##TITLE=AC1740_SEN00013_9276343_qgJO3Bddgf
##JCAMPDX= 6.0         $$ Bruker NMR JCAMP-DX V2.0
##DATA TYPE= NMR SPECTRUM
##DATA CLASS= NTUPLES
##ORIGIN= BRUKER
##OWNER= Administrator
$$ 1.72 TOPSPIN		Version 2.1
$$ 2015-08-07 21:02:55.813 -0700  Administrator@X
$$ Compression mode = diff/dup
##.OBSERVE FREQUENCY= 400.02188249412
##.OBSERVE NUCLEUS= ^1H
##.ACQUISITION MODE= SIMULTANEOUS (DQD)
##.ACQUISITION SCHEME= undefined
##.AVERAGES= 8
##.DIGITISER RES= 22
##SPECTROMETER/DATA SYSTEM= spect
##.PULSE SEQUENCE= zg30
##.SOLVENT NAME= COFFEE_meoh
##.SHIFT REFERENCE= INTERNAL, COFFEE_meoh, 1, 14.98509
##AUDIT TRAIL= $$ (NUMBER, WHEN, WHO, WHERE, PROCESS, VERSION, WHAT)
$$ ##TITLE= Audit trail, TOPSPIN		Version 2.1
$$ ##JCAMPDX= 5.01
$$ ##ORIGIN= Bruker BioSpin GmbH
$$ ##OWNER= Administrator
$$ $$ E:\/data/COFFEE/nmr/AC1740_SEN00013_9276343_qgJO3Bddgf/30/pdata/1/auditp.txt
$$ ##AUDIT TRAIL=  $$ (NUMBER, WHEN, WHO, WHERE, PROCESS, VERSION, WHAT)
(   1,<2015-08-07 21:02:48.422 -0700>,<Administrator>,<X>,<go>,<TOPSPIN 2.1>,
      <created by zg
	started at 2015-08-07 21:01:42.469 -0700,
	POWCHK enabled, PULCHK disabled,
       configuration hash MD5:
       21 0F 79 D6 B3 7B B4 F6 88 20 88 DB 03 48 BD 9F
       data hash MD5: 64K
       63 27 5C 23 F3 AA 31 78 73 1D 04 18 90 74 BC 5B>)
(   2,<2015-08-07 21:02:51.641 -0700>,<Administrator>,<X>,<proc1d>,<TOPSPIN 2.1>,
      <Start of raw data processing
       efp LB = 0 FT_mod = 6 PKNL = 1 PHC0 = 0 PHC1 = 0 SI = 32K 
       data hash MD5: 32K
       A6 42 12 78 4C F5 2E 69 20 55 C0 05 46 D6 12 F4>)
(   3,<2015-08-07 21:02:51.953 -0700>,<Administrator>,<X>,<proc1d>,<TOPSPIN 2.1>,
      <pk PHC0 = 93.26294 PHC1 = 0 
       data hash MD5: 32K
       8F A6 35 41 E6 10 D4 61 75 7F E8 87 24 B1 A6 94>)
(   4,<2015-08-07 21:02:52.078 -0700>,<Administrator>,<X>,<proc1d>,<TOPSPIN 2.1>,
      <abs ABSG = 1 
       data hash MD5: 32K
       35 26 C3 BB 3F F1 E1 F1 52 BB E8 40 05 B0 58 EF>)
(   5,<2015-08-07 21:02:52.141 -0700>,<Administrator>,<X>,<proc1d>,<TOPSPIN 2.1>,
      <abs ABSG = 2 
       data hash MD5: 32K
       39 1F 77 BD 88 E0 62 CA DB 43 E8 DF 2E C5 AD 24>)
(   6,<2015-08-07 21:02:52.203 -0700>,<Administrator>,<X>,<proc1d>,<TOPSPIN 2.1>,
      <abs ABSG = 3 
       data hash MD5: 32K
       C6 0B 5B 5A E5 B0 F3 89 77 BF 36 4C C1 AE 36 61>)
(   7,<2015-08-07 21:02:52.266 -0700>,<Administrator>,<X>,<proc1d>,<TOPSPIN 2.1>,
      <abs ABSG = 4 
       data hash MD5: 32K
       32 28 60 CA 3B 5E D4 3F B2 E2 D4 B1 A1 E0 58 DA>)
(   8,<2015-08-07 21:02:52.328 -0700>,<Administrator>,<X>,<proc1d>,<TOPSPIN 2.1>,
      <abs ABSG = 5 
       data hash MD5: 32K
       FD 3C 5B 33 B5 DE 1A 47 06 3F D1 70 4D 3A 56 12>)
$$ ##END=
$$ 
$$ $$ hash MD5
$$ $$ 1A 63 78 D3 7C 4D 99 CD 74 C7 CA 88 7E 18 AE 57
##$RELAX= 
##$RELAX= 
##$RELAX= 
##$RELAX= 
##$RELAX= 
##$RELAX= 
##$RELAX= 
$$ Bruker specific parameters
$$ --------------------------
##$DU= <E:\>
##$EXPNO= 30
##$NAME= <AC1740_SEN00013_9276343_qgJO3Bddgf>
$$ [...]
150 150 150 150 150 150 150 150
##$TP07= 0
##$TPNAME0= <>
##$TPNAME1= <>
##$TPNAME2= <>
##$TPNAME3= <>
##$TPNAME4= <>
##$TPNAME5= <>
##$TPNAME6= <>
##$TPNAME7= <>
##$TPOAL= (0..7)
0.5 0.5 0.5 0.5 0.5 0.5 0.5 0.5
##$TPOFFS= (0..7)
0 0 0 0 0 0 0 0
##$TUNHIN= 0
##$TUNHOUT= 0
##$TUNXOUT= 0
##$USERA1= <user>
##$USERA2= <user>
##$USERA3= <user>
##$USERA4= <user>
##$USERA5= <user>
##$V9= 5
##$VALIST= <valist>
##$VCLIST= <CCCCCCCCCCCCCCC>
##$VD= 0
##$VDLIST= <DDDDDDDDDDDDDDD>
##$VPLIST= <PPPPPPPPPPPPPPP>
##$VTLIST= <TTTTTTTTTTTTTTT>
##$WBST= 2048
##$WBSW= 25
##$XGAIN= (0..3)
0 0 0 0
##$XL= 0
##$YL= 0
##$YMAX_a= 603684
##$YMIN_a= -511368
##$ZGOPTNS= <>
##$ZL1= 120
##$ZL2= 120
##$ZL3= 120
##$ZL4= 120
##$ABSF1= 14.98509
##$ABSF2= -5.573092
##$ABSG= 5
##$ABSL= 3
##$ALPHA= 0
##$AQORDER= 0
##$ASSFAC= 0
##$ASSFACI= 0
##$ASSFACX= 0
##$ASSWID= 0
##$AUNMP= <proc_prof1d_extract_pilot.lims>
##$AXLEFT= 0
##$AXNAME= <>
##$AXNUC= <1H>
##$AXRIGHT= 0
##$AXTYPE= 0
##$AXUNIT= <>
##$AZFE= 0.1
##$AZFW= 0.1
##$BCFW= 0
##$BC_mod= 0
##$BYTORDP= 0
##$COROFFS= 0
##$CY= 15
##$DATMOD= 1
##$DC= 0
##$DFILT= <>
##$DTYPP= 0
##$F1P= 0
##$F2P= 0
##$FCOR= 0.5
##$FTSIZE= 32768
##$FT_mod= 6
##$GAMMA= 0
##$GB= 0
##$INTBC= 1
##$INTSCL= 1
##$ISEN= 128
##$LB= 0
##$LEV0= 0
##$LPBIN= 0
##$MAXI= 10000
##$MC2= 0
##$MEAN= 0
##$ME_mod= 0
##$MI= 0
##$NCOEF= 0
##$NC_proc= -8
##$NLEV= 6
##$NOISF1= 0
##$NOISF2= 0
##$NSP= 0
##$NTH_PI= 0
##$NZP= 0
##$OFFSET= 14.98509
##$PC= 1
##$PHC0= 93.26294
##$PHC1= 0
##$PH_mod= 1
##$PKNL= yes
##$PPARMOD= 0
##$PPDIAG= 0
##$PPIPTYP= 0
##$PPMPNUM= 2147483647
##$PPRESOL= 1
##$PSCAL= 4
##$PSIGN= 0
##$PYNMP= <proc.py>
##$REVERSE= no
##$SF= 400.02
##$SI= 32768
##$SIGF1= 0
##$SIGF2= 0
##$SINO= 400
##$SIOLD= 32768
##$SPECTYP= <>
##$SREGLST= <1H.CDCl3>
##$SSB= 0
##$STSI= 32768
##$STSR= 0
##$SW_p= 8223.68421052631
##$SYMM= 0
##$S_DEV= 0
##$TDeff= 65536
##$TDoff= 0
##$TI= <>
##$TILT= no
##$TM1= 0
##$TM2= 0
##$TOPLEV= 0
##$USERP1= <user>
##$USERP2= <user>
##$USERP3= <user>
##$USERP4= <user>
##$USERP5= <user>
##$WDW= 1
##$XDIM= 32768
##$YMAX_p= 442601125
##$YMIN_p= -715704
##$CURPLOT= <Network HP LaserJet P1505>
##$CURPRIN= <$Network HP LaserJet P1505>
##$DFORMAT= <normdp>
##$LAYOUT= <+/1D_H.xwp>
##$LFORMAT= <normlp>
##$PFORMAT= <normpl>
##$SURQMSG= 1
$$ End of Bruker specific parameters
$$ ---------------------------------
##NTUPLES= NMR SPECTRUM
##VAR_NAME=  FREQUENCY,     SPECTRUM/REAL,   SPECTRUM/IMAG
##SYMBOL=    X,             R,               I
##VAR_TYPE=  INDEPENDENT,   DEPENDENT,       DEPENDENT
##VAR_FORM=  AFFN,          ASDF,            ASDF
##VAR_DIM=   32768,         32768,           32768
##UNITS=     HZ,            ARBITRARY UNITS, ARBITRARY UNITS
##FACTOR=    0.250966925370066, 1,           1
##FIRST=     8223.43324360094, -230884,      -207195
##LAST=      0,             -9249,           -104012
##MIN=       0,             -715704,         0
##MAX=       8223.43324360094, 442601125,    0
$$ Real data points
##PAGE= N=1
##DATA TABLE= (X++(R..R)), XYDATA
$$ [...]
19543a83683l6934d4863j68225f0665k48468J40187G9660b62664Q8719Q5911l20453
19532d08487G9510Q4196D3547b44471i2150D9486b69468J21787N2080A05402b00286
19520F8185j5490J09560K25560c03186j28110f2505j30113O3548k9428A14310
19509b81614D9240a60101k54616M7057g5831A06517C3181c13542h0848d941j04762
19498a09703p8068D1771O7202a45071A86094L53046b09642A26145d91284A58145
19487A93264a63496c7077B01926q266a65085q4919O1473A74726a25728A46186
19476b55279R2980P8124r1503A35086k3908g8808A33327a76367C85353B2667J70163
19465A92830c15871C6606A4595a43909K9746j75670f4515j40498a9952K638l14566
$$ plain form
19543 -183683 -220617 -44863 -213088 -60665 -309133 -168946 79660 -262664 -173945 -88034 -408487
19532 -408487 79510 163706 43547 -244471 -92150 49486 -269468 -147681 -95601 105402 -200286
19520 68185 52695 162255 387815 -303186 -431296 -62505 -192618 -129070 -158498 114310
19509 -281614 49240 -160101 -414717 -367660 -75831 106517 33181 -313542 -80848 -4941 -109703
19498 -109703 -187771 41771 108973 -145071 186094 539140 -209642 126145 -491284 158145
19487 193264 -163496 -37077 201926 193660 -165085 -250004 -188531 174726 -125728 146186
19476 -255279 -162299 -84175 -175678 135086 111178 -78808 133327 -176367 385353 22667 192830
19465 192830 -315871 36606 14595 -143909 -114163 -289833 -64515 -205013 -19952 -17314 -331880
19454c31880a40137L2741a5151j99340A72172c59184B29905o3465a8456B4694
19443g6876j75760N0859L5839k755A59791b82742A15670c38101A85146f6965k07294
19432b74259b3430L706l90295d7917E9753g6723k38617O4286c1356C80512A16745
19420a00336k56493B1159e489j50790d0375A14410c5990j45454I3286c70860D4165
19408C57957G0844i5362B77399c37235a61581k34718b5339o2354J8508L210k49687
19397c15662a54497b2751l34286B9894b44924j17790J74306J8361M9412I9743
19386a8391r5838d0675j64301H011b13020C7424c32221Q1244a7322k33214C486
19374b28667i5287n8162A38754b85534a3767k98814A84538b93344F5305c22190
$$ plain form
19454 -331880 -140137 -107396 -15151 -214491 172172 -359184 229905 166440 -18456 24694
19443 -76876 -252636 -201777 -165938 -168693 159791 -282742 115670 -338101 185146 -66965 -274259
19432 -274259 -23430 -19724 -410019 -47917 59753 -76723 -315340 -251054 -31356 380512 116745
19420 -100336 -356829 21159 -5489 -156279 -40375 114410 -35990 -181444 93286 -370860 44165
19408 357957 70844 -95362 277399 -337235 -161581 -396299 -25339 -87693 -69185 -65975 -315662
19397 -315662 -154497 -22751 -357037 29894 -244924 -362714 -188408 -170047 -120635 99743
19386 -18391 -114229 -40675 -204976 8011 -213020 37424 -332221 -250977 -17322 -250536 3486
19374 -228667 -95287 -153449 138754 -285534 -13767 -312581 184538 -293344 65305 -322190
19363E2856a3467A20032R0851b84724Q9709A14706b56142Q1242I0313a92033k5788
19352b17821F2253g3485B65784h6980k6263L1848A38144e113A7242C987a81238
19340c23819A3453e0570j34330F2034k1124d1540l2327j22501e8625D18596b88820
19328D0894a20345D33769a23782C6948a60870k426j40967c0788k34278i9328b203
19316a55517B2638a58175a2677j03460F6801J01578b02415H9202B9621a0573j68581
19305a79154F3652k012a90857D1067d0360B37482a76608b9373l21013i0803B9122
19293h8331l3555d989I040a28126a3517n1243j38376A34395a06280F8219b67228
19281A74533b2762o5187m7983b8935A15462b0471j734n2652p5079I5923j3959
$$ plain form
19363 52856 -13467 120032 210883 -284724 -195015 114706 -256142 -174900 90313 -192033 -217821
19352 -217821 62253 -73485 265784 -86980 -113243 -81395 138144 -5113 17242 3987 -181238
19340 -323819 13453 -50570 -184900 62034 40910 -41540 -73867 -196368 -58625 418596 -288820
19328 40894 -120345 433769 -123782 36948 -160870 -163296 -304263 -30788 -265066 -99328 -2203
19316 -155517 22638 -158175 -12677 -116137 66801 168379 -202415 89202 29621 -10573 -179154
19305 -179154 63652 61640 -190857 41067 -40360 237482 -176608 -29373 -350386 -90803 29122
19293 -88331 -121886 -4989 9040 -128126 -13517 -64760 -203136 134395 -106280 68219 -267228
19281 174533 -22762 -87949 -135932 -28935 115462 -20471 -22205 -74857 -149936 95923 81964
19270H1964K08131C24e1642B48201d3782H7780D3572c2311A0523c65731J42649
19259b23082a00839A98390A2494a82081k33587J92315i4581I0596a03751j64740
19249b68491B8451a33382K4898A15314n1098d4836D8320A059a2377l36192b9018
19237H2067a33583A29148a19947K2303k07845I4855d6161k71545M570a43588H5322
19225c4526i301l33675e4274p5549c5849A97859d25076c869j3693k04181J9504
19214b02239j1196f0790j94154M8372o6700n2371E8624c8532B58272f3120j41535
19203b04655A05083J40700b67831L4502I1466J3249N6166a9276k42155j1558O3023
19192b09966A47619f2724I5120K4719c07505f2076j03574A24917a91378N2878
$$ plain form
19270 81964 290095 324 -51642 248201 -43782 87780 43572 -32311 10523 -365731 -223082
19259 -223082 -100839 198390 12494 -182081 -415668 -223353 -94581 90596 -103751 -268491
19249 -268491 28451 -133382 -108484 115314 64216 -44836 48320 1059 -12377 -348569 -29018
19237 82067 -133583 129148 -119947 -97644 -305489 94855 -46161 -317706 -313136 -143588 85322
19225 -34526 -9301 -342976 -54274 -129823 -35849 197859 -425076 -3869 -17562 -221743 -202239
19214 -202239 -213435 -60790 -254944 -206572 -273272 -325643 58624 -38532 258272 -63120 -204655
19203 -204655 105083 245783 -267831 -233329 91466 104715 160881 -19276 -261431 -272989 -209966
19192 -209966 147619 -62724 95120 119839 -307505 -62076 -165650 124917 -191378 -138500
19182a38500D9547a91334m0869G9343n592c99878J53450i7675b6781k92823a17465
19170g9192b5530k10335g3748k0690l6221j68162e0647C3070b51269F7607J69596
19159B37203D0777e9165A66370h0406I1687a71752N3149A62239m7920c46862i7151
19147B38900j13605M422B5958b71070R7787c928D9034a55926q5735h5458A2828
19135F5724g1869C7261b99336A45863E1460R3709c7059B38265a10980E804b43501
19123A95655c9013n3964A01639i7350A2400c8071n2733c6217r3372g106k58413
19112b65519Q3217B31289b3294D6141J61978a41718A31826f4608k5004H79f5239
19100b53643g2401n7589O596k11337i8590j49461A59236g4008j36589C0381a97186
$$ plain form
19182 -138500 49547 -191334 -232203 79343 73751 -399878 -246428 -97675 -26781 -319604 -117465
19170 -79192 -25530 -235865 -73748 -94438 -130659 -298821 -50647 33070 -251269 67607 237203
19159 237203 40777 -59165 166370 -80406 91687 -171752 -118603 162239 114319 -346862 -97151
19147 238900 125295 129717 25958 -271070 -173283 -3928 49034 -155926 -241661 -85458 12828
19135 65724 -71869 37261 -299336 145863 51460 145169 -37059 238265 -110980 5804 -243501
19123 195655 -39013 -92977 101639 -97350 12400 -38071 -90804 -36217 -129589 -7106 -265519
19112 -265519 -182302 231289 -23294 46141 208119 -141718 131826 -64608 -89612 879 -65239
19100 -253643 -72401 -129990 -123394 -334731 -98590 -248051 159236 -74008 -210597 30381 -197186
19088F251b15050f9253F1294B8688R09N7351c67942B37879A07313D8279d10171
19076E2974A7211a77869C05208G0483b55756f1106F3511b75066a5247j63626f7992
19064b25917B4784d9055A23421b84922A15633b07857B93863F400J86024i6507
19053a86394B3249b07222O4273D8872J9439a37853B13341d6314j34387k72882
19043d53583E7925A8120a68169p8500h6973A72418J1507b8139m0662A62021f3659
19031a05528j33556E9183E859f5654g778k4048B50075a92351I7045a87791a8368
19019A79702B1195h2479a9562C8128b79519a27507H1592j5922a05633a0582j39910
19008a50492A59990b89426q6330J65446i7891K4230J4225j42158B04116f1980
$$ plain form
19088 6251 -215050 -69253 61294 28688 29597 86948 -367942 237879 107313 48279 -410171
19076 52974 17211 -177869 305208 70483 -255756 -61106 63511 -275066 -15247 -178873 -67992
19064 -225917 24784 -49055 123421 -284922 115633 -207857 293863 6400 192424 -96507
19053 -186394 23249 -207222 -142949 48872 68311 -137853 213341 -46314 -180701 -453583
19043 -453583 57925 18120 -168169 -246669 -86973 172418 183925 -28139 -68801 162021 -63659
19031 -105528 -239084 59183 5859 -65654 -7778 -31826 250075 -192351 97045 -187791 -18368
19019 179702 21195 -82479 -19562 38128 -279519 -127507 81592 65670 -105633 -10582 -150492
19008 -150492 159990 -289426 -375756 -210310 -97891 -73661 -59436 -201594 204116 -61980
18997F5462c640E6215J45953h0148j41531j4212N9483B48343j02725M4534a10059
18985a1587B28219d12367A50883b99393J28696A58721C3898a36800A97918a96201
18974a53659J8891A95354E715a73525J180A42985O5543J79428a23370N8798h411
18962A1697a76353l11576a59188J4892B99827a77670D878a01797j25178b0473
18951c5465j64653d19H1299k9193b08634j2449M472A7549N5968n148a10254j35834
18939b46088i6070n1482A14970l681L1561E9162e4359l11298J54784F8510J5103
18928H3613O8637B2160J12670b65157P2999A66911c75412c3435j31645k58887
18918d23967J88011A79009B7182a88373c8618A23766i6132A8802a23944B74886
$$ plain form
18997 65462 -3640 56215 202168 -80148 -221679 -235891 -176408 248343 145618 190152 -110059
18985 -11587 228219 -412367 150883 -299393 -170697 158721 33898 -136800 197918 -196201
18974 -153659 -134768 195354 5715 -173525 -172345 142985 208528 387956 -123370 -64572 -8411
18962 11697 -176353 -487929 -159188 -144296 299827 -177670 4878 -101797 -226975 -20473
18951 -35465 -200118 -419 81299 52106 -208634 -221083 -216611 17549 73517 68369 -110254 -246088
18939 -246088 -96070 -147552 114970 111289 142850 59162 -54359 -365657 -210873 68510 83613
18928 83613 152250 22160 134830 -265157 -192158 166911 -375412 -33435 -165080 -423967
18918 -423967 -235956 179009 27182 -188373 -38618 123766 -96132 18802 -123944 274886
18907e1140D0906a72936q3330A35798e4165B06301h6267n1077e4344o0621m2159
18896a57124A25324D6850a04260D3594K17076a45880j13518Q5416k15536H9461
18885c2410j00857L9664A55032b93885A18120I425a32181m26183H7508c3004j03059
18874a36063k21674D7541a65733I7304a32747B05106O3866a6203k36927I3512
18863h5790c1527Q854m7182L783D73707B2173d8559A63955a15119j55058H6482
18851A09951k9366J40027d1341C01665a34288j13090g5124r4541J8987j50976
18841c01654i7166b0311n5800G104f1855k0867H3176B0970J61199A5428a4102
18829a66419I8871J35357l6881j2634e9734o520E2862K64905F2864K21297j0422
$$ plain form
18907 -51140 40906 -172936 -256266 135798 -54165 206301 -86267 -137344 -54344 -114965 -157124
18896 -157124 125324 46850 -104260 43594 260670 -145880 -259398 -173982 -389518 89461
18885 -32410 -133267 -93603 155032 -293885 118120 9425 -132181 -558364 87508 -33004 -136063
18874 -136063 -357737 47541 -165733 97304 -132747 205106 268972 -16203 -253130 93512
18863 -85790 -31527 -22673 -69855 -66072 473707 22173 -48559 163955 -115119 -270177 86482
18851 109951 80585 220612 -41341 301665 -134288 -247378 -75124 -169665 -150678 -301654
18841 -301654 -97166 -20311 -76111 7104 -61855 -82722 83176 20970 182169 15428 -14102
18829 -166419 98871 234228 197347 184713 -59734 -66254 52862 317767 62864 284161 273739
18818B73739a42611E600K60401c4144q0762j03118j49198A30193o4424J6002i750
18806d5776A67387e3566k9260p8347O8631b2693k22352J02178f2121m8049A08339
18794c36153B54235j22869a65171n4017h7829E6087O9005g925F1805Q3678c6934
18782B87022b35757B747K28864b84792A5468c49343A69874H290b37398B11406
18771f3120j10843M2073o6251G193b4097k61138j0229J10128g7907R899j18361
18760a86369c5723B9617J58545C9426R0573G630a33812B51364b99883Q1623m7812
18749b66072a0314I6430J1501Q4895F0562c33695c125B57340b31550g937j32338
18738a40275M8280B51407D3389K8760P9242a2698o9874p6874N2926j04688P0420
$$ plain form
18818 273739 -142611 5600 266001 -34144 -114906 -218024 -367222 130193 65769 81771 -9750
18806 -45776 167387 -53566 -82826 -161173 -92542 -22693 -245045 -142867 -62121 -110170 108339
18794 -336153 254235 131366 -165171 -219188 -87829 56087 125092 -7925 61805 145483 -36934
18782 287022 -235757 2747 231611 -284792 15468 -349343 169874 8290 -237398 211406
18771 -63120 -173963 -131890 -198141 7193 -24097 -285235 -295464 -185336 -77907 -68008 -186369
18760 -186369 -35723 29617 188162 39426 129999 7630 -133812 251364 -299883 -218260 -266072
18749 -266072 -10314 96430 107931 192826 60562 -333695 -3125 257340 -231550 -7937 -140275
18738 -140275 -91995 251407 43389 72149 151391 -12698 -82572 -159446 -106520 -211208 -140788
18727a40788D4547M57537b5659j71930l3737E3478K631L6811O7467n9421C8759
18715B24128a00931m46513d2909j02186f83l37791R2343e7257E1921b76045A90083
18703B95404b07770Q3833e6991m394k87364P7067i1479J8131L1808k9712A11721
18691a97802Q0635e481j74054a3282n4612q3440p5956I8377d4696k2481j09988
18680a77165O892C24040A8202P306J25052b28680o315n7502A70554a23838A93482
18668b8220l18882a63515D4479J30563B2170a98308D4255K07775b46673d1281
18657B9588c58548c0361c607E3850a51950J5155A12591g6170G8057R4703a06640
18645E9133a39097K2636A29566a74766h5706G5335a76875A38249b74352g0310
$$ plain form
18727 -140788 44547 502084 -25659 -197589 -231326 53478 56109 92920 160387 100966 38759
18715 224128 -100931 -547444 -42909 -145095 -683 -338474 -246131 -57257 51921 -276045 190083
18703 295404 -207770 -123937 -56991 -61385 -348749 -271682 -91479 -73348 -41540 -71252 111721
18691 -197802 -117167 -5481 -179535 -13282 -67894 -151334 -227290 98377 -44696 -67177 -177165
18680 -177165 -170273 324040 18202 25508 150560 -228680 -234995 -292497 170554 -123838 193482
18668 -28220 -347102 -163515 44479 175042 22170 -198308 44255 252030 -246673 -41281
18657 29588 -358548 -30361 -3607 53850 -151950 -136795 112591 -76170 78057 172760 -106640
18645 59133 -139097 -116461 129566 -174766 -85706 75335 -176875 138249 -274352 -70310
18634I175J00586b02028G3629b96664E3313c22338B76396e9448C601e8551l7886
18623i6437a2596q191m18708a08790k45050A91463b613l5025m2491C31469A32596
18611H6856p482P9964d9249j34245j25999a35402m9909d4384k61357D1460N3382
18600I4842m2119d9818j13213A44414m8535b22768b888G2222c3510j8960j08879
18589a61349O0446Q129j42510n2029c378E490i2964A27886g7893j09883A08742
18577c25893Q561e4119j47003O7646j4361g3852l4482a5174m1165A32187l966
18566A28221g7443k56075A47940a36783b91C10380c30057d3766J6430B59821A13053
18554d79470A3328a37044A98743a8333k3830A71795M5727a12582j83306m2796
$$ plain form
18634 9175 109761 -202028 73629 -296664 53313 -322338 276396 -59448 3601 -58551 -96437
18623 -96437 -12596 -20787 -439495 -108790 -353840 191463 -2613 -37638 -80129 331469 132596
18611 86856 79374 159338 -49249 -183494 -309493 -135402 -185311 -44384 -305741 41460 94842
18600 94842 52723 -49818 -163031 144414 95879 -222768 -2888 72222 -33510 -52470 -161349
18589 -161349 -100903 -92774 -235284 -287313 -3378 5490 -92964 127886 -77893 -187776 108742
18577 -325893 -317332 -54119 -201122 -133476 -147837 -73852 -108334 -15174 -56339 132187 128221
18566 128221 -77443 -333518 147940 -136783 -291 310380 -330057 -43766 -27336 259821 113053
18554 -479470 13328 -137044 198743 -18333 -42163 171795 217522 -112582 -295888 -338684
18544c38684i1325a3881l4417n3622q4081H0391L85520c1384I8647j0393i6202
18532f3382A3203a6024e476j42433A7039Q6484f7063E57996E1029b64756B8118
18520E9115J29057J33671A54040O3763q5199F4223c6230m4108j79791j2310C01742
18508a10696a5120M842B8643J11758b18930B5862a88509h0952b7955k89364a03540
18496c35115d6628g950j5255A50705a99350H2615a56625O513C693b70989J01920
18485a69069b909B7586b54808k7909p2816c7474k62534B73700C2280f3235C7516
18473A84687f4964j8276H7084N3632E3019a16811L9974j43154b4402k5012m4237
18462i3651Q629C97863f9601l87455I7052J0332F820J36807b42846e9889M951
$$ plain form
18544 -338684 -91325 -13881 -48298 -101920 -186001 80391 465911 -31384 98647 88254 -96202
18532 -63382 13203 -16024 -5476 -147909 17039 103523 -67063 557996 51029 -264756 28118
18520 59115 188172 321843 154040 217803 132604 64223 -36230 -80338 -260129 -272439 301742
18508 -110696 -15120 -10278 28643 140401 -218930 25862 -188509 -80952 -27955 -317319 -103540
18496 -335115 -46628 -7950 -23205 150705 -199350 82615 -156625 -150112 3693 -270989 -169069
18485 -169069 -2909 27586 -254808 -282717 -355533 -37474 -300008 273700 32280 -63235 37516
18473 184687 -64964 -83240 87084 140716 53019 -116811 -76837 -219991 -24402 -49414 -93651
18462 -93651 -85022 397863 -69601 -457056 97052 107384 6820 143627 -242846 -59889 -54938
18451e4938p0063b6749q1632A73442g281o7005p1972A3766c1770D7147i7649o8824
18439a66473A27632g6164b6917h563j71716E2727a97192B5414N708K51984b4733
18427h3669q0323p2268g9973G21K0628K6976d7629m9738A658J07368A3974R4635
18415A08609g2287j40479i2572m8429A80291J26110q715A01457a42829J2856B63731
18403b44857i3917B62453B8805J74667l4547C803J42100c9061G6700A5834b35918
18391a77748I139a57849q9710B44047q2063a6683j68336P3922L3774A17546b90903
18379a79059j7021e6362A66350d0089k17657B7871b71285M1476K3604h4560B0222
18367E7922J18295A9661q117N1563J27050K0410D0189J38602D9055k589d588A04007
$$ plain form
18451 -54938 -125001 -26749 -108381 173442 -7281 -74286 -146258 13766 -31770 47147 -97649 -166473
18439 -166473 127632 -76164 -26917 -8563 -180279 52727 -197192 25414 31122 283106 -24733
18427 -83669 -163992 -236260 -79973 721 21349 48325 -47629 -97367 1658 109026 13974 108609
18415 108609 -72287 -212766 -92572 -141001 180291 306401 297686 101457 -142829 -129973 263731
18403 -244857 -93917 262453 28805 203472 168925 3803 145903 -39061 76700 15834 -235918
18391 -177748 9139 -157849 -247559 244047 161984 -16683 -185019 -111097 -77323 117546 -290903
18379 -179059 -196080 -56362 166350 -40089 -257746 27871 -271285 -229809 -206205 -84560 20222
18367 57922 176217 19661 11544 63107 190157 210567 40189 178791 49055 46466 -4588 104007
18354A05611a66254l4708m7865c3892A33011a30678F946b48496P0659A73779a26462
18342A22928c23953A78775l9375D1774c55739a22850C615h6067D56184a41827
18331G6118c0064a2517k7342j401K0021A08169l9547P7819a65219C22423a35017
18319H6590a43337e697j75213A19688b96283L9136F5159a37048k17797d4963k25195
18308b70158d1937j12614A83107f6746H5479r276b43765j67337a1806D4609J01617
18297A46226a33669K1124B4333a84252o8281A98041b616A93426q0157L0927n3766
18286I0430B0009i5925K2065r5029O7611A1306R9681J31627j8131i9908c332j34191
18274a37523B37160b13323h9211I9182b0331H795b5491C2378K22676a27321b0007
$$ plain form
18354 105611 -166254 -200962 -248827 -33892 133011 -130678 6946 -248496 -177837 173779 -126462
18342 122928 -323953 178775 139400 41774 -355739 -122850 3615 -86067 456184 -141827
18331 76118 -30064 -12517 -39859 -41260 -21239 108169 68622 146441 -165219 322423 -135017
18319 86590 -143337 -5697 -180910 119688 -296283 -257147 65159 -137048 -354845 -44963 -270158
18308 -270158 -41937 -154551 183107 -66746 85479 76203 -243765 -411102 -11806 44609 146226
18297 146226 -133669 -112545 24333 -184252 -252533 198041 -2616 193426 113269 144196 90430
18286 90430 20009 -95925 -73860 -168889 -101278 11306 110987 242614 224483 -99908 -3332 -137523
18274 -137523 237160 -213323 -89211 99182 -20331 8795 -25491 32378 255054 -127321 -20007
18262a62415j4831c2844A2904g502j9241I0757P9255a09237j53724C49892I5868
18250D5N6630i2406A23371J12412c06212A7495R4472K39818G2353L37217G8792
18238C29343a73132I910i0259j71466k314d9015Q167j20504A67786F3070K13695
18227B76765e3739J056l18933R4139J17428f2909B48065Q2603G4590a58009j42499
18216c00508a12341j53000J4506K8436B2337a46243k63098a17675A38862a49810
18205a28352M162A47476c7026E626g5266j05244A4425K90752c3949j82160R4546
18194a21563E523b78085I6822L1333a43175j86381J28719P6242A23784K18586
18184C42370d5622k63736G3584a84167O6535B61097b16691j97024I3578b90392
$$ plain form
18262 -162415 -177246 -32844 12904 -7502 -26743 90757 170012 -109237 -262961 349892 95868
18250 45 56675 -92406 123371 235783 -306212 17495 111967 351785 72353 409570 78792
18238 329343 -173132 9910 -90259 -261725 -264039 -49015 -40848 -161352 167786 63070 276765
18227 276765 -53739 -52683 -371616 -277477 -160049 -62909 248065 330668 74590 -158009 -300508
18216 -300508 -112341 -265341 -250835 -222399 22337 -146243 -409341 -117675 138862 -149810
18205 -128352 -124190 147476 -37026 5626 -75266 -180510 14425 305177 -33949 -216109 -121563
18194 -121563 5523 -278085 96822 128155 -143175 -329556 -200837 -124595 123784 342370
18184 342370 -45622 -309358 73584 -184167 -117632 261097 -216691 -413715 93578 -290392
18173A96304n9039h8607B5080a82901p2492A28080b66026J14391a0346k801B09113
18161G4075f3697m4510j30412J8624C15555a01828J1383c75B8955b5576n18515
18150e44091D1905R0705i3143j66038H2866P7455J19196C4603h6824l9850B29977
18138E3793J38926c73778C0935K10433r0976a80491A28971f6907I7192i8365M1005
18127e7360n995b0280j32308l8716n1100a07170H1221b06618N3445A39204k9871
18116A09333D7498a59116B08541a06025l5822e3918a9040B44283a62062O0840
18106a01222k2410M7530k41446a17541G2371c65061D0647b5525A36973a19353
18095b22793j0016A32610b67099d7001q0833M864j33365O2410D9175a55416E3842
$$ plain form
18173 196304 137265 -88607 25080 -182901 -255393 128080 -266026 -151635 -10346 -13147 209113
18161 74075 -63697 -108207 -238619 -219995 315555 -101828 -90445 -375 28955 -25576 -544091
18150 -544091 41905 132610 -93143 -259181 82866 160321 279517 34603 -86824 -126674 229977
18138 53793 192719 -373778 30935 241368 150392 -180491 128971 -66907 97192 -98365 -57360
18127 -57360 -63355 -20280 -152588 -191304 -242404 -107170 81221 -206618 -153173 139204 109333
18116 109333 47498 -159116 208541 -106025 -141847 -53918 -19040 244283 -162062 -101222
18106 -101222 -123632 -76102 -317548 -117541 72371 -365061 40647 -25525 136973 -119353
18095 -222793 -232809 132610 -267099 -47001 -127834 -122970 -256335 -193925 49175 -155416 53842
18083a10063B3336K49160e6846I3629a85904c7782k91418D9689h4121A16958J890
18072A18848n3111b1157b526A50069f2043q5857A97831H4479a15656d3249F9882
18060a04286M8687K6892m71316A68625p6813l9550a32961N5882h704k43551J1623
18049b40632A29220D7248I823b06781D6959M2308d8017C0745c24498c1016B8731
18037F1363f8394B66071M474g8721k2479A37132n9639d8372j16305N7604d95l8576
18025c9071m0818I7665a3330A18859b7041k70865Q379p6740A04961g9822h261
18013A69599n5887K924d2672A38813h2943H892b26754A72309F5957b72349C14866
18001a65625m892A3675J12258a13372K0306c4452o6727q884A60524d5005A13741
$$ plain form
18083 -110063 23336 272496 -56846 93629 -185904 -37782 -329200 49689 -84121 116958 118848
18072 118848 65737 -21157 -2526 150069 -62043 -147900 197831 84479 -115656 -43249 69882
18060 -104286 -55599 -28707 -500023 168625 91812 52262 -132961 -77079 -8704 -252255 -240632
18049 -240632 129220 47248 9823 -206781 46959 89267 -48017 30745 -324498 -31016 28731
18037 61363 -68394 266071 270545 -78721 -101200 137132 77493 -48372 -164677 -107073 -495 -39071
18025 -39071 -79889 97665 -13330 118859 -27041 -297906 -289527 -366267 104961 -79822 -8261
18013 169599 113712 116636 -42672 138813 -82943 8892 -226754 172309 65957 -272349 314866
18001 -165625 -170517 13675 125933 -113372 -93066 -34452 -101179 -110063 160524 -45005 113741
17989i1212j32401C21618b20421A19816b74181C460O661c4577m5332B65981A3604
17977I4314J63196E5699J73512g2207A43464M6637a19312b3857m3776A49908B7977
17965f8280j35474F7774J75586B1767R8787a78338A57566B1354i0879K4270b4695
17953d48964a2892B72937b33830h9526r5140P8426F2916J40672a11225p8852B22492
17941b21139A25546f4709j67818A17822h2142l4421D2305A7829a26422k5845H9254
17929B86607A3868Q5817a56272l05373D2932K3928k9570K31029a8691j40704C867
17917A30670c56644a34574p0514A00738k690a9806a045A56020f8254G8468K5147
17906A03615K8352i2269H1845D99a55137f7996A19979A144f6218B52438c88971
$$ plain form
17989 -91212 -223613 321618 -220421 119816 -274181 3460 10121 -34577 -79909 265981 13604
17977 94314 257510 55699 229211 -72207 143464 190101 -119312 -23857 -67633 149908 27977
17965 -68280 -203754 67774 243360 21767 120554 -178338 157566 21354 -90879 -66609 -24695
17953 -448964 -12892 272937 -233830 -89526 -184666 -106240 62916 203588 -111225 -190077 222492
17941 -221139 125546 -64709 -232527 117822 -82142 -116563 42305 17829 -126422 -152267 89254
17929 286607 13868 99685 -156272 -461645 42932 66860 37290 268319 -18691 -159395 3867
17917 130670 -356644 -134574 -205088 100738 98048 -19806 -1045 156020 -68254 78468 103615
17906 103615 131967 -92269 81845 499 -155137 -67996 119979 1144 -66218 252438 -388971
17894G1123J98291j6998j17669i2598B30962b74190J01658B94255d20784J95004
17884b25780m8813I1928D3181N0294J1367F443g2319q4488D4861G89J95002r108
17872A86683a77491D1265h0118j45094d9597j84313O0070m2638E6544R3648d093
17860D8526B1175a49116K2969k00507a15392B41567r1236k1689b17120a4093p603
17849b1696j26754O0546j0101j41012I8426J41175I8005A7259J33172o9868a65319
17837D701a32548r3465D5838a7775r475j34353B92880i6975d3791C91292h0137
17825D03026f1257A90777c3374r2478K2979B39324l1198m3539d0310k14668A05753
17813b03915i6128B03023j6185G0068l4245b97048p8499a37176k2349C44663G2740
$$ plain form
17894 71123 269414 252416 134747 -92598 230962 -274190 -172532 294255 -420784 -225780
17884 -225780 -274593 91928 43181 93475 104842 6443 -72319 -156807 44861 789 195791 186683
17872 186683 -177491 41265 -80118 -225212 -49597 -233910 -173840 -216478 56544 150192 -4093
17860 48526 21175 -149116 -126147 -326654 -115392 241567 150331 128642 -217120 -14093 -21696
17849 -21696 -148450 -87904 -98005 -239017 98426 239601 98005 17259 150431 80563 -165319
17837 4701 -132548 -226013 45838 -17775 -27250 -161603 292880 -96975 -43791 391292 -80137
17825 403026 -61257 190777 -33374 -125852 -102873 239324 208126 164587 -40310 -254978 105753
17813 -203915 -96128 203023 186838 70068 35823 -297048 -375547 -137176 -159525 344663 72740
17801B11400b3057B1533O8390a03213B26176a00159C1479K04092d1948a7141j20113
17790a37254M0593l6607j7229O5881j52108k5610c2262j24241o8816Q9080A17274
17778b23802A79311i149q2524M3791D66940F9734a60054P8450A28721a56805C81826
17766E2743j589K2584a30020B43428b364m671B28907d6350A44847h9289d4051
17754c5424l7797A76226i9052Q210c1061I8300g2222o5307L0846d3292C224a72537
17741A53508B4533b11301h506H2139b8100k43837h7941F03402A54687K8778C2492
17729G0102N3940b00167C7216O3935b6364j60456G5320Q2215c46252F7594L16397
17718C83991a89532B0207f6967D7602d6940A08102a94434Q0652B04558e7534A9214
$$ plain form
17801 211400 -23057 21533 89923 -103213 226176 -100159 31479 235571 -41948 -17141 -137254
17790 -137254 -96661 -133268 -150497 -84616 -236724 -262334 -32262 -156503 -225319 -136239 117274
17778 -223802 179311 -9149 -91673 -47882 466940 69734 -160054 -81604 128721 -156805 381826
17766 52743 51154 73738 -130020 243428 -2364 -7035 228907 -46350 144847 -89289 -44051
17754 -35424 -73221 176226 -99052 -90842 -31061 98300 -72222 -137529 -106683 -43292 3224 -172537
17741 153508 24533 -211301 -8506 82139 -28100 -271937 -87941 603402 154687 183465 32492
17729 70102 124042 -200167 37216 101151 -26364 -186820 75320 157535 -346252 67594 383991
17718 383991 -189532 20207 -66967 47602 -46940 108102 -194434 -113782 204558 -57534 19214
17706E4494d5606J1285I2133K76643D3683M9232J07574f3883A96137q8312B0610
17694h619B7563O7351c314A19810D2587d2851j6197l07968h6917r5127M2540B81630
17681c270j41214A23632J52933b76496c1293H2707K39791H095J89363n9048B3502
17669f035B14645a33458E7710h1721I6110B8246a98865m0403A04941d7584q0527
17658a28111A44818P633l149K3726n8806c7031J1361A17462h9913k6253D9229
17646e857j24700B50800a05278k5919F5486f3429Q044A2065J97097J00876p1395
17635B38643f6291F4318d8725k1035C41457b4512A23282a94708M5847K4295C66939
17623b87320D2187c6236B52570o6327a1614A84020C7868e098A38271m4451L3379
$$ plain form
17706 54494 -45606 -34321 92133 368776 43683 92915 200489 -63883 196137 107825 20610
17694 -8619 27563 94914 -3314 119810 42587 -42851 -59048 -367016 -86917 -182044 -139504 281630
17681 -3270 -144484 123632 276565 -276496 -31293 82707 322498 8095 197458 138410 23502
17669 -6035 214645 -133458 57710 -81721 96110 28246 -198865 -239268 104941 -47584 -128111
17658 -128111 144818 152451 149302 173028 114222 -37031 -25670 117462 -89913 -116166 49229
17646 -5857 -130557 250800 -105278 -131197 65486 -63429 -55385 12065 209162 310038 238643
17635 238643 -66291 64318 -48725 -69760 341457 -24512 123282 -194708 -148861 -124566 366939
17623 -287320 42187 -36236 252570 186243 -11614 184020 37868 -5098 138271 93820 127199
17612A27199C550J71453a58557j27973A03805i1212A40497b48516C01699a32649
17601B8524M9793R3559C6570J60681e5242j62208M5825G8404l4544K04044g8387
17589a58571j67013e6018j07527j963B11612k634H8925a07247B33288q0315d8014
17577H0164c23707A38451b52805G8058c16408B79080f3041C00291j43132C9198
17566B04039c44031a47903A73125a47858P2502B0241c1111C8430a15503B02011
17555A36991F1454m697j1346K06398A3076J15219a60040A46798K95408H7401l5788
17544E1613K33867h3211C0347j4964L87283A12677J84284j34934m1824C8142R9920
17533A38062h9615I3777R1542J37934A9833a42902g1246A05396a38966A15529
$$ plain form
17612 127199 3550 175003 -158557 -286530 103805 -91212 140497 -248516 301699 -132649
17601 28524 78317 171876 36570 197251 -55242 -217450 -171625 78404 43860 247904 -78387
17589 -158571 -325584 -56018 -163545 -165508 211612 208978 88925 -107247 233288 152973 -48014
17577 80164 -323707 138451 -252805 78058 -316408 279080 -63041 300291 157159 39198
17566 204039 -344031 -147903 173125 -147858 -75356 20241 -31111 38430 -115503 202011
17555 136991 61454 56757 45411 251809 13076 128295 -160040 146798 442206 87401 51613
17544 51613 285480 -83211 30347 15383 402666 112677 296961 162027 120203 38142 138062
17533 138062 -89615 93777 185319 323253 19833 -142902 -71246 105396 -138966 115529
17522g2438D19732g2608A58605Q5703I3843a1868j06853n4487A14762J32048K6204
17511B73014j22430h8172B12380A7970d2480A18169N0724a58468G4967c0771m4455
17500g5226j3631B01788p6895L2136k665K5581p5731c13078A79376b18044A69240
17488i4395A8666K06505D8137O6583A7341J75832J49221I0274b51760A39161K71089
17477D10250e1921l3308D2396J51352k0207a67181A44438K13713j39300H9581
17466A16864J9046J2929M02480c02329A73484P7734H2432e6697i071F2168b1014
17454C5326K43466L4702K6159h733E28475A88511l5229K55034A29588E8779J93549
17443B52328i7293F5491J53643Q8141c266D7640K47632q6423R8232R7797j49257
$$ plain form
17522 -72438 419732 -72608 158605 244308 93843 -11868 -118721 -173208 114762 246810 273014
17511 273014 150584 -88172 212380 17970 -42480 118169 168893 -158468 74967 -30771 -75226
17500 -75226 -88857 201788 124893 157029 154364 179945 104214 -313078 179376 -218044 169240
17488 -94395 18666 225171 48137 114720 17341 193173 342394 90274 -251760 139161 410250
17477 410250 -51921 -85229 42396 193748 173541 -167181 144438 358151 218851 89581
17466 116864 135910 148839 551319 -302329 173484 251218 82432 -56697 -9071 62168 -21014
17454 35326 278792 313494 339653 -8733 528475 188511 153282 408316 129588 58779 252328
17443 252328 -97293 65491 219134 307275 -3266 47640 295272 208849 307081 404878 255621
17432B55621i1391A40137M08377B62856d69130D78807j77584A2965K26264j8415
17422B20814J18131N4253A89665p9447K65710j23427j01092Q5639L65641A60523
17411B97588e713j04609M7876D4361c8926D14930j31065r635E0924K04179p1748
17400A83355G5759n587K2239M8785k5664K79231e1005J2868A9842P631J3308j0365
17388C0416J12877a28568d443E89548E9936K01952k6326j10966J01500b2571A89797
17376D8861B140b5141D1643J40751b22565A67417A8492J97019a61862B48004n2004
17365A96000D379Q1372M9175b8195A80275K08677J85692A7293f9225G2528J54199
17354B26727E6597K82650A48237e4829H3953J56962b2960O715A45623J8452f3447
$$ plain form
17432 255621 -91391 140137 548514 262856 -469130 478807 301223 12965 239229 220814
17422 220814 338945 393198 189665 110218 375928 252501 151409 237048 602689 160523
17411 297588 -5713 -110322 -62446 44361 -38926 414930 283865 274230 50924 255103 183355
17400 183355 75759 70172 92411 141196 115532 394763 -51005 -38137 19842 27473 40781 30416
17388 30416 143293 -128568 -4443 589548 59936 261888 235562 124596 226096 -22571 189797
17376 48861 2140 -25141 41643 182394 -222565 167417 18492 215511 -161862 248004 196000
17365 196000 4379 85751 134926 -28195 180275 388952 574644 17293 -69225 72528 226727
17354 226727 56597 339247 148237 -54829 83953 240915 -22960 -16245 145623 164075 -63447
17342G0954K15590e8271D54297F9729L41623A69376k1638B6042b43851B27442
17331c5776D7916O0395J54631n0697F0620J867M0607D082L11441J00394G1564
17319A24971g9861J6165j68436A51248O7977n835N6846F0208K71637A38626J56014
17308B94640J67000h5363C36055J93332B27297K53355B34837C3400K84231p6509
17298B41122g156B99553A34863a885E0584A4054J84110F8736Q8959N0095O1613
17287B69403c6471A91564L0889J11878I6480K15790j07222J77864j23043r8310
17277A61559J59399j20629I6700K45021b19831E13036B18026j04201C9513g3002
17266A65401O1845d571A02452a83362E1675E532K81337K7938o5548b32076e113
$$ plain form
17342 70954 286544 -58271 454297 69729 411352 169376 147738 26042 -243851 227442
17331 -35776 47916 108311 262942 212245 60620 62487 103094 4082 315523 415917 71564
17319 124971 -79861 -63696 -232132 151248 219225 213390 270236 60208 331845 138626 294640
17308 294640 461640 -85363 336055 529387 227297 480652 234837 33400 317631 241122
17298 241122 -7156 299553 134863 -1885 50584 14054 198164 68736 157695 207790 269403
17287 269403 -36471 191564 222453 334331 96480 312270 205048 382912 259869 161559
17277 161559 320958 200329 96700 341721 -219831 513036 218026 113825 39513 -73002
17266 165401 227246 -4571 102452 -183362 51675 5532 286869 314807 249259 -232076 -5113
17254E2853N7400m1573a20332B57117r8320g3737A09889k6492K12291B167J26742
17243A28909K92716A51863K35970A48111p0205a6735D9658K02032J53922G8009
17232D3934L94907h9162A52226D1023J23713J73032O9754A51283a0037A59291
17221B01111J03272L1294L5906Q4070A85622K329k2810k667J80048j10743a67879
17209C09850C7072L83016j03006I5387J25803J22028N8535A359M16931B05358
17198A02620k8454K24487J25517j24383q7842J91252j67960J23232a4322C81098
17187B14123L87012j17829R8347E3805j9210O2387K6934R7622J18392J68204A30576
17175B25967O1448j2191j16499J00190L9312o0511L39989A68202J62500p9926
$$ plain form
17254 52853 110253 68680 -120332 257117 158797 -73737 109889 83397 295688 2167 128909
17243 128909 421625 151863 387833 148111 77906 -16735 49658 251690 405612 78009
17232 43934 438841 -89162 152226 41023 164736 337768 407522 151283 -10037 159291
17221 201111 304383 335677 371583 455653 185622 187951 165141 162474 342522 231779 -167879
17209 309850 37072 420088 317082 95387 221190 343218 401753 1359 418290 205358
17198 102620 74166 298653 424170 299787 211945 403197 235237 358469 -14322 381098
17187 214123 601135 483306 581653 53805 34595 96982 123916 221538 339930 508134 130576
17175 225967 287415 275224 158725 258915 298227 237716 577705 168202 330702 250776
17165B50776J99100n1670A11196K77392J19323j23735A69520J27947K19026B22229
17154E6637Q8530J29703j15172k3620K36317j83362k9294K8678R9820C2073J45466
17143A77539l0521L94816B39722J86732m7130J73729n7587M9383r103A33027L83707
17132E16734A80596o8274k3911M65267p0332j56981K52727k00091q8237I2086
17121E48359n5316j18479R0881J20838k68073r2206L15816j16844k00517L02851
17111E27310B09465N7426K71939q1551j38359g9412C42389J66369A80294K38563
17101D18857k02012K97973j23117O0426j63174q2890J92233D0031o684N96605
17091F29952l07601J59429M226j63947R2819n5693K92087B52751A12282L09658
$$ plain form
17165 250776 449876 398206 111196 388588 507911 384176 169520 297467 516493 222229
17154 56637 145167 274870 159698 136078 372395 189033 159739 188417 288237 32073 177539
17143 177539 147018 541834 239722 426454 379324 553053 495466 544849 535746 133027 516734
17132 516734 180596 112322 88411 553678 483346 326365 579092 379001 290764 92086
17121 548359 493043 374564 465445 586283 318210 226004 541820 424976 224459 527310
17111 527310 209465 266891 538830 457279 318920 -79412 342389 508758 180294 418857
17101 418857 216845 514818 391701 452127 288953 206063 398296 40031 33347 629952
17091 629952 322351 481780 486006 322059 414878 359185 651272 252751 112282 421940
17081D21940K9778j98439q5056L01921O1662k789J65716j8292l25319J91264J43329
17070F85715K9859j84498j04201K4880k01009K65187l5099Q7099k09216j58965
17060A99752J78501m5721J86894M7949k54979o3102K92067o6607j97043J23892
17050D01603N5375j33312L40092o9461p0394M51360B41718J52281O9032k3096
17040D39935M34304B94745N03222k12629R9530j27614J6422O242O5946k22515
17030D23349J96423O57751D99292J56146j19432M58670l51158m4896K20811j81378
17020F38055j21412k3146K90653j82968p9483L22669o2062p2046j2896C04165
17009E97601K57530k39554N6783C22569N02378J7830K14109l17927j04794R2742
$$ plain form
17081 421940 451718 253279 168223 470144 531806 529017 694733 676441 351122 542386 685715
17070 685715 715574 531076 426875 451755 250746 515933 480834 567933 358717 199752
17060 199752 378253 332532 519426 567375 312396 249294 541361 474754 277711 401603
17050 401603 456978 323666 663758 594297 523903 975263 241718 393999 463031 439935
17040 439935 874239 294745 797967 585338 684868 557254 573676 579918 645864 423349
17030 423349 619772 1277523 499292 655438 536006 994676 643518 598622 819433 638055
17020 638055 516643 493497 784150 601182 521699 844368 782306 710260 697364 304165
17009 597601 855131 615577 672360 322569 824947 842777 1056886 738959 634165 726907
16999G26907J3439q9517L26006k76248j38829J73191J9056r3358j8038K51978
16989H94587l2933L7366q037j67740L18829C89539N74020M7176K0861j64803j06622
16978G60171o7485K19375l2648j29322K18630n778o480K2151k25126K73762j46319
16967H80931M9842K86204m50210K81479P8434j03262m23972J75970J24149N2806
16957I52371K48300k03612K61313m70001L07774k40773K02611r8415L93035l61292
16947I91311N02879j99724k0257k75881O7052j84257L85218l86441J08028L20322
16937A308250j20711J67420N2526r5342l4442j50722K366K77909n9023J1233l8660
16926A320804p7191K79634r0257J01002q6341q1811L49906k77166M73626p41050
$$ plain form
16999 726907 740346 650829 976835 700587 561758 734949 754005 660647 642609 894587
16989 894587 861654 899020 890983 723243 1042072 389539 963559 1010735 1031596 866793 760171
16978 760171 692686 912061 879413 750091 968721 962943 956463 978614 753488 1027250 880931
16967 880931 930773 1216977 766767 1048246 1126680 1023418 599446 775416 899565 952371
16957 952371 1200671 997059 1258372 788371 1096145 855372 1057983 959568 1352603 991311
16947 991311 1494190 1294466 1274209 998328 1065380 881123 1266341 879900 987928 1308250
16937 1308250 1187539 1354959 1407485 1312143 1277701 1126979 1129345 1407254 1348231 1359464 1320804
16926 1320804 1243613 1523247 1432990 1533992 1447651 1365840 1715746 1438580 1912206 1171156
16916A171156J09290J92933r4207Q8317J65336j63596J52283k4598L0865k23200
16906A404579M42345j59034k52547M87110r7979K8597j12214L08056k96971k2643
16896A729299j81904K09986O9914R7459K53845l93675J11171J0619P6737L5160
16886B018611j53365L15008R3082r3070O1291J71109l47342J54153K31065L03577
16876B754119k80665j44083J3437j04488M49317p7383j73956P8774L65982J45001
16866C026055j77073P7441o4676K33359m28938K80773j34776L12884P244j94294
16856B937999p8967K17274L57095j66472K1635k57479K51891K80067J17431K34035
16846C914509l71174n9501J89448r1281J23647J03369K07350J75983J11472k28255
$$ plain form
16916 1171156 1280446 1473379 1379172 1467489 1632825 1469229 1621512 1596914 1627779 1404579
16906 1404579 1846924 1687890 1435343 1922453 1824474 1853071 1740857 2048913 1751942 1729299
16896 1729299 1547395 1757381 1827295 1924754 2178599 1784924 1896095 1906714 1983451 2018611
16886 2018611 1865246 2180254 2273336 2180266 2241557 2412666 2065324 2219477 2450542 2754119
16876 2754119 2473454 2329371 2342808 2238320 2687637 2610254 2436298 2515072 2881054 3026055
16866 3026055 2848982 2926423 2861747 3095106 2666168 2946941 2812165 3125049 3132293 2937999
16856 2937999 2859032 3076306 3433401 3266929 3288564 3031085 3282976 3563043 3680474 3914509
16846 3914509 3543335 3483834 3673282 3582001 3705648 3809017 4016367 4192350 4303822 4075567
16836D075567M69984J3524m51885N10131j66434M17735J89379k50998K14987J25323
16826E147313j40084J60490p7763K6222J83855K00531O0415L34885l26895K77220
16816E846189O2394K74122M8756J21292j12888J60378L41285K23483k18785L81741
16806G127967J31980J05785J01552J6590P23161l92708O00938P9431q0979N35429
16796H949146k88962O89373J96987L26883J4831L29237K44645M63225N71846j37806
16786A1359405L73731K93437N53164j3380M40637K94551M80111M44209K42245
16777A4468110P27820J75031Q17356J85600O25759O79408P20960K19322P28086
16768A9347452N00991J032331O04646O95849O81146R20373Q02384J257370O65338
$$ plain form
16836 4075567 4545551 4559075 4107190 4617321 4450887 4868622 5058001 4807003 5021990 5147313
16826 5147313 5007229 5167719 5089956 5116178 5300033 5500564 5560979 5895864 5568969 5846189
16816 5846189 5908583 6182705 6231461 6352753 6239865 6400243 6741528 6965011 6746226 7127967
16806 7127967 7259947 7365732 7467284 7483874 8207035 7814327 8415265 8494696 8413717 8949146
16796 8949146 8660184 9349557 9546544 9873427 9888258 10217495 10462140 10925365 11497211 11359405
16786 11359405 11733136 12026573 12579737 12566357 13006994 13301545 13781656 14225865 14468110
16777 14468110 15195930 15370961 16188317 16373917 16999676 17679084 18400044 18619366 19347452
16768 19347452 19848443 20880774 21485420 22181269 22862415 23782788 24585172 25842542 26507880
16759B6507880J434155O22578J487710J059081J197771J434829J336760J786922
16751C6867686J332527K163275J961258J769108K212105J990926K141698K741616
16743E3180199K654406K774683L007247L282059L464611L548926M117729L748406
16735G9778266M532761M499030M718302N071584N039601N563937N717058N611714
16727A20532253N859078N595932N681238N414155N332259M668567M221953L500154
16719A60805589K929846K319496J294187K22338j026583j546267k389559l272190
16711A59336857l859640m815627m691843n304657n448942n907794o299591n737921
16703A17270842n595368n752917n637731n298251m904514m753723m774018m253303
$$ plain form
16759 26507880 27942035 28564613 30052323 31111404 32309175 33744004 35080764 36867686
16751 36867686 38200213 40363488 42324746 44093854 46305959 48296885 50438583 53180199
16743 53180199 55834605 58609288 61616535 64898594 68363205 71912131 76029860 79778266
16735 79778266 84311027 88810057 93528359 98599943 103639544 109203481 114920539 120532253
16727 120532253 126391331 131987263 137668501 143082656 148414915 153083482 157305435 160805589
16719 160805589 163735435 166054931 167349118 167571456 166544873 164998606 162609047 159336857
16711 159336857 155477217 150661590 145969747 140665090 135216148 129308354 123008763 117270842
16703 117270842 111675474 105922557 100284826 94986575 90082061 85328338 80554320 76301017
16695G6301017m074957m019975l430095l663729l193933k770929k945762k075253
16687E0126384k552861k493829k264047k144308j795530k098909j264641j563930
16679C3948329j507089j438639j323400j305186j432658q02495j011349q50625
16671B4276888j155394q75880r23701n97538p39981q85961l00338q60336p20044
16662A7217715n58982j18912j094693k92252m86102n62085n85566j52046L6726
16653A3403803j041950j62048k31597k63003q35522l16399J1394k80029n54233
16644I730416q097l14762J2404k46851n98967k13391R0792o065n37559n50980
16634G356940M42132n04200r4897k04763k91446j13239j52756j67855k9894l78100
$$ plain form
16695 76301017 72226060 68206085 64775990 61112261 57918328 55147399 52201637 50126384
16687 50126384 47573523 45079694 42815647 40671339 38875809 36776900 35512259 33948329
16679 33948329 32441240 31002601 29679201 28374015 26941357 26138862 25127513 24276888
16671 24276888 23121494 22245614 21321913 20724375 19984394 19098433 18798095 17937759 17217715
16662 17217715 16658733 16539821 15445128 15152876 14666774 14104689 13519123 13367077 13403803
16653 13403803 12361853 12199805 11968208 11705205 10869683 10553284 10564678 10284649 9730416
16644 9730416 9722319 9407557 9419961 9173110 8574143 8360752 8451544 8445479 7907920 7356940
16634 7356940 7799072 7294872 7199975 6995212 6703766 6590527 6437771 6269916 6240022 5861922
16624E861922j6106j37647O1786l4870j29939k88760j06223m7715r8251l75994
16614D688203L10167n25232K55816j90145l1860n0599r2253n41441L26658m2193
16604D107121l14041j88316K0330K75089k48813M3549j0602l5301k15405o2166
16594C371445K28202k53297q1371j41279L67355j87898o4349L4790k34836k58173
16584B780589N36779o08139n4694r7883O3231P2586L0196L2871n30400K46381
16574B471517R9048j73455L8772K6956J77187k40699J47381m17501k4710R192
16564B113688L58988n37424q4301J93387J85294j71895j45108j8575N1900k16784
16554A729170J31577k91634M58958o5963l16277J68770j81093J84124j75146J57047
$$ plain form
16624 5861922 5845816 5708169 5769955 5735085 5605146 5316386 5210163 5162448 5064197 4688203
16614 4688203 4998370 4473138 4728954 4538809 4506949 4456350 4364097 3822656 4149314 4107121
16604 4107121 3793080 3604764 3625094 3900183 3651370 3694919 3684317 3649016 3433611 3371445
16594 3371445 3599647 3346350 3264979 3123700 3491055 3303157 3238808 3273598 3038762 2780589
16584 2780589 3317368 2709229 2654535 2556652 2619883 2692469 2722665 2755536 2225136 2471517
16574 2471517 2570565 2397110 2435882 2462838 2640025 2399326 2546707 2129206 2104496 2113688
16564 2113688 2472676 1935252 1850951 2044338 2229632 2057737 1912629 1894054 1945954 1729170
16554 1729170 1860747 1569113 2028071 1962108 1645831 1814601 1633508 1817632 1642486 1799533
16544A799533j51071J0045k02620K37424k26797m8199p2240K8197j03009J5835
16534A287098K7302j2557j92711K87368J98673J5865k67398N1096k1178n50105
16524H23453J77748K72391M6002k63641l6412L55948l04499J04168M26144n58765
16514A042537L56356m64326K25131J84974J56210q6776n03421M87989m00818m7143
16504I50713J08446m0546k22416j45067N02978j29118J14327k72103J84432j95774
16494H55872j50684J93080p3234K79940k42412j70360R5185l2729L19366q3160
16484I90864C28626P95649l76242k00722J0699L58861j12105P1592k1682K66028
16474A120704j32384m46766K19708k33113L54072k53295O4084K63305m29287j2022
$$ plain form
16544 1799533 1648462 1658507 1455887 1693311 1466514 1418315 1346075 1374272 1271263 1287098
16534 1287098 1314400 1301843 1109132 1396500 1595173 1611038 1343640 1394736 1373558 823453
16524 823453 1001201 1273592 1319594 1055953 1019541 1375489 1070990 1175158 1601302 1042537
16514 1042537 1398893 934567 1159698 1344672 1500882 1414106 910685 1398674 997856 950713
16504 950713 1059159 1018613 796197 651130 1154108 1024990 1139317 867214 1051646 855872
16494 855872 705188 898268 825034 1104974 862562 692202 787387 754658 1074024 990864
16484 990864 328626 1124275 748033 547311 558010 916871 804766 876358 854676 1120704
16474 1120704 988320 541554 761262 528149 882221 628926 693010 956315 527028 515006
16464E15006j1354L19916l46326M0877K39812N8106C56804M79590P9344l19242
16454E96496J60823r887r2251j69806K18956j86106J20187K36383l46101n014
16444E23680j84058L63128C25222M26339C14078o8642K24749l9872J96963k62328
16434C64948J1643j02687K46191J4005j84765J07163n9170j18599R6088J77281
16424E52098A59469K73091p1494J15087J25441j40776p3086J8658j0839j34617
16414B60934q3132L29040j00553K4224J36236j86980J67573q4663j57391J73529
16404D78817m7376J03124k55145C0333L27002J39973P4554J8038B61940I1909
16393C49881J6120n5100j10172L33384k05187A18772d0528C77989A21495J69894
$$ plain form
16464 515006 503652 823568 477242 518119 757931 816037 356804 836394 915738 596496
16454 596496 757319 747432 655181 485375 704331 518225 638412 874795 528694 523680
16444 523680 339622 702750 325222 751561 314078 245436 470185 430313 627276 364948
16434 364948 376591 273904 520095 534100 349335 456498 397328 278729 374817 552098
16424 552098 159469 432560 361066 476153 601594 460818 387732 406390 395551 260934
16414 260934 177802 506842 406289 430513 566749 379769 547342 462679 305288 478817
16404 478817 431441 534565 279420 30333 357335 497308 571862 589900 261940 91909
16393 349881 366001 310901 200729 534113 328926 118772 -40528 377989 121495 291389
16383B91389j09934J85218P3634k10545J27391P2677A98733n137L70062k0981
16373E42677K354A58969J85635k2982O2532L32577A49039L38096O423m3563p8269
16362C71726L7406r7545O7362A21863J55432r4276M38736k97566A23261m491N1167
16351A69937K34248j12341b5392B10487Q4537b71893D86322j17190j62620J03354
16341C09866j02706J47910j48785J8265k3382r553J63308j74932L1629D2684O725
16330D9409A6126K85480F9792L59990j42199A03257M99123B28984J33070F225
16319B92290A06281N9458K36098C6807L55276e3500F7160J07611K38394a79695
16308A47930R6606K51506B32810j04504J80413O3664E0134K84278A63942K52599
$$ plain form
16383 291389 181455 366673 440307 229762 357153 429830 198733 193596 563658 542677
16373 542677 545031 158969 344604 321622 384154 716731 149039 487135 493558 449995 371726
16362 371726 409132 311587 378949 121863 277295 183019 621755 324189 123261 118770 169937
16351 169937 404185 291844 -25392 210487 295024 -271893 486322 369132 206512 309866
16341 309866 207160 355070 206285 224550 201168 191615 354923 179991 211620 42684 49409
16330 49409 16126 301606 69792 429782 287583 103257 602380 228984 362054 6225
16319 292290 106281 165739 401837 36807 392083 -53500 67160 174771 413165 -179695
16308 147930 244536 496042 232810 128306 308719 372383 50134 334412 163942 416541
16298D16541A73304H513L11720H971K75039d969A75863j6777a9798C43672F8434
16286a05636a8865B94754a1809C21249H5435J14072Q0917C3158M3045K86094m4013
16275C18284I9481j521f7046C75743b13261k7734A36037O7972l4746M8449d2537
16263A69122O908a9393C0200J64006j2852J87446a71107H3556N9950g6612j58343
16252b34955B09737J44841A58514R9505A02249K21713O3938c116k457A60920J05566
16241B66486l034f782A68918a9701B82276a0317A73600a49867A09370J87711n9056
16230B38025p8734l128j4971a90147D02319a89138A99742d7072D10698C320K49974
16219B53294A06148a54690e4081j68538A92168o6383a38112l068A52584a42088
$$ plain form
16298 416541 173304 8513 320233 8971 284010 -4969 175863 159086 -19798 343672 68434
16286 -105636 -18865 294754 -11809 321249 85435 199507 280424 33158 76203 362297 318284
16275 318284 99481 97960 -67046 375743 -213261 -240995 136037 204009 169263 217712 -42537
16263 169122 176030 -19393 30200 194206 181354 368800 -171107 83556 143506 -76612 -234955
16252 -234955 209737 354578 158514 258019 102249 323962 387900 -3116 -5573 160920 266486
16241 266486 263452 -6782 168918 -19701 282276 -10317 173600 -149867 109370 297081 238025
16230 238025 159291 156163 141192 -190147 402319 -189138 199742 -47072 410698 3320 253294
16219 253294 106148 -154690 -54081 -222619 192168 125785 -138112 -141180 152584 -142088
16208a87524A55945n6598e9169k55492C31874d8502k06938J16075E2702a0104
16197B54457F8539C0660n92a18905b8172B32155o2867n3588a95941F9299L0663
16186I9962A9149J85369P0214I5239L39525C5641K2515b64296C042O2658j9100
16175D6600J40094o6582l9262A8953R6214J16342A6780E235c85777A877J39547
16164A41424b13690A49622L8167F0068D830b0435H5998L5233J39439a58995b8845
16152b39261J14928L562A57361K31906l1815a56222K4172C5798K07670k8214R0589
16141C05843d5418K1536j00101A81061b14912A39885n2086f1288a9011H8396N2954
16130A41350O6778i3908A08197B9609r894Q070e6910j8486k25039e6143A23081
$$ plain form
16208 -187524 155945 99347 -59169 -314661 331874 -48502 -255440 -139365 52702 -10104
16197 254457 68539 30660 30068 -118905 -28172 232155 169288 115700 -195941 69299 99962
16186 99962 19149 204518 274732 95239 434764 35641 58156 -264296 3042 65700 46600
16175 46600 186694 120112 80850 18953 115167 231509 16780 5235 -385777 1877 141424
16164 141424 -213690 149622 187789 60068 4830 -20435 85998 121231 260670 -158995 -28845
16152 -239261 -124333 -120771 157361 389267 357452 -156222 -132050 35798 243468 215254 305843
16141 305843 -45418 -23882 -123983 181061 -214912 139885 87799 -61288 -19011 88396 141350
16130 141350 208128 -93908 108197 29609 19715 27785 -56910 -75396 -300435 -56143 123081
16118c83485d4766j27718j14968A03206a43321B0846O0535N6243r630b28469F8430
16106A79079g8600B08137E1520M2666a75620B97692l8464P5541h7265A35392A5908
16094a08532A0173g3203B67256j17072a52432I7479N4689J59176c5453j71238
16084b06691K4396A01703h4892G8826K7643N8728J14195a34462A77256J20418
16074B97674a01508A45087r322A0005K26432a46955B92368c8568B57523a43450
16063A70495a37817J8599j034A21862b9486A07018O5262b84039A27056a20890
16052a3925k15998J4429F6276L05974b8214j32071d6704d230j73173p721l1326
16041b16450J02350J9715o9144D7181J54294D7185i7679r3852B73274g8262B7398
$$ plain form
16118 -383485 -44766 -172484 -287452 103206 -143321 20846 81381 137624 127994 -228469 68430
16106 179079 -78600 208137 51520 94186 -175620 297692 259228 334769 -87265 135392 15908
16094 -108532 10173 -73203 267256 150184 -152432 97479 152168 311344 -35453 -206691
16084 -206691 -182295 101703 -84892 78826 106469 165197 279392 -134462 177256 297674
16074 297674 -101508 145087 135765 10005 236437 -146955 292368 -38568 257523 -143450
16063 170495 -137817 -119218 -120252 121862 -29486 107018 172280 -284039 127056 -120890
16052 -13925 -229923 -215494 66276 372250 -28214 -160285 -46704 -4230 -177403 -185124 -216450
16041 -216450 -114100 -94385 -163529 47181 201475 47185 -97679 -191531 273274 -78262 27398
16029h431A30330i6724j78146A03567b80808i7479D44988e14111h4025o4566q210
16018a56801b7203k30066B36595A13745a35085G9600a36743A6174j68O1564I141
16006b64876A41276C4130i4181j84437a01318j6054o2584D860a23772M4217l28835
15995d08390F7702K3770c28927e8314P756k03960l9215b8425A45449k8902a35528
15983B29112j11736L12437j04322d2989J9028B60854H5016J74742B5495h5700
15972A69045i4422G3502B7486K35924a05884b0738C53155b06781A58438B262a59885
15960A35133b20238A2575J52242G2377a02370C8748f5307k17540a5501C11997
15949B80335A09436M57a30381B39586h9377G9157B3803M468a02495j73844J9088
$$ plain form
16029 -8431 130330 -96724 -274870 103567 -280808 -97479 444988 -514111 -84025 -148591 -156801
16018 -156801 -27203 -257269 236595 113745 -135085 79600 -136743 16174 16006 77570 9141
16006 -264876 141276 34130 -94181 -278618 -101318 -117372 -179956 4860 -123772 -79555 -408390
15995 -408390 67702 91472 -328927 -58314 -50558 -254518 -293733 -28425 145449 116547 -135528
15983 229112 117376 429813 325491 -42989 -23961 260854 85016 259758 25495 -85700
15972 169045 -94422 73502 27486 263410 -105884 -20738 353155 -206781 158438 2262 -159885
15960 135133 -220238 12575 164817 72377 -102370 38748 -65307 -282847 -15501 311997
15949 280335 109436 109893 -130381 239586 -89377 79157 23803 28271 -102495 -276339 -257251
15938b57251a6668m7661D0518a27498r3284N562I1937a12348N4237A14353I282
15926b26072a08492M5974G0992b50280A69792E3795g391k03474i0984r373r530
15915a09887j31181D95591j74201I2945P7771a25817A17628C5780J5318J49214
15905B00312e3777j45932B3507J34249q214J65794G0951c7273e349A9909E505
15893A27933m6812f2221b1414j17773A44516g2920k8530C87000B4099b16894A69095
15881d7404C1040b65873B12672a22347A4232b28118D40549b26314D1962J80942
15871B22904b32400B6972a11950K8757A45747B180a77012l63702b13448B04561
15860e7884P054o8558A29071h1613i244A94501O1698F9420c86067D0630a96345
$$ plain form
15938 -257251 -16668 -64329 40518 -127498 -220782 -215220 91937 -112348 -58111 114353 9282
15926 -226072 -108492 -62518 70992 -250280 169792 53795 -7391 -210865 -90984 -100357 -109887
15915 -109887 -241068 495591 321390 92945 170716 -125817 117628 35780 51098 200312
15905 200312 -53777 -199709 23507 157756 149542 315336 70951 -37273 -5349 19909 5505
15893 127933 81121 -62221 -21414 -139187 144516 -72920 -101450 387000 24099 -216894 169095
15881 -47404 31040 -265873 212672 -122347 14232 -228118 440549 -226314 41962 222904
15871 222904 -232400 26972 -111950 -83193 145747 2180 -177012 -540714 -213448 204561
15860 -57884 -50830 -119388 129071 -81613 -9244 194501 256199 69420 -386067 40630 -196345
15848B27936P4070F2385J50639b1584D8470O3295C4686c4468B44129G791Q9036
15837I6827b04153A24245f8466p633B3681a81108G889a51400A38244K7616c47932
15825A04604a55708E8454i5596m9373A0159R2571b50224I3065N7104d8057C6192
15813d57j19434A10427g6555I960J56956a79521j30045E2075a05875r3072A05411
15801F5633k3883l139a50596j28711h0971j5997B84423A5752Q2080D1831J66652
15790B08483q5282f6744F126a5114j6515B51602a47318E9553b13088Q9857J3183
15779a10048A54005a08566N879l8291a0544A83280c71469J40002j16373B38292
15768b1032j97369b4995m45548G4078k0195a01908C5238N0415c222G5385h3119
$$ plain form
15848 227936 302006 62385 213024 -21584 48470 111765 34686 -34468 244129 7791 96827
15837 96827 -204153 124245 -68466 -76099 23681 -181108 7889 -151400 138244 165860 -347932
15825 104604 -155708 58454 -95596 -144969 10159 102730 -250224 93065 150169 -48057 36192
15813 -457 -119891 110427 -76555 9960 166916 -179521 -309566 52075 -105875 -198947 105411
15801 65633 41750 38611 -150596 -279307 -80971 -96968 284423 15752 97832 41831 208483
15790 208483 123201 -66744 6126 -15114 -31629 251602 -147318 59553 -213088 -123231 -110048
15779 -110048 154005 -108566 -102687 -140978 -10544 183280 -371469 -231467 -347840 238292
15768 -21032 -218401 -24995 -470543 74078 53883 -101908 35238 85653 -3222 75385 -83119
15756A81190p4003J84277F5417A851c769j88187b008E6272b07853c6654B47403
15744e3276A14391J81094f2132D0912A400e5911j14184d3831D021g9186J6754
15733f2432K8173A51092b1477D3492e7690H0878a15559l3131l234j8041f3136
15721A72859b00213g1043k53680A0010a47978k31504J86890b239j86737R0194
15711i8782G2206b652B80504a46667p1534f0885K4896F0952B7831a47699B2703
15699a1691k25533h7120C14749a45301B86442f6686A91853m4196R6147B2521J98734
15688B21255H937K54344b04623k12459J52882P6839D8169b41240D500d23A92910
15676H518g5745D4102Q7864J4524m7329L2118e8101A22544C489K52386Q1406A14125
$$ plain form
15756 181190 107187 291464 65417 1851 -3769 -191956 -2008 56272 -207853 -36654 247403
15744 -53276 114391 295485 -62132 40912 1400 -55911 -170095 -43831 4021 -79186 -62432
15733 -62432 -34259 151092 -21477 43492 -57690 80878 -115559 -148690 -151924 -169965 -63136
15721 172859 -200213 -71043 -324723 10010 -147978 -379482 -192592 -2239 -188976 -98782
15711 -98782 72206 -2652 280504 -146667 -218201 -60885 -35989 60952 27831 -147699 22703
15699 -11691 -237224 -87120 314749 -145301 286442 -66686 191853 147657 243804 22521 221255
15688 221255 8937 263281 -204623 -417082 -264200 -187361 48169 -241240 4500 -423 192910
15676 8518 -75745 44102 131966 146490 99161 131279 -58101 122544 3489 255875 337281 114125
15663D37168h0365q556j67345g3455D0932b97870B3339c80177a70668h5058H0730
15651b72148B06279j837B2939J59677m1539o5257a65386B72251j02770C2739e1305
15639e8519k64706l552a45811j69956a34279N3532k9425N1545o1063B47938B6771
15627i202j00314B01638g3856A24338c1309j60312A72498F539J47314C6325c9707
15615G4096b19529j75333C05933c30952A74386q732e9579A3605b16076c8818j38087
15604a76905a2413j10566R078j0648I3495a04291h066A35051b6593k32756R6539
15593a62810B25419n5328b04466k43805P0190I0740a11783B76744c325q331A59490
15581A31426a09185b5671A28518Q3357N9190c18446a5309l05969J29642h9045
$$ plain form
15663 437168 -80365 -88921 -256266 -73455 40932 -297870 23339 -380177 -170668 -85058 80730
15651 -272148 206279 204442 22939 182616 141077 75820 -165386 272251 169481 32739 -51305
15639 -58519 -323225 -326777 -145811 -315767 -134279 -80747 -110172 -58627 -119690 247938 26771
15627 -9202 -109516 201638 -73856 124338 -31309 -191621 172498 6539 153853 36325 -39707
15615 74096 -219529 -394862 305933 -330952 174386 165654 -59579 13605 -216076 -38818 -176905
15604 -176905 -12413 -122979 -113901 -124549 93495 -104291 -8066 135051 -26593 -259349 -162810
15593 -162810 225419 170091 -204466 -448271 -378081 90740 -111783 276744 -3325 -11656 159490
15581 131426 -109185 -25671 128518 211875 271065 -318446 -15309 -321278 -191636 -89045
15570f449j38393p8034M8000A4611a21465n4359A0961Q5638c07484A97112Q9226
15559B86338a19672A71333Q3464d07274H9435a41497A1592Q5924P6019k662b15160
15547c07540f1984D0480b18661j90726e4775B12405p6995a51992b5276J29A41106
15535i8829A24998A7678c01497i558j09658K4087E3282a31976F9293b13632A29404
15523D2938P4431a56608A22041h4050F6392F172R8063b32640f5553A55651K9361
15512A85012F1224a30787M1293D9995G628J82093a97157G0369b29561j44006J58824
15501b14743a05264N0842A81177E5465c20482A29782i6601f970A23773b34036
15490i5170k8077d8431k55494A6145P4652j5991C1811N5686a34931B6195a37733
$$ plain form
15570 -6449 -144842 -222876 -174876 14611 -121465 -175824 10961 96599 -307484 197112 286338
15559 286338 -119672 171333 254797 -407274 89435 -141497 11592 97516 173535 170873 -215160
15547 -307540 -61984 40480 -218661 -409387 -54775 212405 135410 -151992 -25276 -25147 141106
15535 -98829 124998 17678 -301497 -9558 -119216 -95129 53282 -131976 69293 -213632 129404
15523 42938 117369 -156608 122041 -84050 66392 6172 104235 -232640 -65553 155651 185012
15512 185012 61224 -130787 -89494 49995 7628 189721 -197157 70369 -229561 -373567 -214743
15501 -214743 -105264 -54422 181177 55465 -320482 129782 -96601 -6970 123773 -234036
15490 -95170 -123247 -48431 -303925 16145 90797 74806 31811 87497 -134931 26195 -137733
15478D3639J9802b04208C2119d58967a55313K1513A01021L0237f1336A5513L22318
15467C37831d361A03631a24415D2906a55579J7767B95591f6059j66116N9524j36345
15456c08996B5342b09337a9498A93631G3071d24993i5323L7972B06023a55907
15445A785L4456L7165M7224D156b06356A97212p1884b01294E2858d82633A61052
15433c11089i190G1751M030f36846a27644B18804J6198a62737C03630a20353A70192
15421A93211G2775B4249L1179f615B02096m1010f9692C2381a05515q3271A36501
15409A39739N2860a76166Q6186a7855k1043j74475A49540b19259i4675d0737j8626
15398e9363B78580b19273G443J58189d7679C08288A02027N6984o7425M4418J36196
$$ plain form
15478 43639 63441 -204208 32119 -458967 -155313 -133800 101021 131258 -61336 15513 337831
15467 337831 -4361 103631 -124415 42906 -155579 -137812 295591 -66059 -232175 -172651 -308996
15456 -308996 25342 -209337 -19498 193631 73071 -424993 -95323 -57351 206023 -155907
15445 1785 36241 73406 120630 4156 -206356 197212 125328 -201294 52858 -482633 161052
15433 -311089 -9190 71751 75781 -636846 -127644 218804 235002 -162737 303630 -120353 170192
15421 193211 72775 24249 55428 -6615 202096 161086 -69692 32381 -105515 -188786 136501
15409 139739 192599 -176166 -89980 -17855 -38898 -213373 149540 -219259 -94675 -40737 -59363
15398 -59363 278580 -219273 7443 165632 -47679 308288 102027 159011 91586 136004 272200
15387B72200c1825r606P682o052o8615c8318B3385J0671a16468B8899J61902r2243
15375I8558d4971A11633O9988G5469i5514C7842K36725r4487c3568I3861j3994
15364G9867f3691j94612A30127J17938a29768A56794p784a81227p1470q4538g5252
15352B86099j36365f4712A42640J46379A4028O58a84914h2864m1948M311l5484
15341a55985J6918A38679J23738P8370i6286D6387L54392i0838d4599q4124l4565
15330a63288I816K28510E8403J66493b84868i9992j24775H4844K7374b0515m4297
15319f4812o3737r8947A14010J08594h3518k38195A71912G3123b05622B20042
15308C72374f9589D75233A11212K50383b9394A92754B6718d4579B7030J19083
$$ plain form
15387 272200 -31825 -41431 -33749 -39801 -108416 -38318 23385 34056 -116468 28899 190801 98558
15375 98558 -44971 111633 181621 75469 -95514 37842 274567 180080 -33568 93861 79867
15364 79867 -63691 -258303 130127 248065 -129768 156794 149010 -181227 -252697 -337235 -75252
15352 286099 149734 -64712 142640 289019 14028 14686 -184914 -82864 -124812 -120501 -155985
15341 -155985 -139067 138679 262417 340787 -96286 46387 400779 -90838 -44599 -128723 -163288
15330 -163288 9816 238326 58403 224896 -284868 -99992 -224767 84844 112218 -20515 -64812
15319 -64812 -128549 -227496 114010 222604 -83518 -321713 171912 73123 -205622 220042
15308 372374 -69589 475233 111212 361595 -29394 192754 26718 -44579 27030 146113
15298A46113C5804a08837C4398g4134B13692c4700p3954l1730H5225R8304p4897
15287A08632K6628k2102J08682k2974h9313c7416E727K9706a38406A71887r38
15276A70949n1118b36552A56781o0237o401i057A50039l8059j6432K06009p1A26059
15263f4018J5272D28394A5622K17591e2736A57365D1398J21927A8998K77906n4741
15252B42163j0281j8612K02744L29852L61585K68073j08565K6407o21296B21585
15241A06864D163J9351M4267N438g7825e96A38215D1201K55208a19533A1375L2637
15229D4012b1258A04239h3592A76093A478e8387m2066A26005a41537A18230e8861
15217C5028J21595h5287G0624K16008q984C7752M0460a04946D44828B05132a58161
$$ plain form
15298 146113 35804 -108837 34398 -74134 213692 -34700 -108654 -140384 85225 183529 108632
15287 108632 135260 113158 221840 198866 -89313 -37416 5727 35433 -138406 171887 170949
15276 170949 119831 -236552 156781 96544 90143 -9057 150039 111980 95548 301557 301486 126059
15263 -64018 -48746 428394 15622 233213 -52736 157365 41398 163325 18998 296904 242163
15252 242163 231882 213270 416014 745866 1107451 1375524 1266959 1293366 672070 221585
15241 106864 4163 23514 67781 73219 -77825 -596 138215 41201 296409 -119533 11375 44012
15229 44012 -21258 104239 -83592 176093 1478 -58387 -100453 126005 -141537 118230 -58861
15217 35028 156623 -85287 70624 286632 277648 37752 78212 -104946 444828 205132 -158161
15205A70457E5467k3016L6438A5914L48403j14124k9248a07235j23129F8151R5884
15194A64035A4989J30485c87976G0534a40131d9174k0572B38812a7468A16043
15183e0230j15633A53681h5269k36898C1462J27388a24382B18298o7953f8968
15172a0437B11136e190j38936M083B25181J72167B8947c801A3411J71726a41623
15160A38775a62492J6134I4504c4276o8719E51971D9853Q8235b7766C64884f2731
15148H6413J03164J53693a15241I8094B3133c87937g137q8455C03287A30523a99723
15136F5316k5114K26968n3040f58B43181g7060J183D5966R8723O0391J58924A05870
15123C62953j60429h9649B99543A3690e7599K3696A58147k4320h9116A21562O9983
$$ plain form
15205 170457 55467 32451 68889 15914 364317 250193 220945 -107235 -230364 68151 164035
15194 164035 14989 145474 -387976 70534 -140131 -49174 -69746 238812 -17468 116043
15183 -50230 -165863 153681 -85269 -322167 31462 158850 -124382 218298 150345 -68968
15172 -10437 211136 -5190 -144126 -140043 225181 397348 28947 -3801 13411 185137 -141623
15160 138775 -162492 -146358 94504 -34276 -102995 551971 49853 138088 -27766 364884 -62731
15148 86413 189577 343270 -115241 98094 23133 -387937 -7137 -95592 303287 130523 -199723
15136 65316 40202 267170 214130 -658 243181 -77060 -75877 45966 144689 205080 364004 105870
15123 362953 202524 -89649 299543 13690 -57599 -33903 158147 133827 -89116 121562 191545
15112A91545E0572f1246H2461M2377K93459j84673o6430n2466d7826B10803L95452
15101F06255B17265a28474A27562J97276A61770K21286b51954C15767h1476A53366
15090B80693m9658I8241J37077a88215A93819O890Q9234Q6697E7449Q0041E5647
15078F9527J21500H4681b2271B37467j09854m4763d5795j58246h7969F7347O8173
15067A35520K5639J31929j15099b95217B9750N9212K9488L49744F9445K64554
15057C33999p8144e4486G1418K56798A30861N9857l1630J71614I906K76985e718
15045C51369h9727C79654M06443l54088o7693j72587l9248P0494K16942B0809
15034C93780D3734h9739A18957a01698A99883I5138g7750C33224j59544p4115
$$ plain form
15112 191545 50572 -61246 82461 124838 418297 233624 167194 114728 -47826 210803 606255
15101 606255 217265 -128474 127562 324838 161770 383056 -251954 315767 -81476 153366
15090 280693 231035 98241 235318 -188215 193819 200709 289943 376640 57449 137490 55647
15078 69527 191027 84681 -22271 237467 127613 82850 -45795 -204041 -87969 67347 135520
15067 135520 161159 293088 177989 -295217 29750 88962 118450 468194 69445 333999
15057 333999 255855 -54486 71418 328216 130861 190718 159088 330702 9906 286891 -5718
15045 351369 -89727 379654 786097 432009 364316 191729 152481 222975 439917 20809
15034 393780 43734 -89739 118957 -101698 199883 95138 -77750 333224 173680 99565
15024I9565o111M9537J19615c35834J58149h2744A67542R6189J91954j84146L2606
15013C04145j15238M602a01488A468J73121J36740j18541C2486i763D65571G8882
15001A44811K84272j67012o5845D8796J04533a93435g2785B73706G1785J54541
14991B26326N9232A41414a7937A94359n0984K30808q8630R9692k7397A68314K87673
14980D55987k12236o0007J32225l273J8283J6524D1779a29187A06602K9100K89378
14969D25080A16026K24403b3457I4482m7131j4708L83886A07587L29055K6473
14959D63115A19980J77882G9340K088J34317n3611K55633j44027K30116C27P119
14948G446J48142L32875A10663J95675j33510l0834K21217R1627A75158K0632
$$ plain form
15024 99565 93454 142991 262606 -335834 -177685 -82744 167542 263731 455685 271539 304145
15013 304145 188907 193509 -101488 1468 174589 311329 192788 32486 -9763 465571 78882
15001 144811 429083 262071 196226 48796 153329 -193435 -72785 273706 71785 226326
14991 226326 285558 141414 -17937 194359 143375 374183 285553 385245 357848 168314 455987
14980 455987 243751 183744 315969 312696 330979 347503 41779 -129187 106602 135702 425080
14969 425080 116026 340429 -23457 94482 47351 32643 416529 107587 436642 463115
14959 463115 119980 297862 79340 81428 215745 162134 417767 273740 503856 327 7446
14948 7446 155588 488463 110663 306338 172828 141994 363211 454838 175158 195790
14938A95790l1527J44997K57077A67615a6139B96975A17579J90268A51488J75437
14928C26925J6540q9768M4712i8275D03524A39189J75785K10531k33708H5065
14917E89170A90091p3989K01787Q8614j81218K60263J7968A29793J52240I7771
14906B97371l1770K52560l1631m4287o0233a2181D28295A94560K01997R1870j10897
14895C77530j05466J04348o4799e6706B59123I3088N8203L90601j95035r4821
14885B52036j02375K40695J77971j28643j9428A04925J25304K98274q9868o3032
14875C75603J91581A4407K26188l618J32713E2292L67926k8431j62255J76593
14865D06125k6243j13279A12845N2214J22865B7793N80391k94119K22643M5875
$$ plain form
14938 195790 164263 309260 566337 167615 -16139 296975 117579 307847 151488 326925
14928 326925 343465 253697 298409 -98275 403524 139189 314974 525505 291797 85065
14917 589170 190091 116102 317889 406503 225285 485548 503516 129793 282033 97771
14906 297371 265601 518161 486530 442243 382010 -12181 428295 194560 396557 488427 377530
14895 377530 272064 376412 311613 -56706 259123 93088 151291 541892 346857 252036
14885 252036 149661 390356 568327 439684 420256 104925 230229 528503 438635 375603
14875 375603 567184 14407 240595 236977 369690 52292 420218 391787 229532 406125
14865 406125 379882 266603 112845 165059 287924 27793 608184 314065 536708 582583
14855E82583k66475J84607B04130M4975b6011C17313m5383M71003k43081J51583
14845F51435k37414M7879k00611I2221K16601J52055k4167Q389j76605l2872K37832
14834D73454K32167B54339K79645K03617k89522A70989J84407j37703M1886J95334
14824D54913k02118K28748K26798k59787j03545Q3657A97216J53848J76161B30361
14813D44645O5293M037k1958P9353E0904N40543R0528J1757B60270M87087C21777
14801E81298j49804A93281J51383R2680L62280K59168n17885K8451k1639M7262
14791E94981j22663j20271J1185j1927N0002J11012j16814J5322k0960e9336F39876
14779A74209K6031K31175K75607k86827N6181A02939N02380B99406L94187j13462
$$ plain form
14855 582583 316108 500715 204130 249105 -26011 317313 271930 742933 499852 651435
14845 651435 414021 461900 261289 92221 308822 460877 436710 445099 268494 235622 473454
14834 473454 705621 254339 533984 737601 448079 170989 355396 217693 259579 454913
14824 454913 252795 481543 708341 448554 345009 428666 197216 351064 527225 230361
14813 444645 509938 513975 492017 571370 50904 591447 681975 693732 260270 747357 321777
14801 581298 431494 193281 344664 437344 799624 1058792 540907 569358 547719 594981
14791 594981 472318 352047 363232 351305 401307 512319 395505 410827 389867 -59336 639876
14779 174209 200240 431415 707022 420195 476376 102939 605319 299406 693593 580131
14769E80131M7735O4509L3159B27768M86982j35267j13459R7247j35815j08782
14759C18674O0923J31502j05716j153p3997J27118L10123k29644j03677P0968
14749E05121J09578B97329K62165N9012j70220j0317q0499J98697M21875k84674
14739F93368j27066K28054J9088C82511L29363q71K98304j49361J69008j2905
14729A016049D35542J49297j52475J18497J45292l44611M58824l30124j9583J81678
14719F42337L63256k67733J03365n0175L758l5517k8151J4489M61958k02544m48316
14708E56727L65400D49459M74398l71416J65018m203m8735K38573L2114m54218
14698D80990N04202l12234J58668k58886o9724J14036K66489l72852J38297K94675
$$ plain form
14769 580131 627866 692375 725534 227768 714750 579483 466024 563271 427456 318674
14759 318674 379597 511099 405383 404230 330233 457351 767474 537830 434153 505121
14749 505121 614699 297329 559494 618506 448286 437969 357470 556167 978042 693368
14739 693368 566302 794356 813444 382511 711874 711003 1009307 859946 1028954 1016049
14729 1016049 435542 584839 432364 550861 696153 351542 810366 480242 460659 642337
14719 642337 1005593 737860 841225 791050 794808 759291 731140 745629 1207587 1005043 556727
14708 556727 922127 449459 923857 552441 717459 713256 664521 903094 935208 480990
14698 480990 985192 672958 831626 572740 503016 617052 883541 510689 648986 943661
14688I43661q4647B54614O27618k79268J15523K02207K04603l30218k88366L36179
14678H42892K9270J52991l55245L02342K97847l64316K01874j44464m9402R5211
14668A009000l13411L16064l74075K33782M87198m66499J03337k4218J80825k69225
14658H82778J721M6749K94255n66o6676l32190O5142j83445K25611N5351j8547
14647I70183J40919k31500J76737L94301k47247l80568L22560p0820L38059m08894
14637A003730j12033N11532k7217j08027J08164k39261j2670q9802J84005m6020
14627A172401k98791M56928r5523J7226J9177J8689q7424J40557m8588j16422
14617A178230J63664l8792l5719L91218k45092j31881j41221J12959Q8046k31872
$$ plain form
14688 943661 859014 254614 882232 602964 718487 920694 1125297 795079 506713 842892
14678 842892 872162 1025153 669908 972250 1270097 905781 1107655 963191 913789 1009000
14668 1009000 695589 1011653 637578 871360 1358558 892059 995396 971178 1152003 882778
14658 882778 884499 931248 1225503 1224937 1158261 826071 891213 707768 933379 988730 970183
14647 970183 1111102 879602 1056339 1450640 1203393 822825 1145385 1074565 1412624 1003730
14637 1003730 891697 1403229 1376012 1267985 1376149 1136888 1124218 1034416 1218421 1172401
14627 1172401 873610 1330538 1235015 1252241 1271418 1290107 1202683 1343240 1294652 1178230
14617 1178230 1341894 1303102 1267383 1658601 1413509 1281628 1140407 1253366 1341412 1109540
14607A109540N07962k42208j0206L55051j12658j21030L85816j62206j79770j66941
14597A363350M05278l52376m160K73026l3529r0214L13277J9810l52909J01396
14587A642949j22529L63185m80601P5377J65310M91833k06151k26346N26131l24637
14577A904521o5737k06412J25034K39936N5065J075j33381j20143K42787K04461
14567B247206m01969L06605M2900k3360K23730j66309M07686j30954o7414J1727
14557B449848K81729J06357K54967L56778k845K36128L70878J137356J647574
14548F838770L978864Q689131K0206343J093270A9764682H853227m109877j663791
14540C079559r01295J31863k37411L4223j04668l86889J82435K24802m19702L78840
$$ plain form
14607 1109540 1617502 1375294 1365088 1720139 1607481 1486451 1872267 1710061 1530291 1363350
14597 1363350 1768628 1416252 1412092 1685118 1651589 1561375 1874652 1894462 1541553 1642949
14587 1642949 1520420 1883605 1403004 1478381 1643691 2135524 1929373 1703027 2229158 1904521
14577 1904521 1838784 1632372 1757406 1997342 2052407 2053482 1920101 1799958 2042745 2247206
14567 2247206 1845237 2151842 2194742 2171382 2395112 2228803 2636489 2505535 2438121 2449848
14557 2449848 2731577 2837934 3092901 3449679 3446834 3682962 4053840 5191196 6838770
14548 6838770 10817634 19506765 39713108 40806378 19764682 8853227 4743350 3079559
14540 3079559 2178264 2310127 2072716 2106939 2002271 1615382 1797817 2022619 1602917 1981757
14530A981757j22094j4482m1464N11448n0505j85332k5952M13236l29475K88740
14520B425877K1037m16934J76365n8354R2100p821p7012N65772k34787L08093
14510B794336j94101k2229O3845J63669q0607j2770J51306K2652q6593m51217
14500B348291O47025l14526J88041J2850J61068P8047p2470J64355j20569J23954
14490C216066M8772j09166j69139K66136r4490J63634J13104k40414J26475K37969
14480C558947j37463J77125Q2983n227J57344k37776K00104r8779Q2645K65187
14470D045090l38648K75746j9144r1100J71345P771L34786N5159m70607O35832
14460D606230k69752L58184j5288m1344K81272L7197n1153K8325j25989J26182
$$ plain form
14530 1981757 1859663 1845181 1803717 2315165 2264660 2079328 2053376 2466612 2137137 2425877
14520 2425877 2446914 2029980 2206345 2147991 2240091 2232270 2155258 2721030 2486243 2794336
14510 2794336 2600235 2578006 2641851 2805520 2724913 2712143 2863449 2886101 2799508 2348291
14500 2348291 2995316 2680790 2868831 2881681 3042749 3120796 3048326 3212681 3092112 3216066
14490 3216066 3264838 3155672 2986533 3252669 3158179 3321813 3434917 3194503 3320978 3558947
14480 3558947 3421484 3598609 3681592 3676365 3833709 3595933 3796037 3697258 3779903 4045090
14470 4045090 3706442 3982188 3963044 3871944 4043289 4051060 4385846 4441005 3970398 4606230
14460 4606230 4336478 4694662 4679374 4638030 4919302 4956499 4905346 4933671 4807682 4933864
14450D933864j16575M63997n6603J96510R649o798J22330l19455K15890N7614
14440E500423Q4824Q5605k8953K25426j84796K70760L90324K72942n22002J70732
14430F265285L98949j49722L90438l56841L57004r2261j78377L89561Q5581R0987
14420G200604R891K94248j52689N96278k33068j14627J7611M87731q0136K03636
14410H229479J11392K69830j91354M46529K40767L34223k11441J18707N7503K76664
14400I682299M23561k08703K99874J45084O4743P1698K68005L46571J77527l9314
14390A1231345M63304K72547j8173J50764K14492M05137K03772j15443M37832
14381A3245577J00677K35098M61429J54737K24792K05743N88552Q3478M22825
$$ plain form
14450 4933864 4817289 5281286 5224683 5421193 5430842 5424044 5546374 5226919 5442809 5500423
14440 5500423 5585247 5670852 5641899 5867325 5682529 5953289 6343613 6616555 6094553 6265285
14430 6265285 6664234 6514512 6904950 6548109 6905113 6812852 6634475 7024036 7109617 7200604
14420 7200604 7210495 7504743 7352054 7948332 7715264 7600637 7618248 8105979 8025843 8229479
14410 8229479 8340871 8610701 8419347 8865876 9106643 9440866 9229425 9348132 9405635 9682299
14400 9682299 10105860 9897157 10197031 10342115 10406858 10478556 10746561 11093132 11270659 11231345
14390 11231345 11694649 11967196 11949023 12099787 12314279 12719416 12923188 12807745 13245577
14381 13245577 13346254 13581352 14042781 14197518 14422310 14628053 15216605 15300083 15722908
14372A5722908k4246N26467M26084j48811P89000L49165L15113M76036J81825
14363A8613541J41469R91686o5119K62062O64056Q81763L9119Q17824M25107M90407
14353B3261915Q67358L72145O33047L27898P84667O85838O76553P21385N65919
14344B8896725Q78249P80741Q82487P73377J025971L92790J274618P86000J576110
14335C7267068O08314J367290R23345J240618J136413J404383J483618J325057
14327D6756106J640853J306732J878300J573715J848494J799838J897800J960194
14319F0662032K329969K137832K603318K460168K333675K925537K717728L418728
14311H1588987L439291L098390L742454L914943L766365M476227M441609M966820
$$ plain form
14372 15722908 15698662 16225129 16651213 16502402 17291402 17640567 17955680 18431716 18613541
14363 18613541 18755010 19746696 19681577 19943639 20607695 21489458 21528577 22346401 22771508 23261915
14353 23261915 24129273 24501418 25134465 25462363 26247030 26932868 27609421 28330806 28896725
14344 28896725 29774974 30555715 31438202 32211579 33237550 33630340 34904958 35690958 37267068
14335 37267068 37875382 39242672 40166017 41406635 42543048 43947431 45431049 46756106
14327 46756106 48396959 49703691 51581991 53155706 55004200 56804038 58701838 60662032
14319 60662032 62992001 65129833 67733151 70193319 72526994 75452531 78170259 81588987
14311 81588987 85028278 88126668 91869122 95784065 99550430 104026657 108468266 113435086
14303A13435086N043821N202844N879798O091549O733839O753919P283293Q109270
14295A64533419P502789Q802738R153502R776902J0639037J0527335J1519169
14288B32454891J2083955J2268334J2944145J3562819J4336263J4210381J4893147
14281C26753935J4785835J4577655J5035010J3863634J3621592J2665981J1365901
14274D22669543R327528N443655K654962J537029R68408j120812m750917l773830
14266D32955566o060706p229543q719156j0310696j2197289j3584330j4750207
14259C60103639j4896648j5555644j5228939j5480476j4261796j3495199j3757898
14252B57427039j3029082j2471909j1797895j1528793j0612221r894963r299731
$$ plain form
14303 113435086 118478907 123681751 129561549 135653098 142386937 149140856 156424149 164533419
14295 164533419 172036208 180838946 189992448 199769350 210408387 220935722 232454891
14288 232454891 244538846 256807180 269751325 283314144 297650407 311860788 326753935
14281 326753935 341539770 356117425 371152435 385016069 398637661 411303642 422669543
14274 422669543 431997071 437440726 440095688 441632717 442601125 441480313 436729396 432955566
14266 432955566 426894860 419665317 410946161 400635465 388438176 374853846 360103639
14259 360103639 345206991 329651347 314422408 298941932 284680136 271184937 257427039
14252 257427039 244397957 231926048 220128153 208599360 197987139 188092176 178792445
14245A78792445q694129p888560p938237p480866p257091o459055o108110n158176
14237A21808221n656626n110229m544449n116967m387134l542696l589098l545114
14229H6315908l611051l439965l195087k618564k939655k618904k514112k299688
14221F3078882k001817k205766k177035j658779j857560j876055j813056r34007
14213D8554807j369826j709184j315703j402160j375356j115517p22496j097187
14205C8447378j498672j310488n90792j057997q31365l24219j485034l43760j322762
14196B9682289m58254q30525l95095o68592r27962o78010m22899o99416m03327
14187B4198209p15607n37820l69619p66467n45675L3503q39627l04958l96221
$$ plain form
14245 178792445 170098316 162209756 154271519 146790653 139533562 133074507 126966397 121808221
14237 121808221 116151595 111041366 106496917 101379950 96992816 93450120 89861022 86315908
14229 86315908 82704857 79264892 76069805 73451241 70511586 67892682 65378570 63078882
14221 63078882 61077065 58871299 56694264 55035485 53177925 51301870 49488814 48554807
14213 48554807 47184981 45475797 44160094 42757934 41382578 40267061 39544565 38447378
14205 38447378 36948706 35638218 35047426 33989429 33158064 32833845 31348811 31005051 29682289
14196 29682289 29224035 28393510 27998415 27329823 26401861 25723851 25300952 24601536 24198209
14187 24198209 23482602 22944782 22575163 21808696 21263021 21296524 20456897 20151939 19755718
14178A9755718n97979j41936p31456j14883l47925o83939J842m30434l93586l70754
14168A5944668L8054q06489n514o96801J22905o02000J84976n57517k13508j09260
14158A3299514n6690m67145j24586j39844L4366p16788R1498K3478k05145p9233
14148A1659425m66166k79905k82012j52356l53539M2294l11964R3329M3003j10691
14138I881418l19264j78526j28177p99577K68794K8411j80316J35165l51127Q7171
14128H443972k29992J15751J51561n17199J56414l91490K6896l82582j26769J38540
14118G385102k28700Q3520l70897K74522l54498r4640K2321l76916L30435m51273
14108F218976K44521l96653L65919k73823j89242J03892j34902r6196k4025k53358
$$ plain form
14178 19755718 19157739 19015803 18284347 18169464 17821539 17137600 17139442 16709008 16315422 15944668
14168 15944668 15982722 15176233 15170719 14473918 14596823 13994823 14179799 13622282 13408774 13299514
14158 13299514 13242824 12775679 12651093 12511249 12545615 11828827 11920325 11943803 11738658 11659425
14148 11659425 11193259 10913354 10631342 10478986 10125447 10167741 9855777 9949106 9992109 9881418
14138 9881418 9562154 9383628 9255451 8455874 8724668 8753079 8572763 8707928 8356801 8443972
14128 8443972 8213980 8329731 8481292 7964093 8120507 7729017 7755913 7373331 7246562 7385102
14118 7385102 7156402 7239922 6869025 7143547 6789049 6694409 6716730 6339814 6670249 6218976
14108 6218976 6463497 6066844 6432763 6158940 5969698 6073590 5938688 5842492 5818467 5565109
14098E565109J16929k35010J77256j22400q3608k56255n8089L55187o85010K50663
14088E024772k1492J99739k78880j47800j43717j18224K71090n63220L35903j73994
14078D384177P4407K21702o04694L01983r1485M4604r1438k14576J50806R3221
14068D268707j41333L68718p60346K05837J33323m26830J26016L89987j79597
14059C984482m5945k02035K82060k71017P6469m3906l09163l3435L37452l0452
14049C744510k48558l23754J13493J52503k34081L5041m156j30236L23592k16548
14039C211806k81474k03740L94572k00691L85200l82108J04553O6229k35443L17200
14029C176104k64861L427m36918K41221N745q0436K03848j81174k98J48662l46485
$$ plain form
14098 5565109 5682038 5447028 5624284 5501884 5418276 5162021 5103932 5459119 4774109 5024772
14088 5024772 5003280 5203019 4924139 4776339 4632622 4514398 4785488 4222268 4558171 4384177
14078 4384177 4458584 4680286 4075592 4377575 4286090 4330694 4239256 4024680 4175486 4268707
14068 4268707 4127374 4496092 3735746 3941583 4074906 3648076 3774092 4164079 3984482
14059 3984482 3938537 3736502 4018562 3747545 3824014 3780108 3470945 3437510 3774962 3744510
14049 3744510 3495952 3172198 3285691 3438194 3204113 3239154 3234998 3104762 3428354 3211806
14039 3211806 2930332 2726592 3121164 2920473 3305673 2923565 3028118 3094347 2858904 3176104
14029 3176104 2911243 2914670 2477752 2718973 2724718 2644282 2848130 2666956 2666658 2815320 2468835
14018B468835J13416l31959J93242j48611j62651M23717l62598K49712K6961m88148
14008A981916J78168L20100k41203n31554O41118o5186l58842L0971J67747J76277
13998B299512L2294l97416r3737q1068M10552k82277J51743k91089Q33693Q86146
13988C468353K449682O498143J8850396J3361279k1571056j0428342m468966k441936
13980E717553q29019j349112M9072m21612R8729l02065l47591j1994k50873K6102
13970B379190j29327J57680k63103J1959j89958J91151q7803Q005K8158k88921
13960A817031j76120J04903J24257k9111K90513q49k76169K91424k63582l17172
13950A565125J58997O6936j59658K01604p3209j68427J6722J56936Q821j43318
$$ plain form
14018 2468835 2582251 2250292 2443534 2294923 2132272 2555989 2193391 2443103 2470064 1981916
14008 1981916 2160084 2480184 2238981 1707427 2348545 2283359 1924517 1955488 2123235 2299512
13998 2299512 2331806 1934390 1840653 1759585 2170137 1887860 2039603 1748514 2582207 3468353
13988 3468353 5918035 12416178 31266574 44627853 23056797 12628455 8159489 5717553
13980 5717553 4888534 3539422 3588494 3166882 3265611 2963546 2615955 2603961 2353088 2379190
13970 2379190 2249863 2407543 2144440 2156399 1966441 2157592 2069789 2077794 2105952 1817031
13960 1817031 1640911 1745814 1870071 1840960 2131473 2130624 1854455 2145879 1882297 1565125
13950 1565125 1724122 1791058 1631400 1833004 1759795 1591368 1608090 1765026 1773847 1630529
13940A630529K93074m64390L02925r6269P7727J78540m19364j25565K29583M7720
13930A654510m48881L76625j46073K03189k36665K35784n1545J0913p6590k50078
13920A271189M76557l81333K31899k16348q5281k49436K82462J11507k4029j80804
13910A236383K21692k71300M61237j42579J07246k80252j29770j35675L24961
13901A391943J56295m72420N80554l76233K82037l51050K48816l65609K10680
13892A305013l40672K68179k3704J22199j40213Q9705P1524m0002l00094J01695
13882A113630K42785O4074k25499k72832M56668j33799q2673R8513j41443K63973
13872A383397m42751J25853k29231L75774l24519Q7733J47951Q669J25857k55354
$$ plain form
13940 1630529 1923603 1459213 1762138 1665869 1743596 1922136 1502772 1377207 1606790 1654510
13930 1654510 1205629 1582254 1436181 1639370 1402705 1638489 1586944 1597857 1521267 1271189
13920 1271189 1747746 1366413 1598312 1381964 1296683 1047247 1329709 1441216 1417187 1236383
13910 1236383 1458075 1186775 1648012 1505433 1612679 1332427 1202657 1066982 1391943
13901 1391943 1548238 1075818 1656372 1280139 1562176 1211126 1459942 1094333 1305013
13892 1305013 964341 1232520 1208816 1331015 1190802 1280507 1352031 1312029 1011935 1113630
13882 1113630 1356415 1420489 1194990 922158 1378826 1245027 1162354 1260867 1119424 1383397
13872 1383397 940646 1066499 837268 1213042 888523 976256 1124207 1132876 1258733 1003379
13862A003379j9768n0628M46806k6869m71230M24552n63696K32780M41821F04130
13851F77224J36349J80882l84158M51299q5298J47860k34268O4665j16769N37229
13841A375015l74046m2703K47766m97338L42661j39031l48595N14192J7081p7176
13831A017826r4890M347l28344K55956j622K50067j47604l8501k9762Q7332J1149
13820I85954K30627m47169Q2436k16749j35622J04334J00171M16M3282K9187K11524
13809I88391l25344K01861k96116L99103q9981l01643K98320l16592K38911N7907
13799H54817r5641n9793j29523J86989L71419l34071l6505p7777J61053J63934
13789A004902l86023J87322L29926l62007K0353j03597r2731J82218J30323D54978
$$ plain form
13862 1003379 983611 932983 1379789 1352920 881690 1306242 742546 975326 1417147 604130
13851 677224 813573 994455 610297 1061596 976298 1124158 889890 954555 837786 1375015
13841 1375015 1000969 958266 1206032 708694 1051355 912324 563729 1077921 1095002 1017826
13831 1017826 922936 927283 598939 854895 853273 1103340 955736 917235 887473 974805 985954
13820 985954 1216581 769412 851848 635099 499477 603811 703982 704398 747680 776867 988391
13809 988391 663047 864908 568792 967895 877914 576271 874591 557999 796910 854817
13799 854817 759176 699383 569860 756849 1128268 794197 757692 679915 840968 1004902
13789 1004902 618879 806201 1136127 774120 794473 690876 598145 780363 910686 454978
13778F94727L5022M6097j70917n3064J54858J5106j75345K16309P0412j87841
13768F45364J32845k44948K08879k04097J04271O4312k33458M0787P3003L51973
13758I38931l75018J53469p3837K00366j00570L4130k55677J53301o7690K22222
13748H29627j90071J28397k93505Q799J12155k0334j33707o454O7943O3330R2434
13737F58614N4144j49901J95926l08704j69467M14743k03364L17131l59616O5144
13727E14650J20748q7785J45028j63995J18447k47577k6607R3363A89410K21383
13717D10793m1681K45303M6323K67352q6913l63610o2059n9166K38170r010O2598
13706F48100j08631J04059Q5486k33609j73343J94607K70687k15091l9614K3997
$$ plain form
13778 694727 729749 775846 604929 551865 706723 721829 546484 762793 833205 645364
13768 645364 778209 533261 742140 538043 642314 706626 473168 513955 586958 938931
13758 938931 563913 717382 643545 843911 743341 777471 521794 675095 607405 829627
13748 829627 639556 767953 474448 483247 595402 575068 441361 434907 502850 566180 658614
13737 658614 712758 562857 758783 450079 280612 695355 491991 809122 449506 514650
13727 514650 635398 547613 692641 528646 647093 399516 372909 466272 189410 410793
13717 410793 369112 614415 660738 928090 841177 477567 415508 356342 594512 585502 648100
13706 648100 539469 643528 729014 495405 322062 516669 787356 572265 532651 556648
13696E56648p9577L15062k83605P0285k36525n8762K85889n6327B09763L94217
13686F03980K7571J95175l53730K57894k94654l9658k4925n6718K40206B58815
13675D91019B23071K75490M1305K14656q9154B02383K02685J02529j37070m1735
13665C28792A43384M13355n0492J7727m3451B27327L06178K63384l10409A99009
13654C27411J11199J75444j36487j15280K80359B75352K84522o3928k2955A80173
13643C84234j05600K94378k67885M2915K16322B81733J37728j6861o8726mI4949
13631D77429K24225o3084j52500P2620j94907K03992K9170k13531K43405j72915
13621D53904L015o7720l0211L22158k55226p8273e8787E63329j40522j54737P7196
$$ plain form
13696 556648 477071 792133 508528 578813 342288 283526 569415 513088 209763 603980
13686 603980 631551 826726 472996 730890 436236 396578 371653 314935 555141 258815
13675 491019 223071 498561 539866 754522 665368 202383 405068 507597 370527 328792
13665 328792 143384 556739 506247 523974 480523 227327 533505 796889 486480 199009
13654 327411 438610 614054 477567 362287 642646 275352 559874 495946 472991 180173
13643 384234 278634 573012 305127 348042 564364 281733 419461 402600 333874 333870 94949
13631 477429 701654 638570 486070 558690 363783 567775 596945 383414 626819 453904
13621 453904 456919 389199 358988 681146 425920 347647 -58787 563329 422807 268070 345266
13610C45266j31475L2014n9383L2899M24781B76993q8122K26305A88123K73418
13600D61541J62294A70478j7395N011K35891d158F75868L6596l38566J22805j35983
13589C60720j60739J30349O6361A86793R7197j15389J79837j4531J57883Q4037
13579E75827B59743K45643f8669B48656j05647L79169A13658J29675L26463J9960
13569E89756k09369j4113P3264P0400A88819F0797L21302J77070k51457K5913
13559C33625D1054L28033j02835j258J69098j54665l0983J43759K6299K08491
13549F26993B86253L0494J14719B14516n0151L63428k12291r0676H2754M22809
13539E05563l0528b63888F10630m8127r6938o5293j48443E2310L59384A27089
$$ plain form
13610 345266 213791 245805 186422 219321 644102 276993 188871 415176 188123 461541
13600 461541 623835 170478 153083 158094 393985 -4158 675868 712464 373898 496703 360720
13589 360720 199981 330330 396691 186793 283990 168601 348438 333907 491790 575827
13579 575827 259743 505386 -68669 248656 143009 522178 113658 243333 569796 589756
13569 589756 380387 366274 439538 509938 188819 60797 382099 559169 307712 333625
13559 333625 41054 369087 266252 264994 434092 279427 248444 392203 418502 626993
13549 626993 286253 316747 431466 214516 164365 527793 315502 224826 82754 505563
13539 505563 475035 -263888 610630 562503 465565 400272 251829 52310 411694 127089
13528C94530A27979L35175j94270B0166L99111F8814K35212J40683C2596a78145
13517D19232D5013J22538j9275L34720A68336K15678C8713Q1185L22562d6308
13506A70421f0364A33380J50404J85344j58081j27136J18427J33837A81731j1934
13496A69797J87943r0562Q4176q0685M6524n481E1698J95238M0976l5424M16537
13485F69025A73467I264K46389j20943J37372j05414J81540n6764b9946D19021
13474B2033L5784J03947J63954I0917K50187A46068J99547j3460E1778M8731J35034
13463B35543K22350E8406K05986I6104O7972k9649Q3383Q814J22125N4669A75542
13451d7957C86881j8823o8073J32944j83632J23330A33058K28130F2396J28174
$$ plain form
13528 394530 127979 463154 268884 20166 419277 68814 304026 444709 32596 -178145
13517 419232 45013 167551 148276 482996 168336 384014 38713 119898 442460 -46308
13506 170421 -60364 133380 283784 469128 311047 183911 302338 436175 181731 169797
13496 169797 357740 267178 351354 270669 317193 311712 51698 246936 287912 252488 669025
13485 669025 173467 9264 255653 134710 272082 166668 348208 291444 -29946 419021
13474 22033 57817 161764 325718 90917 341104 146068 345615 332155 51778 100509 235543
13463 235543 457893 58406 264392 96104 164076 134427 217810 226624 348749 403418 175542
13451 -47957 386881 368058 299985 432929 249297 372627 133058 361188 62396 190570
13441A90570K08482j43825A13372K56551A48567m2618D4802J86826J93925A64322
13430D16298K7986j96454G585J56810l3371i4317r8748G48K91456j01006b0256
13418G6573J65557b26506A77371n8503J74831j43086L25041b4721A43465J80388
13408C23853K9694l9971J45685j96890J29053b6582B93814p9310G3262J03787
13398A77049C7967K48877Q3190a44522A44565o4180L52794B09234q3667K83494
13388D09061g550F5848K31291J28878A57067K93977j17682E9203J40084J77259
13378C76546J4383A13843J21959r2204J64927O1243J37841i3874B89110j42167
13368A46943D5640L99597b3328C5478L88789g2857B82517Q7286K6390A35464K79966
$$ plain form
13441 190570 399052 255227 113372 369923 148567 105949 44802 231628 425553 164322
13430 416298 444284 247830 7585 164395 131024 -94317 -193065 748 292204 191198 -20256
13418 76573 242130 -226506 177371 118868 293699 150613 475654 -24721 143465 323853
13408 323853 353547 313576 459261 262371 391424 -26582 293814 214504 73262 177049
13398 177049 37967 286844 370034 -144522 144565 80385 433179 209234 125567 409061
13388 409061 -7550 65848 297139 426017 157067 451044 333362 59203 199287 376546
13378 376546 390929 113843 235802 143598 308525 369768 507609 -93874 289110 146943
13368 146943 45640 445237 -23328 35478 424267 -72857 282517 369803 396193 135464 415430
13357D15430A53276k1823m4479L53227j43199N7013c0030A56435M5086a10219
13346C79243L8009A53926J36831P9049d9392B93612A2539E668K83284J01314D3595
13334i8942C27574k5811J24561j60131a12438E1287d4738B38695D8501H642J67534
13323A76176c4034B56965c1986C3642L03640A23678J43421j6833N54A13318L9137
13312A52455p596R5246r0075L0361k805o5700m7610J33252q290h8718K6024j47676
13300b10370B37778J67968j21779A10136d4141C00537j14990J02737D7981K13079
13290B61060C7013K64750j08924r6056J108b19539C21008A05666K34996a07734
13279I2714d293A31010E3258K01751B4538K46823l674A30593j965J75689b41896
$$ plain form
13357 415430 153276 131453 86974 440201 297002 354015 -30030 156435 201521 -110219
13346 379243 417252 153926 290757 369806 -49392 293612 12539 5668 288952 390266 43595
13334 -98942 327574 301763 426324 266193 -112438 51287 -44738 238695 48501 8642 176176
13323 176176 -34034 256965 -31986 33642 337282 123678 267099 250266 250820 113318 152455
13312 152455 144859 240105 150030 180391 177586 111886 64276 197528 189238 -88718 -62694 -210370
13300 -210370 237778 405746 283967 110136 -44141 300537 185547 288284 47981 261060
13290 261060 37013 301763 192839 96783 97891 -219539 321008 105666 340662 -107734
13279 92714 -4293 131010 53258 255009 24538 271361 267687 130593 128628 304317 -241896
13267H1419a42802H9679J00067l9935a23985B93589E443J65020J64743A11246
13256A13357J6727J02374A7588M96816B5056M4448a79534E9677R8407k495J00936
13245B56525Q8502i7390A7506b56319d4304j28504A59450N8190R208H8648J2548
13234A01196O7043b03786f1369A44834K4895J37813A8569M68832j22251a77668
13223A91905r5050H581L06515j49766n039L16717j18417h0789A3304J05627d6117
13211A49811M905L90289H6440a23604A09748J77756g8981B9738j1393M9687b68682
13199B84744O3062a28344B73346b6486m3339n464E6922K58217h0931j01338j35717
13188c17986B52664a03323k97620G2923N04L5812m2936j5758K0987a0580C72207
$$ plain form
13267 81419 -142802 89679 189746 149811 -123985 293589 5443 170463 335206 111246
13256 113357 130084 232458 17588 514404 25056 69504 -179534 59677 158084 155589 256525
13245 256525 345027 -97390 17506 -256319 -44304 -172808 159450 217640 226848 88648 101196
13234 101196 168239 -203786 -61369 144834 169729 307542 18569 487401 365150 -177668
13223 191905 96855 8581 315096 165330 160291 477008 358591 -80789 13304 118931 -46117
13211 149811 154716 545005 86440 -123604 109748 287504 -78981 29738 18345 68032 -268682
13199 284744 347806 -128344 273346 -26486 -69825 -75289 56922 315139 -80931 -182269 -317986
13188 -317986 252664 -103323 -400943 72923 73427 109239 66303 50545 71532 -10580 372207
13176a66594B17085l9966o5831E0611f5118k7622c0591E7330K67256a19108I7949
13164F0747a7837I492e6829B82542o5196j9956D5034a7609C5607J15761D8342
13152F9581a47637B45578H0333J2681l1631J10881n9278O5983K4277L9294B1685
13140a58778A37131a2315k41049i3716r0448A64390Q1316K9161o7064e480E26984
13128B65483j12873i8361C2142e5597m0666l2565A56684a01892n1713F6690b4678
13116e8048A05228a7123A81457k8245K65786j43186b26324A27850a06783j50029
13106b56812A20201L15235F9365J2562a22575H4430a80951O5196E7295a33402
13095e0004C48323j26611j10403J13525J27888A36601n1243D1397R7048J1489
$$ plain form
13176 -166594 217085 177119 111288 50611 -65118 -92740 -30591 57330 324586 -119108 97949
13164 60747 -17837 9492 -56829 282542 217346 197390 45034 -17609 35607 151368 48342
13152 69581 -147637 245578 80333 93014 61383 172264 112986 178969 203246 242540 21685
13140 -158778 137131 -12315 -253364 -93716 -184164 164390 245706 274867 207803 -5480 526984
13128 265483 152610 -98361 32142 -55597 -96263 -128828 156684 -101892 -153605 66690 -24678
13116 -58048 105228 -17123 181457 153212 418998 275812 -226324 127850 -106783 -256812
13106 -256812 120201 435436 69365 81927 -122575 84430 -180951 -115755 57295 -133402
13095 -50004 348323 221712 111309 224834 352722 136601 85358 41397 138445 149934
13085A49934p0184L52672C9222K72391j18747j0773f2764l699l1242A00065K72490
13074C72555F1525M3190D2657c10492C5133j957d0828p9784H2562K5034a57406
13062H2661a6608k25132H5285c7349B07590m3038E7568d3031A68254e3459A12814
13050G0753b04670H9400a0458A54615K29148j57673q7527b12106N8245B16548
13039d4791A99088B8624I448e7326b6909C08302A39311f4655A5169K91563b4890
13027B22486K0968N7751m0314o396b38167B23257H8411h6424A08528b8044l09215
13016c37259A89524p2523J93905g9076J7546G0772a29576o7694A85065G6469J03963
13005A80432A2114a83941A083M08298K7761h4474n5962H6174N19217k27161P5695
$$ plain form
13085 149934 79750 432422 39222 311613 192866 182093 -62764 -66463 -97705 100065 372555
13074 372555 61525 104715 42657 -310492 35133 33176 -40828 -120612 82562 107596 -157406
13062 82661 -16608 -241740 85285 -37349 207590 164552 57568 -43031 168254 -53459 112814
13050 70753 -204670 89400 -10458 154615 383763 226090 138563 -212106 -153861 216548
13039 -44791 199088 28624 9448 -57326 -26909 308302 139311 -64655 15169 306732 -24890
13027 222486 243454 301205 260891 254495 -238167 223257 88411 -86424 108528 -28044 -337259
13016 -337259 189524 117001 310906 -79076 -61530 70772 -129576 -197270 185065 76469 180432
13005 180432 12114 -183941 1083 409381 437142 -84474 -140436 86174 605391 378230 453925
12994D53925b530B39567e6578q3127r5260A85311J46467G4584J44550q9431D0052
12982A53092D4952J97355a36831A99303q1284a82488j74296f1181E05696b06270
12971d2144A48063J08353A8009f2730L599m8533G3191J01281h0260A54826E268
12959C112d9188B10375I1394j7094h8072F0791a66569F454e8491J6183O422m9436
12947h5322i689c127E6920h484C13375a6226k188j89392l3507g6271A655a46492
12934A6857L3852K04704b2949A82212h0296I6741L6819K63415A88443h5164l6668
12923a21832A19905R6008p5800a55135C59003A17801E4989P2958n1334P598c3508
12911A64141a91665F1251a50334f2146A65078A7888B486J96815C0797J47997G0814
$$ plain form
12994 453925 -2530 239567 -56578 -139705 -234965 185311 331778 74584 219134 129703 40052
12982 153092 44952 242307 -136831 199303 118019 -182488 -356784 -61181 505696 -206270
12971 -42144 148063 256416 18009 -62730 -59131 -107664 73191 174472 -80260 154826 5268
12959 3112 -49188 210375 91394 74300 -88072 60791 -166569 6454 -58491 -42308 -35886 -85322
12947 -85322 -9689 -3127 56920 -8484 313375 -16226 -18414 -207806 -241313 -76271 1655 -146492
12934 16857 50709 255413 -22949 182212 -80296 96741 133560 396975 188443 -85164 -121832
12923 -121832 119905 215913 140113 -155135 359003 117801 54989 127947 76613 84211 -33508
12911 164141 -191665 61251 -150334 -62146 165078 17888 2486 199301 30797 178794 70814
12899C3217Q087L14137b63755a24201A15897b47359N8591L5750C0717N7613c22154
12887a03008g861k0150k38565A53878J6257e5331B44910b6104A80260a47035A37424
12875A01072J02066b57968i9931A41748F8124g041A10616M6202J11046b05271
12864B55132a90785A4197b79643E5217Q7130J90370A44474P2374a36269m3995
12854a80264I8758B8283g2453k80737F5729a00836L0151j9768A2009M5750a4907
12842d4202j96696A83545k6324a61805B57812E3220a93478c9928j93175e3469
12831A31388m0274a28226e1883A94253k3534J14807j41617g058m0818E8909K56317
12820C15226A4838K97975B4206d466A08770c02865J19486E8822J61988e8491j52295
$$ plain form
12899 33217 41304 355441 -263755 -124201 115897 -247359 -188768 -153018 30717 88330 -322154
12887 -103008 -7861 -28011 -266576 153878 170135 -55331 244910 -26104 180260 -147035 137424
12875 101072 203138 -257968 -99931 141748 68124 -7041 110616 156818 267864 -205271
12864 255132 -190785 14197 -279643 55217 142347 332717 144474 216848 -136269 -180264
12854 -180264 98758 28283 -72453 -353190 65729 -100836 -70685 -90453 12009 57759 -14907
12842 -44202 -240898 183545 157221 -161805 257812 53220 -193478 -39928 -233103 -53469
12831 131388 91114 -128226 -51883 194253 170719 285526 143909 -7058 -47876 58909 315226
12820 315226 14838 312813 24206 -4466 108770 -302865 -183379 58822 220810 -58491 -210786
12809b10786A40897E587K5726a0409a895l14018B8031J95442C9156P0315J44977
12798B54448c26007h7375H5595a8331A09355b30814A19096b54386a6098j68355
12788a84453F4848b93364b5143E1128b07658A27511b12664A94730o6848a07806
12777D5722b7810D8611a3085A64537o6803Q3911J8659h1673C7137L0077h4708
12765b43730D07420H797R9036J15163h360G0376a76768a6356B01271b1019A31448
12753a85873A68268n2598a60629A42214K70668a028B21518k0180f2903B62795
12742G328L8930N9760f1797G9595l4176h0178A71829f2099l2345c1142A60411
12730B22700q6018e1792B92959e5236B31790b5190D8774a25822J1887E2043J39492
$$ plain form
12809 -210786 140897 5587 31313 -10409 -1895 -315913 28031 223473 39156 109471 254448
12798 254448 -326007 -87375 85595 -18331 109355 -230814 119096 -254386 -16098 -184453
12788 -184453 64848 -293364 -25143 51128 -207658 127511 -212664 194730 127882 -107806
12777 45722 -27810 48611 -13085 164537 97734 181645 200304 -81673 37137 67214 -84708
12765 -243730 407420 8797 107833 222996 -8360 70376 -176768 -16356 201271 -21019 131448
12753 -185873 168268 115670 -160629 142214 412882 -1028 221518 201338 -62903 262795
12742 7328 46258 106018 -61797 79595 45419 -80178 171829 -62099 -94444 -31142 160411
12730 222700 136682 -51792 292959 -55236 231790 -25190 48774 -125822 -113935 52043 191535
12719A91535a738A58P0873K2712L9906P6616j02851G485L5383J43462J09775G192
12706B16317J39236a55050B98754G2580N8114a1652n0062A237O8737a58275C20364
12694B40464A07835e8799A78102l6903J40596A21888L0235O16125b3465A54085
12683d5881l2267A24710i5098A53528b22526C02746m2753d0874H5929a54124B9243
12671B17138a10051B00908r8820C403L12314p9798a55929C53148a32894I3636
12660c2869C4071J27865o0751J46789G6936a00643j7861C35099e7577l4489E6508
12648A83580a73637B97395a83590E400J35360h4515K4966p5128k4646O9317D32516
12636C38249I1081g8293D9022d9976B23314C0424J87408G1112J30236K66076A55962
$$ plain form
12719 191535 -1738 158 71031 93743 133649 210265 107414 7485 42868 186330 296105 7192
12706 216317 355553 -155050 298754 72580 130694 -11652 -61714 1237 69974 -158275 320364
12694 240464 107835 -58799 178102 141199 281795 121888 152123 768248 -23465 154085
12683 -45881 -78148 124710 -95098 153528 -222526 302746 259993 -40874 85929 -154124 29243
12671 217138 -110051 200908 102088 3403 315717 235919 -155929 353148 -132894 93636
12660 -32869 34071 161936 101185 247974 76936 -100643 -118504 335099 -57577 -92066 56508
12648 183580 -173637 297395 -183590 5400 140760 -84515 -59549 -134677 -159323 -90006 432516
12636 338249 91081 -78293 49022 -49976 223314 30424 217832 71112 201348 467424 155962
12624E513e6365a1691A63228p3434K2091b7917A16266Q617P573b4513n1591A91447
12611B60430a77900G7498a94756A10705a64299B0569L14061d2135r640q5814f2420
12599b22704q9757H8581b0434B3788R2813a12851A53205o2310J42149I2389M1508
12588A33897J27179J18746A62701a04908A215f3516j94300C2241J8133b09906
12577c54702e9356m0157r3591B37622c5864N430p4797k141A79323l5027E6983
12565I9998a95377C4052P2346c8741I3959i2804j8980q3641h3833P813N414C6511
12552a62877O0337O342B34792g6191d285k10311b3352B75467r1644B6990h9451
12540A20961c99306A05571K54717a14992A57807K93126B00071a20323G4453k6641
$$ plain form
12624 5513 -56365 -11691 163228 89794 111885 -27917 116266 124883 132456 -24513 -76104 191447
12611 260430 -177900 77498 -194756 110705 -164299 20569 334630 -42135 -51775 -137589 -62420
12599 -222704 -312461 88581 -20434 23788 116601 -112851 153205 90895 233044 92389 133897
12588 133897 261076 379822 162701 -104908 1215 -63516 -257816 32241 50374 -209906
12577 -354702 -59356 -99513 -193104 237622 -35864 -30434 -105231 -107372 179323 144296 56983
12565 99998 -195377 34052 106398 -38741 93959 -92804 -111784 -195425 -83833 -76020 -70606 36511
12552 -162877 -102540 -96198 234792 -76191 -4285 -214596 -23352 275467 183823 26990 -89451
12540 120961 -399306 105571 360288 -114992 157807 450933 200071 -120323 74453 47812
12530D7812L0033a0112j54204M6185L2406K4476j79963i6026A82844E911a40830
12518i4415j40045A79782J60531G4481b12566B78680E0544g2313E7465j4657K5235
12507F8043K44478D8707b65681J05777f8239j7044q9620A32870L9379a29691D7425
12495B07264a38378E8706E011i3522n118B70358a02190b8054A6750b02663E491
12483f8745a9624B71787j15204d0169A15040g5857B22425f6878F8136a34026B0193
12471C272K36541i9087F9563H69J29752E8039h5278k1336I6310c98086F0792J05557
12459A66349E9188b3906I6132k2513b3900B45417J8863a4636A26644a54982m0446
12448a95428b4358C24624a12362p1668f1089B79161b4380B22888G4858c0580k25572
$$ plain form
12530 47812 77845 -10112 -164316 -118131 -85725 -61249 -241212 -96026 182844 5911 -140830
12518 -94415 -234460 179782 340313 74481 -212566 278680 50544 -72313 57465 42808 68043
12507 68043 312521 48707 -265681 -159904 -68239 -85283 -174903 132870 172249 -129691 47425
12495 207264 -138378 58706 5011 -93522 -98640 270358 -102190 -28054 16750 -202663 5491
12483 -68745 -19624 271787 156583 -40169 115040 -75857 222425 -66878 68136 -134026 20193
12471 3272 239813 -99087 69563 869 130621 58039 -85278 -106614 96310 -398086 60792 166349
12459 166349 59188 -23906 96132 73619 -23900 245417 264280 -14636 126644 -154982 -195428
12448 -195428 -24358 324624 -112362 -184030 -61089 279161 -24380 222888 74858 -30580 -256152
12437b56152f3399f705j18299L1864C7441j3952a30702j01120D10365j07779A12281
12425H1008b24157A60517i6824m9614A97559K90670j54708F8349C1278J46131
12415A77409a76674d0667r4638A73782a59990B09410J7756a54510B1152c90393
12404a73339K2658D424c9648A8654a31710f269n2279I6665j1361a64901a6831
12392C228i4153r7589A01825K4452a24481k28121a8392l5636A25696l0367b1341
12380I8756g8610L0812a1600A03554g1219D7030L3611d834k31154A90429C2571
12368a92764E1867J88803B5952a03061E2368B5336J43502e0115k36375a1923A08099
12356A24520B6421d4545o341C9169a00724A09070M904B9694b37492A59897o3515
$$ plain form
12437 -256152 -63399 -6705 -125004 -93140 37441 23489 -130702 -231822 410365 302586 112281
12425 81008 -224157 160517 -96824 -146438 197559 488229 333521 68349 31278 177409
12415 177409 -176674 -40667 -135305 173782 -159990 209410 227166 -154510 21152 -390393
12404 -173339 -150681 4424 -39648 18654 -131710 -6269 -58548 96665 85304 -164901 -16831
12392 3228 -94153 -191742 101825 126277 -124481 -352602 -18392 -54028 125696 95329 -21341
12380 98756 -78610 -47798 -11600 103554 -71219 47030 80641 -4834 -235988 190429 32571
12368 -192764 51867 240670 25952 -103061 52368 25336 168838 -50115 -286490 -11923 108099
12356 124520 26421 -44545 -50886 39169 -100724 109070 113974 29694 -237492 159897 96382
12345I6382a67529j50645H5872K66402d4442F4328R9057k9382B646c4279k15417
12334b49696J09717B52630a77939m51225A12748Q4252a40632N7888B25741A06842
12323G1398L10429G083L07306a86460j53406c6102k26050a03789B43726C4664
12312B78023b62915F0584A0138J41547d6985j63647Q1550A20906C2263Q9575b20969
12300E5208a62577A24524G318K5495a4269I820K630d03194a30520F1316b5594
12288C0042J32714B6993J29794B6736K37397P7474a63744A48429D2178K328M7953
12277I2459a24573M1963B50612o9656J17648j05640b47779E2567a67583F9361
12266g5392A937J76093b5164C8024Q3253K65168e7194C9694K19619f3488j4654
$$ plain form
12345 96382 -167529 -318174 85872 352274 -44442 64328 163385 134003 2646 -34279 -249696
12334 -249696 -139979 252630 -177939 -629164 112748 197000 -140632 -82744 225741 106842
12323 71398 381827 7083 314389 -186460 -339866 -36102 -262152 -103789 243726 34664
12312 278023 -262915 60584 10138 151685 -46985 -210632 -129082 120906 32263 121838 -220969
12300 55208 -162577 124524 7318 32813 -14269 9820 12450 -403194 -130520 61316 -25594
12288 30042 162756 26993 156787 26736 264133 341607 -163744 148429 42178 44506 92459
12277 92459 -124573 -82610 250612 180956 298604 192964 -247779 52567 -167583 69361
12266 -75392 1937 178030 -25164 38024 121277 386445 -57194 39694 259313 -63488 -78142
12255g8142B04431N7987L13872B4853f1876B33761a07345C38052A26504j2973
12245A13531k9683J33202k6206k0976b4502C18642b5805A31183n4502b36639D78136
12233A49915p25a93586C36981a88224B18246E0261f383j23872L1368G5399N3931
12222A29330K75716A81666J846j9457a04428A46720J2066Q3367e9534A34427a47947
12210a2501n464A48204f6571A34683m4432Q9266J33294A9691b1638k455B98478
12198c6486C86126J27180k48894a41467F0107P4705J19076q1464J54894a25365
12187A25280L32884A26472a10635E3794O7841j638B3583J05609E8969K63807r846
12176C12930l1724p6528A4173N3515J51801g8220A01784N10891j91765E1215a14216
$$ plain form
12255 -78142 204431 262418 576290 24853 -61876 233761 -107345 338052 126504 113531
12245 113531 83848 217050 190844 169868 -24502 318642 -25805 131183 76681 -236639 478136
12233 149915 149190 -193586 336981 -188224 218246 50261 -6383 -130255 -98887 75399 129330
12222 129330 405046 181666 183512 164055 -104428 146720 158786 242153 -59534 134427 -147947
12210 -12501 -17965 148204 -66571 134683 90251 179517 312811 19691 -21638 -24093 298478
12198 -36486 386126 513306 264412 -141467 60107 134812 253888 172424 327318 -125365
12187 125280 458164 126472 -110635 53794 121635 119997 23583 129192 58969 322776 312930
12176 312930 281206 204678 14173 67688 219489 -78220 101784 612675 420910 51215 -114216
12164d3451B21950A2337K98407g503k10807C59210d2320D07386G6847J96601d3961
12152i9519j60222a13n1555m5466A13535k3255a08616I0977h4701j75855B21288
12140H8551K70195a21613j3190A41430o2504a39897B0939f1327j17286C73020
12129D7241K5267j4590a28319M7883o39D6801f9816j0589a5921I1123a71864L1889
12117a39975j73686G0234a77415C93604i962k25230F8460b6182j082A65810a20784
12105e1597E3453J40163a88017A45042A9904J84340d6926A00577a1372k7568k05893
12094b44833c2799A92396A3213M3433a58381P9161f500B59711G9513a83286j23527
12083c06813B10453A04024b0990B63073J008970M55753q28638B51219D5662O9871
$$ plain form
12164 -43451 221950 12337 310744 -7503 -218310 359210 -42320 407386 76847 273448 -43961
12152 -99519 -259741 -113 -51668 -97134 113535 90280 -108616 90977 -84701 -260556 221288
12140 88551 358746 -121613 -134803 141430 78926 -139897 20939 -61327 -178613 373020
12129 47241 72508 57918 -128319 -80436 -81075 46801 -69816 -80405 -15921 91123 -171864 -139975
12117 -139975 -313661 70234 -177415 393604 -9962 -235192 68460 -26182 -27264 165810 -120784
12105 -51597 53453 193616 -188017 145042 19904 204244 -46926 100577 -11372 -38940 -244833
12094 -244833 -32799 192396 13213 56646 -158381 -79220 -6500 259711 79513 -183286 -306813
12083 -306813 210453 104024 -20990 263073 1272043 1727796 899158 251219 45662 115533
12073A15533J66410N6458g2636B6222L25476j64146a51054D70148A85333B0597
12062A31669k6776l5415K00126A4743r01d8422o9986e0099A0022A069b22667f4182
12049A7034J84386a46081a2990j26655c3917a4405A46938H506i5206E5197Q5560
12038A40757a65450A75508a80729o5394B54609a3647A77570J28342H4903c56241
12027F6222B5138J44704d62282D1065h0859A43024B3820O2168c08357C25156i278
12015b96813I5611B3413P6197D5877a09806C5575b03811c6759l217A87878a19462
12003i5963F4978a50612L8020A15747A8440e515l26950a43665A81948h8739j95656
11992b84395H5419B4680K5004b03758R3843d6220G9409l1282a78361A68759A5577
$$ plain form
12073 115533 281943 338401 -72636 26222 351698 187552 -151054 470148 185333 20597
12062 131669 104893 69478 269604 14743 13842 -48422 -118408 -50099 10022 1069 -222667 -64182
12049 17034 201420 -146081 -12990 -139645 -33917 -14405 146938 8506 -95206 55197 140757
12038 140757 -165450 175508 -180729 -246123 254609 -13647 177570 305912 84903 -356241
12027 66222 25138 169842 -462282 41065 -80859 143024 23820 85988 -308357 325156 -9278
12015 -296813 95611 23413 99610 45877 -109806 35575 -203811 -36759 -39976 187878 -119462
12003 -95963 64978 -150612 -112592 115747 18440 -5515 -332465 -143665 181948 -88739 -284395
11992 -284395 85419 24680 49684 -203758 -109915 -46220 79409 48127 -178361 168759 15577
11980A60961l2170a58547D28039b55664A89372a32803M2313j62777R8919A61350
11969a05627M3993A32514J38410a77621B12505d2796k4777f85C3309J88338R181
11958B30828a78071f3761A25723a8627C91865g1554m661j54893a07524j5987e9366
11946A1675K95727j33012l0362m4097a73182E4006c3513D8479b80123A2728e4944
11934d9558o802A66610L11311D1297O5760C4330J17152E2823a76808f7811J8507
11923d9304A03529d33610d539B96169A1282a33625N0144B16084b22770A15987
11912C6034i625o7161A16859K02565i5077A8587L2204N0145a3039A76021b1166
11900A69386a39654p7155D601g9695o3511q6202R60j49874E3918g2385I0521b96091
$$ plain form
11980 160961 128791 -158547 428039 -255664 189372 -132803 -90490 -253267 -154348 161350
11969 -105627 -61634 132514 270924 -177621 212505 -42796 -67573 -685 33309 221647 230828
11958 230828 -178071 -63761 125723 -18627 391865 -71554 -76215 -231108 -107524 -123511 -59366
11946 11675 307402 174390 144028 99931 -173182 54006 -33513 48479 -280123 12728 -54944
11934 -49558 -56360 166610 477921 41297 107057 34330 151482 52823 -176808 -67811 -49304
11923 -49304 103529 -433610 -4539 296169 11282 -133625 -83481 216084 -222770 115987
11912 36034 -9625 -76786 116859 319424 -95077 18587 50791 100936 -13039 176021 -21166
11900 169386 -139654 -216809 4601 -79695 -143206 -229408 -228448 -378322 53918 -72385 90521 -296091
11887c66463a17864A26549g5342L7607m9548F5423a76033D8375J34965n129a13047
11875b51671a7281o2089j61825q296a10649k52124B40435a67900B34019a8296
11864A1712a02458k08183a44132A16979b56190a2230j01099C1030m351e0122r0932
11853a41054k27232a41556A32081b602p6388C04574a74665n0917K5248B04354
11842A53243a59616m5655h2331A25236b5434n7966G7729i4366B01810G5903a89402
11830a41771D33138c68957C03647a79774O6846n3045b8364l08614K0213D2571
11819c43562a35289n4115A38213m2797a84697G1327a38561F8184L7150a53005
11808A76757l8920k813L1574a77113O5303d2340j18027j3995E6147J47298q4423
$$ plain form
11887 -366463 -117864 126549 -75342 -37735 -87283 65423 -176033 48375 183340 178211 -113047
11875 -251671 -17281 -79370 -241195 -249491 -110649 -362773 240435 -167900 234019 -18296
11864 11712 -102458 -310641 -144132 116979 -256190 -12230 -113329 31030 26679 -50122 -141054
11853 -141054 -368286 -141556 132081 -2602 -78990 304574 -174665 -225582 -200334 204354
11842 153243 -159616 -205271 -82331 125236 -25434 -83400 77729 -94366 201810 75903 -189402
11830 -141771 433138 -368957 303647 -179774 -112928 -165973 -28364 -336978 -316765 42571
11819 -343562 -135289 -189404 138213 95416 -184697 71327 -138561 68184 105334 -153005
11808 176757 137837 135024 166598 -177113 -111810 -42340 -160367 -174362 56147 203445 119022
11797A19022J9366a57792R547f2228B11015C9126J24432b74496H1986b9073A84881
11785d45719c3331j33843A9564J1816a13329K1419G7105g0569G3270i1420k46639
11774c38059A78963a36702G7634l789h8280j10964n1484Q1345k6867H1617i46
11762h0166j6580E1334c5751j80100A16163R4903I0026L10974C8272h9515I2379
11750h7297b035k80842l6988R1304h3040J6815k32194B37519I8607L9101J59303
11739B97011H7536a45426b02o3098L0498m0851C99734H5780K87137A57468a44302
11727I3910c31163h5655K2461k44642F3032P3992b02095D7311R9621F6631c60338
11715A6300a22829L036A5012K17262e7145J051H9019N0164D1864c9786j35779
$$ plain form
11797 119022 138388 -157792 -148245 -62228 211015 39126 163558 -274496 81986 -29073 184881
11785 -445719 -33331 -167174 19564 31380 -113329 -91910 77105 -70569 73270 -91420 -338059
11774 -338059 178963 -136702 77634 73845 -88280 -199244 -250728 -169383 -196250 81617 -946
11762 -80166 -96746 51334 -35751 -215851 116163 211066 90026 401000 38272 -89515 92379
11750 -87297 -2035 -282877 -319865 -228561 -83040 -66225 -298419 237519 98607 137708 297011
11739 297011 87536 -145426 -202 -63300 -32802 -73653 399734 85780 372917 157468 -144302
11727 93910 -331163 -85655 -63194 -307836 63032 137024 -202095 47311 146932 66631 -360338
11715 16300 -122829 -119793 15012 232274 -57145 -56094 89019 139183 41864 -39786 -175565
11704a75565C35867H4226g0307a4555I8704A6171O9229J19918I8673b15737F10
11692A94627K30653e4291A38012f5229D9701L6906J34994m0801F9678J01352c10380
11680b25432C32573j65143M4345M9227E0019N8343a60614c7115q3499D9394f5094
11668g0001B54456C4426a34093q1451I1470a33495A81649a11574E9645J0440B4448
11656a20753L5781M0691B54861j20260J00901R0904C6853P3319c83851a12860
11645C38811a92592B8220a02886D6748B0745h499K211B6409F861N5326D189c0839
11632A00032J26092j12899a69941E1217J31143A2802K63181L8n7878J63785j71253
11621B10675K1752b26703e1169C60909a85227H7917b21622g3121K6272o0945H4173
$$ plain form
11704 -175565 335867 84226 -70307 -14555 98704 16171 85400 205318 98673 -215737 610
11692 194627 425280 -54291 138012 -65229 49701 86607 221601 180800 69678 171030 -310380
11680 -225432 332573 167430 211775 261002 50019 108362 -160614 -37115 -120614 49394 -65094
11668 -70001 254456 34426 -134093 -215544 91470 -133495 181649 -111574 59645 70085 24448
11656 -120753 -84972 -44281 254861 134601 235502 326406 36853 110172 -383851 -112860
11645 338811 -192592 28220 -102886 46748 20745 -8499 -6288 26409 6861 62187 4189 -30839
11632 100032 226124 113225 -169941 51217 182360 12802 275983 276021 218143 381928 210675
11621 210675 232427 -226703 -51169 360909 -185227 87917 -221622 -73121 -46849 -107794 84173
11609A072J66626d7259F7054M6886b12952D9358a7155E6366a61288C73472D5490
11597a0125A18457c43465C9665O2667l3992K8408a31582D18516h4150A65266A572
11585B77384p6229J7369k9139F1190N9235Q4645a67117C9390J50217K65364d0749
11573C0354J64237a65292n8408g7628D16574h3450A85539D7644K2682e9223A57585
11561A09667K11839a33525N9450B01149O2438a57135n562c2262E1417J90872F4923
11549A75143i9654r036L7746k84375a03796B41099L7902a21789E6378e4406A05318
11537B774J01985m0517a14530F7103b36219M9360A1971b50175A38203b9655H0123
11525A9737c2862A78516B3540c11598C51170A32102k8316b11801A46869o5228
$$ plain form
11609 1072 167698 -47259 67054 113940 -212952 49358 -17155 56366 -161288 373472 45490
11597 -10125 118457 -343465 39665 102332 68340 96748 -131582 418516 -84150 165266 1572
11585 277384 201155 218524 189385 61190 120425 205070 -167117 39390 189607 454971 -40749
11573 30354 194591 -165292 -223700 -77628 416574 -83450 185539 47644 70326 -59223 157585
11561 109667 321506 -133525 -74075 201149 263587 -157135 -162697 -32262 51417 242289 64923
11549 175143 -99654 -108690 -70944 -355319 -103796 241099 279001 -121789 56378 -54406 105318
11537 2774 104759 64242 -114530 67103 -236219 -186859 11971 -250175 138203 -29655 80123
11525 19737 -32862 178516 23540 -311598 351170 132102 103786 -211801 146869 81641
11515H1641Q4183C6020A0593M5254b37097N8738A30819J31452K79485b1023a797
11503B55095d8325G6542a40601A28647b40175E4825M54810r3919j4118b6043k14459
11492b40502f7538B36057a44309n6864D8413a14363K4286B12924P7073G2500b6859
11480A9538J68646D6586L85853B06075K5039a26064A25169D2130O636K41676b12720
11468c1938E48J75569A9602L26467E3582K95296c29067B65713A25084f0917o1612
11457a22529N5104G4033M6662R2576n0947a25742o6123B11519c7168J466j94359
11446b30061A77423K6914C7558M7227A3067R607J77010P595c19073f9199k60364
11435c29563A05778J55182d08135C75051I2502h1192B42143n3008a59867A03738
$$ plain form
11515 81641 165824 36020 10593 55847 -237097 -178359 130819 262271 541756 -21023 -1797
11503 255095 -48325 76542 -140601 128647 -240175 54825 509635 415716 401598 -26043 -240502
11492 -240502 -67538 236057 -144309 -201173 48413 -114363 -90077 212924 289997 72500 -26859
11480 19538 188184 46586 432439 206075 231114 -126064 125169 42130 48766 290442 -212720
11468 -31938 548 176117 19602 346069 53582 348878 -329067 265713 125084 -60917 -122529
11457 -122529 -67425 74033 120695 213271 162324 -125742 -191865 211519 -37168 -35702 -230061
11446 -230061 177423 204337 37558 84785 13067 22674 199684 207279 -319073 -69199 -329563
11435 -329563 105778 260960 -408135 375051 92502 -81192 242143 189135 -159867 103738
11424a31312N8651A67070n3305l8630K39893A05941L2799a22432b5984B16970
11413b05408j38389a71811A13384b51408A36191B0749J91301b20967J09608A1359
11402B76058b02409D3687K8510a1881k30164f3157A07560d3091K298A6364R6335
11391A12699a7864F4822b23723A81060q5343g123m2311I610b24175B86298C3026
11379a39760A57492M1117B1816Q5522a18295G9744B7373h0472B45445A9505L3509
11368E3014f8083A18011d6465m1357A55797o5764C1686o232a69658I8228J05800
11357B04028c48958F2397a04370K2723j86585A53373K09413a243j51117O8211
11347h4149m4417H9130D3038j692b44564A15704a58632C29677B0096J0751e9436
$$ plain form
11424 -131312 -72661 167070 113765 75135 315028 105941 138740 -122432 -25984 216970
11413 -205408 -343797 -171811 113384 -251408 136191 20749 212050 -220967 -111359 11359
11402 276058 -202409 43687 72197 -11881 -242045 -63157 107560 -43091 -40793 16364 112699
11391 112699 -17864 64822 -223723 181060 95717 -7123 -49434 9610 -224175 286298 33026
11379 -139760 157492 198609 21816 107338 -118295 79744 27373 -80472 245445 19505 53014
11368 53014 -68083 118011 -46465 -87822 155797 90033 31686 25454 -169658 98228 204028
11357 204028 -348958 62397 -104370 -81647 -268232 153373 362786 -1243 -152360 -84149
11347 -84149 -128566 89130 43038 41346 -244564 115704 -158632 329677 20096 30847 -59436
11335E3389g4111j66635A22738b55977B74597g8699a6828E9299a40073B8019a37997
11323F5499a55890f0035j5269j45938c0884B00810a10120K1528M0293p7650K383
11312a23566e1090n6330b76j8925j8039A74689E2159p919a6000k01721i0449a67
11299a12723r5959A7777N3284b66956C97101a90506A65110d3814j91568P1175
11289a64207q2294d0308A18226a06386D1662c13186A86909n7035a26536F9754
11278i3026A6115h5982D18619G2722b4101q3221p8934e2268A26915O0195a98402
11266G5896J30020a36401m14O202m2595d178o6438A71756h8110o882K9600l2272
11254i7664A09978J95427C3144J69649b47391c4529A20272c5633j30424j55987
$$ plain form
11335 53389 -74111 -240746 122738 -255977 274597 -78699 -16828 59299 -140073 28019 -137997
11323 65499 -155890 -60035 -75304 -221242 -30884 200810 -110120 -88592 -48299 -125949 -123566
11312 -123566 -51090 -107420 -276 -19201 -37240 174689 52159 44240 -16000 -217721 -90449 -167
11299 -112723 -208682 17777 71061 -266956 397101 -190506 165110 -43814 -235382 -164207
11289 -164207 -246501 -40308 118226 -106386 41662 -313186 186909 129874 -126536 69754
11278 -93026 16115 -85982 418619 72722 -24101 -107322 -186256 -52268 126915 187110 -198402
11266 75896 205916 -136401 -136815 -130613 -173208 -4178 -70616 171756 -88110 -94992 -65392 -97664
11254 -97664 109978 305405 33144 202793 -247391 -34529 120272 -35633 -166057 -322044
11244c22044E7382a41719A47842c41896L5253Q6119B82424a91099R0562M1217
11234e9320A55507A559b43073g3447D213N263J79632g5064A49386C1053c72048
11222B1778J09848K1571L544g8450C2472L77245A50722G3265J69808i8009A17961
11210i9958F26a98759h3203l26699m8300h9617K3669C1323J82623e4270k6420
11199h0690j22730f8355K9142k22110H9093A5945c9388l5849h314f49k86958B33614
11186D8730M6352h8152a482l8442O355j668B59220q4541h5503b6406L391G4209
11173B0926a10668N0391C5882A1372M5330f5891A98278a55739H5097m0850i4409
11161d0679l5121L2750E9d462j17055J2435A60396F746J86002b59828g4782B87960
$$ plain form
11244 -322044 57382 -141719 147842 -341896 -306643 -220524 282424 -191099 -100537 -59320
11234 -59320 155507 1559 -243073 -73447 4213 9476 189108 -75064 149386 31053 -372048
11222 21778 131626 153197 156741 -78450 32472 409717 150722 73265 243073 -98009 117961
11210 -99958 626 -198759 -83203 -409902 -458202 -89617 -65948 31323 213946 -54270 -80690
11199 -80690 -203420 -68355 -39213 -261323 89093 15945 -39388 -75237 -8314 -649 -287607 233614
11186 48730 95082 -88152 -1482 -39924 -33569 -35237 259220 174679 -85503 -26406 -23015 74209
11173 20926 -110668 -60277 35882 11372 56702 -65891 198278 -155739 85097 44247 -94409
11161 -40679 -75800 -43050 59 -4462 -121517 -109082 160396 6746 192748 -259828 -74782 287960
11148b97237a00688F0856c68645g7909A37548n2443b51699b516H4778C0150b29473
11136I8982a60678c3178C05049C5286b05473B07660F7620A1371K68539a35099
11125C47969F2893J9409N3326a27155M418A56205i3963m8233B22790c45178E9479
11113A89670M0236A01716a24439n0762A89061d8551C9177j8533L12544E2016L9699
11102I1715O2226K37737H1658O1094a16281A02111b39173P9500A88571K01540
11092C90111H1154g5314q0840B83148i8602C11341I5099N4371J35947L8094A43912
11080A25870J15337E5779L14484m5700B2614Q8939O0580P543K78407A98612L8550
11069B37162Q4565o4324C8358L67654j1999A51791J64630r5150K66641K4393k27383
$$ plain form
11148 -297237 -100688 60856 -368645 -77909 137548 85105 -251699 -2516 84778 30150 -229473
11136 98982 -160678 -33178 305049 35286 -205473 207660 67620 11371 279910 -135099
11125 347969 62893 82302 135628 -127155 -122737 156205 -93963 -142196 222790 -345178 59479
11113 189670 229906 101716 -124439 -175201 189061 -48551 39177 20644 333188 52016 91715
11102 91715 153941 391678 81658 142752 -116281 102111 -239173 -159673 188571 390111
11092 390111 81154 -75314 -156154 283148 -98602 311341 95099 149470 285417 323511 143912
11080 125870 241207 55779 370263 324563 22614 111553 172133 179676 458083 198612 237162
11069 237162 321727 257403 38358 406012 394013 151791 316421 221271 487912 512305 284922
11058B84922L0386M78992l36596r1101L53918l23589P5208j60285J60840P040
11048D79735J87588r9208J29621k1554Q7733J42972m07496Q4471J94906k37602
11038E41166L42041k74819j02911J57214J89494k26149B23761J99976k9649J20681
11028E14769M3615J97235P2506r9321J19705k08715j73161K87395C52553J31782
11018D84335J79302k93965n3298L35884k13442L15564k72839j07843J78895j24064
11008D28529J02538J96059j93241N2010B00260L99319K26504k85390L1484j00930
10998D71247L4523k02460L18060n2903O2515K71640J70365k89747N2394R5392
10988I31026q7754k14949Q1236J27483m435K80139n24472J48204N99112k01352
$$ plain form
11058 284922 315308 794300 457704 366603 720521 396932 472140 311855 472695 479735
11048 479735 667323 568115 697736 676182 763915 906887 499391 583862 778768 541166
11038 541166 883207 608388 505477 662691 852185 626036 223761 423737 394088 514769
11028 514769 558384 755619 828125 728804 848509 639794 466633 754028 352553 484335
11018 484335 663637 369672 316374 652258 438816 754380 481541 373698 552593 428529
11008 428529 531067 727126 533885 585895 200260 599579 826083 540693 572177 471247
10998 471247 505770 303310 621370 568467 630982 902622 1072987 783240 835634 931026
10988 931026 843272 628323 709559 837042 832607 1112746 588274 736478 1335590 1134238
10978A134238p3760L16911M773M61454J0203J35548N40222l23100J62780N10826
10968B880095n08553l87818K2848m53428L3628j74969m4627j49444n8252M44384
10958A603864q613L4426R6257j03684l25062O7956m28117k1199l48343K60243
10948H27728j54001k2667k25664J79470o7336k62530q880c2633C28906n7208A32829
10936F8607B9848R4121J98865I1035J45303m0372p4581j7438c62115C26346A09695
10924B08078b19310B94532o9110F3733Q8599F3655a3968j71638f1310D2273J40756
10913A83029a05928C638K36085j05056b6648j27359C775L38638a14529B47957
10902c2655A10884a98563C8569K043A1568N5180R5301L88554I2094o011A4446
$$ plain form
10978 1134238 1060478 1377389 1382162 1843616 1853819 1989367 2529589 2206489 2369269 2880095
10968 2880095 2371542 1983724 2006572 1553144 1586772 1411803 1367176 1217732 1159480 1603864
10958 1603864 1595251 1629677 1725934 1622250 1297188 1365144 937027 915828 567485 827728
10948 827728 673727 651060 425396 604866 537530 275000 266120 -32633 328906 271698 132829
10936 68607 29848 123969 322834 91035 236338 195966 121385 103947 -362115 326346 109695
10924 208078 -219310 294532 225422 63733 152332 63655 -13968 -185606 -61310 42273 183029
10913 183029 -105928 3638 239723 134667 -26648 -154007 3775 342413 -114529 247957
10902 -32655 110884 -198563 38569 40612 11568 66748 162049 550603 92094 86083 14446
10890B94191b42074A71447n2367E5151O340e3716j0773A22167c44576F6685Q31
10879F7516L2451J20060A8935f6012C99159A52560n3595b20466B332a8168m00062
10868d18230i9907r5848K5968B52549P954a26194d8006F8432h0651j75668a1310
10856a65472d9197k72140C10718C8541b22922H8192l2626b79377J30252A17260
10845f194C0994a52953m6225M7404A53789l0579n737C4622K52137H8335c2222
10833C55148j46923A3623e6124F5506b03330O711f1082E0693J40527e59921h4232
10821I2373a14522A08101J75089I6304a59861L7988k5870H2905b01069e1919A31217
10809d6438k86314A5224O5324Q6485b13531f5576n0155A93118a72916l05714B6577
$$ plain form
10890 294191 -242074 171447 119080 55151 61491 -53716 -64489 122167 -344576 66685 67516
10879 67516 99967 220027 18935 -66012 399159 152560 98965 -220466 2332 -18168 -418230
10868 -418230 -99907 -195755 -169787 252549 260503 -126194 -48006 68432 -80651 -256319 -11310
10856 -165472 -49197 -321337 310718 38541 -222922 88192 55566 -279377 -149125 117260
10845 -6194 30994 -152953 -199178 -151774 153789 123210 117473 34622 286759 88335 -32222
10833 355148 208225 13623 -56124 65506 -203330 -196619 -61082 50693 191220 -559921 -84232
10821 92373 -114522 108101 283190 96304 -159861 -121873 -147743 82905 -201069 -51919 131217
10809 -46438 -332752 15224 80548 167033 -213531 -65576 -115731 193118 -172916 -478630 26577
10797G0798b09017A83474n7214b4552k41304E9034J5531b7801D4618h5709j11595
10786a97304R2828d287j63569j8470A70890B0614f7109p0561q2754a02614j50667
10775b53281A95734a66060B9161h2571B81192d32091A87723c75265A39870a83444
10764c07777J51227B67471d3701q2752C0103J77161o3586a69605K4276j50341
10754b95670f176j87179O7573l02764D650d517B59011a467l92079a91495j26320
10743c17815a18469l9009k7838A13166a40650I5807b99759A88307B7674j101J41219
10732A67792n3288d7565r5260k9573e3757C42796c31267P9925a05790B91583B465
10720A48112C6305P2382C2940a60524A24445M0782g7945C8470a17535b3043B49242
$$ plain form
10797 70798 -209017 183474 126260 -24552 -265856 59034 74565 -27801 44618 -85709 -197304
10786 -197304 -104476 -4287 -167856 -186326 170890 20614 -67109 -137670 -220424 -102614 -253281
10775 -253281 195734 -166060 29161 -82571 281192 -432091 187723 -375265 139870 -183444
10764 -307777 -156550 267471 -43701 -126453 30103 207264 143678 -169605 -145329 -295670
10754 -295670 -6176 -193355 -125782 -428546 4650 -4517 259011 -1467 -393546 -191495 -317815
10743 -317815 -118469 -157478 -185316 113166 -140650 95807 -299759 188307 27674 26573 167792
10732 167792 114504 -47565 -142825 -172398 -53757 342796 -331267 -251342 -105790 291583 2465
10720 148112 36305 108687 32940 -160524 124445 165227 -77945 38470 -117535 -23043 249242
10708A18001h3672E15883a30945A26412b2755k05036C54284A5461K31695q7235
10698A59921J8507C5499b83451f7341n930A23694d50330h577j39345C64142j30758
10687B33384J0882F8076R590J77809b32208L9757k34531H3155a4239k61142E6701
10675h7627A06530F538L63911A44751a35225l5369B06330e545m0773B75257H6668
10663A6383a19261d4108r5171m7956B09147G7162a88447C9942b22820R3220a6442
10651b06711L4216A10076a8041n8873a8736j68014B24215F3514a60214j1009C4103
10639b25147j23311J28436h3169I9064c00114A50536L5194A1898K3863a95111
10628d7375A11411d0746j40687j4872J8414n6607j97012B46672A0938g7756j13450
$$ plain form
10708 118001 -83672 515883 -130945 126412 -22755 -227791 354284 15461 247156 159921
10698 159921 178428 35499 -283451 -67341 -73271 123694 -450330 -8577 -147922 364142 233384
10687 233384 244266 68076 77666 255475 -232208 -192451 -426982 83155 -14239 -275381 56701
10675 -87627 106530 6538 370449 144751 -135225 -170594 206330 -5545 -46318 275257 86668
10663 16383 -119261 -44108 -139279 -187235 209147 77162 -188447 39942 -222820 -129600 -16442
10651 -206711 -172495 110076 -18041 -76914 -18736 -186750 224215 63514 -160214 -171223 34103
10639 -225147 -348458 -220022 -83169 99064 -300114 150536 185730 11898 35761 -195111
10628 -47375 111411 -40746 -181433 -196305 -177891 -234498 -431510 246672 10938 -77756 -191206
10617a91206b6661A14686c49098J21056e1383p4034J964M0658j70146B45589a55484
10605A42489J58949j0718b60675A95536a67001d8873O294j54876r094o9984B3657
10593A32736e6503o3515A58829A4777K1764a03372l564A51511b37708A31174a5472
10581h3741j81656B76904e2959k3412I2218M4835c7993o7035D01925b537G3557
10569A73885c9117k10513b5262l04049H537J83593b08928A54834b11225D74735
10558b4324C5628a94146F0096k3513c3859a1798G3878a56366a8715H1675h0801
10546b64780f3407q3885B80603P0941d1619B2689J06047f3004A20382d64388C09173
10534I7846d4211j86995O3505E4259L3955a90284B02959r0194h2146J3114k2158
$$ plain form
10617 -191206 -26661 114686 -349098 -228042 -51383 -125417 -123453 -82795 -252941 245589 -155484
10605 142489 301438 290720 -260675 195536 -167001 -48873 -42579 -197455 -206549 -276533 23657
10593 132736 -56503 -120018 158829 14777 36541 -103372 -106936 151511 -237708 131174 -15472
10581 -83741 -265397 276904 -52959 -76371 92218 137053 -37993 -105028 401925 -2537 73557
10569 173885 -39117 -249630 -25262 -329311 8537 192130 -208928 154834 -211225 474735
10558 -24324 35628 -194146 60096 36583 -33859 -11798 73878 -156366 -18715 81675 -80801
10546 -264780 -63407 -147292 280603 351544 -41619 22689 128736 -63004 120382 -464388 309173
10534 97846 -44211 -231206 -167701 54259 88214 -190284 202959 112765 -82146 -69032 -91190
10523i1190A57228i6128j13809A25334a15853j25455A88435c96286B92227b50942
10512A96084E7825J5144A876a82335P8954j85267i0716K2936k44739I0658b79523
10500d2983j1395j31116a3187H603a75877c0059A3059K55155E0203e02324B46133
10488H1815R5027A2049M7248a39056a4358B13737L260J44596J03073P4419A21396
10476B22895f3691r6342B3762a26787J0019E4347r545a62286j49859A4760L7782
10465E2542a34357C09441A04724i0875b3951j80043B10086a85429K7965k0905
10455a78369E2522c41068A63200a69106d4959k2342D5546q990a26051q6866A12202
10443G643d7338l81314A61134c55846C07532h2903E5909g5886Q59A27893i0398
$$ plain form
10523 -91190 157228 -96128 -209937 125334 -115853 -241308 188435 -396286 292227 -250942
10512 196084 57825 72969 1876 -182335 -103381 -288648 -90716 -67780 -312519 90658 -279523
10500 -42983 -54378 -185494 -13187 8603 -175877 -30059 13059 268214 50203 -502324 246133
10488 81815 176842 12049 59297 -139056 -14358 213737 216997 361593 464666 539085 121396
10476 222895 -63691 -160033 23762 -126787 -116768 54347 44802 -162286 -312145 14760 52542
10465 52542 -134357 309441 104724 -90875 -23951 -203994 210086 -185429 -157464 -178369
10455 -178369 52522 -341068 163200 -169106 -44959 -67301 45546 36556 -126051 -212917 112202
10443 7643 -47338 -428652 161134 -355846 307532 -82903 55909 -75886 -75027 127893 -90398
10431a47004f568A00236a3806G101b72042H2048a35227C81082a57172e6982j19984
10420a76966A25424a75183A83746l9972d9896a0695l5326A38546c49506A97662
10409i4713h517D7452J99327I9608d3048k56205A85009o3119C5638b23921h3531
10397F9767b65773d725p2147j26412j0963E2197K15N6584f3092A74474J57937
10386C32411I3212Q301Q8786R3350A24902d2534A51129i7771B54840A7477J25894
10375A43371L4405l1881K80913I0169J126b4941B01393E1630L77319o4509J02583
10364D67023j17337A44518F1040J98225J25576J19604d0401E92362B3711A0050
10353F8684L33168Q5079H9786N34829k07327A69375M2810L53458E5429K93695
$$ plain form
10431 -147004 -6568 100236 -13806 7101 -272042 82048 -135227 381082 -157172 -56982 -176966
10420 -176966 125424 -175183 183746 143774 -49896 -10695 -46021 138546 -349506 197662
10409 -94713 -8517 47452 246779 99608 -43048 -299253 185009 121890 35638 -223921 -83531
10397 69767 -265773 -4725 -76872 -203284 -214247 52197 52412 108996 -63092 174474 332411
10386 332411 93212 101513 190299 283649 124902 -42534 151129 -97771 254840 17477 143371
10375 143371 177776 145895 426808 90169 91295 -24941 201393 51630 428949 364440 467023
10364 467023 349686 144518 61040 259265 384841 504445 -40401 592362 23711 10050
10353 68684 401852 486931 89786 624615 417288 169375 212185 565643 55429 349124
10343C49124J5667j23935J17805j21364L121J00507K63366B14974A572K67907
10333B69479a70265A09382J25521n4443K50380g8520k928E5782J9633i1333A33977
10321D75474E5769L2743J00495L732r1672F617g4312b0336k39680A24218a76398
10309d00452i7799B19306m0271A7402K80205a99913a1327C57297I217J39457a62496
10297B2773K16902L2266a57591A40284a36843J460j53408A65960P9143F3509f362
10285E9991A102c83872H4721B1091i6228A94886B6151f2097k19263J01535A8610
10273b31825Q2712D6348i8592H3210K9196J68529A1906N2765L03318A03596a02087
10261a80492A28914a3134A02871K85593A92974m166a15907B47089C4115J93833
$$ plain form
10343 349124 364791 240856 358661 237297 240418 340925 604291 214974 1572 269479
10333 269479 -170265 109382 234903 180460 430840 -78520 -81448 55782 75415 -91333 133977
10321 475474 55769 88512 189007 192739 101067 6617 -74312 -20336 -260016 124218 -176398
10309 -400452 -97799 219306 179035 17402 297607 -199913 -11327 357297 9217 148674 -162496
10297 22773 239675 271941 -157591 140284 -136843 -135383 -288791 165960 245103 63509 -6362
10285 59991 1102 -383872 84721 21091 -96228 194886 26151 -62097 -281360 -179825 18610
10273 -231825 -149113 46348 -98592 83210 112406 280935 11906 64671 367989 103596 -102087
10261 -180492 128914 -13134 102871 388464 192974 188808 -115907 247089 34115 227948
10251B27948p2032b2533A20557a70820d24p0359F2553M2266L8236R1573I8141
10239b88246A52649I942J53052l9313b5349l0647I9168j3144h508j83395h3071
10227e6642A15921a3377o8841G9314g5030a8476l24144f512l52612A48264a95484
10215b17872c5336j03327A61714E264a16114j71250f82j08264B9123J11487b95401
10203c1601l69859A27589b36010j23636E9589K7086a09121k06996P6053N798R709
10192b24557n1341A48626b74062a06819J8343k3385B8770M7663i3327b521n4607
10181e7128A38976j4294J3274b27655j09746B93517b79385j40516c4309k1814
10171e6123l7489k66076b8417A69038a31354B76953b4321j48072A32180D5155
$$ plain form
10251 227948 155916 -22533 120557 -170820 -424 -70783 62553 104819 143055 234628 98141
10239 -288246 152649 9942 162994 123681 -25349 -55996 99168 86024 -8508 -191903 -83071
10227 -56642 115921 -13377 -82218 79314 -75030 -18476 -342620 -6512 -359124 148264 -195484
10215 -217872 -35336 -138663 161714 5264 -116114 -287364 -682 -108946 29123 140610 -295401
10203 -31601 -401460 127589 -236010 -359646 59589 86675 -109121 -316117 -240064 -234266 -224557
10192 -224557 -275898 148626 -274062 -106819 -88476 -111861 28770 76433 -93327 -2521 -57128
10181 -57128 138976 124682 137956 -227655 -337401 293517 -279385 -419901 -34309 -56123
10171 -56123 -93612 -359688 -28417 169038 -131354 276953 -24321 -172393 132180 45155
10160a33273l03881h4273B44022a53773H8954R7352o0415K7413o474J04984A6905
10148i2330A52804K1979h0804j65079q4290H4689a03104j20553C20320b45477
10137B23318A5211d33989a90869B8437b72904B0445J59389l0470b48088i0877
10126a55279r8620a17699c0485l00625e4088j53182F3711Q5391r290m448b48092
10114C57234a13706F2959a79517j8972A4423a7096H4687m1032a83144A32049M1049
10103A73098h6472a5984A26000Q6444a55554B91059c7900E1259b24394j366h3132
10091B5000M5556J9010C4183c26498j85833a22902j48022d0520o9018J5385L6298
10080e7855K7753j84440P6529l10098I015L6264b2132G3034a24820l12757g3040
$$ plain form
10160 -133273 -437154 -84273 244022 -153773 88954 186306 125891 153304 146830 251814 16905
10148 -92330 152804 174783 -80804 -245883 -330173 84689 -103104 -223657 320320 -245477
10137 223318 15211 -433989 -190869 28437 -272904 20445 179834 149364 -248088 -90877
10126 -155279 -253899 -117699 -30485 -331110 -54088 -207270 63711 149102 139812 135364 -248092
10114 357234 -113706 62959 -179517 -198489 14423 -17096 84687 43655 -183144 132049 173098
10103 173098 -86472 -15984 126000 212444 -155554 291059 -37900 51259 -224394 -225760 -83132
10091 25000 70556 89566 34183 -326498 -512331 -122902 -270924 -40520 -109538 -94153 -57855
10080 -57855 -30102 -214542 -138013 -448111 9015 45279 -22132 73034 -124820 -437577 -73040
10068c38176B4019c29710A7285c859C80910e078l48284a46044c0415C8944Q4933
10057A23877g8380j20506O2194j56576a17969l7324j5963F9569R3591i5463B49689
10045a52714c3877H3928a2362o6398m1607A44745B4367L53811A45726c3584k81567
10034c15151i4557o2278j28351D8849a19301b2163E7630a79023l6206A27618D1369
10022h9070A06799i9979q9202P2107a0878A01673c37253G8153A8402d4949B82937
10010f963A17337n2122f1515q4156k13993e6193C02574a86905i1207C036R9474
9999A02510L0766d9764K0699A80808C0569a07721B1909a67560A45042g6949J1573
9988f5376n4544c6802k50029j0648b3212o9527A52854c51690J17556f7034f854
$$ plain form
10068 -338176 24019 -329710 17285 -3859 380910 -5078 -353362 -146044 -30415 38944 123877
10057 123877 -78380 -198886 -136692 -293268 -117969 -155293 -171256 69569 163160 -95463 249689
10045 -152714 -33877 83928 -12362 -78760 -120367 144745 24367 378178 145726 -33584 -315151
10034 -315151 -94557 -156835 -285186 48849 -119301 -22163 57630 -179023 -215229 127618 41369
10022 -89070 106799 -99979 -189181 -117074 -10878 101673 -337253 78153 18402 -44949 282937
10010 -6963 117337 65215 -61515 -145671 -359664 -56193 302574 -186905 -91207 3036 102510
9999 102510 133276 -49764 -29065 180808 30569 -107721 21909 -167560 145042 -76949 -65376
9988 -65376 -119920 -36802 -286831 -297479 -23212 -92739 152854 -351690 -234134 -67034 -6854
9976A66333b12694b0646E433c8090B02104a84680h7751l025q8372K4931O6573
9965h7644j01577r8114F5195G691b37817L71j57655J41136B03982H698a8763k60055
9953b78818c2804E2665a00190A83693r1828a74753h1156g634A3548Q4081a11415
9941f1269J347r5501D7552b12844J04532k57499a31268j62754C0015d06156a69048
9929c76681m8935J69893g3125F3753c21033G2602a18874E8345b2268m22299B06987
9917b53189E2795L6084b43620B70321A29776a92599Q9333LA1120c6396C4539e460
9904A211a49351C1253K0532c16309R3606a01040R616B56022i2931k08345l7954
9893c39230a03480B79769b59390a06407H5061c37256e774H0641a25691A11804
$$ plain form
9976 166333 -212694 -20646 5433 -38090 202104 -184680 -87751 -90776 -179148 -154217 -87644
9965 -87644 -189221 -287335 65195 7691 -237817 -237446 -395101 -253965 203982 8698 -18763 -278818
9953 -278818 -32804 52665 -100190 183693 91865 -174753 -81156 -7634 13548 97629 -111415
9941 -61269 -59922 -155423 47552 -212844 -108312 -365811 -131268 -294022 30015 -406156 -169048
9929 -376681 -425616 -255723 -73125 63753 -321033 72602 -118874 58345 -22268 -444567 206987
9917 -253189 52795 88879 -243620 270321 129776 -192599 -103266 -103263 11120 -36396 34539 -5460
9904 1211 -149351 31253 51785 -316309 -222703 -101040 -91424 256022 -92931 -301276 -339230
9893 -339230 -103480 279769 -259390 -106407 85061 -337256 -5774 80641 -125691 111804
9882f0203G3557f8316A74721c02695B26558b07940C332a63676L6761M6492a4840
9870c6974J7641k27276d6351A6676J11896a32095j23300A8285J31665d9270A65936
9858b49456i6127A74769p0271c03747e3034A67327c9761H536a06232m1488m4530
9847a92250H9096b27306a4611H4186b01830l5810A37213C5577Q8728b0527p6694
9836i7221G456g0711A70204b02024B08956C5019a08049F7873L8747L4297h33I018
9823C26N9648c75346C2634g4512A491c39497a15490j49183G836J08453b8598l64344
9811c92942M1356J30105m36224C28920b98480a1750I4834P9860D9369e8783j34175
9800a92958j10684A11089b38318A42690C1309d45960J42435h963j85473i0765
$$ plain form
9882 -60203 73557 -68316 174721 -302695 226558 -207940 3332 -163676 -126915 -80423 -14840
9870 -36974 -19333 -246609 -46351 16676 128572 -132095 -255395 18285 149950 -49270 165936
9858 -249456 -96127 174769 104498 -303747 -53034 167327 -39761 8536 -106232 -147720 -192250
9847 -192250 89096 -227306 -14611 84186 -201830 -237640 137213 35577 124305 -20527 -97221
9836 -97221 7456 -70711 170204 -202024 208956 35019 -108049 67873 106620 140917 -833 9018
9823 326 59974 -375346 32634 -74512 1491 -339497 -115490 -264673 7836 116289 -28598 -392942
9811 -392942 -351586 -221481 -657705 328920 -298480 -11750 94834 174694 49369 -58783 -192958
9800 -192958 -303642 111089 -238318 142690 31309 -445960 -303525 -8963 -194436 -90765
9789A78023a73948A49696n0728i8091K1560R040H8401a9158E7832J62965j05340
9778A15457a89358G078J14505l3264l9724f7187k2647k7747j40284g028H2960
9766e3606k78734e6357C74496B1129e4245K4859A36867J26748c97406h3656D01052
9754E365a94606P6812R254B4012d0748E733f0217E4396L7468a04396j10444F3164
9741g3490m4803i313E1054K29023a45070O2181j31976Q1639a4205k57940J30946
9730a41199J8516b4610C1937b57502h775j11666p4440i947B44492e2062A30436
9718b918k12824a3854j12301p262q3799f4824A30188c23695N2110A18755b9169
9706c49986A15631j6600l6449f4827a1091l09379H3596c9793m533m2626A7279
$$ plain form
9789 178023 -173948 149696 98968 -98091 -76531 -67491 88401 -19158 57832 220797 115457
9778 115457 -189358 7078 121583 88319 48595 -67187 -89834 -117581 -257865 -7028 82960
9766 -53606 -332340 -56357 374496 21129 -54245 -29386 136867 263615 -397406 -83656 401052
9754 5365 -194606 -117794 -108540 24012 -40748 5733 -60217 54396 91864 -104396 -214840 63164
9741 -73490 -118293 -9313 51054 280077 -145070 -82889 -214865 -133226 -14205 -272145 -141199
9730 -141199 -122683 -24610 31937 -257502 -8775 -120441 -194881 -9947 244492 -52062 130436
9718 -2918 -215742 -13854 -126155 -133417 -217216 -64824 130188 -323695 -271585 118755 -29169
9706 -349986 115631 99031 62582 -64827 -11091 -320470 83596 -39793 -44326 -86952 17279
9694C4053a96249b5692G8839l5199c3549I10J21128J3984d2000l65740h0457A0736
9681h5984b4282A34827F7362h8990F3836c10289A50885f3081B13439D8207b15375
9669g1194j23442C88833e8180n4233k20143a30549M1695A33395a10015J4462C6500
9657C61488b82434A49792b1814l40808e8010q8316J700O8410a7320C79271b05166
9645b73182A24789l9685j0437a81155O6118A59123B9057a99565k94148a3982A46950
9633a6879k0813j8239E5059b02029j15249a40020l33543a52247A47586A6432K84364
9622C00796q2742a83872m635l7094A36076b1199H9119d94400K24664d3434q9054
9611a32488C6381K57559a81663A34566d57343a81645A90507g206B4683b99788
$$ plain form
9694 34053 -196249 -25692 78839 43640 -33549 910 122038 136022 -42000 -407740 -80457 10736
9681 -85984 -24282 134827 67362 -88990 63836 -310289 150885 -63081 213439 48207 -215375
9669 -71194 -194636 388833 -58180 -112413 -332556 -130549 -88854 133395 -110015 -95553 36500
9657 361488 -282434 149792 -21814 -362622 -58010 -146326 -144626 -76216 -17320 379271 -205166
9645 -273182 124789 85104 74667 -181155 -115037 159123 29057 -199565 -493713 -13982 146950
9633 -16879 -37692 -55931 55059 -202029 -317278 -140020 -473563 -152247 147586 16432 300796
9622 300796 218054 -183872 -188507 -225601 136076 -21199 89119 -494400 -269736 -43434 -132488
9611 -132488 36381 293940 -181663 134566 -457343 -181645 190507 -7206 24683 -299788
9600i1227j02398A6003a40493I8199i7411l4361G5325b03118A14311a73955A14358
9588A06820i2836J9732B53427A08633A6928K17432c72977J79565h7707E8089N4815
9577A12904O1821a99590I5018K04472F2151D981a94039L3958e8687J1038a4437
9565a07114B3543P5847N0156a86382f1766p7584j70536g7785m2538E4513a2932
9553A9085J1588a11214D9352b03150j8046p5176C1158e0789J1798k51781F5927
9541A33184b07040B30810a42452n8622J9981A43170F6602c48687Q2845a4165B06231
9529b96439a4432E3426K14941a39196k77741A4507a95383A54340a76435D6263
9518D7938e1808k51218O4738f5640p9126B20942I0318J92644d32860A64002r261
$$ plain form
9600 -91227 -193625 16003 -140493 98199 -97411 -131772 75325 -203118 114311 -173955 114358
9588 106820 -92836 -73104 253427 108633 16928 234360 -372977 -193412 -87707 58089 112904
9577 112904 174725 -199590 95018 299490 62151 4981 -194039 -160081 -58687 -47649 -14437
9565 -107114 23543 99390 149546 -186382 -61766 -139350 -309886 -77785 -120323 54513 -12932
9553 19085 30673 -111214 49352 -203150 -221196 -296372 31158 -50789 -38991 -290772 65927
9541 133184 -207040 230810 -142452 -201074 -181093 143170 66602 -348687 -265842 -14165 206231
9529 -296439 -14432 53426 268367 -139196 -416937 14507 -195383 154340 -176435 46263
9518 47938 -51808 -303026 -238288 -65640 -144766 220942 90318 282962 -432860 164002 154741
9507A54741a21924J6713p8397J2531j47184D9293P0320b69378A03561a60801p9602
9496b40403A07896e6773b524k1189j83313E4815c7652j01736K9462j4348A46339
9484c88812n8991a90528A88756b04223G1887c83545A89151a62092g6951A3959
9473F7555a34383J1260l7571B82659p6346a11918b9532o3880D0870F46K29666
9462B30312c3973n392B1770J45085a39119A36954m7768A2506a26402c3889k3772
9451e7661k05888a10270E8613b75778r4235k9153a47029A07480b23425P1934C3643
9439g5198b7254A40010d9740j80460n775k31299a12230M1439n1336B88843a73437
9427g0510r4472n109D733a42169a3408C474e2188J8877A43828E8541f2095C82096
$$ plain form
9507 154741 -121924 -105211 -183608 -171077 -318261 49293 119613 -269378 103561 -160801 -240403
9496 -240403 107896 -56773 -2524 -23713 -207026 54815 -37652 -139388 -109926 -124274 146339
9484 -388812 -447803 -190528 188756 -204223 71887 -383545 189151 -162092 -76951 13959
9473 67555 -134383 -123123 -160694 282659 206313 -111918 -29532 -93412 40870 646 230312
9462 230312 -33973 -39365 21770 166855 -139119 136954 89186 12506 -126402 -33889 -57661
9451 -57661 -263549 -110270 58613 -275778 -370013 -399166 -147029 107480 -223425 -151491 33643
9439 -75198 -27254 140010 -49740 -230200 -235975 -467274 -112230 -70791 -122127 288843 -173437
9427 -70510 -164982 -170091 4733 -142169 -13408 3474 -52188 -33311 143828 58541 -62095 382096
9414g4738k472B60334a33469D333Q9646d3499B19343R4766f0173k70744J62586
9403a68331A0458e7154p418q5233j1604A4377b39410j3693e615l23250R1500l6782
9391b74147A87675a0345D6046b14066f4637A5294J7613o946L64048G0643a70976
9379B65305a72011E7259a88268a272r5809K8972j64130d3162G7080a60663b9088
9367H8793b95000A20275f6668C5571p373K4063a19413p5257B79049a16091A7857
9355C3204h0253r9199E0893b14401r0088n4802F821b05322j7247j27143h380o4503
9343g2883H4930K47942b259j319r1784b058k66991h0280R036A62972A0592J11791
9331A22383K2491n869c05301c3821B18098a26552h806j10319A65867a67680G6929
$$ plain form
9414 -74738 -77210 260334 -133469 4333 93979 -43499 219343 314109 -60173 -330917 -168331
9403 -168331 10458 -57154 -64572 -149805 -161409 14377 -239410 -253103 -5615 -328865 -237365 -274147
9391 -274147 187675 -10345 46046 -214066 -64637 15294 32907 25961 390009 70643 -170976
9379 265305 -172011 57259 -188268 -1272 -97081 -68109 -232239 -43162 77080 -160663 -29088
9367 88793 -295000 120275 -66668 35571 28198 52261 -119413 -194670 279049 -116091 17857
9355 33204 -80253 -179452 50893 -214401 -304489 -359291 6821 -205322 -222569 -349712 -8380 -72883
9343 -72883 84930 332872 -2259 -3578 -95362 -2058 -269049 -80280 -71244 162972 10592 122383
9331 122383 144874 139005 -305301 -33821 218098 -126552 -8806 -119125 165867 -167680 76929
9319A33163n3580b97274f4903j18361K1936D815J76884b02753j06783R3109A8265
9307c39683a11359H4503h936C7312k701a67394K8924O8843o5685l6580E2923c99396
9294I2167B5858b3998m30368A36084F5972a60447r21F7212a56346D492c7268Q852
9282b8416p0482A41441E7523c71731G0956g4905o5469i30D57356b47588f2878
9270c58662A69522E8904o282J6360a52546k08925N2573a04804p2623D3534A2849
9258a0703A2606a72549n0109k0265O6798E7844A51J52915e8454k29531j16395
9247d04380a35261j51135I9147a11574j52425I1990b02110C70742a72848C93188
9236C5779O7762i03m48454A44257b24370A40094b67787m800j89064a81324N2211
$$ plain form
9319 133163 79583 -297274 -64903 -183264 -161328 4815 181699 -202753 -309536 -216427 18265
9307 -339683 -111359 84503 -8936 37312 34611 -167394 -138470 -69627 -135312 -171892 52923 -399396
9294 92167 25858 -23998 -454366 136084 65972 -160447 -161368 67212 -156346 4492 -37268 -28416
9282 -28416 -98898 141441 57523 -371731 70956 -74905 -140374 -930 457356 -247588 -62878
9270 -358662 169522 58904 52622 68982 -152546 -361471 -308898 -104804 -177427 43534 12849
9258 -10703 12606 -172549 -222658 -242923 -176125 57844 151 153066 -58454 -287985 -404380
9247 -404380 -135261 -286396 99147 -111574 -263999 91990 -202110 370742 -172848 393188
9236 35779 103541 -903 -449357 144257 -224370 140094 -267787 -272587 -461651 -181324 -129113
9225a29113A51110L1232a866G0881a24872A58731i4631q7117N273A34676h3776
9213a86596r9043G261K9734a41755B73993J07015c32436a33148c3145k95844B46444
9201H9385a75074l147e686F1369e5405j21378B1421O9438J96358c6643A04450
9189A1457a06572o1922j21465k708B53035f6714d686k28441a2879q9284C0084
9177A47016a80251e1513j80329O8405e9609b2868A62276b79924N0616J09924q6643
9166b06027A99132b97917A53461b8141l5321a0671k71932a41071B01220a94286
9155a84336j5085i5923K4398k5690j91849H0035a11942J8439o5182o6595j12249
9144c37529a48110a2916A58605a91271N2496A48318D4878o778I348f05F5789L61267
$$ plain form
9225 -129113 151110 182342 -1866 70881 -124872 158731 -94631 -181748 -176475 134676 -83776
9213 -186596 -285639 7261 36995 -141755 273993 381008 -332436 -133148 -33145 -328989 246444
9201 89385 -175074 -178221 -5686 61369 -55405 -176783 21421 90859 287217 -36643 104450
9189 11457 -106572 -168494 -289959 -292667 253035 -66714 -4686 -233127 -12879 -102163 30084
9177 147016 -180251 -51513 -231842 -163437 -59609 -22868 162276 -279924 -229308 -119384 -206027
9166 -206027 199132 -297917 153461 -28141 -63462 -10671 -282603 -141071 201220 -194286
9155 -184336 -199421 -95923 -71525 -97215 -289064 80035 -111942 -93503 -158685 -225280 -337529
9144 -337529 -148110 -12916 158605 -191271 -138775 148318 44878 38100 9348 -605 65789 427056
9132D27056b8982D5695a67610O9033j06864g6924A60051a36863o8204e3667m1331
9121i4998b1623G011Q3796b99727H2761A3528i341C624a54913G2451c62034k0304
9109c82338J66824C6102a10877C4471a85095B3016c15131A95050G7604d7605C9164
9097I5849e27379A05434c7591j74049A61716L091a23084B54965c6792j20056m932
9086a61780j68509f2433p8759A77482a24278k5806A15817O538q548g6146B34731
9074h6057j38846a00753A38119c3083l2393l1264J2765A86924a42071B55895c053
9062a50397C8012a25821o0312G8506a2163q9342J8796D6601J19205e8935C9214
9050d3986m9889H093b89679F400P4478M2473c137l62395a0166r1944c4860E6864
$$ plain form
9132 427056 -28982 45695 -167610 -98577 -205441 -76924 160051 -136863 -205067 -53667 -94998
9121 -94998 -21623 7011 90807 -299727 82761 13528 -9341 3624 -154913 72451 -362034 -382338
9109 -382338 -215514 36102 -110877 34471 -185095 23016 -315131 195050 77604 -47605 39164
9097 95849 -527379 105434 -37591 -211640 161716 164807 -123084 254965 -36792 -156848 -161780
9086 -161780 -330289 -62433 -141192 177482 -124278 -150084 115817 122355 113807 -76146 234731
9074 -86057 -224903 -100753 138119 -33083 -65476 -96740 -83975 186924 -142071 255895 -3053
9062 -150397 38012 -125821 -186133 78506 -12163 -101505 -82709 46601 165806 -58935 39214
9050 -43986 -93875 8093 -289679 6400 80878 123351 -3137 -365532 -10166 -102110 -34860 56864
9037A2381L7760G252b12300h5578A91746a19766j03085d0100a728p5767L0155
9026d7340A44116b75597m9158J46681B26794e4359n7308K9654B05578D1589a53478
9014b23323K7311L9632b6640j08935j67696c6537Q741l65178A4587a43585F8438
9002a06378A77267J05825A08873c9930j15694C7796c0643B26201i6249c2791k5207
8991e7998B7855K10339A4586a15128H0968e6473k46802A06850b877j46113B48870
8979a41516b9414j98784h044l36084g246k82222E4823J10576a90344p0809e3145
8967a4983k36416B2096P5608K6883g491G267d3960j64493h4647J9233B55239c23190
8954H8040a13440Q722j12383B66706a88341C3035R540d22259d9209A64077c59354
$$ plain form
9037 12381 50141 7252 -212300 -85578 191746 -119766 -222851 -40100 -1728 -77495 -47340
9026 -47340 144116 -275597 -324755 -178074 226794 -54359 -111667 -82013 205578 41589 -153478
9014 -223323 -196012 -156380 -26640 -135575 -303271 -36537 -27796 -392974 14587 -143585 68438
9002 -106378 177267 283092 108873 -39930 -155624 37796 -30643 226201 -96249 -32791 -57998
8991 -57998 27855 238194 14586 -115128 80968 -56473 -303275 106850 -2877 -148990 248870
8979 -141516 -29414 -228198 -8044 -344128 -7246 -289468 54823 165399 -190344 -261153 -53145
8967 -14983 -251399 22096 97704 124587 -7491 7267 -43960 -208453 -84647 -65414 255239 -323190
8954 88040 -113440 -104718 -217101 266706 -188341 33035 42575 -422259 -49209 164077 -359354
8942g4342j04532a7356B5613b48637J17997E6864j3361d00662J17048J39318A54302
8930A81551a65227D1735a57418j82284A3960a24144H8689J15718D0903N34635
8920E75538G6043A6292f8927A64413g8095p2656A95158d30851b07473M9985A23779
8908A13111N6359Q9466e8774C7992f9742j61003J11782A37719b34141e968k8082
8897c4050A74771a25953a0137q0189m0785j04979m23328D26543a32793E6238R3508
8886A49746J49294a52444j47393a05113o5158B38656b07143A6698a92917j4052
8876b06969A55770o3824g5029A95983f8074G3694h9321k28918H8655c17874A08243
8864A56317b28761C70866d0238j38178P4312o7087A06571l1345O6566k7089a89447
$$ plain form
8942 -74342 -178874 -17356 25613 -248637 -130640 56864 43503 -400662 -283614 -144296 154302
8930 181551 -165227 41735 -157418 -339702 13960 -124144 88689 204407 40903 575538
8920 575538 76043 16292 -68927 164413 -78095 -150751 195158 -430851 -207473 -157488 123779
8908 113111 169470 258936 -58774 37992 -69742 -230745 -118963 137719 -234141 -5968 -34050
8897 -34050 174771 -125953 -10137 -90326 -131111 -236090 -659418 426543 -132793 56238 149746
8886 149746 299040 -152444 -299837 -105113 -170271 238656 -207143 16698 -192917 -206969
8876 -206969 155770 91946 -75029 195983 -68074 73694 -89321 -318239 88655 -317874 108243
8864 156317 -228761 370866 -40238 -178416 -104104 -171191 106571 75226 141792 114703 -189447
8852a70921j33036G3974a39604n3120j04435I2915K8020e6472p6759A33490a69
8840A42554C8011j13A1891a41726C8695a93077N368C14373E0977o586a26625A49216
8827I5066a98241P2770J1263B84380c47969B05290c5356j9976H9087J41893a5802
8815A17584D7929b17097b5849q7059A08929a47083d7201j61023P2730j32369C9528
$$ plain form
8852 -170921 -303957 73974 -139604 -192724 -297159 92915 120935 -56472 -133231 133490 -169
8840 142554 38011 37898 11891 -141726 38695 -193077 -187709 314373 50977 44391 -126625 149216
8827 95066 -198241 -125471 -114208 284380 -347969 205290 -35356 -55332 89087 230980 -15802
8815 117584 47929 -217097 -25849 -112908 108929 -147083 -47201 -208224 -135494 -267863 39528
$$ [...]
##END NTUPLES=NMR SPECTRUM
##END=
