##TITLE=AC1741_SEN00014_9276431_AB4jOIfaEK
##JCAMPDX= 6.0         $$ Bruker NMR JCAMP-DX V2.0
##DATA TYPE= NMR SPECTRUM
##DATA CLASS= NTUPLES
##ORIGIN= BRUKER
##OWNER= Administrator
$$ 1.72 TOPSPIN		Version 2.1
$$ 2015-07-15 01:16:43.369 -0700  Administrator@X
$$ Compression mode = diff/dup
##.OBSERVE FREQUENCY= 400.02188249412
##.OBSERVE NUCLEUS= ^1H
##.ACQUISITION MODE= SIMULTANEOUS (DQD)
##.ACQUISITION SCHEME= undefined
##.AVERAGES= 64
##.DIGITISER RES= 22
##SPECTROMETER/DATA SYSTEM= spect
##.PULSE SEQUENCE= noesygpps1d.comp
##.SOLVENT NAME= COFFEE_meoh
##.SHIFT REFERENCE= INTERNAL, COFFEE_meoh, 1, 14.96107
##AUDIT TRAIL= $$ (NUMBER, WHEN, WHO, WHERE, PROCESS, VERSION, WHAT)
$$ ##TITLE= Audit trail, TOPSPIN		Version 2.1
$$ ##JCAMPDX= 5.01
$$ ##ORIGIN= Bruker BioSpin GmbH
$$ ##OWNER= Administrator
$$ $$ E:\/data/COFFEE/nmr/AC1741_SEN00014_9276431_AB4jOIfaEK/12/pdata/1/auditp.txt
$$ ##AUDIT TRAIL=  $$ (NUMBER, WHEN, WHO, WHERE, PROCESS, VERSION, WHAT)
(   1,<2015-07-15 01:16:38.354 -0700>,<Administrator>,<X>,<go>,<TOPSPIN 2.1>,
      <created by zg
	started at 2015-07-15 01:05:08.479 -0700,
	POWCHK enabled, PULCHK disabled,
       configuration hash MD5:
       21 0F 79 D6 B3 7B B4 F6 88 20 88 DB 03 48 BD 9F
       data hash MD5: 64K
       44 B6 49 62 07 3E AF 39 90 69 14 AA 2E CA 1B 0D>)
(   2,<2015-07-15 01:16:41.541 -0700>,<Administrator>,<X>,<proc1d>,<TOPSPIN 2.1>,
      <Start of raw data processing
       efp LB = 0.3 FT_mod = 6 PKNL = 1 PHC0 = 0 PHC1 = 0 SI = 128K 
       data hash MD5: 128K
       11 3C F2 D8 B8 49 00 4B 55 35 AD 12 18 E0 3E 58>)
(   3,<2015-07-15 01:16:42.447 -0700>,<Administrator>,<X>,<proc1d>,<TOPSPIN 2.1>,
      <pk PHC0 = -88.05542 PHC1 = 0 
       data hash MD5: 128K
       14 B9 44 F3 5E 59 44 6A 57 2F B4 1F 20 3F AA 7B>)
(   4,<2015-07-15 01:16:42.854 -0700>,<Administrator>,<X>,<proc1d>,<TOPSPIN 2.1>,
      <abs ABSG = 1 
       data hash MD5: 128K
       35 02 7C 96 59 A1 C9 A0 A4 A5 B5 18 61 C8 CF B6>)
(   5,<2015-07-15 01:16:42.947 -0700>,<Administrator>,<X>,<proc1d>,<TOPSPIN 2.1>,
      <abs ABSG = 2 
       data hash MD5: 128K
       B0 EA D7 79 CA D7 E7 10 77 DB E7 54 AB A5 D0 FB>)
(   6,<2015-07-15 01:16:43.025 -0700>,<Administrator>,<X>,<proc1d>,<TOPSPIN 2.1>,
      <abs ABSG = 3 
       data hash MD5: 128K
       DA FE B1 F1 8D 4A 07 ED 03 82 CE 49 E3 AD D7 AE>)
(   7,<2015-07-15 01:16:43.104 -0700>,<Administrator>,<X>,<proc1d>,<TOPSPIN 2.1>,
      <abs ABSG = 4 
       data hash MD5: 128K
       CB 7E D2 C4 F2 E4 53 B3 97 BE 1D DB 0B 01 F5 9B>)
(   8,<2015-07-15 01:16:43.182 -0700>,<Administrator>,<X>,<proc1d>,<TOPSPIN 2.1>,
      <abs ABSG = 5 
       data hash MD5: 128K
       88 C1 7E 1A 53 29 BB 14 AB DC D4 4D F9 F6 6C 89>)
$$ ##END=
$$ 
$$ $$ hash MD5
$$ $$ 28 1F FB 09 80 D5 58 CB 5A 6A 54 FF 52 12 A9 F8
##$RELAX= 
##$RELAX= 
##$RELAX= 
##$RELAX= 
##$RELAX= 
##$RELAX= 
##$RELAX= 
##$RELAX= 
$$ Bruker specific parameters
$$ --------------------------
##$DU= <E:\>
##$EXPNO= 12
$$ [...]
##$TP07= 0
##$TPNAME0= <>
##$TPNAME1= <>
##$TPNAME2= <>
##$TPNAME3= <>
##$TPNAME4= <>
##$TPNAME5= <>
##$TPNAME6= <>
##$TPNAME7= <>
##$TPOAL= (0..7)
0.5 0.5 0.5 0.5 0.5 0.5 0.5 0.5
##$TPOFFS= (0..7)
0 0 0 0 0 0 0 0
##$TUNHIN= 0
##$TUNHOUT= 0
##$TUNXOUT= 0
##$USERA1= <user>
##$USERA2= <user>
##$USERA3= <user>
##$USERA4= <user>
##$USERA5= <user>
##$V9= 5
##$VALIST= <valist>
##$VCLIST= <CCCCCCCCCCCCCCC>
##$VD= 0
##$VDLIST= <DDDDDDDDDDDDDDD>
##$VPLIST= <PPPPPPPPPPPPPPP>
##$VTLIST= <TTTTTTTTTTTTTTT>
##$WBST= 2048
##$WBSW= 25
##$XGAIN= (0..3)
0 0 0 0
##$XL= 0
##$YL= 0
##$YMAX_a= 6262031
##$YMIN_a= -11487900
##$ZGOPTNS= <>
##$ZL1= 120
##$ZL2= 120
##$ZL3= 120
##$ZL4= 120
##$ABSF1= 14.96107
##$ABSF2= -5.597112
##$ABSG= 5
##$ABSL= 3
##$ALPHA= 0
##$AQORDER= 0
##$ASSFAC= 0
##$ASSFACI= 0
##$ASSFACX= 0
##$ASSWID= 0
##$AUNMP= <proc_prof1d_extract.lims>
##$AXLEFT= 0
##$AXNAME= <>
##$AXNUC= <1H>
##$AXRIGHT= 0
##$AXTYPE= 0
##$AXUNIT= <>
##$AZFE= 0.1
##$AZFW= 0.1
##$BCFW= 0
##$BC_mod= 0
##$BYTORDP= 0
##$COROFFS= 0
##$CY= 15
##$DATMOD= 1
##$DC= 0
##$DFILT= <>
##$DTYPP= 0
##$F1P= 0
##$F2P= 0
##$FCOR= 0.5
##$FTSIZE= 131072
##$FT_mod= 6
##$GAMMA= 0
##$GB= 0
##$INTBC= 1
##$INTSCL= 1
##$ISEN= 128
##$LB= 0.3
##$LEV0= 0
##$LPBIN= 0
##$MAXI= 10000
##$MC2= 0
##$MEAN= 0
##$ME_mod= 0
##$MI= 0
##$NCOEF= 0
##$NC_proc= -2
##$NLEV= 6
##$NOISF1= 0
##$NOISF2= 0
##$NSP= 0
##$NTH_PI= 0
##$NZP= 0
##$OFFSET= 14.96107
##$PC= 1
##$PHC0= -88.05542
##$PHC1= 0
##$PH_mod= 1
##$PKNL= yes
##$PPARMOD= 0
##$PPDIAG= 0
##$PPIPTYP= 0
##$PPMPNUM= 2147483647
##$PPRESOL= 1
##$PSCAL= 4
##$PSIGN= 0
##$PYNMP= <proc.py>
##$REVERSE= no
##$SF= 400.020009607324
##$SI= 131072
##$SIGF1= 0
##$SIGF2= 0
##$SINO= 400
##$SIOLD= 131072
##$SPECTYP= <>
##$SREGLST= <1H.CDCl3>
##$SSB= 0
##$STSI= 131072
##$STSR= 0
##$SW_p= 8223.68421052631
##$SYMM= 0
##$S_DEV= 0
##$TDeff= 65536
##$TDoff= 0
##$TI= <>
##$TILT= no
##$TM1= 0
##$TM2= 0
##$TOPLEV= 0
##$USERP1= <user>
##$USERP2= <user>
##$USERP3= <user>
##$USERP4= <user>
##$USERP5= <user>
##$WDW= 1
##$XDIM= 131072
##$YMAX_p= 411118699
##$YMIN_p= -12030
##$CURPLOT= <Network HP LaserJet P1505>
##$CURPRIN= <$Network HP LaserJet P1505>
##$DFORMAT= <normdp>
##$LAYOUT= <+/1D_H.xwp>
##$LFORMAT= <normlp>
##$PFORMAT= <normpl>
##$SURQMSG= 1
$$ End of Bruker specific parameters
$$ ---------------------------------
##NTUPLES= NMR SPECTRUM
##VAR_NAME=  FREQUENCY,     SPECTRUM/REAL,   SPECTRUM/IMAG
##SYMBOL=    X,             R,               I
##VAR_TYPE=  INDEPENDENT,   DEPENDENT,       DEPENDENT
##VAR_FORM=  AFFN,          ASDF,            ASDF
##VAR_DIM=   131072,        131072,          131072
##UNITS=     HZ,            ARBITRARY UNITS, ARBITRARY UNITS
##FACTOR=    0.0627417313425164, 1,          1
##FIRST=     8223.62146879497, -2760,        -54568
##LAST=      0,             -165,            -55579
##MIN=       0,             -12030,          0
##MAX=       8223.62146879497, 411118699,    0
$$ Real data points
##PAGE= N=1
##DATA TABLE= (X++(R..R)), XYDATA
$$ [...]
67939 74567 76551 77236 76677 75681 75096 75339 76317 77565 78606 79395 80280 81408 82386 82761 82662 82645 82997 83500
67921 83500 83816 83835 83658 83572 84035 85330 87086 88353 88352 87106 85321 83767 82723 81831 80461 78424 76315
67904 76315 74927 74308 73683 72414 70802 69735 69729 70501 71367 71844 71863 71571 71113 70645 70462 70812 71466 71743 71268
67885 71268 70527 70320 70757 71252 71505 71922 72899 74191 75369 76495 77871 79330 80257 80310 79819 79446 79613 80186
67867 80186 80564 80213 79290 78580 78607 78992 78964 78385 77887 78057 78801 79521 79616 78820 77304 75523 73810 72152 70503
67848 70503 69192 68691 69034 69751 70406 70932 71408 71880 72401 72963 73315 73180 72762 72684 73234 74019 74568 74970 75571
67829 75571 76300 76684 76500 76093 76012 76546 77661 79252 81339 83992 86972 89568 91086 91606 91912 92436 92574
67812 92574 91439 89115 86655 84886 83632 82233 80389 78307 76374 74980 74429 74631 74892 74329 72613
67797 72613 70254 68112 66672 65785 65029 64252 63683 63500 63462 63172 62656 62410 62775 63515 64130 64454 64756 65357
67779 65357 66280 67243 67909 68279 68820 69992 71552 72601 72591 72020 71832 72342 73165 73999 74887 75724 76162 76234 76564
67760 76564 77592 78975 80121 80943 81680 82244 82291 81821 81222 80688 80014 79012 77836 76809 76208 76237 76924 77965
67742 77965 78914 79590 80119 80608 81049 81473 81795 81476 79824 76872 73603 70992 69114 67450 65765 64290
67726 64290 63234 62567 62293 62498 63023 63388 63265 62910 62854 63225 63532 63242 62437 61660 61164 60659 59991 59631 60034
67707 60034 60727 60747 59994 59474 59932 60876 61392 61339 61146 60883 60327 59771 59949 61040 62321 63002 62959 62516 61983
67688 61983 61584 61414 61238 60685 59861 59424 59778 60541 61144 61665 62608 63972 65044 65216 64668 64011 63445 62589
67670 62589 61208 59870 59558 60551 61959 62631 62390 62062 62367 63149 63794 64031 64096 64284 64609 64842 64789 64565 64620
67651 64620 65355 66692 68184 69516 70597 71144 70622 68909 66752 65218 64733 64883 65032 64925 64801 65154 66302
67634 66302 67993 69504 70303 70566 70855 71458 72287 73235 74223 74914 74899 74346 74123 74902 76286 77160 76904 75989
67616 75989 75325 75266 75522 75844 76373 77160 77751 77701 77315 77358 78015 78685 78969 79237 79753 79796 78448 76037 74006
67597 74006 73273 73363 73370 73132 73068 73337 73689 73852 73663 73037 72259 72121 73220 75046 76222 75804 74080 72040 70388
67578 70388 69276 68654 68516 68836 69463 70108 70406 70129 69459 68870 68556 68160 67385 66761 67362 69564 72394 74376
67560 74376 74843 74260 73475 73035 73078 73468 73878 74001 73836 73608 73394 73034 72493 71998 71641 71102 70063 68740 67699
67541 67699 67215 67073 66974 66861 66852 67081 67641 68470 69246 69615 69566 69388 69192 68730 67811 66651 65641 64934 64499 64430
67521 64430 64904 65829 66739 67111 66742 65888 65138 65097 65975 67444 68964 70218 71124 71543 71295 70564 69974 69977 70296
67502 70296 70291 69815 69361 69264 69129 68362 67058 65961 65563 65653 65894 66456 67717 69500 71018 71634 71407 70847 70423
67483 70423 70468 71242 72688 74161 74762 74144 72876 71919 71778 72257 72910 73523 74123 74678 75007 74993 74833 74916 75423
67464 75423 76069 76307 75849 74941 74067 73426 72854 72311 72273 73414 75849 78827 81276 82613 83056 83214 83513 83995
67446 83995 84562 85235 86047 86722 86707 85718 84120 82584 81405 80393 79412 78703 78566 78977 79722 80698 81874 83130
67428 83130 84370 85612 86711 87119 86322 84577 82890 82124 82324 82995 83828 84940 86471 88121 89182 89113
67412 89113 88084 86871 86113 85795 85567 85342 85269 85277 85095 84755 84626 84780 84741 84152 83365 83017 83216 83468 83313 82713
67392 82713 81931 81356 81412 82256 83490 84410 84669 84579 84731 85462 86655 87859 88563 88586 88280 88206 88515 88802 88654
67373 88654 88174 87842 87979 88492 89082 89540 89852 90156 90653 91474 92518 93467 94079 94501 95139 96063 96658 96188 94773
67354 94773 93481 93264 94073 95212 96249 97123 97668 97696 97539 97836 98582 98955 98423 97481 96870 96596 96301 96187
67336 96187 96799 98048 99280 100348 101810 103803 105474 106052 105936 106171 107142 108374 109382 110135 110676 110867
67320 110867 110720 110629 111028 111975 113197 114432 115635 116903 118208 119191 119374 118741 117957 117783 118327 119101 119674
67303 119674 119951 119899 119484 119039 119292 120691 122826 124728 125664 125599 125096 124889 125372 126334 127264 127944 128539 129082
67285 129082 129199 128584 127454 126253 125105 123873 122613 121637 121167 121242 121923 123315 125275 127314 128880 129730
67269 129730 130077 130469 131398 132853 134335 135434 136282 137308 138673 140152 141456 142435 143127 143797 144759 145844
67253 145844 146234 145264 143305 141404 140132 139242 138446 137900 137732 137634 137252 136643 136047 135571 135391 135940 137455 139514
67235 139514 141346 142558 143310 143944 144687 145615 146640 147560 148296 149014 149890 150911 152034 153353 154918 156539
67219 156539 157915 158833 159198 159129 159145 159849 161151 162182 162357 162209 162710 163942 165031 165259 164785 164265 164218 164832
67201 164832 165961 167205 168262 169228 170324 171454 172363 173128 173991 174784 175069 174920 175007 175716 176661 177339 177766
67184 177766 178182 178520 178563 178351 178072 177745 177363 177202 177695 179036 181024 183141 184700 185226 184949 184676 184926 185395
67166 185395 185494 185245 185329 186389 188476 190996 193052 194064 194357 194924 196349 198154 199446 199936 199978 199966 200170
67149 200170 200953 202527 204541 206387 207958 209601 211329 212666 213394 213946 214787 215814 216682 217353 217978 218503
67133 218503 218792 219046 219747 221120 222831 224292 225229 225958 227025 228514 229819 230319 230171 230156 230716 231511 232001
67116 232001 232088 232044 232161 232727 234086 236328 239038 241609 243768 245681 247648 249817 252004 253677 254363 254293
67100 254293 254378 255291 256773 258101 258968 259484 259574 259029 258162 257795 258334 259257 259825 260037 260586 262037 264280 266755
67082 266755 269007 271028 273153 275582 278044 280049 281491 282822 284509 286499 288341 289753 290936 292346
67068 292346 294232 296342 298095 299178 299975 301237 303262 305585 307521 308819 309669 310351 311135 312318 313994
67053 313994 315828 317402 318821 320722 323558 327030 330349 332956 334931 336777 338860 340996 342616 343424
67039 343424 343875 344819 346667 349121 351761 354597 357799 361078 363759 365506 366715 368034 369696 371503 373351
67024 373351 375424 377867 380443 382769 384789 386827 389151 391659 394160 396805 400000 403823 407744 411113
67010 411113 413850 416488 419499 422780 425919 428809 431764 434981 438121 440624 442408 444065 446335 449474
66996 449474 453182 457030 460842 464658 468453 472045 475378 478805 482860 487612 492435 496698 500543 504594
66982 504594 508927 512851 515947 518872 522618 527241 531853 535802 539366 543242 547844 553275 559473 566079
66968 566079 572496 578389 583900 589181 594047 598444 602995 608569 615368 622769 630046 636929 643558 650240
66954 650240 657265 664681 672222 679728 687573 696314 705930 715823 725637 735641 746070 756554 766580
66941 766580 776309 786511 797712 809649 821603 833165 844692 857020 870628 885074 899465 913469
66929 913469 927556 942128 956868 971287 985600 1000559 1016521 1033175 1050224 1067968 1087004
66918 1087004 1107594 1129406 1151699 1173688 1194959 1215790 1237050 1259616 1283731 1308830 1334021
66907 1334021 1358854 1383645 1408968 1434890 1460962 1486958 1513245 1540209 1567689 1595235 1622700
66896 1622700 1650284 1678339 1707442 1738266 1770754 1803648 1835472 1865944 1895819 1925488 1954533
66885 1954533 1982756 2010755 2039009 2066951 2093431 2117742 2139974 2160851 2181486 2202620 2223528
66874 2223528 2242177 2257126 2269019 2279674 2290012 2299472 2307139 2312662 2316127 2317673 2317336 2314829 2309569
66861 2309569 2301441 2291378 2280537 2268886 2255273 2238979 2220492 2200575 2179259 2156221 2131563
66850 2131563 2105717 2078877 2050975 2021993 1992019 1961209 1929948 1898701 1867401 1835336 1802027
66839 1802027 1767974 1734131 1700860 1667922 1635349 1603696 1573316 1543759 1514150 1483964 1453338
66828 1453338 1422749 1392556 1362809 1333489 1304822 1277184 1250598 1224565 1198618 1172898 1147890
66817 1147890 1123729 1100111 1076892 1054351 1032685 1011594 990655 969980 950091 931110 912409
66806 912409 893313 873971 855176 837300 819837 802206 784651 767895 752086 736693 721447
66795 721447 706773 692968 679522 665769 651915 638819 626864 615593 604503 593674 583362
66784 583362 573366 563167 552602 542097 532204 523050 514273 505474 496619 487986 479739 471701 463679
66771 463679 455918 449023 443294 438219 432762 426207 418757 411292 404538 398504 392644 386458 379848 373082
66757 373082 366601 360748 355456 350278 344924 339709 335136 331184 327434 323871 320893 318370 315329 311079
66743 311079 306183 301762 298175 294967 291799 288750 285751 282435 278676 274790 271048 267406 263811 260351
66729 260351 256953 253316 249376 245567 242409 239979 237877 235566 232752 229695 227144 225671 225029 224426 223345
66714 223345 221804 219873 217480 214769 212167 209898 207803 205798 204043 202476 200686 198552 196549 195019
66700 195019 193557 191583 189202 186944 184915 182815 180640 178756 177218 175595 173644 171723 170294 169290
66686 169290 168234 166820 165179 163651 162445 161469 160420 159085 157550 156051 154708 153535 152662 152280 152256
66671 152256 152012 150998 149229 147199 145324 143674 142252 141208 140559 139922 138947 137941 137591 137944 138167 137615
66655 137615 136692 136165 135947 135238 133688 131787 130108 128826 128078 128073 128620 129112 129274 129404 129650 129598 128962 128053
66637 128053 127114 125737 123516 120812 118318 116253 114591 113637 113637 114100 114317 114410 115056 116260 117138 116951 115682
66620 115682 113609 111076 108797 107570 107388 107447 107204 106829 106445 105678 104362 103007 102067 101309 100396 99636 99576
66603 99576 100228 101197 102196 102960 103055 102441 101920 102288 103197 103527 102800 101510 100072 98258 95921 93584 91932
66586 91932 91115 90888 90988 91067 90720 90076 89994 91126 92933 94188 94413 94280 94545 95110 95371 95050 94415 93917 93891
66567 93891 94346 94872 94980 94732 94660 94732 93933 91487 88227 85885 85078 84854 84380 84094 84657 85653 86170 86148 86191
66548 86191 86308 85845 84637 83343 82434 81607 80558 79657 79413 79696 79885 79518 78517 77094 75760 75151 75492
66531 75492 76381 77253 77833 78009 77683 77070 76734 76905 77035 76602 76111 76635 78287 79801 79923 78806 77671 77359
66513 77359 77644 77847 77698 77471 77513 77835 78045 77619 76399 74960 74314 74961 76297 77218 77261 76812 76262 75527 74605
66494 74605 73988 74016 74268 74164 73892 74021 74419 74332 73572 72849 72734 72967 73042 72863 72482 71802 70958 70512 70782 71348
66474 71348 71663 71834 72334 73204 73993 74278 73900 72936 71832 71296 71620 72294 72642 72623 72602 72616 72419 72056 71829 71783
66454 71783 71710 71612 71708 71977 72159 72166 72158 72255 72557 73313 74550 75660 75915 75388 74807 74461 73946 73114 72556 72737 73249
66433 73249 73448 73464 73981 75190 76443 77006 76847 76601 76864 77560 77965 77457 76192 74902 74042 73412 72698 72018
66415 72018 71728 71888 72170 72181 71748 71003 70268 69779 69425 68967 68541 68679 69634 70898 71650 71539 70805 69784 68624
66396 68624 67458 66496 65805 65258 64870 65041 66150 67921 69472 70188 70311 70433 70537 69995 68600 67196 66961
66379 66961 68276 70485 72554 73661 73458 72213 70739 69856 69861 70561 71645 72745 73371 73196 72325 71032 69400
66362 69400 67590 66212 65816 66068 66020 65256 64249 63507 63004 62646 62674 63240 64032 64729 65482 66631 68133 69541
66344 69541 70322 70122 69050 67790 67025 66592 65749 64420 63505 63590 64059 64099 64001 64648 66106 67544 68364 68642
66326 68642 68556 68205 67949 68180 68643 68666 68257 68253 69078 69981 69908 68699 67029 65552 64554 64108 64077 64089 63934 63945 64703
66305 64703 66311 68188 69584 70158 70075 69755 69568 69665 69961 70229 70250 69964 69591 69510 69902 70530 71048 71441 71977
66286 71977 72690 73220 73209 72657 71733 70484 69013 67806 67516 68342 69797 71177 72125 72641 72733 72355 71724 71393
66268 71393 71788 72734 73630 74009 73767 72924 71554 70008 68868 68457 68580 68889 69222 69426 69179 68379 67493 67099
66250 67099 67194 67281 67078 66723 66374 66079 66072 66715 67914 69014 69504 69588 69822 70377 70902 70908 70128 68723 67398 67100
66230 67100 68226 70095 71491 71837 71649 71788 72445 73059 73116 72740 72379 72154 71803 71188 70543 70152 70143 70722 72145
66211 72145 74114 75564 75641 74721 73958 73812 73612 72600 70891 69200 68119 67897 68472 69376 69991 70253 70847
66194 70847 72330 74290 75696 75936 75230 74217 73436 73056 72832 72393 71732 71212 70931 70497 69705 69042 68996 69184
66176 69184 68826 67926 67314 67510 68261 69230 70378 71408 71562 70572 69327 69016 69792 70743 71017 70571 69979 69957
66158 69957 70997 72953 74904 75781 75293 74050 72811 71944 71576 71795 72410 72853 72668 72004 71317 70682 69695
66141 69695 68116 66400 65435 65825 67408 69344 70673 70967 70607 70379 70725 71386 71754 71517 70898 70399 70419 71075
66123 71075 72182 73337 74134 74444 74490 74624 74974 75382 75709 76152 77097 78533 79803 80219 79973 80048 81043 82393
66105 82393 83048 82694 81886 81154 80584 80302 80708 81846 83031 83554 83507 83488 83748 84084 84413 84932 85716 86585 87375
66086 87375 88022 88379 88359 88245 88426 88811 88975 88928 89164 89715 89780 88729 87039 85711 85119 84962 85079 85650 86588
66067 86588 87389 87718 87740 87755 87860 88156 88900 90211 91782 93028 93490 93078 92141 91281 90867 90702 90382 89949 89787
66048 89787 89797 89189 87461 85302 84068 84409 85683 86710 86833 86275 85707 85627 86080 86857 87856 89135 90672
66031 90672 92319 94071 96102 98336 100169 100935 100646 100072 100071 100914 102195 103257 103745 103869 104113 104701 105465
66014 105465 106281 107290 108496 109398 109428 108675 107873 107709 108437 110010 112162 114279 115667 116220 116643 117863 120359
65997 120359 124050 128530 133257 137831 142246 146708 151093 154883 157826 160333 162860 165093 166163 165694
65983 165694 164256 162720 161394 159938 157915 155248 152195 149063 145969 142811 139375 135506 131295 127193
65969 127193 123830 121534 119987 118496 116654 114655 113021 112193 112319 113158 114087 114545 114622 115003 116117 117572
65953 117572 118666 119235 119633 120029 120160 119871 119538 119778 120897 122765 125056 127490 129884 132164 134364 136553
65937 136553 138641 140246 140894 140618 140289 141075 143357 146331 148796 150211 150948 151782 153367 155892 158905 161573
65921 161573 163418 164746 166147 167854 169924 172749 176815 181924 187203 191971 196208 200130 203825 207418
65907 207418 211048 214416 216844 218135 218970 220032 221136 221655 221433 220689 219266 216734 213266 209765 206956
65892 206956 204775 202845 201025 199234 197093 194174 190460 186258 181773 177019 172072 167180 162630 158613
65878 158613 155122 151905 148672 145523 142913 140950 138914 135932 132085 128403 125667 123697 122030 120801
65864 120801 120453 120869 121419 121847 122512 123601 124643 125111 125107 125020 124838 124355 123945 124502 126351 128630 130102 130373
65846 130373 130039 129787 129745 129793 130131 131195 133040 135033 136320 136482 135723 134579 133594 133144 133276 133709 134273 135389
65828 135389 137764 141406 145286 148357 150793 153847 158522 164660 171290 177463 182664 186810 190162 193142
65814 193142 195989 198553 200368 200878 199678 196856 193163 189582 186558 183753 180634 177083 173327 169549
65800 169549 165840 162389 159381 156730 154169 151680 149677 148606 148478 148880 149387 149847 150256 150568 150802 151298
65784 151298 152597 154928 157972 161259 164685 168503 172989 178321 184568 191469 198308 204412 209743 214614
65770 214614 218816 221502 222079 220814 218333 214883 210313 204498 197510 189691 181846 175075 170027 166500
65756 166500 164034 162643 162585 163689 165437 167647 170625 174693 180004 186764 195087 204487 214004 223070 231909
65741 231909 240820 249406 256903 263049 268222 272731 276252 278043 277510 274503 269198 261889 252904 242688
65727 242688 231851 221055 210788 201212 192223 183619 175254 167151 159570 152978 147791 143984 140932
65714 140932 137829 134391 131041 128252 125901 123534 121147 119281 118298 117980 117983 118279 118908 119659 120346 121063 121759
65697 121759 121829 120715 118811 117259 116765 117035 117427 117739 118153 118755 119422 120072 120811 121870 123372 125159 126873
65680 126873 128388 130091 132563 136020 140234 144958 150217 156219 163182 171199 180094 189421 198845 208468
65666 208468 218619 229496 241268 254221 268258 282339 295005 305594 314468 321973 327765 331437
65654 331437 333267 333942 333870 333224 332382 331862 331854 332119 332343 332463 332759 333703 335492 337561 338785 338370 336307 332777
65636 332777 327390 319418 308697 295993 282470 268908 255358 241446 227106 213065 200462 189874
65624 189874 180943 172927 165352 158069 151178 145145 140515 137213 134433 131590 128969 127046 125618 124163
65610 124163 122743 121881 121697 121768 121762 121622 121211 120415 119580 119223 119230 118925 118070 117232 116950 117100 117356 117739 118406 119281
65590 119281 120251 121388 122654 123692 124242 124551 125119 126246 128019 130473 133520 136935 140711 145257 151027
65575 151027 158115 166339 175517 185491 196148 207595 219985 232957 245533 256885 266940 275989
65563 275989 283950 290345 294698 296595 295614 291670 285329 277412 268442 258759 248855 239047 229014 218283
65549 218283 207174 196713 187594 179799 173205 167899 163634 159635 155400 151338 148215 146261 145174 144757
65535 144757 145104 146256 148005 149959 151610 152459 152416 152031 152063 152717 153463 153569 152652 150775 148165 145004 141430
65518 141430 137653 133960 130523 127325 124414 122133 120809 120219 119758 119221 119025 119423 119913 119880 119534 119750 121017
65501 121017 122961 124850 126143 126570 126168 125407 124953 125078 125550 126201 127264 128940 130922 132668 134068 135634
65485 135634 138041 141600 146004 150439 154040 156477 158093 159391 160477 161145 161358 161345 161211 160638 159112 156434
65469 156434 152962 149370 146124 143199 140354 137595 135185 133171 131191 128997 126966 125768 125549 125711 125557
65454 125557 124913 124054 123216 122397 121507 120550 119619 118804 118175 117849 118008 118758 119980 121447 123119 125124 127335
65437 127335 129228 130430 131257 132361 133901 135446 136735 138117 140041 142499 145154 147728 149895 151093
65423 151093 150913 149606 147836 145905 143594 140807 138013 135805 134239 132854 131296 129710 128515 127901 127636
65408 127636 127359 127021 126923 127355 128320 129703 131517 133792 136317 138798 141228 143808 146488 148918 150968 153021
65392 153021 155460 158088 160342 161931 162987 163597 163509 162398 160277 157582 154912 152680 150898 149302 147754
65377 147754 146436 145536 144922 144414 144309 145183 147065 149177 150812 152148 153859 156178 158854 161894 165685
65362 165685 170192 174603 178213 181328 184843 189158 194052 199458 205727 212974 220758 228733 237086 245859
65348 245859 254171 260737 265042 267511 268590 268211 266268 263049 258950 254194 249105 244245 239847 235433
65334 235433 230445 225076 219942 215047 209616 203091 195886 188986 183147 178616 175236 172488 169598 166075
65320 166075 162176 158708 156290 154876 153937 152987 151882 150730 149648 148739 148241 148440 149234 149927 149753 148591
65304 148591 146985 145486 144237 143197 142451 142189 142624 143962 146202 148880 151378 153617 156120 159244 162727
65289 162727 166149 169389 172259 174180 174757 174388 173781 173078 172045 170846 169918 169135 167928 166382 165455 165770
65273 165770 166668 166871 165688 163338 160579 158303 157001 156196 154801 152471 150209 149089 148775 147960 146070
65258 146070 143807 141997 140626 139243 137785 136681 136354 136889 138012 139267 140287 140937 141103 140488 138924
65243 138924 136803 134849 133387 132143 130816 129503 128424 127618 127111 127119 127735 128592 129179 129479 130074 131521 133698
65226 133698 135734 136583 135796 133872 131795 130163 128821 127431 126199 125831 126762 128579 130331 131345 131724
65211 131724 132072 132810 133827 134734 135349 135791 136170 136317 135926 134912 133565 132288 131208 130118 128865 127688
65195 127688 127014 126995 127498 128548 130337 132657 134739 136054 136958 138092 139401 140363 141048 142188 144033 145835
65179 145835 146887 147534 148650 150442 152307 153731 154854 156114 157665 159229 160306 160519 159935 159063 158493
65164 158493 158573 159440 161108 163366 165825 168341 171295 175150 179775 184464 188620 192324 196304 201513 208552
65149 208552 217206 226539 235662 244484 253656 263899 275533 288534 302766 318134 334640 352161
65137 352161 370060 387218 402752 416617 429307 441197 452454 463290 473668 482786 489397 492791
65125 492791 493041 490326 484610 476247 466238 455472 444055 431743 418572 404608 389534 373179
65113 373179 356225 339687 323756 307796 291592 275906 261588 248765 237293 227457 219593 213267
65101 213267 207438 201453 195473 189900 184791 179938 175196 170567 166164 162278 159279 157242 155811 154645
65087 154645 153896 153991 154935 156058 156615 156500 156223 156258 156593 156932 157144 157325 157510 157547 157292 156773 156095 155341 154691
65068 154691 154456 154776 155383 155895 156309 156856 157396 157347 156459 155364 154987 155560 156526 157328 157904 158375 158663 158675 158693
65049 158693 159259 160558 162012 162607 161769 159942 158180 157150 156696 156446 156479 157036 157812 158026 157213 155557 153422
65032 153422 150985 148453 146164 144227 142413 140670 139408 138946 138902 138487 137284 135526 133773 132581 132263
65017 132263 132618 133007 132993 132800 132839 133035 133069 133163 134005 135791 137768 138985 139247 139162 139543 140932 143454 146785
64999 146785 150268 153191 155061 155774 155778 156008 157236 159272 161049 161718 161556 161639 162761 164882 167427 169799
64983 169799 171574 172569 172996 173485 174745 177027 179897 182542 184342 185211 185451 185311 184681 183209 180771 177819
64967 177819 175158 173211 171579 169506 166786 163985 161756 160205 159038 158000 156940 155679 154135 152413
64953 152413 150542 148303 145648 143076 141208 140065 139183 138405 138102 138541 139459 140418 141223 141799 141968 141589 140776
64936 140776 139824 139023 138571 138499 138668 139041 139889 141375 142982 143874 143938 143978 144586 145295 145275 144483 143665 143406 143655
64917 143655 144125 144687 145350 146123 147004 147958 148941 150050 151468 153043 154106 154104 153370 152988 153904 156306 159735
64900 159735 163483 167015 170382 174266 179304 185322 191517 197382 203072 208790 214253 219014 222985 226307
64886 226307 228881 230407 230861 230683 230406 230230 229941 229134 227493 224976 221770 218106 214110 209840 205367 200848
64870 200848 196606 193167 191042 190276 190301 190382 190211 189971 189840 189651 189096 188073 186705 185132 183457 181771 180032
64853 180032 177943 175179 171819 168385 165356 162799 160576 158737 157538 157097 157147 157124 156505 155268 154092 153821
64837 153821 154518 155327 155561 155684 156682 158571 160111 160158 158839 157170 155937 155301 155185 155600 156639 158382 160785
64820 160785 163504 166033 168207 170479 173494 177451 182014 186691 191159 195375 199648 204518 210339 216953
64806 216953 223871 230681 237196 243313 248828 253385 256531 257976 257789 256139 252873 247694 240878 233380
64792 233380 226038 219089 212728 207611 204203 201917 199534 196392 192742 189193 186393 184991 185085 185663 185413
64777 185413 184300 183643 184420 186234 188351 190919 194399 198407 202106 205581 209927 215773 222413 228690 234312
64762 234312 239973 246479 253999 261945 269289 275155 279438 282859 286215 289529 292079 293261 293266 292843 292541
64747 292541 292341 291943 291132 289778 287657 284515 280275 275042 268927 262016 254498 246723 239086 231952 225710
64732 225710 220684 216861 213757 210718 207476 204394 202144 201076 200933 201152 201416 201767 202289 202898 203506 204197
64716 204197 205119 206364 208123 210701 214163 218016 221465 223921 225143 225118 224081 222570 221098 219797 218529
64701 218529 217174 215525 213088 209522 205302 201498 198772 196971 195697 194772 193956 192772 191057 189337 188264
64686 188264 187857 187682 187622 188066 189391 191544 194179 197013 200093 203813 208590 214372 220574 226621 232418
64671 232418 238216 244283 250840 258035 265566 272482 277725 280893 282246 282094 280477 277361 272799 266886
64657 266886 259911 252572 245676 239488 233683 228090 223219 219806 218011 217310 217061 216986 217148 217730 218900 220805
64641 220805 223578 227327 232056 237627 243894 250987 259283 268945 279523 290225 300649 310922 320941
64628 320941 329739 336049 339510 340860 340834 339351 336132 331639 326685 321283 314684 306730 298420 290710 283369
64613 283369 275642 267706 260683 255331 251390 248369 246288 245345 245245 245329 245196 244957 244954 245432 246353 247347 247916
64596 247916 247882 247550 247238 246788 245781 244172 242380 240630 238532 235614 232167 229211 227477 226665 225928 224992
64580 224992 224537 225424 227764 230861 233922 236553 238627 239993 240507 240274 239644 238905 238086 237084 235867 234393
64564 234393 232419 229628 226011 221963 217872 213766 209499 205142 200948 197001 193180 189490 186166 183423
64550 183423 181290 179771 178977 179018 179926 181690 184083 186444 187989 188519 188555 188624 188739 188828 189288 190609 192577
64533 192577 194286 194975 194567 193461 192148 191045 190367 190028 189806 189614 189473 189265 188806 188157 187639 187532 187932
64516 187932 188823 190017 191081 191678 192030 192729 194073 195911 198220 201352 205439 209907 213990 217571 221290
64501 221290 225902 231716 238540 245916 253466 261169 269196 277361 284807 290499 293965 295501 295658 294672 292353
64486 292353 288437 283106 277170 271557 266588 261910 257225 252771 248900 245483 242124 238800 235913 233724
64472 233724 232074 230656 229212 227477 225264 222766 220497 218875 218057 218176 219350 221315 223424 225268 226990
64457 226990 228782 230419 231694 232971 234777 236927 238642 239563 240122 240788 241477 241993 242605 243722 245335 247239
64441 247239 249645 253078 257718 263267 269511 276559 284433 292887 301877 311903 323618 337332 353133
64428 353133 371234 391860 414954 440363 468296 499330 534089 573279 618025 669710 729210
64417 729210 796504 871195 953060 1041588 1134843 1229088 1319982 1404455 1481511 1551231 1613048
64406 1613048 1665069 1704991 1731253 1743128 1740211 1722628 1691888 1650825 1602037 1546388 1483181
64395 1483181 1411605 1331796 1244942 1153163 1059512 967564 880431 799982 726986 661741 604365
64384 604365 554674 512151 476156 446003 420767 399193 380069 362766 347332 333983 322553
64373 322553 312540 303597 295762 289082 283204 277541 271773 265994 260414 255119 250133 245468 241020 236662
64359 236662 232568 229196 226733 224766 222809 221051 220289 221114 223464 226947 231276 236241 241581 247073 252616
64344 252616 258087 263239 267815 271630 274446 276010 276286 275415 273322 269712 264698 259163 254144 250128 247205
64329 247205 245571 245279 245711 246006 246097 246766 248480 250706 252591 253836 254594 254922 254731 254013 252746 250813 248312
64312 248312 245766 243685 242064 240545 238877 236925 234485 231497 228302 225332 222554 219564 216134 212442
64298 212442 208872 205875 203855 202776 201978 200865 199765 199642 200899 202899 204787 206336 207791 209346 211150
64283 211150 213561 217002 221615 227185 233241 239126 244254 248660 253151 258572 264905 271320 277143 282520
64269 282520 288022 293772 299191 303553 306571 308292 308614 307289 304519 301259 298630 297118 296499 296362 296375
64254 296375 296201 295559 294444 292947 290748 287120 281617 274589 266873 259186 251902 245203 239251 234257 230428
64239 230428 227750 225872 224420 223371 222886 222820 222791 222691 222729 222842 222598 221908 221345 221422 221927 222397 222803 223278 223509
64220 223509 223041 222069 221241 220702 219876 218330 216254 213929 211218 207956 204505 201569 199574 198461 197957 197827
64204 197827 197948 198318 198990 199931 201027 202269 203785 205609 207546 209415 211311 213557 216489 220366 225371
64189 225371 231483 238403 245781 253575 262113 271754 282525 294066 305824 317186 327403 335555 340746
64176 340746 342398 340268 334331 324924 313131 300708 289166 278906 269372 260078 251246 243477 237028
64163 237028 231555 226419 221193 216022 211553 208391 206563 205574 204964 204592 204423 204399 204707 205812 207882 210358
64147 210358 212521 214388 216605 219450 222419 225006 227407 230039 232641 234426 235102 235269 235679 236454 237201
64132 237201 237555 237358 236577 235354 234028 232832 231715 230697 230212 230755 232249 234161 236190 238516 241375
64117 241375 244842 249096 254445 260875 267988 275617 284077 293475 303147 312319 321108 330273 339942 349085
64103 349085 356362 361216 364058 365768 367178 368781 370720 373125 376508 381573 388519 396638 404757 411932
64089 411932 417680 421712 423749 423638 421482 417539 412021 405161 397474 389738 382379 374929 366418 356513
64075 356513 346023 336154 327533 320176 314018 308931 304431 299962 295620 292121 289937 288792 288144 287703
64061 287703 287284 286565 285424 284263 283594 283394 283223 282956 283112 284390 287004 290551 294438 298435 302848 308143
64045 308143 314452 321565 329366 338036 347702 358112 368840 379698 390782 402217 413942 425550
64033 425550 436213 445023 451654 456517 459958 461509 460309 456239 450188 443226 435949 428833 422709 418377
64019 418377 415878 414479 413313 411796 409534 406245 401919 396791 391003 384469 377255 369926 363270 357672
64005 357672 352908 348499 344162 339998 336477 334186 333334 333418 333593 333460 333283 333386 333653 333788 333834 334149 335095
63988 335095 336969 339999 344049 348495 352803 357135 362024 367611 373693 380431 388363 397549 407297 416998
63974 416998 426714 436680 446773 456922 467618 479441 492344 505961 520370 536076 553365 572248
63962 572248 592911 615716 640761 667957 697532 729944 765323 803657 845779 893582 948886
63951 948886 1012504 1084794 1166776 1260190 1366652 1487203 1622718 1774292 1942973 2129010
63941 2129010 2331342 2547791 2775904 3013633 3259043 3509341 3760458 4007647 4246073
63932 4246073 4470529 4675038 4853524 5001240 5115435 5194708 5238071 5244726 5214351 5147158
63922 5147158 5043738 4905287 4734386 4535610 4315147 4079635 3835141 3586902 3339381
63913 3339381 3096097 2859562 2631909 2415729 2213969 2028831 1861058 1710418 1576513
63904 1576513 1458764 1355882 1265914 1186964 1117698 1057191 1004598 959012 919454 884850 854096
63893 854096 826238 800662 777115 755511 735539 716446 697452 678423 659873 642191 625218
63882 625218 608823 593520 580044 568540 558695 550525 544432 540510 538378 537880 539381 543151 548910
63869 548910 556319 565443 576332 588444 601007 613857 627461 642118 657409 672482 686640 699666
63857 699666 711790 723350 734333 744250 752521 758896 763341 765661 765474 762586 757211 749815 740805 730346
63843 730346 718359 704752 689648 673311 655778 636774 616147 594243 571695 549017 526630
63832 526630 505080 484869 466028 448150 430913 414403 398849 384250 370361 357018 344406
63821 344406 332980 323023 314310 306361 299075 292829 287842 283740 280005 276524 273367 270320 267163 264237
63807 264237 262113 260687 259173 257107 254862 253033 251781 250962 250349 249424 247463 244284 240650 237540 235264
63792 235264 233585 232377 231593 230831 229542 227744 226047 224910 224214 223639 223078 222480 221664 220567 219448 218525
63776 218525 217500 215785 213282 210764 209286 209265 210173 211087 211409 211108 210474 209775 209104 208422 207747 207283 207207 207304
63758 207304 207073 206361 205667 205533 205918 206493 207329 208698 210293 211316 211471 211306 211368 211588 211808 212342 213546 215228
63740 215228 216935 218564 220314 222334 224781 227779 230878 233010 233653 233747 234731 236876 239264 241312 243444
63725 243444 246199 249447 252798 256199 259764 263440 267098 270664 273962 276795 279321 281951 284706 287040
63711 287040 288458 288940 288655 287722 286482 285514 285047 284645 283735 282175 280153 277995 276333 275934 276849 278089
63695 278089 278666 278727 279226 280695 282849 285259 287895 290926 294382 298070 301625 304728 307435 310152 312964
63680 312964 315221 316151 315767 314770 313650 312389 311052 310149 310166 311043 312323 313629 314862 316074 317293 318356
63664 318356 318901 318671 317831 316813 315802 314501 312503 309756 306620 303508 300487 297254 293585 289785 286425
63649 286425 283544 280468 276716 272820 269771 267859 266562 265503 264928 265149 266079 267573 269763 272716 276097
63634 276097 279520 283001 286778 290960 295644 301103 307395 313905 319736 324643 329318 334729 341412 349421
63620 349421 358615 368857 380086 392398 405968 420819 436746 453561 471313 490125 509893 530380
63608 530380 551723 574714 600319 628758 659055 689454 718140 743567 764429 779787 789326 793303
63596 793303 792283 787205 779715 771876 765065 759188 753236 746470 738728 729687 718384 703818 685919
63583 685919 665640 644159 622113 599677 577199 555527 535586 517861 502506 489804 480051 472846
63571 472846 467093 462086 458306 456650 457171 459193 462474 467438 474109 481626 489222 497091 505834 515493
63557 515493 525647 536050 546635 557285 568207 580222 594014 609344 625775 643955 665250
63546 665250 690138 717976 748477 782112 818301 854006 884981 908075 921883 926197 922068 912177
63534 912177 899822 887184 875037 863924 854609 847182 840595 833520 825053 814265 799770 780468
63522 780468 756497 729026 699368 668620 637845 607970 579457 552397 526959 503485 482209
63511 482209 463119 446121 431112 417865 405950 394897 384458 374758 366154 358852 352644 347112
63499 347112 342065 337616 333888 330807 328196 325877 323706 321694 320067 318933 317996 316981 316288 316654 317998
63484 317998 319156 319188 318542 318441 319450 321209 323383 326193 329858 333988 337888 341303 344594 348125 351627
63469 351627 354312 355696 356081 355941 354941 352084 346987 340597 334372 329147 325163 322726 322114 322896 324020
63454 324020 324766 325247 325897 326898 328366 330801 334911 340912 348188 355782 363298 371211 380233 390421 401142
63439 401142 411878 422761 434265 446867 461201 478131 498144 520845 545341 570779 595990
63428 595990 618875 637041 649509 657571 663785 670250 677822 686647 697174 710518 727786 749115
63416 749115 773697 800850 830565 862657 895790 927936 957495 983315 1003861 1017380 1023244 1022527
63404 1022527 1017038 1008269 997494 986132 975298 965145 954992 943967 931240 915887 896996 874052
63392 874052 847161 817052 784898 751976 719292 687518 657226 628955 603040 579606 558758
63381 558758 540526 524622 510600 498446 488719 481911 477839 475824 475331 476320 479155 484274 491828 501519
63367 501519 512849 525520 539508 554824 571411 589201 608045 627769 648570 671181 696227
63356 696227 723475 752183 782021 813073 844978 876679 907043 935021 959087 977361 988766
63345 988766 993573 992644 986898 977818 967523 957452 947430 936673 925163 913291 900585 885718
63333 885718 867679 846200 821308 793318 763287 732711 702634 673585 646354 622075 601329
63322 601329 583773 568901 556734 547513 541132 536953 533724 529482 522123 510635 495740 479159 462383
63309 462383 446184 430923 416953 404683 394322 385576 377736 370296 363459 357763 353272 349437 345740
63296 345740 342102 338628 335372 332496 330260 328519 326543 323672 320012 316201 312624 309159 305635 302152
63282 302152 298828 295582 292452 289975 288767 288640 288527 287664 286618 286660 288198 290366 292196 293584 294855
63267 294855 295973 296707 297171 297647 298151 298667 299548 301097 302966 304625 306331 308916 312547 316376 319623 322480
63251 322480 325660 329463 333544 337346 340599 343683 347600 353252 360650 369050 377869 387064 396632 406300
63237 406300 415978 426104 437278 449827 463837 479272 495818 513012 530754 549436 569372 590350
63225 590350 611853 633360 654321 674276 693265 711783 730170 748448 766947 786462 807314
63214 807314 828663 849250 868490 886370 902572 916279 926685 933166 935057 931816 923448 910465
63202 910465 893467 873133 850476 826645 802436 778370 755216 734018 715422 699307 685271
63191 685271 673318 663971 657772 654752 654411 656273 660424 667221 676489 687440 699621 713520 729797
63178 729797 748234 767890 787970 807978 827308 845476 862804 880154 897797 915099 931448
63167 931448 946889 961485 974536 984858 991615 994590 993843 989328 980705 967465 949494 927549 902814
63154 902814 875914 846837 815951 784425 753296 722722 692828 664754 639996 618821 600150
63143 600150 583050 567614 554228 542751 532808 524254 516884 510168 503915 498879 495965 494872 494171
63130 494171 492852 491241 490196 489964 490261 491085 492848 495748 499471 503643 508254 513503 519354 525359 530816
63115 530816 535149 538324 540951 543756 546862 549740 551886 553344 554527 555743 557057 558433 559825 561199
63101 561199 562567 563882 564879 565218 564908 564358 563932 563696 563757 564447 565773 566983 567223 566591 566050 566262 566937 567484
63083 567484 567860 568526 569775 571443 573244 575238 577886 581629 586391 591626 596883 602129 607416 612603 617849
63068 617849 624053 632137 641884 652127 662240 672859 684886 698465 713333 729665 747902 768123
63056 768123 790248 814700 842174 872680 905355 939420 974930 1012484 1052506 1094990 1139669
63045 1139669 1186218 1234334 1283671 1333659 1383584 1433041 1482209 1531367 1580261 1628288 1675301
63034 1675301 1721804 1768279 1814630 1860323 1904586 1946266 1983844 2015919 2041498 2059652 2069160
63023 2069160 2068746 2057523 2035136 2001849 1958850 1908228 1852256 1792727 1731173 1669388 1609299 1552424
63011 1552424 1499824 1452464 1411108 1375901 1346557 1323137 1306268 1296456 1293543 1296957 1306084 1320142
62999 1320142 1338118 1359223 1383243 1410163 1439633 1471102 1504172 1538360 1572617 1605683 1637094
62988 1637094 1667536 1698022 1728904 1759663 1789275 1816521 1840155 1859019 1872022 1878016 1875961 1865353
62976 1865353 1846341 1819243 1784190 1741467 1692039 1637404 1578933 1517684 1454891 1392265 1331548
62965 1331548 1273850 1219546 1168654 1121123 1076837 1035673 997657 962921 931396 902626 876037
62954 876037 851315 828381 806990 786560 766489 746567 726979 708039 690024 673141 657399
62943 657399 642424 627618 612659 597813 583707 570837 559332 549121 540213 532758 526810 522012
62931 522012 517657 513232 508869 505099 502216 500112 498653 497803 497268 496468 495192 493950 493256 492863 492173 491116
62915 491116 489974 488475 485906 482378 479187 477400 476547 475259 472839 469596 465958 461995 457880 454099
62901 454099 450898 447914 444668 441223 438103 435732 434136 433123 432500 432045 431380 430081 428158 426374 425742
62886 425742 426437 427437 427574 426805 426146 426438 427631 429219 430836 432227 433092 433320 433192 433140 433410 433989 434657
62869 434657 435037 434901 434487 434160 433697 432407 430234 428239 427559 428238 429513 430875 432330 433881 435426 437078
62853 437078 439023 441081 442883 444477 446267 448366 450472 452337 453864 454818 455093 455243 456023 457234 457754
62838 457754 457000 455632 454444 453321 451902 450541 449801 449483 449058 448734 449153 450137 450716 450517 450269 450683 451577
62821 451577 452513 453660 455474 457974 460831 463894 467188 470565 473812 476980 480283 483703 487015 490097
62807 490097 493012 495888 498971 502660 507129 511990 516699 521324 526596 533172 541117 550141 559931 570090
62793 570090 580176 590174 600766 612818 626786 642887 661622 683634 709112 737807 769769 805600
62781 805600 845819 890394 939170 992363 1050257 1112711 1179350 1249888 1323643 1398957 1473704
62770 1473704 1546368 1615972 1680977 1738981 1787810 1826255 1853405 1867946 1868806 1856148 1831153 1795116
62758 1795116 1749330 1695564 1635800 1571361 1502886 1431359 1358702 1287026 1217614 1150829 1086811
62747 1086811 1025972 968899 916021 867479 823285 783435 747704 715419 685815 658745 634702
62736 634702 613963 596032 580242 566437 554598 544154 534396 525447 518099 512615 508294 504401 500983
62723 500983 498586 497608 498120 499894 502447 505456 509261 514530 521309 528895 536871 545749 556380 569264
62709 569264 584728 603144 624419 647731 672405 698846 728176 761204 798180 839222 884292
62698 884292 932906 984476 1039024 1097092 1158913 1224017 1291592 1360737 1430299 1498816 1564765
62687 1564765 1626514 1682005 1728795 1764727 1788484 1799567 1797923 1783674 1757076 1718700 1669705
62676 1669705 1611857 1547190 1477764 1405676 1332869 1260628 1189552 1120341 1054310 992672 935624
62665 935624 882705 833891 789679 750130 714513 682034 652377 625425 601066 579513 561171
62654 561171 545777 532132 519206 507094 496380 486833 477404 467475 457597 448877 442012 437016 433478
62641 433478 430816 428451 426022 423465 420908 418602 416966 416454 417144 418484 419649 420186 420200 419928 419296 418071
62625 418071 416304 414388 412647 411078 409597 408412 408084 409209 412017 416084 420475 424421 427994 431910
62611 431910 436637 441956 447541 453600 460591 468549 477070 485937 495426 505972 517726 530414 543602
62598 543602 557271 572375 590509 612687 638486 666625 696108 726606 758143 790979 825500
62587 825500 861459 897297 930878 960905 987036 1008643 1024300 1032812 1034125 1028921 1017900 1001730
62575 1001730 981038 955966 926333 892752 857115 821413 786481 752446 719833 689399 661172
62564 661172 634560 609423 586294 565530 546957 530457 516203 504072 493458 484003 476016 469747
62552 469747 464642 459777 454803 450143 446363 443667 441885 440694 439860 439410 439543 440277 441293 442232 443019 443792
62536 443792 444646 445510 446159 446288 445819 445264 445525 447110 449704 452750 456226 460570 466065 472805 481205 491982
62520 491982 505437 521226 539057 559216 582001 606999 633509 661628 692383 726667 764380
62509 764380 804671 846626 889543 932852 976018 1018303 1058408 1094617 1125546 1150622 1169684
62498 1169684 1182454 1188749 1189011 1184163 1175026 1162315 1147285 1131931 1118342 1107924 1101310 1098806 1100880
62485 1100880 1108289 1121619 1140568 1163939 1190723 1220999 1255354 1293546 1334178 1375383 1414930
62474 1414930 1449706 1476355 1493293 1501539 1502880 1497532 1484053 1460975 1427791 1384830 1333320 1275630
62462 1275630 1214597 1152279 1089790 1028230 969020 913169 860975 812812 769544 731665 698568
62451 698568 669304 643801 622715 606249 593697 584158 577166 572480 569642 568073 567416 567570 568499 570183
62437 570183 572718 576212 580482 584947 589062 592828 596580 600004 601639 599851 594408 586716 578317 569553
62423 569553 559951 549453 538567 527460 515714 503337 491485 481650 474306 468690 463743 458810 453580
62410 453580 448003 442492 437717 433788 429944 425419 420451 416015 412734 410521 409179 408703 408837 408906 408533
62395 408533 408159 408443 409436 410733 412264 414405 417344 420751 424122 427066 429219 430337 430726 431317 433023
62380 433023 436134 440381 445344 450610 455795 460810 466101 472384 480030 488812 498238 508026 518298 529487
62366 529487 542136 556664 573166 591436 611291 632935 656958 683965 714255 747921 785145
62355 785145 826146 870756 918247 967745 1018702 1070646 1122416 1171781 1215953 1252540 1280211
62344 1280211 1298770 1308815 1311259 1306962 1296663 1281032 1260640 1235821 1206715 1173545 1136906 1097812
62332 1097812 1057526 1017302 978227 941236 907199 876784 850121 826699 805851 787292 770947
62321 770947 756226 741844 726648 710451 693771 676843 659296 640915 622359 604714 588421
62310 588421 573017 557987 543557 530404 518842 508619 499410 491164 483957 477809 472726 468661 465308
62297 465308 462181 459015 455909 452985 450135 447292 444662 442514 440980 440294 440925 443079 446245 449638 453012
62282 453012 456720 461062 466011 471521 477626 484160 490815 497602 504914 512971 521561 530508 540130 551070
62268 551070 563880 578875 596035 614887 634806 655708 678212 702936 729956 759207 791092
62257 791092 826224 864754 906367 950860 998348 1048816 1101741 1156050 1210107 1261723 1308520
62246 1308520 1348522 1380405 1403423 1417447 1423031 1421018 1411909 1395837 1373054 1344018 1308842 1267192
62234 1267192 1219196 1166275 1110687 1054332 998346 943747 891939 844253 801156 762166 726535
62223 726535 693951 664668 639045 616951 597597 580032 563870 549446 537240 527249 518997 511943
62211 511943 505683 499897 494452 489584 485686 482791 480498 478541 477141 476595 476778 477441 478804 481399 485284
62196 485284 489870 494685 499876 505663 511614 516950 521555 526327 532431 540373 549792 559869 569790 579060
62182 579060 587757 596561 606304 617183 628401 638706 647434 655013 662382 670074 677986 685987 694502
62169 694502 704407 716541 731448 749425 770611 794975 822475 853268 887651 925547 965972 1007043
62157 1007043 1046573 1082661 1113803 1138756 1156739 1167885 1173241 1174013 1170729 1163158 1150840 1133546
62145 1133546 1111455 1085283 1056324 1026109 995864 966354 938138 911681 887217 864805 844698
62134 844698 827433 813396 802447 794098 787860 783262 779692 776490 773228 769853 766584 763656 761092
62121 761092 758717 756523 754977 754785 756447 760239 766352 774389 782629 788548 790562 788954 784867 779056
62107 779056 772194 765711 761150 758661 756845 754144 749703 742984 733654 722367 710914 700923 692727 685921
62093 685921 680520 676974 675372 675322 676512 678816 681897 685277 688970 693547 699386 706148 713217 720472 728387
62078 728387 737488 747922 759574 772457 786799 802678 819746 837522 855933 875207 895221 915379
62066 915379 935440 956077 978184 1001860 1026573 1052095 1078651 1106109 1133663 1160452 1185893
62055 1185893 1209079 1228361 1242078 1249599 1251427 1248482 1241542 1231065 1217102 1199431 1177946 1152804
62043 1152804 1124089 1091729 1056137 1018635 980769 943379 906741 871357 837886 806359 776273
62032 776273 747666 721442 698280 677818 659374 642869 628398 615292 602448 589556 577308
62021 577308 566260 556111 546304 536789 527771 519132 510607 502375 494949 488453 482402 476380 470676 465964
62007 465964 462483 459798 457435 455554 454854 455863 458450 461943 465618 469065 472283 475509 478847 481946
61993 481946 484162 485169 485414 485785 486726 487684 487501 485400 481661 477295 473013 468533 462988 455917 447698
61978 447698 439042 430453 422305 415076 409038 403827 398724 393485 388583 384494 380973 377275 373037 368774
61964 368774 365429 363478 362526 361756 360700 359513 358575 358066 357962 358247 358955 360107 361741 363800 365915 367627
61948 367627 369153 371718 376609 383848 392170 400402 408490 417114 426675 437018 447910 459429 471803
61935 471803 485018 498690 512365 525973 539865 554254 568672 582196 594173 604543 613489 621085
61923 621085 627266 631860 634561 635200 634109 631862 628631 624243 619083 614430 611400 609824 608635 607264
61909 607264 606254 606656 609236 614187 621114 629169 637573 646141 655059 664067 672199 678451 682399 683947
61895 683947 682843 678872 672413 664309 655063 644532 632657 620188 608263 597377 587281 577953 570028
61882 570028 563880 558672 552971 546121 538429 530114 520856 510588 500052 490082 480803 471937 463493 455736
61868 455736 448815 442916 438459 435590 433736 432255 431360 431757 433538 436164 439534 444291 450848 458895 468214
61853 468214 479296 492555 507433 522950 538877 555794 574127 593705 614193 635393 656941
61842 656941 678120 698150 716423 732373 745452 755416 762399 766506 767537 765382 760551 754077 746901
61829 746901 739561 732508 726449 722242 720524 721554 725310 731558 739826 749402 759400 768807 776525 781523
61815 781523 783074 780913 775201 766404 755095 741673 726215 708716 689553 669619 649945 631222
61803 631222 613701 597396 582232 568046 554581 541554 528798 516472 505148 495539 487952 482029
61791 482029 477050 472430 467887 463322 458759 454458 450884 448441 447132 446543 446193 445921 445801 445694 445098 443727
61775 443727 442049 440887 440536 440638 440936 441640 442895 444340 445605 446936 448910 451705 454913 458010 460799
61760 460799 463578 467000 471442 476269 480081 482138 483256 484889 487625 491004 494427 497485 499564 500013
61746 500013 498878 496927 494761 492377 489593 486294 482239 477385 472585 469172 467387 465914 463529 460612
61732 460612 458386 457169 456238 455208 454661 455323 457260 460101 463514 467187 470652 473506 475707 477518 479170
61717 479170 480617 481618 482058 482243 482740 483824 485179 486293 487043 487678 488319 488673 488284 486918 484729 482131
61701 482131 479494 476905 474287 471733 469524 467747 466103 464318 462524 460966 459448 457419 454643 451583
61687 451583 449020 447377 446405 445439 444019 442281 440677 439337 437971 436475 435270 434672 434228 433145 431277
61672 431277 429235 427468 425757 423754 421608 419701 418075 416490 414913 413589 412593 411629 410393 408965 407651
61657 407651 406526 405372 404110 403153 403143 404336 406333 408438 410208 411683 413170 414869 416626 418099 419220
61642 419220 420453 422343 424818 427202 429098 430952 433498 436778 440032 442549 444253 445393 445949 445665 444613
61627 444613 443389 442517 441729 440111 437078 433009 428707 424464 420084 415703 411961 409098 406443 403300 400006
61612 400006 397512 395993 394464 391921 388367 384501 380725 376875 372742 368509 364534 360874 357221 353320
61598 353320 349307 345482 341812 337937 333747 329667 326109 322901 319563 316011 312599 309509 306509 303436
61584 303436 300511 297928 295414 292558 289558 287320 286614 287202 287956 287906 287074 286131 285453 284881 284459 284820 286407
61567 286407 288602 290179 290630 290610 291044 292168 293506 294386 294362 293459 292224 291319 290943 290894 291175 292203 294226
61550 294226 296911 299698 302278 304529 306336 307784 309235 310850 312244 312960 313107 313177 313450 313998 315051 316785
61534 316785 318734 320008 320290 320185 320364 320755 320846 320402 319478 317997 315791 313083 310530 308701 307698 307313
61518 307313 307271 307213 306717 305584 304076 302697 301733 301109 300674 300496 300796 301677 303047 304751 306637 308352 309239
61501 309239 308741 307031 305112 304066 304170 304820 305283 305351 305311 305504 306097 307171 308809 311000 313503 315871 317668
61484 317668 318756 319424 320101 320869 321401 321575 322030 323763 326978 330617 333295 334638 335419 336375 337259 337329 336560
61467 336560 335991 336717 338746 341073 342741 343558 343790 343509 342549 341032 339609 339043 339580 340776 341896 342485
61451 342485 342641 342799 343223 343668 343593 342706 341319 340153 339777 340212 341008 341687 342071 342223 342238 342289 342752 343932 345570
61432 345570 346974 347905 349032 351132 353978 356468 357852 358421 358870 359400 359687 359494 359054 358930 359594 361039
61416 361039 362685 363858 364420 364754 365034 364857 363791 362106 360599 359710 359113 358242 357098 356311 356330 356662 356229
61399 356229 354623 352666 351420 350905 350383 349743 349791 350976 352561 353554 353948 354484 355595 357137 358846 360447
61383 360447 361516 361885 362160 363250 365356 367859 370214 372443 374761 377247 379995 383121 386407 389320 391574
61368 391574 393369 394954 396281 397279 398135 399060 399990 400738 401317 401962 402953 404487 406593 409112 411909 415097
61352 415097 418895 423309 428196 433551 439396 445415 451094 456288 461239 465938 469862 472609 474431 475906
61338 475906 477369 478895 480527 482167 483477 484155 484222 483823 482972 481697 480260 478939 477725 476421 474945
61323 474945 473336 471685 470263 469521 469632 470195 470677 471062 471743 472932 474549 476704 479854 484315 489821 495719
61307 495719 501540 507345 513702 521340 530672 541498 553212 565222 577020 587958 597261 604410 609367
61294 609367 612353 613612 613485 612452 610715 607864 603332 597274 590644 584251 578010 571386 564321 557313
61280 557313 550721 544504 538670 533486 529062 525189 521886 519718 519190 520082 521724 523617 525414 526628 526968
61265 526968 526840 526912 527286 527646 528169 529602 532330 536015 540387 545719 552120 558881 565027 570222 574689 578516
61249 578516 581505 583615 585101 586147 586613 586150 584526 581862 578667 575521 572669 570004 567367 564659 561713
61234 561713 558457 555197 552397 550091 547914 545800 544213 543564 543903 545395 548522 553371 559148 564856 570141
61219 570141 575110 579780 584253 589159 595285 602755 610976 619289 627341 634913 641789 647806 652924 657346
61205 657346 661619 666189 670715 674339 676952 679622 683302 687792 692688 698689 706863 716965 727719 738737
61191 738737 750875 764423 778031 790052 800067 808467 815243 820031 822913 824375 824586 823362 820798
61178 820798 817403 813494 808784 802684 794884 785664 775811 766211 757358 749147 741065 732474 722853 712025
61164 712025 700293 688203 676124 664175 652479 641178 630214 619384 608772 598812 589755 581325
61152 581325 573199 565713 559782 556104 554598 554662 555787 557651 559553 560113 558026 553199 546820 540198 533926
61137 533926 528288 523791 520706 518491 516414 514632 513946 514643 516293 518715 522377 527662 534392 542339 551570
61122 551570 561979 573087 584725 597473 611966 628157 645672 664539 685051 707120 730143
61111 730143 753413 776373 798669 820231 841169 861355 880342 897872 914160 929365 943064
61100 943064 954570 963518 969709 972636 971742 967172 959813 950472 939283 926051 910863 894156 876319
61087 876319 857486 837799 817765 798227 779906 763034 747400 732573 718048 703484 689134
61076 689134 675893 664605 655383 647848 641798 637242 633973 631651 630237 629783 629906 630095 630616 632364 635706
61061 635706 640134 645285 651573 659385 668299 677560 686884 696456 706575 717680 730230 744240 759399
61048 759399 775876 794346 814890 836641 858989 882406 907473 933885 961214 989895 1020561
61037 1020561 1052866 1085929 1119556 1154167 1189935 1226916 1265668 1306731 1349766 1394132 1440014
61026 1440014 1488038 1538047 1589333 1641832 1696048 1752077 1810073 1871736 1940105 2017774 2106410
61015 2106410 2207987 2325037 2459305 2611423 2782554 2975735 3195787 3449209 3744244
61006 3744244 4089566 4492405 4959200 5498370 6121474 6842472 7678911 8655145 9803232
60997 9803232 11160864 12767232 14646045 16760746 18958939 20966498 22478304 23306556
60989 23306556 23476779 23198224 22748089 22369229 22227107 22387856 22779891 23175053 23254992
60980 23254992 22756651 21600056 19905778 17905599 15829634 13842236 12034403 10441607
60972 10441607 9063949 7883932 6879913 6031412 5318275 4720452 4220142 3802373 3453041
60963 3453041 3158180 2905870 2687479 2496454 2327168 2175543 2039472 1917593 1808185
60954 1808185 1709688 1621337 1542530 1472255 1409664 1354432 1305688 1261161 1218240 1175668 1133655
60943 1133655 1092750 1053318 1015831 980818 948433 918424 890517 864418 839590 815439 791797
60932 791797 768970 747355 727155 708384 690931 674766 660134 647304 636013 625490 615354
60921 615354 606158 598676 592911 588213 584184 580963 578636 576878 575327 574015 573183 572792 572419 571658 570604
60906 570604 569796 569628 569847 569846 569370 568729 568338 568399 569034 570339 572091 573709 574644 574599 573336 570827 567725 565058
60888 565058 563026 560587 556759 551867 546843 541745 535753 528451 520234 511456 502008 491949 481825 472069
60874 472069 462667 453704 445676 438867 432901 427319 422233 417976 414465 411384 408770 406920 405926 405713 406388
60859 406388 408069 410427 412933 415552 418680 422270 425541 427890 429704 431831 434479 437131 439438 441684
60845 441684 444216 446933 449661 452678 456315 460151 463229 465183 466635 468171 469427 469679 468932 467798 466492
60830 466492 464664 462271 459890 457930 456177 454417 452902 451734 450392 448537 446832 446079 445775 444455 441600
60815 441600 438311 435769 433752 431196 427677 423667 419652 415599 411211 406240 400572 394410 388339 382861
60801 382861 377891 373040 368309 364097 360492 357011 353210 349200 345390 341995 339015 336423 334195 332293
60787 332293 330778 329763 329183 328820 328658 328920 329639 330534 331528 333012 335237 337766 339990 341974 344291 347129
60771 347129 350097 352933 355901 359349 363312 367711 372546 377650 382545 386807 390381 393367 395709 397360
60757 397360 398559 399689 400813 401468 400932 398715 394986 390567 386413 383034 380408 378354 376748 375525 374735
60742 374735 374562 374915 375025 373843 370971 366848 362052 356897 351766 347149 342997 338606 333641 328867 325316
60727 325316 323033 321196 319212 317123 315112 313222 311579 310358 309418 308419 307324 306465 306082 306157 306659 307595
60711 307595 308784 309984 311274 312969 315073 317173 318903 320272 321480 322706 324068 325572 327135 328910
60697 328910 331468 335277 340053 344985 349509 353523 357030 360097 363109 366422 369702 372192 373705 374830
60683 374830 376024 377135 377985 378757 379477 379683 379021 377761 376374 375005 373675 372588 371917 371618 371689 372134 372404
60666 372404 371420 368619 364614 360480 356842 353937 351903 350407 348566 345911 343033 340693 338800 337064
60652 337064 336077 336690 338517 340176 341062 341962 343736 346255 348867 351106 352593 352947 352184 350705 348538 345181
60636 345181 340582 335769 332026 329712 328285 327149 326086 325113 324405 324287 324931 326038 327025 327543 327687 327738
60620 327738 327790 327635 327072 326360 326199 327020 328425 329584 330077 330009 329416 328172 326600 325633 325997 327500 329341
60603 329341 330885 331944 332600 333020 333317 333440 333350 333364 334007 335404 337125 338824 340711 343123 345906 348534
60587 348534 350648 352214 353307 354054 354671 355316 355881 356164 356233 356497 357444 359314 361958 364988 368148 371489
60571 371489 375082 378760 382474 386891 393075 401372 410937 420647 430188 440017 450445 461049 470819 478728
60557 478728 484258 487454 488418 486897 482827 477203 471753 467553 464531 462588 462411 464550 468321 472534 477031
60542 477031 482655 489828 498084 507158 517663 530305 544996 561131 578232 595850 613129 628962
60530 628962 642513 653285 660771 664376 663819 659471 652273 643313 633433 623113 612713 602792 594148
60517 594148 587424 582632 579100 575988 573015 570698 569815 570615 572682 575474 578851 583097 588697 596160 605779
60502 605779 617462 631074 647118 666734 690833 719447 752079 788352 827972 870457 915309
60491 915309 962088 1009796 1056374 1099469 1137602 1170000 1195273 1210930 1214486 1204773 1182180 1148206
60479 1148206 1104999 1054939 1000250 943045 885630 830334 778883 732165 690625 654463 623348
60468 623348 596388 572639 551403 532054 514160 497963 484206 473031 463479 454491 445983 438444
60456 438444 431834 425578 419530 414222 410067 406822 403959 401135 398114 394675 390878 387181 384016 381394
60442 381394 379039 376726 374355 371970 369936 368851 368920 369461 369434 368492 367237 366304 365544 364386 362822 361602
60426 361602 361414 362141 363024 363355 362862 361649 360009 358278 356706 355429 354610 354437 354886 355665 356575 357773 359455
60409 359455 361452 363415 365254 366966 368160 368312 367605 366981 367096 367723 368515 369846 372292 375563 378646 381053
60393 381053 383351 386308 389982 393828 397323 400185 402324 403988 405832 408461 411801 415116 417654 419174
60379 419174 419869 420070 420159 420586 421687 423471 425690 428179 430933 433794 436249 437795 438484 438884 439448 440115
60363 440115 440609 440913 441254 441789 442560 443674 445230 447045 448736 450214 451882 454180 457105 460401 464059
60348 464059 468273 472882 477200 480590 482996 484670 485502 485060 483348 481184 479495 478389 477228 475572 473679
60333 473679 472012 470608 469200 467819 466848 466487 466345 465681 463963 461178 457735 454162 450869 448101 446053
60318 446053 444835 444311 444169 444349 445263 447286 450107 452986 455690 458856 463287 469279 476793 485815 496111
60303 496111 507013 518005 529397 541868 555377 568956 581495 592113 599699 602836 600666 593526
60291 593526 582485 568738 553676 538935 525612 513703 502832 493375 486207 481417 477935 474589
60279 474589 471052 467624 464547 461799 459273 456851 454399 451814 449013 445931 442711 439793 437498 435549
60265 435549 433305 430524 427561 424782 422166 419640 417478 416062 415371 414857 413840 412115 410294 409381 409760
60250 409760 410748 411369 411374 411098 410692 410156 409967 410801 412533 414279 415570 416692 417672 417949 417503 417353 418178 419236
60232 419236 419586 419706 420787 422828 424640 425720 427030 429654 433463 437413 440641 443044 445224 448037 451878
60217 451878 456321 460729 465069 469750 474866 480188 485807 492115 499065 506111 513044 520350 528479 537165
60203 537165 545666 553362 560036 565932 571592 577217 582156 585459 587077 588111 589702 592008 594372 596070
60189 596070 596726 596296 594947 592839 590082 586960 583992 581421 578837 575656 571767 567233 561758 555182 548315
60174 548315 542379 537617 533287 529083 525617 523255 521437 519561 517753 516272 514878 513285 511607 509909
60160 509909 507982 505990 504673 504321 504224 503714 503126 503074 503472 504042 505131 507003 508780 509161 508071 506696 506001
60143 506001 506016 506494 507380 508578 509999 511968 514926 518683 522581 526445 530711 535541 540467 545071 549424
60128 549424 553686 557817 561916 566272 570730 574455 576744 577915 579163 581666 585863 591276 596874 601808
60114 601808 605926 609512 612663 615211 617147 618637 619596 619639 618626 616961 615190 613512 611718 609386 606124
60099 606124 601897 597220 592786 588857 585250 581831 578727 576057 573815 572057 570903 570264 569814 569289 568593
60084 568593 567651 566445 565197 564126 563035 561463 559325 557008 554769 552427 549784 546938 543965 540604
60070 540604 536490 531499 525705 519247 512423 505739 499662 494422 490070 486517 483468 480485 477229 473538
60056 473538 469415 465245 461892 460082 459565 459263 458407 457190 456250 455999 456719 458777 462263 466628 471169 475805
60040 475805 481080 487432 494677 502174 509294 515719 521387 526145 529546 531214 531401 530848 529969 528484 526101
60025 526101 523187 520404 517845 514931 511104 506365 501109 495685 490129 484195 477647 470576 463324 456037
60011 456037 448544 440830 433385 426819 421322 416859 413722 412328 412383 412687 412025 410146 407737 405704 404603
59996 404603 404491 404957 405373 405426 405493 406317 408263 411003 413950 416787 419484 422060 424639 427625 431452 436024
59980 436024 440586 444246 446477 447136 446364 444682 442925 441617 440432 438522 435408 431405 427259 423617 420791
59965 420791 418694 416912 415072 413283 412049 411657 411819 412022 412073 412159 412502 413149 414054 415190 416431 417411 417710
59948 417710 417339 417009 417672 419636 422245 424557 426253 427725 429363 431022 432186 432546 432388 432441 433216 434367
59932 434367 434903 434236 432949 432283 432949 434689 436891 439305 442116 445637 450089 455512 461738 468497 475470
59917 475470 482090 487428 490630 491568 490902 489447 487657 485716 483871 482448 481690 481652 482225 483205 484393 485574
59901 485574 486433 486621 486082 485201 484460 484063 484071 484709 486281 488816 492006 495443 498873 502492 507144 513850 522663
59884 522663 532260 541148 549062 556701 564358 571575 578084 584238 590285 595890 600692 604760 608194 610727
59870 610727 612051 612088 610716 607701 603271 598309 593585 589149 584729 580271 575665 570496 564733 559385 555771
59855 555771 554123 553445 552793 552229 552481 554099 557166 561564 567273 574435 583257 593710 605117 615885
59841 615885 623845 627383 626703 623846 621169 619849 620024 621843 625434 629796 632762 632661 629639 624993 619742
59826 619742 614324 609110 604483 600518 597064 594015 591157 587993 584114 579578 574610 569260 563682 558391
59812 558391 553718 549333 544870 540676 537267 534255 530630 526105 521468 517501 514219 511354 508914 506884
59798 506884 504928 502798 500756 499170 497973 496801 495490 494158 492961 492040 491593 491716 492239 492917 493774 495078
59782 495078 496903 498850 500265 500728 500329 499499 498680 498160 498079 498411 498959 499564 500342 501488 502828 503793 504029
59765 504029 503794 503671 504077 505235 507306 510259 513698 517088 520097 522673 525011 527640 531214 535849 540863
59750 540863 545520 549912 554780 560533 566788 572824 578191 582877 587174 591394 595538 599261 602359 605153
59736 605153 608132 611314 614255 616653 618670 620671 622905 625439 628198 631026 633809 636470 638785 640401
59722 640401 641196 641392 641107 640107 638337 636366 634838 633622 632011 629628 626690 623427 619833 616037 612499
59707 612499 609728 608139 608104 609672 612159 614548 616474 618427 620919 623877 627010 630335 634062 638312 643201
59692 643201 648910 655411 662253 668726 674065 677512 678639 677806 676020 674061 671956 669388 666271 662772
59678 662772 659103 655543 652321 649160 645225 639920 633619 627286 621506 616185 611059 606100 601408 597081
59664 597081 593354 590654 589292 589118 589543 589951 590145 590391 590999 591913 592882 594037 596061 599545 604294 609475
59648 609475 614416 618984 623104 626139 627083 625437 621749 617157 612458 607694 602500 596556 589761 582336
59634 582336 574883 568112 562299 557216 552731 549162 546783 545215 543699 541832 539701 537397 534764 531587
59620 531587 527713 523066 517856 512688 508091 503989 499972 495982 492286 488887 485537 482454 480363 479570
59606 479570 479404 478938 477952 476922 476383 476568 477373 478328 478829 478775 478854 479866 481802 483826 485153 485791 486471 487934
59588 487934 490248 492743 494718 496144 497437 498538 498674 497271 494768 492183 490052 488142 486030 483505
59574 483505 480534 477265 474161 471759 470109 468717 467157 465481 463884 462258 460360 458252 456226 454403
59560 454403 452687 451119 449907 449035 448177 447206 446474 446361 446784 447459 448376 449658 451191 452939 455421 459234
59544 459234 464090 468984 473479 478235 484038 490984 498884 507955 518777 532158 549073 569543 590682
59531 590682 606870 613428 610247 601212 590541 580571 572388 566674 563378 561720 561193 561864 563485 565174
59517 565174 566459 567793 569479 570762 570561 568520 564843 559756 553680 547406 541380 535235 528618 522035
59503 522035 516227 511120 506181 501495 497685 494823 492265 489616 487231 485519 484352 483403 482707 482569 483128
59488 483128 484239 485714 487523 489790 492616 495866 499195 502311 505204 508119 511372 515199 519566 524131
59474 524131 528646 533457 539282 546235 553261 558784 561894 562805 562363 561301 559904 558167 556176 554216 552539
59459 552539 551257 550657 551339 553608 556913 560433 564154 568806 574738 581501 588640 596148 603824 610915 616899
59444 616899 622072 626829 630773 632997 632924 630448 625708 619217 611837 604132 596072 587885 580699 575642 572526
59429 572526 570119 567584 565032 562789 560852 559217 558248 558538 560608 564709 570691 578206 587311 598596
59415 598596 612410 628218 645190 663205 682930 705098 729885 756111 780196 796608 800974 793410
59403 793410 778246 760504 743290 728314 717364 712306 714128 722434 735136 748030 755511 753185
59391 753185 740435 720392 697489 675095 654841 637187 622190 609960 600688 594362 590540 588503
59379 588503 587621 587572 588325 590027 592809 596626 601268 606524 612294 618538 625163 631914 638320 643833 648184
59364 648184 651604 654652 657879 661662 666073 670726 674984 678616 682122 686088 690402 694533 698481 702927
59350 702927 708351 714462 720747 727298 734787 743783 754235 765494 776733 787490 797890 808313 818793
59337 818793 828875 837974 845646 851468 854927 855642 853695 849666 844321 838157 831132 822937 813635 803912
59323 803912 794519 785643 777123 769138 762260 756754 752151 747666 742863 737836 732965 728542 724436 720069
59309 720069 714927 709192 703665 698989 695142 691812 689032 687185 686466 686688 687771 690309 695337 703249 712820
59294 712820 721300 725517 723160 713549 697892 678915 659627 641832 625753 611102 598181 587665
59282 587665 579669 573555 568640 564703 561842 560162 559724 560534 562553 565767 570188 575620 581637 588004 595028
59267 595028 603211 612627 622793 632958 642278 649921 655400 658767 660230 659739 657267 653331 648745 643861
59253 643861 638404 632087 625107 618059 611610 606291 602359 599821 598614 598489 598625 597939 596284 595034 595812
59238 595812 598835 603048 607650 612718 618469 624763 631459 638456 645192 650800 655053 658491 661314 662840
59224 662840 662514 660831 658704 656388 653648 650597 647710 645168 642770 640460 638476 636927 635584 634196
59210 634196 632789 631562 630597 629705 628535 626845 624639 621936 618507 614112 608994 603845 599251 595442 592537
59195 592537 590600 589296 587961 586296 584711 583748 583447 583566 584098 585254 587144 589819 593418 597928 602909
59180 602909 607805 612469 617078 621632 625878 629738 633494 637480 641844 646682 652147 658194 664402 670353
59166 670353 676247 682865 690733 699445 708019 715823 722829 729007 733934 737234 738976 739265 737735 733936
59152 733936 728002 720469 711537 701140 689761 678528 668239 658653 649039 639130 629288 619942 611111
59139 611111 602422 593486 584328 575439 567281 559819 552716 545950 539967 535232 531841 529491 527648 525843
59125 525843 524110 523028 523081 524126 525785 528060 531084 534598 538382 543069 549656 558106 567221 576119 585139
59110 585139 595015 605892 617542 629868 642552 654722 665598 675313 684674 694299 704170 713578 721137
59097 721137 725284 725382 722272 717527 712363 707411 702928 698740 694301 689446 684888 681543 679521 678148 676736
59082 676736 674887 672288 668817 664803 660670 656301 651170 645136 638698 632374 626219 620084 614006 608092
59068 608092 602182 595963 589446 583180 577840 573585 569942 566379 562785 559279 555812 552365 549345 547299
59054 547299 546170 545310 544283 543212 542235 541070 539394 537263 534932 532664 530911 530221 530629 531463 532035 532208
59038 532208 532076 531597 530936 530727 531476 532992 534846 537133 540279 544338 549037 554352 560526 567552 575080
59023 575080 582830 590722 598664 606585 614648 623072 631737 640262 648465 656399 663842 670066 674270 676171
59009 676171 676151 675004 673567 672440 671871 671790 671937 672102 672432 673439 675498 678453 682000 686297 691687 697731
58993 697731 703076 706577 708229 708827 709103 709377 709609 709366 708054 705605 702749 700313 698471 696912 695500
58978 695500 694477 694249 695265 697928 702325 708122 714841 722139 729802 737871 746845 757337 769196 781300
58964 781300 792406 801992 810205 817511 824586 831953 839270 845325 849077 850425 849748 847193 842725 836431
58950 836431 828383 818630 807660 796362 785164 773757 762110 751147 741766 733711 726110 718710 711866
58937 711866 705678 699916 694574 689797 685449 681386 677956 675574 674020 672818 672100 672358 673463 674661 675528
58922 675528 676251 677006 677698 678421 679509 681036 682741 684583 686935 690129 694188 699032 704611 710754 717191
58907 717191 723719 730216 736710 743657 751849 761664 772621 783976 795426 806880 817975 828342 837915
58894 837915 846474 853370 858491 863030 868435 874898 881758 889158 898191 909413 922231 935901 950115
58881 950115 964307 977301 988237 997253 1004761 1010519 1013844 1014490 1012935 1009957 1006123 1001551 996068 989636
58867 989636 982495 974829 966637 958189 950180 942905 935620 927300 917819 907808 897659 887263 876450
58854 876450 864901 851953 837354 822125 807749 794520 781625 768784 756742 745930 735710
58843 735710 725399 715204 705605 696523 687664 679174 671412 664361 657697 651198 644871 638842 633250 628013
58829 628013 622786 617529 613024 610302 609530 609956 610941 612459 614575 617120 620111 623966 629064 635412 642736
58814 642736 650466 657719 663836 668960 673551 677415 679845 680603 680061 678464 675869 672795 670023 667594 664827
58799 664827 661461 657905 654196 649714 644301 638749 633686 628756 623413 617817 612466 607558 603157 599425
58785 599425 596289 593539 591620 591593 593869 597711 602455 608455 616050 624315 631713 637623 642457 646562 649735
58770 649735 651641 652017 650472 646615 640486 632650 623964 615345 607399 600013 592566 584771 577073 570106
58756 570106 564141 559259 555563 552880 550676 548612 546914 545931 545595 545515 545254 544418 542970 541694 541839 543939
58740 543939 547280 550815 554260 558034 562499 567593 572930 578046 582735 587224 591754 596063 599790 603299
58726 603299 607417 612264 617100 621561 626324 632107 638612 644899 650389 655169 659735 664748 670677 677407
58712 677407 684451 691557 698632 705178 710470 714345 717045 718274 717325 714238 709859 704492 697548 688861
58698 688861 679124 668398 655410 639327 621404 603881 587947 573646 561039 550263 540855 532151
58686 532151 524257 517810 512893 508875 505211 501775 498522 495386 492391 489541 486777 484314 482678 482069
58672 482069 482097 482439 483313 485003 487485 490874 495604 501674 508428 515651 524237 535002 547226 558958
58658 558958 568312 574019 575459 573039 568178 562207 555556 548418 541531 535473 529770 523600 517099 511195
58644 511195 506440 502713 499737 497173 494508 491627 489313 488472 489012 490027 490864 491544 492453 494119 496993
58629 496993 500904 505024 508722 511965 514538 515668 515119 513910 513126 512628 511842 511148 511408 512622 514216 516330
58613 516330 519612 523877 528169 532106 536129 540291 543822 546135 547485 548425 549260 550174 551233 552104 552330
58598 552330 552011 551746 551807 551780 551081 549536 547501 545732 545007 545592 547220 549719 553287 557930 563225 568996
58582 568996 575668 583436 591681 599747 607719 615795 623565 630674 637566 644659 651380 657074 662484 669231
58568 669231 678078 688741 701142 715727 732479 750726 770188 791467 815235 841417 869197 897335
58556 897335 924481 949598 972044 991028 1005398 1014387 1018251 1017818 1013904 1007609 1000475 993545 986743
58543 986743 979795 973158 967228 961177 953484 943230 930158 914040 894946 873709 851254 827914
58531 827914 804208 781672 761849 744918 730286 717965 708277 700711 694329 688980 684950 681849 678966
58518 678966 676350 674307 672300 669618 666768 664764 663391 661625 659584 658427 658315 658058 656999 655842 655286
58503 655286 655107 654906 654685 654385 653828 653291 653218 653323 652957 652340 652398 653411 654921 656936 660010 664142 668771
58486 668771 673983 680550 688638 697577 707028 717318 728570 740658 753972 769087 785586 802491
58474 802491 819768 838042 856641 873353 886440 895594 900617 900642 895379 886061 874535 862166 850004
58461 850004 839072 830029 823174 818934 817641 818869 821922 826955 834634 844726 856075 867886 879867
58448 879867 891151 900369 906890 910742 911245 907142 898399 886733 874063 861440 849477 838569 828481
58435 828481 818963 810908 805711 803377 802550 802507 803808 806796 810841 815323 820201 825504 831458 839042 848920
58420 848920 859790 869280 876489 882069 885885 886635 884103 879811 874855 868911 861985 855296 849617 844297
58406 844297 838804 833737 829576 825859 822383 819871 818797 818809 819864 822496 826418 830294 833480 836591 839910
58391 839910 842859 845563 849176 853897 858283 861317 863576 865661 867160 868062 869450 871810 874247 876402
58377 876402 879579 884852 891518 898453 905603 913062 920108 926343 932625 939857 947946 956722 966548 977201
58363 977201 987552 997280 1007599 1019396 1031992 1044544 1057321 1070644 1083873 1096312 1107973 1118771
58351 1118771 1128223 1136423 1143894 1150187 1154338 1157102 1160707 1165845 1171075 1175910 1182053 1190443 1199499 1207758
58337 1207758 1216165 1226208 1237754 1250369 1264879 1281918 1300450 1319307 1338667 1358696 1378343
58326 1378343 1396835 1414787 1432443 1448459 1461717 1472768 1482314 1490088 1496492 1503432 1512080 1521544
58314 1521544 1530984 1541124 1552376 1563623 1574389 1586240 1600478 1616371 1633139 1651561 1672085
58303 1672085 1693406 1714533 1736148 1758461 1780058 1800596 1822192 1846239 1871189 1895421 1919893
58292 1919893 1945947 1972885 1999929 2028223 2058659 2090016 2121471 2154650 2190876 2228727 2266616
58281 2266616 2305425 2346319 2388427 2431188 2476376 2525168 2575618 2625754 2676747 2730285 2785260
58270 2785260 2839879 2894678 2950659 3006909 3062896 3120645 3181785 3244947 3308861 3375236 3445651
58259 3445651 3518532 3592457 3669499 3751870 3838031 3925425 4014245 4105236 4197020 4289254 4385212
58248 4385212 4487393 4593745 4702042 4814573 4934396 5060449 5190838 5327510 5473109
58239 5473109 5626531 5786235 5954547 6134075 6323490 6521668 6732137 6958354 7198521
58230 7198521 7450401 7717114 8002656 8306142 8626508 8968365 9336916 9731699 10151995
58221 10151995 10603658 11093657 11622965 12192269 12809487 13483978 14219008 15018484 15895480
58212 15895480 16865580 17938528 19126675 20455729 21957343 23658646 25591122 27803676
58204 27803676 30355986 33307359 36724891 40693494 45303808 50640720 56800271 63907180
58196 63907180 72098372 81504318 92273800 104614500 118799750 135164055 154128846
58189 154128846 176221222 202027196 232066532 266495201 304440930 343112527 377516798
58182 377516798 401683256 411118699 404831298 385383128 357127181 324213160 289660605
58175 289660605 255471157 223009486 193190326 166531504 143217218 123171694 106126678
58168 106126678 91711753 79550740 69305328 60668279 53363021 47160968 41880404
58161 41880404 37365745 33482109 30126053 27221343 24699975 22497430 20562799 18858372
58153 18858372 17348394 15998763 14786064 13695537 12710795 11814960 10999754 10263075 9598342
58144 9598342 8994855 8446694 7952007 7504759 7095919 6721779 6382769 6074696 5788773
58135 5788773 5519551 5265793 5024709 4792729 4571320 4365013 4173855 3993764 3823403
58126 3823403 3664477 3516039 3374818 3240784 3116556 3001693 2893058 2790287 2695450 2607728
58116 2607728 2523718 2442764 2366944 2296136 2227956 2162287 2101105 2043998 1988326 1933633 1881661
58105 1881661 1832343 1783870 1736289 1690954 1646921 1601948 1556634 1513592 1473028 1433017 1393596
58094 1393596 1356636 1322229 1289142 1258380 1232345 1210720 1190913 1172193 1155747 1141163 1126586
58083 1126586 1111918 1098177 1084122 1067345 1048372 1029977 1012721 994859 976299 958845 942658
58072 942658 926205 909617 894444 880229 865054 849396 835672 823926 811822 799105 788148
58061 788148 779580 771186 761924 753417 746502 739650 731827 723861 715948 706679 695621 684281 673615
58048 673615 662988 652292 642704 634768 627949 622454 619062 616845 613601 608916 604294 600057 594851 588633
58034 588633 583238 579270 575054 569422 562986 555946 547233 536716 525951 515887 506037 496525 488624
58021 488624 482506 476792 471069 466504 463149 459052 453157 446907 441901 437910 434248 431195 428979 427096
58007 427096 425553 425141 425698 425846 425182 425040 426288 428080 429507 430744 431839 432047 431156 429837 428022 424600
57991 424600 419415 413874 408855 403683 397880 392218 387301 382768 378710 376210 375574 375541 375071 374484 374032 372920
57975 372920 370705 368322 366798 366042 365557 365274 365097 364802 364808 365830 367458 368400 368326 368045 367731 366718 365346
57958 365346 365085 366254 367459 367855 368138 368590 368121 366234 364137 362789 361416 359074 356254 353862 351939
57943 351939 350391 349716 350023 350497 350708 351295 352669 354320 356187 359338 364391 370514 376770 383193 389708
57928 389708 395311 399207 401634 402803 402313 400405 398458 397319 396304 394649 392628 390423 387241 382597
57914 382597 377353 372541 368262 364496 361771 360154 358759 357112 355864 355409 355121 354712 354896 355768 355949 354403
57898 354403 351783 348974 345837 342655 341247 342969 346620 349899 352166 354402 357309 360815 364752 368741
57884 368741 371957 374108 376015 378305 380241 380807 380146 378912 377092 374474 371453 368239 364103 358591 352725
57869 352725 347841 343906 340099 336436 333638 331981 331297 331556 332410 332827 332287 331844 332988 335899 339703 343817
57853 343817 348079 352199 356148 360649 366287 372511 378367 383726 389010 394213 399068 403669 408122 412040
57839 412040 415032 417133 418177 417597 415523 413177 411326 409312 406497 403651 401678 399902 397018 393077
57825 393077 389201 385843 382705 379915 377933 376495 374851 372959 371418 370372 369388 368230 366976 365617
57811 365617 364258 363292 362521 360561 356059 349222 341384 333460 325682 318446 312499 308415 306459 306588 308033
57796 308033 309444 310132 310625 311442 312130 312229 312315 313072 314056 314420 314219 314002 313810 313633 314178 316054 318844 322075
57778 322075 326345 332159 338316 343022 346182 349203 352807 356496 359955 363500 367101 370204 372632 374600
57764 374600 375877 375969 375059 373783 372186 369884 367132 364717 362925 361561 360760 360750 361027 360874 360519 360704 361265
57747 361265 361330 360785 360389 360424 360369 359981 359617 359411 359145 358943 359125 359411 359282 359144 360011 361974 364019 365488 366674
57728 366674 367830 368663 369121 369793 371225 373553 376893 381267 385981 389929 392749 395021 397265 399465 401596
57713 401596 403811 405985 407777 409217 410551 411528 411586 410737 409566 408358 406973 405514 404322 403317 402089
57698 402089 400620 399272 398251 397825 398677 401005 403480 404230 402827 400250 397043 392750 387223 381148 374981
57683 374981 368578 362267 357199 354099 352550 351941 352364 354183 357547 362636 369716 378613 388886 400797
57669 400797 415375 433361 454878 480361 510754 546052 583899 619714 647712 662289 660162 642322
57657 642322 613624 579911 545551 513128 484058 458790 437110 418875 404152 392583 383313 375815
57645 375815 370124 366061 362905 360069 357509 355322 353659 353129 354336 356693 358578 359123 359146 359859 361414
57630 361414 363199 364915 366714 368702 370788 372757 374210 374793 374636 374175 373485 372385 371224 370740 370847 370399
57614 370399 368601 366083 364112 363236 363141 363294 363335 363169 363098 363653 365070 367129 369452 371633 373227 374153 375026
57597 375026 376413 377872 378437 377979 377197 376278 374625 372213 370197 369720 370757 372465 373895 374164 372864 370786
57581 370786 369448 369422 369811 369732 369478 369703 370325 370925 371562 372443 373303 373758 373905 374024 374054 373842 373588 373589 373888 374426
57561 374426 375246 376293 377506 379205 381805 384906 387397 388779 389708 390908 392327 393884 396198 399844 404376
57546 404376 408845 412929 416892 420759 424074 426400 427671 428332 429304 431444 434728 438297 441476 444338 447134
57531 447134 449761 452042 453967 455394 456074 456310 456984 458635 461056 464036 467794 472320 476976 481247 485326
57516 485326 489581 494042 498757 503933 509287 513991 517765 521314 525200 529005 532225 535276 538871 542983
57502 542983 547066 550763 553861 556196 558318 561523 566331 571410 574860 576283 576931 578173 580514 583718
57488 583718 587166 590305 593301 596935 601458 606082 610174 614294 619347 625245 631193 636783 641963 646466
57474 646466 650212 653906 658200 662567 666047 668937 672646 677900 684058 690302 696550 702940 709222 715105
57460 715105 720680 726198 731788 737525 743469 749505 755427 761182 766867 772607 778675 785525 793369 801841
57446 801841 810350 818619 826670 834623 842724 851223 859956 868492 876970 886212 896600 907451 917995
57433 917995 928254 938303 947413 954963 961697 969002 977237 985831 994784 1004872 1016313 1028290 1040026
57420 1040026 1051435 1062568 1073267 1083655 1094209 1104980 1115408 1125238 1135029 1145415 1156390 1167643
57408 1167643 1179227 1191517 1204786 1218973 1233614 1247843 1260860 1272642 1283957 1295537 1307485
57397 1307485 1319627 1332105 1345337 1359464 1374111 1388766 1403340 1418280 1434023 1450455 1467087
57386 1467087 1483668 1500322 1517120 1534022 1551331 1569652 1589058 1608841 1628464 1648244 1668626
57375 1668626 1689279 1709538 1729422 1749492 1769873 1790007 1809330 1827745 1845517 1863170 1881355
57364 1881355 1900401 1920057 1939952 1960082 1980537 2001177 2022082 2043993 2067627 2092691 2118137
57353 2118137 2143344 2168596 2194520 2221501 2249498 2277944 2306002 2333367 2360736 2389052 2418444
57342 2418444 2448308 2478146 2507768 2536887 2565152 2592626 2619771 2647008 2674590 2702769 2731696
57331 2731696 2761303 2791599 2822795 2854780 2886870 2918575 2950303 2982758 3016009 3049695 3083826
57320 3083826 3118661 3154019 3189430 3224793 3260293 3295855 3331321 3367002 3403388 3440395 3477467
57309 3477467 3514327 3551139 3588161 3625794 3664662 3705005 3746192 3787422 3828613 3870028 3911555
57298 3911555 3953143 3995507 4039374 4084349 4129566 4175203 4222180 4270549 4319418 4368510 4418516
57287 4418516 4469712 4521413 4573142 4625176 4677534 4729468 4780590 4831537 4882925 4934417 4985551
57276 4985551 5036880 5089583 5144226 5200360 5257061 5313582 5369779 5426081 5482844 5539834 5596834
57265 5596834 5654474 5713586 5773763 5833552 5892382 5951375 6011935 6074370 6138242 6203191 6268855
57254 6268855 6334835 6401340 6469222 6538708 6608714 6678043 6746634 6815012 6883081 6950317 7016720
57243 7016720 7082685 7148065 7212196 7274937 7337164 7400174 7465074 7532826 7604435 7680643 7761288
57232 7761288 7844994 7929708 8013874 8097121 8179804 8262169 8344291 8426440 8508778 8590782 8671672
57221 8671672 8751356 8830093 8907067 8980176 9047565 9108545 9162626 9208682 9246008 9275704 9300134
57210 9300134 9321191 9339625 9355765 9370204 9383801 9397433 9411614 9426076 9439983 9452986 9465748
57199 9465748 9478988 9492226 9504016 9513279 9519972 9524636 9527896 9530491 9533212 9536491 9540246 9544340 9549044
57186 9549044 9554818 9561693 9569117 9576584 9584368 9593383 9604269 9616872 9630731 9645644 9661361 9677024
57174 9677024 9691517 9704335 9715581 9725166 9732514 9737152 9739082 9738430 9735130 9729023 9719859 9707134 9690428
57161 9690428 9670003 9646584 9620377 9590706 9556744 9518165 9474975 9427207 9374986 9318406 9257151
57150 9257151 9190685 9119041 9042949 8962975 8879150 8791933 8703131 8615320 8530432 8449280 8372353
57139 8372353 8300728 8235985 8179095 8129234 8083838 8040077 7995971 7949677 7898161 7837878 7767416
57128 7767416 7689017 7607143 7525777 7447181 7372407 7302218 7237540 7179296 7127768 7082090 7040708
57117 7040708 7002519 6967348 6935389 6906873 6882648 6864735 6855929 6859077 6877003 6912875 6970363 7053573
57105 7053573 7167014 7315543 7504472 7740299 8031946 8391269 8832025 9367909 10011122
57096 10011122 10772267 11661445 12689793 13870712 15220043 16754772 18490361 20437856
57088 20437856 22602090 24980118 27557092 30299048 33146308 36009773 38766994 41258244
57080 41258244 43296255 44704465 45372584 45290796 44534763 43217446 41449180 39326859 36939028
57071 36939028 34368514 31691738 28980580 26303693 23721839 21281352 19013154 16936185
57063 16936185 15059192 13380641 11890936 10576590 9422503 8412128 7528410 6755356
57055 6755356 6078103 5482373 4955607 4488413 4073523 3703638 3371614 3072375 2803043
57046 2803043 2561117 2343604 2147746 1971289 1812045 1668193 1538904 1423697 1321348
57037 1321348 1230383 1150272 1080971 1021549 970459 926937 890918 861776 838590 821649 812344
57026 812344 811333 818063 832190 853647 879960 904106 916180 907885 876440 825517 762997 696984
57014 696984 632859 573205 519337 472023 431172 396078 366250 341379 320559 302375 285915
57003 285915 271083 257879 245994 235141 225075 215197 204819 193978 183445 173790 164898 156472
56991 156472 148543 141457 135773 132143 130867 131657 134152 138540 145226 154135 164640 175699 185538 191701
56977 191701 192353 187481 178403 166571 153462 140965 130650 122731 116563 111912 108900 107118 106023
56964 106023 106078 108313 112776 118581 125575 134768 146945 161995 179805 200344 222039 241047 253179
56951 253179 256361 251083 239265 223320 205655 188208 172264 158691 147935 139781 133698 129646
56939 129646 128103 129204 132498 137736 145348 155902 169630 186703 207425 231685 258358 285199
56927 285199 308904 325468 331539 326203 311480 290905 267708 243984 220767 198481 177517 158517
56915 158517 141990 127882 115902 105991 97999 91218 84928 79253 74761 71349 68331 65545 63529
56902 63529 62492 61973 61704 61991 62968 64188 65330 66762 69101 72699 77720 84271 92225 101350 111701
56887 111701 123499 136677 151051 166788 183848 200748 214627 222917 224747 220911 213169 203655
56875 203655 194070 185039 176570 169204 164165 162358 163779 167986 174569 183210 193923 207342 224187
56862 224187 244552 268394 296546 330200 369044 410367 449818 482272 502538 507177 496672 475174
56850 475174 447654 417797 388370 361941 340235 323549 311632 304607 302655 305568 313320 326461
56838 326461 345343 369581 398957 434407 477460 528916 588103 652320 715862 770012 805419
56827 805419 815739 800012 762647 711475 654788 598748 546693 500293 460697 428496 403461
56816 403461 385024 372898 366961 366871 372152 382537 398130 419441 447284 482261 523983 570479
56804 570479 617663 658972 686430 693812 679668 647435 603040 552803 502433 455902 414543 378039
56792 378039 346495 320781 300983 285916 274540 266827 262935 262699 266352 274642 287673 304645 325087
56779 325087 348989 374819 398445 415003 421340 416394 400619 376207 347001 316791 287728 260683
56767 260683 236297 214859 195877 178700 163254 149637 137564 126793 117478 109509 102160 95024
56755 95024 88651 83643 79760 76550 74149 72760 72024 71585 71554 71725 71145 69344 67282 66168 65907 65653
56739 65653 65263 65192 65347 65159 64579 64174 64322 64908 65601 65915 65389 64148 62917 62132 61614 61437 62273 64276
56721 64276 66461 67853 68498 68733 68477 68024 68484 70328 72390 73436 73876 74719 75711 75945 75716 76237 77827
56704 77827 79754 81581 83386 84917 85825 86554 87800 89271 90222 90934 92281 93961 94600 93780 92620 92063
56688 92063 91806 91316 90900 91164 92085 93029 93338 92860 92326 92978 95239 98015 99980 101197 102622 104397 105664
56671 105664 105933 105541 104829 103878 103078 102949 103281 103337 102999 102888 103298 103814 104082 104194 104291 104448 104872 105547 105853
56652 105853 105401 104986 105747 107537 109173 110214 111270 112516 113118 112553 111538 111145 111666 112611 113226 112854 111441
56635 111441 109825 108972 108949 109169 109407 109801 110093 109868 109469 109604 110077 109939 108983 108012 107495 107060 106547 106387 106567
56616 106567 106234 104884 103117 101764 100991 100639 100674 100859 100682 100017 99301 98813 98433 98265 98737 99755 100518 100512
56598 100512 100007 99341 98532 97911 98270 99813 101616 102680 102984 103054 103048 102832 102535 102468 102726 103197 103766 104286 104586
56579 104586 104690 104804 105088 105693 106964 109099 111700 114130 116288 118564 121119 123839 126894 130613 134804
56564 134804 138866 142675 146730 151432 156934 163730 172576 183535 195613 207428 217716 225309 229392
56551 229392 230036 228006 224154 219503 215498 213079 211537 209312 206002 202653 200003 197612 194962 192335
56537 192335 190108 188126 186222 184561 183038 181129 178784 176702 175269 173981 172346 170646 169345 168386
56523 168386 167609 167188 167189 167200 166862 166317 165740 164907 163613 162124 160879 160034 159496 159088 158604 158022 157642 157588 157377
56504 157377 156550 155489 154872 154531 153771 152652 151910 151624 151110 150300 150021 150548 150947 150320 148753 146658 144156
56487 144156 141621 139944 139601 140071 140595 140911 141026 140941 140913 141245 141654 141640 141517 142136 143417 144304 144472 144852 146003
56468 146003 147125 147378 147170 147377 148130 149057 149909 150347 149886 148703 147815 147916 148700 149702 150990 152597 154140
56451 154140 155521 157143 158926 160055 160246 160369 161192 162385 163405 164462 165922 167461 168441 168434 167065 164287
56435 164287 161269 159853 160425 161390 161410 161001 161199 161927 162721 163869 165508 166573 166049 164654 163989 164515 165494
56418 165494 166439 167432 168410 169243 170294 171933 173686 174709 174863 174584 174066 173322 172787 173093 174341 176061 177657
56401 177657 178573 178593 178337 178848 180236 181409 181601 181307 181226 181214 181028 181147 181926 182769 183106 183509 184840 186914
56383 186914 188920 190595 192039 193000 193294 193473 194111 194881 195168 195107 195203 195412 195481 195710 196556 197868 199247 200669
56365 200669 202155 203379 204269 205357 206892 208364 209526 211004 213045 214688 215203 215457 216678 218666 220405
56350 220405 221711 222973 223914 224049 223934 224626 226139 227593 228618 229550 230506 231284 231913 232422 232450 232022 232195
56333 232195 233942 236826 239794 242761 246299 250183 253506 256032 258364 260977 263992 267576 271613 275218
56319 275218 277541 278797 279762 280656 281281 281706 281979 281745 281120 281315 283312 286520 289754 292935 296659 300728
56303 300728 304448 307992 312210 317428 323547 330823 339298 347795 354736 359803 363760 367077 369837 372572
56289 372572 375891 379493 382678 385608 389121 393585 398942 405354 412802 420513 427891 435549 444379 454180
56275 454180 464312 475017 486850 499438 512120 525272 539651 555048 570926 587813 606625
56264 606625 627187 648912 672394 698749 727917 759209 793137 831112 873723 920924 973544
56253 973544 1033015 1099870 1173991 1255947 1346547 1445609 1552822 1669261 1796085 1932045 2074200
56242 2074200 2220805 2371488 2524674 2676848 2824438 2964518 3093531 3207178 3301982 3375552
56232 3375552 3425421 3449313 3446645 3418342 3365379 3289219 3193414 3082735 2960616 2829131 2691273
56221 2691273 2551163 2411760 2274332 2140366 2012058 1890542 1775459 1666723 1565115
56212 1565115 1470861 1383291 1302196 1228015 1160516 1098854 1042935 993125 948663 908090 871127
56201 871127 838249 808582 780353 753473 729484 708787 690094 672769 657376 643605 630075
56190 630075 616806 605561 597018 589776 582814 576749 571874 567173 562249 558166 555393 552830 549884 547533
56176 547533 546310 545120 543267 541920 542248 543556 544503 544974 545796 547702 551252 556611 562822 568482 573487
56161 573487 578883 584902 590835 596911 604418 613552 623088 632616 643170 655189 667898 681236 696325
56148 696325 713371 731208 749657 770321 794321 821328 851677 887344 929842 978983 1034580
56137 1034580 1097382 1167380 1242831 1321578 1401380 1478380 1547700 1606924 1657515 1702281 1743307
56126 1743307 1782659 1822265 1861577 1897157 1925558 1945104 1954709 1953650 1943452 1927555 1907872 1883464
56114 1883464 1853046 1816273 1771935 1717910 1654379 1584816 1512758 1440040 1369034 1303551 1245971
56103 1245971 1195901 1152866 1117608 1089524 1065875 1045279 1029242 1018597 1011246 1005224 1001162 999800
56091 999800 999830 1000315 1002626 1007771 1014235 1020567 1027740 1036842 1046713 1055958 1065120 1074926 1084680 1094245 1105219
56076 1105219 1118208 1131351 1143445 1156055 1170644 1186186 1201556 1217641 1235058 1252512 1269486
56065 1269486 1287788 1308253 1328773 1347835 1367142 1388349 1410122 1430906 1451715 1473635 1495463
56054 1495463 1516413 1538227 1561977 1585784 1608393 1631884 1657988 1684898 1710793 1737366 1766628
56043 1766628 1797254 1827432 1858455 1892146 1927610 1963742 2002007 2043386 2085570 2126574 2168093
56032 2168093 2211948 2256438 2299747 2343687 2390395 2438603 2486841 2536871 2590022 2643762 2696087
56021 2696087 2749825 2808232 2869780 2931862 2996156 3065659 3139690 3216412 3296930 3382290 3470008
56010 3470008 3558435 3650910 3750671 3855407 3961765 4071188 4186020 4304189 4423654 4547966
56000 4547966 4681285 4821926 4967053 5119626 5284121 5459426 5642628 5835767 6042064
55991 6042064 6259687 6486280 6725404 6981529 7253332 7539289 7844802 8175860 8530943
55982 8530943 8907513 9311012 9748676 10220351 10725135 11271225 11868985 12520410 13226336
55973 13226336 13998040 14850710 15792489 16832661 17994272 19306216 20790860 22474167
55965 22474167 24400984 26626252 29200613 32181742 35650599 39698177 44406539 49863444
55957 49863444 56184074 63494806 71908835 81549229 92593559 105280847 119903712 136838125
55949 136838125 156571708 179664609 206654934 237852548 272781581 309257494 342823373
55942 342823373 367577013 378445462 373480459 354498187 325788773 292122992 257379516
55935 257379516 224128094 193768384 166844860 143395625 123233431 106074214 91564764
55928 91564764 79323267 69000656 60297960 52945239 46701901 41377366 36825284 32917037
55920 32917037 29538392 26604523 24054482 21830052 19874909 18149440 16627975 15282273
55912 15282273 14081681 13006456 12046241 11186830 10410937 9709509 9079538 8512091 7993734
55903 7993734 7517914 7084067 6687172 6318641 5976017 5661765 5373669 5105546 4855994
55894 4855994 4627386 4417480 4220622 4035961 3866164 3709249 3559959 3418087 3287488
55885 3287488 3167758 3054619 2947743 2850536 2762654 2679839 2600627 2526193 2454026 2378875 2300233
55874 2300233 2222628 2148453 2076376 2006474 1940729 1878227 1815590 1752560 1692129 1635273 1580476
55863 1580476 1528114 1480147 1435726 1392129 1349747 1311226 1276024 1240923 1205733 1173467 1144954
55852 1144954 1118183 1093008 1071466 1053184 1035182 1016615 999196 982654 964334 943842 923748
55841 923748 905027 885933 865967 846962 829568 812432 795566 780852 768490 756344 743481
55830 743481 731191 720054 709162 698606 689649 682077 674325 666384 659553 653303 645494 635815 625931
55817 625931 616195 605370 593682 582892 573169 563021 552526 543507 536351 529698 523432 518871 515880
55804 515880 512977 510530 510609 513365 516653 519603 523456 528492 533241 537125 540782 543376 542800 539176 535093
55789 535093 531683 527428 521420 514797 508238 501113 493942 488617 485117 480695 473320 463441 451746 438131
55775 438131 423741 411087 400888 391415 381983 374362 369563 366000 362291 359341 358062 357268 355506 353071
55761 353071 350776 348480 346041 344046 342489 340332 337244 334041 330678 325793 319101 312227 306223 300172
55747 300172 293190 285845 278627 271038 263259 256750 252019 247686 242902 238800 236312 234403 231871 229237
55733 229237 227448 226117 224379 222267 220091 217721 215501 214556 215188 216150 216307 215726 214475 211978 208464
55718 208464 205508 204080 203419 202630 201891 201228 199779 197441 195735 195816 196909 197783 198431 199208 199649 199404 199172
55701 199172 199546 199848 199129 197376 194966 191980 188726 185803 183002 179462 175504 172804 171906 171120 168868
55686 168868 165685 162896 160858 159645 159965 162091 165106 168386 172580 178029 183570 188130 192136 196055
55672 196055 198953 200024 200346 201430 202982 203646 203099 201936 200287 198086 196017 194656 193207 190433 186439
55657 186439 182376 178959 176411 175161 175288 175809 175781 175688 176582 178349 180020 181368 182894 184499 185364 185043
55641 185043 183753 181694 178932 175744 172374 168711 164840 161471 159089 157089 154523 151319 148099 145249
55627 145249 142893 141380 140992 141443 142165 142766 142860 142100 140878 140167 140066 139376 137394 135251 134422 134651 134491
55610 134491 133313 131612 129756 127645 125480 123763 122504 121251 119983 119303 119693 120993 122481 123188 122469
55595 122469 120642 118759 117406 116247 115012 114187 114159 114376 114082 113344 112692 112255 111999 112306 113547 115466 117633
55578 117633 120177 123448 127368 131722 136684 142449 148750 155330 162583 171117 181048 192054 203583 214496
55564 214496 223094 228263 230280 230067 228157 224820 220505 215361 208773 200131 189828 179047 168917 160187
55550 160187 153145 147342 141929 136750 132491 129413 126709 123717 120937 119078 117866 116596 115184 113796
55536 113796 112122 109989 108175 107570 107874 108083 107971 108155 108905 109762 110298 110491 110379 109865 108806 106956 104121
55519 104121 100747 97975 96613 96381 96512 96648 96732 96573 96013 95129 93904 92206 90412 89347 89145 88924 87984
55502 87984 86630 85344 84070 82889 82377 82508 82184 80821 79515 79561 80601 81347 81455 81505 81663 81567 81139 80470
55484 80470 79269 77444 75824 75291 75592 75991 76649 78205 80358 82009 82689 82808 82678 82245 81686 81350 81201
55467 81201 80960 80612 80138 79172 77699 76556 76392 76613 76250 75382 74727 74443 74392 75056 76857 78942 80003 80106
55449 80106 80449 81469 82412 82726 82696 82680 82796 83280 84094 84324 83117 81151 80021 80221 80814 81022 80855 80237
55431 80237 78973 77762 77854 79199 80212 79889 79125 79290 80423 81541 82044 82132 82187 82272 82102 81442 80668 80683 81818
55412 81818 83169 83641 83334 83093 83056 82715 82168 82114 82552 82625 81954 81075 80381 79636 78737 78021 77543 76939 76276 76163
55392 76163 76726 77301 77413 77272 77056 76555 75860 75639 76381 77995 80267 82944 85227 86088 85406 84081 82832
55375 82832 81625 80396 79427 78726 77941 77185 77089 77703 78255 78359 78563 79203 79659 79346 78670 78364 78507 78806 79219
55356 79219 79637 79560 78791 78077 78336 79448 80319 80056 78757 77312 76636 76958 77718 78310 78787 79469 80098 80052 79345
55337 79345 78638 78181 77527 76519 75792 75946 76820 77885 78764 79119 78678 77706 76951 76751 76700 76396 75975 75691 75543
55318 75543 75589 76040 76784 77387 77782 78376 79211 79642 79156 78004 76787 75994 76086 77323 79140 80372 80451 79837
55300 79837 78993 77680 75721 73772 72707 72645 73058 73481 73743 73888 74183 74845 75577 75802 75526 75424 75886 76570
55282 76570 77163 77892 78963 80129 81150 82104 82867 82909 82022 80715 79571 78768 78497 79048 80088 80556 79878
55265 79878 78679 77784 77175 76542 76211 76741 78011 79420 80673 81802 82722 83320 83712 83956 83818 83234 82622
55248 82622 82325 82159 81923 81969 82741 84152 85814 87444 88541 88228 86108 83007 80222 78252 76847 75987
55232 75987 76071 77136 78489 79280 79188 78530 77912 77759 78089 78744 79713 80890 81706 81605 80889 80469 80661 80975 81224
55213 81224 81883 83004 83737 83604 83444 84293 85877 87042 87219 86709 85959 85289 84992 84976 84598 83513 82318 81720
55195 81720 81415 80630 79450 78758 78941 79491 79870 80078 80312 80689 81319 82175 82878 83072 82950 82984 83277 83660 84218
55176 84218 85117 86000 86243 85882 85749 86493 87898 89226 89888 89711 88912 87961 87196 86505 85578 84490 83823 84121
55158 84121 85347 86857 87879 88104 87837 87453 86815 85588 84042 83009 82825 82861 82423 81702 81432 81915 82810
55141 82810 83633 84156 84466 84862 85468 85901 85736 85337 85591 86557 87041 86002 83840 81829 80789 80777 81514 82447
55123 82447 82834 82423 81803 81628 81820 81990 82137 82382 82513 82424 82580 83327 84171 84427 84220 84147 84310 84462 84753 85469
55103 85469 86300 86712 86912 87599 88862 90127 91121 92086 93059 93675 93740 93392 92724 91836 91128 90918 90909 90701 90567
55084 90567 90985 91623 91783 91711 92425 94176 96087 97495 98624 99616 99927 99268 98301 97778 97612 97378 97174 97361
55066 97361 97815 98022 97746 97187 96650 96397 96623 97316 98272 99358 100562 101711 102444 102622 102416 101937 101142 100264
55048 100264 99824 99941 100002 99411 98381 97592 97283 97116 96827 96576 96459 96038 94694 92454 90219 88979 88883 89289
55030 89289 89634 89913 90228 90289 89745 88798 88188 88584 90123 92344 94428 95708 96168 96326 96546 96748 96855 97032
55012 97032 97274 97290 97167 97622 99070 100834 101857 101886 101427 100924 100596 100734 101323 101594 100688 98728 96627 94966
54994 94966 93752 93114 93387 94449 95682 96749 97820 98925 99654 99691 99163 98387 97658 97237 97102 96762 95834
54977 95834 94734 94275 94625 95239 95703 96048 96281 96277 96079 95730 94936 93637 92781 93542 95728 97874 99123 100031
54959 100031 101223 102318 102740 102709 102666 102337 101206 99587 98471 98438 99182 100014 100466 100473 100201 99757 99028 98003
54941 98003 97087 96752 96936 97235 97630 98456 99615 100468 100664 100500 100294 100030 99844 100250 101489 103142 104720 106219
54923 106219 107827 109579 111507 113677 115782 117280 118276 119763 122558 126371 130221 133344 135371 136098 135588
54908 135588 134158 131952 128906 125380 122292 120149 118361 116018 113036 110111 107840 106386 105715 105651 105825
54893 105825 105988 106266 106823 107487 107976 108291 108572 108856 109265 110144 111577 112994 113668 113472 112839 112201 111960 112836
54875 112836 115592 120124 125152 129156 131662 133489 135677 138270 140330 141122 140913 140355 139469 137769 135190
54860 135190 132293 129550 126997 124632 122588 120822 119148 117679 116683 115871 114440 112066 109333 106978 105200
54845 105200 103850 102719 101417 99650 97857 96907 96829 96585 95514 94273 93792 93968 94081 93933 93868 94026 94270
54828 94270 94579 94965 95334 95886 97154 99048 100398 100235 99206 98844 99656 100756 101249 101130 100792 100451 100290
54811 100290 100572 101268 101944 102169 101830 101051 100137 99600 99907 101097 102811 104633 106203 107123 107085 106144 104754
54794 104754 103599 103377 104398 106190 107776 108556 108704 108603 108352 108029 107889 107921 107687 107008 106350 106092 105948 105631
54776 105631 105545 106128 106997 107552 108077 109365 111521 113996 116587 119451 122287 124614 126975 130765 136421 142587
54760 142587 147596 151193 154316 157578 160442 161692 160459 157003 152556 148197 143910 139062 133690 128674
54746 128674 124654 121422 118580 116118 114016 111903 109654 107861 107122 107134 107035 106497 105952 105734 105560 105033 104346
54729 104346 104232 105301 107513 110212 112603 114298 115605 117257 119726 122724 125533 127933 130569 134071
54715 134071 138003 141151 142865 143564 143714 143002 140983 138114 135398 133190 131028 128649 126499 124998 123808
54700 123808 122266 120298 118528 117495 116991 116322 115117 113659 112393 111356 110417 109858 110167 111154 111807 111355
54684 111355 110115 109005 108535 108577 108744 108639 108033 107190 106762 107041 107585 107863 107871 107754 107315 106476 105762 105634 105672
54665 105672 105151 104170 103444 103183 103020 102993 103672 105163 106791 107939 108573 108812 108675 108452 108621 109102 109182 108506
54647 108506 107579 107012 106833 106879 107237 107807 107972 107326 106451 106367 107293 108391 108739 108241 107604 107695 108848 110636 112263
54628 112263 113244 113661 113762 113583 113059 112284 111401 110370 109045 107539 106379 106174 107016 108305 109294 109885 110644
54611 110644 111950 113446 114515 114940 114816 114168 113092 111988 111136 110287 109234 108547 108995 110308 111213 110837
54595 110837 109463 107853 106491 105684 105668 106241 106780 106989 107211 107738 108240 108250 107881 107718 108232 109501 111210 112673
54577 112673 113199 112734 111944 111450 111221 110865 110202 109322 108374 107589 107259 107465 107931 108318 108512 108534 108411 108272 108407
54558 108407 109105 110518 112606 114975 116859 117690 117706 117680 118021 118536 118991 119360 119501 119158 118452 117913 117896 118472
54540 118472 119883 122373 125358 127540 128304 128363 128557 128681 128115 127018 126132 125719 125432 125010 124493 123882 123168
54523 123168 122611 122441 122319 121591 120142 118658 117998 118493 119756 120876 121009 120062 118727 117701 117105 116855 117132
54506 117132 117990 118818 118771 117712 116290 115145 114408 113902 113477 113132 113021 113218 113331 112747 111549 110812 111457 113127
54488 113127 114743 115890 116936 118019 118826 119426 120461 122138 123679 124200 123729 122954 122338 121856 121367 120868
54472 120868 120524 120704 121813 123798 125952 127479 128268 128861 129701 130622 131187 131363 131603 132238 133049 133649 134086
54455 134086 134657 135174 134954 133720 132055 130591 129305 128094 127560 128367 130002 131100 131176 131214 132208 133781 134775
54438 134775 134664 133792 132582 131143 129616 128320 127437 126884 126556 126430 126416 126396 126486 127027 128173 129634 130927
54421 130927 131768 132168 132290 132386 132725 133387 134087 134358 133977 133148 132241 131476 130953 130886 131523 132772 134061 134815 135045
54402 135045 135336 136173 137378 138330 138715 138911 139503 140527 141431 141856 142175 142997 144237 145071 144881 143960 143085 142620
54384 142620 142312 141887 141521 141606 142162 142721 142781 142353 141937 141987 142487 143106 143639 144142 144707 145337 146058 146950 148019
54365 148019 149201 150555 152291 154469 156789 158852 160626 162606 165386 168959 172376 174276 174002 172098
54351 172098 169599 166980 164107 161026 158192 155783 153322 150344 147119 144375 142509 141357 140566 139881 139145
54336 139145 138346 137648 137234 137150 137392 137945 138561 138684 137900 136416 134880 133826 133405 133486 133721 133640 133060 132408 132401
54317 132401 133337 134923 136677 138201 139046 138828 137749 136757 136762 137657 138391 138119 137072 136116 135586 134895 133385
54300 133385 131306 129706 129432 130465 132118 133606 134478 134845 135309 136397 137943 139225 139790 139849 139749 139360
54284 139360 138350 136877 135632 135178 135468 136066 136631 137108 137556 137966 138317 138749 139506 140619 141771 142618 143077
54267 143077 143164 142769 141917 141099 140880 141220 141579 141709 141868 142249 142764 143501 144819 146705 148566 150008 151327
54250 151327 152821 154086 154501 154090 153382 152667 151887 151040 150202 149267 148145 147079 146370 145889 145232 144230 142964
54233 142964 141473 139867 138519 137735 137377 137296 137859 139436 141488 142872 143170 143107 143484 144267 144874 144931 144440 143613
54215 143613 142804 142329 142086 141590 140587 139448 138793 138829 139140 139040 138104 136560 135176 134607 134890 135678 136791
54198 136791 138183 139512 140230 140213 139909 139778 139891 140182 140676 141264 141592 141426 140992 140724 140833 141233 141741 142179
54180 142179 142402 142376 142230 142218 142677 143840 145473 146770 146988 146247 145425 145180 145343 145326 144819 143930 142935 142152 141851
54161 141851 142011 142198 141917 141137 140415 140465 141529 143087 144204 144300 143565 142555 141571 140639 139974 139997 140806 141935
54143 141935 142898 143706 144622 145582 146147 146015 145387 144736 144391 144402 144663 144967 144956 144306 143118 141969 141390 141415 141839
54124 141839 142676 143911 144990 145240 144879 144911 145730 146559 146771 147055 148438 150642 152399 153249 154084 155752 157956
54107 157956 159754 160575 160390 159478 158348 157543 157237 157222 157373 157789 158433 159075 159726 160724 162259 164196 166499
54090 166499 169374 172725 175839 177841 178291 177237 175071 172456 170041 167989 165995 163868 161841 160270
54076 160270 159418 159575 160850 162667 164020 164541 164869 165666 166790 167867 169173 171270 174005 176498 178086
54061 178086 178791 178891 178617 178417 178994 180682 182931 184734 185590 185904 186385 187223 188038 188514 188766 188998 189217 189569
54043 189569 190637 192923 196185 199742 203384 207538 212579 218386 224525 230421 235444 239447 243241 247912
54029 247912 253540 259122 263878 267947 271609 274572 276478 277578 278483 279671 281519 284148 286796 288012
54015 288012 287111 285070 283401 282472 281488 279666 276764 272768 267837 262501 257337 252449 247644 242938 238497
54000 238497 234274 230122 226086 222208 218387 214867 212443 211562 211492 211109 210255 209571 209155 208253 206352 203806
53984 203806 201238 198950 197082 195750 194788 193855 192951 192414 192299 192247 192064 191913 191841 191724 191789 192553 193916 194899
53966 194899 194770 194022 193805 194744 196623 198931 201281 203464 205487 207492 209550 211688 214208 217653 222297
53951 222297 227961 234373 241268 247887 252967 255684 256333 255712 254264 252251 250325 249192 248815 248641 248563 249032
53935 249032 250171 251444 252491 253704 255620 258192 261087 264378 268445 273274 278340 283155 287620 291839
53921 291839 295986 300477 305841 312117 318567 324326 329365 334550 340699 347779 355146 362366 369576 376986
53907 376986 384287 390723 395776 399605 402710 405192 406513 406012 403593 399860 395744 392024 388941 386026
53893 386026 382395 377521 371673 365405 358702 351083 342548 333894 325824 318162 310340 302412 295025 288518
53879 288518 282588 276939 271739 267199 263121 259208 255587 252579 250017 247238 243855 240269 237189 234822
53865 234822 232771 230584 228156 225619 223094 220651 218321 216070 213902 211985 210472 209127 207505 205696
53851 205696 204472 204304 204477 203719 201648 199094 197026 195675 194798 194236 193921 193749 193684 193742 193711 193275 192601 192356
53833 192356 192806 193313 193160 192601 192559 193467 194881 196136 196916 197190 197012 196616 196453 196940 198130 199596 200702
53816 200702 201179 201487 202388 204038 205813 207147 208218 209627 211764 214760 218603 222893 226921 230566 234759
53801 234759 240388 246942 252947 257694 261807 266102 270622 275032 279246 283230 286660 289225 291082 292720
53787 292720 294528 296604 298741 300441 301241 301176 300750 300278 299456 297667 294503 289983 284605 279290 274871 271342
53771 271342 267854 263616 258605 253242 247839 242690 238369 235380 233518 231975 230120 227941 225669 223290
53757 223290 220579 217509 214521 212342 211415 211359 211082 209650 207176 204682 203000 201929 200692 199120 198001
53742 198001 198103 199190 200380 201271 202147 203073 203437 202763 201506 200548 200236 200367 200844 201748 202874 203871 204875
53725 204875 206401 208485 210475 211914 213120 214587 216273 217766 218840 219486 219708 219685 219968 221097 223023
53710 223023 225099 226631 227346 227599 228309 230404 233970 237998 241236 243221 244361 245228 246178 247538 249701
53695 249701 252796 256549 260582 264713 268806 272514 275431 277458 278842 279774 280110 279646 278598 277570 276921
53680 276921 276293 274976 272722 270042 267717 266189 265432 265161 265023 264707 264098 263334 262633 262050 261441 260675 259868
53663 259868 259385 259475 259868 259825 258829 257244 256140 256314 257521 258713 259031 258545 258082 258358 259281 260120 260287 259851
53645 259851 259334 259202 259660 260656 261894 262981 263838 264863 266490 268657 270976 273317 275890 278723 281433
53630 281433 283667 285574 287683 290405 293706 297121 300063 302341 304438 307177 310990 315602 320405 325006
53616 325006 329368 333612 337827 341980 345923 349471 352571 355399 358321 361694 365624 369849 373902 377461
53602 377461 380530 383372 386366 389818 393625 397156 399748 401385 402599 403636 404120 403684 402497 400957 399291
53587 399291 397748 396706 396184 395648 394728 393658 392575 390912 388218 385112 382586 380638 378442 375659 372686
53572 372686 369732 366664 363758 361604 360054 358208 355698 353102 350817 348423 345625 342958 341036 339816
53558 339816 339138 339328 340629 342589 344576 346394 347969 348997 349492 350107 351315 352725 353858 355018 356706
53543 356706 358640 360203 361566 363502 366259 369384 372568 375942 379585 383446 387780 393066 399377 406317
53529 406317 413618 421405 429858 439034 449008 459764 470899 481833 492409 503091 514571 527334
53517 527334 541401 556311 571553 587250 604093 622381 641593 661272 681755 703417 725723
53506 725723 747917 770279 793709 818113 842161 864749 885853 905838 924822 943088 961281
53495 961281 979631 997547 1014418 1030414 1046068 1061499 1076512 1091185 1105895 1120925 1136377
53484 1136377 1152268 1168360 1184023 1198617 1212056 1224863 1237712 1250923 1264196 1276670 1287364
53473 1287364 1295753 1301951 1306382 1309339 1310803 1310552 1308370 1304263 1298369 1290583 1280496 1267975 1253668
53460 1253668 1238637 1223605 1208800 1194282 1179948 1165310 1149818 1133409 1116302 1098392 1079490
53449 1079490 1060219 1041846 1024848 1008229 990785 972590 954673 937626 921265 905665 891868
53438 891868 881193 874048 869613 866607 864214 862302 860954 860125 859894 860769 863291 867291 871890 876380 880941
53423 880941 886374 893390 902281 913047 925548 939595 955017 971644 989250 1007664 1026971 1047460
53411 1047460 1069403 1093058 1118804 1146884 1176852 1207634 1238415 1269364 1301278 1334680 1369483
53400 1369483 1405486 1442877 1482129 1523544 1567037 1612360 1659302 1707537 1756404 1805235 1853970
53389 1853970 1903166 1953137 2003357 2052949 2101515 2149087 2195467 2240028 2282150 2321501 2357967
53378 2357967 2391647 2422804 2451409 2476731 2497792 2514236 2526450 2534884 2539636 2540548 2537144 2528460
53366 2528460 2513562 2492420 2465826 2434435 2398421 2358130 2314378 2267883 2219124 2169071 2119292
53355 2119292 2070751 2023040 1975419 1928144 1882166 1837940 1795261 1754000 1714238 1675794 1638253
53344 1638253 1601483 1565556 1530234 1495163 1460596 1427359 1395982 1366365 1338330 1311942 1287153
53333 1287153 1263716 1241804 1222177 1205317 1190695 1177314 1164689 1152859 1141565 1129984 1117484
53322 1117484 1104345 1091537 1079875 1069546 1060334 1052056 1044631 1037827 1031250 1024752 1018698 1013607 1009633
53309 1009633 1006672 1004992 1005341 1008151 1012839 1018255 1023826 1029964 1037291 1045812 1055133 1065325 1077116 1091096
53295 1091096 1107006 1124099 1142070 1161350 1182419 1205165 1229079 1253804 1279091 1304242 1328033
53284 1328033 1349536 1368850 1386756 1403686 1419320 1433132 1444875 1454332 1460960 1464258 1464308 1461580 1456335
53271 1456335 1448644 1438883 1427615 1414878 1400159 1383253 1364630 1344659 1323020 1299384 1274274 1248742
53259 1248742 1223457 1198577 1174120 1149883 1125171 1099323 1072508 1045538 1018973 992885 967366
53248 967366 942658 918764 895435 872569 850183 828041 805862 783850 762503 741970 722238
53237 722238 703761 687009 671398 655665 639595 624399 610973 598768 587037 576252 567300 559885
53225 559885 552744 545167 537366 529544 521510 513239 505032 496882 488215 478485 467689 456218 444474
53212 444474 432710 421073 409844 399638 391105 384169 377895 371396 364601 357857 351211 344588 338325
53199 338325 332911 328296 323962 319502 314694 309269 303270 297477 292786 289102 285438 281129 276464 272140
53185 272140 268638 266101 264219 262204 259468 256450 254139 252672 251070 248597 245623 242787 239935 236600
53171 236600 233161 230810 230322 231192 232080 231986 231020 230123 229990 230337 230351 229704 228728 227679 226438 225059 224025
53154 224025 223575 223193 222220 220745 219510 219064 219281 219523 219078 217667 215816 214487 214050 213827 212982 211657 210800
53137 210800 210978 211826 212714 213561 214765 216536 218493 219977 220693 221036 221696 222931 224380 225610 226576 227439
53121 227439 228208 228866 229659 230882 232430 233877 234984 235841 236535 236995 237207 237314 237328 237010 236207 235122 234076
53104 234076 233144 232196 231199 230290 229566 228932 228199 227236 226024 224653 223293 222128 221292 220867 220897 221361 222127 223042
53086 223042 224017 224907 225298 224636 222781 220390 218504 217694 217688 217876 217981 218128 218408 218627 218545 218221 218047 218350 218962
53067 218962 219197 218381 216493 214205 212278 211021 210345 210099 210128 210201 210173 210176 210376 210582 210421 209983 209945 210836 212408
53048 212408 213969 215214 216426 217925 219624 221188 222346 222893 222662 221798 220987 221009 221855 222520 221930 219995
53032 219995 217599 215674 214562 214148 214141 214112 213664 212933 212659 213411 214852 216058 216504 216424 216299 216339 216479 216611 216700
53013 216700 216819 217117 217610 218077 218417 219017 220360 222195 223489 223472 222506 221697 221811 222766 223958 224791 224959 224553
52995 224553 223946 223431 222942 222291 221615 221399 221975 223160 224477 225591 226444 227021 227213 226968 226475 226128 226287 227089
52977 227089 228445 230105 231806 233406 234957 236617 238514 240698 243120 245469 247092 247399 246544 245519 245376
52962 245376 246393 248071 249713 250762 250766 249515 247363 245127 243459 242382 241498 240459 239130 237515 235813
52947 235813 234446 233750 233570 233371 232855 232265 231923 231652 230966 229792 228634 227878 227312 226597 225901 225639 225720 225569
52929 225569 224888 223964 223131 222448 222013 222100 222630 223002 222822 222495 222672 223405 224254 224988 225700 226387 226926 227343 227693
52910 227693 227782 227472 227116 227205 227635 227863 227725 227556 227443 226997 226056 225079 224529 224286 223911 223235 222468 221955 221930 222211
52890 222211 222129 221221 220070 219913 221141 222701 223312 222856 222161 221855 222011 222628 223866 225731 227898 229885 231229
52873 231229 231646 231275 230721 230609 231171 232348 234014 235888 237526 238722 239759 240923 241964 242423 242311 242090
52857 242090 242024 241952 241711 241380 241083 240814 240516 240096 239283 237731 235332 232290 228905 225407 221941 218544 215182
52840 215182 211986 209374 207696 206824 206314 205927 205743 205863 206233 206787 207423 207854 207824 207554 207657 208484 209774 211022
52822 211022 211868 212029 211213 209482 207527 206252 206037 206558 207241 207731 207991 208183 208548 209274 210380 211724 213086
52805 213086 214213 214805 214623 213676 212242 210664 209109 207547 205913 204267 202768 201591 200861 200610 200759 201166
52789 201166 201700 202246 202640 202710 202371 201668 200695 199645 198914 198888 199510 200307 200993 201786 202841 203729 203947 203697 203502
52770 203502 203185 201985 199872 197972 197273 197523 197895 198181 198660 199239 199561 199856 200852 202670 204463 205407 205572
52753 205572 205583 205790 206123 206476 206871 207305 207704 208064 208578 209559 211210 213374 215573 217359 218650 219671 220692
52736 220692 221948 223620 225622 227475 228684 229275 229757 230548 231614 232620 233233 233320 233048 232776 232608 232140 230855
52719 230855 228784 226522 224645 223323 222408 221561 220402 218884 217494 216706 216288 215644 214818 214508 214998 215754
52703 215754 216383 217261 218642 219713 219411 217906 216471 215912 215867 215752 215677 216069 216966 218108 219398 220810 221978
52686 221978 222367 221843 220844 219947 219458 219396 219670 220119 220549 220840 221041 221331 221862 222574 223096 222876 221632 219833
52668 219833 218589 218814 220358 222174 223427 224345 225685 227509 228849 228779 227542 226382 226369 227640 229674 231953
52652 231953 234306 236881 239918 243354 246498 248268 248028 246134 243512 240741 237749 234349 230852 228009
52638 228009 226459 226253 226824 227388 227485 227237 227085 227356 228168 229601 231683 234166 236564 238538 239989 240684 240162
52621 240162 238362 236138 234721 234613 235251 235719 235578 235033 234612 234697 235161 235456 235260 234970 235196 235913 236499 236646
52603 236646 236651 236656 236160 234726 232805 231375 230943 231235 231734 232136 232409 232748 233400 234328 235120 235502 235804 236653 238290
52584 238290 240422 242535 244073 244599 244305 244258 245539 248024 250399 251532 251423 250792 250185 249748 249469 249274 249012
52567 249012 248578 248001 247332 246604 245942 245507 245217 244746 243866 242666 241378 240222 239432 239150 239201 239217 239043 238693
52549 238693 237922 236343 234173 232366 231600 231519 231456 231584 232738 235141 237859 239635 239950 239240 238403 238173 238675
52532 238675 239488 240246 241077 242243 243561 244581 245260 245980 246873 247673 248315 249115 250029 250350 249659 248676 248540 249431
52514 249431 250547 251342 252105 253224 254559 255898 257548 259995 263249 266866 270418 273560 275808 276708 276186
52499 276186 274427 271481 267365 262584 258169 254996 253131 251912 250554 248812 247262 246815 247604 248417 247730
52484 247730 245428 243062 242213 242987 244371 245565 246458 247136 247598 248015 248787 250128 251833 253591 255332 257202
52468 257202 259293 261446 263235 264241 264516 264722 265704 267911 271215 275099 278836 281676 283147 283181 281833
52453 281833 279073 275069 270497 266242 262790 260144 258182 256785 255716 254789 254122 253882 253749 253053 251568
52438 251568 249845 248601 247991 247576 246833 245621 244311 243455 243192 243102 242885 242936 243785 245111 245962 246077 246304 247397
52420 247397 248972 250160 250929 252146 254446 257493 260426 262737 264565 266322 268126 269711 270971 272426
52406 272426 274912 278890 284390 291458 300004 308983 316435 320902 322512 322274 320628 317311 312385 306715
52392 306715 301322 296717 292963 289979 287587 285584 283986 283069 282975 283373 283659 283491 283100 283076 283810 285177 286804
52375 286804 288600 290837 293745 297215 300988 304929 309054 313476 318379 323793 329285 334128 337910 340679
52361 340679 342436 342927 342262 341288 340845 340808 340407 339331 338106 337340 337076 336975 336860 336935 337583 338975 340779 342386
52343 342386 343533 344556 345907 347726 350127 353482 357883 362587 366694 370409 375036 381515 389433 397688
52329 397688 405752 413979 422934 432739 443034 453529 464658 477595 493271 511279 530024 548056
52317 548056 565084 581648 598139 614311 629545 643446 656322 669166 682972 697899 713215
52306 713215 728113 742449 756706 771373 786454 801340 815172 827484 838533 848821 858388 866901
52294 866901 874334 881005 886721 890431 891181 889167 885442 880759 875149 868543 861292 853956 846907 840359
52280 840359 834584 829822 826045 823023 820752 819666 820227 822344 825400 828990 833463 839523 847380 856527
52266 856527 866348 876706 887781 899466 911067 921702 931112 940109 950053 961673 974440 987218
52254 987218 999326 1010851 1022188 1033661 1045376 1056965 1067444 1075803 1081814 1085854 1087948 1087541 1084364
52241 1084364 1078991 1072228 1064432 1055803 1046846 1037967 1028877 1019012 1008518 998324 989177 980986 973227
52228 973227 965646 958394 951674 945466 939576 933868 928416 923397 918870 914818 911389 908903 907498 906941
52214 906941 906961 907595 909034 911264 914079 917340 921034 925152 929652 934471 939381 943938 947747 950748 953225
52199 953225 955644 958600 962637 967839 973667 979402 984655 989333 993371 996820 1000104 1003843 1008340 1013335
52185 1013335 1018124 1021759 1023429 1023012 1021188 1018602 1015005 1009617 1002299 993936 985503 977202 968703 959891
52171 959891 951108 942892 935811 930412 927016 925492 925334 925968 926921 927843 928586 929356 930687 933044 936321 939723
52155 939723 942317 943773 944497 945007 945425 945685 945996 946777 948182 949927 951538 952619 953046 953150 953587 954677
52139 954677 955937 956593 956530 956334 956439 956683 956854 957253 958469 960901 964749 970260 977774 987600 999979 1014961
52123 1014961 1032229 1051199 1071414 1092759 1115329 1139261 1164568 1190702 1216376 1240355 1262605
52112 1262605 1284132 1305486 1325991 1344737 1361689 1377250 1391269 1403231 1413095 1421239 1427730 1432387
52100 1432387 1435542 1438035 1440346 1442272 1443444 1443566 1442116 1438513 1432839 1425811 1417706 1407856 1395514 1380809
52086 1380809 1364535 1347464 1330236 1313484 1297563 1282452 1268338 1255952 1245820 1237532 1230366 1224480
52074 1224480 1220815 1219805 1220841 1223189 1226938 1232725 1240814 1250767 1261851 1273584 1285909 1298925 1312412
52061 1312412 1325695 1338120 1349602 1360530 1371185 1381453 1391065 1399814 1407546 1414223 1420005 1424984
52049 1424984 1428694 1430188 1428766 1424477 1417839 1409249 1398728 1386049 1371036 1353948 1335690 1317400
52037 1317400 1299709 1282548 1265670 1249074 1232825 1216878 1201347 1186615 1172904 1160029 1147899
52026 1147899 1136949 1127620 1119571 1111881 1103938 1095716 1087201 1078148 1068565 1058979 1049916 1041392 1033095 1024808
52012 1024808 1016384 1007622 998556 989746 981817 974538 966639 956736 944449 930496 915729 900215 883395
51999 883395 865108 846238 828137 811489 795996 781163 767057 754087 742289 731208 720471
51988 720471 710104 700112 690028 679205 667535 655588 643909 632379 620446 607860 594912 581969
51976 581969 569116 556340 543841 531955 520924 510949 502341 495368 489981 485921 483120 481900 482782
51963 482782 486152 491923 499266 506821 513500 519082 523796 527461 529543 530013 529541 528508 526392 522591 517554
51948 517554 512506 508212 504586 501501 499414 498978 500464 503857 509232 516649 525867 536504 548439 561758
51934 561758 576232 591115 605658 619640 633202 646158 657708 666989 673839 678903 682939 685984
51922 685984 687036 684374 676283 661871 641611 617261 591229 565777 542427 521689 503271 486778
51910 486778 472427 460961 452773 447321 443545 440727 438716 437523 437132 437711 439637 443044 447465 452037
51896 452037 455925 458502 459348 458264 455214 450099 442786 433604 423679 414487 406934 401053 396564 393480
51882 393480 391969 391848 392585 393851 395845 398917 402979 407519 412212 417293 423157 429645 435955 441254 445228
51867 445228 447975 449622 450277 450166 449438 447833 444942 440967 436870 433491 430777 428297 426249 425383 425873
51852 425873 426909 427702 428419 429636 431187 432054 431303 428636 424118 417978 410905 404056 398302 393557 389107
51837 389107 384516 379999 375994 372641 369763 367208 365131 363947 364025 365399 367678 370117 371835 372212 371317
51822 371317 369778 368052 365949 363187 360253 358196 357513 357642 357729 357441 356853 356059 355380 355613 357448 360632
51806 360632 364117 366988 368915 369855 369859 369296 368809 368765 368939 368901 368549 368140 367960 368045 368062 367390 365524 362540 359055
51787 359055 355676 352636 350064 348390 348158 349408 351383 353074 354138 355202 357029 359411 361219 361764 361778
51772 361778 362651 364977 368391 372701 378381 385665 393821 401840 409439 416841 423912 430132 435336 439762
51758 439762 443133 444240 441897 436195 428522 420350 412243 404041 395769 387992 381224 375301 369689 364433
51744 364433 360390 358265 357605 357110 355927 354458 353905 355253 358761 364191 371265 379750 389108 398252 405932
51729 405932 411480 415057 417082 417693 417040 415946 415833 417839 422028 427331 431984 434148 432716 427997 421613
51714 421613 415461 410627 407153 404509 402085 399377 396083 392180 387903 383585 379564 376258 374141 373483
51700 373483 374077 375353 376820 378282 379574 380280 380027 378986 377765 376792 376108 375860 376485 378016 379509 379699
51684 379699 378160 375435 372165 368622 365157 362477 361092 360816 361108 361698 362626 363931 365607 367760 370537
51669 370537 373990 378222 383543 390265 398473 408186 419540 432411 445816 457974 467059 471855 471883 467292
51655 467292 458780 447539 435192 423723 415065 410266 408908 409580 410956 412347 413362 413539 412452 409856
51641 409856 405555 399433 391859 383782 376064 368807 361755 355275 350506 348266 348145 349024 350388 352663 356141
51626 356141 360078 363281 365426 367177 368881 369666 368268 364521 359611 355039 351654 349511 348067 346445
51612 346445 343987 340836 337707 334989 332391 329649 327204 325862 325956 327092 328497 329398 329339 328566 328144 329335
51596 329335 332743 338156 345127 353502 363330 374333 385424 394756 400555 402189 400432 396554 391377 385347
51582 385347 379209 374034 370507 368605 368111 369188 372311 377852 385842 395915 407303 419010 430269
51569 430269 440993 451827 463755 477432 492528 507646 521105 532199 541839 552027 564596 580305
51557 580305 598961 620267 644317 671062 699355 726869 751080 770175 783043 789095 788622 782959
51545 782959 773567 760853 744322 723856 700297 674722 647741 619886 592325 566750 544545 526088
51533 526088 510691 497266 485336 475416 468165 463303 459888 457515 456489 456580 456411 454603 450978 446062
51519 446062 439962 432476 423982 415426 407465 400198 393616 387681 382084 376597 371673 368003 365364 362598
51505 362598 358996 355058 351614 348806 346356 344320 342925 341969 340985 339976 339540 340157 341598 343058 343720
51490 343720 343252 341962 340561 339702 339742 340785 342638 344678 346111 346653 346757 346940 347079 346602 345189 342960
51474 342960 340183 337157 334351 332230 330830 329696 328319 326485 324242 321763 319294 317024 314984 313186
51460 313186 311807 311025 310689 310412 309964 309358 308607 307754 307174 307468 308876 311075 313759 317081 321310 326325
51444 326325 331786 337670 344368 352385 362124 373586 385786 396664 404232 408086 409464 409806 409695 409250
51430 409250 408916 409293 410338 411194 410812 408627 404767 399926 395002 390627 386932 383746 380875 378122 375288
51415 375288 372405 369844 367930 366565 365411 364302 363186 361862 360149 358239 356520 355110 353983 353463
51401 353463 354037 355524 357007 357907 358686 360107 362175 364312 366366 368903 372553 377463 383441 390295 397937
51386 397937 406436 416036 426961 439266 453127 469280 488829 512427 539818 570272 603325 639056
51374 639056 677871 719974 764563 809080 849433 881585 903410 915206 918563 914847 904647 888198
51362 888198 865917 838524 806900 772022 734961 696852 658756 621508 585643 551534 519770
51351 519770 491301 466947 446564 429020 413281 399425 388197 379655 372745 366301 360010 354134
51339 354134 348726 343594 338811 334719 331425 328743 326693 325632 325659 326202 326536 326596 326999 328230 330059 331834
51323 331834 333160 334106 334814 335238 335394 335574 335977 336236 335643 333959 331680 329452 327567 326189 325670 326193 327280
51306 327280 328026 327891 327019 325870 324777 323840 322969 321985 320847 319747 318805 317733 316100 313920 311725 309966
51290 309966 308603 307400 306406 305932 306160 307005 308391 310500 313594 317582 321983 326456 331199 336493 341913
51275 341913 346417 349382 351172 352516 353709 354713 355628 356560 357309 357765 358424 359956 362290 364708 366860
51260 366860 369068 371465 373307 373501 371503 367612 362656 357579 352970 348799 344727 340721 337103 334033
51246 334033 331325 328852 326701 324831 323001 321263 320130 319975 320511 321042 320999 320132 318560 316794 315373 314320
51230 314320 313320 312561 312865 314652 317212 319464 321096 322511 324017 325549 326972 328183 329053 329640 330184
51215 330184 330558 330079 328416 326468 325693 326625 328549 330540 332183 333365 334102 334845 336346 338872 341875 344669
51199 344669 347121 349446 351665 353593 355123 356270 357043 357458 357497 356980 355695 353839 352159 351345 351305 351230 350415
51182 350415 348934 347529 346842 346768 346595 345776 344440 343096 342017 341186 340706 340873 341790 343148 344565 345880
51166 345880 347080 348140 349103 350143 351405 352900 354645 356675 358804 360593 361757 362459 362919 362899 361930 360054
51150 360054 357968 356191 354391 351890 348750 345949 344309 343654 343299 343032 343052 343091 342348 340595 338801 338123
51134 338123 338625 339438 339904 339997 339808 339394 339160 339694 340957 342246 343326 345007 348090 352142 355917 358751
51118 358751 360940 362826 364296 365303 366277 367650 369368 371244 373409 375945 378353 379951 380788 381624 382862
51103 382862 384038 384678 385207 386457 388450 390253 391109 391256 391411 391831 392204 392261 392103 391921 391692 391284 390686 390022
51085 390022 389381 388776 388368 388572 389766 391799 393994 395821 397389 399089 400993 402984 405277 408200 411419
51070 411419 414033 415746 417392 419884 423091 426310 429518 433534 439040 446073 454554 464861 477711 493611
51056 493611 512292 532265 551027 566329 577589 586010 593392 601112 610022 620490 632019 643149
51044 643149 652253 658570 662341 664003 663405 659758 652352 641376 628183 614818 603309 595091 590459
51031 590459 588105 585414 579879 570568 558323 544840 531823 520610 511803 505041 499512 494875 491430
51018 491430 489460 488893 489673 491882 495343 499577 504461 510490 518060 526815 536010 545177 554171 562894 571374
51003 571374 579852 588413 596717 604400 611476 617988 623573 627872 631196 634268 637311 639818 641200 641314
50989 641314 640391 638898 637561 637123 637911 639888 643166 648166 655258 664606 676405 690756 706929 723162
50975 723162 737802 750681 763056 776248 790737 806618 824388 844932 868996 897026 929384
50964 929384 966224 1007186 1051606 1099152 1149838 1203336 1258739 1315309 1372944 1431325 1488950
50953 1488950 1543701 1594280 1640479 1682139 1718682 1749833 1776012 1797587 1814409 1826661 1835701
50942 1835701 1843367 1850685 1857804 1864922 1872426 1879970 1886020 1888762 1887407 1882533 1875291 1866292 1855101 1840815
50928 1840815 1823111 1802481 1779303 1752975 1722342 1686776 1646502 1602048 1553922 1502853 1449882
50917 1449882 1396073 1342442 1290125 1240253 1193435 1149732 1109295 1072736 1040627 1012801 988294
50906 988294 965879 944640 924334 905328 887984 872001 856643 841724 828058 816645 807623 800290
50894 800290 793961 788440 783727 779719 776329 773647 771801 770757 770335 770413 771115 772775 775624 779360 783169
50879 783169 786419 789346 792822 797438 803062 809336 816210 823747 831726 839933 848741 859003 871238 885292
50865 885292 900822 917768 936222 956205 977935 1002017 1029068 1059311 1092793 1129721 1170285
50854 1170285 1214464 1262605 1315969 1375992 1442909 1515794 1594191 1679010 1771430 1871458 1978131
50843 1978131 2090665 2208605 2331055 2456535 2583710 2711526 2838264 2960840 3075397
50834 3075397 3178448 3267334 3340107 3395642 3434096 3456979 3466529 3464932 3454057 3435777 3412394
50823 3412394 3386749 3362037 3341435 3327562 3321831 3323999 3332305 3344003 3355774 3363892 3364607 3354853 3332756
50810 3332756 3297415 3248298 3184997 3107469 3016373 2913082 2799452 2677644 2550230 2420341
50800 2420341 2291405 2166471 2047772 1936951 1835382 1743889 1662361 1590131 1526780 1472177
50790 1472177 1425776 1386541 1353729 1327176 1306458 1290376 1277716 1268033 1261174 1256441 1252856 1249988
50778 1249988 1247857 1246204 1244439 1242159 1239086 1234652 1228373 1220646 1212384 1203709 1193694 1181655 1168019
50765 1168019 1153592 1138586 1122896 1106817 1090852 1075045 1059102 1043044 1027366 1012610 999186
50754 999186 987571 978290 971542 967076 964485 963510 964090 966379 970822 978096 988828 1003363 1021757 1043906
50740 1043906 1069639 1098771 1131164 1166782 1205689 1248022 1293991 1343925 1398135 1456433 1517755
50729 1517755 1580518 1643552 1706567 1769608 1832385 1894364 1955283 2015090 2073411 2129395 2182016
50718 2182016 2230157 2272285 2306420 2330622 2343483 2344386 2333756 2313259 2285449 2253024 2218405 2183874
50706 2183874 2151694 2123846 2101732 2086109 2077077 2074139 2076423 2082814 2091715 2100861 2107713 2109878 2104887
50693 2104887 2090032 2063325 2024782 1976172 1919429 1855959 1787525 1716793 1646397 1578038 1513005
50682 1513005 1452858 1398844 1351146 1309509 1274381 1246612 1226163 1211917 1202846 1198777 1199933 1206278
50670 1206278 1217427 1232689 1250991 1271169 1292510 1314697 1337165 1358942 1379311 1398271 1416126
50659 1416126 1432956 1448748 1463866 1479063 1495064 1512213 1530424 1549321 1568530 1587869 1607348
50648 1607348 1627088 1647466 1669278 1693495 1720769 1751237 1784722 1820926 1859480 1900097 1942731
50637 1942731 1987271 2032999 2078666 2123311 2166715 2208775 2248628 2284858 2316737 2345024 2371408
50626 2371408 2397391 2424051 2452541 2483557 2514964 2539961 2549237 2536750 2504094 2459115 2410465
50615 2410465 2363711 2321646 2286190 2258725 2239284 2226746 2219992 2218275 2220461 2224665 2228906 2231569
50603 2231569 2230919 2224639 2210377 2186650 2152938 2109323 2056656 1996964 1932900 1866481 1798724 1730655
50591 1730655 1664006 1600376 1540158 1482973 1428919 1378594 1331953 1288082 1246459 1207719 1172621
50580 1172621 1140886 1111750 1085341 1062725 1044618 1030650 1019985 1012130 1007009 1004638 1004960 1007750
50568 1007750 1012556 1018948 1026903 1036753 1048674 1062364 1077269 1092980 1109533 1127516 1147781 1170735
50556 1170735 1195925 1222537 1250160 1278685 1307665 1336351 1364388 1391853 1418521 1443763 1467509
50545 1467509 1490699 1514293 1538300 1562443 1587451 1615016 1646525 1682411 1722744 1767889 1818407
50534 1818407 1874690 1936895 2005002 2078733 2157636 2241361 2329836 2423123 2521259 2624123 2731243
50523 2731243 2841673 2954245 3067878 3181416 3293215 3401141 3502969 3596436 3678857 3747192
50513 3747192 3798951 3832960 3849076 3847335 3827623 3790085 3735566 3665671 3582669 3489408 3389167
50502 3389167 3285493 3182171 3083205 2992497 2913321 2848010 2798011 2763970 2745744 2742537 2753215
50491 2753215 2776434 2810283 2851853 2897230 2941845 2980687 3008324 3019300 3009235 2976036 2920285
50480 2920285 2844557 2752412 2647753 2534622 2416953 2298167 2180937 2067357 1959218 1858000
50470 1858000 1764660 1679627 1603097 1535169 1475529 1423057 1375931 1332360 1291362 1252962 1217788
50459 1217788 1186459 1159299 1136485 1118262 1104789 1095723 1090191 1087387 1087108 1089475 1094261 1100847 1108919
50446 1108919 1118848 1131181 1145983 1162975 1182135 1203783 1228060 1254452 1281745 1308118 1331387
50435 1331387 1349624 1361945 1368815 1371617 1371982 1371357 1370799 1370903 1371946 1374099 1377366 1381427 1385940 1391174
50421 1391174 1398099 1407605 1419763 1434112 1450577 1469859 1492989 1520733 1553440 1591205 1633943 1681386
50409 1681386 1733044 1788236 1846126 1905716 1965810 2025051 2082177 2136258 2186616 2232425 2272563
50398 2272563 2305892 2331518 2348684 2356569 2354370 2341454 2317332 2281784 2235305 2179341 2115872 2046947
50386 2046947 1974934 1902875 1833896 1770114 1712537 1662113 1620297 1588328 1566349 1553581 1549024
50375 1549024 1551649 1560273 1573770 1591182 1611123 1631110 1647932 1658764 1661708 1655574 1639783 1614672
50363 1614672 1581352 1541050 1494889 1444503 1392372 1341051 1292093 1245990 1202957 1163386 1127484
50352 1127484 1094773 1064332 1035723 1009682 987720 970862 958876 950804 945812 942879 939798 933500
50340 933500 922154 906731 890034 874405 860732 849280 840512 834794 831835 830875 831243 832574 834703
50327 834703 837641 841545 846497 852212 858141 863924 869733 876114 883352 891013 898277 904762 910777 916537
50313 916537 921425 924452 925443 925373 925415 925963 926690 927285 927895 928979 930988 934147 938435 943760 950081 957285
50297 957285 965055 973141 981849 992000 1004222 1018368 1033785 1050084 1067558 1086837 1108346 1132446
50285 1132446 1160396 1194673 1236891 1284067 1327110 1354514 1358910 1340775 1306573 1264280 1220468
50274 1220468 1179735 1144703 1115942 1092494 1073059 1056851 1043627 1033309 1025569 1019611 1014500 1009869
50262 1009869 1006065 1003422 1001820 1001361 1003040 1008009 1016287 1026785 1038541 1051338 1065230 1080136 1096035
50249 1096035 1112791 1129628 1145448 1159977 1174013 1188135 1201846 1214501 1226515 1238810 1251228
50238 1251228 1262143 1269608 1272398 1269993 1262231 1249349 1232196 1212302 1191667 1172099 1154326 1137921
50226 1137921 1122507 1108796 1097747 1088587 1078370 1063874 1043646 1018189 988920 957544 925940
50215 925940 895773 868022 843171 821628 803435 787728 773217 759480 747327 737644 730311 724528
50203 724528 719720 715617 711756 707523 702703 697629 692766 688425 684772 681661 678491 674652 670242 665972
50189 665972 662245 658701 654810 650465 645770 640667 635217 630000 625730 622490 619623 616348 612309 607666
50175 607666 602982 598917 595778 593333 591225 589454 588256 587675 587527 587669 588003 588328 588556 588973 589984 591637
50159 591637 593733 596326 599718 603962 608818 614267 620627 628073 636462 645780 656323 668208 680976
50146 680976 693901 706444 718361 729876 741982 756105 773072 792695 814734 839919 869464
50135 869464 903725 941658 981472 1021406 1060146 1097090 1132401 1166508 1199527 1231340 1261983
50124 1261983 1291527 1319567 1345078 1366682 1382635 1390789 1389366 1378104 1358315 1331722 1299659 1263479
50112 1263479 1224968 1185815 1147025 1109352 1074014 1042339 1014841 991092 970492 952571 936536
50101 936536 921183 905686 890161 875204 861068 847621 834780 822596 810986 799867 789657
50090 789657 781307 775610 772628 771901 772945 775362 778638 782280 786219 790843 796449 802730 808903 814314
50076 814314 818875 822994 827127 831340 835208 838184 840091 841184 841774 841909 841534 840704 839420 837319 833864
50061 833864 828935 823064 816992 811200 805930 801420 797768 794668 791584 788270 784992 782239 780397 779697
50047 779697 780174 781517 783252 785367 788639 794003 801531 810277 819255 828362 838187 849114 860825 872708
50033 872708 884563 896717 909459 922438 934764 945727 955378 964368 973296 982250 990892 998816 1005966
50020 1005966 1012935 1020839 1030674 1042703 1056548 1071789 1088077 1104532 1119425 1130939 1138314 1142180
50008 1142180 1143944 1145040 1146613 1149373 1153329 1157661 1160987 1161974 1159770 1153852 1143549 1128047 1107223
49995 1107223 1082372 1055692 1028869 1002450 976567 951716 928408 906557 885789 866166 847986
49984 847986 830934 814035 796612 778844 761240 743976 727001 710443 694602 679641 665504
49973 665504 652095 639479 628011 618261 610572 604587 599432 594497 589912 586186 583552 581754 580277
49960 580277 578599 576372 573604 570721 568414 567296 567644 569382 572378 576723 582565 589628 597254 605086
49946 605086 613327 621931 629892 635960 639936 642639 644731 646249 647265 648112 648618 647941 645597 641974 637311
49931 637311 630784 621464 609850 597703 586476 576501 567524 559315 551731 544731 538522 533315 529009
49918 529009 525538 523484 523746 526433 530462 534472 537833 540712 543480 546339 549282 552238 555314 558889
49904 558889 563318 568594 574513 581136 588763 597474 607039 617245 627871 638241 647263 654207 659135
49891 659135 662340 663738 663158 660911 657561 653229 647548 640347 631979 622855 613046 602661 592341 582947
49877 582947 574676 566812 558581 550063 542004 534897 528618 522995 518369 515254 513707 513320 513764 514994 516950
49862 516950 519409 522270 525772 530253 535793 542210 549377 557430 566627 576952 587879 598675 608994
49849 608994 619063 629088 638581 646538 652367 656417 659490 661913 663193 662526 659540 654519 647984 640234
49835 640234 631426 622016 612776 604227 596259 588548 581262 575075 570475 567282 564965 563365 562889 563928
49821 563928 566102 568394 570206 572144 575408 580466 586776 593764 601463 609891 618413 626212 633015 638881
49807 638881 643653 647258 650198 653044 655535 656874 656822 655763 653813 650735 646921 643503 640949 638167 633516
49792 633516 626310 616962 606272 595176 584757 575719 567865 560546 553566 547323 542227 538429 535982
49779 535982 534813 534477 534330 533987 533465 532971 532878 533801 536280 540242 545064 550221 555717 561835 568614 575623
49763 575623 582183 587833 592669 597117 601315 604870 607394 609004 609976 610123 608921 606161 602009 596478 589386
49748 589386 581059 572587 565064 558778 553432 548883 545302 542767 541094 540042 539408 538930 538446 538218 538766
49733 538766 540279 542450 545134 548804 553889 559767 564896 568197 570021 571649 574130 577844 582912 589554
49719 589554 597950 607994 619243 631071 642952 654697 666238 676967 685466 690247 690783 687639 681751
49706 681751 673957 665077 655857 646640 637480 628774 621521 616804 615219 616684 620210 623690 624610 621634
49692 621634 615466 607993 600894 595210 591531 589876 589604 590136 591759 595253 600790 607685 615226 623269 632016
49677 632016 641697 652665 665491 680842 699309 720921 744222 765842 781859 790075 790984 786712
49665 786712 779640 771986 765689 761803 760259 760710 763496 769361 778256 788500 796891 799610 793795 779196
49651 779196 758423 735196 712221 690708 671320 654771 641484 631247 623434 617301 612141 607659
49639 607659 604347 603029 603808 605788 607925 609721 610904 610986 609612 607039 603791 599972 595374 590158 584928
49624 584928 580091 575517 570945 566406 562161 558460 555499 553393 552075 551404 551411 552233 553738 555464 557060
49609 557060 558570 560121 561577 562774 563997 565904 568896 572667 576392 579372 581609 583804 586668 590127
49595 590127 593340 595640 597309 599219 601822 604735 607267 609116 610491 611787 613288 615052 616911 618555
49581 618555 619690 620280 620675 621389 622575 623799 624598 625257 626692 629403 632855 636148 639030 641953 645440
49566 645440 649843 655513 662708 671229 680530 690149 699660 708290 715111 719801 722800 724585 725138 724250 721911
49551 721911 718192 713167 707291 701591 697140 694468 693623 694411 696340 698633 700806 703061 705786 708750 711159
49536 711159 712503 713114 713938 715939 719680 725201 732276 740791 750763 761995 774063 786798 800531 815675
49522 815675 832374 850698 870602 891094 909828 924303 933541 938198 939266 937460 933893 930385 928521
49509 928521 928791 931095 935655 942794 951768 960266 965297 964645 957676 945109 928252 908464 887153 865819
49495 865819 845679 827251 810522 795510 782397 771183 761539 753126 745749 739224 733432 728625 725256
49482 725256 723262 721863 720358 718857 717910 717721 718113 719054 720665 722633 724091 724391 723831 723437 724037 725606
49466 725606 727479 729127 730676 732603 735074 737767 740394 743071 746006 749069 751966 754651 757156 759037
49452 759037 759389 757621 753999 749387 744585 740005 735693 731428 726920 722155 717573 713778 711103 709528
49438 709528 709026 709852 712467 717214 724119 732965 743487 755409 768361 781938 795995 810765 826550
49425 826550 843417 861547 881814 905686 934439 968756 1008923 1054083 1100031 1138127 1158389
49414 1158389 1155558 1132712 1098859 1063043 1030488 1002934 980809 964338 953422 947512 945951 948283
49402 948283 954226 963413 975094 988078 1001201 1013988 1026706 1039715 1052933 1065996 1078600 1090481
49390 1090481 1101298 1110815 1119012 1125713 1130319 1132247 1131577 1128917 1124666 1118776 1111193 1102205 1092281 1081946
49376 1081946 1071904 1062939 1055435 1049245 1044210 1040633 1038939 1039042 1040341 1042343 1045085 1048889 1053792 1059272
49362 1059272 1064496 1068814 1072002 1073998 1074583 1073478 1070721 1066639 1061356 1054717 1046942 1039135 1032691 1028146
49348 1028146 1024874 1021904 1018828 1015883 1013481 1011831 1010848 1010149 1009179 1007517 1005094 1002074 998565 994544 990055
49333 990055 985394 981082 977676 975553 974751 975018 976023 977492 979126 980508 981378 982056 983507 986835 992707
49318 992707 1001193 1012069 1025178 1040539 1058013 1076580 1093859 1106668 1112543 1110995 1103487 1092464
49306 1092464 1080389 1069099 1059248 1050186 1040780 1030614 1020315 1010790 1002552 995872 991041 988115 986675
49293 986675 986158 986268 986752 987006 986341 984601 982244 979795 977465 975152 972495 968925 964019 957947 951414
49278 951414 945136 939502 934688 930832 928044 926410 926017 926785 928342 930264 932431 934915 937545 939794 941175
49263 941175 941563 941119 940103 938683 936745 934008 930663 927871 927228 929637 934974 942771 952794 964882
49249 964882 978719 993869 1009420 1023233 1032260 1034428 1030121 1021383 1009816 995835 979790 963027
49237 963027 947395 934008 922775 913012 904337 897062 891904 889390 889554 892072 896404 901714 907021 911836
49223 911836 916539 921825 927850 934282 941041 948429 956366 963982 970406 975782 981218 987700 995143 1002482
49209 1002482 1008628 1013375 1017450 1021738 1026677 1032554 1040008 1049666 1061279 1073791 1086564 1100060 1114975
49196 1114975 1131007 1146954 1161820 1175453 1188263 1200770 1213322 1225790 1237490 1247780 1256785
49185 1256785 1265279 1273858 1282564 1291331 1300400 1310203 1321192 1333889 1348676 1365376 1383431 1402784
49173 1402784 1424269 1448902 1477199 1509532 1546592 1588584 1633737 1677991 1716310 1744371 1759774
49162 1759774 1762778 1756468 1745602 1734535 1725776 1720128 1717581 1717797 1720101 1723521 1726994 1729630 1731074 1731787
49148 1731787 1732706 1734418 1736850 1739937 1744301 1750837 1759776 1770513 1782340 1794939 1808196 1821963 1836213
49135 1836213 1851113 1866702 1882722 1899044 1916068 1934281 1953454 1972642 1991130 2009143 2027400
49124 2027400 2046214 2065298 2084379 2103734 2124128 2146434 2171296 2198862 2228815 2260837 2295106
49113 2295106 2332226 2372856 2417911 2469125 2528815 2598951 2681223 2778391 2894271 3030266 3180841
49102 3180841 3333187 3473327 3595024 3704590 3816214 3938639 4062241 4158961 4198865 4171223
49092 4171223 4091581 3988714 3884143 3781776 3672906 3548247 3406478 3255171 3106092 2969271
49082 2969271 2849819 2748571 2664299 2594894 2537600 2489720 2449507 2415943 2387758 2363331 2341446
49071 2341446 2321496 2302951 2285385 2269060 2254741 2242659 2232164 2222529 2213544 2205196 2197436 2190437
49059 2190437 2184529 2179586 2175032 2170740 2167307 2165075 2163443 2161686 2160053 2159474 2160412 2162538 2165354 2168747
49045 2168747 2172989 2178547 2185771 2194464 2203868 2213235 2222150 2229958 2235311 2236984 2235172 2231460 2227499 2224201
49031 2224201 2222184 2222156 2224279 2227552 2230517 2232531 2233859 2234596 2234170 2232220 2229398 2226750 2224518 2222126 2219276
49016 2219276 2216536 2214764 2214435 2215703 2218598 2222845 2227890 2233418 2239597 2246530 2253860 2261267 2269022 2277556
49002 2277556 2286775 2296245 2305768 2315215 2324001 2331403 2337385 2342565 2347381 2351753 2355418 2357972 2358679 2356970
48988 2356970 2353310 2348916 2344494 2339782 2334520 2329213 2324629 2321118 2318736 2317465 2316889 2316086 2314357 2311878
48974 2311878 2309302 2306996 2304910 2302872 2300641 2297855 2294213 2289650 2284222 2278104 2271798 2265992 2261029 2256812
48960 2256812 2253396 2251314 2251063 2252551 2255292 2258871 2263034 2267656 2272943 2279437 2287606 2297623 2309616 2323774
48946 2323774 2340018 2357925 2377200 2397895 2419942 2442864 2466198 2489877 2514030 2538807 2564683
48935 2564683 2592487 2622833 2655880 2691863 2731246 2773914 2818735 2864572 2911373 2959772 3009991
48924 3009991 3061800 3115208 3170350 3226675 3283004 3338628 3393913 3449618 3505873 3561998 3617079
48913 3617079 3670557 3722258 3771940 3819007 3862986 3904225 3943639 3981598 4017512 4050804 4081855
48902 4081855 4111566 4140423 4168404 4195461 4221439 4245737 4267635 4287003 4304257 4319589 4332572
48891 4332572 4342526 4349098 4352497 4353266 4351784 4347986 4341813 4333776 4324442 4313257 4298657 4279827 4257728
48878 4257728 4233843 4208553 4181428 4152515 4122289 4090505 4056089 4018235 3976979 3932603 3885206
48867 3885206 3834998 3782527 3728487 3673674 3619087 3565616 3513581 3462955 3413997 3367306 3323267
48856 3323267 3281829 3242849 3206321 3172327 3140962 3112244 3085939 3061746 3039890 3021175 3006112
48845 3006112 2994389 2985561 2979735 2977083 2977193 2979578 2984293 2991274 2999610 3008497 3018649 3031573 3047562
48832 3047562 3065521 3084806 3105996 3129415 3153946 3177972 3200843 3222941 3244817 3266794 3289024
48821 3289024 3311460 3333873 3355989 3377486 3397982 3417451 3436483 3455605 3474432 3492095 3508410
48810 3508410 3523974 3539222 3554224 3569383 3585430 3602488 3619993 3637781 3656455 3676311 3696696
48799 3696696 3716905 3737043 3757593 3778735 3800539 3823152 3846205 3868444 3888542 3906007 3921016
48788 3921016 3933830 3944766 3954394 3963266 3971658 3979693 3987278 3993691 3997722 3998583 3996278 3990735 3981032 3965922
48774 3965922 3944925 3918688 3888588 3856096 3822037 3786152 3747713 3706758 3664318 3621307 3577777
48763 3577777 3533512 3488746 3443908 3399172 3354698 3310914 3268197 3226690 3186730 3148911 3113336
48752 3113336 3079387 3046778 3016306 2988971 2964686 2942464 2921604 2902108 2884152 2867711 2852678
48741 2852678 2839008 2826837 2816717 2809454 2805344 2803706 2803386 2803521 2803642 2803468 2803007 2802611 2802546 2802673 2802717 2802604
$$ [...]
##END NTUPLES=NMR SPECTRUM
##END=
