##TITLE=AC1742_SEN00015_9276387_kIMzPg8PVW
##JCAMPDX= 6.0         $$ Bruker NMR JCAMP-DX V2.0
##DATA TYPE= NMR SPECTRUM
##DATA CLASS= NTUPLES
##ORIGIN= BRUKER
##OWNER= Administrator
$$ 1.72 TOPSPIN		Version 2.1
$$ 2015-07-15 01:40:09.135 -0700  Administrator@X
$$ Compression mode = diff/dup
##.OBSERVE FREQUENCY= 400.02188249412
##.OBSERVE NUCLEUS= ^1H
##.ACQUISITION MODE= SIMULTANEOUS (DQD)
##.ACQUISITION SCHEME= undefined
##.AVERAGES= 8
##.DIGITISER RES= 22
##SPECTROMETER/DATA SYSTEM= spect
##.PULSE SEQUENCE= zg30
##.SOLVENT NAME= COFFEE_meoh
##.SHIFT REFERENCE= INTERNAL, COFFEE_meoh, 1, 14.98509
##AUDIT TRAIL= $$ (NUMBER, WHEN, WHO, WHERE, PROCESS, VERSION, WHAT)
$$ ##TITLE= Audit trail, TOPSPIN		Version 2.1
$$ ##JCAMPDX= 5.01
$$ ##ORIGIN= Bruker BioSpin GmbH
$$ ##OWNER= Administrator
$$ $$ E:\/data/COFFEE/nmr/AC1742_SEN00015_9276387_kIMzPg8PVW/10/pdata/1/auditp.txt
$$ ##AUDIT TRAIL=  $$ (NUMBER, WHEN, WHO, WHERE, PROCESS, VERSION, WHAT)
(   1,<2015-07-15 01:40:01.854 -0700>,<Administrator>,<X>,<go>,<TOPSPIN 2.1>,
      <created by zg
	started at 2015-07-15 01:38:55.307 -0700,
	POWCHK enabled, PULCHK disabled,
       configuration hash MD5:
       21 0F 79 D6 B3 7B B4 F6 88 20 88 DB 03 48 BD 9F
       data hash MD5: 64K
       78 9A DE C3 74 28 2D 81 F7 C5 B7 DF 0A 15 E4 EC>)
(   2,<2015-07-15 01:40:04.979 -0700>,<Administrator>,<X>,<proc1d>,<TOPSPIN 2.1>,
      <Start of raw data processing
       efp LB = 0 FT_mod = 6 PKNL = 1 PHC0 = 0 PHC1 = 0 SI = 32K 
       data hash MD5: 32K
       60 E7 E4 9F 88 A7 C3 6D 5D F8 4D 35 C8 C3 11 D1>)
(   3,<2015-07-15 01:40:05.275 -0700>,<Administrator>,<X>,<proc1d>,<TOPSPIN 2.1>,
      <pk PHC0 = 89.86267 PHC1 = 0 
       data hash MD5: 32K
       4D 59 12 B7 C9 BD 29 23 8B 1E 8D 8E D5 60 8F 71>)
(   4,<2015-07-15 01:40:05.385 -0700>,<Administrator>,<X>,<proc1d>,<TOPSPIN 2.1>,
      <abs ABSG = 1 
       data hash MD5: 32K
       3D 83 30 14 8C A4 D8 99 4A 22 AF 0B 4A 6D 3B FC>)
(   5,<2015-07-15 01:40:05.447 -0700>,<Administrator>,<X>,<proc1d>,<TOPSPIN 2.1>,
      <abs ABSG = 2 
       data hash MD5: 32K
       4A 6A 9E 8E AD 4B B8 CA 13 66 E6 44 E7 E2 D5 23>)
(   6,<2015-07-15 01:40:05.525 -0700>,<Administrator>,<X>,<proc1d>,<TOPSPIN 2.1>,
      <abs ABSG = 3 
       data hash MD5: 32K
       06 CE 09 44 73 AB F2 18 44 EC 3F 4F 16 94 AE 92>)
(   7,<2015-07-15 01:40:05.588 -0700>,<Administrator>,<X>,<proc1d>,<TOPSPIN 2.1>,
      <abs ABSG = 4 
       data hash MD5: 32K
       25 3E 53 90 D3 63 C8 C8 28 B4 94 8E 06 88 C9 C3>)
(   8,<2015-07-15 01:40:05.650 -0700>,<Administrator>,<X>,<proc1d>,<TOPSPIN 2.1>,
      <abs ABSG = 5 
       data hash MD5: 32K
       32 7D FB A3 50 75 65 F9 C1 7D 5E CC ED 7A 10 12>)
$$ ##END=
$$ 
$$ $$ hash MD5
$$ $$ 68 01 E3 F6 7E 4E 9B A5 1A E6 63 54 36 CF 4E 16
##$RELAX= 
##$RELAX= 
##$RELAX= 
##$RELAX= 
##$RELAX= 
##$RELAX= 
##$RELAX= 
$$ Bruker specific parameters
$$ --------------------------
##$DU= <E:\>
##$EXPNO= 10
##$NAME= <AC1742_SEN00015_9276387_kIMzPg8PVW>
$$ [...]
##$TP= (0..7)
150 150 150 150 150 150 150 150
##$TP07= 0
##$TPNAME0= <>
##$TPNAME1= <>
##$TPNAME2= <>
##$TPNAME3= <>
##$TPNAME4= <>
##$TPNAME5= <>
##$TPNAME6= <>
##$TPNAME7= <>
##$TPOAL= (0..7)
0.5 0.5 0.5 0.5 0.5 0.5 0.5 0.5
##$TPOFFS= (0..7)
0 0 0 0 0 0 0 0
##$TUNHIN= 0
##$TUNHOUT= 0
##$TUNXOUT= 0
##$USERA1= <user>
##$USERA2= <user>
##$USERA3= <user>
##$USERA4= <user>
##$USERA5= <user>
##$V9= 5
##$VALIST= <valist>
##$VCLIST= <CCCCCCCCCCCCCCC>
##$VD= 0
##$VDLIST= <DDDDDDDDDDDDDDD>
##$VPLIST= <PPPPPPPPPPPPPPP>
##$VTLIST= <TTTTTTTTTTTTTTT>
##$WBST= 2048
##$WBSW= 25
##$XGAIN= (0..3)
0 0 0 0
##$XL= 0
##$YL= 0
##$YMAX_a= 603904
##$YMIN_a= -522751
##$ZGOPTNS= <>
##$ZL1= 120
##$ZL2= 120
##$ZL3= 120
##$ZL4= 120
##$ABSF1= 14.98509
##$ABSF2= -5.573092
##$ABSG= 5
##$ABSL= 3
##$ALPHA= 0
##$AQORDER= 0
##$ASSFAC= 0
##$ASSFACI= 0
##$ASSFACX= 0
##$ASSWID= 0
##$AUNMP= <proc_prof1d_extract_pilot.lims>
##$AXLEFT= 0
##$AXNAME= <>
##$AXNUC= <1H>
##$AXRIGHT= 0
##$AXTYPE= 0
##$AXUNIT= <>
##$AZFE= 0.1
##$AZFW= 0.1
##$BCFW= 0
##$BC_mod= 0
##$BYTORDP= 0
##$COROFFS= 0
##$CY= 15
##$DATMOD= 1
##$DC= 0
##$DFILT= <>
##$DTYPP= 0
##$F1P= 0
##$F2P= 0
##$FCOR= 0.5
##$FTSIZE= 32768
##$FT_mod= 6
##$GAMMA= 0
##$GB= 0
##$INTBC= 1
##$INTSCL= 1
##$ISEN= 128
##$LB= 0
##$LEV0= 0
##$LPBIN= 0
##$MAXI= 10000
##$MC2= 0
##$MEAN= 0
##$ME_mod= 0
##$MI= 0
##$NCOEF= 0
##$NC_proc= -8
##$NLEV= 6
##$NOISF1= 0
##$NOISF2= 0
##$NSP= 0
##$NTH_PI= 0
##$NZP= 0
##$OFFSET= 14.98509
##$PC= 1
##$PHC0= 89.86267
##$PHC1= 0
##$PH_mod= 1
##$PKNL= yes
##$PPARMOD= 0
##$PPDIAG= 0
##$PPIPTYP= 0
##$PPMPNUM= 2147483647
##$PPRESOL= 1
##$PSCAL= 4
##$PSIGN= 0
##$PYNMP= <proc.py>
##$REVERSE= no
##$SF= 400.02
##$SI= 32768
##$SIGF1= 0
##$SIGF2= 0
##$SINO= 400
##$SIOLD= 32768
##$SPECTYP= <>
##$SREGLST= <1H.CDCl3>
##$SSB= 0
##$STSI= 32768
##$STSR= 0
##$SW_p= 8223.68421052631
##$SYMM= 0
##$S_DEV= 0
##$TDeff= 65536
##$TDoff= 0
##$TI= <>
##$TILT= no
##$TM1= 0
##$TM2= 0
##$TOPLEV= 0
##$USERP1= <user>
##$USERP2= <user>
##$USERP3= <user>
##$USERP4= <user>
##$USERP5= <user>
##$WDW= 1
##$XDIM= 32768
##$YMAX_p= 445028896
##$YMIN_p= -769864
##$CURPLOT= <Network HP LaserJet P1505>
##$CURPRIN= <$Network HP LaserJet P1505>
##$DFORMAT= <normdp>
##$LAYOUT= <+/1D_H.xwp>
##$LFORMAT= <normlp>
##$PFORMAT= <normpl>
##$SURQMSG= 1
$$ End of Bruker specific parameters
$$ ---------------------------------
##NTUPLES= NMR SPECTRUM
##VAR_NAME=  FREQUENCY,     SPECTRUM/REAL,   SPECTRUM/IMAG
##SYMBOL=    X,             R,               I
##VAR_TYPE=  INDEPENDENT,   DEPENDENT,       DEPENDENT
##VAR_FORM=  AFFN,          ASDF,            ASDF
##VAR_DIM=   32768,         32768,           32768
##UNITS=     HZ,            ARBITRARY UNITS, ARBITRARY UNITS
##FACTOR=    0.250966925370066, 1,           1
##FIRST=     8223.43324360094, -158687,      24905
##LAST=      0,             3238,            -65744
##MIN=       0,             -769864,         0
##MAX=       8223.43324360094, 445028896,    0
$$ Real data points
##PAGE= N=1
##DATA TABLE= (X++(R..R)), XYDATA
$$ [...]
23893 159290 -39171 -119826 -305035 83281 -40643 -197601 -217750 124808 396540 73696 62563
23882 62563 -92139 -54663 -126693 -242301 -175921 15135 -141766 395003 -106254 213996 64813
23870 335492 124101 -102243 74197 -28252 40489 189321 -88317 12821 139374 132867 5935
23858 -177869 -257006 -92672 -179110 18005 -106739 -221198 155672 300454 -41836 192919
23847 8715 -11047 17953 117931 -41512 93849 -295294 93345 67135 100804 208437 -54357
23835 184765 33719 200770 250881 -271489 -171880 253791 -94153 -48953 347722 95512 67769
23824 67769 38653 212867 -63350 -382399 18406 144688 -169757 -290769 15224 -243934
23813 -9298 -116365 162215 69093 293256 218154 150346 -92264 132321 30227 -168082 -200629
23802 -200629 14740 278797 -136903 -134614 137365 -66037 131589 133256 -102799 183070 101003
23791 101003 -23657 217837 48109 -314114 -214426 107825 -142908 -52756 198122 -307742
23780 -174955 -216782 -39916 -98378 111048 12040 -45035 -42885 242723 139058 -41232 258578
23768 -353929 -282882 -200056 199543 30005 -231049 -128391 366086 -77839 61933 97063 -70404
23756 41189 -98337 82780 136232 5914 168649 -18506 -171054 -14174 15363 -566 -94604 -75000
23744 -75000 19943 -247059 -360790 -129622 -50293 -117398 -64196 -25897 -175317 -147305 -170187
23733 -170187 172995 21184 163482 44403 -72283 -82433 -46104 -141123 125849 267598 -27403
23721 -247194 -68729 -236449 -77259 146876 -71431 31472 -188755 8417 -73553 -318930 225057
23709 -120459 -181936 59333 -38688 46869 130383 -237932 -146012 -234464 -11294 30100 122355
23698 122355 14272 111718 -98300 372963 204887 261979 11472 -56167 38991 12455 198181
23687 198181 143660 -125061 -64578 4428 30337 -314808 -211960 -23393 -143098 -114470 -100124
23676 -100124 -113980 -198981 -83590 -106242 17505 334149 2195 -74082 -44472 -97172 76015
23664 20226 -133752 -189154 250917 207350 105739 108281 -253558 -16778 -270232 127331 96197
23653 96197 211647 215195 122476 145681 -150853 101096 -155956 -108856 -461599 -9531 -248801
23642 -248801 -123093 308091 98899 140023 -186818 -100439 34959 116351 167367 162766 -60115
23630 -57341 11671 -94052 -73726 120791 -173733 69956 -142639 -29155 -153371 377832 29059
23618 -198872 -122877 55379 165144 82507 40432 127164 279254 -174844 -118596 16654 -209315
23606 -76979 99289 82713 52660 -297015 -29133 -143612 43159 97610 61946 91307 78478
23595 78478 24836 -260860 -117762 -127388 163497 84048 -158523 260446 156594 94299 59383
23584 59383 290922 169 303927 58557 -54829 -207757 244034 438240 -54135 140366 -224350
23572 -435286 -17615 141802 -262967 -238833 52180 136667 166211 200105 102186 -155786 86879
23560 19810 24563 367005 -122897 -183547 -210697 49047 -171778 -73803 -28844 38243 -194702
23548 103248 -116796 28276 130259 209873 -67919 8242 -233924 32365 -211466 41507 29931
23537 29931 167366 78392 -120725 -182781 -56308 289755 9198 -158703 -50573 -98191 55009
23525 -189110 190818 228789 41461 241705 86256 -145211 -77756 -17040 -92737 -44976 -30783
23514 -30783 -417331 49941 -162344 -66184 -122613 -118694 -132252 -142849 74495 -101962 -151948
23503 -151948 -139435 -38815 57663 -257551 72997 290290 -10798 -61305 124759 -130321 285367
23491 -178498 276335 -153784 11608 -256879 261462 -62694 -112340 -96 210335 -42374 265025
23479 29785 146263 -470252 -70700 109363 225782 260887 -103947 388131 -85169 -88391 273795
23467 147155 -154437 -79859 -107950 -90834 185220 -230633 -136928 -73100 -34154 19616 165262
23456 165262 85882 142173 25142 146927 115012 -133162 -63601 -182725 292053 -409303
23445 144108 -254458 -72962 -168112 -190704 -63487 -292582 -212698 121608 50876 -128636 27519
23433 65288 -168098 21017 -89802 -345117 137015 -82358 -57192 168203 290652 -155000
23422 23697 -377831 -517 -109460 4870 180 -76334 25994 32072 153878 31411 -309467 -114482
23409 1523 -249928 -178890 59414 -31373 97321 215389 -82330 58142 39026 44245 -234873
23397 -60405 224382 -273603 151797 -59794 132299 -192856 -15010 32411 -338634 215684
23386 29375 -42013 -22295 297477 -305936 185558 -48547 -92115 -371941 189365 14016 -293523
23374 -208595 -236613 220827 170749 194451 -53851 -47936 -49121 -88245 25160 -87989 314165
23362 63599 197720 -315341 -48092 102449 6626 -81698 15451 -48317 189635 159111 -29402
23350 133218 111065 29763 -204685 94397 255336 -29866 -4361 220115 -169392 3636 211856
23339 211856 105314 212245 -191198 -219789 24398 17442 -343854 194883 -250948 -173756
23329 -173756 353424 91187 -48270 -178544 -230553 -323485 3637 -24865 1441 73284 119902
23318 119902 -97387 92684 -455920 -304196 -317104 -216388 375615 -159055 -65802 263917
23307 -478713 186458 -37606 -141420 -32294 164551 -155664 119718 -223281 124818 39230
23296 -175688 -335519 88383 72202 134515 -85349 -234684 -214757 22771 478568 15854 154266
23285 154266 3678 15188 21479 316457 -124475 -52539 -102714 -116971 -95040 -76662 94579
23273 139926 135743 220513 -24849 49714 -95635 208156 -369592 -319997 -250278 189620 -69296
23261 102400 -39233 -271354 -146840 -115395 279946 10427 89199 -13626 -240897 167663
23250 -166223 -58538 188865 39717 -77324 143257 -204707 140452 95920 200702 220536
23240 220536 -150769 -95064 -363214 282902 73114 28445 717051 205389 -335855 -307008
23230 -307008 -209837 53525 -145374 -337364 226834 81227 -35368 -108243 -197436 59090 12464
23218 189352 -157562 -102086 -437108 290074 245998 -113047 -207627 -106280 142262 85293
23208 85293 30046 34789 61136 -173888 -309679 143551 231811 196452 285327 -442567 -76082
23196 195914 135053 79866 26338 -54514 -211225 -2406 235393 -117604 -269339 -201955 84716
23184 24377 128087 75173 -35088 -87677 411858 -343800 -167009 233415 33630 2989 -181107
23172 -87326 -218730 -72695 -283087 120724 195766 -78535 -404052 -17187 -52716 -101692 -187240
23161 -187240 -177089 -4894 191524 -173423 -12231 223325 -73972 364220 111215 22543 -108177
23149 114557 -22497 61228 35029 -18251 -307979 -45800 -222114 214803 142488 -412846 96124
23137 182513 36593 -124059 -105596 96483 -243066 201843 69650 160888 -32608 163236 92206
23126 92206 176350 138786 60766 228059 26116 130559 -331313 375195 -125518 -108372 -289326
23115 -289326 -16906 110970 25602 -303364 -38319 3312 -55520 -2010 48161 -54604 196219
23103 97773 -171850 -203078 -35612 -67231 -132744 147734 -100504 -178142 -19928 93234 -97568
23091 -142381 -97959 -103895 25571 -108535 -73845 -845 181371 140442 -523343 -163361 -91431
23080 -91431 -178349 -280880 -118493 -536282 115901 91327 -125792 -76399 41564 -262867
23069 5955 17070 6187 -47541 -305716 35359 269069 -113613 87474 185803 261564 -506672
23057 98813 -78203 -152957 -286000 -15035 298606 -84047 -138528 170662 -19054 51531 -115105
23045 80996 3658 -37736 293268 7993 -127055 -457353 118059 160285 -6235 -269433 215336
23033 37896 3 -14774 298039 -174639 209218 109433 -56332 190139 -12402 96651 -321521
23021 43706 100909 100783 -75974 -66037 431119 39448 30125 255168 57763 -17868 102378 -478945
23008 161689 -89777 -191357 -160748 -53986 -169778 -213128 -24923 -61024 -12044 -126213 261725
22996 -95634 -214165 251598 16639 66770 38221 -129973 -219597 -5885 158515 -239010 -45713
22984 236619 153491 -340052 -167218 72032 26034 -340933 182708 244213 151520 -77688 -62963
22973 -62963 -137125 171712 -69288 43721 -10932 -87075 -233852 8571 43495 100482 -329688
22961 -296385 -148783 -399191 106158 -161751 178277 368959 -167120 -46133 21957 45811
22951 45811 102913 -32273 -98905 115540 -66362 84800 72977 28917 72236 -246524 -29028
22939 4210 197156 -273662 -13677 154719 -28483 -247991 -274099 -54189 6256 207359 -40597
22927 3470 -124920 101742 103114 159733 84915 188996 -461564 -298961 22314 -276151 -104928
22915 164635 124984 20467 64139 75507 -170100 -111927 30363 112557 -82519 -247774 104320
22903 -115842 -226804 -208337 -337941 -193926 -94394 -81294 224567 -286654 -6243 152300
22892 269887 287918 -200293 -82737 107963 -84538 -324671 6394 190912 26954 70729 47825
22881 47825 210364 -159645 56519 -329272 225298 48492 14868 -103318 -14087 38768 -51566
22869 -205551 -11145 -267961 61201 -831 226969 -97427 -38826 -49444 -196574 -53702 -73216
22858 -73216 202958 -84571 69079 224311 -119764 -4727 -266611 168929 -254262 -53596 -234120
22847 -234120 -1340 136641 -74411 -71177 13370 217947 -344451 -31318 -294653 164858 84345
22836 84345 -116363 290697 290524 276726 24776 78870 -115428 -138852 102706 330031 -306430
22824 -329982 -9747 -85825 2607 345540 -68614 46920 62038 -43584 -162627 -225541 378158
22812 43531 -229603 36924 59688 242696 205133 -181314 48036 258872 143412 76673 -121222
22800 95204 -182289 -128057 35258 -27313 -32689 -172835 66337 137333 -159180 6116 -38165
22788 -281740 -3495 -174898 266628 188012 -353565 -213991 324872 -288494 -323246 -416708
22778 -416708 -159154 -156363 -18284 126687 31482 -309562 316143 66454 229623 74552 82078
22767 82078 -8980 -54492 42687 176092 -105497 -387688 -129147 17515 -137858 -30484 -163695
22756 -163695 53846 -111124 74729 -211598 -81545 -87195 -133229 -93138 -196475 -137027 -378141
22745 -378141 127469 67971 -234599 103883 -28888 -65770 14100 -173925 63657 190104
22735 190104 -192043 193186 -84074 -106334 97800 -289062 -23046 -148967 -191424 -138371 22588
22723 167309 169301 142133 -154875 -10310 54764 54183 -308088 89563 52680 -65774 153408
22711 124729 104549 -277473 -254924 -207392 -7156 -30122 77333 -87266 -162408 202361 -59486
22699 -122442 399262 169252 -89366 -335294 73199 72821 -263179 19398 -122826 30720 -138754
22687 -284685 -66314 -71606 103553 -11517 -32300 247117 162598 -103876 -174390 297947 -231634
22675 19041 125964 -396638 -424346 37724 -63065 -217436 399793 321580 -360836 43372 -131692
22663 -171339 -163980 -48094 -270714 136836 311875 203043 1144 -221302 93662 10880 65453
22652 65453 110266 -84249 144670 -86478 -72974 -152425 -37441 149100 149860 28648 52731 -298727
22639 -4161 -102571 -102139 109704 111492 -56635 280872 125352 -152167 -140926 26537 -378090
22627 -199410 -339556 -61035 136670 26202 -255064 28015 113695 -122558 51345 -231622
22616 25839 8326 68572 -80485 -3084 102626 98665 -220281 -430750 -215025 17357 -10479
22604 67586 148989 108113 -21028 -81908 -197201 -208570 -67850 114750 41495 -128547 128718
22592 -22713 -129854 -171247 55586 39447 -170189 130389 -117337 -59775 -81604 23011 -582200
22580 -186416 -78454 10943 37202 -7268 -28903 -26253 -141415 -23841 -213167 46668 272666
22569 272666 261987 117841 -39519 70222 -26211 217488 -267018 -94365 162338 -15784 4026
22557 -29053 67052 -150067 -231361 -304442 -27168 258023 -101106 -139060 258680 159134 -84727
22545 150612 150253 59567 -133119 175194 -41124 -241614 -136583 111306 224634 -24113 -84245
22534 -84245 32272 59809 443110 39482 -266482 167938 -97577 108045 -101840 -31281 167973
22522 101814 -131133 -59683 36011 69711 -184251 -589133 97157 -3377 44703 -25862 67776
22510 -44629 115960 -196960 245115 31839 -192626 -340669 -94328 -30701 20896 220290
22500 220290 3632 239882 -63730 -200099 212174 156124 68077 -28718 -292896 105214 -129257
22488 308904 -36397 385540 126464 46478 -46208 226530 -246497 -49009 -168891 516653
22477 -84445 17696 -54 -81173 74684 6403 -175442 -15179 -134671 62780 -250699 143578 59342
22464 13912 114766 -24621 -249944 150299 13965 -8209 16025 -113113 63295 187339 180859
22453 180859 -75191 -235030 -411485 -68098 -280910 40306 35920 52765 106156 94561 -149253
22441 122832 61284 28579 -73000 362749 231667 138532 21257 -3651 315246 -9051 -23420
22430 -23420 -16070 53952 -44082 -50984 -28841 -336943 23111 -26933 -308511 -231347 60648 -376092
22417 -113627 230972 -292041 96522 -249380 -60308 -131783 224323 387814 1620 -8436 12094
22405 -548906 -333673 65910 -409576 294689 278445 128044 -101523 -234004 27066 -8319
22394 -55206 80078 110076 -28999 -609905 -73375 -200616 74446 3926 -227254 126605 -48341
22382 -185417 26165 -124681 -131543 -309081 -77762 348430 -59550 31642 38488 -106341 76335
22370 -152898 -325677 -34946 -403332 109463 59145 -140769 54426 -158794 316526 -169692
22359 -59328 -328247 -96789 -79224 -85625 -151973 54959 -56478 153963 132172 -7411 -22618 -180591
22347 -180591 298251 293332 8814 -384981 -8693 -75861 -144238 -279165 -63888 304234 -232084
22335 42866 133550 -57041 -144964 -316322 -215801 -130578 -35948 -173210 -29717 -126673 -26209
22323 35323 -189352 35207 119743 -17173 -190521 -57429 302028 -268084 19587 286382 130437
22311 -80379 31526 -45109 171796 -121771 -151521 -288594 -131154 275266 297143 -79436 -184674
22300 -184674 81601 53116 124242 83588 83510 -116658 165792 134468 -235878 -294084 -92401
22288 -128604 -76083 -12499 -356500 116038 113832 -65641 -148881 185761 145979 4791 68136
22277 68136 -322279 -4134 -301424 219237 42923 40757 -69183 -93100 60252 -114611 -23514
22265 -124827 -139460 -38691 -258342 187957 254234 205954 -9344 -97800 217773 -72968 -22913
22253 241920 324237 -155798 -197089 -21902 -142771 -127873 -122715 -48650 113480 158983 -72454
22241 -103382 -380086 -297462 -282948 -160275 16319 93589 -1769 -83536 -81558 -158687 -1231 -166374
22229 -166374 117678 -143672 -158215 -315109 -99210 171975 73228 -31963 44251 71529 47496
22218 47496 -275082 273905 -151850 75070 -108054 -19518 -212904 -127682 -150494 -26511 18124
22206 -158200 -384544 301096 -278412 18862 -103503 190155 -31311 120288 179682 291000
22196 291000 -134675 -48035 115535 -123896 -122544 118282 -53157 -194211 -3148 -70164 169967
22184 -129093 -166029 301912 -61080 -21990 -167707 109164 -185702 -201875 18384 65600 236028
22173 236028 -145920 -99722 -150258 -223565 -378089 -82437 174145 -66798 -145906 2667 154367
22162 154367 10198 274331 -257412 -122112 164042 59060 231711 114531 106569 -369885
22151 126316 129959 27018 -84960 -121207 -42702 185820 -285853 -112734 94657 -40908 -71042
22140 -71042 -227971 -84411 -365798 7255 94188 59219 -174593 -153726 -225745 87859 -134964
22128 -321499 -12602 -201371 -216637 83113 -394354 159687 -273898 -53484 295912 -9096 -428606
22117 -428606 -47904 40447 181668 -151144 -326533 -118150 -52088 -6938 23462 -121034 -12168
22105 -126608 -245154 85677 -221810 -16017 -329612 -33564 -292036 -71679 323990 -100682
22094 -85449 2287 15160 -128247 -422890 -173390 58231 34638 -142797 -46981 27310 -226493
22082 -290263 206891 289344 200386 97243 -147041 60085 8491 -155415 -36943 242162 130457
22071 130457 233462 -87323 -133714 -374632 -355235 -18241 -386382 -39455 -113451 201316 354492
22060 354492 -187747 103595 198774 149439 2368 -114230 66003 -79162 14887 -133952 -232974
22049 -232974 -172041 -6231 -24349 -111558 123121 -119287 85489 25014 156094 -11994 -47221
22038 -47221 46587 -287122 204710 36497 -273658 -85317 -368577 200979 -79296 -309426
22028 -309426 -18302 -151253 -32633 21074 -345899 -114265 -277469 50978 -88510 -224336
22018 -224336 -263968 -37865 -180417 -58023 -68627 159275 -224197 -140811 -225757 -396710 -64090
22006 111410 56545 8282 -177929 -221732 -319576 9610 95359 135285 -179861 288466 -81005
21994 -219752 -82222 148965 -200675 43614 -214800 -507575 46377 121181 265794 55536
21983 -55988 -169005 -278325 -247107 -1327 -120742 1467 -275154 21862 -31077 -53749 -5031
21971 58664 -125349 -40713 -287573 228083 19384 -217415 312403 33086 -158013 -58902
21960 -105531 -62001 -33823 -19706 75156 73121 -20625 -136053 -49887 64421 -123395 103781
21948 -229588 146194 -45559 -101170 -79063 -254894 22120 -137144 -135109 20090 -152676 -419022
21937 -419022 26000 305986 131643 -71063 120930 156394 -151603 93324 -66026 8431 399599
21926 399599 -128270 -99321 -25420 -7985 -158331 -73837 -71290 -13600 8379 -210206 -127 15111
21913 194089 71747 29325 -69717 -25019 -51515 34392 170393 -244916 55242 -55874 131127
21901 -409184 45231 -120250 -159604 -218315 -39015 102684 74036 -162693 -357025 -98175 157971
21889 -216660 244382 -63752 55906 -172190 -226696 -130862 -3288 219383 1767 60430 -8611
21877 -355805 45150 47166 -150459 71442 35093 -311975 27815 127955 -82755 -146913 239895
21865 150831 -10402 -37033 107645 -164303 52991 219517 -53009 26299 -250004 129765
21854 -125479 -279065 145757 50490 25214 -34575 -155891 135255 -6859 201519 182548 -107365
21842 10269 -261825 106098 57858 6869 122734 -134796 1331 2993 -167741 -236071 -1197
21830 18889 260565 -17032 26781 214132 -24157 -369357 -166702 -43249 -12071 -20081 243279
21818 167279 -39207 126779 -316883 17443 -42417 25136 -204423 375184 38025 -122871
21807 -119695 298113 102567 283376 -132631 72798 -200113 128447 264831 8340 -389831
21796 168567 102938 -294342 139718 111603 -286675 -398333 -45060 -310715 162704 -206523
21785 -211384 -277392 49970 31229 -36940 138527 111424 -277774 -70519 -283177 -398462 354428
21773 -280220 23533 103583 -123904 -113653 -157916 195036 194285 -51759 -306328 -124266 346100
21761 138214 32704 175792 40463 46016 72776 -321507 165453 144838 -333584 304924 -199171
21749 -283060 -176104 -142272 -91752 25825 -192892 -293029 -177636 129379 -123163 64515
21738 -21640 -130146 -160116 -277565 190976 -180499 -206332 -42233 539469 -1718 -14671 -45005
21727 -45005 43665 306012 -335555 129806 -79274 -84293 -157142 289859 -190722 149947 -199018
21715 -83457 -57074 -105477 -183425 -308637 -155129 -171531 62068 273865 -45955 -106443 -274104
21704 -274104 -7085 -57839 -314422 -206586 120931 -11100 95257 -159483 -121235 -202351 -274115
21693 -274115 -176669 -125037 -105994 -143954 -339664 -111830 8086 65220 23227 -2244 80415
21681 160283 -414245 302695 118045 -5078 5805 61201 86564 191595 -239436 -336028 -54856
21669 -8336 -92641 192396 -235089 199238 -160388 -33117 2468 65038 -362486 -272008 216222
21657 37976 -100009 -81480 -125259 -6210 -146742 44176 -313801 -275384 -6059 447556 23961
21645 -192640 15377 13646 -118569 -72409 -39124 190029 124980 73346 322839 -191309 -35771
21633 -87080 -275852 -88236 -19309 -230 48885 317142 106030 -60029 -204339 -324038 -199085
21622 -199085 -155129 -140700 -138150 -94231 163882 -64407 216336 -201456 180988 -92075 319278
21610 139203 -190181 -330146 -193587 -187104 54280 50259 29967 -360006 34782 -219430 10229
21598 29236 31515 -137810 -97524 -196748 1245 47820 -216689 -223972 -232246 -126899 -236723 -54175
21585 191946 75442 -99541 60566 129539 185969 185056 130437 -67176 96377 -50851 -270053 -82574
21572 -217657 185544 -108276 -30045 134793 -166458 194059 -147333 72311 392312 229077
21562 229077 -231965 -230018 -18089 95249 -72729 158097 -130810 -251482 -1132 -79184 -124413
21551 -124413 -13251 -354463 -41772 105375 -265783 -402804 -232095 -29155 15961 -2593 -62960
21540 -62960 -114992 217711 -34922 112817 -84171 -173182 -305458 7882 58627 34141 -302530
21528 -164443 -200329 -395733 189044 -20827 22516 63379 48782 119791 195512 -99110 97790
21516 -147932 -7069 168468 17 -173830 -128226 -196362 248633 87175 45217 90704 -251620
21504 -109801 137396 53410 244156 191326 -282097 67137 -118660 -141924 8453 -195823 144019
21492 -4140 -293417 174817 41885 -52977 144601 102797 -115614 -196036 -261767 -112727 -39419
21480 -186966 72724 -50600 -238050 -27897 177530 -365515 -127971 5479 128198 -159473
21469 -99679 -34946 62361 -140078 -304399 -244961 -296927 11843 -70979 22127 -159493 -282996
21458 -282996 -59451 3554 -125927 -54079 45266 -470663 -105835 -202899 291914 91798 51798
21447 51798 -54849 -188308 -60092 -330027 89508 411399 22450 189066 43804 385833 310084
21436 310084 297733 276335 -96045 -61774 69035 136574 9048 38189 -356359 120884 114087
21425 114087 -98234 -184797 62487 300036 18953 93087 101997 -89414 -243931 231978 -92642
21413 -145211 -29621 -142750 -112835 276700 32700 -109406 -322321 196574 68051 43973
21403 43973 -108091 320566 -306006 -113385 -217245 16133 -289646 -140795 15743 -201046
21392 -246818 195167 -154515 60935 -302546 -179311 -165361 -45163 173104 -93118 78998
21381 -286482 -288838 -120865 96994 -297966 -347821 -11387 284764 -23454 -217382 -120259 -307208
21370 -307208 -34622 -152637 162606 -88274 -39973 -3443 -287771 201296 -268934 -62591 -281086
21359 -281086 102895 -195402 68449 -79238 280084 -41672 21504 92876 -58746 -153956 -179060
21348 -179060 -2722 27797 16534 -76318 -267602 -252604 -12051 56989 53103 258860 256637 -157712
21335 -64470 118908 -29776 -208071 114140 -357585 73275 -68000 289045 -354842 -206000
21325 -206000 -28829 -180368 -106378 -160854 178904 170153 122864 278150 31918 -29531 -140769
21314 -140769 -192651 438939 17713 -162658 -360975 51259 228864 -33031 68848 -1417 103723
21302 -55406 -96301 6020 -226690 -53082 60205 -4389 -38417 36696 -61551 -541053 35246 -32659
21289 -273338 -196954 276216 -377365 -18933 -14837 101910 -33067 298694 241672 -305335 44231
21277 88074 60019 232108 -96384 -198439 21038 -47792 30018 -25681 -55780 -9579 117245
21265 -150459 -252199 20536 -85203 -56048 -157606 -17716 -147769 106939 -100121 -164623
21255 -164623 -114764 29103 -206759 32568 348485 80887 -28111 7927 95387 199268 -160856
21243 15320 -117326 -145401 -26386 -116855 -284087 -19043 304944 -192205 -388 67544 -135254
21231 155464 -84629 26576 -174620 150999 -171037 -162390 -86173 -149337 -73572 2349 -151355
21219 114953 20280 -207255 -638 -237599 -93212 157756 49253 -26718 613369 -222784 -158219
21208 -158219 -244066 -27337 27007 77632 -112631 42359 56404 -79555 251751 -150011 209270
21196 325337 -226240 122164 -323061 69736 -131522 -192676 -84426 -32567 121313 -88473
21185 54684 253446 118179 -408559 90348 224683 -293252 -184772 -107096 -248233 -336651
21175 -336651 -135206 202921 172635 -130079 -120914 -220340 -96445 -10192 -86267 -190413 195293
21163 -124026 312330 -48940 -124227 -191967 -279673 152793 36677 -149807 -78114 77595 74677
21152 74677 -58862 29159 -212336 44866 286763 -249106 -192095 -37713 -89925 19548 188675
21141 188675 300891 -148591 -31861 -10196 223542 -198779 -34189 180016 -262659 -26983
21130 -88745 -269316 -213483 -13755 106091 108860 61971 -3981 -29999 27275 -211524 213495
21118 51911 -313110 -54726 -280526 -373467 -84191 -168111 33910 209043 -179777 -146096 232293
21106 2665 231755 153498 -132297 -287292 288871 21515 -407591 17916 -170885 47248 -44664
21094 175531 -50107 285194 -43670 -90240 63179 256876 117186 2913 -311684 -291605 -92732
21082 -7016 -233087 -210044 153075 -80690 195921 139373 -96255 -195312 69951 75051 -117879
21070 103049 165338 -107032 3207 -41479 209896 310165 -384776 87678 2601 174650 -274303
21058 -153881 42437 -152562 -11768 -86743 204766 306677 23981 -71030 -58921 -351806 -112571
21046 256703 -116051 -27775 69521 -218685 -97903 -251692 61092 39507 -17425 169929 -168847
21034 -38367 61534 -165856 -125640 -299378 35668 -83739 37975 151590 168666 369238 39960
21022 -172555 -249835 -62110 99022 136184 176486 97607 -105781 -87054 15099 355548 203268
21011 203268 -183915 115526 -339961 37501 -50250 114210 -130113 -160524 -177071 -139099
21001 -139099 -35733 -56898 -158295 8637 188867 -356232 134144 145068 63387 -124621 87012
20989 -154638 21667 -138957 -70111 -265743 -175247 -93923 -19138 -19141 89964 -268416 -108095
20977 -182430 225697 -15992 -103950 1580 -101227 -183537 231237 -110300 -407187 130099
20966 -245407 43644 -22587 199883 42590 178292 -155802 -74979 70628 -126134 -232448
20956 -232448 -143326 -277008 -29253 -234232 -146018 23402 -19663 -141208 -57445 -252506 -127540
20945 -127540 -330095 61166 -208956 102086 -127845 182778 231169 80456 -183333 147586
20934 178586 -118215 -198574 11080 79659 111503 -25988 -59959 3887 -137973 -332848 -72670
20922 -299505 141288 -216962 88287 166622 -133161 28648 315736 236711 -69340 7402 -278030
20910 -200020 -13170 86085 -57330 106622 -250702 -91431 32129 42156 375112 280952 238818
20899 238818 -105559 215406 69808 -422793 -48836 285607 -163042 -144547 -323987 -261689
20889 -261689 265 91237 89410 -196827 -203030 86736 -162039 3733 -134654 -70481 197051 176120
20877 176120 -375873 -78179 -38285 85632 -258668 -52233 30784 127827 -312789 -660 -1490 99986
20864 94175 -108312 72773 9262 6297 -28211 -303606 -68188 113058 16033 388471 121898
20852 -76883 -286999 -8777 166437 -20136 -141440 -353383 -299104 62778 25586 -112632 -30138
20840 -385273 -33222 84079 -139775 -227047 -293897 6640 61681 -191060 -109969 106839 226324
20829 226324 -432 -199420 -285342 -156540 -132436 102399 -241871 79161 -69550 -213017 -226009
20818 -226009 -128843 -224877 -30739 3604 -20772 -54671 -187771 206037 -133525 139960 120390
20807 120390 -365972 -75730 -215399 -168812 -154376 -5181 -98746 33068 -3583 -30245 -531829
20796 -531829 168318 -1714 -17693 -221287 -351745 198348 -174906 85509 -138832 145385
20785 -343060 6974 390952 -316227 -67173 62819 114397 -163298 -1635 71056 -234097 -118437
20774 -118437 118431 1366 -45453 -169434 -72362 -186351 224195 113567 116489 35882 -21290
20762 -156106 -3788 34667 -173670 17873 -4941 109973 -361521 36247 1832 83655 -257589
20750 -47064 109089 -266177 203777 80063 54914 122789 -22331 -281769 -119586 -158386 7954
20738 -99049 70694 -36647 -23539 -1140 73524 -179622 -252770 -256913 -37460 -241744 27861 309256
20726 309256 -18994 43517 -2691 -68401 92954 -131415 -156190 237464 161490 -367416 136406
20714 156068 -9046 69624 101943 -5243 -215292 7646 48485 30415 126349 -197873 -421201
20703 -421201 -86692 67262 -252624 8401 -220383 -110283 -115138 -76987 146548 -87136 -32334
20691 -190520 -63522 69160 -186132 -12083 100576 -23823 -68911 -46244 -25572 5948 -128432
20679 321766 -38929 -46937 313408 -341478 -137072 -59659 -20700 -30209 -200977 -242574 -122590
20668 -122590 -345663 -54087 -156559 -175090 -96776 -248943 -20561 22232 -60891 -180839 -405959
20657 -405959 -174276 -151750 -258501 -304554 11057 -30997 70889 -173788 -39517 6423 255241
20646 255241 -96150 -190850 24804 16932 -94308 77965 -108343 -418094 -255706 -288102 73793
20634 128599 16963 -92574 -33365 406097 -74497 165548 -195651 -63488 123916 99523 47860
20622 -185491 119698 -294336 15749 29393 140124 -91967 113865 185706 37098 2370 -15733
20610 84248 -241487 27815 -142286 -235449 33070 -237445 -77929 -170850 -74528 35063 -347155
20598 206088 -162303 -113341 -304402 43147 70709 -199467 25839 -45812 -88468 -109718 220932
20586 -75497 -61131 199863 229516 191593 53929 15466 -53985 -71121 -91472 -84647 -36731 -260255
20574 -260255 -87787 -259134 45552 -41919 -122042 127320 -294323 350624 -75521 133825
20563 -361373 -240379 -33155 -68163 71609 -50436 81074 164938 -217500 135759 249253 -75174
20551 -117913 -293193 387218 3018 157327 86390 -193858 5050 -33140 241698 52987 155299
20540 155299 184754 -163491 -107765 31793 -92792 150594 13367 -329184 -8148 -175985 66686
20528 -54603 -35793 -128490 205266 -135222 -607 -176480 -271263 33936 265349 -120008 188637
20516 162232 -386738 83593 -120503 -224497 -287866 -139675 -155842 -130769 314236 427873
20506 427873 164398 -153866 283109 -55591 -271673 154356 221177 -332220 -253843 -78668
20495 8156 -38572 211172 91904 -138653 -153016 -14584 132887 89657 -147265 -375759 147090
20483 -72263 -113879 -217601 250614 -191446 -26370 -143084 -304791 -2314 -149643 89405 -236136
20471 208848 -1811 183596 293851 -21030 46061 -140289 216633 99958 -200983 -164316 15118
20459 -18306 294240 219735 381416 -11163 160906 113918 141247 -168239 -127055 -192784 -194926
20448 -194926 -61165 -357996 -119130 -170474 -500928 67552 -507021 -23447 -65329 183006
20437 -68030 -137131 -57935 208420 -132200 -238080 70914 44265 238507 96101 -297862 31319
20425 104635 -259178 -56774 34981 -204781 -64587 -265710 -116681 -242555 -38008 -61140
20415 -61140 116953 2183 49555 90146 246194 -80790 -322602 -159331 73529 -43420 -54143
20404 -54143 -312651 -328629 -65585 -155647 2020 -151511 -322553 2554 26095 -317611 -154881
20392 -145415 -24619 -166840 118511 -280157 -303763 -190874 -64951 325072 -15459 -230728
20382 -230728 107260 -81300 269211 89700 -159717 185197 50625 60471 -48557 -81482 -354247
20371 -354247 -240600 9951 -97096 -282203 -81769 -313705 31293 -314781 136174 47546 7336
20359 110415 44476 -42643 43552 111099 7643 -141223 -18958 -293432 27759 -271266 45667
20347 129601 294874 -186783 87418 132569 44436 -174667 -55799 -114236 -57015 -6537 59913
20335 -174189 -81359 66556 -171938 -219153 -165864 207472 -288313 -294898 183755 -5246 199179
20323 20327 -105313 118200 48262 181533 88227 2005 128788 -149532 -76791 -30632 32409
20311 -194861 326761 -245772 213778 153555 -63839 -115581 -86647 -161615 141545 -900 36496
20299 116020 -42205 -57851 13895 -97628 -71645 250850 34441 -46871 416322 -63169 -38966
20288 -38966 37110 101916 25481 6853 38015 -288306 -178019 28512 -127971 -142158 75677
20276 -22781 -266303 42242 58479 55616 106226 -15826 -69670 -371878 -422020 -330523 -259099
20265 -259099 35126 -174178 -430212 -124021 91201 86803 -111817 -150667 -161442 -252147 72012
20253 5999 -57176 267131 -2814 -13177 12258 -226757 -33881 170801 118561 -157531 -248099
20242 -248099 84282 -84025 -137308 13952 -80976 -227806 -52896 -222833 -14551 -128905 -93852
20231 -93852 -159507 280021 -134611 -330078 5098 75867 -130473 -120117 -25196 -80641 -308222
20220 -308222 -136770 -6566 -288453 -117959 337155 181776 132048 179493 -308527 297302
20209 -69626 -33749 33756 -46626 -189940 -26660 84776 237968 218166 312604 154900 -145972
20197 -219790 -111830 -224747 -116444 129066 -29626 -157683 -63655 -187360 -54867 -140650
20187 -140650 -218832 23891 18455 204459 -47497 -87562 191874 -43188 -129645 123658 244387
20176 244387 -119740 5003 -328422 1188 -329835 -26172 338942 -265503 121883 90205 315377
20165 315377 47474 -85547 -301153 -44957 -176479 104087 -502996 -252323 -116771 161573
20154 -43029 -303393 160954 -114518 89704 -89296 -128373 76441 33681 62837 -143315 -113329
20143 -113329 -82181 112836 253197 -32641 4617 -178414 -165996 -37247 -40411 -279129 269534
20131 -148410 51183 -176067 -72221 18043 -261547 113911 24768 -277936 -199219 176196
20120 21891 -209098 -70871 -189828 -50448 299953 7619 35648 -45537 138314 -127665 -78922
20109 -78922 -18378 -23007 186665 82043 64025 -29737 -94262 92832 103393 32067 -178592
20097 85219 269454 50816 -203282 108868 -95637 44416 -177557 -69380 2934 -353579 102066
20085 306091 -130062 -113950 -94094 -91106 359703 63176 77763 -262522 -236897 -428682 -274713
20074 -274713 -128385 -290904 -4174 99058 -21254 -182467 7147 280496 -106072 -48547 69780
20062 31704 -67140 260596 -382534 163181 -15330 166468 -424522 129304 -51904 23653
20051 56136 -213844 -320772 -161410 -112382 -74493 -198165 97183 135297 -122800 446010
20040 -126254 -110702 -123970 -148660 118171 -344589 -4870 -5956 -188921 -129048 -186455 50999
20028 132360 -108684 25830 -120626 146424 152204 -296018 2252 -251050 -276971 -46185 -155867
20017 -155867 -322567 -9891 67505 190722 -173765 174657 -485506 -17072 23366 -304425
20006 -164079 3536 -208566 -204954 -92199 -28696 258818 48104 -127296 305937 220738 124343
19995 124343 -172918 361473 -61319 174730 -18651 -63521 -179706 25277 242530 -14996
19984 -354932 -134352 -225886 -212611 -154168 -159783 300314 63019 -42934 -221786 52413 -34314
19972 23247 -148985 6566 20055 87318 -185601 195329 -207128 -548089 -123769 61876 -65247
19960 -175134 -374252 -245418 -57934 85940 148675 189679 -184053 72866 -19572 -208134 -169061
19949 -169061 2953 16320 -92438 -50112 -299130 -10283 148940 -134795 -353244 -28918 -31042
19938 -31042 -203786 -149198 134163 -102782 -130721 84150 -178807 290383 11220 85711 32268
19926 -481461 110308 -4486 -25924 26952 -181546 -232165 161609 53321 115734 -110877 -214190
19915 -214190 -42295 531664 49298 88655 -240245 -9643 12515 -14887 33722 115343 -3450
19903 219567 -55422 -370624 -118748 251970 -409279 -38041 82667 -77870 -196586 -60518
19892 69240 170407 -310937 10978 195981 -110962 -183377 -78406 -148631 -132305 -81104 133116
19880 -219889 69645 -234505 86095 93601 -456565 280762 -131473 -206822 -96558 134341 -234363
19868 -240114 -369410 39410 -123959 296171 235629 239634 16484 -149501 58874 -522247 94991
19856 298277 66486 -147131 -117851 259662 -108857 -125145 -9756 184317 45712 -42544 -72556
19845 -72556 -150457 -171677 200382 -13120 -25270 209760 -132974 64329 -160482 -88776 107265
19833 -132616 -152942 -169776 101400 -156342 232649 240128 36510 64003 231144 -96621 -184136
19822 -184136 -100477 -232048 -9529 -221566 38906 -134854 -207807 -37796 138693 -74898 26246
19810 -168610 -108750 33044 -194440 71835 190786 -29452 -103139 50842 -431149 23015 -390137
19798 -78767 -122522 222719 -227658 121696 -477703 14850 25956 -309982 -2835 -213688 -376566
19787 -376566 -6896 63246 -206416 51289 47208 -308965 -46616 -276673 134655 3337 -215992
19775 -135293 -136166 -348880 -156255 -82515 -202106 -187825 62533 -157277 7571 -325577 97594
19763 -213088 -155274 -154614 -28416 241589 75911 -49862 -313429 66078 -120242 -96473 42434
19751 -114238 -40050 193763 -51269 246689 47492 33911 112952 -145899 -101143 72287 -221653
19739 -61804 93480 31299 88644 167713 -79819 -155097 326987 32787 65257 171460 -270705
19727 -187708 137396 381046 -56734 -309291 322346 -42925 -333279 8948 176277 -260745
19716 -4784 57166 128832 -34377 26114 -159858 -114380 -139304 -11781 -147 -278679 107314 -166450
19703 26596 -190436 56832 -220693 -58542 44730 -31534 53311 -283488 -101786 79020 -125392
19691 -20993 -38060 39145 181807 -235339 -334416 -155203 -189738 92031 -200210 -207727 -61696
19679 9971 -73435 -99372 -6948 -241226 -157731 -31510 -17161 -21420 -93378 231471 92451 -223922
19666 -138411 -99518 119769 54219 -8384 68776 -204375 207576 -122765 65658 -465228 -207271
19654 -33201 107910 -148390 -315997 70519 237752 -66932 98776 -97024 -92655 -92551 121273
19642 -276162 -376711 -137675 306708 -46110 -67193 -183026 -224717 -196786 -201482 -80296 -75826
19631 -75826 31513 372740 52596 -55980 -195867 -318027 52552 194623 -343244 -251499 -86815
19619 -108644 32102 -391977 -501 156058 -146668 -174997 66787 -1282 22761 -42279 -238530
19608 -238530 80446 -83162 -190255 -244596 -254060 73976 51580 -92074 209382 84922 -303174
19596 189607 -169454 -524213 -236260 138293 -317064 19715 -164220 19357 -97159 68540
19585 -77241 13639 -260332 -339717 49276 -113593 31113 -135916 -121963 -116067 -242524 -182449
19574 -182449 -307688 87132 -82692 -247728 113448 -197887 -166460 -40427 253012 26733
19563 -78283 -54360 69172 -82168 2532 -89155 -172926 -400519 75870 -739 -249029 -411660 20438
19550 -215748 185791 -17830 -128329 -117958 -74347 -19450 -192904 257305 39865 -56964 152894
19538 10229 6389 -178038 -114689 188 17645 -106471 -231270 107896 -136583 -139221 111177
19526 138033 -10937 12442 168540 134016 148714 -151103 -76261 2460 -137238 184175 -251984
19514 -37869 223310 -131183 34614 -197336 -82993 22524 -200009 -225924 -74795 -45161 -5658
19502 22128 -365809 -131866 -33436 281799 72939 81415 103069 -153072 152664 -96504 -51713
19491 -51713 -85350 -110656 -146036 31034 -78582 -336569 -154876 177819 -294559 -95447 89171
19479 49338 -85092 4307 344992 -26345 71975 -94538 209571 -46935 -89970 49930 -188439
19467 -86331 -132272 92939 -29833 -147129 119940 -183429 64845 -23457 -246664 -303220 -104139
19455 -108545 194841 -333922 -225696 -107233 -25900 -118564 88206 145415 305166 -396701
19444 -142713 203518 48443 65244 160398 97882 29187 -212574 -169450 229655 61393 186656
19433 186656 -138256 -68456 -366311 -68599 -226732 34129 -13913 -41793 -222981 67345 -266663
19421 36573 -350728 13116 -45424 14320 -258774 -144441 -364383 -209552 -295776 -51702 -441751
19410 -441751 21010 36191 -47202 -248575 -83313 -265273 -146157 -138268 5028 -292329 117461
19398 61107 11618 -510236 181062 98518 -136200 -154449 -81545 -64910 -153226 -60764 -255400
19387 -255400 68470 7936 -108495 532515 179596 -339072 -31024 3701 -9022 -110400 -133650
19376 -133650 59610 212239 207697 -218373 -1582 22948 -236349 -121720 -109632 -293505 2939
19364 -38691 20067 214980 -257691 -96755 139264 -256205 59887 -205517 -87549 16637 110462
19353 110462 -45111 -241131 50822 15794 155961 -172006 137610 -55447 -231066 52130
19342 26351 29002 249079 14581 -62811 -213541 -335337 -57093 -258497 73073 48775 113370
19331 113370 104014 -119461 91929 40678 -181994 -104723 -48201 157001 -159454 230618 -31796
19319 -283214 -123930 -178043 -110028 27821 -259998 -188970 -100859 160421 127135 -131694 -261006
19308 -261006 -422255 -205934 -317263 -19115 -134661 92040 252952 167200 -19931 -196492
19298 -196492 329063 160773 -187262 139649 -251180 120338 -325215 -51004 44765 153840
19288 153840 -101911 -165941 117745 -250948 -48415 -25936 -173881 -120543 97744 -244630
19277 -150222 201479 -19003 -292003 39018 -257621 -79483 -152772 33227 -116841 175085
19266 -177438 -216266 -83173 -152522 -74083 36834 171305 -515109 26005 -331687 174998 -110118
19254 -6126 -163009 -203063 -213297 -290938 65514 94690 -97048 237127 -95256 -35688 -91588
19243 -91588 -143742 -276706 -135212 -105429 -38787 -163391 273411 -177196 -111496 32480 -111605
19231 -18537 -41588 -14338 331590 -103727 288533 -675 -403450 -84411 55645 -39061 -37720
19220 -37720 119940 240550 -122861 22280 -469989 -82097 102156 -162508 90406 -211325
19209 49573 -54503 -406704 65929 -8420 98361 -107413 -161231 38703 -225331 -15770 182123
19197 -355342 -149746 -48141 -169920 -84706 -204102 36131 -179149 62554 -288508 -38781
19186 -90625 -19776 364871 89123 19660 -22916 41710 -51316 -112659 -296361 -47152 92589
19174 66721 -39912 -43284 -246254 59230 -6333 31366 -173439 -79501 -69911 -183755 -116666 190509
19161 101899 -174604 -212002 137393 186918 8789 77517 -72928 2958 -240862 -159702 196124
19149 341810 -7941 -169312 72183 -241061 -424842 222804 -222663 -397272 -152008 320870
19138 38929 287684 -501752 -141932 -155204 145173 -20827 33361 -9384 -204948 229895 -49135
19126 -308570 -238699 -107906 -63050 -65929 -16173 96991 -198181 147608 -27057 -266687 101367
19114 215235 -188828 169828 459494 226997 261234 46787 -113588 68191 124967 313080
19104 313080 76941 7428 80308 -230538 -52563 -2235 214393 -163458 60919 -295691 173575
19092 -166831 -206870 -465586 50977 -146736 -200765 -125833 257920 8105 300421 233920 52137
19080 -73860 -118699 266782 28741 -153089 39813 -193465 53545 76244 -61899 -291528 216982
19068 -129771 -37450 81743 -119682 -28885 153698 -211420 -19695 -186453 -78015 -57486 -131021
19057 -131021 -106723 16382 -305929 -99976 -270374 -208714 313923 -57192 -50203 111550 -46305
19045 26951 -191499 304518 92312 2365 -8884 -55202 -88327 15643 -235114 -3640 -310769
19034 -310769 200138 299979 -279605 167741 116952 -166824 445756 12308 -28671 -144474
19024 -144474 -51319 -249163 94807 -57599 146359 -30759 -47052 198439 242565 -368332 -146072
19012 91484 -105430 -187703 -88488 -367392 -205741 302258 88460 243200 -70064 -30520 -90259
19001 -90259 4846 -132260 209953 -80313 -205693 -71916 -150507 -341770 -11057 128317 249573
18990 249573 1154 -6457 36761 -225418 -188804 -121252 -69225 -41293 -140677 114544 -18417
18978 53 -219075 -293956 -401678 -52081 238168 -250942 -271374 104734 31037 130826 -315549
18966 -146864 -152224 416638 20368 -18976 -42252 -6986 113018 -146788 97548 -414022 -253904
18955 -253904 191311 -94979 -88235 -83639 -212314 -46026 -204789 8184 -153634 165789 -282528
18943 37453 -131042 -122599 113581 267269 120118 -98851 -296159 143829 133315 23597 -14744
18931 42366 -236158 124259 35088 226667 242257 -164559 -105977 -119357 37445 -330161 -71022
18919 69970 -152287 59444 -217082 -12472 -45448 -8351 -134947 -394384 -18541 242994 78291
18907 -142427 426590 -68267 -19252 -298668 -50686 -323140 247123 364151 -342228 -42954
18896 -232123 -58587 -166643 -37614 -256014 174418 4751 202023 -310708 -300904 121721 -542429
18884 -70203 -200147 -192343 -49080 -167202 -461993 -143070 -179488 -333874 -170228 -66730 -19481
18872 -62732 -235126 -96819 163310 -289537 -147186 48608 -27816 -77835 3797 -140031 332260
18860 -123929 55026 -36459 -4715 69934 -137982 -97190 -187306 -68469 -47020 195524 51319
18848 -18059 21279 35669 -201902 215184 129833 101227 78183 -223011 -199287 -36089 -165264
18837 -165264 36092 142996 -177208 -1559 52799 226504 -154141 -189603 -61441 -152733 -139409
18826 -139409 -23495 -141074 152464 98857 -61829 307369 -75242 -25476 201717 290299 -8947
18814 -31427 32435 -187023 -4931 194073 -41962 -72483 -94324 193901 74339 76970 -153650
18802 -84795 127527 128170 56839 24309 74124 -265905 -241492 -75903 60101 -166397 -50720
18790 -110502 46026 97260 37574 -250198 135463 -76599 -418056 10986 -185201 110995
18779 -246411 -252394 21517 -10789 146396 -372014 135000 -297886 65333 -330217 -9028 3549
18767 -209099 -151836 43510 -513094 47786 -145555 290761 193587 -88344 -13954 197330 5792
18755 -68274 31564 71626 16067 -16347 -366698 92688 -21687 -132728 -254376 318686 106394
18743 168565 -185008 -175133 -25682 -73158 -289820 -276386 -106322 -136883 118311 -22966 -134723
18732 -134723 -113289 7700 -278860 -125304 -63573 19118 232056 44863 -130371 5467 -345813
18720 153913 -99319 -162360 116870 -113716 154470 -15973 -97315 -248755 -203396 -117029 -6617
18708 -23227 -120595 186366 75777 51654 161134 -76198 -22923 -69515 -351096 25988 -244894
18696 -15704 -150336 -39244 11047 -139555 -388613 -318355 -103446 -274624 -218891 146544
18685 188493 -40611 227170 168444 69775 -334392 -38604 -137641 -74992 210983 210798 90969
18673 -18764 -85555 84600 322409 89203 169717 -133611 219727 -62127 55952 160604 28280
18661 112671 -227764 -138268 -86276 -134531 -330843 -370953 -10079 -85448 123328 51733 206313
18650 206313 219205 -11094 -52972 -227587 83996 -32821 193842 142573 209581 184391 -350336
18638 39853 79887 -220818 75804 -7542 -400878 35369 -69688 -172427 -33852 -157456 303950
18626 -171703 -67631 -29977 -151745 117881 -172293 -148874 -421954 -7748 -106467 36367 245419
18615 245419 99765 314745 -204345 410227 -36053 127640 -26688 126269 -171192 -111716
18605 -111716 -958 -7540 -52176 -55774 -21441 -216670 -50586 -125844 19286 -107628 -231989 -40807
18592 -230962 -216077 -152489 228721 -193587 -292302 248793 -141067 66991 -209575 -94034
18581 -235062 -9153 316302 146160 -65396 -34306 -151803 -144794 17236 99060 -7098 205175
18569 -265797 -167250 -445234 66578 -5199 -3835 118667 -85677 -66333 22753 -69419 103110
18557 -42606 -310390 -279838 -44850 -82775 35876 -277747 17302 -290288 140162 -244652 103082
18545 102170 -16592 3191 -32164 -183586 -39681 -284455 15033 170166 39763 69488 8793
18533 -27211 81533 -72507 -68270 -223744 -164490 158078 180884 -137446 -45433 -37181 -16182
18521 89312 75746 327343 16703 -34484 48375 113147 -42357 -351924 -51209 54381 -153752
18509 -146166 42779 131990 83823 -244888 74119 -284082 276168 190473 -164009 282439
18498 -333045 -34668 85495 -40190 -31236 -275377 -197234 -392266 -78830 -171814 -215 225438
18486 -9156 -106961 329936 -109612 67106 -112864 141754 -124640 -14905 -37397 -151093 296993
18474 150347 -98941 63815 -46603 -22630 -195290 -263836 285247 -64913 -349106 -108892 -182935
18463 -182935 -49979 -14990 105124 -81979 -47379 -145912 -214383 14701 42917 -166630 -176867
18452 -176867 -102110 -171460 14332 13341 -338565 -114488 -75234 100141 1993 132699 -291889
18440 -5445 86189 -24278 49996 134678 -44196 -81796 -265206 198660 69200 -100322 15110
18428 -196603 -171275 -115391 287578 -271070 44224 -91938 -482219 -73230 2107 52441 -101828
18416 135305 62509 20076 -202264 -305939 -170496 -10131 -22667 -184043 88608 53389 -87071
18404 420229 110440 -170956 -263415 -32067 -73101 -39400 -75035 15637 -291074 6043 152597
18393 152597 -133991 -331411 -117682 286396 108297 -234079 31605 180264 -1977 -24109
18383 -24109 -254798 114261 5358 69078 -105883 56417 -18572 340283 18092 28309 177150
18372 177150 -255348 -174597 -108821 154347 -46026 -79901 26399 -133148 242573 96944 77937
18361 77937 -98068 60562 35560 90699 36938 -358073 -113532 -243128 175717 -92423 30963
18349 -105446 -130661 22422 -7859 287022 54541 -145941 -79295 -165368 -55082 239416 33040
18337 -314242 118881 -208826 45550 -63467 -109777 -228910 -208116 -222298 -119201 267059
18326 -97492 230862 -197526 -130665 -141801 270845 -123769 -287680 284378 -289361 240087
18315 -245378 88906 -98177 53015 -171270 -321452 -126422 -50859 177 -253315 10102 148473
18304 148473 -304314 26291 164357 75281 36829 -178850 -108237 -248051 -116506 -237246
18294 -237246 -71546 -186423 -95074 -274975 12111 320892 -104561 17253 12771 -119984 -136803
18283 -136803 -45023 -255708 -199375 -168915 44324 -186040 -241130 -115206 -197187 39498 30543
18272 30543 263016 85402 -116621 -84034 -169202 -8468 -183394 -162222 74031 132674 -10677
18260 -134675 139134 4455 141691 -274469 81418 -209600 -15903 -197120 204231 120491
18250 120491 -21874 -316678 268275 84630 -10587 -112343 -99362 80032 192685 -79200 -125624
18239 -125624 54775 -82078 173594 -295463 -90282 -315109 134912 -198975 92137 5588 139078
18228 139078 -156025 11581 54775 -44496 -123397 69535 -406695 -223846 -244750 82286 170269
18217 170269 -246605 -119201 46236 -236946 -214337 -212166 -166433 -230943 311287 45003 -172159
18205 -416664 45663 109190 81083 318461 53599 202101 -383073 18061 166168 27488 24490
18194 24490 27958 -56707 174936 266408 -90985 -124826 76947 107710 34571 91541 -252723
18182 118245 -331249 -279510 -241027 -288523 -248336 37663 -103588 56328 -104311 68426 41397
18171 41397 -11532 -68197 61804 389972 5316 -125277 -17858 17682 36289 -113666 -218624
18160 -218624 130838 15877 227517 13014 -128743 203910 -198580 -206480 307657 -150071
18149 -106902 -17038 218960 -70606 41846 273679 -331275 -291375 -251479 -182771 -275985 110790
18137 224254 -91146 222651 -34252 -106519 -302489 -166967 -92616 -304189 118948 -50692
18126 139429 47997 -151655 231402 -59268 293215 -313906 -435796 -153614 185012 -295301
18115 -377641 144388 106628 74023 -78421 99165 378109 -104426 -19228 66442 207053 -423069
18103 -13514 32822 343706 -111743 226072 363061 -75985 -268488 74546 -6033 -121933 379810
18091 -154893 30878 -17353 226829 -200967 -129440 -335963 112326 116532 128506 -118495 183846
18079 -198623 -92545 54968 -15934 118905 -155962 261046 68409 246661 -25215 -24608 -162745
18068 -162745 -38628 167319 96125 144202 -112477 186472 -301339 -318392 -42519 45317 135191
18057 135191 -47645 -63155 -259367 -235606 156307 142460 -74268 56126 288453 147521 -273916
18045 -94433 -253634 228134 -24529 9972 32218 -132343 30490 262164 -280105 5232 -333862
18033 102803 270833 -31670 -150183 -178062 21232 36860 6998 109359 -71306 269180 -329259
18021 3089 -147848 76573 88006 -178030 -52646 -196832 -80116 20630 -94438 -317326 -23336
18009 -138415 -148453 -132196 103624 -230557 23060 11888 254861 58550 30823 167069 167713
17998 167713 152534 124958 135740 -22383 97100 140875 52566 -7348 17985 -9413 -86929 -144811
17986 -144811 208966 20995 -173859 -19181 -360163 -284864 48363 118386 -60648 -123090 -17795
17974 -314543 -178361 -62041 160523 -140475 -151623 -26776 195500 -20241 -6463 72185 -158573
17962 -279189 47420 -18250 20896 -89626 -148719 121746 37471 -114478 -251381 150003 -108975
17950 135422 -75672 8018 80320 25280 -46495 154577 -121496 16865 44440 -233606 -56119
17938 24383 -113923 220262 194554 -126204 -109025 236280 61930 -173851 159418 237938
17928 237938 118253 289109 -29215 197502 343699 -215364 -369171 57649 127812 -11662
17917 -71940 -18142 276381 -8341 -68466 -143891 25581 93211 217375 41930 -173582 194167
17905 -17406 -36283 -452435 -35411 -70130 -153705 -24367 60509 -50052 -8375 78116 68825 -5924
17892 43602 -12322 33186 -7399 171557 72975 -209377 -109070 -106473 32865 -75896 112390
17880 119383 -143328 38202 -464996 -139952 -268419 -507 58730 -126578 -2580 238945 -266896
17868 -53067 299400 50721 146469 -198283 -44583 -185568 315011 -87948 -40186 -223141 -67943
17856 -135298 110743 228563 -63627 166343 6634 16539 148829 -60386 -117040 -88125 -347982
17845 -347982 -131782 159922 -163398 -246023 -60804 130882 174612 -237424 -56483 31824
17834 -159221 -47006 275987 -143592 -93019 -104500 -233580 -253441 181076 19548 -331207
17823 -118949 363386 106650 25568 8724 -135440 -85643 12531 -83021 -139317 -38892 -56695
17812 -56695 -3551 -340795 77342 75701 -22346 84181 -216684 -159729 -22730 -66786 -7151 -60025
17800 -60025 -207495 -50206 -121686 -249936 -90769 4256 -71940 -305595 -151888 -45491 10198
17788 -145700 99859 305743 -226024 137019 -166516 -85319 -172327 -30605 209338 108934
17778 108934 -33401 54023 92135 233077 -31353 26673 42422 -132496 -28175 -84860 -99053
17767 -99053 147430 189956 28288 40253 -12713 -266890 115707 58716 -10963 -15502 83006
17755 -141549 -70853 14988 159838 84743 75984 57139 34045 -56238 -181193 29572 193780
17744 193780 117977 -48836 -131534 177255 274141 91610 -131065 209135 136952 -139631 101172
17732 178510 27047 -146543 -136991 56811 -119843 47518 -57896 28142 172925 20174 -201214
17720 -15325 -32302 179144 -210783 273109 143596 -350843 -28630 482751 104573 -271954
17709 56476 -15477 -56282 112071 -38230 -5610 -143494 -16856 -178885 -81764 140628 149804
17698 149804 252467 409490 44924 57619 253480 -180792 -80891 -71583 -113954 -260598 232036
17686 -20320 -64228 -68852 -1022 54748 109168 -104429 145770 -183424 -156615 -87927 22789
17674 -126734 -43719 125148 -26682 37430 143185 205184 -23065 -242254 89731 -203381 -169151
17663 -169151 16542 -268164 -253259 -225253 -84590 44907 208622 197006 277237 -101645 101732
17651 -64158 61236 -72302 92473 -45542 225016 346343 99873 -4553 -65611 -16960 194959
17639 427654 -25469 -202899 -85537 -23920 -15535 62445 -175728 -60399 61304 27418 58647
17628 58647 -12528 170944 200884 20699 303111 164274 210677 148105 167638 172267 -47415
17616 -107471 47570 -301959 158077 -175778 85251 238637 189985 -250055 -47358 -92708
17606 -92708 72071 98145 338062 -93859 -320628 341352 -23887 -71145 -144732 26870 21986
17595 21986 -101694 -26333 210247 -14612 -72672 -281836 -70124 -102863 147427 222776 -18875
17583 250291 97294 186395 -200639 96815 -158443 -39606 130383 180458 -215801 124800
17572 -129394 60008 203551 132086 17822 37182 -170242 -294204 -133690 140213 398105
17562 398105 -50243 293054 295501 -143443 -121732 140214 55149 -34095 83206 314582 -179529
17550 262655 59182 67142 -438689 128344 -79366 235184 178397 148586 -199265 48558 363930
17539 363930 84991 -28525 -252764 -190227 55330 55038 -358972 141815 -28487 223161 -151054
17527 -189757 72272 85528 37195 -303217 196912 -10328 30133 -63610 148088 -70443 -59403
17516 -59403 -58212 259125 -331 174182 264681 44516 -32336 193653 101948 -105085 323220
17504 91527 248676 118577 -110432 320410 210722 12880 160610 276262 202938 275268
17494 275268 -18995 183303 257930 5732 165789 161065 60292 73073 299418 -31340 425082
17482 317458 302786 -6182 232303 291607 132186 34474 131103 324726 -9208 -45398 -43374
17471 -43374 256817 128409 197071 -50490 78847 -172113 160703 -77705 366056 -122730
17460 66836 189311 474446 -158566 88086 327606 12467 -125731 435201 333969 406087
17450 406087 236723 165806 316705 181232 146429 385441 75112 235290 450683 215262
17439 389248 18088 532509 258980 -3411 279475 220198 -27070 155736 -47442 5847 214732
17428 214732 320317 60165 215936 -77249 92302 182317 243909 47458 268273 83585 238927
17417 238927 303526 472543 -22753 263233 220660 344315 328329 -8826 -14441 68325 68367 351188
17405 351188 109828 18146 -56198 54011 103082 259360 184180 104493 -91395 273132 -95537
17393 43475 227949 164208 90286 80035 56657 -12022 353556 216027 -166013 233650 -76422
17381 -101213 242341 204248 74371 -54768 4749 26582 440088 -54081 84552 -13786 8725
17369 -72623 87192 171199 174459 -169992 35866 373368 258962 -56371 24379 153804 294312
17358 294312 421338 179550 -150704 247397 10715 282931 -119522 206691 -17618 498476
17347 472558 -79515 351136 169925 165444 -130557 494261 -60675 -4643 163603 196345 -52819
17335 54986 52224 424083 78224 -123405 305332 180668 369316 -108104 114911 6263 -20724
17323 159267 321508 209289 321489 164790 12772 20649 232949 100036 317286 149191
17312 201813 48038 25148 146044 44971 38683 68697 300976 55423 223581 76064 185264
17301 185264 95018 157985 302348 319299 -3793 123766 -55727 72733 342995 183152 164117
17290 164117 -18068 202741 16415 228379 182271 -54780 2370 181443 104017 -13981 197801
17278 -216280 450456 100224 241092 115684 17126 160545 118101 152908 -58948 85189
17267 229988 -44874 206388 -125892 141360 53937 -48244 205212 261140 85754 182163 533309
17256 533309 387053 295864 287045 298832 -1014 -270041 335944 303803 -109960 -24580 92867
17244 204883 167684 249768 -29238 14088 230784 153787 66484 158715 311725 -42179 186615
17232 129578 254294 184411 275183 333191 -136720 328302 169379 133211 286694 400109
17222 400109 -75828 292404 424708 358122 -7361 85227 142276 204956 504292 323678 21777
17210 173932 170087 494376 99138 239664 135023 437258 170933 255903 296615 24910 31226
17199 31226 -6866 345829 234217 203112 431512 33516 58444 342191 535693 82741 561934
17188 561934 -13477 259736 155495 233479 207009 225840 380823 275079 96524 263172
17178 263172 376435 281090 209755 339137 224341 120745 292950 533390 304701 532953
17168 532953 353403 397697 281979 353690 202692 308000 270118 45921 229817 85195
17157 288181 -3136 473648 337869 -38751 351676 165163 461755 348433 319717 331186
17147 331186 187563 157278 514212 118921 384174 257862 -104773 170803 33294 196773
17137 196773 268993 523565 320428 486097 243319 224631 555917 56026 167653 399552
17127 399552 -1384 575670 577861 278055 302510 289199 436155 648745 328739 369432 369664
17116 369664 631191 390531 388588 532809 134519 731078 70857 76393 217942 491881
17106 491881 295563 463868 422461 328055 183649 635276 293294 423044 678342 363562
17096 363562 554706 359108 375740 299617 539129 371588 262574 350372 402554 213764
17086 213764 500578 244635 543176 463032 533464 554281 387790 505308 376820 165831
17075 713037 223911 252414 811425 154836 685720 589427 499601 351132 615575 564390
17065 564390 461880 108868 193787 388740 588490 749466 327861 498106 264551 633296
17055 633296 651878 659160 462518 456729 458687 383264 668033 419211 363496 576581 508760
17044 508760 865682 318498 669040 459162 474022 339933 230339 287708 457700 699361
17034 699361 470339 658201 381293 425807 471351 427640 520483 514371 626231 525742 58674
17022 652343 696088 393092 602620 688845 720363 520159 595328 565061 846239 389949
17011 295473 574287 886514 967175 611138 956268 798245 643535 614256 484278 613867
17001 613867 708066 258376 662282 168684 916815 619880 888932 545119 737481 614443
16991 614443 711019 1233028 719181 881087 554307 584934 1000241 802626 676768 567399
16981 567399 858661 726874 639369 644310 643504 945281 908896 833781 728030 814715 1070482
16970 1070482 896874 883084 852743 1167019 872529 997977 605885 841881 1010177 561388
16960 561388 869425 654304 716512 1032485 953417 1169886 1157186 964700 1322541 894055
16950 894055 1241860 1284132 1117469 1082599 876165 1190780 987935 1060509 1167657 968898
16940 968898 1016227 916193 1344801 1197860 1248198 1314260 1066596 1090064 1269735 1175661
16930 1175661 1114019 1349641 1060561 1128094 1450321 1399499 1186679 1423202 1114349 1432939
16920 1432939 1472291 1204371 1564101 920707 1170210 1206346 1128174 1493809 1609618 1535021
16910 1535021 1479031 1585095 1569702 1566030 1102695 1726697 1589231 1477040 1692711 1617925
16900 1617925 1566572 1755252 1573370 1570761 1660793 1868259 1991294 1974786 1882954 1933337 1633312
16889 1633312 1669637 2027953 1768699 2079330 2199249 1673014 1873807 1972675 2220539 2114107
16879 2114107 2103990 2310696 1998294 2294393 2277765 2155640 2250510 2477538 2173144 2280190
16869 2280190 2586061 2549183 2954928 2500693 2242206 2588556 2466294 2712805 2769755 2547702
16859 2547702 2361578 2771332 3049336 2992060 2865877 3343525 2989631 3480791 3254496 3508355
16849 3508355 3276170 3296051 3302184 3142560 3625612 3613042 3950193 3431672 3540010 3792790
16839 3792790 4085831 3929234 3960982 4115884 3914457 4089717 4225988 4384713 4478230 4488505
16829 4488505 4368723 4617337 4688002 4885787 4650784 4897150 5106343 5157651 5189521 5532209
16819 5532209 5466308 5509901 5698378 5593429 5980303 6237053 5637718 6067130 6334455 6496536
16809 6496536 6440271 6973514 6787309 7121205 7122311 7099390 7682101 7480354 7761638 8132445
16799 8132445 8091859 8123267 8754354 8487296 8705769 8984205 9343000 9535489 9755053 9873320
16789 9873320 10362507 10391116 11330653 11263589 11681242 11757196 12446784 12422106 13093465 13362469
16779 13362469 13797608 14230341 14509592 15330332 15887644 15962646 16453860 17270512 17583498
16770 17583498 18483246 18954531 19724568 20703956 21205557 21780767 22810868 23378434 24516527
16761 24516527 25641741 26633795 27774835 28761573 29947489 31421565 32663730 34079953
16753 34079953 35418009 37251024 38852359 41086427 43132574 44607173 46965406 49430096
16745 49430096 52162448 55097099 57462136 60578109 63696826 67915805 71313629 75615501
16737 75615501 79642108 84481636 88713422 93785751 99176261 104738881 110917059 117215440
16729 117215440 123120223 129623300 136191054 142153790 148423364 154391341 159815945 164951183
16721 164951183 169065107 172596749 175242936 177010899 177412638 176679728 175115491 172482383
16713 172482383 168847667 164225575 159202017 153680720 147336993 141058344 134734373 128023301
16705 128023301 121258793 115189406 109066800 102811906 97067760 91512116 86716124 81962052
16697 81962052 77061810 72885830 69097852 65440090 61500223 58560227 55015636 52292180
16689 52292180 49832572 47109432 44837063 42794309 40631678 38475201 36789536 35120710
16681 35120710 33876905 31767059 30960492 29479160 27921420 27239386 25703837 24375613
16673 24375613 23646254 22646776 22199541 20932775 20638216 19685684 19005744 18317528 17931069
16664 17931069 16878881 16392582 16162958 15290982 14998231 14673409 13913331 13446069 13034949
16655 13034949 12683851 12681685 12109691 11798197 11126128 10969336 10897879 10520930 10005099 9804579
16645 9804579 9648745 9611116 9132557 8966934 9019305 8394661 8230781 8000272 7876974 7408649
16635 7408649 7380338 7060807 7141515 6879539 6634172 6538283 6426378 5906422 6409195 6003662
16625 6003662 6085583 5577767 5796295 5388947 5736627 5121859 5068143 5334973 5009522 4965716
16615 4965716 4657116 4776972 4897290 4462614 4596468 4229004 4363476 4159915 3844442
16606 3844442 3946541 3817645 3795302 3650326 3626816 3767333 3606562 3498933 3416297 3532391
16596 3532391 3182758 3344953 3056655 3070068 3106030 2823618 2955719 2957203 3260568 2904443
16586 2904443 2864779 2996153 2790206 2682256 2734436 2862496 2498721 2549172 2582247 2254069
16576 2254069 2279873 2707204 2361239 2344357 2249122 2333423 2432355 1855535 2229443 2248078
16566 2248078 1918589 2172935 2008684 1553960 1931223 2182040 1761571 1990012 1846341
16557 1846341 1729369 1606366 1598688 1528545 1458741 1931328 1914064 1742574 1439691 1801886
16547 1801886 1847786 1293353 1784449 1640112 1767695 1521023 1591374 1681195 1443513 1495795
16537 1495795 1297511 1538702 1346337 1551918 1422653 1525579 1107068 1156890 1595415 1247001
16527 1247001 1376893 1483182 1554063 1061770 929951 1160446 965233 1203612 1212604 1007465
16517 1007465 1240282 894481 1212832 1468819 963603 1227210 938598 988162 966065 1197847
16507 1197847 1166022 1277603 1285417 949248 1184501 1069160 1052301 959684 845545 957295
16497 957295 1088001 788289 944016 1011279 1033327 1065391 1172443 1029699 571678 879728
16487 879728 1215580 1187699 716250 954519 927192 875614 676403 751512 935699 650923
16477 650923 628100 712037 749539 635934 701472 922764 903804 669445 683255 465291 493368
16466 493368 475996 924371 1056741 769009 838882 1048460 520084 813120 279664 690226
16456 690226 636913 409337 869411 460367 487836 712036 716335 858272 315068 539598
16446 539598 896950 536388 418879 700330 732624 325329 625183 359416 205991 235614
16436 235614 522490 449341 532638 188874 491230 372538 402226 697416 241461 559210
16426 559210 307585 382797 526891 594086 339121 407812 91022 384893 -171313 414916
16415 284250 157243 72133 601244 362870 336553 444857 342204 424502 365700 425938
16405 425938 455983 220180 388780 123685 486686 105647 109284 424038 354589 121595
16394 218434 281672 -67744 147420 61654 332168 263662 195058 -35501 440956 316897 125267
16382 157800 292534 357243 658987 136858 567581 388189 352267 471186 333089 331062
16372 331062 241578 190509 496887 427410 425697 361509 338834 47066 371339 210161 144563
16361 144563 551908 340936 229909 321489 310574 9404 361272 323093 158358 85023 388259
16350 388259 80264 440274 443721 422593 318715 192018 411337 281947 102630 139317
16340 139317 601259 561490 395242 174002 128541 143920 376003 445463 -2111 -106133 249314
16328 326630 83466 312851 77125 199199 396863 203308 413896 83547 243602 -195530
16317 96892 155981 291981 258134 115779 8664 451366 254699 23850 22252 233802 410609
16306 410609 248935 159951 87954 -57336 294508 196290 281952 46250 48615 258062 236299
16295 236299 37446 -80624 -93901 32745 -197843 130625 322564 357596 244789 7358 369404
16284 369404 71276 -36048 327026 423994 25676 -158160 -244955 281303 180619 -97984 230355
16272 137307 -100353 187142 -183141 324036 -183218 165517 -49326 317193 -122820 314389
16261 73516 418923 -83586 -11884 21877 345187 12154 -15074 -327831 55132 -64471 25027
16249 -42423 246783 -243930 99682 106598 402579 -19376 -94764 491587 340480 254945 -71330
16237 334241 173094 -92212 64403 309764 6382 235139 55616 54605 239204 99789 49175
16225 3943 317650 110585 281439 167347 195587 32941 274489 -225296 -68722 2163 -92679
16213 154716 21290 -74629 30168 63504 37863 65464 125603 212838 97248 150331 88307
16202 88307 -111016 86411 85548 100156 -90404 152961 -17606 9093 134381 -38381 288668
16190 -61430 140764 -102233 307992 40120 -199518 122678 121240 -33312 -237839 -66875 224469
16178 -82617 50904 162100 14899 78705 137424 -45045 34725 258308 -251236 -22443 -229786
16167 -229786 -109772 34166 30099 -68454 -101730 -27879 114493 11126 202269 108941 -185591
16155 89675 -12640 219982 -59151 279559 146502 -75576 -302773 -150668 123212 218839
16145 218839 49274 -27092 -217636 26940 138208 160140 75581 -69764 220122 -317331 -8790
16133 103128 133964 -149539 104341 77219 218114 332484 122039 9335 -84381 -445788
16123 -445788 324888 -26957 33206 118844 -188779 -214138 -311165 46903 373769 33792 -254791
16111 -30938 94565 -10361 -141669 218682 -33219 264100 253840 -196625 135489 126039 245266
16100 245266 22033 88427 185334 71480 -130979 326795 42342 172676 -51205 -59392 -83110
16089 -83110 53548 -216206 -196706 -240535 133358 73140 270707 58365 -9334 -271717 -48310
16077 -31109 97985 146691 -60381 -28934 -174457 57824 160620 -96953 -125213 10214 47679
16066 47679 -153620 182356 -25601 -113161 78314 -5001 293010 100710 63103 36754 181987
16055 181987 -97325 21847 68262 -174417 -112589 368175 -262840 196814 -9700 152796 -63087
16043 14532 30730 -66923 189841 225108 -60703 -368521 -80470 132550 -17652 106152 -112269
16031 251828 243748 183566 -111413 -153539 6792 203506 49211 233625 -102542 -72798 -118661
16020 -118661 -129571 -84003 -1569 70619 -124041 156597 -112381 -220221 123598 102316 -317545
16008 61757 102237 -39394 -94852 59712 148699 161827 -84241 184569 93357 408972 15707
15996 -365980 -185914 -96746 -43074 -140361 -50268 -153185 -232036 181215 -290286 -267261 -35473
15984 -18011 92218 451135 292148 224703 368254 57809 80148 -116304 27239 -139601 -85953
15973 -85953 -145905 -164836 348286 10811 -20371 298528 181322 -165522 -129524 96040 2536
15961 850 68458 -182703 155113 -142012 -28775 -64461 -303484 180903 -85386 57175 127419
15950 127419 -100334 -313071 -32201 -153684 91495 348074 -566867 61745 343968 -224432
15939 183310 -260975 -131616 -64351 125495 -41139 -35136 -117144 -79468 -75325 -232402 -37908
15927 -9096 -81982 -15228 -188452 195229 -304989 10853 -104909 181887 59543 88464 145310
15916 145310 -122694 -166970 151671 -280285 168430 -33930 31566 16941 171825 -237172
15905 -274424 -20534 -127065 -107360 -326937 50319 -23419 -48568 114308 94233 113190 38789
15893 -121089 -279635 -103806 62807 -48270 -178930 5850 -262436 295467 -280790 -219300
15883 -219300 -145987 -144683 -172268 -329729 -25848 -95054 -329339 -44244 36995 4479 41670
15872 41670 -183199 -91524 -61992 -120762 -3003 -330051 -34873 -58053 -182825 -66707 200277
15860 10487 6453 77119 -72314 144274 247023 9175 -167560 -167842 251210 77743 26054 -40613
15847 185308 -96452 -101464 127479 84210 39943 -167779 -112417 125765 -177473 -60818 281174
15835 32091 -285711 124434 -147258 162699 384492 -231629 -228563 -149884 -180657 -140315 -66718
15823 77385 -337947 9635 -34259 23565 -148840 -204324 -220507 40285 -183876 -176912 232481
15811 -165893 -207050 5341 -78460 111032 -56967 54248 -17510 193365 -49146 164571 -359770
15799 -121633 5124 -73693 -147459 97436 -71527 -156050 -144437 -128793 -92445 147976 -234481
15787 125200 57730 -25629 44831 280307 194269 7379 -176615 -62179 34137 68306 -158010
15775 55206 1133 40750 -159710 -191603 -224295 -33479 103066 -172680 -36874 13398 15465
15764 15465 91894 176746 -6086 75939 146474 137257 192092 -43804 140560 157185 -147650 -18758
15751 137679 108559 210275 5475 -108607 114672 -138256 52003 -166151 -240456 272955
15740 -136616 45039 -231860 -84801 141953 -27488 -113770 -278252 -108871 -168400 -281946
15730 -281946 -196411 -92941 102441 -47564 -140114 -339394 -10372 -215998 -68953 -133113 -30833
15718 -340489 -118726 -115371 127981 -339788 -118203 -76400 -125916 197950 -185810 139924
15707 199674 -161562 -113948 -78054 112879 -97749 25916 -89301 -193799 -187885 71009 273232
15696 273232 -203354 -90446 -155959 260889 102063 50671 297945 246344 346847 -97466
15685 93327 49059 161923 53568 318434 -2605 -129152 -42845 295906 -98757 -107479 -1807
15673 310773 190730 96547 196507 -88956 -88563 176943 -77888 40235 12886 146696 -37833
15661 -74645 -122229 -21695 -77745 -41544 -39074 -714 -355370 124440 -302680 -148754 184694
15649 -200883 -27535 -563276 -198308 311289 -253984 98526 105349 -56049 -37914 2731 -83376
15637 -274337 -216072 90541 -126395 108718 -329128 200179 -120792 107954 -33062 25141
15626 437058 -447 -53239 -272224 -105862 -138030 -1918 -81669 53144 -168571 144300 -117322
15614 192506 -5716 -130235 -210700 -175169 -286278 161509 152050 -82822 -346384 -99378 260495
15602 175102 204831 -169363 -17775 23663 55321 107918 7220 -149869 136570 -74228 2269
15590 -79043 21574 -274225 161440 -303787 -30252 105215 87756 36389 145513 -198109
15579 99354 27225 91679 208269 278221 7372 -108478 -214549 -189272 219516 24850 -50689
15567 -206093 82979 -76822 101777 -158373 182161 231291 65050 14679 -44429 -137946 -153096
15556 -153096 60356 52719 -223986 93919 111846 -19627 78571 116552 -341896 164473 -39748
15544 -246540 -90318 160735 -229784 -106311 -11004 -5310 -59018 -69218 -14154 131571 -193897
15532 -239405 115830 -37953 198223 -103660 123570 53991 -59624 -134618 14579 -6247 26884
15520 -89310 -69304 389806 21753 -38954 176276 63548 -148049 183947 200092 -31079 226293
15508 287324 -161436 -141770 -81707 -87399 -225670 -74831 113987 10681 -108800 -155554 71051
15496 17297 52600 -114482 270041 -51526 -93770 -61285 -113118 -94092 -201415 107841 32137
15484 213359 -78649 50465 133889 -98290 -24260 -152045 -345611 -154673 -14095 45689 -301712
15472 162735 170027 209436 -239302 -43293 23469 74119 -228398 -289943 -149140 -21210 -156094
15461 -156094 57181 249405 -45272 31183 302053 -123515 -253834 -332902 220180 -171733
15450 -196486 148421 160845 -11516 -98697 -137840 186969 -23855 -64941 -69756 -69409 157592
15438 -21674 -62565 -25863 85651 83688 -76510 -246415 11806 58894 97467 173420 324578
15427 324578 100521 269309 -59954 260761 196802 -162082 -45004 -116293 141885 -260210
15416 -107786 81780 -6256 1039 -251685 -199790 -207260 -148150 -75375 61895 -142537 74692 -133263
15403 198080 144607 281919 -149621 60947 -38019 -147316 -6271 -14254 -238948 33727 -332817
15391 -20787 -30959 160788 329428 5914 -30728 -72187 -40056 -285981 2484 73612 164003
15380 164003 10928 -212329 74180 -1566 -134965 87101 363195 -37542 149071 14564 -34704
15368 -43116 -178366 115093 -96388 9102 -200268 -107777 101658 -8541 265605 -67426 -284121
15357 -284121 62444 -242347 -186861 266973 -6977 -94549 -246759 403408 29925 55008 63633
15346 63633 156467 11522 69378 -307285 134717 101144 -162607 221358 57715 300670 90634
15334 -165574 234961 -17772 129788 -110801 53768 318380 256911 14008 219180 276952
15324 276952 -25351 -60538 -27111 62793 12395 -37561 -347390 -49527 447 -250906 315432
15312 -187304 -101150 50434 349372 -504624 98816 -41684 97898 -86859 -153356 413559 339383
15301 339383 -55517 4332 111098 75791 -35663 55568 -106627 292582 214902 293581 -484148
15289 197035 137908 69709 -165204 -203125 -302064 45848 -38444 -58270 106002 -40128 81858
15277 -3244 -90186 -26648 47711 -92695 252781 -343637 121177 202083 325781 35859 -5689
15265 245723 112668 32986 -183171 54033 -106505 275740 -90410 39606 316651 272790
15255 272790 67772 -124924 637950 272736 152696 379288 1072048 1452814 940516 1197012
15245 1197012 1029233 418471 373844 137342 377485 284927 220334 69927 -157650 -10113
15234 -143878 114101 -61738 -44786 159915 -47644 175223 288099 231826 -151219 113735
15223 73354 -82295 55207 -37651 250863 -173367 9438 120356 -95799 128292 -154051 153579
15211 55773 96930 -423020 39263 38943 184829 270917 160033 -92939 -15821 391585 -415411
15199 -38509 194620 -122243 8478 186972 159274 207152 20136 -186825 131071 -100448 -334369
15188 -334369 62716 -30966 79744 66754 69753 -160325 -205014 41616 227445 64031 102730
15177 102730 -115292 95105 113989 47392 -146543 130637 -169418 122543 14680 334505
15167 334505 52127 -248696 30458 90125 196215 336035 387208 149572 111499 261329
15157 261329 -60934 105770 -6761 -32404 -118371 -184184 -216494 -112411 -46404 -68723 147403
15145 -104996 166573 -16729 62040 57294 -55705 59178 197261 162799 -70871 -24395 98423
15133 -158741 -50020 -145754 -199935 167254 129117 112109 247639 155912 151177 -10127 289028
15121 12474 -46435 236872 225159 169316 -43594 186143 91217 221152 520174 -103159 -86375
15110 -86375 -48734 123942 179590 147609 78724 165128 -48911 -78308 204453 142830 181869
15099 181869 -71400 217577 489422 116667 -158001 -87171 205837 64835 222007 75366
15088 -32192 -3423 -61839 237633 68576 -103791 235408 76927 12214 144227 112695 11643
15076 -9596 -10147 -40095 13885 56498 130450 142359 -166867 -9522 260883 459052 225012 167849
15064 167849 202007 79568 443447 -49276 91138 218209 211843 319150 -52022 -29566 429156
15052 244394 509501 169846 337221 -17211 316202 55756 -77736 4114 -27498 563776 59623
15040 25868 315046 -25680 2339 68896 231914 10931 465743 184182 -55367 118518 197968
15029 197968 94381 281708 226516 63458 75631 329694 105033 198768 304023 246984 -67819
15017 518069 222205 32198 20258 152569 449443 136694 34991 200568 -114511 -21648
15006 -106377 399182 171679 210051 302321 319070 19531 416428 -58347 295288 331806 230553
14995 230553 514720 276096 19859 140358 -169795 53184 -144400 40974 407990 273283
14985 273283 182574 349704 250418 -142808 279280 330089 295669 315831 125560 366945
14975 366945 -20385 86230 165193 240728 445982 229973 649920 231603 460776 40434
14964 41659 122369 613252 77194 407574 104495 85584 116885 122968 209670 302495 -98896
14952 233363 -26808 329012 380732 135269 359798 353980 195409 550876 151865 515202
14942 515202 353357 220966 355297 112496 17304 522002 182446 204784 75529 313036
14932 313036 175829 216389 143594 93564 239638 358842 -92495 205396 140926 547088
14922 547088 212882 744244 273952 587698 -55605 138520 -88296 465860 425607 289230
14912 289230 391977 326759 126616 482994 444015 437526 546554 295439 229993 604196
14902 604196 190135 545192 245440 506624 275076 110243 458451 364028 255035 411771
14892 411771 222741 413580 497111 192327 481279 271834 174240 395159 48880 259889
14882 259889 83427 203205 418090 214098 404117 634523 271374 30155 127433 214062
14872 214062 748682 151810 339855 409387 502087 481063 380273 595559 156098 427844
14862 427844 372771 531592 335781 55349 311957 435835 172663 128340 328594 693607
14852 693607 260298 122547 216052 286543 373881 621932 267596 266705 422812 276018 325579
14841 325579 286841 478160 594429 253392 338658 385802 499464 449291 382601 558144
14831 558144 798737 534760 583510 758022 512980 315564 357598 493172 749877 724831
14821 724831 455144 527241 207572 364527 405423 621637 265376 459433 589426 143452
14810 338792 355757 582491 502016 442422 731597 212252 444552 449440 465327 484567 569312
14799 569312 145979 353909 665227 752054 243517 101601 438215 61009 617884 206849
14788 548491 899763 500545 594365 617383 819014 246529 427846 482512 408525 686001
14778 686001 552206 260738 229165 763762 517988 670539 555723 416763 229984 727653
14768 727653 341097 73020 1017475 449426 489043 557233 891115 505602 497980 454178 738388
14757 738388 647928 729511 551701 584714 545254 643628 719113 639684 312816 395481 677050
14746 677050 445112 438113 724367 656997 816775 670079 609257 542634 577003 715222 500275
14735 500275 597849 655715 813005 844040 960803 708516 762697 504553 607263 906274
14725 906274 497434 835727 575547 935418 570625 940044 733677 659647 653496 409532
14715 409532 687710 554945 741390 645056 1147072 769501 801191 908769 827731 706584
14705 706584 730925 806350 760432 804810 1073214 951245 630986 826862 1018856 733181
14695 733181 886699 963903 786003 994358 1167493 552540 878834 621579 904722 720420
14685 720420 991265 703269 974463 1093203 1173054 996480 552419 849875 981393 1023210
14675 1023210 742415 987880 709079 1293493 657585 771670 984990 770012 1277264
14666 1277264 1116669 880346 948882 1023497 717816 983404 949966 1122280 894121 1152360
14656 1152360 845588 1009108 844993 906411 1029545 1063999 1226102 853194 806327 1058863
14646 1058863 1267836 931751 1256222 1141100 830898 1248365 1224031 1249009 1202728 1257326
14636 1257326 1585502 1156567 921956 1132984 1308565 1329094 1301420 1672143 1347299 1185792
14626 1185792 1119266 1300914 1410316 1143851 1379356 1158072 1198085 994233 1250313 1638438
14616 1638438 1696802 1331547 1133395 1489308 1364908 1487920 1496114 1484852 1481294 1491655 1554772
14605 1554772 1461811 1634068 1767551 1481317 1300890 1573717 1575473 1487031 1407848 1589334
14595 1589334 1498879 1703872 1543871 1752202 2283171 1246949 1888871 1775543 1564948
14586 1564948 1674932 1863631 1845679 1646262 1848609 1884051 1610627 1738664 1457103 1769334
14576 1769334 1767710 1942102 2047990 1813014 2129062 1953462 1894064 2380359 2180888 2293353
14566 2293353 2206275 2120495 2229137 2370858 2704743 2510882 2596672 2512091 2639176 2907579
14556 2907579 3120335 3255422 3448383 3759658 4046975 4356600 5737172 7653971 11864840
14547 11864840 21840184 37731560 40949576 20075347 9249353 4611034 2766334 2536448
14539 2536448 2011341 2164911 1845214 2088981 1910370 1982729 2111022 1954517 2001480 1947734
14529 1947734 1856462 1983178 2237291 2339988 2421793 2255079 2224970 2263422 2368808 2253849
14519 2253849 2351293 2408882 2369764 2198735 2517905 2224288 2500516 2634676 2849913 2435962
14509 2435962 2806219 2787953 2714786 2790803 2777433 2756679 3037141 2842303 2905996 2989569 2586572
14498 2586572 3014199 2916143 3083027 3062224 3119201 3378788 3066988 3067276 3493610 3343466
14488 3343466 3486817 3360095 3145627 3309479 3300109 3517522 3305830 3719252 3894373 3639616
14478 3639616 3471043 3765106 3617608 3986939 3933895 3766420 3862036 3743530 4036551 4181786
14468 4181786 4327142 4334717 4382844 4401815 4110638 4643591 4242211 4158059 4466175 4266231
14458 4266231 4673999 4835989 4696284 5125079 4486204 4727176 5076949 5098649 4796419 5086640
14448 5086640 4863271 5586684 5198872 5408957 5474183 5353884 5590255 5525357 5970197 5646417
14438 5646417 6106681 6162799 6105090 6047540 6044970 6353376 6417636 6497687 6516790 6966753 6616674
14427 6616674 7061307 6766285 7305421 7238328 7309368 7467053 7574207 7562704 7610698 7869416
14417 7869416 7756960 8226937 7783857 8251323 8100640 8270386 8580892 8488114 8713740 9159888
14407 9159888 9083636 8920900 9732817 9304296 9657918 10016358 10059488 9824537 10034998 10704802
14397 10704802 10640864 10841217 11169396 11072398 11425588 11739140 11765207 12013211 12247082 12428477
14387 12428477 12585632 13064532 13063593 12828377 13427919 13857587 14236887 14095599 14587480 14742533
14377 14742533 15244260 15349985 15674487 16132599 16202871 16732681 16803866 16908460 17650677 18043823
14367 18043823 18102009 18759863 18874029 19294628 20184597 20434577 20602044 21027728 21586959
14358 21586959 22342764 22568385 22906702 23707586 24097978 24682742 25224978 26283666 26743037
14349 26743037 27064119 27763606 28298081 29332213 29884953 30807287 31705742 32280272 33814374
14340 33814374 34182456 35088640 36192444 37425308 38061159 39744725 40862261 41954613
14332 41954613 43255521 44492437 46125041 47424919 48947829 50900671 52006647 53989938
14324 53989938 55764998 57859835 59820124 62180738 64270048 66592347 69022784 71841369
14316 71841369 74575547 77353017 80549842 83397624 86789608 90014690 94027218 98034305
14308 98034305 102471903 106770034 111319178 116296212 121396770 127109102 132976962 139220455
14300 139220455 145648555 153064099 160512611 168260275 176441187 184953351 194565784 204251554
14292 204251554 214652305 225611949 237364612 248975650 261581128 274680485 287893044
14285 287893044 301580156 315849741 329912000 344508668 358627431 373119878 386760109
14278 386760109 399804403 412269031 423252956 432964580 440504660 444605550 445028896 444406348
14270 444406348 442978135 440704438 437118833 432771936 427597114 417819385 406625390 393365381
14262 393365381 378784825 363561406 348584228 333188538 318075112 302742028 288321398
14255 288321398 274602411 261016696 248159081 235559357 224119254 212788825 201944698
14248 201944698 191897058 182375873 173313038 165244898 157899680 150100275 142851303 136123796
14240 136123796 130107104 124293897 119167342 114233150 108896611 104319775 100047326 95793734
14232 95793734 92172752 88676316 85193791 81900462 78488325 75905729 72467831 70252384
14224 70252384 67463965 65057856 62838501 60504526 58889089 56885727 54913808 53171959
14216 53171959 51414844 49895833 48510427 47247905 45656781 44009754 42703509 41547771
14208 41547771 40663881 40056774 38587154 37538390 36067400 35604151 34554022 34123435 32747078
14199 32747078 32174144 31300990 30354680 29553554 28464282 28166589 27369284 26617243 25930474
14190 25930474 25397123 24748760 24237569 23813283 22910635 22604918 22068466 21700467 20984796
14181 20984796 21040618 20220776 19386071 19614556 19221313 18605279 18338076 17764482 17330247
14172 17330247 17003634 16888011 16408571 16074303 15947873 15390198 15030533 14858659 14751787
14163 14751787 14627366 14066280 13621618 13848502 13479559 13153526 12753579 12607375 12799195
14154 12799195 12405428 12210883 11760827 11536185 11581618 11254391 11160281 11294080 11211949 10618715
14144 10618715 10346735 10106779 10414647 10261916 9973085 9798548 9677172 9332063 9309567
14135 9309567 9146152 8919372 8762764 8591255 8890524 8496239 8439023 8047060 7909969 7880319
14125 7880319 8010890 7815545 7709827 7723805 8066409 7567810 7359194 7004890 7319890 7148676
14115 7148676 7174067 6982776 6816427 6586930 6440274 6279187 6563598 6484776 6571453 6177699
14105 6177699 5916368 6207346 5826200 6270928 5762526 5933767 5756582 5641326 5617086 5428328
14095 5428328 5785078 5376528 5438195 5233025 5287925 5243136 5060942 5346403 4942871 4960740
14085 4960740 4611677 4980614 4984408 4541526 5084181 4757626 4689316 4638317 4479402 4422748
14075 4422748 4461890 4506476 4076129 4285671 4301957 4134004 4305305 4062538 3901650 3953378
14065 3953378 4116226 4135317 3679275 4044334 4131574 4133879 3989000 3959625 4153110 3955813
14055 3955813 3857184 3468862 3681048 3732030 3680964 3463735 3213074 3414391 3203179 3282314
14045 3282314 3292329 3214878 2781057 3250221 2841570 3047351 3026726 3082372 2904077 3131250
14035 3131250 3012595 3236286 2844784 2927791 3020642 3162743 2917543 3160721 2676356 2751787
14025 2751787 2497844 2733887 2521381 2580350 2586172 2258771 2584435 2523002 2272893 2402700
14015 2402700 2695113 2349988 2105203 2400654 2438736 2396445 2545018 2344180 2028719 2202017
14005 2202017 2063410 2073280 1689807 2162487 2463328 1951016 2213511 2378353 2184336 2506190
13995 2506190 1945080 2024074 2217736 2229121 2108089 2726708 3709736 7115765 14964912
13986 14964912 31750476 41976188 23302058 12991449 7810024 5568778 4475485
13979 4475485 3855445 3530748 3370365 3266135 2386814 2574133 2689558 2736462 2427022 2426146
13969 2426146 2259520 2659333 2527554 2192999 2405404 1912500 2166229 2103162 2132986 2114090
13959 2114090 1873067 2143025 2015155 1956698 1767661 1807028 1822865 1856495 1932630 2000372
13949 2000372 1998392 1934966 1360813 1792125 1836028 1832408 1585299 1807430 1830477 1665031 1651352
13938 1651352 1791475 1707660 1866070 1535406 1687299 1449452 1688523 1580570 1874762 1500381
13928 1500381 1661837 1387472 1788121 1467552 1055912 1745888 1390876 1710918 1667788 1778959
13918 1778959 1498019 1576289 1535580 1530249 1702890 1170361 1297810 1408040 1016485 1403555
13908 1403555 1677423 1545523 1472135 988034 1298497 1545698 1295368 1335334 1355883 1380766
13898 1380766 877918 1370528 1324915 1319875 1140854 1331320 1147182 1388797 1279229 1310412
13888 1310412 971741 1243207 1327401 872598 1184875 1200019 1337786 1289624 997569 1254797
13878 1254797 1390406 1016178 1556662 1389541 1097699 955296 903576 1205283 1050168 1197885
13868 1197885 1062335 917767 1373788 776328 1102380 1119401 1149355 923186 684560 965297
13858 965297 1088026 935892 912953 1027213 1097413 1086400 931292 1038855 1188801 887714
13848 887714 852200 715859 910100 841561 844640 899758 1003547 1032370 1145476 1219356 926263
13837 926263 884011 998502 782101 825689 781457 980104 1232400 721497 535830 722789
13827 722789 982057 1108289 907614 1125353 706942 817000 931613 726197 834409 853770
13817 853770 705565 842519 631432 744952 645012 869493 713760 956094 752975 419230
13807 419230 670347 716642 965209 1067220 1018463 904082 526523 821764 871637 756233
13797 756233 847765 494258 830329 897253 725709 923447 706897 470794 954799 826932
13787 826932 888026 575387 820719 615271 615230 549872 1072325 774928 411218 651159 549444
13776 549444 894932 585083 819942 594332 661292 843110 825155 809071 592249 669380
13766 669380 662874 560294 694950 499174 591361 1066839 642463 759152 563358 460428
13756 460428 924311 652453 667481 729545 446788 953235 656793 572719 541677 694512
13746 694512 803479 503586 793660 683487 978776 835453 318784 910196 910705 579558
13736 579558 753401 751765 425702 809456 570744 575973 120427 420283 410422 760377 270676
13724 418579 761984 301466 374759 528827 542443 484822 455026 576746 651073 401364
13714 401364 577277 442764 671876 373232 782528 427424 216803 456978 535428 704531
13704 704531 513117 466029 670905 717634 589679 501296 366387 466351 351014 363843
13694 363843 445937 340850 677700 450794 351958 490339 563867 568126 559766 651174 376621
13683 376621 409313 353423 118863 253683 689503 285795 586558 560872 280494 638133
13673 638133 877986 564783 321129 432251 358399 373665 570802 626910 252643 223214
13663 223214 468973 400434 476595 222590 702039 390954 587103 428008 220606 470122
13653 470122 691790 355429 129398 158028 456511 511546 270688 365577 180300 481210
13643 481210 198115 414519 289919 646583 313778 261978 280533 528718 708518 185718
13632 581658 557017 379959 170950 619220 595566 177081 140186 324521 454929 54454
13621 331443 302468 242309 367428 615887 629107 715357 211573 -45 255996 227647 230165
13610 230165 161180 609788 393832 253050 219915 414225 396220 118295 495359 135763
13599 357950 465963 267276 332577 515946 399801 256861 104853 445723 182363 364033
13589 364033 7160 390729 358077 92660 430436 253572 312483 183726 520932 414268
13579 414268 267633 84451 457867 287412 319749 217938 243560 299958 172824 352946
13569 352946 59711 410045 392233 408289 235666 253090 344066 130780 25324 72876 377955
13558 377955 458644 588146 190991 43474 -30312 430159 407687 312985 386727 332166 400283
13547 400283 337798 320743 382143 489468 -49651 49589 276488 445085 269798 450709
13537 450709 322690 269091 382304 478513 242609 394872 534101 288829 456304 577105
13527 577105 93704 -14326 131847 186354 125683 188275 474946 210909 110831 128003 477564
13516 477564 292386 226957 249570 278778 134037 37087 176316 195079 333981 28788 -44529
13504 193760 165795 138640 215729 226494 -9917 284029 -11140 224896 -186846 77158 23773
13492 229084 351450 261668 307194 266296 515441 369023 158119 331740 333341 242189 -12982
13480 484083 306809 291267 218659 451698 67986 111198 231146 210351 95404 193689 194530
13469 194530 -88614 49927 264844 424311 186696 148159 256395 618265 241855 284727
13459 284727 489762 323546 155140 195003 20943 233929 -6486 507415 247119 118662
13448 60791 168853 -30327 105973 202563 284325 -44607 381947 288334 150106 169021 165307
13437 165307 209522 60282 316609 443767 -192909 383781 95656 47201 278524 179865
13427 179865 213595 246814 317138 -95001 177344 244068 -124386 326221 309106 368614 326379
13416 326379 418596 112061 110638 129219 104823 33991 332774 351568 325722 241079 -2502
13404 215333 48250 399985 301120 463643 61581 341107 307707 309995 508908 231256 231654
13393 231654 -162187 474214 190751 124135 179851 6006 -155743 141070 195880 133022 60314
13381 137480 48849 299510 217285 414169 93858 206007 16804 257749 118330 159783
13371 159783 486954 176333 488992 382091 374536 129242 397680 51512 219397 488114
13361 488114 303296 143554 114309 173818 318032 210503 113414 162763 448582 226490
13351 226490 64200 -96729 104104 146453 305181 273803 246750 182389 370513 179729 617241
13340 617241 208496 272956 348857 317721 -300060 204815 325928 246505 173307 339039
13330 339039 257470 82197 -77146 11344 339483 222033 492563 -40045 60293 44716 301385
13319 301385 61553 168909 -21815 300046 246659 153689 337981 202897 315413 156587
13308 88064 -105140 204571 374453 -31585 52476 -176188 52875 181490 -154647 369852
13297 -160638 188657 289340 72341 -213148 169853 306639 293036 476506 -167545 150467
13286 39182 102297 228792 132241 209613 167347 577551 128356 32743 406079 -46018 311293
13274 273442 131163 -85245 411950 37612 298499 -119026 214070 110801 -36078 -79109
13264 -79109 107674 149477 263891 97821 358255 119127 61677 -37629 207297 -73311 143970
13252 67229 93853 268963 -9201 352649 -56544 437808 224945 58992 -67387 124127 206044
13241 206044 430936 -35202 138340 -191775 10110 336815 286346 525948 -115063 -164639
13231 -164639 3358 114796 -29589 -70107 268955 -13843 488741 -6999 108931 212712 43505
13219 244831 -133765 21831 145785 31904 135815 382887 -52067 -34002 117062 83522
13209 83522 -70260 217719 62902 168103 -39327 50842 -1847 187324 115142 -20207 -96171
13198 -96171 149120 -132148 147605 254202 -51791 145664 -105849 115182 209126 245218
13188 245218 39424 404689 -87548 148361 289038 44505 191437 -85411 47754 -167478
13177 264785 -94705 16779 19905 247497 397122 97437 279237 114559 231252 116032
13167 116032 -233812 165672 160604 -150483 61238 39597 -16377 -43237 279584 -264195 -118170
13155 116574 479631 174182 141242 -31555 -53313 131757 179163 -80637 38798 471260 -25344
13143 157694 45601 20951 -77460 265979 353381 212726 77313 -28649 100727 -14366 365349
13131 118937 122696 260164 -181399 296593 12973 -135089 23694 10787 -114066 112180
13120 152185 299119 176634 50264 203990 -82072 400712 40169 -239341 349020 -56908
13109 -118831 125170 21206 -45614 81720 -106790 260986 351983 -366680 101934 -50380
13098 -143902 -259597 109716 -165150 64931 229330 104820 -3927 216861 459370 280901
13088 280901 92222 191571 -19853 143428 296522 -224749 -70368 204247 273134 -222063
13077 -100722 -229355 241380 256933 279952 -108527 149814 92338 144693 234263 -112427
13066 -13077 180522 173344 -14896 432175 85783 -433892 63776 248626 266568 47578 264811
13055 264811 76526 -182610 31576 130382 -79233 195477 146946 -33602 144953 -123606 231339
13043 232329 276845 -120176 219963 -80538 -27535 460444 419804 229632 -276671 81708
13032 -397636 -197364 142475 116376 -36827 64252 194442 400130 161386 297861 173712
13022 173712 -118282 -12737 222552 187446 -46745 347958 -44168 28521 186251 181733 -17598
13010 -153631 134167 241465 244562 276869 91414 -376425 -30994 12189 383459 -26402 8874
12998 387589 251313 56512 128227 414099 -40856 23230 -64692 -11340 140966 97980 257100
12987 257100 54992 146324 283166 73557 -207431 -17922 -97334 -108156 -101779 232405 300288
12976 300288 334832 446256 -210498 145918 -16428 -59922 -45842 50512 107879 -131134 111091
12964 -43620 69072 45510 383961 77120 -75460 -29199 -51154 -36189 228611 -25109 25988
12952 115030 97222 99040 77520 -22688 146166 20481 -38938 45887 -92525 88597 195397
12941 195397 -15598 -58115 -304262 272984 -458161 69662 169115 -59074 89556 148597 14565
12929 150384 188759 131532 603003 -87173 176383 -54957 11877 -19841 -24618 -244822 163556
12917 -178467 172115 -63670 -201133 -194438 -202835 228258 237494 -92105 183517 209217 -186000
12905 93488 -98456 -66831 57711 161790 153585 129552 252174 -163014 70308 215728 63732
12893 -160699 8351 206643 93346 -302759 154888 198253 78683 18904 385335 -125495 87596
12881 24963 -224125 -93848 -81833 -71515 201352 35653 288604 -89695 174840 -104203 151691
12869 -192815 -29283 268873 222538 -203999 -132108 -478311 151592 167949 113766 -118830
12858 -257173 109249 -76027 -113229 140763 143665 91412 -313751 -94693 65848 22258 152277
12847 152277 11123 -18504 152899 372244 -58691 -197422 12199 176654 55341 -52297 -159549
12836 -159549 132423 62105 145585 -25430 111905 52199 142857 -357225 91790 161940 -134928
12824 -189272 255754 213640 -91846 33593 -143240 -26554 -71605 70097 -78394 143178 -157791
12812 97185 312973 -121728 223708 -247498 212503 -2551 108855 92433 -319858 -299694
12802 -299694 -105802 -87222 -30347 -3463 229331 -138886 -195364 128462 35631 -216025 101900
12790 171310 99477 -329972 -205001 157863 -28272 174237 -244968 -478746 -141727 -76510
12780 -76510 39382 -104483 -272605 -117371 6332 -677 76540 -76472 216415 -144083 -78639
12769 -78639 -186749 -57967 25630 -315944 63816 -237461 18515 78135 223271 278806 32264
12757 -154593 137850 -69339 139314 203321 26740 102711 11559 304889 -155461 -14249 -65339
12746 -65339 50385 -62261 230048 -77790 159820 37202 156020 305654 55949 163502 184674
12735 184674 320137 184171 -68861 -172605 -96061 236617 -94083 -90517 -11825 -26610 303143
12723 19127 113009 110788 183784 191702 -58034 38393 137514 67209 53934 121756 325393 327213
12711 327213 63237 243672 118456 263510 -45144 113800 255964 177797 76983 160771
12701 160771 5441 292971 165309 -318889 -30158 -136609 105212 -397672 -50074 352408
12690 214944 193986 -99428 206737 42379 -55715 15944 220370 108942 84644 101522 188651
12679 188651 135677 39501 -67584 266906 343843 -109088 132003 25086 -195256 -6059 124404
12667 -51123 -378845 104932 261839 261818 117114 62498 184086 292738 -194535 80010 130960
12656 130960 343608 245339 369592 -227086 -16659 287193 604489 131135 171405 97680
12646 97680 197684 -47853 200158 89582 -171699 79221 116800 217431 6675 -232671 -115789
12634 54774 241712 131888 196666 338982 37623 92226 68716 -110487 306633 70915 -86300
12622 -76688 226355 4990 -5433 135219 49489 -208787 -136698 234652 116999 281426 305045
12611 305045 -24789 -124068 82063 31364 112026 39321 -30323 -65577 -23433 30911 357540
12600 357540 142748 331176 160893 163353 87927 -152846 245361 100053 236040 36672
12589 226672 33595 80013 66920 -1625 -169479 84116 -293700 149986 90898 -333237 75598
12577 -104665 -394245 131261 -25746 -68976 -129769 -116073 -145042 49649 -284055 103230 121365
12566 121365 260791 -203886 -184856 -384263 -673 202154 63247 102138 -100442 91186 214765
12555 214765 -209766 107980 188149 -18500 188858 -79213 381084 -286434 174901 66280
12544 4523 182342 -58271 262728 63816 -86761 -90045 -1942 -186847 -277531 249547 -132881
12532 242517 -369032 182613 11122 69589 79932 -133110 -95425 157892 -4812 -115616 8247
12520 52869 137217 -46313 -83909 -159791 -220382 339415 -247320 -130782 109556 94108 111410
12509 111410 63734 77117 88563 97106 -52876 12984 133355 -82893 355128 128249 -237327
12497 -4551 308521 -194931 -89973 -52245 -54542 -85308 58979 178027 237606 -142515 161910
12485 81700 -516 108540 477814 -179668 50429 53546 160831 179468 101904 247682 276260
12474 276260 24051 -341722 109671 172203 -17334 250868 275511 124955 118010 103057 -241836
12462 81153 54998 -334906 102107 828 25666 125150 -34834 93046 -216264 -17676 -100771
12451 -100771 216502 145843 124623 -160322 -52714 131936 130671 300924 16305 -168146 22318
12439 266662 -107356 191578 60954 165447 14774 11700 174597 -109135 -10174 -129112
12429 -129112 -348839 -73757 -36546 -534192 194164 -69821 18078 48892 72073 -228650 15276
12417 7445 -132176 411843 11426 104197 -13702 15312 98092 -56612 -164136 -72875 -63579
12406 -63579 42086 187641 -44253 257149 220221 -271898 133179 -119015 15547 253714
12396 253714 -3883 -156114 -90165 123858 50493 57812 -30848 -318357 -202872 -249342 -76255
12384 206162 101232 4195 -21171 -135234 194537 337580 291465 87449 -128852 -171596 50778
12372 67796 193690 136967 182502 -41850 -26933 -28876 272047 173666 -249092 -145380 149752
12360 -127678 -121475 -14770 -40789 -252925 -2452 -56165 44708 207450 251575 192788 216890
12349 216890 156765 154856 55180 62333 11472 -103227 -14652 57022 -142845 -34157 116215
12337 79147 -25045 147354 62691 33849 -191343 131998 185214 -55022 -68728 -342766 113408
12325 -34959 -43344 -61831 -21361 56683 -84768 -46162 238040 247029 -52032 326738 265583 -179502
12312 -139201 -12367 11571 -43691 -40007 155931 -102254 -137366 137801 -209716 15140 107027
12301 107027 -1913 -86880 -54898 -145948 288586 81234 59355 -210343 47760 111070 347747
12290 347747 -12010 102726 196492 -31182 174198 81876 138659 5166 -56799 220680 126000
12279 126000 -105221 84927 380834 -357840 34639 39628 193654 293449 270303 -126115 166623
12267 -196253 381624 202433 126490 100190 279431 200645 -162769 104363 300424 -9226
12256 323776 -268364 -48661 31801 -30186 -19924 122857 15718 -269368 125715 102712 92395
12245 92395 126128 113568 156157 209244 72920 -236773 359618 -43056 316467 266591 68444
12233 61402 264270 -91736 -13667 112819 -141452 350041 230076 411429 297677 4299
12222 320708 -74766 -95432 309298 107466 299069 247596 66710 70996 164302 145771 -147900
12210 26794 180761 462855 104488 217375 324940 -33577 395153 272757 -22633 140902
12199 269182 425539 369154 351184 -173336 537749 120280 59829 346048 51405 501006
12189 501006 -19003 -97470 -13416 -45537 16097 323236 -254040 89753 -114269 -170136 16885
12177 -111429 72058 52500 -45426 134874 558275 -11890 -190344 -10937 143421 -149060
12166 22434 -146311 -89658 66422 -124254 122639 143967 123600 73453 117136 109248 -115861
12154 2661 -101212 116412 228594 259941 -33294 27124 -225907 314739 16608 238235 76818
12142 -23726 -149457 174267 -128767 -136520 242540 113896 154262 12236 81960 203699 -151741
12130 113502 20398 331570 172672 127815 -159961 -163429 64013 -33208 -3281 17826 112189
12119 112189 -258579 -162422 411 -103096 231346 -69629 286332 -4144 -162465 60673 2235
12107 -8895 -80367 127423 -111937 203114 -320384 -399271 375755 98178 146310 87584 -92943
12095 185744 57612 -370600 -287710 44275 -217656 -182506 194994 -300586 171974 -563727
12084 -132137 -20398 200134 57274 242701 -36461 32942 196525 443278 973507 1916831
12074 1916831 889130 375419 -22552 201620 -137858 -125312 -243279 -75237 78446 -229754
12063 -35772 -154334 -137 -236014 -295428 133621 -341565 -237774 -168787 -116306 132566 265606
12052 265606 -122314 -140679 -75085 -240841 53796 145282 28556 -196492 -86674 -178933 155288
12040 -134562 -164909 -106421 -275628 -11517 -61106 14190 -120074 -5116 47714 62966 66001
12029 66001 42810 154979 32249 147055 -260222 45088 75037 -26752 702 387061 -59881
12017 -252619 -103713 48355 22686 32658 -536 225537 21702 -312029 39538 -60947 -359847
12006 -359847 -178828 65063 -28013 254960 -158875 104157 35933 108619 164359 -292090
11995 -232510 -126425 -163389 230154 106826 -133508 183354 -15688 -94959 -138813 15098
11984 -43459 -60008 -95897 4125 -166080 60189 26751 322975 222861 242931 -92431 285281
11972 146464 -23516 69241 95195 13162 -120926 -65184 -156471 -17807 172376 362420 121994
11960 334295 157801 -107844 -222161 -286590 -139043 267396 -405212 90643 121869 -97677
11949 235881 -363440 57826 -82293 -121777 -44357 -221861 -240771 45184 -22166 395790 -272615
11937 3972 123538 -25718 183372 62753 129021 -27892 -32692 67532 266024 93055 265014
11926 265014 -147375 -127528 141728 12104 -171956 -33596 372105 -127122 26653 85876
11916 85876 -39573 174548 -29971 -131483 12475 10008 -70568 246820 -184870 -38964 -153150
11905 -153150 -153068 -58789 32631 -99120 41418 209746 -48038 -161025 60718 55648 -155450 -123870
11893 -123870 -4274 -290010 -101083 -13586 320912 226614 -129624 233757 -120459 179846
11882 -24004 -49424 -351008 -166522 -224514 -59747 63775 173788 -57960 -221341 147229 62034
11870 172049 -65259 -343970 -142751 15741 29801 163618 253763 -153253 -104318 80519 37609
11858 -114044 -179420 -48514 117232 -114698 -264688 -85615 -156364 -118332 73067 -89311 -172241
11847 -172241 252031 137992 -19507 148021 163267 -79790 112608 23840 -75946 -67805 -13539
11835 23087 10359 46515 6241 -359455 -129051 -64727 -44810 234484 -237459 19121 -43707
11823 157289 6420 33090 16757 112423 -80417 -62128 -155414 119638 65504 76054 -97814
11811 195374 -147640 -10621 70676 -219110 -203240 -76932 -98508 -113647 29608 48566 219684
11800 219684 163474 -50978 -14964 105447 -461601 -205042 -161611 100519 277047 -91043
11789 -78150 12783 -91590 23977 -239878 174589 -212459 -3776 95980 -5645 43578 111172
11778 111172 -150403 -191028 112344 -140983 130290 -310992 -32468 18097 102051 -319273
11767 53027 123594 -4744 -157228 -211220 -172327 -56311 30605 -80995 190005 -390805 -23252
11755 -300064 120397 -91805 -381293 144671 -34297 19884 -102984 -12091 -227544 -80369
11744 26672 -33819 -182359 197587 103871 -443232 -88410 210301 361888 -330746 111278
11733 140328 75171 280450 355484 -225106 -1738 211299 320305 -83920 -49317 -78651 24827
11721 43658 252686 -129549 96314 125608 -161659 -168124 -7757 80693 83708 -128006 -179294
11710 -179294 232396 240228 27920 -57915 -113036 309918 56166 73879 235467 193919 -170461
11698 136371 -199967 -11064 85515 -497807 218969 -151550 16415 14079 -210846 161073
11687 167901 -75978 -68540 -103921 45549 8694 -130604 87599 93915 321277 223357 319464 173745
11675 173745 125010 218263 -11089 -114536 181024 -1595 -135760 -30545 -254297 182423 42523
11663 135396 -43721 -40695 89275 -20631 257945 262952 -86204 358933 161714 -250100 29524
11651 145038 53746 146570 117655 -113452 236379 49259 -102143 -187061 -25688 271888 213959
11640 213959 227004 -35161 47631 -291715 175933 -17311 -154412 -86701 76849 -43339 307488
11628 289288 171301 85456 273336 432125 228737 -170026 -255546 -302152 15236 53248
11618 53248 272748 -108959 -174774 74883 375519 11307 -138785 -101881 343539 -138983
11607 -292070 -161964 -13208 -60772 -28073 75501 122245 193731 241850 93699 -212954 217214
11595 54827 -5444 -85315 69328 -78726 133904 -60805 -28621 179145 162046 243610 126093
11584 126093 47178 -28234 -24028 -71312 16199 168158 313608 82622 378219 25489 -137283
11572 38926 119106 164058 38272 -8051 15640 20071 198730 -49830 -20306 107621 -181022
11560 131173 202585 289261 149432 16179 278091 -108870 -291699 129746 -284107 89814
11549 310817 -179748 -340369 -190490 113137 -96950 -89436 321996 62291 372730 58312
11538 -127350 153263 -92520 88872 194158 12453 89929 -177657 38371 -77980 482250 129996
11526 1160 110474 73851 111363 55768 475527 170006 33039 169448 -75449 39202 59063
11515 59063 -107983 -45252 11954 53168 179619 449238 -44153 216707 22689 279274 -15406
11503 64075 -247490 134526 107366 -18744 -16634 297508 5529 16003 149443 49835 280576
11492 280576 147688 -52951 45271 -1397 392834 244109 79309 28830 7072 280084 -67474
11480 135352 32013 169291 -31749 374882 437325 221314 36945 356242 167726 464131
11470 464131 167079 13482 -172185 7830 468325 91864 -60179 302126 176522 -36961 305572
11458 -177070 -80320 -115311 11626 -87286 157457 137105 -44208 87943 -97503 32116 82872
11447 82872 156627 -21335 328297 -106754 -127155 256144 312221 -90513 -262613 -44324 11877
11435 60516 251242 152133 111227 23128 78470 8985 65839 468898 199712 -238528 208981
11423 -18669 -144751 -80193 -98946 63658 156136 -121638 -119625 -221716 134081 215080 86985
11411 67362 179694 -51734 -119884 -135912 43599 -240021 15561 -11656 -199917 317272 120269
11399 7229 -25454 -33718 99625 174452 8212 315901 129959 327451 -99003 442223 134817
11387 -336383 179213 -8301 -6170 -128555 78562 -175418 114612 97811 192001 135936 63969
11375 104754 -177588 156534 138555 -62900 73512 -130809 -163388 107820 -85354 -100892 -56849
11364 -56849 93782 228234 93256 -250164 -258578 203630 149344 -92809 -334974 79817 115459
11353 115459 77052 -106224 310278 -30332 203172 -18729 -91936 140272 -135670 42564
11342 114419 -27798 -153756 118515 -38552 -68947 221746 74592 -56349 107656 -122713
11331 137095 25169 -228030 73227 -194271 -98524 129065 -111225 -157791 -9019 -251790 175232
11319 119365 -125466 -105375 -79970 300328 156674 148330 23029 -31471 12429 228373 -215309
11307 151252 39280 -263207 -303051 69461 -43837 -182615 -103246 90943 97394 135893 -58382
11295 242448 -196143 86674 44500 -51476 -115148 -90961 -119672 -6437 -42923 -201437 -342850
11284 -342850 137188 16393 27862 -21608 186215 1654 -64683 59360 166225 20664 25925
11273 25925 236536 94545 -181975 -58933 217516 -81428 242183 -214092 107531 -132685
11262 -125198 -14334 -94291 -77681 234117 -224314 108733 68536 -52328 77783 -9676 -2534
11250 196646 61875 -300686 -62805 -270316 31182 -131838 195438 45595 274318 166945
11240 166945 -221524 216329 -114390 21483 -337423 4335 55805 39185 -88282 223455 317650
11229 317650 -264451 -148218 66693 -49435 177292 -323633 50995 275138 -101212 -310588
11219 -310588 123001 -368311 -20749 -107153 87213 -18245 383942 34571 -206136 5716 -210004
11207 -154344 -288782 11045 134817 69706 199796 -269992 -16953 104681 -403236 221235
11196 -72352 43099 108030 -115100 312966 66125 -115066 -19971 -195031 -227663 -79058 52217
11184 -92668 -339642 55959 -303692 170525 114950 -9179 -153883 -48722 -7258 -35544 68690
11172 -32067 -220059 -134134 -184665 356879 7285 -274675 120682 -219642 5175 -231683 93108
11160 -18260 63674 -153763 -139785 129630 -88962 68090 231582 -293292 51360 -82226 -27572
11148 -48243 51603 -20234 34643 224105 31370 -296194 32405 -31069 -258461 -88029 -58443
11137 -58443 -158292 -173676 171336 -165229 -205737 100522 58365 -24376 -170522 -260752 -80193
11125 75874 -98154 52669 254733 108855 110570 -11181 -242502 -22957 -141870 56931 83766
11114 83766 -29018 18196 354065 -224431 -204373 130828 42998 72318 424073 339948 11842
11102 217146 76845 60109 266641 167949 236853 282996 38924 116769 63054 97412 193753
11091 193753 192077 14188 119962 258279 164365 -72216 44463 371304 63875 336146 501740
11080 501740 -33415 -37569 83710 322808 456188 152700 442399 250317 333820 408050 50782
11068 509542 252708 501049 234589 396169 292745 486565 455763 242875 471064 358086
11058 358086 465161 276550 466004 402570 269906 483972 826564 194541 403538 867580
11048 867580 904865 555573 603781 819937 548842 581952 939377 537550 600766 907991
11038 907991 688906 633521 487477 600031 597252 706718 677409 676849 1060209 807755 558019
11027 558019 1074983 676193 861635 517322 448738 548603 355034 774604 571993 576829
11017 576829 315025 585909 599167 517521 758609 454170 688646 574346 617702 612646
11007 612646 596758 135230 820220 534760 843964 609818 784314 749743 830581 639979
10997 639979 572153 364319 798421 900465 657775 794493 728941 1018848 720054 954717
10987 954717 744717 961795 640955 894790 741615 848540 1275444 1477623 1142540 1504380
10977 1504380 1614689 1727381 2322013 2258189 2619003 2707541 2714899 2810042 2693251 2541285
10967 2541285 2479800 2017939 1559195 1783324 1919492 1710644 1806542 1621258 1971055 1798589
10957 1798589 1679152 1730922 2019840 1915116 1542696 991057 1035396 912449 940213 872549
10947 872549 653534 382361 318094 242111 466861 220539 194003 -26948 163592 337869
10937 337869 29494 98956 178176 195979 165780 543382 85623 -60764 295279 -326188 124271
10925 287074 309346 35400 -24185 -6294 -74209 252406 -220533 -25140 5625 210962 -73302
10913 -136132 -117318 -97579 295734 -276680 -25771 -9934 -47142 141227 -231630 207711 -53278
10901 -101488 -68710 86347 -45562 -60264 -171763 267980 69244 -23683 -275062 120270 202073
10890 202073 -23216 -213755 20752 283076 52892 30113 33303 -325499 258362 -90938 -35073
10878 -46040 67518 -65939 46369 246717 31934 -278840 29711 -3418 145219 -48162 125793
10866 87934 -131767 25624 -72386 -170563 -143410 185847 -155585 111078 -120207 -267371
10856 -267371 261886 -114483 84324 102563 -207723 -5910 70054 -388717 300275 -29142 142989
10844 39435 -47847 -334491 -157768 112069 -144079 110366 429977 -85332 -241479 -8552
10833 271997 -137906 83174 -149602 55924 2991 -80314 81999 59488 103269 -212277 -130697
10822 -130697 -59540 256963 -61278 -192623 -126418 -42087 -158980 -88229 22205 236576 -65594
10810 -131004 -254172 -177221 35298 -125893 -10847 -112273 -2482 199246 -161118 -77525 -84954
10799 -84954 133180 416185 -352393 69666 -89346 -115091 112120 -151261 -24789 -163167
10789 -163167 -35462 -195403 38806 102428 117486 -276947 152504 43371 -144308 -36005 -83832
10778 -83832 -162860 169148 -118749 213686 5132 -89759 14316 155297 -175564 247231 85618
10766 -271796 -173058 77331 148535 -42714 -228674 -57695 6245 407542 -208307 -19781 158939
10754 -142022 -196952 -121359 69555 -82615 5035 106810 62595 -137028 141883 34285 -71931
10742 -321160 7322 -232986 -14236 -4977 -159915 48466 74417 -174994 -115068 -108331 116766
10730 26290 55910 -65787 23298 -131978 -21833 177094 188454 -98663 99549 -32110 -252961
10719 -252961 -86616 40899 119462 -211903 -255031 113486 -121890 -100929 187311 78865 -83964
10707 127844 -212416 -136199 116370 -159421 -83418 252172 178705 65894 -125603 -147595
10697 -147595 -18666 21634 183825 -12517 221085 842 -120929 108995 1520 299453 -83379
10685 -360814 -269015 -321898 31746 -232573 15153 86062 -49024 122133 -28237 -109708 -131536
10674 -131536 93513 272232 -1912 -200962 201301 24012 158337 468333 -156185 -268301
10664 -268301 -102101 47766 169821 3440 -320958 51841 -110098 -134998 57946 147493 -113910
10652 199300 97827 -8482 171856 -46039 -199773 -70747 -141230 -55577 -27582 -153618 28477
10640 -332878 -36232 -205895 -83158 -11559 -253215 -98603 -184323 -48920 -303922 80667 -72055
10628 -23864 -144113 -110531 -236462 -182089 -328015 40474 -73928 -407966 -112383 -165637 -45008
10616 60222 -1012 -348620 469 223046 78796 197430 23127 48646 22904 -218512 -362183
10605 -362183 -210641 43140 109666 -29770 -275153 29301 -178633 62819 187365 -43592 -185047
10594 -185047 42025 40120 371659 105860 -109458 -103231 -99130 -195739 8437 -264185 -43146
10582 -17411 223821 -40956 89330 -286979 -329933 -26024 -422993 -111289 -68345 86692 123599
10571 123599 176038 200391 -80280 -102862 181697 69283 -4628 -87582 97413 -22474 91084
10559 4705 -163784 -1618 -321423 180666 -195662 33599 -108821 27164 -175469 206894 -248895
10547 265362 -220407 -266490 79631 -188984 310764 135397 171211 89439 -154781 80215
10536 12897 4951 35833 191413 338842 -35332 -12902 -126369 -33717 159638 -155754 59977
10524 35929 57097 87720 130182 248478 -26089 -153593 -78525 -199638 -171582 -90943 79439
10512 -110732 -109601 -123653 -303345 -73599 -23101 43340 198596 -248649 -375571 -20286 -1259
10500 113408 -257480 -90810 -201447 85653 -201511 -200559 23951 -78424 293864 123158 -208039
10488 -455725 202460 -194120 278321 116720 292260 146317 147682 554907 629622 527401
10478 527401 59933 390829 291394 -98122 7256 10043 -22406 231061 202976 -26605 -88133
10467 -88133 102836 115992 45548 145724 7853 -18280 -6699 -87198 -103895 139448 -318902
10455 84276 -1309 282657 -231309 -176849 229653 264985 -78328 124103 -87477 -292230 170714
10443 -274644 -42456 227018 331427 228482 -37029 -275804 -196325 -7050 -231865 -39509 -306283
10432 -306283 -163218 -96427 -310116 -188747 166055 33690 -144992 -447030 -341725 -95025
10421 -88853 -137710 217507 15342 -101127 211296 84352 232970 -309094 18332 -158452
10410 4661 20734 118298 -262390 -89616 5697 62851 102747 154642 199094 82988 -29661 -104098
10398 -104098 23719 327171 38332 77579 149463 265258 217831 406187 -2469 -61559 168743
10386 118184 127909 10507 -8537 63969 203911 -106530 85224 -90135 143457 66052 248624
10375 248624 275105 -68117 90294 -48118 355152 31450 254387 451262 400890 685810 461800
10364 461800 182874 222402 422180 468560 -80946 146998 278850 45372 273583 423573
10354 423573 258110 -42989 295367 375089 662993 631251 169024 305806 227270 213630
10344 213630 449625 489340 418349 38503 162733 34429 333409 430426 80945 187313 81688
10332 97936 105720 -65436 -119314 203829 471609 245076 103044 84257 259860 371050 93281
10320 444577 358543 9318 27016 93801 318110 -13173 -61059 -156880 -15726 80382 -165479
10308 -148153 65984 41108 17895 151829 -326282 376264 146535 -31332 184832 -190455
10297 -212526 -105221 -215804 -30039 -67424 410265 -136089 190679 -216392 -128440 -199775
10287 -199775 -302500 140595 -271677 344673 -3807 -189552 -307551 -272149 -20456 16723
10276 -115580 151364 77000 -356366 116478 220752 -90596 4342 145608 180433 9580 23355
10265 23355 -66396 15911 -6834 -94635 -49494 331117 -66530 -339 523550 62856 318881 275606
10253 275606 70775 347186 180380 206473 66869 122988 -107762 -56478 50689 -95058 -354916
10242 -354916 69694 -18534 25053 -94388 1788 10966 -384730 -324468 148117 70893 150019
10231 150019 -277754 -58176 67134 -20755 -156348 22652 1766 -243062 -244968 57116 -71410
10219 50043 133755 -120646 -308885 -96188 -200538 185407 -310518 144945 -64903 -252807
10209 -252807 54806 -167359 27086 -194006 -207944 18550 -400260 50236 -7646 -166325 -190567
10198 -190567 80038 -196248 222989 78227 -216145 101633 -117887 -272868 -274506 222186
10187 -215080 170861 -14695 86632 -186882 -197505 -152789 112118 -144553 337327 69015
10176 234414 -18133 -188552 -114873 -96898 -204491 -157218 -90342 86014 -163557 -134937 146237
10164 -73815 -244715 4053 -160083 -64228 -51667 -118638 177345 -97669 37659 329584 -34465
10152 -471673 -107913 -158405 4210 155333 180580 -4107 -187113 -15101 -432273 -376102 57371
10140 102649 -138294 -72594 -135788 -182507 -143345 81948 15371 -68091 -107321 -437256 -95542
10128 -30503 -377318 -301075 -164609 -58614 -133755 -475379 -63664 -566008 11432 78352 17928
10116 13646 -157884 -215122 -139172 -205691 -226129 -50730 232883 -120312 -20782 -148853 -349993
10105 -349993 -190978 -226332 -203156 -19290 -266347 -332881 -58651 56198 -144293 -276791 79213
10093 14587 137309 -24383 85614 -165126 -211409 -92231 277106 84019 -233284 -87795 -438496
10082 -438496 182847 208378 107784 23354 -320928 -140598 55819 66294 27523 -96032 -269280
10071 -269280 112651 202876 149568 6864 80501 96640 -264624 -266788 144693 75991 -227465
10059 -135635 -90560 -159152 -181569 -309607 -206344 -14304 91255 -217511 -195703 -153460 -381330
10048 -381330 -41806 285262 78042 98262 163267 537976 183883 229704 -85531 -306086 151300
10036 12532 -70035 -189908 47556 -75433 153884 305648 -65129 -187435 -148278 -23015 -137798
10025 -137798 -217715 104728 18985 -26146 -310804 -170556 -34039 124502 150063 255677
10015 255677 149937 -28675 -190584 -10951 -77892 -511336 -168193 -344471 -259767 -125166
10004 -208945 -158238 -177794 -15378 -63394 -227355 68517 227249 15591 -160837 318028 -109281
9992 -206846 -125771 -71650 53009 -117049 -291505 -81119 -333357 303952 265270 -69751 -1952
9980 -161795 -24956 207209 -206794 -145467 -82731 -383307 -5696 -96339 -87096 108223 -180552
9968 54086 11703 348902 -366010 147403 -70763 386016 -212450 -49593 -456 -31042 -187182
9957 -187182 38660 -66904 -99175 -67803 -197442 5182 -73579 21248 -5517 -152720 68852 105048
9945 105048 -152706 -72313 72662 -429690 -432171 164394 -278915 -30978 -46871 -83940 -314086
9934 -314086 78143 -160926 -94619 -268464 -74680 16482 813 -92441 -145029 23706 -107019
9922 -36536 -90811 -15611 -263311 -189765 -275540 10428 225941 -102637 -266777 -259242 28180
9910 43647 -5686 -341247 -92125 100027 23897 -17124 -171603 -42557 -42704 378856 -217956
9898 -262223 -150570 -300339 -102524 -40762 469274 -147461 62406 109318 -306089 94541
9887 244744 -109898 -123 9662 -5584 -133167 -107573 208224 -396587 190326 38846 133279
9876 133279 -76964 77407 -273078 -126916 -91422 -120020 29745 -6746 -169173 140278 -196749
9864 -400578 -173344 146992 -103364 54182 -7569 -19418 -15337 27997 -316332 -246065 -75078
9852 -43962 -19670 229944 -46307 -191948 -81510 -163837 -68543 -42864 -237884 -18171 11830
9840 -64773 26709 136114 196258 92276 -190773 -45753 -228972 22650 -255187 -32523 -5119
9828 -151819 248003 128935 -271053 -381273 -297243 -199724 -36884 263157 -351505 -39818
9817 130884 -81628 -259239 -236739 26757 -16451 34267 -83179 -210135 -119369 -200416 -29735
9805 -202889 -126801 58395 57357 -190396 79925 -136198 -55877 -148081 31110 121894 -307973
9793 237142 63844 -84368 -119872 -20677 -59341 16173 -128111 -8797 91554 21908 141573
9782 141573 -186573 163841 147378 -10216 -102401 174693 92642 -100943 -371904 -49843 12253
9770 -433549 153146 -251269 -156240 -77217 -141624 100336 -230207 203079 50114 -230692
9759 -346229 -322682 -243081 -67860 -303120 -122067 34170 -173426 -60603 -137617 -308121 9134
9747 -196300 -134611 398517 -135827 -78374 -39019 16319 -241966 -186034 -177789 -187336 -65800
9735 -266003 -251245 -73269 -161605 295304 -191652 129200 -121874 -180180 -50118 -324256 -172001
9724 -172001 -110715 127023 122892 131417 -29779 399478 14101 -322350 21563 -96533 -54745
9713 -54745 -79419 -199919 -103929 -212767 -211759 -42357 -220132 95591 -39771 304688 -57716
9701 11981 69736 -215391 154397 -248705 237260 -342876 338725 -4634 43212 -284889 -9741
9689 -124604 -186090 -75568 42755 -158518 27596 464729 56508 42217 -154147 123589 -400788
9677 76355 -591965 219412 -197464 88940 -23350 6283 -205545 -63016 -86750 88096 64927
9666 64927 -204178 -146621 278177 -174605 291991 59010 -157475 74524 -87107 17180 -148832
9654 77540 -265456 14079 -111 -288104 164207 -200972 -26978 -19487 218756 16419 -330155
9642 8389 -363653 -336570 15490 38741 -99236 -261288 -126883 -20111 130407 -210045 285321
9630 -221251 -310748 -88692 -272862 8484 -41926 -1349 -144723 123885 157595 -209561 165140
9618 -48836 -255949 -30813 -82306 -78021 -38368 -129199 36328 64019 206031 -167225 -226920
9607 -226920 -107069 -134150 -37273 -82867 33613 -37537 192923 17619 -147230 364345 -113350
9595 38038 53658 -288560 87546 30626 244421 134951 155005 -76755 -162492 223218 -58381
9583 20779 -73549 -78357 -148834 -139495 -36197 -156331 170917 -26138 -294389 -62033 -147162 155378
9570 -101053 -36573 -42663 -281102 -339756 196471 170763 44682 -178979 -116847 -163622 131860
9558 108700 -463833 -17551 -74455 -231502 -106318 29153 76891 -69169 -187421 129149 -19602
9546 -63790 -106187 -327733 -78198 81309 11825 -10813 -154132 -290229 90432 25852 -19571
9534 -35803 -144307 230265 -302933 -127441 -217686 -103874 91745 -34160 -241723 -245469 35375
9522 -313287 35557 13937 -4658 237942 77348 -200031 -240664 -13150 141034 270313 -220486
9510 -65237 114148 37056 -72156 6840 53042 15723 -213902 -31545 -194860 -191964 -439017
9499 -439017 -235841 -74730 -90227 -56078 -131199 60141 191803 -83102 -12837 -93516 -249824
9488 -249824 -63576 -219150 -187896 11621 -511207 -62316 148508 -43308 90651 -241027 -321474
9477 -321474 -213384 -79945 89499 104917 -303268 3776 -38006 -154102 -148994 113924 -10274
9465 24214 -66049 -396949 27620 -170907 -151563 -375295 368926 -243480 -192513 -50344 119907
9453 -91609 104767 -130979 -48117 227220 148264 -13928 37677 204030 -221940 -132021 183922
9441 -100930 3784 -90966 172457 -150613 -114458 -206275 227024 181492 151288 -111852 20811
9429 -175945 -51865 426800 86103 -207555 10941 -107975 -42804 117062 -53165 -273349 -72525
9417 -308516 -163103 391270 119442 -104648 -71171 -340651 -296166 -89542 -227990 75891
9406 -81497 -242821 19282 70105 -18884 -127128 -133233 144353 236900 -177287 -418327 -367809
9395 -367809 36495 81572 111529 -82364 -231135 162300 -84864 70870 -171230 -111410 33794
9383 -22785 -158061 192136 -254567 -149294 -23445 15485 155583 83974 -251843 -208522 -130764
9372 -130764 93125 167904 -18954 -79781 -22885 40008 -227885 -248366 -202886 -104374 285277
9360 -116001 -243808 156409 -78750 405027 -17313 -89408 35893 -109277 -132789 73423 -286362
9348 -116202 -244523 -163896 -96022 -46305 25969 23345 353425 -170466 -227263 -252002 22059
9336 -37743 -49939 301714 38923 50788 -41200 -6624 96853 -329698 35501 53548 -39139 -60649
9324 -60649 -61852 21526 -12156 103985 -369149 -3738 -417459 -179832 160486 -67237 94251
9312 -184716 -161458 -54903 -58409 -57564 24856 -74981 -23830 -178516 252301 67356 83268 -173116
9299 110670 -126597 150183 -214213 -176981 -214914 149278 -18193 462305 -319900 -70965
9288 249711 -191193 -410336 314263 -258819 -131621 -73379 -83008 -20321 46405 440553 167260
9276 -87072 -386066 -159236 -61628 -56369 -4258 131618 -396314 -169309 97527 59677 326042
9265 326042 -304107 -185229 92809 -33632 -324999 -256486 -188591 -142155 -167200 -111567 -415802
9254 -415802 -180546 -24751 -232772 -252133 -176238 -67763 -248026 98438 346678 -73183 -215993
9243 -215993 -147824 -47698 -72443 -286358 -307995 -58726 -279695 -39118 44438 -126003 5493
9231 -113155 -255756 82270 -70761 -203595 -141851 111888 -127709 -146464 -464121 75315 -309027
9219 59161 144573 -115811 -42813 -18035 226487 -124834 83425 112745 158394 -73323 140899
9207 348291 98021 -256009 -191083 -186194 -131789 -164729 -51975 113296 -262945 65436 19962
9195 -394192 203872 -193659 -250452 61118 -81919 55343 -159362 31902 -10294 -113742 -289489
9184 -289489 162759 119351 126274 -349095 -34492 -222266 39602 -328855 -75667 -106819 -218746
9173 -218746 -179103 -247820 -148707 13404 -24729 -88088 12488 -162993 -212520 56230 73798
9162 73798 -176522 -204619 -47973 80863 15997 68924 202189 -44300 302761 33874 -118212
9150 121590 -83522 -243945 35558 -12542 134258 -96904 -74749 113728 -257398 -444282 -49014
9138 -300620 269309 -50853 -118175 -41962 -151701 102039 1274 -126929 -166057 132697 -331364
9126 106301 -193698 -349933 22097 -163284 -112257 32862 -219111 -179975 -164543 -300366 -149389
9114 -351848 -300033 -70734 -128467 -182959 -138708 24401 -176810 -111521 -10801 34086 131669
9103 131669 -197941 -319607 -24313 -312079 16044 -342838 95010 -231499 -1827 -49601 -278319
9092 -278319 -12759 -260938 -106086 -70407 -104402 198072 -263722 63193 30333 -355944 211513
9080 -20082 -18031 -234981 -25166 85621 -70931 226531 -67832 58986 -44756 -19969 82864 -143082
9067 -323293 -5127 -422234 -100470 54925 -11719 -24721 -221934 27667 -65038 -219726 -45232
9055 214855 127591 -477459 -221469 -144245 55131 80333 100512 126815 -19890 142564 -11867
9043 -36018 -122098 90546 -254333 371607 30391 -149558 11457 -214581 -108345 382551 -39904
9031 42213 -388252 -170572 -61073 -89820 19355 20079 -146090 92558 -145288 91739 -272073
9019 -79897 44897 214547 102034 217410 -26119 -435368 -40481 -241434 -46492 -149865 -97711
9008 -97711 16864 -283516 199177 37624 -116084 -149727 -49564 102809 127008 -23920 131225
8996 -158401 6105 -216525 -85501 -58050 -185508 849 222200 -190569 194184 388664 -253501
8984 170676 137311 -228025 136984 -259076 -318855 -76182 -178123 15869 185022 -46821 -19885
8972 18783 57629 -262384 -74331 40462 26075 -122072 112132 -99754 -188680 -200857 7929
8960 -41035 433184 144920 192750 -170644 99606 -149631 -66293 49430 -138906 -71627 153044
8948 -8966 -30639 261043 -40588 -111995 27388 -121941 -137418 -181671 -347381 877 204675 -134628
8935 -315905 -35762 -122253 -311333 42631 -255374 -14134 -57518 238036 19015 62932 -241335
8923 5437 99161 294842 291767 313566 121859 -69782 -123157 -149068 -11474 156701 156411 473592
8911 473592 -197811 -307508 -14439 88245 -210175 -57509 146789 119023 5941 -394013 -31937
8899 56542 6285 -125287 -19066 -187584 -139273 86034 59922 41497 18421 14106 29592 131736
8887 131736 -412768 -162946 140924 -122123 -99863 151633 46581 -43915 230167 -363830
8876 -435065 -441599 -85930 -225350 -19829 -204457 -44409 360327 -118613 52702 66778 -143954
8864 243827 119006 -32178 205596 -152295 214131 37277 -79948 -367089 -5470 -45019 87
8852 -8955 -150717 82977 32033 -17526 -281133 44502 125131 -113933 113666 128617 -295782
8840 -167952 -78979 -45637 -186691 -65909 -100559 -65431 132572 61835 -83234 137144 22525
8828 -239227 159118 162383 -319055 -299627 -318008 140397 -101462 43692 249480 111544 -128822
8816 -306159 -171621 -175320 -56104 -233946 -90130 53236 -100699 -184581 -353722 -281044 -201342
8805 -201342 106460 -65382 -421687 103261 -78942 280597 -103907 -367132 -248695 -14365
8794 9013 -221552 42323 -90585 -84311 96005 3314 203293 200115 104905 -32147 -423953 -134148
8781 -116523 83626 -99730 198732 98621 -39262 33046 -186962 -63990 -217487 -234863 -50851
8769 47088 -56020 158027 -68358 144688 -117581 246112 -53822 -267651 -355814 10458 -123298
8757 -151373 -331261 -117454 454066 -128721 85153 8073 23674 55951 -12604 -147691 -77000
8746 -77000 19623 178257 56972 -83839 -186924 148709 -197964 199713 -125695 -177143 -169692
8735 -169692 -173148 57201 243398 81755 181190 -226409 147456 -72199 -203227 115066 130846
8724 130846 -87633 -321257 79541 -308224 -36565 13429 -135806 -126661 -151403 -177388 -233507
8713 -233507 28455 -268100 -299138 127838 270005 -196701 126295 90112 -30687 -229915
8703 -229915 85602 -336514 115334 -209951 -107908 -312145 -55023 -50480 167595 -88376 -57663
8692 -57663 -39291 11614 -96969 -156686 -92285 -289732 -185819 -45344 49698 -2009 -104985
8681 -104985 40180 -9200 -59660 315680 -61807 -139260 -36285 6006 67233 -799 -53657 114104
8668 -20142 -15744 -140676 8926 -313 154461 -126427 78800 13154 -701 -41069 -12655 -395736
8656 -395736 -103999 -215086 185544 -212383 -16937 -56241 -472709 66314 -99848 105275
8645 -157708 -79801 -226301 80546 -119673 -253451 4073 -170827 -43987 73549 259493 -131590
8633 216175 241830 295126 -228549 -159842 115125 137400 -309273 44950 85720 187693 -159511
8621 -426 -237647 -235126 35444 -46514 -217534 -414902 69976 -75109 -4632 -437791 -201408 -4739
8608 -2827 -71744 650 190785 83827 84243 21639 -24193 210387 53886 -44180 239595 -166310
8595 36168 247389 -360667 151210 -251061 -274821 117182 -281405 -29826 302622 81078
8584 -105465 23821 447587 -183099 -275788 -86037 -16544 96768 212467 82724 -256095 99907
8572 -17126 147598 -337396 -332210 29515 140694 -304559 -115669 -53980 66242 23527 450581
8561 450581 16872 -163036 133296 -203479 -252883 180911 -52183 -9134 -186783 -160431 -7707
8549 -18111 50935 -60620 -25254 65697 -96572 -11240 70793 -103253 -19340 21889 -12463 -121194
8537 -121194 150762 -107922 117122 -193475 -99329 24236 -187722 190935 -213395 -169653
8527 -169653 43059 -150173 11512 16673 -122660 95513 -167137 -168440 -194537 69540 169955
8516 169955 -158026 -259415 117888 -23729 38982 165698 -61141 168444 -125934 -200277
8506 -200277 -185002 -52898 -80425 -38253 -109790 239131 145719 33048 -227555 -254734 343485
8494 288256 -116094 -66688 133570 87598 -303814 -184092 -260593 -8344 -349412 -96039 -133780
8483 -133780 100991 -671233 -5085 147065 37868 -239590 -136005 67307 -17446 -37602 -141592
8472 -141592 -205666 -397975 301070 83364 94830 -176020 -56601 -118703 -180017 -118484 -184220
8461 -184220 57529 -76639 147226 11021 -63916 -48193 -214592 384048 -59018 -94311 -40672
8449 12049 -99596 -199044 -204707 154427 -387186 -105382 121721 72583 -308061 -86515 21968
8437 24782 109469 205891 6995 22154 -238692 -417063 525054 51565 28799 110249 -77777
8425 -195232 -149036 6876 177611 -245603 142563 -68142 7297 -3919 81376 -77080 224469
8413 282959 -73432 -186389 67575 204048 -70000 -31811 -90249 -178407 -66604 -220380 -51248
8401 -144719 63299 213243 -12836 100495 199898 58704 -161544 -235316 -195045 -52229 145424
8389 -220443 30622 -122062 -95131 -115987 -40748 -230616 -260735 82192 120093 -80548 -231388
8378 -231388 -159135 -141498 -29751 -93269 330908 -181332 -102130 -145462 -152296 -299996 92626
8366 -73553 -38417 -18990 -225476 -140741 -64055 -285166 -211165 212462 151762 56662 59927
8355 59927 75586 -37341 117329 111982 -182735 -1925 -71084 -195109 31830 -265260 39014
8343 127537 339212 54899 297013 -302431 159217 70266 158782 58581 -22065 -81106 -39435
8331 -67959 248282 -16551 41730 -394909 161378 48478 -148239 -294888 44088 100364 -254819
8319 -367976 -3051 -156478 19775 -226450 -156337 -233181 172370 37881 -32993 76136 209771
8308 209771 206070 -86011 39039 -195794 -290145 -422079 -47509 87233 -19517 10918 264327
8297 264327 -37318 73595 19415 -5775 -100335 173239 8388 -116899 -233969 63138 -47998
8285 -43547 233404 -35501 28987 94280 260050 -186325 -96177 -45476 -240813 11881 -80330
8273 177178 -312456 -237719 -183563 120249 -15776 -105466 242187 15105 19274 -277693 91285
8261 -158149 -99454 289744 79509 169290 -98437 -75332 60650 25712 -237633 1764 101762
8250 101762 131069 196367 -353319 61139 346260 -232056 -262097 -244675 -462954 265192 -86238
8238 7258 69198 -140404 214408 -51961 165559 39303 -338079 89855 -111592 -117098 61328
8226 -89992 101501 -292691 37341 -193379 108788 228227 10669 112772 -180682 -206878
8216 -206878 -148742 -315011 100909 33142 -4082 -167018 -86967 -202163 44479 111913 -100109
8204 -102276 -255846 -93098 350731 99568 -21045 45514 -316943 217800 -38174 -128961 44810
8192 -293259 -63707 -161032 -40087 12654 -218023 -71365 -29382 -110766 144030 -70781 -159813
8181 -159813 -42368 -187500 61682 -352696 1017 36839 -252859 54384 358464 -2285 162605
8169 -268584 61150 -26430 -150834 -220076 94876 96758 -357952 -16125 10751 54213 -270887
8157 -115795 -307251 214825 -467105 23671 -111323 4308 24008 149371 -257380 94258 235723
8146 235723 218077 -122334 -168617 202263 -27803 -223131 -60591 -147961 -158157 -261260 -246594
8135 -246594 139584 -314901 148960 -102467 24318 309370 57085 -17755 -83072 22926 -144394
8123 241390 -261533 6704 -248447 -130193 -174345 -145724 -68614 121712 -172330 -261851 -37689
8111 -13726 -74976 -22855 -119345 -59125 128450 -152311 -176382 -65413 195622 119191 137103
8100 137103 -242984 -16673 -191287 276265 -47754 235760 -144227 -55799 66603 16274 -102659
8088 -46166 -197299 -69523 247901 -81909 -62988 -92507 -207152 341516 -239544 138724 -105525
8076 370813 48882 -208283 303146 146749 219791 -147688 192778 -153055 86755 9546 -263184
8064 -126697 -292646 7279 -303736 -235822 -138178 -81839 39468 27048 107150 -96968 168046
8052 12848 -20361 220903 46052 101619 120990 -144489 -23695 117801 -34335 23799 1909
8040 -27680 -31056 -90159 127398 -132021 82413 293324 -213844 -92870 -217897 168693 -125143
8028 -374708 5034 116846 -253487 154080 57919 134866 237022 50368 -188952 223758 -193583
8016 -185468 59555 -2371 -124355 -234988 -17499 -96090 -320526 -356660 -62190 58642 662767
8005 662767 11380 76928 -7523 -97793 -154457 76560 -8892 111558 -164151 10528 224189
7994 224189 -30781 125703 81149 -254995 -47207 143953 -9404 31721 -491419 -104724 -177052
7983 -177052 -79314 -270195 -52282 -19631 -294933 -106999 43680 -151813 -80998 -194718 -192180
7972 -192180 145102 156763 -109517 204477 -46852 -33129 -205230 85123 106702 -267205 107552
7960 -76237 -20611 76314 -177907 172056 -31 -18209 72767 -6242 -56434 -107141 58899 -59592
7947 -220099 -182792 141140 -51540 -145105 131342 112175 -112581 -237657 -369800 -203243
7937 -203243 9729 -239413 -63449 -179424 -51290 -158309 -138874 -69663 150716 3485 -188449
7925 20143 109252 38336 -7076 -361215 -53931 80719 -153688 389935 -281008 130503 -145753
7913 -194844 48903 -397765 -173741 -21739 26466 -17189 -76606 97562 183197 640915 -142481
7901 -195673 -17536 -102044 -339487 -50447 189066 112706 133895 -192349 -265412 -38014 22316
7889 204301 -166928 20137 49052 -103850 92133 135225 180623 -282625 -35437 207496 200144
7878 200144 -304785 -271743 -11214 -120045 -15799 -121625 -496480 1121 -212701 -106890 235689
7866 56558 -286334 190488 -96508 -154884 -283435 -45824 94612 34633 109849 129577 236940
7855 236940 -10365 -382373 -50302 -104020 79157 77947 18201 11184 -80441 115764 87004 -3325
7842 -47138 45433 35482 -169416 -160846 323930 85353 -185395 -128023 1327 -150890 205685
7830 -339180 -158367 -96040 -66130 -384618 3796 -84187 -130893 18086 298223 -213842 272236
7818 -295897 -219320 78484 -190758 121844 77179 -167546 -68444 -396500 -34784 -140682 42909
7806 86264 56709 -15639 -30470 37326 10683 217823 -219037 227634 65693 -74595 -65703
7795 -65703 10029 -101947 -54412 -26449 -17718 -110191 -39150 241732 -332212 5377 -218235
7783 -114732 -17517 -34731 286732 -315655 -64502 -45940 -259974 -42287 40096 101259 -200316
7771 296430 -50552 99708 -11504 -69780 -157908 95214 -194031 -53397 -135094 320143 -190985
7759 142579 -4545 252969 54074 -210039 -122722 -163531 -285314 399305 150132 -5893 155396
7747 31373 91553 100455 -65036 369333 -85097 -2541 -73956 132217 154406 -45627 18941 -363317
7734 -125561 63905 164213 -228273 22846 85793 72863 -82537 144328 56527 -9969 -4711
7722 -233741 225593 114150 -267093 147359 -123786 -37721 180791 -75434 -324737 110806
7711 185419 -291366 -34634 107312 -257703 125871 -109933 -207520 -118288 -106532 23858 -19812
7699 110939 -325762 -44782 48406 149983 369481 188310 -240928 -207572 66625 194651
7689 194651 -173202 -188580 -44209 13696 96932 -153233 -45916 146302 -232 134085 62335
7677 25151 -115217 -44001 -15567 -385199 -154500 -255930 150719 16345 258582 -203478
7666 40000 -106740 -164020 -132349 234054 -56789 -122016 147580 221683 186570 -89942 -49581
7655 -49581 -45338 45325 -90231 -79480 -56069 116230 100365 -163487 14729 -123367 -174248
7644 -174248 -301249 185424 -89869 -114726 -60510 65344 79033 -131081 -206034 -159824 8192
7632 -99616 -44638 191182 -76075 219036 -208423 -125672 -319350 212924 -272071 146894
7621 -180860 -11808 -224141 -27089 -51770 72112 168934 -122155 -110084 -166993 136008 -181888
7609 2893 50336 -282879 -263365 -251501 27358 -219546 257148 172233 -237636 -100560 -497505
7598 -497505 -88388 34428 -32363 -59570 -118890 -114751 -228494 -424456 -178889 -198483 -87704
7586 -125166 -113391 462020 -231807 76718 -223228 -74827 229523 139059 -128922 -176575 -62554
7574 -164207 28259 -318534 36213 -185364 -51429 151732 290960 9187 47470 14930 -52067
7562 -71936 -35063 30491 -140711 -74431 326925 64558 204874 13711 -32922 -236782 66359
7550 -55475 104652 159946 3187 -35975 -200296 66492 -83342 -125893 -416080 58315 -16976
7538 23406 -4271 148143 752155 -184771 127721 -135480 -389534 -38138 -120831 -150307 -240096
7527 -240096 33078 -2667 -21819 -12642 -410420 -92659 209355 -320876 166721 -95257 -60679
7516 -60679 234200 -15235 38369 -183229 107759 -94541 -249273 -147589 236691 121508
7506 121508 9825 193398 -30588 233366 113681 16148 -163946 170888 -85205 213253 -360832
7494 148989 -139747 125081 329347 18835 -89330 119035 432800 -66820 -137736 -35716 -42110
7483 -42110 152127 -42193 -415375 55109 -176918 -134277 179308 33283 -103559 -99309 -127295
7472 -127295 -67386 -47217 -148797 -98718 -87430 128069 41521 52023 74816 -13416 101435
7460 77670 173570 -119996 54525 -88713 301973 -36559 -209055 -14128 20462 303999 32904
7448 6435 4622 -62217 -67313 -168981 301607 9055 -47544 -220545 213723 -235751 -161276 -18727
7435 45242 139518 102058 64125 -44448 101820 15791 -89583 -25898 61595 -130771 38210
7423 117025 -320186 131302 63851 -145567 -59761 -384571 139202 -307009 50626 -283669
7412 118544 121386 180410 -1676 -51299 49086 -31361 72926 110375 -175718 -146054 -265079 -77574
7399 -193731 -193903 67429 66503 -65810 137420 74707 89625 -223892 -9837 335482 29231 -94482
7386 -182685 233597 -34754 -246294 328102 273535 206498 -261546 -56401 68183 -18625 292210
7374 -174254 68412 76612 -274628 -47854 277863 -177434 -96302 34248 83650 60713 -77193
7362 -32469 -23315 -42922 -121058 100825 -288749 -4658 -49149 -116524 -186549 57406 -309916 -56538
7349 -171997 -45455 -66713 -39879 -157538 -178408 56639 -188494 -25008 -82934 116830 75320
7338 75320 -35170 -15361 -139215 44782 156357 32900 256016 88171 138931 50201 -58869
7326 23077 -11535 -539668 119107 -185702 -35026 -144454 80535 -7660 -145490 -379202 -234510
7315 -234510 31963 51985 -1237 273844 157526 -29522 -346551 -148443 -22537 -15369 -99005
7304 -99005 97595 60264 -86219 149550 -94615 -121809 -276504 -98420 -212823 -102934 -147726
7293 -147726 318292 -96020 -148613 303267 141361 -92472 -159038 49418 -37285 78542 207933
7282 207933 -36714 -189832 191091 -235720 27462 -31009 -322664 -37319 188040 -769864
7271 -117738 29531 -122825 23033 -219779 165802 -80761 -14742 85758 -157516 198562 -214260
7259 -48279 23746 317414 -103956 -11373 -106147 187628 74055 53098 163330 -98022 -90884
7248 -90884 90829 116908 99549 -135291 137779 133087 766 8830 -25180 -41439 -28532 -257260
7236 -257260 -175574 -146237 -128767 130831 123499 253983 -104267 63006 -235168 -31060 -85845
7225 -85845 21431 316133 -119274 -13904 83438 -36421 -378566 -225237 -171222 79003 20905
7213 -34825 -9919 125310 -84694 175000 134846 38628 -9300 -160545 95516 66983 -82071 321595
7200 430244 -137809 -208959 -20851 -159714 -167405 -236867 292925 173807 63708 -54934 41746
7188 -57605 -62302 -17540 -488 -88437 -16969 205276 45877 -114007 117902 -7185 196555 199906
7176 199906 -100388 -173814 229482 -618440 231072 43546 -9062 43870 92107 110077 62566
7165 62566 -230281 222006 77047 -12288 14911 242063 162672 182614 51563 -315897 -70732
7153 168712 -229527 -302392 -18659 -353696 -227692 197653 -102497 242511 -220885 -108655
7142 -38134 -147354 43242 110932 406920 69206 13811 83576 142362 -425141 14429 19663
7131 19663 -75360 -39664 -132668 153647 53269 -147182 -102109 197223 -174791 -196170 -222511
7120 -222511 96254 -136794 -177478 -105421 -135190 -58230 -257405 227401 44457 -6451 -69989
7109 -69989 -149167 108404 9109 -278972 -346036 153238 109392 23836 10329 160671 2567
7097 41875 16653 -22609 176632 -128941 -90121 -135480 47743 38490 74434 -345123 28735
7085 -129326 -193923 87193 110423 216425 132052 -18484 -146778 119387 139196 -329322 -40667
7073 -272807 -213122 137244 10398 144701 -192131 350455 167719 -118920 1343 143317
7063 143317 -195825 113172 181890 -182276 -146243 16412 -32562 54778 -461630 201175 22498
7051 9078 -88823 132979 267768 -10022 64073 88413 25961 -102036 104534 -17446 -25843
7040 -25843 -221435 160394 182991 -46068 -146144 173597 -108519 -235181 295740 -171267
7029 -211751 -219047 4423 -275571 -73716 -53932 -47037 -244713 -82588 5996 -114589 38438 -409008
7016 -21600 171552 -188664 -34831 132894 168522 315951 -69251 145969 88312 -91111 -313941
7005 -313941 -155554 -133537 109969 17620 500087 91433 -3493 -106484 -32109 464714 -304641
6993 -97635 -97576 -68638 338042 214414 -348567 88718 -197081 -55878 122126 155837 -253674
6981 188583 61856 20113 260704 -49299 434961 85371 -38382 -64922 91711 -22639 -214829
6970 -214829 -2804 1394 162975 35734 -179036 138758 -159905 20076 233274 133567 -117662
6958 -47022 -8431 -57570 70950 32220 22466 114474 -192938 -327216 -269446 -43844 -71773 41802
6945 117518 308346 12480 -147623 204680 -218244 -42293 -236462 -347213 386597 -159882
6934 -108159 -43132 76706 -24472 -21133 229982 -4181 91571 -86388 -112723 -181822 85596 -102701
6921 -148124 -40425 74326 170242 -233619 35355 116258 -46969 134585 -173812 178834 89574
6910 89574 39770 154016 -42941 -135298 -43688 -162995 331123 -211827 234784 77681 -103570
6898 -289489 -293762 -117074 30320 259959 267640 -39384 143745 212244 188143 -412376 -46910
6886 -105420 -149397 10765 -92541 -7471 -117335 -81471 -13094 214254 -17900 38882 -58855
6874 63982 -257005 26669 261845 -99996 -110102 -63861 -126468 -136200 59666 -71299 -427684
6863 -427684 152659 -75535 146911 213835 163599 -59125 168538 68050 -17872 -129109 66319
6851 -425310 -99734 15910 -301140 -31431 7738 92751 16839 -176032 -299980 19805 -1915
6839 -46017 203702 241257 -11302 29964 -24580 51957 94088 52291 -216046 -196916 -61976
6827 -69815 -7973 33672 -160856 16856 -21742 268700 -26202 39016 -326918 117153 -28671
6815 68331 33021 -194830 105888 -132599 4814 182449 21244 -70941 -153308 -45599 135775
6803 133486 -184490 242917 -49856 -231766 15384 -9752 -212214 108011 309240 189595
6793 189595 187127 -251369 34878 -79576 -75251 331935 143142 -26760 -76102 -145810 98233
6781 113882 -14003 32118 248848 68948 105640 215043 108936 188913 261032 43672 -171020
6769 19061 242791 146132 60464 -84011 -85014 -134157 165200 -207131 228965 -293991 -121389
6757 -280219 152281 247184 -3252 87680 169657 -83236 22256 -55522 -122046 152531 -38764
6745 151490 73566 186243 -171519 -140932 235343 -243130 -165934 -69389 96572 -99255 -224167
6734 -224167 -29331 -248329 -366694 88303 191056 -121154 -97010 12271 -144229 -281444
6724 -281444 -25701 262441 120533 85111 -86483 11313 112586 -80559 197650 -147075 11198
6712 499133 -112828 -281492 -54248 426042 -237461 245516 14490 333304 -324487 155360
6701 -45731 138849 7909 -159393 -54743 -259244 -69674 -194540 -145194 -109952 121876 -305455
6689 -222661 50554 -246916 -134226 -73548 66511 217712 90387 236307 148528 31951 -62558
6677 468588 18544 -368017 102483 279917 -61305 -372287 -143000 20692 -89230 -91831 -24898
6665 5175 -115695 56747 91494 -1691 154427 -284672 -208332 -62069 -46817 -290740 -71725
6653 154189 -39783 33599 -23478 -1151 133697 -146140 -82815 -42133 -89099 -254982 -283301
6642 -283301 6046 -184400 35162 -69135 -252318 -67582 135914 -45478 294042 65966 -103804
6630 84529 196969 -117289 -40784 -29613 296486 -2945 129536 -101335 -10910 -70839 164366
6618 11738 182720 -344689 242606 -257255 182861 37364 131949 -162912 232463 -204039
6607 240146 -28265 -171395 -50412 -28162 117560 150710 -76122 -303576 115747 169852 -123760
6595 -25269 -3809 -109297 -7579 -189178 -90319 -91812 1782 -101444 85981 -350617 232062 -355320
6582 -42198 243165 -185544 73710 -138565 -88070 83220 -397840 254319 -3877 -223779 -257656
6571 -257656 45636 -34603 170955 -82750 -258957 96162 -173466 387518 -113037 67823 -7880
6559 -109691 -43220 36016 -273173 -109691 23921 -164337 -32130 -27392 108655 -125627 -1351
6547 140804 33876 84760 -254 32664 -118886 -218158 -220546 -228249 116000 -25129 35493 -98359
6534 100269 100906 -181142 128797 -309045 -133672 348511 -88447 132982 -51669 6131 1043
6522 164476 133744 -406327 -177296 -129662 -15511 97916 12594 -21540 100394 -102588 -126335
6511 -126335 274832 -12947 342725 123485 33658 115188 276071 -65534 96889 -174211 -88217
6500 -88217 -4526 -167536 -142925 3631 -135358 -241405 -342246 157570 -234412 -372439 229056
6488 -140047 -28030 13248 13640 -102448 121497 102333 -81688 226428 36577 247491 -354993
6476 171443 -184005 -259146 274144 82314 -166793 -186930 -213834 417861 13589 -7071 -223536
6465 -223536 -159587 135237 134589 -71161 30092 384860 -978 92083 351200 11849 -311677 -198805
6453 -198805 59064 187372 -66632 -290249 171400 -19187 29090 -220050 419106 -229246
6442 97091 -22794 29672 105964 -77152 1453 31377 -54810 143239 -79792 -67097 -131750 46089
6429 233419 -83053 7393 90625 -153002 -269103 -145115 -46969 11742 63740 302820 -20546
6417 144132 -12593 56439 49825 -256691 -103726 271648 14554 -36465 291550 -186070 -87155
6405 -223611 -170082 201014 184333 -133006 232655 -92792 -295597 -237994 186102 203366 -132346
6393 -10612 41506 20251 -30356 -74455 214746 -232797 -24864 -52516 162960 -350914 20907
6381 6326 115518 169464 -28638 -235080 -234928 120051 96034 170139 93430 -150114 -90137 -76453
6369 -76453 261435 4597 2533 -24454 100422 -349325 112238 -138854 -52548 -158522 -84852
6358 -84852 22460 217498 -23614 -134918 -319293 -161756 -296010 170307 116082 -43514 -232586
6347 -232586 147588 58952 -316139 29601 255875 67114 272218 -38571 -40633 -167862 32896
6335 -118174 -141807 180743 -12359 201921 -297406 -46740 -3742 147870 -192337 -268855 119866
6323 161682 188573 -85071 -170132 -18609 -43428 -181518 -66713 -102395 -61864 -379013 -38247
6311 -18638 -29307 121181 -107641 61521 312541 -85762 -20668 217695 259533 4955 -38423
6299 -37891 -108293 160642 -202283 24738 -317937 -525119 137387 -54687 177548 -240413
6288 179926 51489 302263 12752 66546 -51510 161214 149188 -156209 -31270 11645 -144998
6276 -151096 -230863 -145138 328782 -252081 364693 -185106 -77730 -89520 -160717 368055 31631
6264 223388 118085 -64960 -96848 306972 -50715 -4226 -15816 16946 -144536 -185495 -39890
6252 174216 230495 -176282 -25780 -81366 -206622 371885 -188079 98956 -112988 133810
6241 -228683 120575 -373705 87457 -124929 -84062 -102141 65023 -253720 -56493 -263171 174594
6229 -93926 -139641 -80447 21507 51911 -14234 136721 69242 256336 -30656 215038 -173256
6217 -26771 -27571 -142354 141270 11433 -302212 207220 180026 -91729 -111195 194186 -176040
6205 -52271 -99288 62907 -325440 -112002 201752 281448 -198484 -153362 -221258 127911 -86462
6193 -24334 64675 -199762 -31844 -233680 32364 9823 -258906 19949 101492 -39142 101028
6181 131443 17996 304253 -173097 74496 -91522 98939 95519 -43645 171383 -79533 289246
6169 -33018 -206624 -133623 -271557 159433 -318 82214 -260520 -214676 116660 -165631 -97461
6158 -97461 -166368 282294 149537 -26974 -112567 -125308 -51807 50914 -6833 65834 -90224 -158014
6146 -158014 -101374 181348 416803 65969 -270228 40943 199674 -205582 44627 -117842
6135 74769 -12577 117131 -188040 228387 216408 -40629 -122736 -330710 132486 78735 -70292
6123 -400654 -56934 221063 -55873 -193244 -201987 -173301 10572 -51340 163844 193493 196901
6112 196901 237344 -48510 -194171 63539 276908 -241077 124045 88732 -5606 35746 129902
6101 129902 132474 248439 -4227 389417 70312 229271 -318694 95868 -28733 54237 270886
6090 270886 -57100 125735 -107348 -119928 77194 -34840 72388 -19481 241834 188120 92621
6078 -169813 -49861 -404912 -1322 1116 118465 -120309 220297 -103580 80561 -3984 -227575
6067 -227575 -180447 -40264 20315 -49771 -53167 -345336 25430 81876 -48726 76451 -48036 -95819
6055 -95819 141774 183928 -205950 110467 -365349 -65114 -9055 36895 -210672 166446 -121610
6043 365821 102389 -37489 -258253 409731 264608 -68902 7329 -224110 -47367 -333256 407851
6031 -19330 -410961 93101 -12531 -2314 105406 -33841 -129561 -82021 -147041 -137416 -206914 45605
6018 31600 215638 -249079 128987 -114149 246826 -97606 -32871 135147 -58000 -105151 -87618
6007 -87618 70958 -128086 153818 315617 210091 -192131 78403 -43411 -109808 -176620 143258
5995 -99881 60001 42752 -61653 -473966 93325 -194585 91743 -109705 118192 -154420 -116362
5984 -116362 -105215 -6319 129844 -163663 -44442 241461 26701 -326123 -118527 126320 -252079
5972 -158215 -99607 -245644 167789 -11695 33083 -397724 -117426 136037 -53812 8781 -102882
5960 85327 -197038 74662 -34183 -45858 137266 22282 52357 300116 67750 -151469 -211697
5949 -211697 46436 143776 45098 370817 196685 -170120 -417657 -37867 54649 -123430 180004
5937 87550 118113 12808 -22517 76583 -24710 -216610 -5472 76820 -106536 -354491 80769
5925 -187237 -250478 36001 -18525 127294 186483 -42425 333116 -531911 -6411 -125708 77155
5913 149309 215170 -16791 -181654 -164246 109723 -53589 -188798 -213861 128888 -201634 189183
5901 33565 -335294 -218379 17619 19486 -66344 -131363 129123 163136 -13318 132361 -285607
5889 -1563 470938 -235652 -164457 -7215 -207850 166065 28768 -47851 -9751 15771 50791 -15498
5876 58329 2598 -64610 27595 -67594 -223810 -173097 368576 114597 352884 67984 -105717
5864 -146346 -107694 -254878 -251698 -96045 -202449 -63418 -79559 -131206 185983 130553 -33380
5852 79537 252650 -279581 -38063 -273435 40977 168221 -235247 326082 -161791 -90481
5842 -90481 261595 172328 176037 283943 -81292 186250 -269706 -348287 199049 -75797 -79163
5831 -79163 -211026 22862 106999 -51549 -35948 114338 -116475 24714 -9116 2017 154562
5820 154562 213365 254688 -114692 -90771 242964 -389 32768 -56541 -578273 -177567 184858
5808 -212527 22516 -115611 -18927 -31153 -164302 108444 -131201 -200962 -46261 -55026 47639
5796 72736 246969 -184334 -70137 -21191 -13652 -96994 6742 -228706 -17813 -205334 28606
5784 -110412 191854 -356253 364262 -125729 14422 -158020 70109 106637 212074 134586
5774 134586 119219 81782 253226 61003 -168359 203940 -295803 -9082 -159422 401480 42206
5762 -106888 92452 164160 -223566 120543 68656 -153246 -106804 111856 -115408 -54931 -88857
5751 -88857 -81841 -77493 163586 -144269 -300284 248672 -125945 -22436 -51591 108898 214965
5740 214965 -41739 -255770 41801 -129095 80393 -167781 -148849 -187670 108211 317096 404440
5729 404440 34949 63552 -478636 177165 313297 -84932 -14272 132264 53471 -295971 164347
5717 -27610 189449 155722 83372 104549 -498501 104203 -104341 -129357 -83186 38893 -106029
5705 142811 -229038 81251 -150989 -180838 138614 -115464 -55496 -61175 83751 -70536 -116153
5694 -116153 182502 -102931 -248877 217582 250558 26317 -105226 -3394 -188129 69848 32621
5682 139442 -5930 -37448 -121482 -84945 155299 68913 230160 165926 -15770 33676 21691
5671 21691 398349 -165101 127054 63912 149231 -50826 109644 69765 -332731 -162197 -11824
5659 -101516 129717 -51895 279981 -54915 280114 65598 343818 329740 -12233 -214865 110006
5647 -102854 229959 182930 -182809 53931 15014 349847 -75364 2561 -188508 -142320 45271
5635 168432 -5966 -284986 324607 -78918 196841 43397 116867 90452 205879 -190070 29239
5623 -121088 18032 258673 -167138 -362006 30513 212241 156562 -85590 40530 166681 50182
5611 18912 -74201 4465 -30030 -388429 -14933 -204773 150266 52656 -11809 -498 217413 -272091
5598 66638 -41929 -176126 -174254 132741 17736 -71870 27992 98610 50127 -106364 179097
5586 163565 72239 43844 -13733 -88375 -168941 -41045 118751 26063 -112482 -183928 61774
5574 207743 -184740 12684 190537 -21823 -155649 263468 -87977 -231407 294511 89297
5563 2428 90259 -72100 223235 -577559 18768 3285 -53746 58743 -271541 -234591 -156495 -156464
5551 -156464 36637 82202 21063 -153525 133642 161457 173464 28620 260963 -2508 -20606
5540 -20606 -134236 -178997 -395392 -52756 -8873 -59935 106597 -354114 -128793 138884 -46263
5528 -194816 72852 54564 198204 -118086 241779 96435 -308084 -65856 178681 -22789 106507
5516 -82018 232628 -249192 -22613 -57690 -9729 -34295 -63999 233697 41270 231501 167837
5505 167837 -91401 -97870 248338 -2215 -122893 119689 65213 98377 266114 274582 -183876
5493 124755 157926 194052 -137488 416495 -87551 267614 74132 -69331 -218358 -307436 -123949
5481 395172 191672 167967 -189072 -2846 -35559 115330 131909 240437 -247941 76934 307718
5470 307718 260885 -150379 -206454 -11003 131641 155571 -65992 -56156 35182 125774 53004
5458 218536 -174852 -114438 327573 84833 -181892 -10666 -38776 -919 119443 179252 -115331
5446 -149583 -65189 17076 7142 117202 140517 -25096 -31518 1669 -48370 -112546 107577 -287215
5433 -179220 -197565 365366 290745 -23306 -259713 -23579 -115743 -23196 -174498 188178 -111968
5421 -221506 116749 360109 -5357 130598 196110 531422 -131338 125163 187329 71028 185226
5410 185226 -24743 3822 -40696 -217866 -125259 -463591 369997 242895 178332 21701 -263046
5398 -50345 74596 123526 86891 -24586 -205808 4386 -89294 81638 93936 -112323 46519 224121
5386 224121 -102702 -294981 248281 130010 12075 20672 287991 -106032 -9814 -73435 248728
5374 145135 175456 -121353 -33741 -154354 -41380 -57544 -73702 -15749 247547 -137133 -129332
5363 -129332 52584 -160109 162237 -158491 170371 86438 -73840 75471 152503 30019 -102211
5351 74242 309093 30951 70310 78713 -271947 -106857 -200321 -65725 236474 6403 -30195
5339 -70348 -146542 91217 158258 -117654 -208041 -209540 34383 84656 -111372 -144743 242599
5327 -138600 9595 241186 18769 -90659 -201018 143298 128233 80886 73032 -204094 -136329
5316 -136329 118918 -190109 -140292 -5260 93981 -51170 -24515 289295 -1269 -73089 -143361
5305 -143361 -227074 221904 -29697 -126979 -167616 -234730 136537 37789 -26176 34055 71802
5294 71802 202398 146743 308002 5478 167939 -114276 -96489 -170973 -105417 155910 135826
5283 135826 -196169 -81393 -175862 -156717 -206551 -97724 106508 60085 -276274 241834 35958
5271 -56975 265473 57914 -31690 183200 115559 -57034 149814 21688 -135148 108858 29617
5259 -85555 129004 217298 127443 201494 346002 68958 191490 75672 -154709 -51596 -13163
5247 52324 135790 114554 -70238 93267 -219340 -73248 124694 362097 142864 -61784 57216
5235 222 1647 -40317 82970 -437781 217152 -9317 58593 -279859 -103300 113201 -62436 -471185
5223 -471185 135952 209875 -190576 -71374 -179400 69561 69039 181605 202482 119984 107724
5212 107724 -58034 -117601 -29332 -129221 -17811 -132709 -331629 -325546 -189156 98527 -228881
5200 206521 -108259 -316361 -48013 156925 -20953 254047 -31188 -186674 90862 52478 -79350
5188 43422 200017 121451 303844 -43738 -105081 -14407 -96610 -173087 -116786 18987 49681
5177 49681 15616 133198 -146378 -53076 224049 -303403 158120 -3714 -135582 11048 -80237
5165 -40151 266977 -227355 46559 116481 -32451 53596 50659 -6830 -244723 32912 190735
5154 190735 235706 150920 -56190 54418 -365493 -31312 -149447 -216866 295528 109110 -197931
5142 81024 13254 1305 195623 -27214 280883 -132006 123819 140064 -113483 -43389 204110
5130 -23910 -324564 42563 21929 -182226 93489 -116374 112964 -118898 95440 138832 23254
5118 52879 119276 142093 85548 -247931 175910 -190396 82075 62622 -144449 221872 379733
5107 379733 173556 -112992 107200 -69246 90020 -120325 -250111 388488 -65464 -346989
5097 -346989 -500359 -84161 3110 277230 257434 113451 108227 -10470 216818 -109533 -79616
5086 -79616 40446 -236469 7721 112504 -138578 166856 -160628 -362870 -320190 -108315 -98225
5075 -98225 176403 -121783 -293019 62427 12904 21814 -62335 -175063 -83409 8251 -365168
5063 -111787 -211313 165804 -204479 -60247 -57318 262425 -135694 -208318 -59512 -135166 276212
5051 154542 -117598 62743 77604 69392 8718 -390032 105335 127345 -208565 234485 135155
5040 135155 -181330 -181988 -170385 -35819 316970 95599 -60443 147046 -174362 42996 164950
5029 164950 -123119 -294412 177814 -76305 -68764 -263991 -259237 11945 -46870 -359198 144175
5017 -80529 43631 -62062 -80052 -142116 99309 319100 142051 -62182 -147281 158997 56500
5005 -105418 -122274 -220022 -22897 -133512 94859 161040 49358 114694 -295324 -302748 -51962
4993 316386 34479 31351 25851 49486 17774 160356 -213401 -260547 189781 -153453 407364
4981 25815 69312 273917 -82260 285564 143486 169902 131078 -126479 213338 51687 -229853
4969 95097 11029 -93539 -119403 122044 -86284 -290427 -141932 -239626 49513 260365 130265
4958 130265 240151 312801 -129066 32535 147686 69372 -106699 251322 -100124 8843 115908
4947 115908 -144199 200529 -72908 145150 -107563 -28032 -85584 -139959 130202 -254357
4936 -82351 -58547 -24463 -19674 -102223 286297 -93800 44079 -7672 -111826 189701 15059 -13578
4923 67001 -123244 127135 145779 25025 78166 47716 -118052 109513 -165269 -150174 -327620
4912 -327620 -111108 10530 348550 263975 203892 1134 74961 -22710 -3596 -116096 -105283
4901 -105283 -72056 -106280 217208 130317 -171095 -120122 -52999 49687 -363260 140758 -35810
4889 -304312 288234 163195 -94911 248405 -111600 -8681 -191294 15257 -33037 37306 134981
4878 134981 228847 -219590 302318 56487 102643 170687 -83494 -242916 139425 4338 109571
4867 109571 -82483 82123 -378136 272075 -440158 280822 142485 307236 -150026 89137
4856 253004 -316633 -27705 -148766 -381865 51362 -258096 172429 136405 -119796 443039
4845 -36371 -463028 -141700 -137555 355342 1193 44865 -15422 -230317 24281 -37090 -106761
4834 -106761 111077 -166304 118576 84820 343272 -31544 171100 21023 43880 -19629 -114915
4823 -114915 288343 300928 62469 3241 -118024 134245 -75971 115025 -4824 171602 -116621
4811 -37011 22099 79117 312901 -60325 3886 -95465 -70388 -45343 -268542 55088 103961 -63509
4798 40884 -45192 -114843 396334 225437 45683 182036 -27019 -235477 -196005 -67186 53772
4786 -187078 5462 -21194 -214285 301459 -39996 -16835 -49022 97496 55437 92044 39951
4774 2695 -186330 227670 -30802 -394799 -154244 268612 116751 -133825 -57891 -38100 -155222
4763 -155222 28018 -19548 -181526 80638 55279 85661 6702 307559 -246208 -140587 208922
4751 -6802 -37497 23249 147800 189591 -84080 -18764 -85647 -49494 133160 286710 -477739
4739 162217 -4984 133525 37494 57359 -154666 57109 151004 -67818 200404 -400664 87899
4727 130410 399931 -98111 -32126 386407 -216589 141255 165791 -8940 -141422 107749 174587
4716 174587 22587 152483 -176864 -243770 59338 117001 117481 -69745 -168289 -265787 -154034
4705 -154034 18625 35118 57013 -122525 -114928 -245784 -41110 -99441 43742 185526 15086
4693 191106 -153143 115430 -229240 190787 -158285 247568 -186897 -244322 99258 24992
4682 127254 -333026 163615 201694 -26244 218531 -119998 53778 -224282 96403 26031 219152
4671 219152 -202569 -80605 -135971 -4262 48983 108557 46526 -121982 -42106 -233025 -33233
4659 343912 39397 -38944 -227759 -11646 115277 -281737 -7332 -73805 39049 328886 -7356
4647 -34562 -15396 100267 103194 109920 -190902 -263624 -79819 -140468 9765 110832 -54834 177928
4634 -114454 83192 111620 13727 54546 235267 -202955 12691 80307 -65983 106005 -188149
4622 -190312 168573 51639 24366 -2948 -318373 -82204 -118609 -153652 126611 -111973 364830
4610 120651 -102563 194864 -126042 102652 -50019 50855 301473 -29925 31557 41500 239208
4599 239208 -64565 104211 142178 -81605 -61084 396662 42227 52816 120529 -137451 -48639
4587 -57415 -62249 207325 238634 31435 -597 153447 337747 -8775 -95880 89100 95537 -100622
4574 16520 -112840 -210245 -51021 196403 132942 -99956 98349 -180155 -118898 18375 478405
4563 478405 -23512 -35375 49404 -34137 69871 -106562 -12918 -145539 167829 44040 4308
4551 -224935 -92985 4748 -63590 -137212 79834 5161 116050 158450 110180 94162 145698 -68562
4538 332867 41471 -171988 -15649 291240 48898 -61851 164608 131873 251653 -68193 17186
4526 -137216 294321 90419 -35683 -40613 -126166 -142787 -637 392375 -92251 -8297 13881 303006
4514 303006 100213 -270725 -78010 -94314 190314 -41409 -634 102547 236489 -116490 -322308
4503 -322308 -66115 -72125 227349 -12509 -8198 -142093 -142878 -161769 -73946 83290 -113706 -19779
4490 86604 -177795 79685 -74157 698 -87704 392432 88605 -24528 -152556 -123361 139190
4478 -71886 71753 216147 -9131 -24000 32937 -138251 150772 201381 67633 -2236 -6619 -27848
$$ [...]
##END NTUPLES=NMR SPECTRUM
##END=
