##TITLE=AC1742_SEN00015_9276387_kIMzPg8PVW
##JCAMPDX= 6.0         $$ Bruker NMR JCAMP-DX V2.0
##DATA TYPE= NMR SPECTRUM
##DATA CLASS= NTUPLES
##ORIGIN= BRUKER
##OWNER= Administrator
$$ 1.72 TOPSPIN		Version 2.1
$$ 2015-07-15 01:53:12.916 -0700  Administrator@X
$$ Compression mode = diff/dup
##.OBSERVE FREQUENCY= 400.02188249412
##.OBSERVE NUCLEUS= ^1H
##.ACQUISITION MODE= SIMULTANEOUS (DQD)
##.ACQUISITION SCHEME= undefined
##.AVERAGES= 64
##.DIGITISER RES= 22
##SPECTROMETER/DATA SYSTEM= spect
##.PULSE SEQUENCE= noesygpps1d.comp
##.SOLVENT NAME= COFFEE_meoh
##.SHIFT REFERENCE= INTERNAL, COFFEE_meoh, 1, 14.96089
##AUDIT TRAIL= $$ (NUMBER, WHEN, WHO, WHERE, PROCESS, VERSION, WHAT)
$$ ##TITLE= Audit trail, TOPSPIN		Version 2.1
$$ ##JCAMPDX= 5.01
$$ ##ORIGIN= Bruker BioSpin GmbH
$$ ##OWNER= Administrator
$$ $$ E:\/data/COFFEE/nmr/AC1742_SEN00015_9276387_kIMzPg8PVW/12/pdata/1/auditp.txt
$$ ##AUDIT TRAIL=  $$ (NUMBER, WHEN, WHO, WHERE, PROCESS, VERSION, WHAT)
(   1,<2015-07-15 01:53:07.947 -0700>,<Administrator>,<X>,<go>,<TOPSPIN 2.1>,
      <created by zg
	started at 2015-07-15 01:41:38.182 -0700,
	POWCHK enabled, PULCHK disabled,
       configuration hash MD5:
       21 0F 79 D6 B3 7B B4 F6 88 20 88 DB 03 48 BD 9F
       data hash MD5: 64K
       FA E0 00 6D 73 EE 78 FF 38 1E 98 C8 44 4E 94 30>)
(   2,<2015-07-15 01:53:11.088 -0700>,<Administrator>,<X>,<proc1d>,<TOPSPIN 2.1>,
      <Start of raw data processing
       efp LB = 0.3 FT_mod = 6 PKNL = 1 PHC0 = 0 PHC1 = 0 SI = 128K 
       data hash MD5: 128K
       74 D5 DA 53 05 94 82 A2 14 42 48 54 21 A1 A8 C4>)
(   3,<2015-07-15 01:53:11.994 -0700>,<Administrator>,<X>,<proc1d>,<TOPSPIN 2.1>,
      <pk PHC0 = -88.11584 PHC1 = 0 
       data hash MD5: 128K
       98 AC 9A 3F 86 17 1C 23 77 17 1B 64 88 F7 0B E0>)
(   4,<2015-07-15 01:53:12.400 -0700>,<Administrator>,<X>,<proc1d>,<TOPSPIN 2.1>,
      <abs ABSG = 1 
       data hash MD5: 128K
       A1 2E EE FE 25 D8 76 21 1F BD DF 7E 51 11 6F 83>)
(   5,<2015-07-15 01:53:12.494 -0700>,<Administrator>,<X>,<proc1d>,<TOPSPIN 2.1>,
      <abs ABSG = 2 
       data hash MD5: 128K
       29 DB 74 A2 49 9E 2A 1C D2 11 60 1E BA E0 BC 2D>)
(   6,<2015-07-15 01:53:12.588 -0700>,<Administrator>,<X>,<proc1d>,<TOPSPIN 2.1>,
      <abs ABSG = 3 
       data hash MD5: 128K
       0A 05 6B EA AC B5 83 2E A7 39 CB 63 44 82 FD 38>)
(   7,<2015-07-15 01:53:12.666 -0700>,<Administrator>,<X>,<proc1d>,<TOPSPIN 2.1>,
      <abs ABSG = 4 
       data hash MD5: 128K
       ED 5C A9 D5 7E 88 49 78 3B C0 5C 59 F6 5A 43 0A>)
(   8,<2015-07-15 01:53:12.744 -0700>,<Administrator>,<X>,<proc1d>,<TOPSPIN 2.1>,
      <abs ABSG = 5 
       data hash MD5: 128K
       C1 8B 32 A6 E0 9E F9 09 6A E7 37 B5 5A 44 2F CD>)
$$ ##END=
$$ 
$$ $$ hash MD5
$$ $$ 45 5F 13 56 35 17 F6 68 11 79 FE 94 53 FB 31 2E
##$RELAX= 
##$RELAX= 
##$RELAX= 
##$RELAX= 
##$RELAX= 
##$RELAX= 
##$RELAX= 
##$RELAX= 
$$ Bruker specific parameters
$$ --------------------------
##$DU= <E:\>
##$EXPNO= 12
$$ [...]
##$TP07= 0
##$TPNAME0= <>
##$TPNAME1= <>
##$TPNAME2= <>
##$TPNAME3= <>
##$TPNAME4= <>
##$TPNAME5= <>
##$TPNAME6= <>
##$TPNAME7= <>
##$TPOAL= (0..7)
0.5 0.5 0.5 0.5 0.5 0.5 0.5 0.5
##$TPOFFS= (0..7)
0 0 0 0 0 0 0 0
##$TUNHIN= 0
##$TUNHOUT= 0
##$TUNXOUT= 0
##$USERA1= <user>
##$USERA2= <user>
##$USERA3= <user>
##$USERA4= <user>
##$USERA5= <user>
##$V9= 5
##$VALIST= <valist>
##$VCLIST= <CCCCCCCCCCCCCCC>
##$VD= 0
##$VDLIST= <DDDDDDDDDDDDDDD>
##$VPLIST= <PPPPPPPPPPPPPPP>
##$VTLIST= <TTTTTTTTTTTTTTT>
##$WBST= 2048
##$WBSW= 25
##$XGAIN= (0..3)
0 0 0 0
##$XL= 0
##$YL= 0
##$YMAX_a= 6400214
##$YMIN_a= -11682085
##$ZGOPTNS= <>
##$ZL1= 120
##$ZL2= 120
##$ZL3= 120
##$ZL4= 120
##$ABSF1= 14.96089
##$ABSF2= -5.597292
##$ABSG= 5
##$ABSL= 3
##$ALPHA= 0
##$AQORDER= 0
##$ASSFAC= 0
##$ASSFACI= 0
##$ASSFACX= 0
##$ASSWID= 0
##$AUNMP= <proc_prof1d_extract.lims>
##$AXLEFT= 0
##$AXNAME= <>
##$AXNUC= <1H>
##$AXRIGHT= 0
##$AXTYPE= 0
##$AXUNIT= <>
##$AZFE= 0.1
##$AZFW= 0.1
##$BCFW= 0
##$BC_mod= 0
##$BYTORDP= 0
##$COROFFS= 0
##$CY= 15
##$DATMOD= 1
##$DC= 0
##$DFILT= <>
##$DTYPP= 0
##$F1P= 0
##$F2P= 0
##$FCOR= 0.5
##$FTSIZE= 131072
##$FT_mod= 6
##$GAMMA= 0
##$GB= 0
##$INTBC= 1
##$INTSCL= 1
##$ISEN= 128
##$LB= 0.3
##$LEV0= 0
##$LPBIN= 0
##$MAXI= 10000
##$MC2= 0
##$MEAN= 0
##$ME_mod= 0
##$MI= 0
##$NCOEF= 0
##$NC_proc= -2
##$NLEV= 6
##$NOISF1= 0
##$NOISF2= 0
##$NSP= 0
##$NTH_PI= 0
##$NZP= 0
##$OFFSET= 14.96089
##$PC= 1
##$PHC0= -88.11584
##$PHC1= 0
##$PH_mod= 1
##$PKNL= yes
##$PPARMOD= 0
##$PPDIAG= 0
##$PPIPTYP= 0
##$PPMPNUM= 2147483647
##$PPRESOL= 1
##$PSCAL= 4
##$PSIGN= 0
##$PYNMP= <proc.py>
##$REVERSE= no
##$SF= 400.02000968232
##$SI= 131072
##$SIGF1= 0
##$SIGF2= 0
##$SINO= 400
##$SIOLD= 131072
##$SPECTYP= <>
##$SREGLST= <1H.CDCl3>
##$SSB= 0
##$STSI= 131072
##$STSR= 0
##$SW_p= 8223.68421052631
##$SYMM= 0
##$S_DEV= 0
##$TDeff= 65536
##$TDoff= 0
##$TI= <>
##$TILT= no
##$TM1= 0
##$TM2= 0
##$TOPLEV= 0
##$USERP1= <user>
##$USERP2= <user>
##$USERP3= <user>
##$USERP4= <user>
##$USERP5= <user>
##$WDW= 1
##$XDIM= 131072
##$YMAX_p= 403585652
##$YMIN_p= -11450
##$CURPLOT= <Network HP LaserJet P1505>
##$CURPRIN= <$Network HP LaserJet P1505>
##$DFORMAT= <normdp>
##$LAYOUT= <+/1D_H.xwp>
##$LFORMAT= <normlp>
##$PFORMAT= <normpl>
##$SURQMSG= 1
$$ End of Bruker specific parameters
$$ ---------------------------------
##NTUPLES= NMR SPECTRUM
##VAR_NAME=  FREQUENCY,     SPECTRUM/REAL,   SPECTRUM/IMAG
##SYMBOL=    X,             R,               I
##VAR_TYPE=  INDEPENDENT,   DEPENDENT,       DEPENDENT
##VAR_FORM=  AFFN,          ASDF,            ASDF
##VAR_DIM=   131072,        131072,          131072
##UNITS=     HZ,            ARBITRARY UNITS, ARBITRARY UNITS
##FACTOR=    0.0627417313425164, 1,          1
##FIRST=     8223.62146879497, 3635,         -54578
##LAST=      0,             5832,            -54715
##MIN=       0,             -11450,          0
##MAX=       8223.62146879497, 403585652,    0
$$ Real data points
##PAGE= N=1
##DATA TABLE= (X++(R..R)), XYDATA
$$ [...]
61685C92986j549j970k553l041l725m627n097m652l703k917k296j587j062j105
61671C53102j348j064l43J1k77n72l57J50N22P11Q35R28J054J363J896K617L480
61654C62708M174M057K888J453P80Q94J030R08R51J297J552J659K121L085L950
61639C93507M202L896L142J904N56j34m2M1m59j225j825k380k985l288l202l306
61623C88402l921m472m434m149l996l453k032m96j1m48o96m67o14j554k503k654
61607C52502k225j904j913k143k636l441m236m593m512m387m477m620m449l790
61593C03176k845k001j471j231j252j581k010k021j404p41q49j724k417k128j088
61578B78413k27j36o27j131j305j143p42j63M43Q35Q95P05L50j32m37n1J029J931
$$ plain form
61685 392986 391437 389467 386914 383873 380148 375521 370424 365772 362069 359152 356856 355269 354207 353102
61671 353102 351754 350690 350347 350358 350081 349509 349152 349302 349824 350535 351370 352298 353352 354715 356611 359228 362708
61654 362708 366882 370939 373827 375280 376060 376954 377984 378892 379843 381140 382692 384351 386472 389557 393507
61639 393507 397709 401605 404747 406651 407207 407073 407031 407072 406613 405388 403563 401183 398198 394910 391708 388402
61623 388402 384481 380009 375575 371426 367430 363977 361945 361449 361438 360990 360294 359827 359213 357659 355156 352502
61607 352502 350277 348373 346460 344317 341681 338240 334004 329411 324899 320512 316035 311415 306966 303176
61593 303176 300331 298330 296859 295628 294376 292795 290785 288764 287360 286619 285770 284046 281629 279501 278413
61578 278413 278186 278050 277423 276292 274987 273844 273102 272939 273382 274217 275112 275817 276167 276035 275598 275547 276576 278507
61560B78507J818J025O10Q72J060O78K43L92R50J399J721K160K541K482J992J357
61544B99807O50j42p25p46k83L77J180K064K586K355J635R60L18n85j449j560
61528C06442r02l02l04n54o20o66r46j179r73n38m00o13p75o76n09m63m99n37
61510B94986n74n72m86l79l15k02L0J14k52q22r17l43K83M84P32J722L077L560
61492C00126K634J113N6l54m63l30J01M62L37j8R8R15K038L013L527L239K147
61475C18641J041Q58J514K048J978J736J607J142Q8r47j283j052p42l74J73N31
61459C26959K47m11p44n46j73J20L63M96M08K86M66Q55J044R40Q94J102J285J162
61441C34753Q98Q76J202J580J646J301P58K92N5J22N29J033J080M06m33o19j35
$$ plain form
61560 278507 280325 281350 281960 282832 283892 284570 284813 285205 286155 287554 289275 291435 293976 296458 298450 299807
61544 299807 300457 300315 299590 298844 298561 298938 300118 302182 304768 307123 308758 309718 310036 309451 308002 306442
61528 306442 305540 305238 304934 304380 303760 303094 302148 300969 299996 299458 299058 298445 297670 296994 296485 296022 295523 294986
61510 294986 294412 293840 293354 292975 292660 292458 292488 292602 292350 291528 290611 290268 290551 291035 291767 293489 296566 300126
61492 300126 302760 303873 303929 303575 303112 302782 302883 303345 303682 303664 303762 304677 306715 309728 313255 316494 318641
61475 318641 319682 320540 322054 324102 326080 327816 329423 330565 330653 329706 328423 327371 326629 326255 326428 326959
61459 326959 327206 326795 326051 325505 325332 325452 325815 326311 326719 327005 327471 328326 329370 330310 331204 332306 333591 334753
61441 334753 335651 336527 337729 339309 340955 342256 343014 343306 343361 343483 344012 345045 346125 346531 346098 345479 345344
61424C45344L01L99O52J362K035K174K000J861J582J015O43Q12Q98J18j106j613
61408C58477j164o78p80j032q55m41k89m50o28p36r42j313j665j725j394r36p52
61391C42697q40p20r7O48J032J168J422J633J390Q98Q41J343J778J732J506J476
61375C57907J609J848K359L026L265K802K178K029K234K282K178K372K850K932
61361C91871K196J169P94J329K163K659K936L532M560N567O187O523O722O625
61347D44833O133N478M822L909K591J409J057J486K013K285K474K589K292J522
61333D84893P17K01k21q15j545k282k997l511l496l000k589k646k857k675j995
61318D55182j079n9J032J949K361K355K469L129M260N528O807Q217R681J0747
$$ plain form
61424 345344 345645 346044 346696 348058 350093 352267 354267 356128 357710 358725 359368 360180 361078 361196 360090 358477
61408 358477 357313 356635 355855 354823 353968 353527 353238 352788 352160 351424 350482 349169 347504 345779 344385 343449 342697
61391 342697 341857 341137 341040 341688 342720 343888 345310 346943 348333 349231 350072 351415 353193 354925 356431 357907
61375 357907 359516 361364 363723 366749 370014 372816 374994 377023 379257 381539 383717 386089 388939 391871
61361 391871 394067 395236 396030 397359 399522 402181 405117 408649 413209 418776 424963 431486 438208 444833
61347 444833 450966 456444 461266 465175 467766 469175 470232 471718 473731 476016 478490 481079 483371 484893
61333 484893 485610 485811 485590 484775 483230 480948 477951 474440 470944 467944 465355 462709 459852 457177 455182
61318 455182 454103 454044 455076 457025 459386 461741 464210 467339 471599 477127 483934 492151 501832 512579
61304E12579J1029J0818J0795J1053J0737R018O173L311J182l05j451k244k665
61291E80030k979l449l975m342m611n022n593o022o031n685n361n354n483n172
61277E10951m108k685j628j137o73L17J579K172J462n1j045o21Q21K183L013L846
61261E14396N146O519P258P284P028O700O164N327M272L110K092J654J885K102
61247E80937J489P4j374k324k901l418l934m311m321l772k872k307k511l070l328
61232E42057l304l333l101j893J85K090L129L592L849L729L137K621K713L238
61218E58709L761M306N136O102O712O744O431O123N923N590M725L326K087J746
61204F27421K153K486K490K881M240O102P583Q461R155R995J0985J2064J3044
$$ plain form
61304 512579 523608 534426 545221 556274 567011 576029 582202 585513 586695 586390 584939 582695 580030
61291 580030 577051 573602 569627 565285 560674 555652 550059 544037 538006 532321 526960 521606 516123 510951
61277 510951 506843 504158 502530 501393 500720 501037 502616 504788 506250 506199 505154 504533 505354 507537 510550 514396
61261 514396 519542 526061 533319 540603 547631 554331 560495 565822 570094 573204 575296 576950 578835 580937
61247 580937 582426 582500 581126 578802 575901 572483 568549 564238 559917 556145 553273 550966 548455 545385 542057
61232 542057 538753 535420 532319 530426 530611 532701 535830 539422 543271 547000 550137 552758 555471 558709
61218 558709 562470 566776 571912 578014 584726 591470 597901 604024 609947 615537 620262 623588 625675 627421
61204 627421 629574 632060 634550 637431 641671 647773 655356 663817 672972 682967 693952 706016 719060
61191G19060J3367J2480J0560Q514P071O027M600K450J47j491k340k947l641m172
61177G69685m450n012o196p341p607p358p817r292j0667j0857j0055r190q763
61164F65080q720q979r567j0446j1432j2114j1911j0586q731p272o365n373l961
61151E49623k596j694r64K7J050J397N65j415l930n933o653o347n928n763n432
61136E06007m715m003l401k302m00J573K754L314M020N121O268P302Q455R902
61122E39895J1530J3026J4045J4509J4929J6020J7801J9518K0633K1314K1761
61111G24981K1748K1252K0822K0779K0613J9691J8054J5999J3464J0456P501N006
61099I20366K604j81l125n712p927r997j1800j3277j4836j6672j8059j8219j7493
$$ plain form
61191 719060 732427 744907 755467 763981 771052 777079 781679 784129 784276 782785 780445 777498 773857 769685
61177 769685 765235 760223 754027 746686 739079 731721 723904 714612 703945 693088 683033 673843 665080
61164 665080 656360 647381 637814 627368 615936 603822 591911 581325 572594 565322 558957 553584 549623
61151 549623 547027 545333 544369 544396 545446 546843 547408 545993 542063 536130 529477 523130 517202 511439 506007
61136 506007 501292 497289 493888 491586 491186 492759 495513 498827 502847 507968 514236 521538 529993 539895
61122 539895 551425 564451 578496 593005 607934 623954 641755 661273 681906 703220 724981
61111 724981 746729 767981 788803 809582 830195 849886 867940 883939 897403 907859 915360 920366
61099 920366 922970 922789 919664 913952 906025 896028 884228 870951 856115 839443 821384 803165 785672
61086G85672j6815j6424j5930j5338j4905j4229j2588j0310q713q431q558p870
61074F35561o189m218k547j293l99J50M61Q96J921L606N344O378O669O830P224
61059F60394P708Q337R553J1308J2830J3740J4603J5848J6973J7609J8455K0163
61047H27521K2052K3070K3561K4782K7008K9206L0573L1346L2215L3673L5821
61036A140828L8162L9861M0842M2088M4163M6278M7741M9466N2625N6631N9924
61025A658609O2185O4135O5787O6860O8494P2414P8494Q5189R2255J00791J10525
61014B525738J19754J28587J39840J55983J77641K05980K43694K92182L50332
61005D339731M17979M98268N95415P13723Q61001J047222J272229J514760J737177
$$ plain form
61086 785672 768857 752433 736503 721165 706260 692031 679443 669133 660420 651989 643431 635561
61074 635561 629372 625154 622607 621314 620915 621065 621526 622422 624343 627949 633293 639671 646340 653170 660394
61059 660394 668102 676439 685992 697300 710130 723870 738473 754321 771294 788903 807358 827521
61047 827521 849573 872643 896204 920986 947994 977200 1007773 1039119 1071334 1105007 1140828
61036 1140828 1178990 1218851 1259693 1301781 1345944 1392222 1439963 1489429 1542054 1598685 1658609
61025 1658609 1720794 1784929 1850716 1917576 1986070 2058484 2136978 2222167 2314422 2415213 2525738
61014 2525738 2645492 2774079 2913919 3069902 3247543 3453523 3697217 3989399 4339731
61005 4339731 4757710 5255978 5851393 6565116 7426117 8473339 9745568 11260328 12997505
60996A2997505J897219J947412J830131J500821R82508L97573p8140l16797l07312
60987B0850920j35356Q6337K59232K94439J15426k97099q61048j415945j810540
60978A7086366j980018j952488j799909j589972j368728j162639r82575q28063
60970E421974o94474n78739m79651l95934l26200k69612k25111j90674j64045
60961B097534j43442j27134j13314j00988r0169q0754p1995o3461n5580m8822
60951A201875m3087l8255l4569l2126l0634k9937k9962l0006k9090k7276k5676
60940H51257k4703k3448k1305j9147j8071j7866j7599j7013j6391j5630j4439
60929F45645j3113j2230j1717j0978r823q658p878p512p375p170o624n801n059
$$ plain form
60996 12997505 14894724 16842136 18672267 20173088 21155596 21553169 21475029 21158232 20850920
60987 20850920 20715564 20801901 21061133 21355572 21470998 21173899 20312851 18896906 17086366
60978 17086366 15106348 13153860 11353951 9763979 8395251 7232612 6250037 5421974
60970 5421974 4727500 4148761 3669110 3273176 2946976 2677364 2452253 2261579 2097534
60961 2097534 1954092 1826958 1713644 1612656 1522487 1441733 1369738 1306277 1250697 1201875
60951 1201875 1158788 1120533 1085964 1053838 1023204 993267 963305 933299 904209 876933 851257
60940 851257 826554 803106 781801 762654 744583 726717 709118 692105 675714 660084 645645
60929 645645 632532 620302 608585 597607 587784 579126 571248 563736 556361 549191 542567 536766 531707
60916E31707m451l603k421j413r10n57l1L28K07N3L81Q15O93K13J04M14O22O52
60898E22803Q66J043M72q62k072k609k851l250l713m087m576n289n996o578p160
60883D76141p577p424o874o644o847o709n899n208n317n656n397m767m475m354
60869C92993l713k629j782j180k11J036J674J479J413K260L515M097L617K531
60855D05100J644J663K712L941M248L652L358M063M956M859L764K557J780J342
60841D49639J069Q17K75o52j525j948k276l014l865m107l768l539l588l400k868
60826D17250k599k821k864k279j682j824k339k269j526j050j539k713l895m733
60812C83117n127m998m509m195m408m723m360l281k426k570l308l593l128k592
$$ plain form
60916 531707 527256 523653 521232 519819 518909 518352 518321 518649 518856 518909 519290 520105 520798 521011 521115 521529 522151 522803
60898 522803 523669 524712 525184 524322 522250 519641 516790 513540 509827 505740 501164 495875 489879 483301 476141
60883 476141 468564 461140 454266 447622 440775 434066 428167 422959 417642 411986 406589 401822 397347 392993
60869 392993 389280 386651 384869 383689 383478 384514 386188 387667 389080 391340 394855 398952 402569 405100
60855 405100 406744 408407 411119 415060 419308 422960 426318 430381 435337 440196 443960 446517 448297 449639
60841 449639 450708 451525 451800 451148 449623 447675 445399 442385 438520 434413 430645 427106 423518 420118 417250
60826 417250 414651 411830 408966 406687 405005 403181 400842 398573 397047 395997 394458 391745 387850 383117
60812 383117 377990 372992 368483 364288 359880 355157 350797 347516 345090 342520 339212 335619 332491 329899
60798C29899k460k293j569o37k23l70n21m75n36p44o88k16K80M84N58O77P31P16
60780C22613R63J624K264K410K151J873J719J721K087K830L316K849J694R73J388
60765C52475K446L107K901K149J381Q13L77p6o45j344k030k398k216j640j166
60750C54134j126j294j244r42p73q98r83p18l58n38j562l093m390m830m290l258
60734C23837k505k499l065l616l662l071k090j165o79o66q06p80n78m84p22j201
60718B96248j537j333n29N62J585K392K895K878K200J203N02M08P24J188J768
60703C11154K477L105L323K991K285J689J699K383L165L372K910K205J552R39
60689C45249M87M85Q62J064P59K54j1o7j72l53m68n42o81q43r34r59q70n61j70
$$ plain form
60798 329899 327439 325146 323577 322940 322717 322347 321826 321351 320815 320071 319383 319167 319447 319931 320489 321166 321897 322613
60780 322613 323576 325200 327464 329874 332025 333898 335617 337338 339425 342255 345571 348420 350114 351087 352475
60765 352475 354921 358028 360929 363078 364459 365272 365649 365573 364928 363584 361554 359156 356940 355300 354134
60750 354134 353008 351714 350470 349528 348755 347857 346874 346156 345798 345260 343698 340605 336215 331385 327095 323837
60734 323837 321332 318833 315768 312152 308490 305419 303329 302164 301485 300819 300013 299233 298655 298171 297449 296248
60718 296248 294711 293378 292849 293411 294996 297388 300283 303161 305361 306564 307066 307474 308198 309386 311154
60703 311154 313631 316736 320059 323050 325335 327024 328723 331106 334271 337643 340553 342758 344310 345249
60689 345249 345736 346221 347083 348147 348906 349160 349149 349082 348910 348557 348089 347547 346866 346023 345089 344130 343260 342699 342529
60670C42529j03m64q77j110j508k342l071k900j891r72q29j267j694j718j279
60655C20504n57Q3M08O57J242K137K844L003K756K436K240K216K235J899Q44p32
60639C44215k116k862l230l613l878l573k672j707j150r34o71j90K89M58K24k21
60623C18369n85o79n17l71n23r31j150q24j36M43P89J147J503J379N68l64o94
60606C17424m29j29l2J72O65J125J151P46K33j7K88J228K418L151L065K497K031
60589C35587J870J856J925K138K361K208J549P02K7m88r67j195p81K16J203J767
60573C49978K132K741L613M473N308O417P881R321J0281J0651J0587J0227R546
60560D43156Q382O598M306J899l20k378m317n757o171n533m358l046j599n1J329
$$ plain form
60670 342529 342426 341962 341085 339975 338467 336125 333054 330154 328263 327291 326462 325195 323501 321783 320504
60655 320504 319947 320030 320438 321095 322337 324474 327318 330321 333077 335513 337753 339969 342204 344103 344947 344215
60639 344215 342099 339237 336007 332394 328516 324943 322271 320564 319414 318480 317809 317619 317908 318366 318590 318369
60623 318369 317784 317105 316588 316217 315694 314763 313613 312789 312653 313096 313885 315032 316535 317914 318482 318118 317424
60606 317424 316995 316866 316834 317006 317671 318796 319947 320693 320926 320909 321197 322425 324843 327994 331059 333556 335587
60589 335587 337457 339313 341238 343376 345737 347945 349494 350196 350223 349735 348768 347573 346792 347008 348211 349978
60573 349978 352110 354851 358464 362937 368245 374662 382543 391864 402145 412796 423383 433610 443156
60560 443156 451538 458136 462442 464341 464021 461643 457326 451569 445398 439865 435507 432461 430862 430811 432140
60545D32140K422L481M691N819O600P197Q025R304J1023J3034J4960J6267J6706
60532E51669J6545J6052J4950J2741R432N635J905j638n022p919r755j0297j0027
60519E84271r670r391q710p419o084n217m421l056j468n96m02J74J475K501K719
60504E34706L361N931J0129J4326J7656K0514K3331K6022K8635L1431L4108L5853
60492G86003L6411L6373L6079L4926L2172K7891K2772J7374J1911O358M59o147
60480A042582j3446k0866k7720l3664l8638m2551m5115m5909m4637m1558l7555
60469F50923l3540k9800k6193k2764j9778j7279j5108j3330j2121j1218j0036
60458D39756q481p118o351n914n380m737m174l681l205k869k728k587k323k143
$$ plain form
60545 432140 434562 438043 442734 448553 455153 462350 470375 479679 490702 503736 518696 534963 551669
60532 551669 568214 584266 599216 611957 621389 627024 628929 627291 622269 614350 604595 594298 584271
60519 584271 574601 565210 556500 549081 542997 537780 533359 530303 528835 528239 527837 528011 529486 531987 534706
60504 534706 538067 543998 554127 568453 586109 606623 629954 655976 684611 716042 750150 786003
60492 786003 822414 858787 894866 929792 961964 989855 1012627 1030001 1041912 1048270 1048729 1042582
60480 1042582 1029136 1008270 980550 946886 908248 865697 820582 774673 730036 688478 650923
60469 650923 617383 587583 561390 538626 518848 501569 486461 473131 461010 449792 439756
60458 439756 431275 424157 417806 411892 406512 401775 397601 393920 390715 387846 385118 382531 380208 378065
60444C78065k209k221j730q13q3k9n34j060j188r57p52q98j374j879k092j812
60428C58434j100l65j57n73j031r23l60L9Oj58j90j78j91k7M81J176J735J905
60410C58523J543P29n6k46J76O04N46K31K23P28J450J996K218K221K248K449K714
60393C78297K788K561K189J940K023K478L051L260K882K250J874J754J491J006
60379D09844P69J144J914K583K905K931K788K545K215J748J184Q28R72J423J563
60364D37356J054K18l72m60o5P35J747K496K533J956J478J823L050M488N371N498
60348D68906N221M851M356L679L007K474J773M96j234k766l559l541l032k479
60334D78152k263k421k667k801k938l063k794j996j351j722k988m132m397l869
$$ plain form
60444 378065 375856 373635 371905 371092 371009 370980 370446 369386 368198 367241 366489 365591 364217 362338 360246 358434
60428 358434 357334 356969 356812 356239 355208 354285 353925 353964 353970 353812 353622 353444 353253 353226 353707 354883 356618 358523
60410 358523 360066 360795 360739 360493 360669 361273 361819 362050 362273 363001 364451 366447 368665 370886 373134 375583 378297
60393 378297 381085 383646 385835 387775 389798 392276 395327 398587 401469 403719 405593 407347 408838 409844
60379 409844 410613 411757 413671 416254 419159 422090 424878 427423 429638 431386 432570 433398 434370 435793 437356
60364 437356 438410 438628 438256 437796 437731 438466 440213 442709 445242 447198 448676 450499 453549 458037 463408 468906
60348 468906 474127 478978 483334 487013 490020 492494 494267 494763 493529 490763 487204 483663 480631 478152
60334 478152 475889 473468 470801 468000 465062 461999 459205 457209 455858 454136 451148 447016 442619 438750
60320D38750k976j986j073l35M17J457K739M018N301O640P642P903P857Q456R862
60305D94672J1228J1971J2447J3059J3477J3219J2258J0596P876M042j58m004
60293F00683p657j1506j4969j6770j6361j4463j2199j0195q551p192o015m960
60281D69845m077l530l435l680l843l425k452j689j889k828l533l500l168l087
60267D25709l161k966k401j732j340j587k491l392l421k550j637j284j137o84
60253C95926q3K31K66L31N38Q91J468K094K253J735J015N85L61J32M2J80K09k9
60235D08145p8M35J109J417J536J846K100J918J674J978K584K717K372K290K747
60220D34790L248L482L712M118M473M677M911N219N478N860O663P661Q266Q418
$$ plain form
60320 438750 435774 433788 432715 432380 432797 434254 436993 441011 446312 452952 460594 468497 476354 484810 494672
60305 494672 505900 517871 530318 543377 556854 570073 582331 592927 600803 604845 604687 600683
60293 600683 593026 581520 566551 549781 533420 518957 506758 496563 488012 480820 474805 469845
60281 469845 465768 462238 458803 455123 451280 447855 445403 443714 441825 438997 435464 431964 428796 425709
60267 425709 422548 419582 417181 415449 414109 412522 410031 406639 403218 400668 399031 397747 396610 395926
60253 395926 395843 396074 396340 396671 397209 398100 399568 401662 403915 405650 406665 407250 407611 407743 407785 407965 408174 408145
60235 408145 408067 408502 409611 411028 412564 414410 416510 418428 420102 422080 424664 427381 429753 432043 434790
60220 434790 438038 441520 445232 449350 453823 458500 463411 468630 474108 479968 486631 494292 502558 510976
60206E10976Q565Q675Q117O772N460M808M435L777L104L007L286L085K043P43
60192E76853m2j56l9j41n58j174k031l260m614n379n110m320l998m453n076n208
60176E31294m838m317l814l291k737k170j626j194r61q78q88j154j830k598k784
60161D96214k024o42O12J084N49n57j339j199m02M01J049J750K282K018Q97l11
60145E00382r14q86m04N69J765K435K251J960K470L603M415M525M516M982N757
60130E37426O237O002N077L916L143K999K950K284J192P72J666L018L341K264
60116E82287R37O38J423K357K783K800K666K232J194l47j843k750k885k555k356
60101E86581k750l530l989l718l100k734k608k227j418n72j3L92Q53J262J420
$$ plain form
60206 510976 519541 528216 536333 543105 548565 553373 557808 561585 564689 567696 570982 574067 576110 576853
60192 576853 576811 576655 576616 576475 575917 574743 572712 569452 564838 559459 554349 550029 546031 541578 536502 531294
60176 531294 526456 522139 518325 515034 512297 510127 508501 507307 506346 505468 504580 503426 501596 498998 496214
60161 496214 494190 493548 494160 495244 495793 495236 493897 492698 492296 492697 493746 495496 497778 499796 500693 500382
60145 500382 499468 498582 498178 498747 500512 502947 505198 507158 509628 513231 517646 522171 526687 531669 537426
60130 537426 543663 549665 554742 558658 561801 564800 567750 570034 571226 571998 573664 576682 580023 582287
60116 582287 583224 583862 585285 587642 590425 593225 595891 598123 599317 598970 597127 594377 591492 588937 586581
60101 586581 583831 580301 576312 572594 569494 566760 564152 561925 560507 559935 559922 560314 561167 562429 563849
60086E63849J355J201R34M83n9o04j282k209l177l804m011m084m232m410m618
60071E35332n067n806o416o437n964n536n395n288n053m920m976m776m009l192
60057D62497l056l373l100j839l91M10P26J142J636J790J698J920K661L503M108
60042D70332M629N288N949O288O192N751N040M047K865J774J035N45j57j339k662
60027E15577l573m041m486n011n196m865m482m524m979n741o960q449r367r092
60013D34811q074p102o142m714l128k280k257k108j331o13o99j258j522j410j364
59998C90809j383r19K68J711K774L247L366L415L426L252K917K788L189L812L855
59983D26527K925J685J182J660K239J885M61j291k633l413l850m045l957l666
$$ plain form
60086 563849 565204 566405 567339 567822 567763 567159 565877 563668 560491 556687 552676 548592 544360 539950 535332
60071 535332 530265 524459 518043 511606 505642 500106 494711 489423 484370 479450 474474 469698 465689 462497
60057 462497 459441 456068 452968 451129 450738 451148 451874 453016 454652 456442 458140 460060 462721 466224 470332
60042 470332 474961 480249 486198 492486 498678 504429 509469 513516 516381 518155 519190 519735 519578 518239 515577
60027 515577 512004 507963 503477 498466 493270 488405 483923 479399 474420 468679 461719 453270 443903 434811
60013 434811 426737 419635 413493 408779 405651 403371 401114 399006 397675 397062 396363 395105 393583 392173 390809
59998 390809 389426 388507 388775 390486 393260 396507 399873 403288 406714 409966 412883 415671 418860 422672 426527
59983 426527 429452 431137 432319 433979 436218 438103 438564 437273 434640 431227 427377 423332 419375 415709
59969D15709l346k998k481j785j125o43l02k0K94P45J278J474R94J35l94l06R9
59952D07328N70J125J604J690J573J833K396K349J284L0m93m58m77m77q6M02L88
59935D20581l3k72k01j03L7M17Q76J244J900L134M312M648M508M865N679N897
59919D57489N032L645K225P14p85j777k112k017j383k1J359J636R03M17P05R21
59903D66951M73j1N1K28P5K7N01J106J514K170L319M270M480M519M989N396N167
59886E05225M956N688O918P383O804N940N206M431L778L719M121M403M561M932
59872E78065N084M033J779m52j802k701l825m968n485n208m549l984l752l716
59858E48519l384k509j617j393j486o67J539M100N719O277O460O587O468O124
$$ plain form
59969 415709 412363 409365 406884 405099 403974 403331 403029 403009 403303 404048 405326 406800 407794 407929 407535 407229 407328
59952 407328 407898 409023 410627 412317 413890 415723 418119 420468 421752 421782 421289 420831 420354 419877 419791 420193 420581
59935 420581 420548 420276 420075 419972 420009 420426 421302 422546 424446 427580 431892 436540 441048 445913 451592 457489
59919 457489 462521 466166 468391 469105 468320 466543 464431 462414 461031 461010 462369 464005 464908 465325 466030 466951
59903 466951 467424 467413 467464 467692 467767 467794 468295 469401 470915 473085 476404 480674 485154 489673 494662 500058 505225
59886 505225 510181 515869 522787 530170 536974 542914 548120 552551 556329 560048 564169 568572 573133 578065
59872 578065 583149 587182 588961 588509 586707 584006 580181 575213 569728 564520 559971 555987 552235 548519
59858 548519 545135 542626 541009 539616 538130 537463 539002 543102 548821 555098 561558 568145 574613 580737
59844E80737N819N365M131J987k06j360j163j18J152K205K633K067N68j314l086
59829E99417m667o027o761o409n112l587k503k075k168k415k379k057k083l029
59815E48145m453n262n050m500m359m568m700m606m286l657k829k227k024j899
59801D93725j618j419j462j402r78n68n85p83p30n89q16j308j567j465j211p15
59785D76509K33J234J439O17m42q40m98nJ45JMM87J242J713J687J556J713J937
59767D88732J746J175Q10J124K047L042L402K800J779J413K118L125L581L682
59753E20576M129M902N354N366N490N905O093N777N415N440N508N004L903K819
59739E91681K324K491K866K821K120J228Q52J140J614J894K040K090J715P17l94
$$ plain form
59844 580737 586556 591921 596052 598039 597833 596473 595310 595192 596344 598549 601182 603249 603817 602503 599417
59829 599417 594750 588723 581962 575553 570441 566854 564351 562276 560108 557693 555314 553257 551174 548145
59815 548145 543692 538430 533380 528880 524521 519953 515253 510647 506361 502704 499875 497648 495624 493725
59801 493725 492107 490688 489226 487824 486846 486278 485693 484910 484180 483591 482775 481467 479900 478435 477224 476509
59785 476509 476742 477976 479415 480032 479590 478750 478252 478247 478392 478393 478397 478884 480126 481839 483526 485082 486795 488732
59767 488732 490478 491653 492463 493587 495634 498676 502078 504878 506657 508070 510188 513313 516894 520576
59753 520576 524705 529607 534961 540327 545817 551722 557815 563592 569007 574447 579955 584959 588862 591681
59739 591681 594005 596496 599362 602183 604303 605531 606383 607523 609137 611031 613071 615161 616876 617593 617199
59724F17199p65j59P04Q74J35q22j224j091j115j733k590l088l102k882k514j890
59708E95937j124n66l84l63j22O45J940L241L715L149K515L076M929O818P523
59693F30929O983O013N292M835M057K270n24l217m401l849k793k491k937l354
59679F36813l479l699m101m226l966m034n065o632p642p535o613n338l879k418
59665E68186j372r66r24q68p64p11n82k11L14Q72J585K492L249L609L906M486
59649E82301M910M452L192J883P94m57j917l142m159n541p117p700o837n793n888
59634E48981o510n998m086k307j950k606l042k703j987j466j374j680k375l423
59620E07474m483m937m507l756l495l762l902l652l461l548l393k554j353k98
$$ plain form
59724 617199 616434 616275 616979 617853 617988 617166 615942 614851 613736 612003 609413 606325 603223 600341 597827 595937
59708 595937 594813 594247 593863 593500 593378 594023 595963 599204 602919 606068 608583 611659 616588 623406 630929
59693 630929 637912 643925 649217 654052 658109 660379 659855 656638 652237 648388 645595 643104 640167 636813
59679 636813 633334 629635 625534 621308 617342 613308 608243 601611 593969 586434 579821 574483 570604 568186
59665 568186 566814 565848 564924 564056 563292 562581 561999 561788 562102 562974 564559 567051 570300 573909 577815 582301
59649 582301 587211 591663 594855 596738 597532 597075 595158 592016 587857 582316 575199 567499 560662 554869 548981
59634 548981 542471 536473 532387 530080 528130 525524 522482 519779 517792 516326 514952 513272 510897 507474
59620 507474 502991 498054 493547 489791 486296 482534 478632 474980 471519 467971 464578 462024 460671 460373
59606D60373N82J340J694J543J325J285J008L17j15K59Q50Q64O51J037J731J676
59590D76420Q21K96O82J191R27J12m12l37j12k94r75j725k156k548l482m695m969
59573D58744l728k094j478j747j783j405j408j881j875j032k72m10j060j440j412
59558D35719j214q04j69L29M41N23J054J909K478K459K221K450L399M487M859
59543D60141M508M485N673P754R897J1982J4360J6704J8007J7526J4941R903K684
59530E98565m723r472j0414r035p452o259m765k613m37Q13Q38L25L02R26J160
59515E47759J64j448k528l126m176n637o332n861n270n383n716n647n497n601
59501D85701n363m243k908k377k514k335j489n31N3L97Q73J636K455K792K286
$$ plain form
59606 460373 460955 462295 463989 465532 466857 468142 469150 469467 469352 469611 470461 471325 471976 473013 474744 476420
59590 476420 477241 477537 478219 479410 480337 480449 480037 479700 479588 479294 478319 476594 474438 471890 468408 463713 458744
59573 458744 455016 452922 451444 449697 447914 446509 445101 443220 441345 440313 440041 439631 438571 437131 435719
59558 435719 434505 433701 433532 433861 434302 434825 435879 437788 440266 442725 444946 447396 450795 455282 460141
59543 460141 464649 469134 474807 482561 492458 504440 518800 535504 553511 571037 585978 595881 598565
59530 598565 593842 584370 573956 564921 557469 551210 546445 543832 543395 544208 545046 545371 545673 546599 547759
59515 547759 547923 546475 543947 540821 536645 531008 524676 518815 513545 508162 502446 496799 491302 485701
59501 485701 480338 476095 473187 470810 468296 465961 464472 463941 463994 464391 465264 466900 469355 472147 474433
59486D74433J340Q61J226K036K911L842M535M381L577L396M561O095O592O009
59472E25795N289M771M024K889J681M72q87k075k507k270k005j796r53P92K689
59457E35909L914M566N244O061O601O743O889P342P760P563O650N479M472L593
59443F18786K510R44j218l759n962p009o855o325o025n627m675l611l229l455
59429E64490l545l209k709j999p85O21J541K234L817O594R444J1301J2403J3586
59415F13784J5180J7119J9429K1925K3968K4820K3773J9794J2155J992p602j3844
59403G72493j6078j5032j1318n544R49O641J0743J2731J1479O059k619j1773j8564
59390G40167k1614k1208j8711j5677j2866j0022o835l773j591l44N36J387K080
$$ plain form
59486 474433 475773 476634 477860 479896 482807 486649 491184 495565 499142 502538 507099 513194 519786 525795
59472 525795 531084 535855 539879 542768 544449 544921 544034 541959 539452 537182 535177 533381 532428 533220 535909
59457 535909 539823 544389 549633 555694 562295 569038 575927 583269 591029 598592 605242 610721 615193 618786
59443 618786 621296 622240 621022 617263 611301 604292 597437 591112 585087 579460 574785 571174 567945 564490
59429 564490 560945 557736 555027 553028 552243 552864 554405 556639 560456 567050 576494 587795 600198 613784
59415 613784 628964 646083 665512 687437 711405 736225 759998 779792 791947 793939 786337 772493
59403 772493 756415 741383 730065 724521 725470 732111 742854 755585 767064 773123 770504 758731 740167
59390 740167 718553 697345 678634 662957 650091 640069 633234 629461 627870 627526 628062 629449 631529
59377F31529K418K319J760Q89J05l02l93k80L1K96Q1n55q86m65J88L22n5l69j91
59358F36442N87J947L534M747N424O067P000P869Q432R197J0616J2169J3017J3166
59344G40214J3224J3340J3165J2666J2189J1775J1032R642P587M956J977r39l454
59331H47374n512p081q110q890r956j1316j2278j2380j1912j1219j0250r229q911
59318G20330r481j0015r746r187r185r528r471q963q409p708o587n432m755m186
59304F07677k963j048J162L768O915R850J1457J1414R732N788o81p889j2935j4720
59290F27527j4620j4162j3381j1849r904q081o326m456k736j407k37R77K008K672
59276E46025L257M094N113O058O849P635Q673J0151J1715J2464J1899J0620R475
$$ plain form
59377 631529 633947 636266 638026 638915 639020 638718 638325 638045 638076 638372 638453 637898 637012 636547 636735 637057 637002 636633 636442
59358 636442 637029 638976 642510 647257 652681 658748 665748 673617 682049 691246 701862 714031 727048 740214
59344 740214 753438 766778 779943 792609 804798 816573 827605 837247 844834 849790 851767 850828 847374
59331 847374 841862 834781 826671 817781 807825 796509 784231 771851 759939 748720 738470 729241 720330
59318 720330 710849 700834 691088 681901 672716 663188 653717 644754 636345 628637 622050 616618 611863 607677
59304 607677 604714 603666 604828 608596 615511 625361 636818 648232 657964 663752 663071 655182 642247 627527
59290 627527 612907 598745 585364 573515 563611 555530 549204 544748 542012 540605 540368 541345 543353 546025
59276 546025 549282 553376 558489 564547 571396 579031 587704 597855 609570 622034 633933 644553 654028
59263F54028Q273O237L518J223r7r95j965k741l099l400l926m332m262l930l680
59248F40852l449l034k464j811r62J53J392K573L574M303M878N684O815P666P624
59233F73794O908O043M891L038R38m17j016j900l560n317o559p497q268q356p541
59218F45181o566o172o207o305o639p287p448o341m472l142k884l165l396l520
59204E71637l507l056k060r00n3L18L14P0j52Q7J025K279L109L235L174L538M186
59187E83244M548M613M981N824O433O219N544N115N017M855M511M133L719L195
59173F51951K651K122J470Q79Q65J370J494Q42L44P68J164R3k057l484l466l088
59157F53918l397m248n167o077o771o803o394o443p205p873p890p728p877p984
$$ plain form
59263 654028 662301 668538 672056 673279 673182 672187 670222 667481 664382 660982 657056 652724 648462 644532 640852
59248 640852 637403 634369 631905 630094 629132 629285 630677 633250 636824 641127 646005 651689 658504 666170 673794
59233 673794 680702 686745 691636 694674 695612 695195 694179 692279 688719 683402 676843 669346 661078 652722 645181
59218 645181 638615 632443 626236 619931 613292 606005 598557 592216 587744 584602 581718 578553 575157 571637
59204 571637 568130 565074 563014 562114 562061 562379 562693 562763 562611 562698 563723 566002 569111 572346 575520 579058 583244
59187 583244 587792 592405 597386 603210 609643 615862 621406 626521 631538 636393 640904 645037 648756 651951
59173 651951 654602 656724 658194 659073 659938 661308 662802 663644 663988 664756 665920 666013 663956 660472 657006 653918
59157 653918 650521 646273 641106 635029 628258 621455 615061 608618 601413 593540 585650 577922 570045 562061
59143E62061p560o761n936n113m458m492n274n950n707m710l589k602j726j081
59129D97102o82k17N16J235J624J807K103K654L511M666N853O751P487Q405R276
59114E52091R429Q845Q366Q588R221R855J0502J0940J0402Q648O720N877O100
59101F65584O350N964N162M337L498K459J186j55j348k290k989l351l142k418
59087F78847j699j364j100n43j98r28k595m055m658m894n318n732n835n952o484
59072F27492p178p488p313o901o323n458m404l544l195l263l259k746j937j532
59058E62951j796k173k192k112k224k103j397p55r20j374j062j20L71J86P8K65
59042E45623J90o6K75J084J210L65k81P7P99J212J686K573L336L557L812M721
$$ plain form
59143 562061 554501 547740 541804 536691 532233 527741 522467 516517 510810 506100 502511 499909 498183 497102
59129 497102 496420 496203 496719 497954 499578 501385 503488 506142 509653 514319 520172 526923 534410 542815 552091
59114 552091 561520 570365 578731 587319 596540 606395 616897 627837 638239 646887 653607 659484 665584
59101 665584 671934 677898 683060 687397 690895 693354 694540 694385 693037 690747 687758 684407 681265 678847
59087 678847 677148 675784 674684 674141 673943 673015 670420 666365 661707 656813 651495 645763 639928 633976 627492
59072 627492 620314 612826 605513 598612 592289 586831 582427 578883 575688 572425 569166 566420 564483 562951
59058 562951 561155 558982 556790 554678 552454 550351 548954 548199 547279 545905 544843 544723 545094 545280 545358 545623
59042 545623 545813 545747 546022 547106 548316 548681 548400 548477 549276 550488 552174 554747 558083 561640 565452 570173
59026E70173O068P525R192J0762J1298J0702J0259J0793J1353J0700R124P666
59014F85615O406M795L010J726R51R4j062k224l038l038j786L16J960K440K603
58999F98768L568N156O350O675O294N388M193L165K308R40j173l137m114m491
58985G29890n034n635n798n650n454m771l223j446k68N95J961L784N429O884Q496
58970G19760R858J0217R827R789J0507J1260J1316J0662R567Q226O900N789M744
58957H38422L442J790j35k254m258n736o874q454j0613j2320j2724j2306j1906
58944G56074j1303r818p783o310n794n555m906l817k669j921j863k167k053j255
58930F88860l91K9K89P06R72R45J182J856K006R47k86j57J256K539K958L068L508
$$ plain form
59026 570173 576241 583766 592958 603720 615018 625720 635979 646772 658125 668825 677949 685615
59014 685615 692021 696816 699826 701552 702503 702597 701535 699311 696273 693235 691449 691765 693725 696165 698768
58999 698768 702336 707492 713842 720517 726811 732199 736392 739557 741865 742805 741632 738495 734381 729890
58985 729890 724856 719221 713423 707773 702319 697548 694325 692879 692611 693206 695167 698951 704380 711264 719760
58970 719760 729618 739835 749662 759451 769958 781218 792534 803196 812763 820989 827889 833678 838422
58957 838422 841864 843654 843519 841265 837007 831271 824397 815943 805330 793010 780286 767980 756074
58944 756074 744771 734953 727170 720860 715066 709511 704605 700788 698119 696198 694335 692168 690115 688860
58930 688860 688469 688498 688787 689493 690465 691410 692592 694448 696454 697401 697115 696958 698214 700753 703711 706779 710287
58913G10287M299N265O283P121P702Q323R153R869J0251J0569J0894J0764J0101
58900H20881R577R341Q417O400M525L908L767K862J768J916L161M239N183P242
58886H93187J0430J3039J3899J3560J2923J2081J0907R580Q089O143L941K171
58874A009950J086K95n10j300k142l098l920m563n662p699j0059j1819j3025j4242
58860I33292j5364j5996j6498j7371j8061j7763j7001j6945j7363j6832j4936
58849G49162j2842j1610j1238j1338j1478j0878r172p413p005p685p912p218o630
58836F26743o701o729o227n688n489n312m997m819m561l573j968o49R4Q15J680
58821E72619K287K836M005N432N817M967M295M718N413N269M371L386K572K003
$$ plain form
58913 710287 714586 719851 726134 733255 740957 749280 758433 768302 778553 789122 800016 810780 820881
58900 820881 830458 839799 848216 854616 859141 863049 866816 869678 871446 873362 876523 880762 885945 893187
58886 893187 903617 916656 930555 944115 957038 969119 980026 989606 997695 1003838 1007779 1009950
58874 1009950 1011036 1011331 1010821 1009521 1007379 1004281 1000361 995798 990136 982437 972378 960559 947534 933292
58860 933292 917928 901932 885434 868063 850002 832239 815238 798293 780930 764098 749162
58849 749162 736320 724710 713472 702134 690656 679778 670606 663193 656188 648503 640591 633373 626743
58836 626743 620042 613313 607086 601398 595909 590597 585600 580781 576220 572647 570679 570030 570124 570939 572619
58821 572619 574906 577742 581747 587179 592996 597963 602258 606976 612389 617658 622029 625415 627987 629990
58807F29990J780J490M16j277k519k875l090l755m480m862n154n530n589n170
58793E89375m713m489m268m037m031l937l046j512k66M88J480K854L768L941M235
58778E75842N153O071O515O928P388O868M690J626j234l736n970p350p435o917
58764E88439o854p399p960q075p615o647n589n026m929m644l810k742j786j071
58750E14292q74j319j614p59Q43J689J407J359K552M228N146N191M966M772M683
58735E46562M865N150N037M487M052L967M011M304N154N969N681M521L960M456
58721F12176M669L602K141J690K544M268O452Q294Q673P533O128N245M241K516
58707F80172O22q81k398m288o025p307q811j0924j2874j4036j4865j5630j5506
$$ plain form
58807 629990 631770 633260 633676 632399 629880 627005 623915 620160 615680 610818 605664 600134 594545 589375
58793 589375 584662 580173 575905 571868 567837 563900 560854 559342 559076 559564 561044 563898 567666 571607 575842
58778 575842 580995 587066 593581 600509 607897 614765 619455 621081 619847 616111 610141 602791 595356 588439
58764 588439 581585 574186 566226 558151 550536 543889 538300 533274 528345 523701 519891 517149 515363 514292
58750 514292 513418 512099 510485 509726 510569 512258 513665 515024 517576 521804 526950 532141 537107 541879 546562
58735 546562 551427 556577 561614 566101 570153 574120 578131 582435 587589 593558 599239 603760 607720 612176
58721 612176 616845 620447 622588 624278 626822 631090 637542 645836 654509 662042 668170 673415 677656 680172
58707 680172 680794 679913 677515 673227 667202 659895 651084 640160 627286 613250 598385 582755 567249
58694E67249j4059j2427j1739j1463j0524r050p713o354m685l479l588m419m707
58681D63042m250l696l207k570k059j994j854r96J85Q93J261K022L166M038M538
58666D58519N305O770Q724J0587J1628J1292R727P627N239K250j130l907n592
58653E27039o712p511p340o058m848m690n033n002m819m948m914m144l152k662
58639D55206k313j480n54k34r8P78K246L298L441K904J979J052P22J036J131M80
58623D69594k26k00K30L62K78L20L05L00J160L138M919N272M790M668M639L773
58607E03322K486K000K274K145J365Q47R54J022O50J52l62j223k325k966k782
58592E07559k062j094N6J170J995K727L824N389P140Q713R729R928R609R420R411
$$ plain form
58694 567249 553190 540763 529024 517561 507037 497987 490274 483920 479235 475756 472168 467749 463042
58681 463042 458792 455096 451889 449319 447260 445266 443412 442416 442601 443494 444755 446777 449943 453981 458519
58666 458519 463824 470594 479318 489905 501533 512825 522552 530179 535418 537668 536538 532631 527039
58653 527039 520327 512816 505476 499418 494570 489880 484847 479845 475026 470078 465164 461020 457868 455206
58639 455206 452893 451413 450859 450625 450527 451305 453551 456849 460290 463194 465173 466225 466947 467983 469114 469594
58623 469594 469368 469168 469398 469760 470038 470358 470663 470963 472123 475261 480180 485452 490242 494910 499549 503322
58607 503322 505808 507808 510082 512227 513592 514439 515393 516415 517065 517217 516855 515632 513307 510341 507559
58592 507559 505497 504403 504459 505629 507624 510351 514175 519564 526704 535417 545146 555074 564683 574103 583514
58577E83514R001Q154P669P758P532O551N871O594Q338J0100J1763J3661J5618
58564G02124J7425J9557K2288K4825K6289K6798K6644K5330K2504J8956J5467
58553I48207J1562O719J935j307l034m345n612o402o728p055p457p849q667j0345
58539H99622j2586j5009j7758k0552k2096k1666k0426j9871j9717j8689j6657
58528F94595j4523j2548j0301p906o016m824m121l953m244m275l564k725k516
58515F13079k664k540k240k022j560o92o8n0qL75K68o65j172l13Q46R66N53O78
58497F02771Q48Q9r76j070l54K77J073K595L992M206M131N375P502Q738Q961R745
58481F57903J1641J3583J4935J6198J7629J8729J9153J8745J6961J3611R711O259
$$ plain form
58577 583514 592515 600669 608338 616096 623628 630179 636050 642644 650982 661082 672845 686506 702124
58564 702124 719549 739106 761394 786219 812508 839306 865950 891280 913784 932740 948207
58553 948207 959769 966488 968423 967116 964082 959737 954125 947723 940995 933940 926483 918634 909967 899622
58539 899622 887036 872027 854269 833717 811621 789955 769529 749658 729941 711252 694595
58528 694595 680072 667524 657223 649317 643301 638477 634356 630403 626159 621884 618320 615595 613079
58515 613079 610415 607875 605635 603613 602053 601361 601293 601243 601235 601610 601878 601213 600041 599728 600574 601540 602093 602771
58497 602771 603619 603708 602732 601662 601308 601585 602658 605253 609245 613451 617582 622957 630459 639197 648158 657903
58481 657903 669544 683127 698062 714260 731889 750618 769771 788516 805477 819088 828799 835058
58469H35058K792j399n415p781q669r289r708r023p246n273l381j334O05K231
58455G72168M230O965R238R877R556R374Q713O392K882n79m003p724j0609j1496
58441H04984j1302j1438j1284r670p646p012p074n820l482j879r88P32L055M266
58427G35442M492N640P975R716J0118J0241J0426R717P918N770L213j84l290m557
58413H12637m780n997p912q351p107o265o631o845o229n674n383m518l276k611
58399G31058j834O57M176O186O129N881O273O196N462N368N913N407L545K052
58385G92469J682J332O22O37J534K098K078K491L234L090K308K464L545L950L574
58370H27108L945N164N620N116N237O424P564Q648J0719J3053J3580J2367J1518
$$ plain form
58469 835058 837850 836451 831036 823255 814586 805297 795589 786566 779320 774047 770666 769332 769937 772168
58455 772168 776398 783363 792601 802478 812034 821408 830121 836513 839395 838816 834813 827089 816480 804984
58441 804984 793682 782244 770960 761290 753644 746632 739558 733738 730256 728377 727389 728121 731176 735442
58427 735442 739934 745574 753549 763265 773383 783624 794050 803767 811685 817455 820668 820484 817194 812637
58413 812637 807857 801860 793948 785597 778490 772225 765594 758749 752520 746846 741463 736945 733669 731058
58399 731058 729224 729881 734057 740243 746372 752253 758526 764722 770184 775552 781465 786872 790417 792469
58385 792469 794151 795483 796105 796742 798276 800374 802452 804943 808177 811267 813575 816039 819584 823534 827108
58370 827108 831053 836217 841837 846953 852190 858614 866178 874826 885545 898598 912178 924545 936063
58357I36063J1514J0885R522Q831Q516O847M324L283L634K892Q33Q2J483K947
58343A011656L583M915P193Q520Q630R553J1635J2761J2499J2956J4659J5595
58331A134155J5267J5603J6849J6775J4971J3718J3559J2351R702P881P265N596
58319A283692K927K412M681O382N943N884P606Q890Q689R380J2003J3941J3765
58306A386195J3854J5787J7546J7621J7573J8363J8472J7626J7932J9466J9375
58295A579810J7205J6299J8019J9620J9664K0314K2244K2966K2224K3360K6998
58284A808723K9292K8891K9501L2824L5323L5077L5573L9139M2831M4342M5950
58273B207466M9021N0673M9617M9263N1364N2724N1727N1792N4740N7298N7894
$$ plain form
58357 936063 947577 958462 967984 976815 985331 992178 996502 999785 1003419 1006311 1007144 1007226 1008709 1011656
58343 1011656 1015239 1020154 1027347 1035867 1044497 1054050 1065685 1078446 1090945 1103901 1118560 1134155
58331 1134155 1149422 1165025 1181874 1198649 1213620 1227338 1240897 1253248 1262950 1270831 1278096 1283692
58319 1283692 1286619 1289031 1293712 1300094 1306037 1311921 1319527 1328417 1337106 1346486 1358489 1372430 1386195
58306 1386195 1400049 1415836 1433382 1451003 1468576 1486939 1505411 1523037 1540969 1560435 1579810
58295 1579810 1597015 1613314 1631333 1650953 1670617 1690931 1713175 1736141 1758365 1781725 1808723
58284 1808723 1838015 1866906 1896407 1929231 1964554 1999631 2035204 2074343 2117174 2161516 2207466
58273 2207466 2256487 2307160 2356777 2406040 2457404 2510128 2561855 2613647 2668387 2725685 2783579
58262B783579O0042O5103O8826O9137P0105P3914P6502P5654P5636P8975Q1649
58251C579122Q1489Q3094Q9018R4530R6761J00407J08371J15682J19168J24025
58241D591667J33922J43692J49147J54948J65306J76236J84665J95548K11882
58232F107013K27557K38543K50933K69330K88021L02696L19693L43915L69354
58223H717055L91746M18331M54190M91911N26458N66790O20100O78766P36399
58214A3601746Q02125Q84504R76921J074532J189273J331296J493083J670386
58206B3023866J880572K140854K448853K806781L243364L788880M453341N255176
58198D9041687O241292P445782Q861183J0491921J2407830J4708010J7473321
$$ plain form
58262 2783579 2843621 2908724 2977550 3046687 3116792 3190706 3267208 3342862 3418498 3497473 3579122
58251 3579122 3660611 3743705 3832723 3927253 4024014 4124421 4232792 4348474 4467642 4591667
58241 4591667 4725589 4869281 5018428 5173376 5338682 5514918 5699583 5895131 6107013
58232 6107013 6334570 6573113 6824046 7093376 7381397 7684093 8003786 8347701 8717055
58223 8717055 9108801 9527132 9981322 10473233 10999691 11566481 12186581 12865347 13601746
58214 13601746 14403871 15288375 16265296 17339828 18529101 19860397 21353480 23023866
58206 23023866 24904438 27045292 29494145 32300926 35544290 39333170 43786511 49041687
58198 49041687 55282979 62728761 71589944 82081865 94489695 109197705 126671026
58191A26671026K0788703K4710617K9064845L3270617L6447053L7659459L5981156
58184C44593476L0508513K0806020P677643o629373j9348892k8563930l3823565
58177C15219892l5711017l5109510l2845421k9649637k6110708k2599608j9305535
58170A13888456j6336269j3749277j1535713r651045q065238o756890n682477
58163D2111547m790225m051826l451729k960027k543696k192048j905862j672184
58155A8543950j471894j300934j162710j048787r46085q54168p77696p10457o43334
58146I627885n79722n27292m82365m37122l94362l60755l32995l04557k79021
58137E929694k63052k52690k39697k25347k15387k07235j94661j79937j69396
$$ plain form
58191 126671026 147459729 172170346 201235191 234505808 270952861 308612320 344593476
58184 344593476 375101989 395908009 403585652 396956279 377607387 349043457 315219892
58177 315219892 279508875 244399365 211553944 181904307 155793599 133193991 113888456
58170 113888456 97552187 83802910 72267197 62616152 54550914 47794024 42111547
58163 42111547 37321322 33269496 29817767 26857740 24314044 22121996 20216134 18543950
58155 18543950 17072056 15771122 14608412 13559625 12613540 11759372 10981676 10271219 9627885
58146 9627885 9048163 8520871 8038506 7601384 7207022 6846267 6513272 6208715 5929694
58137 5929694 5666642 5413952 5174255 4948908 4733521 4526286 4331625 4151688 3982292
58128C982292j61649j51409j40355j33335j28131j19619j09852j04001j00286
58119B833655r3808q6330q2594q0721p5839o9717o7333o7113o3829n8338n5421
58108B032612n4664n2085m8427m7466m8223m6813m3985m3237m3572m1486l8024
58097A524630l6716l6514l3892k9826k7786k6836k3640j9395j7949j8755j8274
58086A235047j6727j7046j8751j9077j8630j9919k1903k1830k0658k0933k1323
58075A018250j9271j6765j7258j8958j7678j4522j3921j5594j5400j3096j2352
58064H43435j3541j3297j1092r940j0360r654p504o736q014q969q927r629j1001
58051G14771j0916r347q359q036o780n332n875p484p124n073m615o360p518o928
$$ plain form
58128 3982292 3820643 3669234 3528879 3395544 3267413 3147794 3037942 2933941 2833655
58119 2833655 2739847 2653517 2570923 2490202 2414363 2344646 2277313 2210200 2146371 2088033 2032612
58108 2032612 1977948 1925863 1877436 1829970 1781747 1734934 1690949 1647712 1604140 1562654 1524630
58097 1524630 1487914 1451400 1417508 1387682 1359896 1333060 1309420 1290025 1272076 1253321 1235047
58086 1235047 1218320 1201274 1182523 1163446 1144816 1124897 1102994 1081164 1060506 1039573 1018250
58075 1018250 998979 982214 964956 945998 928320 913798 899877 884283 868883 855787 843435
58064 843435 829894 816597 805505 795565 785205 775551 768047 761311 753297 744328 735401 725772 714771
58051 714771 703855 694508 686149 678113 671333 666001 660126 652642 645518 640445 635830 629470 621952 615024
58037F15024o303o262n546m445m797o246o516n657o019p869q942q574q379q699
58023E20770q116o758o242o308n144l198k817l987m230k970k264k896l433l398
58009D59009l792m240l176j166n02j215j086K12O54j64l11P28J219O44N09J006
57993D48329M30j458k813l181m184o109p120o733o681p437p208n374l823l700
57979C82938l769l157k841l247l105j847p49n39k25O91J194P78L61L26p8q23p81
57962C65127P8M00r2j04O84J010M16l8k5n34j649k092j632j559k151k069r55k80
57944C54535p48j110m17O15J275J969K894L498L822M644N897O727P202Q018Q449
57929D07270O980M092J996J210jk360m372n142n882p532r118r503q935q033o933
$$ plain form
58037 615024 608721 602459 596913 592468 587671 581425 574909 569252 563233 555364 546422 537848 529469 520770
58023 520770 512654 505896 499654 493346 488202 485004 482187 478200 473970 471000 468736 465840 462407 459009
58009 459009 455217 450977 447801 446635 446133 444918 443832 444044 444698 444534 444223 444951 446170 446814 447323 448329
57993 448329 448759 447301 444488 441307 437123 431014 423894 417161 410480 403043 395835 390461 386638 382938
57979 382938 379169 376012 373171 369924 366819 364972 364223 363684 363459 364150 365344 366122 366483 366809 366731 365908 365127
57962 365127 365205 365605 365513 365409 366093 367103 367519 367481 367456 366922 365273 363181 361549 359990 357839 355770 354815 354535
57944 354535 353787 352677 352260 352875 354150 356119 359013 362511 366333 370977 376874 383601 390803 398821 407270
57929 407270 414250 418342 420338 421548 421547 419187 414815 409673 403791 396259 387141 377638 368703 360670 353737
57914C53737n985n618n171l627j662r38j346j210k35J99j48J3P56O62k76k87R13
57897C29777J396M53j41O95J712K086K995M941O199N590M453M185M030L070K193
57882C73634K260K153O60j347k384k624l065l647l754l553l518l517l360l296
57868C44642l229k625j727j534k063k116j291m99k3J053K827L971L994M147N161
57853C50688N994N821N368N252M879M015L596L887L677K460J521J711J915J057
57839D01841k13r95j615k355k454j702j362k185l070k936k337k104j940j581j593
57824C73399j906j354J21O96n05j789j620j050j687l036l704l750l915l966l644
57809C42290l951n561p156p130n912m930m396l765l313l490l578k674j253l39
$$ plain form
57914 353737 347752 342134 336963 333336 331674 330736 329390 328180 327945 328144 327996 328009 328765 329427 329151 328864 329777
57897 329777 331173 331626 331485 332180 333892 335978 338973 343914 350113 355703 360156 364341 368371 371441 373634
57882 373634 375894 378047 378707 377360 374976 372352 369287 365640 361886 358333 354815 351298 347938 344642
57868 344642 341413 338788 337061 335527 333464 331348 330057 329558 329535 330588 333415 337386 341380 345527 350688
57853 350688 356682 362503 367871 373123 378002 382017 385613 389500 393177 395637 397158 398869 400784 401841
57839 401841 401628 400633 399018 396663 394209 392507 391145 388960 385890 382954 380617 378513 376573 374992 373399
57824 373399 371493 370139 370260 370956 370451 368662 367042 365992 364305 361269 357565 353815 349900 345934 342290
57809 342290 338339 332778 325622 318492 312580 307650 303254 299489 296176 292686 289108 286434 285181 284842
57795B84842P8M81O00J07l96k61J72N40J261K392K953K624K648L796M919M890
57779C11646M543N043N858O035N990O208N600L302Q40K22R04Q54j33n23J08N46
57763C57043P0p96j542k096k183j691j332j648j924j366o94r95j758j608m75O25
57747C37630J389K151K508J766M76j10J06J72k01m42m28n43o87m54o4N0K15Q52
57729C44386J382J011K30J47P43J148J267J745K552K985K902K778K694K377K010
57714C70357J977K013J627R93N49J10o73j490j954k382l046l313k649j712j289
57699C59118r04K11J452J594O66k85r08j676k730l768m733n554n737n193m794
57684C26759n096n315m613l477k514j084J384L797M950N717P798J0969J3638J5630
$$ plain form
57795 284842 284920 285401 286001 286108 285712 285451 285623 286163 287424 289816 292769 295393 298041 301837 306756 311646
57779 311646 316189 321232 327090 333125 339115 345323 350923 354225 355065 355287 356191 357045 356912 356389 356497 357043
57763 357043 357113 356317 354775 352679 350496 348805 347473 345825 343901 342535 341841 340846 339088 337480 337005 337630
57747 337630 339019 341170 343678 345444 345920 345810 345916 346088 345887 345445 345017 344474 343787 343333 343269 343319 343534 344386
57729 344386 345768 346779 347009 347156 347899 349047 350314 352059 354611 357596 360498 363276 365970 368347 370357
57714 370357 372334 374347 375974 376967 377516 377626 376953 375463 373509 371127 368081 364768 362119 360407 359118
57699 359118 358214 358425 359877 361471 362137 361852 360944 359268 356538 352770 348037 342483 336746 331553 326759
57684 326759 321663 316348 311735 308258 305744 304660 306044 309841 314791 320508 328306 339275 352913 368543
57670C68543J8382K2634K7703L2810L7332L9933L8997L3774K4007R479q223k4457
57658F20914l4628l8358l8561l6953l2992k7040k1446j7673j4774j1677r022p644
57646C30146o945n890m448l105j985j123p00n81l61l8K05P35J935L072L016J946
57630C15879J040O08J5o61o16j6o7r91j569j103m48n43j196j717j703r55L11J116
57612C07384P17j15j11L85n9j447k175j524n20ML73O67J79j029j711j350r91j372
57594B97305j749j418r77j150j571j715j932k588l137k887j970q99N4N88L51k83
57578B76022l49M03J118J140P24K36l00o37l98l6n09j655k130j401m92l52p24
57561B70660j106j499j660r28N37J573J668J601J931K172K087K348L119L389K604
$$ plain form
57670 368543 386925 409559 437262 470072 507404 547337 586334 620108 644115 653594 645371 620914
57658 620914 586286 547928 509367 472414 439422 412382 390936 373263 358489 346812 337790 330146
57646 330146 323201 317311 312863 309758 307773 306650 305950 305369 305008 304970 305175 305910 307845 310917 313933 315879
57630 315879 316919 317527 317542 316881 316265 316249 316182 315191 313622 312519 312071 311528 310332 308615 306912 305957 306268 307384
57612 307384 308101 307986 307875 308260 308201 306754 304579 303055 302535 302539 302912 303579 303758 302729 301018 299668 298677 297305
57594 297305 295556 294138 293161 292011 290440 288725 286793 284205 281068 278181 276211 275312 275366 275954 276305 276022
57578 276022 275673 276076 277194 278334 279058 279294 278994 278357 277959 277923 277414 275759 273629 272228 271736 271384 270660
57561 270660 269554 268055 266395 265467 266004 267577 269245 270846 272777 274949 277036 279384 282503 285892 288496
57546B88496J685J515J622J365J128J319J404J061J164K301L401L128J873R95
57532C12457P60M02k98q01q58p63o23k91K31Q71J647K299K296J732J532K219L147
57515C25959L580L749M057M083L341K426K374L150L711L317K178R58K49L04Q09
57500C64245J160J135R71P26J58n57q13m79j02N4L10P37R71J143J870K899L038
57483C77466K004J064J116J335P54l5J16J102J988K434K611K424J904J728K247
57468D00258K634K091J243J178J727J939J754J857K209K070J439J271K038L081
57454D26789L553L318K777K384K433K869L315L511L595L706L726L696L953M477
57440D74102M686M364M110M362M624M341L908M007M493M694M420L925L335K817
$$ plain form
57546 288496 290181 291696 293318 294683 295811 297130 298534 299595 300759 303060 306461 309589 311462 312457
57532 312457 313217 313619 313321 312520 311662 310899 310276 309985 310216 311087 312734 315033 317329 319061 320593 322812 325959
57515 325959 329539 333288 337345 341428 344769 347195 349569 352719 356430 359747 361925 362883 363132 363436 364245
57500 364245 365405 366540 367511 368237 368395 367838 367025 366546 366444 366498 366808 367545 368516 369659 371529 374428 377466
57483 377466 379470 380534 381650 382985 383739 383704 383820 384922 386910 389344 391955 394379 396283 398011 400258
57468 400258 402892 404983 406226 407404 409131 411070 412824 414681 416890 418960 420399 421670 423708 426789
57454 426789 430342 433660 436437 438821 441254 444123 447438 450949 454544 458250 461976 465672 469625 474102
57440 474102 478788 483152 487262 491624 496248 500589 504497 508504 512997 517691 522111 526036 529371 532188
57426E32188K862L628M370M321L756L487L630L653L409L312L673M385N177N739
57412E87590N861N736N800O084O191O128O407P021P255O868O532O485N924M529
57398F74411L451L718M684N224N534O379P376P610P345P566Q153Q183P800Q203
57384G65637R590J0702J0727J0383J0557J0941J0604R297P730O873P200Q207Q759
57371H87207Q277P407P081P326P592P806Q179Q364P820O878O449O731P108P304
57357I91529P669Q273Q689Q804R049R596J0107J0460J0939J1535J1740J1304J0636
57344A120330J0225J0194J0575J1446J2548J3293J3419J3268J3214J3282J3420
57333A255214J3800J4472J5064J5092J4508J3752J3297J3256J3470J3859J4459
$$ plain form
57426 532188 535050 538678 543048 547369 551125 554612 558242 561895 565304 568616 572289 576674 581851 587590
57412 587590 593451 599187 604987 611071 617262 623390 629797 636818 644073 650941 657473 663958 669882 674411
57398 674411 677862 681580 686264 691488 697022 703401 710777 718387 725732 733298 741451 749634 757434 765637
57384 765637 775227 785929 796656 807039 817596 828537 839141 848438 856168 863041 870241 878448 887207
57371 887207 895484 902891 909972 917298 924890 932696 940875 949239 957059 963937 970386 977117 984225 991529
57357 991529 999198 1007471 1016160 1024964 1034013 1043609 1053716 1064176 1075115 1086650 1098390 1109694 1120330
57344 1120330 1130555 1140749 1151324 1162770 1175318 1188611 1202030 1215298 1228512 1241794 1255214
57333 1255214 1269014 1283486 1298550 1313642 1328150 1341902 1355199 1368455 1381925 1395784 1410243
57322A410243J5114J5435J5411J5638J6439J7101J6823J6123J6253J7267J7908
57311A589755J7615J7268J7516J7714J7387J7342J8253J9237J9191J8625J8762
57300A788665J9547J9962J9884K0109K0781K1185K1102K1134K1586K2068K2273
57289B018296K2337K2327K2155K1982K2079K2375K2677K3110K3775K4321K4488
57278B269922K4650K5137K5567K5577K5669K6439K7513K8124K8200K7967K7167
57267B561932K5801K4955K5481K6510K6659K6239K6660K8011K8930K8817K8439
57256B858434K8328K8134K7865K8159K8915K9194K8893K9151L0547L2144L2951
57245C182715L3183L3390L3482L3352L3589L4635L5874L6332L5873L5112L4466
$$ plain form
57322 1410243 1425357 1440792 1456203 1471841 1488280 1505381 1522204 1538327 1554580 1571847 1589755
57311 1589755 1607370 1624638 1642154 1659868 1677255 1694597 1712850 1732087 1751278 1769903 1788665
57300 1788665 1808212 1828174 1848058 1868167 1888948 1910133 1931235 1952369 1973955 1996023 2018296
57289 2018296 2040633 2062960 2085115 2107097 2129176 2151551 2174228 2197338 2221113 2245434 2269922
57278 2269922 2294572 2319709 2345276 2370853 2396522 2422961 2450474 2478598 2506798 2534765 2561932
57267 2561932 2587733 2612688 2638169 2664679 2691338 2717577 2744237 2772248 2801178 2829995 2858434
57256 2858434 2886762 2914896 2942761 2970920 2999835 3029029 3057922 3087073 3117620 3149764 3182715
57245 3182715 3215898 3249288 3282770 3316122 3349711 3384346 3420220 3456552 3492425 3527537 3562003
57234C562003L3801L2838L1657L0776L0666L1072L1170L0700L0431L0941L1555
57223C907610L1277L0288K9503K9194K9092K9430L0573L1895L2332L1977L1814
57212D244985L2035L1915L1279L0673L0070K8823K7064K5722K4942K3861K2222
57201D553591K0819J9990J9069J7672J6311J5254J4106J2860J2128J1880J1236
57190D724916R914Q637P725O728N882O319Q103R606R693R208R362R908J0021R864
57176D845886J0154J1020J2149J3301J4021J3775J3048J3155J4291J4992J4424
57165D990216J3833J4565J5927J6404J5994J5779J5928J5610J4465J2859J0992
57154E152572Q874O934N505M034J706j391m576p623j0591j2985j4108j4070j3607
$$ plain form
57234 3562003 3595804 3628642 3660299 3691075 3721741 3752813 3783983 3814683 3845114 3876055 3907610
57223 3907610 3938887 3969175 3998678 4027872 4056964 4086394 4116967 4148862 4181194 4213171 4244985
57212 4244985 4277020 4308935 4340214 4370887 4400957 4429780 4456844 4482566 4507508 4531369 4553591
57201 4553591 4574410 4594400 4613469 4631141 4647452 4662706 4676812 4689672 4701800 4713680 4724916
57190 4724916 4734830 4743467 4751192 4757920 4763802 4770121 4778224 4787830 4797523 4806731 4816093 4826001 4836022 4845886
57176 4845886 4856040 4867060 4879209 4892510 4906531 4920306 4933354 4946509 4960800 4975792 4990216
57165 4990216 5004049 5018614 5034541 5050945 5066939 5082718 5098646 5114256 5128721 5141580 5152572
57154 5152572 5161446 5168380 5173885 5177919 5179625 5178234 5173658 5166035 5155444 5142459 5128351 5114281 5100674
57141E100674j2940j1571r075n538j415K591N772Q002R675J0754J0422Q196M781
57128E120328J279j869m542o235o370m836j616L509J0176J6969K2437K6268K9025
57115E204523L1469L4680M0019M8186N8864P1849Q7752J06929J28790J53116J81241
57104F147418K15003K55439L03656L62137M34047N22112O29537P61168R22111
57095A0552628J115481J342522J603700J897504K218299K557233K905127L252857
57087B7445351L588646L896012M153177M331891M397549M315312M060268L622899
57079E9811105L007078K228731J321595L42810o33858j537247k317264k951130
57071E9271820l437899l788686m017947m137588m155154m076580l910843l672377
$$ plain form
57141 5100674 5087734 5076163 5067088 5061550 5060135 5062726 5068498 5076500 5086175 5096929 5107351 5115547 5120328
57128 5120328 5121607 5119738 5115196 5108961 5102591 5097755 5096139 5099648 5109824 5126793 5149230 5175498 5204523
57115 5204523 5235992 5270672 5310691 5358877 5417741 5489590 5577342 5684271 5813061 5966177 6147418
57104 6147418 6362421 6617860 6921516 7283653 7717700 8239812 8869349 9630517 10552628
57095 10552628 11668109 13010631 14614331 16511835 18730134 21287367 24192494 27445351
57087 27445351 31033997 34930009 39083186 43415077 47812626 52127938 56188206 59811105
57079 59811105 62818183 65046914 66368509 66711319 66077461 64540214 62222950 59271820
57071 59271820 55833921 52045235 48027288 43889700 39734546 35657966 31747123 28074746
57063B8074746l379975l054520k717352k388267k082099j806107j560989j344723
57055I740714j155420r91432q50566p30164o27580n40213m65684m02338l49112
57046C628205l04658k67079k34788k06983j83116j62451j44406j28617j14445
57037A881662j01157q8757p7719o7664n7397m6451l5343k3812j0481M722J9256
57026A396859L0269L6637L7148K8352P287k3598n6214q2013r6490r9553r4009
57015A084675q4320p4635o6538n9077n1296m3753l7361l2020k7147k2723j9152
57004E66653j6582j4837j3585j2364j0982r953r893j0453j0568r906r165q691
56992D29674p796n997m029k830k055m73K336N382P411Q079P752O472L678r23o539
$$ plain form
57063 28074746 24694771 21640251 18922899 16534632 14452533 12646426 11085437 9740714
57055 9740714 8585294 7593862 6743296 6013132 5385552 4845339 4379655 3977317 3628205
57046 3628205 3323547 3056468 2821680 2614697 2431581 2269130 2124724 1996107 1881662
57037 1881662 1780505 1691748 1614029 1546365 1488968 1442517 1407174 1383362 1372881 1377603 1396859
57026 1396859 1427128 1463765 1500913 1529265 1536552 1512954 1456740 1374727 1278237 1178684 1084675
57015 1084675 1000355 925720 859182 800105 748809 705056 667695 635675 608528 585805 566653
57004 566653 550071 535234 521649 509285 498303 488350 478457 468004 457436 447530 438365 429674
56992 429674 421878 415881 411852 409022 406967 406494 408830 414212 421623 429702 437454 443926 447604 446681 440142
56977D40142j1733j5619j8134j9209j8530j6369j3849j1789r869p532n087l086
56965B89336j174J463M818Q175J1277J4437J7625K0261K1922K2330K0753J6285
56953D47508Q942q3r216j7005k2155k4014k3231k1164j8585j5499j2084q918o216
56940B78280l612q12K101N126Q499J2326J6560K1140K5603K8733K9325K7145K2435
56927D72849J4889M277p954j8916k6368k9958l0434k8755k6179k3943k2271k0306
56915B56931j7512j4450j1893r925q316p093o257n467m471l471k738k181j624
56902A61533j043l63N78J663K438K684K733L108M044N451P076Q767J0682J3054
56888B22405J5549J7317J7995J8069J7638J5596J0994M696j379o337j0376j3212
$$ plain form
56977 440142 428409 412790 394656 375447 356917 340548 326699 314910 305041 297509 292422 289336
56965 289336 288162 289625 294443 302618 313895 328332 345957 366218 388140 410470 431223 447508
56953 447508 456450 456367 447151 430146 407991 383977 360746 339582 320997 305498 293414 284496 278280
56940 278280 274668 273856 275957 281083 289582 301908 318468 339608 365211 393944 423269 450414 472849
56927 472849 487738 492015 484061 465145 438777 408819 378385 349630 323451 299508 277237 256931
56915 256931 239419 224969 213076 203151 194835 187742 181485 176018 171547 168076 165338 163157 161533
56902 161533 160490 160127 160705 162368 164806 167490 170223 173331 177375 182826 189902 198669 209351 222405
56888 222405 237954 255271 273266 291335 308973 324569 335563 340259 338880 332543 322167 308955
56876C08955j3947j2638j0564q628o576m064j350J469M735Q370J1827J5286J9781
56863C12656K5587L1441L6045L9236M0909L9817L4478K4860J2396j094j3782k3740
56851E58809k9574l1256k9839k6433k1773j6452j1010n772p35M399J0077J6469
56839D16910K3314L0389L7998M6415N4992O2306O6911O7257O1218M7053K5376
56828I40139l90k5646m6363n9833o5286o4274n9574n3171m5750l7854l0323k3397
56816D28278j6495r328k216M897J2604K0813K8494L5168M1407M7057M9923M7282
56804F87884L8104K3359N067j4093l1022m3242m9795n0998m7925m2295l5937k9779
56792D09328k3829j8284j3722r939n864j143L301O902J0488J4866J9385K2785
$$ plain form
56876 308955 295008 282370 271806 263178 256602 252538 251188 252657 257392 265762 277589 292875 312656
56863 312656 338243 369684 405729 444965 485874 525691 560169 585029 597425 596331 582549 558809
56851 558809 529235 497979 468140 441707 419934 403482 392472 386700 385965 390364 400441 416910
56839 416910 440224 470613 508611 555026 610018 672324 739235 806492 867710 914763 940139
56828 940139 939749 914103 867740 807907 742621 678347 618773 565602 519852 481998 451675 428278
56816 428278 411783 402455 400239 405136 417740 438553 467047 502215 543622 590679 640602 687884
56804 687884 725988 749347 754414 740321 709299 666057 616262 565264 517339 475044 439107 409328
56792 409328 385499 367215 353493 343554 337690 336547 339848 346750 357238 372104 391489 414274
56780D14274K4428K3804J9892J2250K103q659j8751k7053l2031l3043l1464k9226
56768C16524k6708k3312j9429j6310j4323j2727j1051r518q166o793n691n353
56756A57143n409m897l664k607k386k724l014k941k413j552p66l28M0O47J138
56741A26267R45J36p79j593k253k309j344J55J162J316J086R14Q72R96J283J382
56725A28236R91M19K24M82R06J430J982K101J543R16Q22P78%j024j025K7O93J73
56707A39674n50k14R85J901J991J615J198P74L02o6j56O2M48P73Q44N91J29k54
56689A50047k51J37M78M30L20P95J791K441K171J377P62N03M46N35O99P37O85
56672A64103P48O44k71j773k532j768m31J27m0P4P22J256J318J109O34k86j298
$$ plain form
56780 414274 438702 462506 482398 494648 496751 488092 469341 442288 410257 377214 345750 316524
56768 316524 289816 266504 247075 230765 216442 203715 192664 183146 174980 168187 162496 157143
56756 157143 151734 146837 143173 140566 138180 135456 132442 129501 127088 125536 124770 124442 124482 125129 126267
56741 126267 127212 127348 126569 124976 122723 120414 119070 119225 120387 121703 122789 123703 124575 125571 126854 128236
56725 128236 129227 129646 129870 130352 131258 132688 134670 136771 138314 139230 140052 140830 140830 139806 138781 138808 139501 139674
56707 139674 139124 138910 139895 141796 143787 145402 146600 147374 147676 147610 147454 147516 147964 148737 149581 150172 150301 150047
56689 150047 149796 149933 150411 150841 151161 151956 153747 156188 158359 159736 160498 161001 161447 161982 162681 163418 164103
56672 164103 164851 165495 165224 163451 160919 159151 158720 158847 158807 158881 159603 160859 162177 163286 163920 163634 162336
56655A62336j609q89M08J577J984J263j53j051o97J90L97j74o71o87n34l27J74
56638A61537Q09R63M68j92o64j041j360j359q80q1P21J103O90l41j190j313j054
56621A56816r43r65j030j490k346k642j732n65n05j234j253j96P88J028J144J595
56605A46470J754J049po17p33p38o86m43j19J02J86J39K2J50Q02J617J839J332
56587A52119Q26R58J504J802J559J039O75O85Q97R74Q41P72R35J197J462J834
56571A70079K224K334K297K662L476M084M301M871O168P415Q022Q730J0352J2260
56557B49275J3263J3158J2117R534N095M39k160k451k050j921j795j759k423l368
56543B84954l345k418k114l015l834l612l108l272l756l909m023m564n111m997
$$ plain form
56655 162336 160727 159838 160246 161823 163807 165070 164917 163866 163169 163359 163756 163582 162911 162224 161690 161363 161537
56638 161537 162346 163309 163777 163585 162921 161880 160520 159161 158281 158200 158921 160024 160714 160373 159183 157870 156816
56621 156816 155873 154908 153878 152388 150042 147400 145668 145103 144598 143364 142111 141915 142703 143731 144875 146470
56605 146470 148224 149273 149266 148649 147916 147178 146492 146049 145930 146032 146218 146357 146379 146529 147331 148948 150787 152119
56587 152119 152945 153903 155407 157209 158768 159807 160482 161167 162064 163038 163879 164651 165586 166783 168245 170079
56571 170079 172303 174637 176934 179596 183072 187156 191457 196328 202496 209911 217933 226663 237015 249275
56557 249275 262538 275696 287813 297347 302442 302881 300721 298270 296220 294299 292504 290745 288322 284954
56543 284954 281609 279191 277077 274062 270228 266616 263508 260236 256480 252571 248548 243984 238873 233876
56529B33876m318l591l060k859l128l498l161j907n20J99J60l81j099j437j099
56514B04177q27j594k949l299k145p76l71p27j320k178k991k681r02J070J880
56499A84367J691J415J244Q75M45K46Q3k73m79j74L70P45R81J120Q37P7n71o69
56481A92330m96l47lN67P81L69l2J46N20N91O86J281J970K032J536J074P50L15
56463B04070q8r8J26J2n80j174j226o44J31M41M3m62l22K98N90M71Q12K029L356
56444B07785L940L794L193K027M43o94q05m72n60j039j367j490j663j738j444
56429B09910j110j247j642j516o58K92O76N59M90Q05J242J235O26mN1Q22J710
56412B12241K218K249J822J015J47m09n82l80L04J269J753J364P74P71J014O92
$$ plain form
56529 233876 229558 225967 222907 220048 216920 213422 210261 208354 207834 208033 208193 207812 206713 205276 204177
56514 204177 203350 201756 198807 195508 193363 192587 192216 191489 190169 187991 185000 182319 181417 182487 184367
56499 184367 186058 187473 188717 189592 190037 190283 190366 190093 189614 189440 189810 190555 191536 192656 193493 193570 192999 192330
56481 192330 191834 191487 191484 192051 192832 193201 193169 193315 193835 194426 195112 196393 198363 200395 201931 203005 203755 204070
56463 204070 203982 203884 204010 204022 203442 202268 201042 200398 200529 200970 201013 200551 200229 200527 201117 201588 202400 204429 207785
56444 207785 211725 215519 218712 220739 221182 220488 219683 219211 218651 217612 216245 214755 213092 211354 209910
56429 209910 208800 207553 205911 204395 203737 204029 204705 205264 205754 206559 207801 209036 209662 209658 209709 210531 212241
56412 212241 214459 216708 218530 219545 219692 219283 218701 218321 218625 219894 221647 223011 223785 224556 225570 226262
56396B26262j3l05k36n39j134j150m02M31J038J624J910J411O45O32J179J204
56380B32557P39Q60J534J437L10m45p2M66M10L27O22O61K73L59J128J424P97M67
56362B43854J163J765J328P89J183J780J482O92L21K02J8M50J902L141K860J626
56346B64556Q34O58M79L67O83J041J088J422K452L180K538J182O04J190K262L291
56330B87827L935L761K986K682L290L900L903L963M406M146K646J311J327J597
56316C31680N77j125j934j836j752j471l32R86J408J473K341L564L858L445L629
56301C44511M549N301N792O523O992O261M785L839L542L115K642K812L322L330
56287D07316L111L580M641N556O414P530Q145P565O876P498Q770R134R019J0093
$$ plain form
56396 226262 226249 225944 225708 225169 224035 222885 222483 222914 223952 225576 227486 228897 229542 230174 231353 232557
56380 232557 233296 234156 235690 237127 237437 236992 236920 237386 237796 238123 238745 239406 239679 240038 241166 242590 243387 243854
56362 243854 245017 246782 248110 248899 250082 251862 253344 254036 254357 254559 254577 255027 256929 260070 262930 264556
56346 264556 265390 266048 266527 266894 267577 268618 269706 271128 273580 276760 279298 280480 281084 282274 284536 287827
56330 287827 291762 295523 298509 301191 304481 308381 312284 316247 320653 324799 327445 328756 330083 331680
56316 331680 332257 331132 329198 327362 325610 324139 323807 324793 326201 327674 330015 333579 337437 340882 344511
56301 344511 349060 354361 360153 366676 373668 379929 384714 388553 392095 395210 397852 400664 403986 407316
56287 407316 410427 414007 418648 424204 430618 438148 446293 453858 460734 468232 477002 486136 495155 505248
56273E05248J2126J3183J2902J2983J4236J5482J5877J6207J7303J8931K0745
56262F75223K2859K5080K7040K9252L2672L7254M2207M7542N3879O0986O8089
56251A122083P5360Q3531R2376J01199J10313J20129J29275J35706J39411J41851
56241B251234J42976J41005J35138J26195J14420R8954P9821N8372L5422J0912
56231C194449j4221l7809n8579p6715r2093j03904j12385j18956j24068j26633
56221B329086j26127j23586j20022j15358j09433j02585r5053q7080p9763p4193
56211A295886o9746o4747n8962n3733m9679m6018m2265l8834l5759l2483k9092
56200G74568k6172k3475k0292j7054j4823j3399j1691r796q744q444p842o980
$$ plain form
56273 505248 517374 530557 543459 556442 570678 586160 602037 618244 635547 654478 675223
56262 675223 698082 723162 750202 779454 812126 849380 891587 939129 993008 1053994 1122083
56251 1122083 1197443 1280974 1373350 1474549 1584862 1704991 1834266 1969972 2109383 2251234
56241 2251234 2394210 2535215 2670353 2796548 2910968 3009922 3089743 3148115 3183537 3194449
56231 3194449 3180228 3142419 3083840 3007125 2915032 2811128 2698743 2579787 2455719 2329086
56221 2329086 2202959 2079373 1959351 1843993 1734560 1631975 1536922 1449842 1370079 1295886
56211 1295886 1226140 1161393 1102431 1048698 999019 953001 910736 871902 836143 803660 774568
56200 774568 748396 724921 704629 687575 672752 659353 647662 637866 629122 620678 612836 605856
56188F05856o777o900o083m420l161k345r88M77N34n42p87K47R12N11L27J097
56172E77958J790J658J291J170J183J881M027O632P747P354P177P593P410O806
56158F41677P490R470J0617J0267J0346J2087J4309J5924J7597J9883K2178K4472
56146H16317K7899L2734L8019M3759N1023N9467O7252P3887Q0369Q6059Q8378
56135A465163Q6316Q1333P4244O4527N3502M4777M0019L7244L4400L1611K8713
56124B041849K3918J6600Q531R58o841j4876k1497k6669l3117m2570n3552o4222
56112A828512p4300q2750q6821q5419q0687p4639o6961n7644m8659m1213l4241
56101A095178k7241k1715j8170j4764j0621p378n838m212j454Q90J903K973M614
$$ plain form
56188 605856 599079 592179 586096 581676 578515 576170 575182 575659 576193 575651 574864 575111 576023 576534 576861 577958
56172 577958 579748 581406 582697 583867 585050 586931 590958 597590 605337 612691 619868 627461 634871 641677
56158 641677 649167 658637 669254 679521 689867 701954 716263 732187 749784 769667 791845 816317
56146 816317 844216 876950 914969 958728 1009751 1069218 1136470 1210357 1290726 1376785 1465163
56135 1465163 1551479 1632812 1707056 1771583 1825085 1869862 1909881 1947125 1981525 2013136 2041849
56124 2041849 2065767 2082367 2090898 2091856 2085015 2070139 2048642 2021973 1988856 1946286 1892734 1828512
56112 1828512 1754212 1671462 1584641 1499222 1418535 1343896 1276935 1219291 1170632 1129419 1095178
56101 1095178 1067937 1046222 1028052 1013288 1002667 995289 989451 985239 983785 984675 986578 989551 994165
56088I94165N031L802L406N096O813P221Q074J0278J1591J0765J0122J1275J2132
56075A099771J1137J0616J2655J5127J5335J4372J4548J5446J5808J6333J7526
56064A258674J7760J6474J6196J8390K0538K0326J9486K0220K1238K0665J9705
56053A469672J9961K0214J9187J8446J9411K0541K0530K1037K3287K5419K6108
56042A703813K7164K9624L1282L1188L2211L5852L9030L9605M0278M3177M5489
56031B098713M4891M4357M6869N0026N0784N0879N2627N4046N3270N3123N6011
56020B655596N8997N9308N9929O4138O9355P2237P4915Q0167Q5427Q7749Q9760
56009C457578R4426R9045J00897J03429J10033J17226J21052J24649J32072J40449
$$ plain form
56088 994165 999196 1002998 1006404 1011500 1018313 1025534 1033608 1043886 1055477 1066242 1076364 1087639 1099771
56075 1099771 1110908 1121524 1134179 1149306 1164641 1179013 1193561 1209007 1224815 1241148 1258674
56064 1258674 1276434 1292908 1309104 1327494 1348032 1368358 1387844 1408064 1429302 1449967 1469672
56053 1469672 1489633 1509847 1529034 1547480 1566891 1587432 1607962 1628999 1652286 1677705 1703813
56042 1703813 1730977 1760601 1791883 1823071 1855282 1891134 1930164 1969769 2010047 2053224 2098713
56031 2098713 2143604 2187961 2234830 2284856 2335640 2386519 2439146 2493192 2546462 2599585 2655596
56020 2655596 2714593 2773901 2833830 2897968 2967323 3039560 3114475 3194642 3280069 3367818 3457578
56009 3457578 3552004 3651049 3751946 3855375 3965408 4082634 4203686 4328335 4460407 4600856
55999D600856J46030J52108J62759J74640J83457J92475K05833K19768K29755
55990F267681K39973K55979K74477K90348L07119L29914L54947L77112M00879
55981I098429M32230M67330N01072N38847N87142O41141O95127P55959Q31788
55972A4549065R17541J007417J111055J239998J389784J554723J748399J988798
55964B5506780K276716K612841L022617L538385M172276M935631N866501P001796
55956E8933543Q340754R879667J1669690J3801104J6356387J9423338K3085312
55949A61489795K7251425L1451392L4863772L6537651L5499157L0761588K1683122
55942C79537902Q749410n979785j9528750k9437533l4785768l6111195l4636537
$$ plain form
55999 4600856 4746886 4898994 5061753 5236393 5419850 5612325 5818158 6037926 6267681
55990 6267681 6507654 6763633 7038110 7328458 7635577 7965491 8320438 8697550 9098429
55981 9098429 9530659 9997989 10499061 11037908 11625050 12266191 12961318 13717277 14549065
55972 14549065 15466606 16474023 17585078 18825076 20214860 21769583 23517982 25506780
55964 25506780 27783496 30396337 33418954 36957339 41129615 46065246 51931747 58933543
55956 58933543 67274297 77153964 88823654 102624758 118981145 138404483 161489795
55949 161489795 188741220 220192612 255056384 291594035 327093192 357854780 379537902
55942 379537902 388287312 382307527 362778777 333341244 298555476 262444281 227807744
55935B27807744l1593347k7932362k4255530k0841492j7764921j5039627j2672308
55928G7708157j0643835q914541p457141o253976n268986m453988l778375l227121
55920B7710194k776334k396304k073559j806835j585609j393089j225384j087478
55912A3365602r73979q72092p79841p03716o41458n83554n28890m83404m45713
55903G352955m08666l72706l43914l20916k96892k72362k53356k38816k22191
55894D623136k03748j89500j79306j67455j53910j43948j37428j28883j17774
55885C201184j08851j02767r5564q7214q1970q0527p9753p9394q1273q2998q0338
55874B240535p4843p1575p0508o7751o3825o2697o3641o1996n7438n3914n1992
$$ plain form
55935 227807744 196214397 168282035 144026505 123185013 105420092 90380465 77708157
55928 77708157 67064322 58149781 50692640 44438664 39169678 34715690 30937315 27710194
55920 27710194 24933860 22537556 20463997 18657162 17071553 15678464 14453080 13365602
55912 13365602 12391623 11519531 10739690 10035974 9394516 8810962 8282072 7798668 7352955
55903 7352955 6944289 6571583 6227669 5906753 5609861 5337499 5084143 4845327 4623136
55894 4623136 4419388 4229888 4050582 3883127 3729217 3585269 3447841 3318958 3201184
55885 3201184 3092333 2989566 2894002 2806788 2724818 2644291 2564538 2485144 2403871 2320873 2240535
55874 2240535 2165692 2094117 2023609 1955858 1892033 1829336 1765695 1703699 1646261 1592347 1540355
55863A540355m8689m4368m2381m2211m0088l6165l4060l3572l0860k5731k1947
55852A140283k0201j7635j4381j3907j6418j8334j8820k0528k3422k4118k2201
55841I30318k1101k1851k1642j9601j8373j8870j8709j7038j5885j5644j4119
55830G27485j1046r006q843q579p624p683q849r163q653r492j1575j2339j1462
55817F03171j1368j2458j2253j0024p948o971n715m137l927m643l751j293k27
55804E18456j223j496K15J829K255L256N449O525N152L073J758K67k080m141n400
55789E33895o910q637q848p235n697n117m481l925n346q873j1966j3148j3608
55776D30104j4135j3603j1661r842q769p185m767l079k705k307j512j682k889
$$ plain form
55863 1540355 1491666 1447298 1404917 1362706 1322618 1286453 1252393 1218821 1187961 1162230 1140283
55852 1140283 1120082 1102447 1088066 1074159 1057741 1039407 1020587 1000059 976637 952519 930318
55841 930318 909217 887366 865724 846123 827750 808880 790171 773133 757248 741604 727485
55830 727485 716439 707433 698590 690011 682387 674704 665855 656692 648039 638547 626972 614633 603171
55817 603171 591803 579345 567092 557068 549120 542149 536434 532297 528370 523727 519976 518683 518456
55804 518456 517233 515737 515952 517781 520036 523292 528741 535266 540418 543491 545249 545516 543436 539295 533895
55789 533895 526985 518348 509500 502265 496568 491451 486970 483045 477699 468826 456860 443712 430104
55776 430104 415969 402366 390705 380863 372094 364909 360142 357063 354358 352051 350539 348857 345968
55763C45968l171j952j201k013k931k903k890l333k937j424o79j765l493n102
55749C10174p491j0450j1637j0124q215p940q234p394n948n108m453l174j895
55736B18111j476j486j231r90j061j068j000j405j941j544o17q73k374l057k042
55721A95946r72j151j682j633j701k385k669j863q79m99k59J3l83j138o31J383
55705A79497K984L056K755K871K171o2k144k438j788j841k540k899k742k305j486
55690A73089o64p56j549j522k68P96R23J230K350L103K681K131K312K427J865
55675A88148J513J847J719M27q49j121j122j435j209k34j47j766l230k708j135
55660A78698l60l23k1L39J67L5N34Q62L60K0P97J810J920J649J793J564N6j737
$$ plain form
55763 345968 342797 340845 339644 337631 334700 331797 328907 325574 322637 321213 320534 318769 315276 310174
55749 310174 302683 292233 280596 270472 262257 254317 246083 238689 232741 227633 223180 220006 218111
55736 218111 216635 215149 213918 212928 211867 210799 209799 208394 206453 204909 204292 203419 201045 197988 195946
55721 195946 194974 193823 192141 190508 188807 186422 183753 181890 181011 180512 180253 180266 179883 178745 178114 179497
55705 179497 182481 185537 188292 191163 193334 193272 191128 188690 186902 185061 182521 179622 176880 174575 173089
55690 173089 172425 171669 170120 168598 168330 169126 170049 171279 173629 176732 179413 181544 183856 186283 188148
55675 188148 189661 191508 193227 193654 192805 191684 190562 189127 187918 187684 187537 185771 182541 179833 178698
55660 178698 178338 178015 177994 178333 178500 178535 179069 179931 180291 180311 181108 182918 184838 186487 188280 189844 189900 188163
55642A88163k295j871j717k161l010m528o331o704m911k833k451k979k558j378
55628A42436r73j394j486j175j281j604j285o10o15j197j350q53k91J84O80O96
55612A29882j52j116j357j327j803k362k239j890k145k580k225j306p42n72k44
55597A07822P6j09n65q44j089j300p42O36J432Q29J89R73K291K441J746J683K188
55580A17657K079J535J850L035L803L808L933M529N155N925P259Q504Q534P593
55566A85199O832O210M613J993m42k232m078o157p637q166q321q310p627o223
55552A45654m853l972l401l064l040k915k227j411j191j257q07j69m07j414j844
55537A13682j119j16M04P35J296J776J699J046O5r01j409j361j304j702k174k174
$$ plain form
55642 188163 185868 183997 182280 180119 177109 172581 166250 159546 154635 151802 149351 146372 143814 142436
55628 142436 141463 140069 138583 137408 136127 134523 133238 132628 132013 130816 129466 128613 128322 128506 129186 129882
55612 129882 129730 128614 127257 125930 124127 121765 119526 117636 115491 112911 110686 109380 108638 108066 107822
55597 107822 107898 107789 107224 106380 105291 103991 103249 103885 105317 106146 106335 107308 109599 112040 113786 115469 117657
55580 117657 119736 121271 123121 126156 129959 133767 137700 142229 147384 153309 160568 169072 177606 185199
55566 185199 192031 198241 202854 204847 204405 202173 198095 191938 184301 176135 167814 159504 151877 145654
55552 145654 140801 136829 133428 130364 127324 124409 122182 120771 119580 118323 117516 117347 116940 115526 113682
55537 113682 112563 112447 112851 113586 114882 116658 118357 119403 119468 118567 117158 115797 114493 112791 110617 108443
55521A08443j869j648j284n84j93o74j389j470j312j789k532k474j726j369j585
55506H6545j541j007o59p04o27l22k46l91k76J02L68O76J309J662R34l16p57l06
55488H4444j09n37o65J3Q08J073J031R99Q43M97R6m37j142j415p12L15N23j7k38
55469H5370Q8J23m12p56n21l50p62j382j630j349o18K78P28M57J18L44N95N8p72
55450G9607p83j48k7n17o27k10k56r91j436j149q78r90p97N0Q39J045J038J121
55432G4891J013P90J030J574J397K66o89o04K4L94M49L71J52Q4O68J599J957J726
55414H7092J856K438K288R26m32p53o72j166j871j852j173o54o69j038j446j399
55398H1475m44R90J713J283O30N65O53K20l71l35L29J020J398J410J015M05l7
$$ plain form
55521 108443 106574 104926 103642 103058 102865 102191 100802 99332 98020 96231 93699 91225 89499 88130 86545
55506 86545 85004 83997 83338 82634 82007 81685 81439 81048 80772 80874 81242 81918 83227 84889 85823 85507 84750 84444
55488 84444 84335 83798 83133 83146 83954 85027 86058 87057 87900 88397 88493 88056 86914 85499 84787 85102 85625 85608 85370
55469 85370 85458 85581 85169 84413 83892 83542 82780 81398 79768 78419 77801 78079 78807 79264 79382 79726 80321 80379 79607
55450 79607 78824 78676 78649 78132 77505 77295 77039 76048 74612 73463 72585 71595 70798 70848 71687 72732 73770 74891
55432 74891 75904 76694 77724 79298 80695 80961 80272 79668 79692 80086 80535 80906 81058 81142 81810 83409 85366 87092
55414 87092 88948 91386 93674 94600 94168 93415 92743 91577 89706 87854 86681 86027 85358 84320 82874 81475
55398 81475 81031 82021 83734 85017 85647 86212 86865 87085 86714 86379 86708 87728 89126 90536 91551 91956 91919
55381I1919l89j070j846j824r56m24q83j404r45Q4O99Q57J041J040L99m13m58
55364H5427K19N87M4r12j411j061j59N40M28k71p32o28m60n33m04J74M75k22j395
55345G9706j878j355n20N1M39Q29J110J092P90L79M8j45l24n58o56m91l51n32
55327G7634p15m01J42K02j34pP35J133O18r2j69J49K81L95Q47J188O81n21j584
55308H0382k086k235k107j501m82M21Q12P93P54R27J193J260J019O23J76l95q86
55291G8668p10K87J226J191N08J99M24N08L06L40N23J28p74j116m91K05K88J72
55273H1882K18p1q58j234n82L20N39L92N73Q01M67p2o3K94K57j33k11Q5J86j00
55253H2690m07n02m70l64k96n48j046j158o22j41l45o72k25P34J111N54k40o51
$$ plain form
55381 91919 91530 90460 88614 86790 85834 85410 84527 83123 82178 82262 82961 83818 84859 85899 86298 85885 85427
55364 85427 85646 86233 86277 85365 83954 82893 82734 83274 83702 83431 82699 82071 81611 81078 80674 80848 81323 81101 79706
55345 79706 77828 76473 75953 76004 76443 77272 78382 79474 80264 80643 80691 80546 80222 79664 79008 78517 78166 77634
55327 77634 76919 76518 76660 76862 76728 76721 77456 78589 79207 79115 78946 79095 79376 79771 80618 81806 82487 81966 80382
55308 80382 78296 76061 73954 72453 71971 72392 73204 73997 74751 75678 76871 78131 79150 79773 79949 79554 78668
55291 78668 77958 78245 79471 80662 81170 81369 81793 82301 82607 82947 83470 83598 82824 81708 81217 81422 81710 81882
55273 81882 82100 82029 81171 79937 79355 79675 80214 80606 81179 81980 82447 82375 82312 82606 82863 82730 82519 82604 82790 82690
55253 82690 82283 81781 81311 80947 80651 80103 79057 77899 77277 77136 76791 76119 75894 76628 77739 78293 78053 77402
55235G7402p42p20o00m08j74K15P09Q41L95o3J22O95Q92N55J58r0l68o35n53o4
55215G7567N32R98J207R09R3n78l06Q28J826J842R28k03q22o37K7N37N60K26k52
55196H5282p58r72n49K06M29j26o89o41l74m32n76l67r6k37n36m27L8M45P92J163
55176H1575J161M99j83r0M51M77j25n73m95k94k43j18J75L98M60M77L86Q5j37
55157H3886mJ46j11m00n3O55Q40M68M04Q92J067L43p02j273j322j147p49j41K66
55138H3065J54j78l03k81m14o44o24k50K05M19K94Pj51q1O1J18K02M05N21L33
55118H2858Q9K55Q07J215J124P57N26N50O42N57K33j08j28J85M90O28R10J513
55100I3103J934J536M78l90n36k09M2j7j93o8N75J369J587J019K85l9j82n93r40
$$ plain form
55235 77402 76660 75940 75340 74932 74758 74973 75682 76523 76918 76855 76977 77672 78564 79119 79277 79187 78819 78184 77631 77567
55215 77567 78099 79097 80304 81213 81306 80728 80422 81250 83076 84918 85846 85643 84821 84184 84211 84748 85308 85534 85282
55196 85282 84524 83552 83003 83209 83638 83512 82823 82182 81808 81376 80800 80433 80337 80100 79564 79137 79175 79620 80412 81575
55176 81575 82736 83235 83052 82962 83413 83890 83765 83192 82697 82403 82160 82042 82217 82615 83075 83552 83938 84023 83886
55157 83886 83882 84028 83917 83517 83464 84119 84959 85427 85831 86723 87790 88133 87431 86158 84836 83689 82940 82799 83065
55138 83065 83219 83041 82738 82457 82043 81399 80775 80525 80730 81149 81443 81450 81299 81218 81279 81397 81599 82004 82525 82858
55118 82858 82947 83202 84009 85224 86348 87105 87631 88181 88823 89380 89613 89505 89377 89562 90052 90680 91590 93103
55100 93103 95037 96573 97051 96661 96125 95916 95958 95941 95748 95680 96255 97624 99211 100230 100515 100476 100294 99701 98761
55081I8761n00N92J260P95l42j200j326q77j20P41J452J595Q90l86j399j504j039
55064I7393q60j068q66N0P62M22m46p38l92k03l23r4O10R65M26m36p65m87j54
55045I3796r5j68j44jQ8p2m83r06j110j091r55p25l87O2O82J435J866J336o8j314
55025I1746j422n07N30J022Q80L29k50m10m2M67O88N80K42k68o82n79o0J67k30
55006I2201o65m97J37P96J340J599J148J46l65K15J137J449J291J184Q85J19m24
54989A01696r7L01l22j376j332j13Q92J041R65R21L74n25p08N9O80N22K93N86
54971A03857Q69O71N29Q87J134O11k27n30k58L8N4k14o77r54n82J59L24l06p44
54952A04641k01P80J187Q72L44j27m84n40k43K6Ln9O2P5k81p14q31o77m18K7O09
$$ plain form
55081 98761 98261 98853 100113 100908 100566 99366 98040 97163 97043 97784 99236 100831 101721 101335 99936 98432 97393
55064 97393 96533 95465 94599 94649 95411 95833 95387 94649 94257 94054 93731 93637 94247 95212 95638 95202 94437 93950 93796
55045 93796 93701 93533 93389 93388 93476 93404 92921 92015 90905 89814 88859 88134 87747 87809 88491 89926 91792 93128 93060 91746
55025 91746 90324 89817 90347 91369 92249 92578 92328 91918 91876 92343 93031 93611 93853 93585 92903 92324 92264 92431 92201
55006 92201 91536 91039 91176 91972 93312 94911 96059 96205 95840 96055 97192 98641 99932 101116 102001 102120 101696
54989 101696 101599 101900 101578 100202 98870 98757 99649 100690 101655 102576 102950 102425 101717 101776 102456 102978 103271 103857
54971 103857 104726 105397 105926 106813 107947 108558 108331 107801 107543 107581 107635 107421 106744 105790 105208 105367 105691 105385 104641
54952 104641 104440 105220 106407 107279 107623 107496 107012 106472 106229 106255 106258 106199 106261 106336 106055 105341 104510 103833 103415 103442 104051
54931A04051R04O91L35K17K65M08Q83J683K297K499K858L822M878N199M770M217
54915A39977L838L350K369P68j204k878l556l333l047l177l271k862k321k236
54901A22417k458k356j810j287j183j453j767j716j138m76l76p24n78N35J839
54886A07469K285J846J300J126J188J249J290J461K046L184M475N198N185M905
54872A44207M524L572J999P51N37P04J28j256k634l619m418m951m790l983l154
54857A27617k649k217j623j045p30p36j018j455j713j509j029p84j060j704k350
54842A05995k561k006q85l3j87j087j726j469o50l3M3j22k9M78J042J250J129
54825I9149J000R52P20J88l85p09p29m58L5L95K48j94k50K90Q51R42P61O21M33
$$ plain form
54931 104051 104955 105646 105981 106198 106463 106871 107754 109437 111734 114233 117091 120913 125791 130990 135760 139977
54915 139977 143815 147165 149534 150302 149098 146220 142664 139331 136284 133107 129836 126974 124653 122417
54901 122417 119959 117603 115793 114506 113323 111870 110103 108387 107249 106773 106397 105673 105095 105630 107469
54886 107469 109754 111600 112900 114026 115214 116463 117753 119214 121260 124444 128919 134117 139302 144207
54872 144207 148731 152303 154302 155053 155590 156294 156422 155166 152532 148913 144495 139544 134754 130771 127617
54857 127617 124968 122751 121128 120083 119353 118617 117599 116144 114431 112922 111893 111109 110049 108345 105995
54842 105995 103434 101428 100543 100510 100323 99236 97510 96041 95391 95358 95401 95279 95250 95728 96770 98020 99149
54825 99149 100149 101101 101821 102009 101624 100915 100186 99728 99763 100158 100406 100212 99962 100252 101103 102045 102806 103427 103860
54806A03860J17L1L72O63L83k18m19K9P61J268J234O63O1O0N64P20J48l52J11
54787A10056J189J733J246L12k57j63L49P40O09J34j62k22m53p24k00J284K539
54770A18010K575K067K303L207L665L465L517M225M840M742M271L856L246K078
54756A66067N95p15j796k907m137n246n771n287l879k368j651j741j929j844j851
54741A25540k237k589k286j327l22J60P3j59r2L19P31Q51P57O78P29R53J389J910
54723A25078K299K645L278M100M489M225L949M125M096K905O92j455k853l641
54709A53932m043m047l796l555l237k556j664j030p55n72n25q81j416j576j375
54694A22904j469k037k404j978j025k00J08k08j008j717j630p78l5k6l85l50L33
$$ plain form
54806 103860 103977 104008 104380 105043 105426 105208 104789 104818 105579 106847 108081 108744 108805 108865 109429 110149 110297 109945 110056
54787 110056 111245 112978 114224 114536 114279 114116 114465 115205 115814 115948 115786 115564 115111 114387 114187 115471 118010
54770 118010 120585 122652 124955 128162 131827 135292 138809 143034 147874 152616 156887 160743 163989 166067
54756 166067 166662 165947 164151 161244 157107 151861 146090 140803 136924 134556 132905 131164 129235 127391 125540
54741 125540 123303 120714 118428 117101 116779 116939 117012 116853 116761 117080 117811 118662 119419 120097 120826 121779 123168 125078
54723 125078 127377 130022 133300 137400 141889 146114 150063 154188 158284 161189 161881 160426 157573 153932
54709 153932 149889 145842 142046 138491 135254 132698 131034 130004 129249 128677 128152 127271 125855 124279 122904
54694 122904 121435 119398 116994 115016 113991 113791 113899 113691 112683 110966 109336 108558 108523 108497 108112 107762 108095
54677A08095J334K167K406J850Q53J24n9j27m78q78r08o63n42o38o94n92m81n20
54659A10249p79j201j475j093R8J451J954J279J25n13l35J28K06j95o13n61K3
54642A08748P70J173R87N21M01Q58J348J206N34K8l5m1j74p1L91O42K89j67j60
54623A17248J1k20n83m20Q3J23l66n78j90J14k00p09p79m72j63J62O23Q18J19
54604A14621j394k710k753j393L76J338J238R79J469K390K559J437j72j071q90
54589A16024k31J82Q9l37p81r72p41j35M86O14J37l92l99j16k81r38j220n95L04
54570A10698O06M00L44O13Q84R90R46O50K48L62J145J571O72q33j286m10L80N0
54552A18030p68r81m39L50J090J668J877J677J383J206J053Q34N77J44n52j026
$$ plain form
54677 108095 109429 111596 114002 115852 116705 116829 116770 116643 116165 115287 114379 113716 113174 112536 111842 111250 110769 110249
54659 110249 109470 108269 106794 105701 105799 107250 109204 110483 110608 110095 109760 109888 110094 109899 109286 108725 108748
54642 108748 109518 110691 111678 112199 112600 113458 114806 116012 116546 116574 116539 116498 116324 116253 116644 117286 117575 117408 117248
54623 117248 117259 117039 116456 116036 116119 116242 115876 115298 115108 115222 115022 114313 113534 113062 112899 113061 113684 114502 114621
54604 114621 113227 110517 107764 106371 106747 108085 109323 110302 111771 114161 116720 118157 117985 116914 116024
54589 116024 115793 115975 116064 115727 114946 113974 113233 113098 113584 114198 114335 113943 113544 113428 113147 112209 110989 110394 110698
54570 110698 111304 111704 112048 112661 113545 114535 115481 116131 116379 116741 117886 119457 120129 119296 118010 117600 117980 118030
54552 118030 117262 116281 115842 116192 117282 118950 120827 122504 123887 125093 126146 126980 127557 127701 127149 126123
54536A26123o87J24M06n2l91j48M1l41p64o59m43o99j042p38K7M18K00r5j14p7
54516A21089k39n68r01j048q04k46J38Ol66m27k0O37J296J684J470O31k41m90
54498A21601p5N50R78J065Q33M76K48J37j49o41r48p98l79R8O88J249J247N37
54480A26717j36p0M41O42N24O91J262J630J382P62K28l4m0R1J87K04L17N49N68
54461A35915K39L1L71Q44P48J80j40p3k11o99q86m36Rj82o29n77q3J35k43q75
54441A33438j357j553j341o93lK58K39N02R38O91m66j377r01M25J056N96K44Q81
54423A31577J825K007J509J143J125J075R57J014R44J42j120j713j169l89l89
54408A38538r72j186o83j1K57K18M27J192K113K321J412N5o18k65L70M87Q5k91
$$ plain form
54536 126123 125436 125560 125966 125914 125523 125375 125416 125075 124311 123652 123209 122510 121468 120730 120757 121175 121375 121280 121166 121089
54516 121089 120850 120282 119381 118333 117529 117283 117421 117427 117061 116634 116614 117251 118547 120231 121701 122332 122091 121601
54498 121601 121526 122076 123054 124119 124952 125428 125676 125813 125664 125023 124075 123277 122898 122996 123684 124933 126180 126717
54480 126717 126581 126511 126952 127594 128118 128809 130071 131701 133083 133845 134073 134039 133999 134090 134277 134481 134798 135347 135915
54461 135915 136154 136185 136556 137400 138148 138328 138188 138115 137904 137205 136319 135883 135892 135710 135081 134504 134421 134556 134313 133438
54441 133438 132081 130528 129187 128494 128491 128749 128988 129490 130428 131119 130653 129276 128375 128800 129856 130452 130696 131577
54423 131577 133402 135409 136918 138061 139186 140261 141218 142232 143176 143318 142198 140485 139316 138927 138538
54408 138538 137566 136380 135697 135686 135943 136161 136588 137780 139893 142214 143626 143681 143063 142798 143168 143655 143740 143449
54390A43449k57J54O47Q62O31J99j02k81m66l98K55J089J194M35k08J3O11P32
54372A48559M09K88N75R07J075J265J660K303L155L934M064L277K094J260Q09
54357A75634J89q04j715k109k090k025k049k010j761j344r94r38j214j635j979
54342A53156k066j840j466j256j286j203p30j63O3N3J81K47k26q92o83N93J710
54325A44192J568N66j95m19n71q71j054r27n44m8J89l20j431k161j776p25J18
54308A35591O33J168J521J150K22m99o77n85l02L27R41P53l27j408j711j407j062
54291A34328q39n60j42L50P75R02N91J26K5L76O90N07q5o16p18l62J64N20P28
54272A36760J113J699J893J229J76l47j26K34L09L49O57J074J298J259R66L86
$$ plain form
54390 143449 143192 143346 143993 144855 145486 145685 145583 145302 144836 144438 144693 145782 146976 147411 147203 147216 147827 148559
54372 148559 148968 149256 149831 150738 151813 153078 154738 157041 160196 164130 168194 171471 173565 174825 175634
54357 175634 175823 175019 173304 171195 169105 167080 165031 163021 161260 159916 158922 157984 156770 155135 153156
54342 153156 151090 149250 147784 146528 145242 144039 143309 143146 143209 143262 143443 143690 143464 142572 141889 142482 144192
54325 144192 145760 146326 146131 145712 145141 144270 143216 142289 141745 141697 141886 141566 140135 137974 136198 135473 135591
54308 135591 136224 137392 138913 140063 140285 139786 139109 138524 138222 138549 139490 140243 139916 138508 136797 135390 134328
54291 134328 133489 132929 132787 133137 133912 134814 135405 135531 135556 135932 136622 137129 137044 136428 135710 135348 135512 136032 136760
54272 136760 137873 139572 141465 142694 142870 142523 142397 142631 142940 143289 143946 145020 146318 147577 148543 148929
54256A48929k86n96l22K67Q13J243J492J281M79m60q16l41M45Q17N63J11l3J01
54238A53687O9l12o87o97m83m31n80o31m50k47l06p13j295j657j490r80p04q73
54220A41220r95o00K4K64Q4p5n3r8k75l15o1L51P59J042J011O68M42O69R54O42
54200A45658r3l09M30J457J826J283K06q63j422j270q65r28j480j725j201m47
54184A40257j38m3N48J615K369K343J935J672J464Q99%o73o65j12M76P51P00M54
54166A53852J10j71k00l9n2n16j241j766j831j503r02j07O68J053P57p3q43r32
54148A46264k88M80P85P48Q99J294J404R93M69J62k26j015j816j982j484q26k94
54131A45567K14P08R83R09N84J96m6l3j2l46q34p25J63Q91O00k08l13O04J785
$$ plain form
54256 148929 148643 148047 147725 147992 148805 150048 151540 152821 153300 152840 152024 151683 152128 152945 153508 153619 153586 153687
54238 153687 153756 153444 152757 152060 151577 151146 150566 149935 149485 149238 148932 148219 146924 145267 143777 142797 142093 141220
54220 141220 140225 139625 139649 139913 139997 139922 139869 139771 139496 139181 139120 139471 140230 141272 142283 142951 143393 144062 145016 145658
54200 145658 145565 145256 145686 147143 148969 150252 150458 149595 148173 146903 146038 145110 143630 141905 140704 140257
54184 140257 140119 140076 140624 142239 144608 146951 148886 150558 152022 152921 152921 152248 151583 151471 151947 152698 153398 153852
54166 153852 153962 153791 153591 153552 153500 152984 151743 149977 148146 146643 145741 145634 146302 147355 148112 148039 147196 146264
54148 146264 145976 146456 147241 147989 148888 150182 151586 152579 153048 153210 152984 151969 150153 148171 146687 145861 145567
54131 145567 145781 146489 147472 148381 148965 149161 149115 149082 149070 148724 147890 147165 147328 148219 148819 148611 148298 148902 150687
54112A50687K559K860K662J855P55qk81m25n32k76L59Q75J018J080J319J628J968
54095A68103K559L343L817L638K902J715M3j757k896l004k585k215j802j045k76
54080A70540k17r57j633j305mJ270J609J190R45J374J995K185K016J872J750J540
54064A84170J560K074K491J932M84q52j490j727j887j810j397r11n02M6Q28J599
54048A84608K170K590K864K946K984L106L098K886L035M000N161N568N487N959
54034B36462O929P141O153N047M676M605M401M634N615O321N677M086K616J534
54020C05897O51L27P91J077L7j830k909k747k651l796n777p250p366o328n079
54005B63047m578m911n133m381l022k187k324k819l026k945k811k619k324k059
$$ plain form
54112 150687 153246 156106 158768 160623 161378 161370 161089 160664 160132 159856 160215 161090 162108 163188 164507 166135 168103
54095 168103 170662 174005 177822 181460 184362 186077 186120 184363 181467 178463 175878 173663 171861 170816 170540
54080 170540 170323 169366 167733 166428 166424 167694 169303 170493 171438 172812 174807 176992 179008 180880 182630 184170
54064 184170 185730 187804 190295 192227 192711 191859 190369 188642 186755 184945 183548 182637 182135 182181 183009 184608
54048 184608 186778 189368 192232 195178 198162 201268 204366 207252 210287 214287 219448 225016 230503 236462
54034 236462 243391 250532 256685 261732 266408 271013 275414 280048 285663 291984 297661 301747 304363 305897
54020 305897 306548 306875 307666 308743 308780 306950 304041 301294 298643 294847 289070 281820 274454 268126 263047
54005 263047 258469 253558 248425 244044 241022 238835 236511 233692 230666 227721 224910 222291 219967 217908
53991B17908j898j681j304r43q40r59j044r45q32r65j280j346q95k05L08P12J277
53974B05068J751J550O84j31m48m76l73Q8Q51J384J537J886K813L955N033O358
53958B31530P945R021R133Q898Q705P556M421J59l199m811n388n487m827l386
53944B60270j906r13j38O73J254J403J397J483J573J765K473L718M783M977M336
53929B87148L328K268J395J120J739K989M157M735M914N427O671P979Q130O823
53915C48823N306N039O064P244P811P987Q122Q011P202N538L269R87n86j182j324
53900D18311j646k020j950j656k058l477n091n958o068o079o409o991p580p994
53886C53334q111p866p266o443n721n473n692n942n906n723n459m761l546k671
$$ plain form
53991 217908 216010 214329 213025 212082 211242 210283 209239 208294 207462 206497 205217 203871 202976 202771 203079 203791 205068
53974 205068 206819 208369 209053 208922 208474 207998 207625 207713 208564 209948 211485 213371 216184 220139 225172 231530
53958 231530 239475 248496 257629 266527 275232 282788 287209 287368 284169 279358 273970 268483 263656 260270
53944 260270 258364 257451 257313 257986 259240 260643 262040 263523 265096 266861 269334 273052 277835 282812 287148
53929 287148 290476 292744 294139 295259 296998 299987 304144 308879 313793 319220 325891 333870 342000 348823
53915 348823 354129 359168 365232 372476 380287 388274 396396 404407 411609 417147 420416 421403 420817 419635 418311
53900 418311 416665 414645 412695 411039 408981 405504 400413 394455 388387 382308 375899 368908 361328 353334
53886 353334 345223 337357 330091 323648 317927 312454 306762 300820 294914 289191 283732 278971 275425 272754
53872B72754l084m438n362n153m418l882l388k504j470r95j328j985k294k064
53858B30389j766k050k896l466l060k054j406j407j509j327j094j047r65o29j53
53843B05560K90N73L88m59j393j413m62K76p1q28p83Q5P26O32M33P57J231J056
53825B06598J93n19l71M07R80Q70L84J51M50J106J803K297K448K276J967J740
53809B22780J785K247L108L997M465M584M816N220N246M723M388M875N672N759
53795B83665N004M140L664L457L370L303K900J948R80O80Q25O83K76J98J40r98
53779C14235l238n013n196m546m374m737m877m707m742n009m968m485m006l836
53765B50501l815l668l283k710k220k164k447k500k099j842k289l057l255k658
$$ plain form
53872 272754 269670 265232 259870 254717 250299 246417 243029 240525 239055 238060 236732 234747 232453 230389
53858 230389 228623 226573 223677 220211 217151 215097 213691 212284 210775 209448 208354 207307 206342 205713 205560
53843 205560 205850 206423 206811 206352 204959 203546 203084 203360 203289 202461 201678 201763 202489 203121 203554 204311 205542 206598
53825 206598 206791 206272 205901 206308 207288 208158 208542 208693 209143 210249 212052 214349 216797 219073 221040 222780
53809 222780 224565 226812 229920 233917 238382 242966 247782 253002 258248 262971 267359 272234 277906 283665
53795 283665 288669 292809 296473 299930 303300 306603 309503 311451 312431 313111 313936 314619 314895 315093 315233 314235
53779 314235 310997 305984 300788 296242 291868 287131 282254 277547 272805 267796 262828 258343 254337 250501
53765 250501 246686 243018 239735 237025 234805 232641 230194 227694 225595 223753 221464 218407 215152 212494
53751B12494j828j278j059j023j055r99p96o05n08k29M58J262J621J376Q35L29
53735B08995K1k7M9p0m47o91m87j24n8k21j54L31J047J811K430K556K108J654
53717B18723J764K152K078J538J263J514J697J448J252J556J977K005J958K427
53703B43352L087K998K072J448K054L398M231M032L394L086L282L684L930L751
53689B87799K977J726L88o60j301j580j601j591j804k136k149j680j177j088j218
53674B74905j136r45j062j345j179m77O1m0m12m95k72J0L11N47L36m69j289j436
53656B65613r47k96L74J115J553J181K65k89j58O0o3m0O95J765K331K313K393
53639B77865K856L106K575J579Q47N70L67Q9J03O60J428J960K328K935L803M455
$$ plain form
53751 212494 210666 209388 208329 207306 206251 205252 204456 203851 203343 203114 203572 204834 206455 207831 208666 208995
53735 208995 209016 208989 209038 208968 208521 207830 207343 207219 207161 206940 206786 207117 208164 209975 212405 214961 217069 218723
53717 218723 220487 222639 224717 226255 227518 229032 230729 232177 233429 234985 236962 238967 240925 243352
53703 243352 246439 249437 251509 252957 255011 258409 262640 266672 270066 273152 276434 280118 284048 287799
53689 287799 290776 292502 292890 292230 290929 289349 287748 286157 284353 282217 280068 278388 277211 276123 274905
53674 274905 273769 272824 271762 270417 269238 268761 268822 268782 268370 267875 267603 267613 267924 268471 268807 268338 267049 265613
53656 265613 264666 264370 264744 265859 267412 268593 268858 268569 268411 268471 268408 268368 269063 270828 273159 275472 277865
53639 277865 280721 283827 286402 287981 288828 289398 289765 289854 289957 290617 292045 294005 296333 299268 303071 307526
53623C07526M543M300M179M222M010L266K313J783J932K411K872L451M330N047
53609C56185M872L948L383L835M627M711M039L278K706K180J906K195K562K057
53595D02484O96m19o63o16q55r69m68P2k77j363k097j848j038m49n02j115j789
53578C88784j914j444j154j706k612k710j717o53n80j384k075j967j261o00l47
53563C66660l25j33K87N39K78k91n35j20N75P94J61q51j289o46O18J543J649J232
53545C70146Q02N87O61J094J753K214K231K123K482L554N089O568P476P579P219
53530D21578P157P858Q997R840J0019R834R830J0299J1090J1787J2120J2223J2402
53517E55034J2790J3433J4598J6485J8654K0234K0937K1375K2139K3114K3934
$$ plain form
53623 307526 312069 316369 320548 324770 328780 332046 334359 336142 338074 340485 343357 346808 351138 356185
53609 356185 361057 365005 368388 372223 376850 381561 385600 388878 391584 393764 395670 397865 400427 402484
53595 402484 403180 402761 402098 401482 400627 399658 399190 399262 398985 397622 395525 393677 392639 392190 391688 390573 388784
53578 388784 386870 385426 384272 382566 379954 377244 375527 374874 374294 372910 370835 368868 367607 367007 366660
53563 366660 366335 366202 366489 367028 367306 367015 366480 366360 366935 367729 367890 367039 365750 365104 365722 367265 368914 370146
53545 370146 370948 371535 372196 373290 375043 377257 379488 381611 384093 387647 392736 399304 406780 414359 421578
53530 421578 428735 436593 445590 455430 465449 475283 485113 495412 506502 518289 530409 542632 555034
53517 555034 567824 581257 595855 612340 630994 651228 672165 693540 715679 738793 762727
53506G62727K4599K5160K5281K4697K3756K2881K1861K0314J8657J7795J7852
53495A005580J7970J7510J6817J6515J6643J6858J7034J7187J7126J6725J6363
53484A192328J6574J7196J7327J6437J5189J4737J5311J5950J5644J4300J2360
53473A363353J0023P306M578K369O59j110l323n875q532j1037j2898j3720j3840
53460A317953j4054j4573j4825j4503j4178j4572j5788j7531j9429k0794k0828
53449A136878j9655j8488j8223j8368j8018j7206j6464j5607j3985j1688r514
53438I59662p797o138m363k918k116j634r85k3J172K459L594M341M776N242N981
53423I61253P092Q588J0228J1587J2631J3964J5991J8137J9549K0298K1138K2311
$$ plain form
53506 762727 787326 812486 837767 862464 886220 909101 930962 951276 969933 987728 1005580
53495 1005580 1023550 1041060 1057877 1074392 1091035 1107893 1124927 1142114 1159240 1175965 1192328
53484 1192328 1208902 1226098 1243425 1259862 1275051 1289788 1305099 1321049 1336693 1350993 1363353
53473 1363353 1373376 1380682 1385260 1387629 1388288 1387178 1383855 1377980 1369448 1358411 1345513 1331793 1317953
53460 1317953 1303899 1289326 1274501 1259998 1245820 1231248 1215460 1197929 1178500 1157706 1136878
53449 1136878 1117223 1098735 1080512 1062144 1044126 1026920 1010456 994849 980864 969176 959662
53438 959662 951865 945727 941364 938446 936330 934696 933711 933688 934860 937319 940913 945254 950030 955272 961253
53423 961253 968345 976933 987161 998748 1011379 1025343 1041334 1059471 1079020 1099318 1120456 1142767
53411A142767K3390K4265K5383K6893K8348K9495L0648L2018L3331L4446L5794
53400A466778L7800M0298M2805M5012M6739M7868M8601M9422N0495N1445N1931
53389A979194N2083N2141N1965N1260N0046M8613M7124M5430M3194M0144L6435
53378B497629L2732K9645K7009K4042K0263J5930J1517P121K520k479p943j3778
53366B644208j9691k5366l0759l5923m0590m4283m6882m8694m9868n0195m9639
53355B202318m8691m7857m7128m6170m4828m3203m1398l9500l7712l6347l5697
53344A733787l5835l6421l6741l6141l4506l2231k9842k7785k6276k5025k3266
53333A389718k0586j7592j5303j3919j2770j1476j0515j0445j1129j2020j2774
$$ plain form
53411 1142767 1166157 1190422 1215805 1242698 1271046 1300541 1331189 1363207 1396538 1430984 1466778
53400 1466778 1504578 1544876 1587681 1632693 1679432 1727300 1775901 1825323 1875818 1927263 1979194
53389 1979194 2031277 2083418 2135383 2186643 2236689 2285302 2332426 2377856 2421050 2461194 2497629
53378 2497629 2530361 2560006 2587015 2611057 2631320 2647250 2658767 2665888 2668408 2665929 2657986 2644208
53366 2644208 2624517 2599151 2568392 2532469 2491879 2447596 2400714 2352020 2302152 2251957 2202318
53355 2202318 2153627 2105770 2058642 2012472 1967644 1924441 1883043 1843543 1805831 1769484 1733787
53344 1733787 1697952 1661531 1624790 1588649 1554143 1521912 1492070 1464285 1438009 1412984 1389718
53333 1389718 1369132 1351540 1336237 1322318 1309548 1298072 1287557 1277112 1265983 1253963 1241189
53322A241189j3261j3343j2987j2414j1865j1328j0657r812q928q231p817p346
53310A113200o132l914j331P04K007L019L966M762N560O695Q063R327J0722J2850
53296A169498J5507J7663J8931K0119K1826K3411K4005K3820K3580K3318K2576
53285A404254K1455K0436J9407J7778J5561J3552J2154J0729Q356M888R67k738
53273A546799n943q568j0448j1529j2335j3841j6528j9654k1953k3017k3584k4406
53261A354993k5412k6161k6528k6626k6537k6448k6655k7121k7387k7173k6677
53250A062268k6058k5169k4082k3262k2822k2269k1406k0825k0865k0815j9987
53239H14708j8917j8478j8314j7312j5463j3985j3508j3225j2182j0458q706p310
$$ plain form
53322 1241189 1227928 1214585 1201598 1189184 1177319 1165991 1155334 1145522 1136594 1128363 1120546 1113200
53310 1113200 1107068 1103154 1101823 1102527 1104534 1107553 1111519 1116281 1121841 1128536 1136599 1145926 1156648 1169498
53296 1169498 1185005 1202668 1221599 1241718 1263544 1286955 1310960 1334780 1358360 1381678 1404254
53285 1404254 1425709 1446145 1465552 1483330 1498891 1512443 1524597 1535326 1543682 1548570 1549537 1546799
53273 1546799 1540856 1532288 1521840 1510311 1497976 1484135 1467607 1447953 1426000 1402983 1379399 1354993
53261 1354993 1329581 1303420 1276892 1250266 1223729 1197281 1170626 1143505 1116118 1088945 1062268
53250 1062268 1036210 1011041 986959 963697 940875 918606 897200 876375 855510 834695 814708
53239 814708 795791 777313 758999 741687 726224 712239 698731 685506 673324 662866 654160 646850
53227F46850o417o181o459o793o998p457q484r867j1246j2530j3622j4211j4157
53214E22428j3744j3230j2553j1725j1071j0726j0275r390q410p808p426o835
53202C99235o238o280o973p534p474p228p341p579p390o868o657o906o950o191
53188C01626m946m052l857l911l675l180k927l212l714l801l258k565k348k571
53174B53609k540j790p10m1j6k69m74o07o34m33j13p5n15j132j548j705j723j551
53156B37733j063l40L67Q01P53J06r69j979k447k252j572o67J22M13M1o69j070
53139B27308o77L75J354J472P10o1k1O33J036R23R49J546K136J916R92K23J18
53122B40932L88M90K33j55k62J82R78J575J622J317J027P75L66j96p26j126j424
$$ plain form
53227 646850 640433 634252 627793 621000 614002 606545 598061 588194 576948 564418 550796 536585 522428
53214 522428 508684 495454 482901 471176 460105 449379 439104 429714 421304 413496 406070 399235
53202 399235 392997 386717 379744 372210 364736 357508 350167 342588 335198 328330 321673 314767 307817 301626
53188 301626 296680 292628 288771 284860 281185 278005 275078 271866 268152 264351 261093 258528 256180 253609
53174 253609 251069 249279 248569 248528 248512 248243 247769 247162 246528 246095 245982 245907 245392 244260 242712 241007 239284 237733
53156 237733 236670 236330 236697 237498 238251 238357 237388 235409 232962 230710 229138 228471 228593 229006 229047 228378 227308
53139 227308 226631 227006 228360 229832 230542 230481 230460 231093 232129 233052 234001 235547 237683 239599 240591 240814 240932
53122 240932 241320 241810 242043 241888 241626 241808 242786 244361 245983 247300 248327 249102 249468 249272 248546 247420 245996
53105B45996j606j731j941k228k316k080j743j414q05J46P48L16p65j412j228
53090B27937q32p34o76l15J18K68K93N30Q87R86P44L96J01j15j45K5N4m14j131
53071B27977j400r85m94n61r87j106p85n75q27j204j234r55o35k32L98R70R37
53054B18302K57m84q02p35m62L3O94J224J479J711K007J816N80j248k406k155
53038B19811j096m03m42n08J03J057J361O32l64o85k78J71K17k4l35n98n38J25
53020B18206J145J845J948J827J799J664J214O78L31P4k44m97n90o99q70p73k51
53003B26807K47K42q3j97M5L70N26L93k6l79j30P44J554J810J836K006J924J099
52985B38788l5n69l52N5M08R26J493J592J112N81M25O37J149J879K411K275J657
$$ plain form
53105 245996 244390 242659 240718 238490 236174 234094 232351 230937 230132 230278 231026 231342 230577 229165 227937
53090 227937 227105 226371 225695 225380 225498 225766 226059 226589 227476 228462 229206 229602 229703 229588 229443 229468 229522 229108 227977
53071 227977 226577 225592 225098 224537 223550 222444 221659 221084 220257 219053 217819 216864 216229 215997 216395 217365 218302
53054 218302 218559 218075 217273 216538 216076 216109 216803 218027 219506 221217 223224 225040 225620 224372 221966 219811
53038 219811 218715 218312 217870 217362 217465 218522 219883 220515 220151 219466 219188 219359 219576 219552 219217 218619 218081 218206
53020 218206 219351 221196 223144 224971 226770 228434 229648 230326 230657 230731 230487 229990 229400 228701 227831 227058 226807
53003 226807 227054 227296 227213 227016 227061 227431 227957 228350 228324 227945 227815 228559 230113 231923 233759 235765 237689 238788
52985 238788 238753 238184 237832 237887 238295 239221 240714 242306 243418 243999 244424 245061 246210 248089 250500 252775 254432
52968B54432J181R48M93k09m99l3O40Q26M29l16j246k060k270j811j213r04p53
52951B47635o67r90j885k738k868k438k092j910j410n06J87J98j62k52N1K92J86
52934B30631K9K46O77P10J33m85m99k7K72N0m45q24r01o71k74L5J96M99J049J297
52914B31698O91l43p57k94J95N7l08k24K17M93M88M13K73o4m18n22m95o59r48
52895B29493r57n78r8K77O39J016J179J030Q25P96P51L63k57n70k99K53O11P14
52877B35188P88Q74Q01N83M77N66O66P27R64J419J771J791J647J479J136O26L97
52860B51900O54Q29L54m07o54m14n01j304k371l188l670l800l481k961k787l042
52844B25157l183k835k248j774j417j119j045j253j445j302p47J70J267K095K287
$$ plain form
52968 254432 255613 256561 257054 256845 256346 256313 256953 257779 258208 257892 256646 254586 252316 250505 249292 248388 247635
52951 247635 246968 245978 244093 241355 238487 236049 233957 232047 230637 230131 230318 230516 230354 230102 230153 230445 230631
52934 230631 230660 230906 231583 232293 232426 231941 231442 231415 231687 231737 231292 230468 229567 228896 228622 228657 228853 229352 230401 231698
52914 231698 232389 232046 231289 230995 231190 231247 230939 230715 230932 231425 231913 232326 232599 232535 232117 231595 231100 230441 229493
52895 229493 228536 227958 227860 228137 228776 229792 230971 232001 232826 233622 234373 234736 234479 233909 233610 233863 234474 235188
52877 235188 235976 236850 237651 238234 238711 239277 239943 240670 241634 243053 244824 246615 248262 249741 250877 251503 251900
52860 251900 252554 253383 253737 253330 252676 252262 251761 250457 248086 244898 241228 237428 233947 230986 228199 225157
52844 225157 221974 219139 216891 215117 213700 212581 211536 210283 208838 207536 206789 206959 208226 210321 212608
52829B12608K115K165K360J946O76o49j168r21n06k86l59p79j398j809j848j788
52813B10359j728j266j43J199K098K325K009J320N61J75K06J33m18j133j535j612
52797B12550j558j345r42n68k84J47O29N65j62o52j79O02N23m07j078q66k05L36
52779B07106O56P59N61K86L77Q08J032P59L24Q9rk05n25q52j007p86k33J62jl28
52759B08973p2P21J118O27m6M0P90J266R43K80O2N82J541K480L130L383L132K351
52741B31301J352O95O89J082J410J503J422J147O27Q0j79j72j75k73k81j89k61
52724B39778n70p87o27k45qo6l73r36j731k428k462j589k90N28L84k74m87J52
52706B27969J041J221M21p01j265r50j35N11O43M51L89N93P21M11j91n48l75K1
$$ plain form
52829 212608 214723 216888 219248 221194 221870 221221 220053 219132 218626 218340 217981 217202 215804 213995 212147 210359
52813 210359 208631 207365 207222 208421 210519 212844 214853 216173 216734 216909 217115 217248 216830 215697 214162 212550
52797 212550 210992 209647 208705 208137 207853 208000 208629 209194 209032 208380 208201 208803 209326 208919 207841 206975 206770 207106
52779 207106 207762 208521 209082 209368 209745 210553 211585 212344 212668 212757 212748 212543 212018 211166 210159 209373 209140 209302 209301 208973
52759 208973 208901 209622 210740 211367 211321 211361 212151 213417 214360 214640 214702 215284 216825 219305 222435 225818 228950 231301
52741 231301 232653 233348 234037 235119 236529 238032 239454 240601 241228 241308 241129 240957 240782 240509 240228 240039 239778
52724 239778 239208 238421 237794 237549 237541 237475 237102 236166 234435 232007 229545 227956 227666 228194 228578 228304 227817 227969
52706 227969 229010 230231 230652 229951 228686 227736 227601 228112 228755 229206 229595 230188 230909 231320 231129 230581 230206 230227
52688B30227P8m41j176j558j377r65p24o33l55J81O37P06M87K71J94K55M40O75
52670B26922P75N84R4n63j132j239p23L7M76N82R03J664K371K510K271K183K397
52653B40112K731L109L432L219J958j13j984k718k225j182m52m85j070j635j831
52638B40866j724j458j064o59m58l31J86J102J638J155J63k66J24N96O07M94P34
52621B41705J114R98K42n98r21p42n57o90r01p19o7P12J289J587J552J108M04
52604B45516k07n84q37r26o16MM95P43J115J663J799J175L58O2J78J83J14L82
52586B50617R45J332J304R63L99j85k47M95J398J525Q29J09j11pJ01O8k69q75
52568B58391j227q31p7J86j78n31o20q50j348j553j140n49k45j01J01J59j08l59
$$ plain form
52688 230227 230305 229864 228688 227130 225753 224788 224064 223431 223076 223257 223894 224600 225087 225358 225552 225807 226247 226922
52670 226922 227697 228281 228375 227812 226680 225441 224718 224755 225231 225813 226716 228380 230751 233261 235532 237715 240112
52653 240112 242843 245952 249384 252603 254561 254448 252464 249746 247521 246339 245887 245402 244332 242697 240866
52638 240866 239142 237684 236620 235961 235503 235172 235358 236460 238098 239253 239416 239150 239274 239870 240477 240971 241705
52621 241705 242819 243817 244059 243461 242540 241798 241241 240551 239650 238931 238864 239576 240865 242452 244004 245112 245516
52604 245516 245309 244725 243888 242962 242346 242350 242845 243588 244703 246366 248165 249340 249698 249760 249938 250121 250235 250617
52586 250617 251562 252894 254198 255161 255560 255375 255128 255623 257021 258546 259375 259484 259373 259366 259467 259535 259266 258391
52568 258391 257164 256333 256256 256442 256264 255733 255113 254263 252915 251362 250222 249673 249428 249327 249428 249587 249479 249120
52550B49120k49QJ3j73j85K9J83R5j33l20l70k74n6L21R22J543J660J053L45M11
52530B53943J232J808J413M31k87m21k89k33l03l55k53k2J33O0q4L6N29J173J698
52511B60209J994K143K432L121L955M176L380K061R06q3j229k290k752k777k935
52496B72311l154k830k064j671j856j836j179m61j92p0J35o6q97j530j172l48
52480B53120r4l86l20M58J445K209K762K981K559J664R85Q88J000Q38M34J68K80
52463B70991O97J162J392J306J168J312J717J920J401P1j541k604k635j992j493
52448B72872j579j962k152k050j872j729j517j098n20j34l63j130j667j317m24
52433B53358J00M7J07O20R91O71N7j60j9k3k18j59L46J044J613J820J484P39K07
$$ plain form
52550 249120 248871 248879 248892 248719 248534 248563 248746 248841 248708 248388 248018 247744 247688 248009 248931 250474 252134 253187 253532 253943
52530 253943 255175 256983 258396 258827 258540 258119 257830 257597 257294 256939 256686 256664 256797 256857 256773 256809 257338 258511 260209
52511 260209 262203 264346 266778 269899 273854 278030 281410 283471 284377 284294 283065 280775 278023 275246 272311
52496 272311 269157 266327 264263 262592 260736 258900 257721 257260 257068 256998 257133 257067 256170 254640 253468 253120
52480 253120 253026 252640 252320 252778 254223 256432 259194 262175 264734 266398 267383 268271 269271 270109 270543 270711 270991
52463 270991 271688 272850 274242 275548 276716 278028 279745 281665 283066 283137 281596 278992 276357 274365 272872
52448 272872 271293 269331 267179 265129 263257 261528 260011 258913 258393 258259 257896 256766 255099 253782 253358
52433 253358 253458 253505 253612 254232 255223 255894 255951 255791 255772 255749 255531 255372 255718 256762 258375 260195 261679 262418 262625
52414B62625M70J445K586L559M298M650M492M199M501N710P356Q629Q931P987
52400C31438N770K588q64l759n591o375o464o143n539m853m385m161l752k761
52386B85149j332N1J030J367R19J52K03J587L183L454K528J937K381L041L344
52371C08994L902N051N831N466M761M816N181M556K806J001j76q59j112p94l22
52356C49102l95q52o81N49K014K607K068J002K09J51O44J128J377J779K583L346
52340C66631L604L671M102M806N405O089P233Q503R274R751J0647J1908J2842
52327D64466J3447J4499J6193J7811J8902J9834K0785K1313K1321K1468K2023
52316F72062K2200K1310J9873J8901J8650J8772J9167J9914K0659K0812K0221
$$ plain form
52414 262625 263095 264540 267126 270685 274983 279633 284125 288324 292825 298535 305891 314520 323451 331438
52400 331438 337208 339796 338932 335173 329582 323207 316743 310600 305061 300208 295823 291662 287910 285149
52386 285149 283817 283868 284898 286265 287184 287336 287539 289126 292309 295763 298291 300228 302609 305650 308994
52371 308994 312896 317947 323778 329244 334005 338821 344002 348558 351364 352365 352189 351330 350218 349424 349102
52356 349102 348707 347855 347174 347723 349737 352344 354412 355414 355623 355774 356418 357546 358923 360702 363285 366631
52340 366631 370235 373906 378008 382814 388219 394308 401541 410044 419318 429069 439716 451624 464466
52327 464466 477913 492412 508605 526416 545318 565152 585937 607250 628571 650039 672062
52316 672062 694262 715572 735445 754346 772996 791768 810935 830849 851508 872320 892541
52305H92541J9166J7928J6757J6032J5876J5781J5027J3452J1508R625P844N993
52293A057530L888J411j390m222o643q315r194r638j0204j1043j1550j0984r463
52280I70183p895o787n567l440n39K147L853M735N541O843Q615J0421J1870J2849
52266A012829J3336J3307J3016J3056J3735J4618J5022J4908J4809J4998J5249
52255A168883J5352J5288J4907J4000J2765J1606J0406Q512N637K196j320m701
52243A273531p647r774j1248j2754j4416j5448j5307j4608j4338j4731j5386j5983
52231A111891j6269j5828j4634j3423j2843j2458j1348r495p842o975o470n606
52219I78700m239k816j905j782k108k048j024O85K301L383L966M126L958L818
$$ plain form
52305 892541 911707 929635 946392 962424 978300 994081 1009108 1022560 1034068 1043693 1051537 1057530
52293 1057530 1061418 1062829 1061439 1057217 1050574 1042259 1033065 1023427 1013223 1002180 990630 979646 970183
52280 970183 962288 955501 949934 946494 945955 948102 951955 956690 962231 969074 977689 988110 999980 1012829
52266 1012829 1026165 1039472 1052488 1065544 1079279 1093897 1108919 1123827 1138636 1153634 1168883
52255 1168883 1184235 1199523 1214430 1228430 1241195 1252801 1263207 1271719 1277356 1279552 1278232 1273531
52243 1273531 1265884 1256110 1244862 1232108 1217692 1202244 1186937 1172329 1157991 1143260 1127874 1111891
52231 1111891 1095622 1079794 1065160 1051737 1038894 1026436 1015088 1005593 997751 990776 984306 978700
52219 978700 974461 971645 969740 967958 965850 963802 962778 963463 965764 969147 973113 977239 981197 985015
52205I85015M045M369M189L530L143L485M163M596M791N070N423N548N345M999
52191A047711M655M317L982L640L183K492J585N31p42k378m313o151p427p948
52177A043137q004q157q686r182q937p766o291n235m653m111l344k396j198L91
52163I65568K077L139L260K929K780K823K761K594K488K227J516O33J48M8j79
52148I94812m87j57R95K118K505K577L008L531L447K868K543K679K817K793K998
52133A029047L602M376N376P073R549J2255J4788J7329K0022K2574K4793K6922
52121A197706K8986L0385L0684L0370L0291L0614L0813L0447K9423K7713K5381
52110A522813K2865K0729J9007J7120J4591J1630Q907O885N454M143K639J035
$$ plain form
52205 985015 989060 993429 997618 1001148 1004291 1007776 1011939 1016535 1021326 1026396 1031819 1037367 1042712 1047711
52191 1047711 1052366 1056683 1060665 1064305 1067488 1069980 1071565 1072096 1071354 1068976 1064663 1058512 1051085 1043137
52177 1043137 1035133 1026976 1018290 1009108 1000171 992405 986114 980879 976226 972115 968771 966375 965177 965568
52163 965568 967645 970784 974044 976973 979753 982576 985337 987931 990419 992646 994162 994795 994943 994991 994812
52148 994812 994325 994168 995163 997281 999786 1002363 1005371 1008902 1012349 1015217 1017760 1020439 1023256 1026049 1029047
52133 1029047 1032649 1037025 1042401 1049474 1059023 1071278 1086066 1103395 1123417 1145991 1170784 1197706
52121 1197706 1226692 1257077 1287761 1318131 1348422 1379036 1409849 1440296 1469719 1497432 1522813
52110 1522813 1545678 1566407 1585414 1602534 1617125 1628755 1637662 1644547 1650001 1654144 1656783 1657818
52098A657818l89j593k869m580o915r767j2714j5265j7319j9292k1445k3292k4021
52085A498357k3406k1867j9786j7316j4797j2662j0789q605o093l964k513r21
52073A355638J725N220Q589J1216J3052J4132J4604J5052J6085J7478J8354J8224
52061A509369J7490J6757J6135J5407J4553J3840J3377J2778J1298Q489M761J174
52049A655428j461l247m935p191j0180j3644j7106k0078k2269k3691k4538k5014
52037A482074k5211k5019k4221k2863k1392k0231j9291j8221j7014j5989j5253
52026A257369j4714j4510j4821j5189j4798j3641j2683j2496j2403j1505r963
52015A110646q679q110q027q149q442q986r917j1334j2943j4191j5061j6200j7844
$$ plain form
52098 1657818 1657429 1655836 1652967 1648387 1641472 1631705 1618991 1603726 1586407 1567115 1545670 1522378 1498357
52085 1498357 1474951 1453084 1433298 1415982 1401185 1388523 1377734 1369129 1363036 1359072 1356559 1355638
52073 1355638 1357363 1362583 1371172 1382388 1395440 1409572 1424176 1439228 1455313 1472791 1491145 1509369
52061 1509369 1526859 1543616 1559751 1575158 1589711 1603551 1616928 1629706 1641004 1649493 1654254 1655428
52049 1655428 1653967 1650720 1645785 1638594 1628414 1614770 1597664 1577586 1555317 1531626 1507088 1482074
52037 1482074 1456863 1431844 1407623 1384760 1363368 1343137 1323846 1305625 1288611 1272622 1257369
52026 1257369 1242655 1228145 1213324 1198135 1183337 1169696 1157013 1144517 1132114 1120609 1110646
52015 1110646 1101967 1093857 1085830 1077681 1069239 1060253 1050336 1039002 1026059 1011868 996807 980607 962763
52002I62763j9174j9394j8977j9020j9667j9983j9235j7558j5436j3268j1503
51991G69548j0610j0677j1410j2429j3313j3594j3184j2614j2401j2481j2670
51980F34165j3182j4030j4413j3660j2458j2022j2251j1835j0261q458p137n716
51968D98742l450o49J880L872N353O080O015N803O035O317N796M331K509O98j199
51953E48133l151m742n656n979n893n363m260k632p46J099K822M600O592Q678
51939E33502J0615J2422J4265J5953J6961J7067J6702J6395J6151J5476J3886
51928F99395J1309Q174N067K010j891p477j4203k0282k4382k6584k7485k7118
51916E76533k5335k2681k0100j7926j5871j3759j1595r182o282l304j040L49J515
$$ plain form
52002 962763 943589 924195 905218 886198 866531 846548 827313 809755 794319 781051 769548
51991 769548 758938 748261 736851 724422 711109 697515 684331 671717 659316 646835 634165
51980 634165 620983 606953 592540 578880 566422 554400 542149 530314 520053 511595 504458 498742
51968 498742 495292 494643 496523 500395 505748 511828 517843 523646 529681 535998 541794 546125 548634 549332 548133
51953 548133 544982 540240 534584 528605 522712 517349 513089 510457 509711 510810 513632 518232 524824 533502
51939 533502 544117 556539 570804 586757 603718 620785 637487 653882 670033 685509 699395
51928 699395 710704 718878 723945 725955 724064 716587 702384 682102 657720 631136 603651 576533
51916 576533 551198 528517 508417 490491 474620 460861 449266 440084 433802 430498 429458 429807 431322
51903D31322K914M179M770M754M499M003L010J570K3j506l214n204p273r102j0402
51888D24343j0799r960p986n525l290j597m51K22O73J420K828M641O225P234P728
51873D15706P762P253O361N430M470L142J481J05o53j266k238l238l639l548l518
51858D33610l458k654r28R42K191K789L005K813K073R03m47j798k976l887m765
51843D27413n966p292p935p368n964m542l596l198l207l193k544j080N55J458
51829C73541J420J011Q72J095J253Q46j79j333k093k468k785l001k685j813j033
51814C62648q30q32l33P59J903K605K684K142J169K44k36l58m90p12p33l95P6
51797C69311L62M39N13O78O89J82q02j709k079k137k363k584k098q00M01O95L67
$$ plain form
51903 431322 434236 438415 443185 447939 452438 456441 459451 461021 461044 459538 456324 451120 443847 434745 424343
51888 424343 413544 403584 395598 390073 386783 385186 384735 384957 385630 387050 389878 394519 400744 407978 415706
51873 415706 423468 430721 437082 442512 446982 450124 451605 451710 451057 449791 447553 444315 440676 437128 433610
51858 433610 430152 427498 426570 427512 429703 432492 435497 438310 440383 441286 440839 439041 436065 432178 427413
51843 427413 421447 414155 406220 398852 392888 388346 384750 381552 378345 375152 372608 371528 372083 373541
51829 373541 374961 375972 376844 377939 379192 380038 379859 378526 376433 373965 371180 368179 365494 363681 362648
51814 362648 361818 360986 360653 361412 363315 365920 368604 370746 371915 372159 371923 371565 371075 370363 369630 369235 369311
51797 369311 369673 370112 370625 371303 371992 372174 371372 369663 367584 365447 363084 360500 358402 357602 358003 358698 359065
51780C59065K42N62R43J133J267J472J767K256L040L955M736N388O135P064Q081
51765D07106Q973R312Q540O614M308K444R74p76l111n606p684r055r744r976j0012
51750C92307r769q832p147n394m228l458k518j411n44J17R63J982K919M036N790
51735C64813P692Q532P915O720N736M727L335K013J431J618K293L394M674N283
51721D30176M493K490n9k735n158o505o170m628l027k040j693j984k919m037m641
51706C91563m510l856k720r88J008K516L014K417R04q89j789j131J28L44o78j397
51690C83936p26M85P21k39j427k194k719l254l614l472k774j799j053q35p27J30
51674C60439J882L477L872L354L080L569M452N525P171R446J1495J2269J1417
$$ plain form
51780 359065 359307 359869 360812 361945 363212 364684 366451 368707 371747 375702 380438 385826 391961 399025 407106
51765 407106 416079 425391 433931 440545 444853 447297 448271 447495 444384 438778 431094 422039 412295 402319 392307
51750 392307 382538 373706 366559 361165 356937 353479 350961 349550 349006 349123 350086 352068 354987 359023 364813
51735 364813 372505 381037 388952 395672 401408 406135 409470 411483 412914 414532 416825 420219 424893 430176
51721 430176 434669 437159 437100 434365 429207 422702 416532 411904 408877 406837 405144 403160 400241 396204 391563
51706 391563 387053 383197 380477 379489 380497 383013 386027 388444 389348 388459 386670 385539 385667 386011 385333 383936
51690 383936 383210 383695 384416 384177 382750 380556 377837 374583 370969 367497 364723 362924 361871 361036 360309 360439
51674 360439 362321 365798 369670 373024 376104 379673 384125 389650 396821 406267 417762 430031 441448
51661D41448R173N796J622k639o102q189q728p856o084m244k876j656J35K452
51647D12252M128L956J952q01l402n776p970r362r246p960o712o104n437l893
51633C55625j835l05M25J000J789K361K304J900J559J146L00r06k044k861l348
51618C57110l439l096k624k516k912l393l434k884k040j321r23p87q01r29j044
51603C24967q10lJ109K060K842L941N651P653R413J0579J0926J0260Q595O137
51589D03320K956q34m509o857p339o635n700m714l381j708J19K204M590O790Q298
51574C86600R345J0410J1314J1589J1510J1806J2491J2835J2608J2266J1901J1103
51562E25778J0222J0644J3165J6877K0356K3189K5634K7436K7877K6584K3551
$$ plain form
51661 441448 450621 456417 458039 455400 449298 441109 432381 424525 418441 414197 411321 409665 409800 412252
51647 412252 416380 420336 422288 421487 418085 412309 404339 394977 385731 377771 371059 364955 359518 355625
51633 355625 353790 353485 353910 354910 356699 359060 361364 363264 364823 365969 366269 365363 363319 360458 357110
51618 357110 353671 350575 347951 345435 342523 339130 335696 332812 330772 329451 328528 327741 326940 326011 324967
51603 324967 324157 324154 325263 327323 330165 334106 339757 347410 356823 367402 378328 388588 397183 403320
51589 403320 406276 405442 400933 394076 386737 380102 374402 369688 366307 364599 364718 366922 371512 378302 386600
51574 386600 395945 406355 417669 429258 440768 452574 465065 477900 490508 502774 514675 525778
51562 525778 536000 546644 559809 576686 597042 620231 645865 673301 701178 727762 751313
51551G51313J8728J2389N619l60n383j0166j5023j9367k2523k4443k5490k5926
51539F39368k5826k5152k3788k1634j8775j5524j2364r816q023o502m668k837
51527D64459j997k411l127l391l818n195o838p332o634o100o373o620o175n703
51513C92745n921o268n784m658l851l603l274k536j793j414j281j290j605k125
51499C47342k225j424m8J086J525J443J160P59K23k50l54p9K21L02L52N89P40
51482C51362L57l82p29m47k45p52j583j974j967k165k494k198j225o86j420k777
51466C30675l539l469l181k846k084j031n20q17j136q55m55n33n63L51J858K562
51450C14417J947J116J337K640M262N777P241Q682J0062J1390J2337J2089J0205
$$ plain form
51551 751313 770041 782430 788049 787689 782306 772140 757117 737750 715227 690784 665294 639368
51539 639368 613542 588390 564602 542968 524193 508669 496305 486489 478466 471964 467296 464459
51527 464459 462462 460051 456924 453533 449715 444520 437682 430350 423716 417616 411243 404623 398448 392745
51513 392745 386824 380556 374772 370114 366263 362660 359386 356850 355057 353643 352362 351072 349467 347342
51499 347342 345117 343693 343645 344731 346256 347699 348859 349618 349841 349591 349237 349158 349379 349681 350033 350622 351362
51482 351362 351719 351337 350608 350161 349916 349164 347581 345607 343640 341475 338981 336783 335558 334872 333452 330675
51466 330675 327136 323667 320486 317640 315556 314525 314005 313188 312052 311197 310742 310209 309646 309997 311855 314417
51450 314417 316364 317480 318817 321457 325719 331496 338737 347419 357481 368871 381208 393297 403502
51437D03502P412M915L094J498M2o82m35J4l02j536l098m394n132n296n157n094
51421C89351n135m911m262l587l281l170k904k525k245j885j162l25L4j60l90
51406C53443l95m67o98n89K23J307J991K180K148J866J161M45N46J685L147M254
51390C72247N129O252P667R076J0452J2110J4149J6286J8321K0514K3279K6690
51378E42172L0427L4134L7686M0987M3585M4584M3023L8432L1052K1717J1624
51367I19423J992o441j3700k0166k5940l0789l4659l7711l9723m0057l8621l6378
51355E97230l4377l2582l0219k7035k3505k0004j6535j3330j0921r386q129o725
51343C64482n408m466l705k933k409k354k474k432k425k715k974k648j725o17
$$ plain form
51437 403502 410914 415829 418923 420421 420463 419781 419346 419360 419058 417522 414424 410030 404898 399602 394445 389351
51421 389351 384216 379305 375043 371456 368175 365005 362101 359576 357331 355446 354284 353959 353993 353833 353443
51406 353443 353048 352581 351883 351294 351517 352824 354815 356995 359143 361009 362170 362615 363161 364846 367993 372247
51390 372247 377376 383628 391295 400371 410823 422933 437082 453368 471689 492203 515482 542172
51378 542172 572599 606733 644419 685406 728991 773575 816598 855030 886082 907799 919423
51367 919423 921415 914974 901274 881108 855168 824379 789720 752009 712286 672229 633608 597230
51355 597230 562853 530271 500052 473017 449512 429508 412973 399643 388722 379336 371207 364482
51343 364482 359074 354608 350903 347970 345561 343207 340733 338301 335876 333161 330187 327539 325814 325197
51329C25197M81J534K240K279J901J597J308N59o45j689k209k380k269j594m22
51314C25888N65Q65Q26J008J313J194M74m77j269j821k194k354k121j335j92N44
51298C20914R3j365k634k747j992j290r15m29L05P59O27M61R51J936K645K781
51282C20100K907L640M837N771N884N166L921K498J242L98l6k61l72l11o2L14
51266C55636R70K134L506M155L489K061Q76P1j028k591l837m144l850l504k970
51251C50974k003j204j484k691l596l405k583j953j639j353j174j422j983k349
51237C22135k280j989j617j002j12O68R60Q55P66Q68R93R51P99O81N83L56m6l90
51219C23179k95L78J287J883J947J713J463J187P92L93J68J45L74J139K551M004
$$ plain form
51329 325197 325678 327212 329452 331731 333632 335229 336537 337096 336451 334762 332553 330173 327904 326310 325888
51314 325888 326453 327318 328144 329152 330465 331659 332133 331656 330387 328566 326372 324018 321897 320562 320370 320914
51298 320914 321007 319642 317008 314261 312269 310979 310064 309635 309940 310699 311326 311787 312738 314674 317319 320100
51282 320100 323007 326647 331484 337255 343139 348305 352226 354724 355966 356364 356328 356067 355695 355384 355322 355636
51266 355636 356606 358740 362246 366401 369890 371951 372827 372898 371870 369279 365442 361298 357448 353944 350974
51251 350974 348971 347767 346283 343592 339996 336591 334008 332055 330416 329063 327889 326467 324484 322135
51237 322135 319855 317866 316249 315247 315135 315803 316763 317618 318384 319252 320245 321196 321995 322676 323259 323615 323569 323179
51219 323179 322884 323262 324549 326432 328379 330092 331555 332742 333534 333927 334095 334240 334614 335753 338304 342308
51203C42308M556L968K950K209J718J159O21M13M38K87j09l90l53k07j85k19j65
51186C58999j39l71q11j067q16k54Pm09j127j424j051m84k32l20n35p39p10j40
51168C48377P98J294R07M07Q75K188L173L222K856K549J906N72q04j251p44j53
51152C66172j39p39j786l091m123m178l128j680p10m93p15r51r97q75o40k75L08
51135C41960J095J852K324K508K564K511K235J837J646J718J565P61k98o07K78
51120C63949J619K277J938J274J011J245J655K001K138J924J384Q60P05Q82J131
51105C85993J383J750K140K237J912J399J024Q81Q97R89J078J087R70P43M23R9
51089D05005p3JK10L98N83Q46J093J092P56K76m6pL34N98M46J07L15J394K663
$$ plain form
51203 342308 346864 350832 353782 355991 357709 358868 359489 359902 360340 360627 360518 360128 359775 359568 359383 359164 358999
51186 358999 358860 358489 357678 356611 355795 355541 355548 355139 354012 352588 351537 351053 350821 350501 349966 349227 348517 348377
51168 348377 349175 350469 351376 351783 352658 354846 358019 361241 364097 366646 368552 369124 368320 367069 366325 366172
51152 366172 366033 365294 363508 360417 356294 352116 348988 347308 346598 346105 345390 344439 343442 342567 341927 341652 341960
51135 341960 343055 344907 347231 349739 352303 354814 357049 358886 360532 362250 363815 364576 364278 363671 363949
51120 363949 365568 367845 369783 371057 372068 373313 374968 376969 379107 381031 382415 383275 383980 384862 385993
51105 385993 387376 389126 391266 393503 395415 396814 397838 398719 399616 400605 401683 402770 403740 404483 404906 405005
51089 405005 404932 404933 405143 405541 406124 406970 408063 409155 409911 410187 410141 410134 410468 411066 411512 411619 411934 413328 415991
51070D15991L178K914K710L125L900M607N272O201P579R489J1903J4453J6520
51057E07842J7704J7910J6934J4503J1104Q243P344Q495J0576J2344J3048J2261
51045F58308R804O078K049j396m137o653r201j1275j1943j0740q103n045k717
51032F05029k254m331q312j2241j4379j4647j4018j2811j0601p659n217l825k549
51019D92185m97J728L019L514M237N481O616P372Q212R317J0170J0437J0522J0808
51005E83121J0944J0352R067P672O580N773N041M278L488K702J996J525J502J949
50991F55990K479K510J915J265J269K154L777N978Q555J1135J3516J5893J8318
50978G44754K0154K0655K0026J9351J9463K0383K1998K4610K8527L3484L8832
$$ plain form
51070 415991 419169 422083 424793 427918 431818 436425 441697 447898 455477 464966 476869 491322 507842
51057 507842 525546 543456 560390 574893 585997 594240 601584 610079 620655 632999 646047 658308
51045 658308 668112 674190 676239 674843 670706 664053 654852 643577 631634 620894 612791 607746 605029
51032 605029 602775 598444 590132 577891 563512 548865 534847 522036 511435 503776 498559 494734 492185
51019 492185 491688 493416 496435 499949 504186 509667 516283 523655 531867 541184 551354 561791 572313 583121
51005 583121 594065 604417 613484 621156 627736 633509 638550 642828 646316 649018 651014 652539 654041 655990
50991 655990 658469 660979 662894 664159 665428 667582 671359 677337 685892 697027 710543 726436 744754
50978 744754 764908 785563 805589 824940 844403 864786 886784 911394 939921 973405 1012237
50967A012237M4075M9038N3756N8395O3100O7725P1862P5221P7794P9521Q0032
50956A732756P8865P5816P0979O4624N7093M8735L9901L1072K2785J5272Q284
50945B246182J661m054q102j0514j2098j3328j4005j4174j4673j6142j8090j9577
50933B103086k0506k1535k2999k4696k6683k9420l2957l6713m0286m3905m7735
50922A755651n1323n4218n6581n8610n9689n8906n6302n2923m9662m6607m3489
50911A167341m0140l6302l1756k6981k3120k0809j9479j8220j6844j5595j4327
50900I03768j2745j1144j0030r148p767n917m429l634k955k058j477j554j592
50887H29318p85N80J602K041K386L007L903N055O334P257P529P693Q527R930J1098
$$ plain form
50967 1012237 1056312 1105350 1159106 1217501 1280601 1348326 1420188 1495409 1573203 1652724 1732756
50956 1732756 1811621 1887437 1958416 2023040 2080133 2128868 2168769 2199841 2222626 2237898 2246182
50945 2246182 2247843 2243789 2235687 2225173 2213075 2199747 2185742 2171568 2156895 2140753 2122663 2103086
50933 2103086 2082580 2061045 2038046 2013350 1986667 1957247 1924290 1887577 1847291 1803386 1755651
50922 1755651 1704328 1650110 1593529 1534919 1475230 1416324 1360022 1307099 1257437 1210830 1167341
50911 1167341 1127201 1090899 1059143 1032162 1009042 988233 968754 950534 933690 918095 903768
50900 903768 891023 879879 869849 860701 852934 847017 842588 838954 835999 833941 832464 830910 829318
50887 829318 828533 829113 830715 832756 835142 838149 842052 847107 853441 860698 868227 875920 884447 894377 905475
50872I05475J1766J2578J3994J5634J6941J7970J9177K0836K2975K5550K8429
50861A111325L1413L4522L8041M2216M7084N2710N9243O6654P4696Q3284R2605
50850A733793J02716J13227J23608J33606J43210J52379J60953J68629J74947
50841C007068J79350J81244J79855J74154J63320J47405J27326J04181P8905N2610
50831D395418K6783K783j8639l7110n2141o3131o9709p1820o9658o3742n5018
50820C924016m4753l4304k5090j8548j5823j7426k3171l2361m3992n6985p0545
50809C541018q4338r8148j11359j22937j32046j38507j42416j43442j40917j34812
50799B292096j26247j16725j06937r6811q6423p6288o6648n7203m7812l8919l0938
$$ plain form
50872 905475 917241 929819 943813 959447 976388 994358 1013535 1034371 1057346 1082896 1111325
50861 1111325 1142738 1177260 1215301 1257517 1304601 1357311 1416554 1483208 1557904 1641188 1733793
50850 1733793 1836509 1949736 2073344 2206950 2350160 2502539 2663492 2832121 3007068
50841 3007068 3186418 3367662 3547517 3721671 3884991 4032396 4159722 4263903 4342808 4395418
50831 4395418 4422201 4424984 4406345 4369235 4317094 4253963 4184254 4112434 4042776 3979034 3924016
50820 3924016 3879263 3844959 3819869 3801321 3785498 3768072 3744901 3712540 3668548 3611563 3541018
50809 3541018 3456680 3358532 3247173 3124236 2992190 2853683 2711267 2567825 2426908 2292096
50799 2292096 2165849 2049124 1942187 1845376 1758953 1682665 1616017 1558814 1511002 1472083 1441145
50788A441145k3753j7335j2252q880o532m221k027r18j200k023k509k672k956
50775A353867l564m506n831p447r043j0434j1711j2962j4184j5432j6710j7645
50763A224398j7816j7479j7449j8059j8730j8654j7508j5385j2688j0237q794
50752A051599q084o817m066j93L882P645J0931J3668J6359K0139K5450L1121L5612
50739A197246L8944M2545M7322N2817N8316O3815O9484P4934P9529Q3124Q6030
50728A894106Q8482R0406R1583R1797R0916Q8955Q5965Q1747P5808O7623N6886
50717B804274M3498K7598R778q779k6519m1914n3773o1373o4494o3392n8766n1699
50705B454439m3386l4681k5961j7554j0220m939k183j728l429p857j5708k6528
$$ plain form
50788 1441145 1417392 1400057 1387805 1378925 1372393 1368172 1366145 1365227 1364027 1362004 1359495 1356823 1353867
50775 1353867 1350303 1345797 1339966 1332519 1323476 1313042 1301331 1288369 1274185 1258753 1242043 1224398
50763 1224398 1206582 1189103 1171654 1153595 1134865 1116211 1098703 1083318 1070630 1060393 1051599
50752 1051599 1043515 1036698 1032632 1032439 1036321 1043966 1054897 1068565 1084924 1105063 1130513 1161634 1197246
50739 1197246 1236190 1278735 1326057 1378874 1437190 1501005 1570489 1645423 1724952 1808076 1894106
50728 1894106 1982588 2072994 2164577 2256374 2347290 2436245 2522210 2603957 2679765 2747388 2804274
50717 2804274 2847772 2875370 2885148 2876369 2849850 2807936 2754163 2692790 2628296 2564904 2506138 2454439
50705 2454439 2411053 2376372 2350411 2332857 2322637 2317698 2315515 2313787 2310358 2302501 2286793 2260265
50693B260265l8493m9731n9556o8096p5011p9299q0354p8635p5015o9983o3795
50682A522297n6977n0061m3075l5763k8160k0564j3079n671J405P745J3270J8176
50670A309543K2475K5914K8341K9694K9802K8623K6631K4406K2012J9335J6847
50659A583623J5295J4666J4231J3714J3562J3911J4141J3818J3357J3335J3762
50648A737415J4495J5757J7792K0499K3750K7545L1487L4726L6962L8838M0929
50637B040195M2910M4241M4981M5231M4401M1965L8534L5369L3059L1383L0177
50626B472446K9379K8224K5053J8146O562r174k6537m1453n0406n2511m9276m2677
50614B307776l4058k4557j5500p873j894K639N796P342O830L940j045p305j4353
$$ plain form
50693 2260265 2221772 2172041 2112485 2044389 1969378 1890079 1809725 1731090 1656075 1586092 1522297
50682 1522297 1465320 1415259 1372184 1336421 1308261 1287697 1274618 1268947 1270352 1278097 1291367 1309543
50670 1309543 1332018 1357932 1386273 1415967 1445769 1474392 1501023 1525429 1547441 1566776 1583623
50659 1583623 1598918 1613584 1627815 1641529 1655091 1669002 1683143 1696961 1710318 1723653 1737415
50648 1737415 1751910 1767667 1785459 1805958 1829708 1857253 1888740 1923466 1960428 1999266 2040195
50637 2040195 2083105 2127346 2172327 2217558 2261959 2303924 2342458 2377827 2410886 2442269 2472446
50626 2472446 2501825 2530049 2555102 2573248 2579810 2570636 2544099 2502646 2452240 2399729 2350453 2307776
50614 2307776 2273718 2249161 2233661 2225788 2223894 2226533 2232329 2239671 2246501 2250441 2249396 2242091 2227738
50601B227738k2548l2237m2638n2199n9898o5604o9301p0715o9892o7605o4909
50590A610192o2415n9982n6958n2984m8705m5331m3115m0844l7327l2897k8698
50579A100936k5089k1643j8326j5505j2899r704n906k464Q0K266M794P652J0399
50566A014591J2575J3743J3884J3920J5036J7264J9566K1493K3708K6556K9198
50555A221534L0801L1700L2574L3210L2987L2002L0894K9902K8885K8018K7721
50544A560228K8013K8587K9448L0973L3374L6529M0326M4780M9828N5264O0846
50533A998196O6303P1413P6163Q0691Q5072Q9428R4213R9850J05922J11334J15407
50522B993992J18254J19762J19029J15390J09285J01349R1161P7809O1405M3098
$$ plain form
50601 2227738 2205190 2172953 2130315 2078116 2018218 1952614 1883313 1812598 1742706 1675101 1610192
50590 1610192 1547777 1487795 1430837 1377853 1329148 1283817 1240702 1199858 1162531 1129634 1100936
50579 1100936 1075847 1054204 1035878 1020373 1007474 997770 991864 989400 989480 991746 996540 1004192 1014591
50566 1014591 1027166 1040909 1054793 1068713 1083749 1101013 1120579 1142072 1165780 1192336 1221534
50555 1221534 1252335 1284035 1316609 1349819 1382806 1414808 1445702 1475604 1504489 1532507 1560228
50544 1560228 1588241 1616828 1646276 1677249 1710623 1747152 1787478 1832258 1882086 1937350 1998196
50533 1998196 2064499 2135912 2212075 2292766 2377838 2467266 2561479 2661329 2767251 2878585 2993992
50522 2993992 3112246 3232008 3351037 3466427 3575712 3677061 3768222 3846031 3907436 3950534
50512C950534K3717L317j7813l8545n7688p4770q9646j01748j10169j14317j14157
50501C258715j09908j01772r0021p5249n8402m0547k2548n028J1421K6137L8444
50490B831242M7582N2505N1993M5221L2224J3911q110l1742n4799p5640r3387
50479B811000j07555j17740j23733j25727j24217j19901j13636j06183r7822q8533
50469A685953p8729o9519o1999n6469n2390m8844m4998m0589l6118l2247k8848
50458A135203k5050k0441j5641j1399p622l800j2L224N753P929J0008J1938J3768
50445A103858J5762J8043K0355K2299K3634K4283K4158K2919K0118J5863J1223
50434A322515P497M957K879Q75m10l03R29K585M387O199P586Q418R469J1517J4221
$$ plain form
50512 3950534 3974251 3977568 3959755 3921210 3863522 3788752 3699106 3597358 3487189 3372872 3258715
50501 3258715 3148807 3047035 2957014 2881765 2823363 2782816 2760268 2755240 2766661 2792798 2831242
50490 2831242 2878824 2931329 2983322 3028543 3060767 3074678 3066568 3034826 2980027 2904387 2811000
50479 2811000 2703445 2585705 2461972 2336245 2212028 2092127 1978491 1872308 1774486 1685953
50469 1685953 1607224 1537705 1475706 1419237 1366847 1318003 1273005 1232416 1196298 1164051 1135203
50458 1135203 1110153 1089712 1074071 1062672 1055050 1051250 1051238 1054462 1060215 1068144 1078152 1090090 1103858
50445 1103858 1119620 1137663 1158018 1180317 1203951 1228234 1252392 1275311 1295429 1311292 1322515
50434 1322515 1330012 1334969 1337848 1338723 1338313 1338010 1338939 1341524 1345911 1352110 1359696 1368114 1377583 1389100 1403321
50419A403321J6750J9256K2675K7152L1789L6090M0581M5641N0624N4672N7751
50408A806302O0300O2372O3651O3935O3085O0769N6750N1319M5001L8011L0225
50397B401720K1560J2056J646r843k2368l5464m8313n9947o9418p5958p9083p8710
50385A957878p5251o9540o2428n4427m5751l6586k7141j7559q023J030Q989J5413
50373A586604K0113K2827K3079K0376J4640O386l469j4037k4688l4755m3126m8649
50361A525301n1165n1793n1756n1209m9547m6558m2739l8625l4385l0130k6147
50350A051247k2601j9379j6309j3459j1201j0124j0670j2620j5036j6999j8182
50339H84667j8492j7563j5187j1986q893o109l206k78J848K744L054L699M868
$$ plain form
50419 1403321 1420071 1439327 1462002 1489154 1520943 1557033 1597614 1643255 1693879 1748551 1806302
50408 1806302 1866602 1928974 1992625 2056560 2119645 2180414 2237164 2288483 2333484 2371495 2401720
50397 2401720 2423280 2435336 2436982 2427139 2404771 2369307 2320994 2261047 2191629 2115671 2036588 1957878
50385 1957878 1882627 1813087 1750659 1696232 1650481 1613895 1586754 1569195 1561172 1562202 1571191 1586604
50373 1586604 1606717 1629544 1652623 1672999 1687639 1694025 1690556 1676519 1651831 1617076 1573950 1525301
50361 1525301 1474136 1422343 1370587 1319378 1269831 1223273 1180534 1141909 1107524 1077394 1051247
50350 1051247 1028646 1009267 992958 979499 968298 958174 947504 934884 919848 902849 884667
50339 884667 866175 848612 833425 821439 812546 806437 803231 802953 804801 807545 810599 814298 819166
50326H19166O094O928P254P267P339P674Q011P998P767P686P555O666M859K876
50312I15140J502Q66P94J234K006K737L387M295N396O030O006O120P098Q527R576
50297I80714J0259J1170J2451J3753J5024J6526J8298K0305K2960K6650L0788
50286A178898L4004L5149L3308K7088J5300r68j7746l0469l6819l7287l3852k8682
50274A137924k3521j9267j5848j2832j0142q017o492n234l941k594j303m4J431
50261A030120L511O367R662J2730J5229J7399J9500K1294K2315K2449K1905K0825
50249A223306J9351J8009J7453J7661J7849J7450J6735J6025J4652J1355N812
50238A395658q16p120j2741j8072k2979k6517k7869k7122k4848k1536j7805j4799
$$ plain form
50326 819166 825260 832188 839442 846709 854048 861722 869733 877731 885498 893184 900739 907405 912264 915140
50312 915140 916642 917508 918302 919536 921542 924279 927666 931961 937357 943387 949393 955513 962611 971138 980714
50297 980714 990973 1002143 1014594 1028347 1043371 1059897 1078195 1098500 1121460 1148110 1178898
50286 1178898 1212902 1248051 1281359 1308447 1323747 1322779 1305033 1274564 1237745 1200458 1166606 1137924
50274 1137924 1114403 1095136 1079288 1066456 1056314 1048297 1041805 1036571 1032630 1030036 1028733 1028689 1030120
50261 1030120 1033631 1039998 1049660 1062390 1077619 1095018 1114518 1135812 1158127 1180576 1202481 1223306
50249 1223306 1242657 1260666 1278119 1295780 1313629 1331079 1347814 1363839 1378491 1389846 1395658
50238 1395658 1394842 1387722 1374981 1356909 1333930 1307413 1279544 1252422 1227574 1206038 1188233 1173434
50226A173434j3678j4667j7061k0302k4439k9225l3245l4793l3553l0849k8065
50215H93557k5416k2513j9517j7007j5029j3051j0929r180q100p245o088m769
50203G34713l733l071k673k662l119l628l702l518l600l940m067l948m096m608
50189F84348m912m759m682n048n314m873m102l871m275m591m310l602k802k084
50175F25123j597j435j388j165q13n51k25M47J212J466J179J052J598K599L619
50160F31121M484N006M956M687N091O431P848Q655R506J1451J4122J5987J6367
50147G45712J6229J6814J8241J9946K1773K4072K7067L0603L4343L7937M1093
50136A033830M3685M5621M6606M6411M5443M4518M3909M3055M1602M0067L8850
$$ plain form
50226 1173434 1159756 1145089 1128028 1107726 1083287 1054062 1020817 986024 952471 921622 893557
50215 893557 868141 845628 826111 809104 794075 781024 770095 760915 752815 745570 739482 734713
50203 734713 730980 727909 725236 722574 719455 715827 712125 708607 705007 701067 697000 693052 688956 684348
50189 684348 679436 674677 669995 664947 659633 654760 650658 646787 642512 637921 633611 630009 627207 625123
50175 625123 623526 622091 620703 619538 618725 618174 617949 618396 619608 621074 622253 623305 624903 627502 631121
50160 631121 635605 640611 645567 650254 655345 661776 669624 678279 687785 699236 713358 729345 745712
50147 745712 761941 778755 796996 816942 838715 862787 889854 920457 954800 992737 1033830
50136 1033830 1077515 1123136 1169742 1216153 1261596 1306114 1350023 1393078 1434680 1474747 1513597
50125A513597L6937L2470K4559J4023K354r373k0501l0399l8550m4787m9207n1937
50113A379186n2992n2234m9579m5402m0614l5956l1476k7069k3282k0898j9858
50102I79826j9340j8929j8802j8652j7506j5153j2834j1701j1275j0316q555o648
50090H10115m758k446R6J858K349K298K685L708M961O055O689O620N946N163M670
50075H56009M439M291M093L595K529J144J36k15m49j155k148k840l153l555m321
50060H58400n140n520n345m993m942n249n464n146m422l746l160k201n97J313
50046H03788L042M453N647O726P851R176J0453J1130J1110J1047J1566J2483J3177
50033I21649J3378J3171J2656J2019J1699J1862J2031J1776J1530J2067J3286
$$ plain form
50125 1513597 1550534 1583004 1607563 1621586 1623940 1614567 1594066 1563667 1525117 1480330 1431123 1379186
50113 1379186 1326194 1273960 1224381 1178979 1138365 1102409 1070933 1043864 1020582 999684 979826
50102 979826 960486 941557 922755 904103 886597 871444 858610 846909 835634 825318 816763 810115
50090 810115 805357 802911 803007 804865 807214 809512 812197 815905 820866 826921 833610 840230 846176 851339 856009
50075 856009 860448 864739 868832 872427 874956 876100 876236 876021 875572 874417 872269 869429 866276 862721 858400
50060 858400 853260 847740 842395 837402 832460 827211 821747 816601 812179 808433 805273 803072 802475 803788
50046 803788 806830 811283 816930 823656 831507 840683 851136 862266 873376 884423 895989 908472 921649
50033 921649 935027 948198 960854 972873 984572 996434 1008465 1020241 1031771 1043838 1057124
50022A057124J4367J5064J6092J7945K0106K1755K2620K2614K1196J7848J3104
50011A259835Q554N730N150O240P799Q470P254L892j125o997j3104j9206k5176
49998A247316l0515l4229l5544l4809l3374l2326l1479k9928k7390k4604k2431
49987I10687k1011j9989j9187j8683j8421j8148j7779j7469j7173j6476j5129
49976G11222j3544j2419j1851j1204r928q241o809n909n229m468l837l789m280
49963F09714m588m024k778j802j725k087j896p46R28K599M163N642O850P610Q049
49948F25909Q299Q214P606O644N683M850L986K965J794N54n77j439k172l268n007
49933F64041p043q867j0412j1843j2900j2989j1940j0286q698p461o522n656m525
$$ plain form
50022 1057124 1071491 1086555 1102647 1120592 1140698 1162453 1185073 1207687 1228883 1246731 1259835
50011 1259835 1268389 1274119 1279269 1285509 1293308 1301778 1309032 1312924 1311799 1304802 1291698 1272492 1247316
49998 1247316 1216801 1182572 1147028 1112219 1078845 1046519 1015040 985112 957722 933118 910687
49987 910687 889676 869687 850500 831817 813396 795248 777469 760000 742827 726351 711222
49976 711222 697678 685259 673408 662204 652276 644035 637226 631317 626088 621620 617783 613994 609714
49963 609714 605126 601102 598324 596522 594797 592710 590814 590068 590996 593595 597758 603400 610250 617860 625909
49948 625909 634208 642422 650028 656672 662355 667205 671191 674156 675950 676504 675927 674488 672316 669048 664041
49933 664041 656998 648131 637719 625876 612976 599987 588047 577761 569063 561602 555080 549424 544899
49920E44899k935j193J73J095K005L087L881L925L427K973K841K899L041L388
49906E73506M082N119O332P425Q104Q349Q510R004R863J0627J0576R233O827M239
49892F81796K209N90j246l348n047o037o933q279r548r902r526r445r952j0152
49878E95180r340q082p382p304p097o426n763n443m996l759j882k55N62R40J617
49863E30570K814M148N253O128O927P702Q490R383J0337J1096J1457J1404J0904
49850F36613R818Q236O639N443M526L554K492J421N4k001m531o869q758j0420
49836F46217j1691j1824j0544q650p026n595l928k379j800k164k461k020j152
$$ plain form
49920 544899 541964 540771 540944 542039 544044 547131 551012 554937 558364 561337 564178 567077 570118 573506
49906 573506 577588 582707 589039 596464 604568 612917 621427 630431 640294 650921 661497 670730 677557 681796
49892 681796 684005 684595 683349 680001 674954 668917 661984 653705 644157 634255 624729 615284 605332 595180
49878 595180 585840 577758 570376 563072 555975 549549 543786 538343 533347 529588 527706 527451 528013 528953 530570
49863 530570 533384 537532 542785 548913 555840 563542 572032 581415 591752 602848 614305 625709 636613
49850 636613 646431 654667 661306 666749 671275 674829 677321 678742 678796 676795 672264 665395 656637 646217
49836 646217 634526 622702 612158 603508 596482 590887 586959 584580 582780 580616 578155 576135 574983
$$ [...]
##END NTUPLES=NMR SPECTRUM
##END=
