##TITLE=AC1743_SEN00016_9276489_UbsbA2z0AU
##JCAMPDX= 6.0         $$ Bruker NMR JCAMP-DX V2.0
##DATA TYPE= NMR SPECTRUM
##DATA CLASS= NTUPLES
##ORIGIN= BRUKER
##OWNER= Administrator
$$ 1.72 TOPSPIN		Version 2.1
$$ 2015-07-15 02:16:45.885 -0700  Administrator@X
$$ Compression mode = diff/dup
##.OBSERVE FREQUENCY= 400.02188249412
##.OBSERVE NUCLEUS= ^1H
##.ACQUISITION MODE= SIMULTANEOUS (DQD)
##.ACQUISITION SCHEME= undefined
##.AVERAGES= 8
##.DIGITISER RES= 22
##SPECTROMETER/DATA SYSTEM= spect
##.PULSE SEQUENCE= zg30
##.SOLVENT NAME= COFFEE_meoh
##.SHIFT REFERENCE= INTERNAL, COFFEE_meoh, 1, 14.98509
##AUDIT TRAIL= $$ (NUMBER, WHEN, WHO, WHERE, PROCESS, VERSION, WHAT)
$$ ##TITLE= Audit trail, TOPSPIN		Version 2.1
$$ ##JCAMPDX= 5.01
$$ ##ORIGIN= Bruker BioSpin GmbH
$$ ##OWNER= Administrator
$$ $$ E:\/data/COFFEE/nmr/AC1743_SEN00016_9276489_UbsbA2z0AU/10/pdata/1/auditp.txt
$$ ##AUDIT TRAIL=  $$ (NUMBER, WHEN, WHO, WHERE, PROCESS, VERSION, WHAT)
(   1,<2015-07-15 02:16:38.619 -0700>,<Administrator>,<X>,<go>,<TOPSPIN 2.1>,
      <created by zg
	started at 2015-07-15 02:15:32.275 -0700,
	POWCHK enabled, PULCHK disabled,
       configuration hash MD5:
       21 0F 79 D6 B3 7B B4 F6 88 20 88 DB 03 48 BD 9F
       data hash MD5: 64K
       73 A8 53 6A C1 54 55 E9 90 AD D5 25 30 71 F2 43>)
(   2,<2015-07-15 02:16:41.744 -0700>,<Administrator>,<X>,<proc1d>,<TOPSPIN 2.1>,
      <Start of raw data processing
       efp LB = 0 FT_mod = 6 PKNL = 1 PHC0 = 0 PHC1 = 0 SI = 32K 
       data hash MD5: 32K
       B1 3E F1 34 07 7E DA 74 28 AD F9 3F DF E9 88 B8>)
(   3,<2015-07-15 02:16:42.057 -0700>,<Administrator>,<X>,<proc1d>,<TOPSPIN 2.1>,
      <pk PHC0 = 91.30737 PHC1 = 0 
       data hash MD5: 32K
       D9 88 18 D3 B8 70 5D 98 80 BE E2 5D 03 C2 57 43>)
(   4,<2015-07-15 02:16:42.166 -0700>,<Administrator>,<X>,<proc1d>,<TOPSPIN 2.1>,
      <abs ABSG = 1 
       data hash MD5: 32K
       9F 5E BE 96 D4 8F EE B4 FF 1B 91 89 85 C7 BB 45>)
(   5,<2015-07-15 02:16:42.244 -0700>,<Administrator>,<X>,<proc1d>,<TOPSPIN 2.1>,
      <abs ABSG = 2 
       data hash MD5: 32K
       2D 02 C3 73 1D A3 84 D4 4C 3A C1 EB DD BD 33 B3>)
(   6,<2015-07-15 02:16:42.307 -0700>,<Administrator>,<X>,<proc1d>,<TOPSPIN 2.1>,
      <abs ABSG = 3 
       data hash MD5: 32K
       3F 79 C1 25 A6 44 C5 5C C2 87 28 91 DF 40 A1 25>)
(   7,<2015-07-15 02:16:42.385 -0700>,<Administrator>,<X>,<proc1d>,<TOPSPIN 2.1>,
      <abs ABSG = 4 
       data hash MD5: 32K
       D6 00 06 67 15 D8 5A 5E 5A E4 B9 8D 04 E2 D9 79>)
(   8,<2015-07-15 02:16:42.432 -0700>,<Administrator>,<X>,<proc1d>,<TOPSPIN 2.1>,
      <abs ABSG = 5 
       data hash MD5: 32K
       25 C5 F8 72 D5 77 DB 2E 39 C8 2A C4 50 EA 32 A5>)
$$ ##END=
$$ 
$$ $$ hash MD5
$$ $$ C5 42 9C E3 29 10 B6 3A 37 F9 29 96 84 30 8D 4C
##$RELAX= 
##$RELAX= 
##$RELAX= 
##$RELAX= 
##$RELAX= 
##$RELAX= 
##$RELAX= 
$$ Bruker specific parameters
$$ --------------------------
##$DU= <E:\>
##$EXPNO= 10
##$NAME= <AC1743_SEN00016_9276489_UbsbA2z0AU>
$$ [...]
150 150 150 150 150 150 150 150
##$TP07= 0
##$TPNAME0= <>
##$TPNAME1= <>
##$TPNAME2= <>
##$TPNAME3= <>
##$TPNAME4= <>
##$TPNAME5= <>
##$TPNAME6= <>
##$TPNAME7= <>
##$TPOAL= (0..7)
0.5 0.5 0.5 0.5 0.5 0.5 0.5 0.5
##$TPOFFS= (0..7)
0 0 0 0 0 0 0 0
##$TUNHIN= 0
##$TUNHOUT= 0
##$TUNXOUT= 0
##$USERA1= <user>
##$USERA2= <user>
##$USERA3= <user>
##$USERA4= <user>
##$USERA5= <user>
##$V9= 5
##$VALIST= <valist>
##$VCLIST= <CCCCCCCCCCCCCCC>
##$VD= 0
##$VDLIST= <DDDDDDDDDDDDDDD>
##$VPLIST= <PPPPPPPPPPPPPPP>
##$VTLIST= <TTTTTTTTTTTTTTT>
##$WBST= 2048
##$WBSW= 25
##$XGAIN= (0..3)
0 0 0 0
##$XL= 0
##$YL= 0
##$YMAX_a= 609878
##$YMIN_a= -522583
##$ZGOPTNS= <>
##$ZL1= 120
##$ZL2= 120
##$ZL3= 120
##$ZL4= 120
##$ABSF1= 14.98509
##$ABSF2= -5.573092
##$ABSG= 5
##$ABSL= 3
##$ALPHA= 0
##$AQORDER= 0
##$ASSFAC= 0
##$ASSFACI= 0
##$ASSFACX= 0
##$ASSWID= 0
##$AUNMP= <proc_prof1d_extract_pilot.lims>
##$AXLEFT= 0
##$AXNAME= <>
##$AXNUC= <1H>
##$AXRIGHT= 0
##$AXTYPE= 0
##$AXUNIT= <>
##$AZFE= 0.1
##$AZFW= 0.1
##$BCFW= 0
##$BC_mod= 0
##$BYTORDP= 0
##$COROFFS= 0
##$CY= 15
##$DATMOD= 1
##$DC= 0
##$DFILT= <>
##$DTYPP= 0
##$F1P= 0
##$F2P= 0
##$FCOR= 0.5
##$FTSIZE= 32768
##$FT_mod= 6
##$GAMMA= 0
##$GB= 0
##$INTBC= 1
##$INTSCL= 1
##$ISEN= 128
##$LB= 0
##$LEV0= 0
##$LPBIN= 0
##$MAXI= 10000
##$MC2= 0
##$MEAN= 0
##$ME_mod= 0
##$MI= 0
##$NCOEF= 0
##$NC_proc= -8
##$NLEV= 6
##$NOISF1= 0
##$NOISF2= 0
##$NSP= 0
##$NTH_PI= 0
##$NZP= 0
##$OFFSET= 14.98509
##$PC= 1
##$PHC0= 91.30737
##$PHC1= 0
##$PH_mod= 1
##$PKNL= yes
##$PPARMOD= 0
##$PPDIAG= 0
##$PPIPTYP= 0
##$PPMPNUM= 2147483647
##$PPRESOL= 1
##$PSCAL= 4
##$PSIGN= 0
##$PYNMP= <proc.py>
##$REVERSE= no
##$SF= 400.02
##$SI= 32768
##$SIGF1= 0
##$SIGF2= 0
##$SINO= 400
##$SIOLD= 32768
##$SPECTYP= <>
##$SREGLST= <1H.CDCl3>
##$SSB= 0
##$STSI= 32768
##$STSR= 0
##$SW_p= 8223.68421052631
##$SYMM= 0
##$S_DEV= 0
##$TDeff= 65536
##$TDoff= 0
##$TI= <>
##$TILT= no
##$TM1= 0
##$TM2= 0
##$TOPLEV= 0
##$USERP1= <user>
##$USERP2= <user>
##$USERP3= <user>
##$USERP4= <user>
##$USERP5= <user>
##$WDW= 1
##$XDIM= 32768
##$YMAX_p= 445221262
##$YMIN_p= -658591
##$CURPLOT= <Network HP LaserJet P1505>
##$CURPRIN= <$Network HP LaserJet P1505>
##$DFORMAT= <normdp>
##$LAYOUT= <+/1D_H.xwp>
##$LFORMAT= <normlp>
##$PFORMAT= <normpl>
##$SURQMSG= 1
$$ End of Bruker specific parameters
$$ ---------------------------------
##NTUPLES= NMR SPECTRUM
##VAR_NAME=  FREQUENCY,     SPECTRUM/REAL,   SPECTRUM/IMAG
##SYMBOL=    X,             R,               I
##VAR_TYPE=  INDEPENDENT,   DEPENDENT,       DEPENDENT
##VAR_FORM=  AFFN,          ASDF,            ASDF
##VAR_DIM=   32768,         32768,           32768
##UNITS=     HZ,            ARBITRARY UNITS, ARBITRARY UNITS
##FACTOR=    0.250966925370066, 1,           1
##FIRST=     8223.43324360094, 1057,         -138492
##LAST=      0,             -47471,          64501
##MIN=       0,             -658591,         0
##MAX=       8223.43324360094, 445221262,    0
$$ Real data points
##PAGE= N=1
##DATA TABLE= (X++(R..R)), XYDATA
$$ [...]
19572a69635k49800B2906b3105A92696a3600d349C0487c58008J44307e4032A15117
$$ -169635 -419435 22906 -23105 192696 -13600 -4349 30487 -358008 -213701 -54032 115117
19560A64509c6476B66431d26712Q2748r961J76831B46205H1905a00707A38733
$$ 164509 -36476 266431 -426712 -343964 -353925 -177094 246205 81905 -100707 138733
19549c17879j992a24303I0616o884O4102e4252A92131g8262l4577A574c55447
$$ -317879 -319871 -124303 90616 83732 147834 -54252 192131 -78262 -112839 1574 -355447
19537a65994m1036H2592J1488c56845e9218n7902B8449J21727J9894d3523q9139
$$ -165994 -207030 82592 94080 -356845 -59218 -117120 28449 150176 170070 -43523 -132662
19526a32662a0595p7971H7574a74697k309B72874d030k08145A2052g2019q9227
$$ -132662 -10595 -88566 87574 -174697 -177006 272874 -4030 -212175 12052 -72019 -161246
19515a61246k0996M1279B81692d754j6398k4651B3856b32188n0553G1233J09919
$$ -161246 -182242 -140963 281692 -4754 -21152 -45803 23856 -232188 -282741 71233 181152
19504A81152a22634j14054a07148A99887a82143A1922b69464O3423H1321a78111
$$ 181152 -122634 -236688 -107148 199887 -182143 11922 -269464 -206041 81321 -178111
19493A0229a97887j14228D22242a68780N6519d6791n1737H3591N1168E2650D481
$$ 10229 -197887 -312115 422242 -168780 -112261 -46791 -98528 83591 134759 52650 4481
19481A07069B5235g9736j8887A07412C1213h9406k5091e4427m5967I3916h3674
$$ 107069 25235 -79736 -98623 107412 31213 -89406 -114497 -54427 -100394 93916 -83674
19469f0593p9443k9347A15576n253B6882M2619a15669A7666b59039D4751L941
$$ -60593 -140036 -169383 115576 110323 26882 69501 -115669 17666 -259039 44751 48692
19458D8692a11627A32444c28268G5278i9470Q841q6136O0624C26647c10542P1143
$$ 48692 -111627 132444 -328268 75278 -99470 -90629 -176765 -116141 326647 -310542 -239399
19447b39399n2332G5536a87462d8612o1329F0032a61454A3007N9395A1896b4080
$$ -239399 -291731 75536 -187462 -48612 -109941 60032 -161454 13007 72402 11896 -24080
19435G1667c80073A63395A8651E410a79631j17412a4194B987b43311e8227j6181
$$ 71667 -380073 163395 18651 5410 -179631 -297043 -14194 2987 -243311 -58227 -74408
19424g4408j47976j90891i7312r9958G1612b14149b8185F215a5466j387l9232
$$ -74408 -222384 -413275 -97312 -197270 71612 -214149 -28185 6215 -15466 -16853 -56085
19413e6085A62454a45435m8212g3020k9737M9825K4327A18924J2863a38950b1114
$$ -56085 162454 -145435 -193647 -73020 -102757 -52932 -28605 118924 131787 -138950 -21114
19401d28564B8328a34893e0757n7596j55531G3357P6516a39978n2218b9249B30124
$$ -428564 28328 -134893 -50757 -108353 -263884 73357 149873 -139978 -192196 -29249 230124
19389c13351f9008b2239k9819j8012j80925n1937f4658b6210A5297c04116f300
$$ -313351 -69008 -22239 -52058 -70070 -250995 -302932 -64658 -26210 15297 -304116 -6300
19377e1028A50167d91295K39108H5092j9689h5603E82b03202P589K6657B9809
$$ -51028 150167 -491295 -252187 85092 65403 -85603 582 -203202 -195613 -168956 29809
19365a17509N4016r0655B18182i5840c0823A3699K2383N274a52465a1199m5260
$$ -117509 -63493 -154148 218182 -95840 -30823 13699 36082 41356 -152465 -11199 -56459
19354e6459B52300f9927A52837e6073l7746B10161a49229F4955j4970a25526j3999
$$ -56459 252300 -69927 152837 -56073 -93819 210161 -149229 64955 49985 -125526 -139525
19343a39525C71611b39913O9263A02339i7511A72541c30224i1414I1355a68447
$$ -139525 371611 -239913 -170650 102339 -97511 172541 -330224 -91414 91355 -168447
19332H700a64182k0523O0801I1289d9720k154b1192F8829i9205j39020A55139
$$ 8700 -164182 -184705 -123904 91289 -49720 -51874 -21192 68829 -99205 -238225 155139
19320A14848b01975e0139J9475B3232l730b11170j6704B0135a44529A41642f0865
$$ 114848 -201975 -50139 -30664 23232 19502 -211170 -227874 20135 -144529 141642 -60865
19308b39258Q3495j8826P400l9179M8851L4599A61190i6247k47130A8235a2233
$$ -239258 -155763 -174589 -167189 -206368 -157517 -122918 161190 -96247 -343377 18235 -12233
19296d08517P1874h8271l332F1725J37763b83584f4721L0403k2079m5633G7597
$$ -408517 -336643 -88271 -91603 61725 199488 -283584 -64721 -34318 -56397 -102030 77597
19284B0952a8501D3398a61269A30709h8744A05893Q431a85374A26963f730B14826
$$ 20952 -18501 43398 -161269 130709 -88744 105893 114324 -185374 126963 -6730 214826
19272c2879f626A33147b77207a36578M5987b8152j22494m0628O8031A56592d7643
$$ -32879 -6626 133147 -277207 -136578 -90591 -28152 -150646 -191274 -123243 156592 -47643
19260b88348B30467D3401d7672j97115L2419b549m7875A1159O0380b62765A37899
$$ -288348 230467 43401 -47672 -244787 -212368 -2549 -50424 11159 71539 -262765 137899
19248H4829k0043L0066B7518R2557K09203c34770a42204J2415l7714N3894B8043
$$ 84829 64786 94852 27518 120075 329278 -334770 -142204 -129789 -167503 -113609 28043
19236c18420A1526N7918a16945b8092k7581j26933O3997j68847m5493J30764A2756
$$ -318420 11526 69444 -116945 -28092 -55673 -182606 -118609 -287456 -332949 -202185 12756
19224a34522E7815J2252P4356m7547a41640e4720o5173D02046j76989a84246j0359
$$ -134522 57815 70067 144423 96876 -141640 -54720 -119893 402046 225057 -184246 -194605
19213a94605N8167J8308K8437Q299D5129b06328a2594l03586g131A52553d65966
$$ -194605 -136438 -118130 -89693 -81394 45129 -206328 -12594 -316180 -7131 152553 -465966
19201a50021j50528A80040b06705p5134a33326K8376P211j03396i6753o9459K1892
$$ -150021 -300549 180040 -206705 -281839 -133326 -104950 -97739 -201135 -96753 -166212 -144320
19190a44320A50679a72611C4103I03b3663A78787K7223a86983B12719N070b94408
$$ -144320 150679 -172611 34103 903 -23663 178787 206010 -186983 212719 217789 -294408
19178d62782a32563M9798B10526c24347I2465d388p2366B6878i0202B5535c07086
$$ -462782 -132563 -82765 210526 -324347 92465 -4388 -76754 26878 -90202 25535 -307086
19166b5552C6548J43646m192A8648b01169Q5653G3749c3100B2895b56283B8365
$$ -25552 36548 180194 176002 18648 -201169 -115516 73749 -33100 22895 -256283 28365
19154d2844j18521A85676H6184h9807m1078A01927a76777j00943A24709g8197
$$ -42844 -161365 185676 86184 -89807 -130885 101927 -176777 -277720 124709 -78197
19143F148d464A9716c731H3722d5625k24976a04295j84970a00617j77981j15490
$$ 6148 -4464 19716 -3731 83722 -45625 -270601 -104295 -289265 -100617 -278598 -394088
19132c94088J16070A01078c32506g0563E0530b1406F6033R1928a53344B07004
$$ -394088 -278018 101078 -332506 -70563 50530 -21406 66033 157961 -153344 207004
19121a73930A51403i7783q4404M6686A5413b93063J08125j01335a24317J3272
$$ -173930 151403 -97783 -182187 -135501 15413 -293063 -184938 -286273 -124317 -111045
19111a11045j69718D743c03238h501j61613c3860m6586L4349j76397g5122K6141
$$ -111045 -280763 4743 -303238 -8501 -170114 -33860 -80446 -46097 -222494 -75122 -48981
19100d8981g703j80134A8049p800f58591L19423A83320b93560d7849E6285e5241
$$ -48981 -7703 -187837 18049 10249 -658591 -339168 183320 -293560 -47849 56285 -55241
19088c11027g8743k28726h9430k28110O2046q5970J55730A1806c09659Q7734A84879
$$ -311027 -78743 -307469 -89430 -317540 -255494 -341464 -185734 11806 -309659 -221925 184879
19076b30123F9053J57567I4449k4363O7629i9088d227k71803a17684n2225a0155
$$ -230123 69053 226620 94449 70086 137715 -99088 -4227 -276030 -117684 -169909 -10155
19064c6979l37071i6551A90383q6269o647J5090b75084D8146a91592o6532d8520
$$ -36979 -374050 -96551 190383 104114 97467 112557 -275084 48146 -191592 -258124 -48520
19052B89632B6308R4583a05285B85548b38067b2933A31060a22646b9967F935c26522
$$ 289632 26308 120891 -105285 285548 -238067 -22933 131060 -122646 -29967 6935 -326522
19040a54693G8278a28520j61087H8700a18301A2093b43813l0609B57809I4640
$$ -154693 78278 -128520 -289607 88700 -118301 12093 -243813 -274422 257809 94640
19029A09393j0807R8146r7347a25754j35141C31455n3182I6445b81680A16425
$$ 109393 98586 196732 99385 -125754 -260895 331455 278273 96445 -281680 116425
19018h5720k76625B00985J93722A2400K14860h7947E8907a40490I9713e23030
$$ -85720 -362345 200985 394707 12400 227260 -87947 58907 -140490 99713 -523030
19007g7630j31468A57367a44496C7306J21799c03782A08733a73895D847J06729
$$ -77630 -209098 157367 -144496 37306 159105 -303782 108733 -173895 4847 111576
18997A11576e7229l6475L6661K3088j09207B9093a72021A06255O6212b46855k10822
$$ 111576 -57229 -93704 -57043 -33955 -143162 29093 -172021 106255 172467 -246855 -457677
18986d57677a40751B32081i5156m564B17206a82066K0349f9172o7762G0884J24301
$$ -457677 -140751 232081 -95156 -99720 217206 -182066 -161717 -69172 -136934 70884 195185
18975A95185g6298m5155e9844B5958c95865B1710O6771a95370A5156O1a35035
$$ 195185 -76298 -121453 -59844 25958 -395865 21710 88481 -195370 15156 15217 -135035
18963F3300e2215j97552C07174j13409D8848a20418B46261K3959a23903A45179
$$ 63300 -52215 -249767 307174 193765 48848 -120418 246261 270220 -123903 145179
18952a33380r9125g9338b0498j23547C1184A303L44429n0659a19744B5814b31789
$$ -133380 -232505 -79338 -20498 -144045 31184 1303 345732 295073 -119744 25814 -231789
18940a39857n2600j68711A00296j4134f5767k80984F2977J06067i6124r0797A7309
$$ -139857 -192457 -361168 100296 86162 -65767 -346751 62977 169044 -96124 -186921 17309
18928a72159K3401L7752G3631Q3798a00207k38003a06940o806H7768a19697M5743
$$ -172159 -148758 -111006 73631 157429 -100207 -338210 -106940 -113746 87768 -119697 -73954
18917g3954B45983f0989r7864l8462B28551I5162b27579I2097a34057m4701e0709
$$ -73954 245983 -60989 -158853 -197315 228551 95162 -227579 92097 -134057 -178758 -50709
18905a7213j77402P5816m0802L1308l1042F0720J18240F3959b64556F908J20291
$$ -17213 -194615 -118799 -159601 -128293 -159335 60720 178960 63959 -264556 6908 127199
18894A27199A7786i3743I4178e4964a8473j54368f8930j77678G6237d50614B7164
$$ 127199 17786 -93743 94178 -54964 -18473 -172841 -68930 -246608 76237 -450614 27164
18882b10242A21206C7391b15602f3471A8478K04021a88002i1576d2765D6515a15856
$$ -210242 121206 37391 -215602 -63471 18478 222499 -188002 -91576 -42765 46515 -115856
18870c43965J54950J4870A63443A9487J39306l4537K2773b5182g807j96917D2759
$$ -343965 -189015 -174145 163443 19487 158793 124256 147029 -25182 -7807 -204724 42759
18858d24501J76675C69555A21960b16101a2407I1101K85897H4319C7099a33020
$$ -424501 -247826 369555 121960 -216101 -12407 91101 376998 84319 37099 -133020
18847g2004B14144r5402a45192G671a59105L1604A12427a24659k70584a75365
$$ -72004 214144 118742 -145192 7671 -159105 -127501 112427 -124659 -395243 -175365
18836b34716J02600I3247I499P8920a30952D1691f38m31618b1107B05921i5231
$$ -234716 -132116 93247 9499 88419 -130952 41691 -638 -432256 -21107 205921 -95231
18824A27862K223C9532J53219n2667i8047B3559K30152K4166E1692C493O730b25792
$$ 127862 130085 39532 192751 140084 -98047 23559 253711 277877 51692 3493 10223 -225792
18811C56026r5009Q4423F9800l1344B508O2619B4288K6845c1876B3709h3885B4909
$$ 356026 261017 345440 69800 38456 2508 65127 24288 51133 -31876 23709 -83885 24909
18798A25803a76029a1094m5658r4316I8815c94403P4358C2065g6532k16147h419
$$ 125803 -176029 -11094 -56752 -151068 98815 -394403 -320045 32065 -76532 -292679 -8419
18786D56604E2962h1829k13420f6930k66358G2499k1118p532c8920B9451b9813
$$ 456604 52962 -81829 -295249 -66930 -333288 72499 51381 43849 -38920 29451 -29813
18774a07018P786D4338F024c81847G1653e0569j51472c0324j51097k6737R9285
$$ -107018 -99232 44338 6024 -381847 71653 -50569 -202041 -30324 -181421 -208158 -108873
18763a08873l99823f8197C3572g2809c0620j07061l9820M8114K6240k60693j42388
$$ -108873 -508696 -68197 33572 -72809 -30620 -137681 -177501 -129387 -103147 -363840 -506228
18752e06228a72504r3269j86907a21341B0927K04212e23921a49916b786D834a9124
$$ -506228 -172504 -265773 -452680 -121341 20927 225139 -523921 -149916 -2786 4834 -19124
18740H6465a79882D8360L91238a18530A42912c92968C3282a20931B4890a77703
$$ 86465 -179882 48360 439598 -118530 142912 -392968 33282 -120931 24890 -177703
18729a88270j74002J43604A03269A4064b80880K6650Q3702C6528a12476C6617
$$ -188270 -362272 -218668 103269 14064 -280880 -254230 -170528 36528 -112476 36617
18718b12334N9467C0821i3531B58229a94820B9119b54177G098a79061F121J63392
$$ -212334 -152867 30821 -93531 258229 -194820 29119 -254177 7098 -179061 6121 169513
18707A69513e9644B6319J52276f1947J7365A84493a45444I8981i0775m2723A91110
$$ 169513 -59644 26319 178595 -61947 -44582 184493 -145444 98981 -90775 -133498 191110
18695a45613f9315I9834a49074n191o4498O1362M7296d0511l7142k35318a3739
$$ -145613 -69315 99834 -149074 -154265 -218763 -157401 -110105 -40511 -77653 -312971 -13739
18683F8751d6708k48895a31103G6223b15678j067a379n5975b5768I8523d2797
$$ 68751 -46708 -295603 -131103 76223 -215678 -216745 -1379 -57354 -25768 98523 -42797
18671C00136a0527k66715B1326a29902A72124d1094C0373a01897c2025J2214j4142
$$ 300136 -10527 -277242 21326 -129902 172124 -41094 30373 -101897 -32025 -19811 -33953
18660c3953m759m60471F4925a1018l91332a79145j3829A82648A1497O3614a85518
$$ -33953 -38712 -499183 64925 -11018 -402350 -179145 -192974 182648 11497 75111 -185518
18648c10610a05699q4312C13197A06447n0462b95789B45571I1585M9533i1808
$$ -310610 -105699 -190011 313197 106447 55985 -295789 245571 91585 141118 -91808
18637h0610A25364a16823A8839J91067q8489E5172L4330a22860j2485b196A00982
$$ -80610 125364 -116823 18839 209906 121417 55172 89502 -122860 -135345 -2196 100982
18625C5027e9877m5400B30086E9705d03846H6039Q1861b9031j74454P9075o2695
$$ 35027 -59877 -105277 230086 59705 -403846 86039 167900 -29031 -203485 -124410 -187105
18614a87105D3853b64798c4463A52068J5927E5967h8227o8626A7504c5282A03929
$$ -187105 43853 -264798 -34463 152068 167995 55967 -88227 -156853 17504 -35282 103929
18602B5072A2036J0136E01J24625c7651B3825b48954A64348a9048q0257o6535
$$ 25072 12036 22172 501 125126 -37651 23825 -248954 164348 -19048 -99305 -165840
18591a65840j97872J65616j30258J14758j0947B9318b27351J3696A14546a66131
$$ -165840 -363712 -198096 -328354 -213596 -224543 29318 -227351 -213655 114546 -166131
18580g5335A31785k7666B4059B062J44060b09632d4318q0427C5213b2874j33492
$$ -75335 131785 104119 24059 2062 146122 -209632 -44318 -124745 35213 -22874 -156366
18569a56366k30829A42486a53256J1347B6285Q2020a40308j53897a45598C79366
$$ -156366 -387195 142486 -153256 -141909 26285 108305 -140308 -294205 -145598 379366
18558A06729g8974L1656m2805o8001N067G7274J7540d412m698E5896c28128B33426
$$ 106729 -78974 -47318 -90123 -158124 -153057 77274 94814 -4412 -9110 55896 -328128 233426
18545B2451J40409k5023k7491h3008k22136J07498H2870C793a34256k27365g5881
$$ 22451 162860 137837 110346 -83008 -305144 -197646 82870 3793 -134256 -361621 -75881
18533I5372j2013b24454A82511b89972P1615j13030A46106M9525a97110i2693
$$ 95372 83359 -224454 182511 -289972 -218357 -331387 146106 195631 -197110 -92693
18522b53315C8799h6859E9024d60555K25083M688B57459e1522j04012r8324c8390
$$ -253315 38799 -86859 59024 -460555 -235472 -230784 257459 -51522 -155534 -253858 -38390
18510B4849J65935a51863m2641k441A16993A9554i6588k45813a09162p7349I8248
$$ 24849 190784 -151863 -194504 -196945 116993 19554 -96588 -342401 -109162 -186511 98248
18498A41938F0338J25446a56294D1695J23911B7794b51399B23526c42670P3209
$$ 141938 60338 185784 -156294 41695 165606 27794 -251399 223526 -342670 -269461
18488b69461B03771I486L29780b09415c5688C3377c36768A42789B1264f1521k01494
$$ -269461 203771 9486 339266 -209415 -35688 33377 -336768 142789 21264 -61521 -263015
18477b63015i2530D36g6977A5526g918j47570j4182A09241Q8040d31090a07865
$$ -263015 -92530 436 -76977 15526 -7918 -155488 -169670 109241 197281 -431090 -107865
18465a10003A26733i3880M1598G9368h3528D93927A22295h3854o8926j03643E4969
$$ -110003 126733 -93880 -52282 79368 -83528 493927 122295 -83854 -152780 -256423 54969
18453a9811q1681B93429D8562d8651k25770m7294f965l3873p256j12596a143F2067
$$ -19811 -101492 293429 48562 -48651 -274421 -321715 -6965 -40838 -48094 -160690 -1143 62067
18440a13951A7990c0293J1162m8488P738D6481A5161f6371F6916f98A3583L6805
$$ -113951 17990 -30293 -19131 -67619 -59881 46481 15161 -66371 66916 -698 13583 50388
18428E0388c02221a39515d4254E7207e1947F1997B6147a06656M5385M914A03370
$$ 50388 -302221 -139515 -44254 57207 -51947 61997 26147 -106656 -61271 -56357 103370
18416G0116a2762A17507J33209q6800b54728D3381b2414j76767D06845b3794f936
$$ 70116 -12762 117507 250716 163916 -254728 43381 -22414 -199181 406845 -23794 -6936
18404D4087N877a15109d5703I1931N8669c20948A2183a3647k41768g5430m694
$$ 44087 49964 -115109 -45703 91931 150600 -320948 12183 -13647 -255415 -75430 -80124
18393h0124g698B5521e0970C89167b59756a24477n7099H8878e522j51635j1296
$$ -80124 -7698 25521 -50970 389167 -259756 -124477 -181576 88878 -5522 -157157 -168453
18382a68453r2791C28245H8621a64996n3385p6424p0438A06627j496d5626j62135
$$ -168453 -261244 328245 88621 -164996 -218381 -294805 -365243 106627 105131 -45626 -207761
18371b07761G8572a21121A50929C9250P1045N8215a13554b5959C26679c3424E6971
$$ -207761 78572 -121121 150929 39250 110295 168510 -113554 -25959 326679 -33424 56971
18359h7044A2070K53597A06953l0597K5234m8703J7643f8832k5744j35208g3435
$$ -87044 12070 265667 106953 76356 101590 52887 70530 -68832 -94576 -229784 -73435
18347B44849a76056B2398a17184I0603c9363l78706d070G1950M0906a60356C64692
$$ 244849 -176056 22398 -117184 90603 -39363 -418069 -4070 71950 112856 -160356 364692
18335F7046d7500B15411k2142c6111A70318l4979E7255a87286H9223b3503B0642
$$ 67046 -47500 215411 193269 -36111 170318 135339 57255 -187286 89223 -23503 20642
18323a51464f8283B98520A09606b9183B37187b57840F0314d5990B66944a05232
$$ -151464 -68283 298520 109606 -29183 237187 -257840 60314 -45990 266944 -105232
18312g4751j48604k55229a19001A53960E559p46d2337r6130B20102b58923Q6993
$$ -74751 -223355 -478584 -119001 153960 5559 4813 -42337 -138467 220102 -258923 -171930
18301a71930A3669e5099k14798r9905J0302A9534a49563E7818J02196K6763h3018
$$ -171930 13669 -55099 -269897 -369802 -359500 19534 -149563 57818 160014 186777 -83018
18289b90088C9131N1209Q5479d87429J33942J33297j01779A64603b05446K7679
$$ -290088 39131 90340 175819 -487429 -353487 -220190 -321969 164603 -205446 -177767
18279a77767N1873A06723a13002l02307a34455p0660J8110f9007A65548i2194
$$ -177767 -125894 106723 -113002 -415309 -134455 -205115 -187005 -69007 165548 -92194
18268g9837j59340l0476B11687a8415j71415E8103M0602c6790k04718K7426F3011
$$ -79837 -239177 -269653 211687 -18415 -189830 58103 98705 -36790 -241508 -214082 63011
18256b61441C0907g8113C25804a27661b8486k3268l5732j02695R2842n7042A22412
$$ -261441 30907 -78113 325804 -127661 -28486 -51754 -87486 -190181 -97339 -154381 122412
18244A83210h5407C36802G5570J25534c07741a00806B50061D5345f7753H0881
$$ 183210 -85407 336802 75570 201104 -307741 -100806 250061 45345 -67753 80881
18233B3205b669B03687P7706a47079r9709A92965b64315i9857A39733k6642a85475
$$ 23205 -2669 203687 281393 -147079 -246788 192965 -264315 -99857 139733 113091 -185475
18221D83737a46736L5611q4119d9651j14059O6660A26415B4047a21325B31274
$$ 483737 -146736 -111125 -195244 -49651 -163710 -97050 126415 24047 -121325 231274
18210A74329J99823d1790P735D2644d5570j11111b0785E3113Q3226k7179d71477
$$ 174329 374152 -41790 -34055 42644 -45570 -156681 -20785 53113 136339 109160 -471477
18198c61757o0721a10213N2213A88341a00995b0568D9984e3554k97035L9154a37600
$$ -361757 -422478 -110213 -58000 188341 -100995 -20568 49984 -53554 -350589 -311435 -137600
18186a24496J8794l3393B76620c17564j36118j3026i3003A0541c00544B68406
$$ -124496 -105702 -139095 276620 -317564 -453682 -466708 -93003 10541 -300544 268406
18175a17809j87063C693a09588n4723j77977a57486F5146c6748a2856A94419h7459
$$ -117809 -304872 3693 -109588 -164311 -342288 -157486 65146 -36748 -12856 194419 -87459
18163e9037F567e8757B1837a23850G1903a80189L9088N8970j14404j26552J08156
$$ -59037 6567 -58757 21837 -123850 71903 -180189 -141101 -82131 -196535 -323087 -214931
18152b14931d0302C2719M7845d4184j08468A62668n9439b33620C4096b0163E154
$$ -214931 -40302 32719 80564 -44184 -152652 162668 103229 -233620 34096 -20163 5154
18140a36299c4745j81205H7033J49501j01701J1933d3800k8010r2342H4537d5897
$$ -136299 -34745 -215950 87033 236534 134833 146766 -43800 -71810 -164152 84537 -45897
18128a47500k4719g8137E3916b26413A9970e9437k5423r3061q0633a24834c6424
$$ -147500 -172219 -78137 53916 -226413 19970 -59437 -84860 -177921 -258554 -124834 -36424
18116d5879F24K99515d357l23310A3784h2430r3355J2856D0257a2883F2943J20444
$$ -45879 624 300139 -4357 -327667 13784 -82430 -175785 -162929 40257 -12883 62943 183387
18104A83387b87697B4092J21158a38728H4802g0609j5637C5994b20254A71313
$$ 183387 -287697 24092 145250 -138728 84802 -70609 -86246 35994 -220254 171313
18093h4194C5180A5934a64857G5012B8362J04501R9585p341j8042g5836m0675
$$ -84194 35180 15934 -164857 75012 28362 132863 232448 225107 207065 -75836 -116511
18082a16511A92673c59404a33971k6618A8929a35836p1567F5445g0365A09087
$$ -116511 192673 -359404 -133971 -160589 18929 -135836 -207403 65445 -70365 109087
18071a18615j25700P4960A8555R6161b11644B39144n708N1151b68966E0255k440
$$ -118615 -244315 -169355 18555 114716 -211644 239144 233436 284587 -268966 50255 47815
18060D7815c8075j47227k9212k1180L9893C4540a85461c436m7135B07481n9684
$$ 47815 -38075 -185302 -214514 -235694 -195801 34540 -185461 -3436 -50571 207481 147797
18049A47797L6481b07048b0879A92081D8859b20872B55452b20859g657I6585h0556
$$ 147797 184278 -207048 -20879 192081 48859 -220872 255452 -220859 -7657 96585 -80556
18037F9944c52852E1494K19458a15153M4553C15995b49557o0707f7851q1541A19791
$$ 69944 -352852 51494 270952 -115153 -70600 315995 -249557 -310264 -67851 -149392 119791
18025f6551H6714j1347b01959B4684c5839A33581g5975A56272A2494b05142P4002
$$ -66551 86714 75367 -201959 24684 -35839 133581 -75975 156272 12494 -205142 -131140
18014a31140Q302j91852C66873o1404H9697g6558j54248f3972A72325c4951l2888
$$ -131140 -122838 -314690 366873 305469 89697 -76558 -230806 -63972 172325 -34951 -67839
18003f7839A08923a49767H1907A3772i4552H4882J05107b15005C2202a0145B92604
$$ -67839 108923 -149767 81907 13772 -94552 84882 189989 -215005 32202 -10145 292604
17991B12369G635B070Q5553N8391a275j52254k89180H2648l6447D777a78940j5314
$$ 212369 7635 2070 87623 146014 -1275 -153529 -442709 82648 46201 4777 -178940 -194254
17979a94254L4494H5993a26135n8110m62402a50569b9803I8953b3814j2727H0323
$$ -194254 -159760 85993 -126135 -184245 -646647 -150569 -29803 98953 -23814 -36541 80323
17967c01011a02947h742o6707o0022A34082F6211d04673b948j28943j33306h9715
$$ -301011 -102947 -8742 -75449 -135471 134082 66211 -404673 -2948 -131891 -265197 -89715
17955A91772e0696q0971I3377a94255Q7975A70696a15964A3600J02253n4259K3188
$$ 191772 -50696 -131667 93377 -194255 -106280 170696 -115964 13600 115853 61594 84782
17944H4782b56672B81717e4524Q566p7531j99860B51491i2011r9015C4800c5436
$$ 84782 -256672 281717 -54524 -45958 -123489 -323349 251491 -92011 -191026 34800 -35436
17932b78801A52609f6056D1380a09733G2075d7627j38731E4321c4365m3597A14121
$$ -278801 152609 -66056 41380 -109733 72075 -47627 -186358 54321 -34365 -77962 114121
17920a38486H4615b0127j7756m2463A38209L5307a40532L1473A33777c7897A4444
$$ -138486 84615 -20127 -37883 -80346 138209 173516 -140532 -109059 133777 -37897 14444
17908a04832H8287a38708D1971J2864g7511F3133j6851K64930b3971A2067d2929
$$ -104832 88287 -138708 41971 54835 -77511 63133 46282 311212 -23971 12067 -42929
17896A75418J79236a08719L0957D0508A5382K95002A49743a89440P1620A12713
$$ 175418 354654 -108719 -77762 40508 15382 310384 149743 -189440 -117820 112713
17885B1863K02196b10809E2622i8006D3829a44779l910b2008L671H5218h0826
$$ 21863 224059 -210809 52622 -98006 43829 -144779 -148689 -22008 -18337 85218 -80826
17873d990B4399K08669b18652N5300J3108C07088d5259j73702j4240A91234a64098
$$ -4990 24399 233068 -218652 -163352 -150244 307088 -45259 -218961 -233201 191234 -164098
17861H1409J94634F9068J84826q4440a70237b0623B0985M0003a04071L8491A35158
$$ 81409 276043 69068 253894 169454 -170237 -20623 20985 60988 -104071 -65580 135158
17849f65r1503k95485E5578a42267A2999L965c165k47393J14838N9737c1570J0527
$$ -665 -92168 -387653 55578 -142267 12999 16964 -3165 -250558 -135720 -75983 -31570 -21043
17837b1043A18812l1883b00871N903B20521m4884a82153B27841A08250j7243J14820
$$ -21043 118812 86929 -200871 -194968 220521 175637 -182153 227841 108250 91007 205827
17826B05827p0462a32453E6068b66089C2675g9161D13835E9910K52143A01136
$$ 205827 135365 -132453 56068 -266089 32675 -79161 413835 59910 312053 101136
17815G4440K07843d7258A5496a4360E2458J20704h8717K5736j09947P8366m04462
$$ 74440 282283 -47258 15496 -14360 52458 173162 -88717 -62981 -172928 -94562 -499024
17804d99024a65042P0875o9384A09202b52510i8279I8242a51992f7551G4929b15209
$$ -499024 -165042 -94167 -163551 109202 -252510 -98279 98242 -151992 -67551 74929 -215209
17792a43251A09028A0358J63176E8898b19429A45980Q5435a55540o3777O2496
$$ -143251 109028 10358 173534 58898 -219429 145980 231415 -155540 -219317 -156821
17782a56821B2734a21506D5411J01295a55937P7378A01416Q7743b9453j14509
$$ -156821 22734 -121506 45411 146706 -155937 -78559 101416 189159 -29453 -143962
17772a43962A32693a53601A86585J5416C8933J63352P5466H7353L7200a28717
$$ -143962 132693 -153601 186585 202001 38933 202285 277751 87353 124553 -128717
17761F7539c03361b9248o3570A62891e7986j27362l2151A10988f8245l3068F1290
$$ 67539 -303361 -29248 -92818 162891 -57986 -185348 -217499 110988 -68245 -101313 61290
17749H0224K86834h8709C74036A14781a21024B6877i8076E5809k2952b9931E7982
$$ 80224 367058 -88709 374036 114781 -121024 26877 -98076 55809 32857 -29931 57982
17737B63385i2011A00005D6123H249J7386b64179e4521B13497a06664d1291A98022
$$ 263385 -92011 100005 46123 8249 25635 -264179 -54521 213497 -106664 -41291 198022
17725B35563j05455C314J54751n1806b07713B87577K3521j23577a88393j14080
$$ 235563 130108 3314 158065 106259 -207713 287577 311098 187521 -188393 -302473
17715c02473C00617A17392J9023b5013C17889a67877G3581O3459b04797D6564
$$ -302473 300617 117392 136415 -25013 317889 -167877 73581 137040 -204797 46564
17704B43336i6908B84247i8779o1628M3875A57069b2549j89682M2593A12937A2713
$$ 243336 -96908 284247 -98779 -160407 -116532 157069 -22549 -212231 -169638 112937 12713
17692a63420j03822i0843j26086f2477j55622b9112j16904A42662K1087n5059
$$ -163420 -267242 -90843 -216929 -62477 -218099 -29112 -146016 142662 163749 108690
17682A08690J964j9667b4009m9558k1111B42233E0313k4978M9434J16772b26905
$$ 108690 110654 90987 -24009 -73567 -94678 242233 50313 25335 74769 191541 -226905
17670b11654A60669q0257a69708C11119j38886b06984G4034c38785a14991j72988
$$ -211654 160669 80412 -169708 311119 172233 -206984 74034 -338785 -114991 -287979
17660b87979L9438C02432A41426m220c0654k11083K5419Q2442j40678Q5535g9584
$$ -287979 -248541 302432 141426 137206 -30654 -241737 -216318 -133876 -274554 -189019 -79584
17648c74525A50240c185k06795d771B0429N65P0888a13602L1317j54914j07979
$$ -374525 150240 -3185 -209980 -4771 20429 20994 91882 -113602 -82285 -237199 -345178
17637c45178B41976A2269J34803a76987C53436a78173C8321b17960a02521A41973
$$ -345178 241976 12269 147072 -176987 353436 -178173 38321 -217960 -102521 141973
17626F5634J96031C4084d25414B34122d6111A81714f8648A12488O5397f9437D59591
$$ 65634 261665 34084 -425414 234122 -46111 181714 -68648 112488 177885 -69437 459591
17614a06586B3111b89809F235a09673C68169a8902B54850f3656a3615A09470J76161
$$ -106586 23111 -289809 6235 -109673 368169 -18902 254850 -63656 -13615 109470 285631
17603B85631D3968b26538I528b36968D11575c6812A39285K4907a4197F860J13926
$$ 285631 43968 -226538 9528 -236968 411575 -36812 139285 164192 -14197 6860 120786
17592A20786n6981R5032b18547C67422i2165a3306j11569M4314h921o184D0797
$$ 120786 63805 158837 -218547 367422 -92165 -13306 -124875 -80561 -8921 -15105 40797
17580a06965A65465g4458r6569l7275A01368b8837B00743h8043o3669P4155C34786
$$ -106965 165465 -74458 -171027 -208302 101368 -28837 200743 -88043 -151712 -77557 334786
17568A57444J04151o0680r3806k3773l1445L7331B6096i1998J7984B13480I6726
$$ 157444 261595 200915 107109 83336 51891 89222 26096 -91998 -74014 213480 96726
17556H732g0k84209E5929d9592p7540A896P0422K81673J08912a0413A35512a73363
$$ 8732 -70 -284279 55929 -49592 -127132 1896 72318 353991 462903 -10413 135512 -173363
17543C49917b10906C08310D2019L13706b02193H4122J13307p7491e2171B23975
$$ 349917 -210906 308310 42019 355725 -202193 84122 197429 119938 -52171 223975
17532A25253a65294M1602a0828I8262J16580f323A75095g7638p5480B71169a39615
$$ 125253 -165294 -123692 -10828 98262 214842 -6323 175095 -77638 -153118 271169 -139615
17520A36846o5879B7269b4841r8226B19333E2756h1954J5421a2543k17988l7477
$$ 136846 70967 27269 -24841 -123067 219333 52756 -81954 -66533 -12543 -230531 -268008
17509b68008J4509j23925I2757i4891B24267D8500O0640a06607d5606A93927m2395
$$ -268008 -253499 -377424 92757 -94891 224267 48500 109140 -106607 -45606 193927 151532
17498A51532k5628f287p3827q5266L3187j66655A2540K36680o9083o0162D9491
$$ 151532 125904 -6287 -80114 -165380 -132193 -298848 12540 249220 180137 119975 49491
17486E8778K38864m2649C4215J77992G5611g274B47289c1029A12847J17744M7012
$$ 58778 297642 254993 34215 212207 75611 -7274 247289 -31029 112847 230591 277603
17475B77603j13803E5043J53333a5614B30930a82574B23467k5144m0825N8261
$$ 277603 163800 55043 208376 -15614 230930 -182574 223467 198323 157498 215759
17465B15759j07740b64373A92776G2988K6695a46207A46090a7647A83053E9283
$$ 215759 108019 -264373 192776 72988 99683 -146207 146090 -17647 183053 59283
17454D22148e5021B13119o3961M1143L7890L03792k18962l268a79677C14700j45667
$$ 422148 -55021 213119 149158 190301 228191 531983 313021 309753 -179677 314700 169033
17443A69033l737H2596O93K48747J38646A61260C7172L56591j96618h078C52542
$$ 169033 165296 82596 83289 332036 470682 161260 37172 393763 197145 -8078 352542
17431B66596A31757L01862I1261O5792g737B79030A701M34330j9081j56898A23315
$$ 266596 131757 433619 91261 157053 -7737 279030 1701 436031 416950 260052 123315
17419G5169J6067O6163D8355J19921h886E51425G9101P7467J43279j43647K89100
$$ 75169 91236 157399 48355 168276 -8886 551425 79101 156568 299847 156200 445300
17408D45300j94895n2614R272p8370j981b11038E6943j4479J53690r2464l4025
$$ 445300 250405 197791 207063 128693 126712 -211038 56943 42464 196154 103690 69665
17397F9665K35832b40893H6614P6298K4043p8845Q0491K45847B8976a45820G8710
$$ 69665 305497 -240893 86614 162912 186955 108110 188601 434448 28976 -145820 78710
17385A42586f057l6226B27640a07592L6458B78870m4561j08105f9031j38301B38189
$$ 142586 -6057 -42283 227640 -107592 -71134 278870 234309 126204 -69031 -207332 238189
17373I4792K24018e7846A15379h0451c3946A99107E067J14903J23911J04536J81404
$$ 94792 318810 -57846 115379 -80451 -33946 199107 5067 119970 243881 348417 529821
17362E29821G8615R3351c2435j73772d6880E5656L8967G500N9322N9973e6984
$$ 529821 78615 171966 -32435 -206207 -46880 55656 94623 7500 66822 126795 -56984
17350F4222e413C59642A37305D1474n319q700O5477K02477m4591j14051a73105
$$ 64222 -5413 359642 137305 41474 36155 27455 92932 295409 250818 136767 -173105
17338C74587b5036J2216q258A81304J31940L780m8079O8296q944j2907R0204A06477
$$ 374587 -25036 -12820 -21078 181304 313244 317024 268945 337241 328297 315390 405594 106477
17325A73130a8539C24676d9171b2876B32306L1785r5558G8793Q5069K84694A11599
$$ 173130 -18539 324676 -49171 -22876 232306 264091 168533 78793 163862 448556 111599
17313A12358a34308Q234A09511l9217K49817H7253g198A01906J43789d0563j22903
$$ 112358 -134308 -126074 109511 70294 320111 87253 -7198 101906 245695 -40563 -163466
17302a63466j90663A6328J77040R5604j17075p4061J47757J40916j76000b56058
$$ -163466 -354129 16328 193368 288972 171897 97836 245593 386509 210509 -256058
17291B41034E0269i6410d0551j26662B4445K82290b14648Q8508B51161I9375a65078
$$ 241034 50269 -96410 -40551 -167213 24445 306735 -214648 -126140 251161 99375 -165078
17279B59195j5807n6890q762n3971D9558P4509a16647e0478E1665K65953i6135
$$ 259195 243388 186498 177736 123765 49558 124067 -116647 -50478 51665 317618 -96135
17267C85614A40045J81559r9842J4180G7968f9109p0003H1886K42669o9533m4069
$$ 385614 140045 321604 221762 235942 77968 -69109 -139112 81886 324555 255022 210953
17256B10953F2709J86551a43126A88436J38078p3266J51537r4977j52077A1118
$$ 210953 62709 249260 -143126 188436 326514 253248 404785 309808 157731 11118
17245D42871j09061A4941K30066m3197L0368b75557E01641k37678e6858H8391
$$ 442871 333810 14941 245007 201810 232178 -275557 501641 263963 -56858 88391
17234h2732A43872Q5921m2782m3977K93165A32146N5054a67842C76908j84184
$$ -82732 143872 229793 187011 143034 436199 132146 187200 -167842 376908 192724
17224A92724L663j6410L69868A33941R7389p2425K56811e8829a9517A73634l0009
$$ 192724 196387 179977 549845 133941 231330 158905 415716 -58829 -19517 173634 143625
17213A43625J28383H4778J42453L2299P7927L5271A34959J11016a02311I6589
$$ 143625 272008 84778 227231 259530 337457 372728 134959 245975 -102311 96589
17202C07371e7665D42303h4898A8477K10323N1534D8149L21680H9958B5344J02785
$$ 307371 -57665 442303 -84898 18477 228800 280334 48149 369829 89958 25344 128129
17191A28129L55139G1925L34069f99m5392n0663E17518d1018F10622A32949J27908
$$ 128129 483268 71925 405994 -699 -46091 -96754 517518 -41018 610622 132949 260857
17180B60857m5496J53831n8207l7858K93986j31386A43372n9222C0144J01293
$$ 260857 215361 369192 310985 273127 567113 435727 143372 84150 30144 131437
17170A31437J12536K73613G3040J93265j4308F8291J62931K20983B00093J22629
$$ 131437 243973 517586 73040 266305 251997 68291 231222 452205 200093 322722
17160C22722A61319C9309J69222a03036B57445J46617q0370o0674o912J87649
$$ 322722 161319 39309 208531 -103036 257445 404062 323692 263018 256106 443755
17150D43755h9287C69970o3541j1666J71713p187N6036N233k45428Q2932A56494
$$ 443755 -89287 369970 306429 294763 466476 459289 515325 520558 275130 358062 156494
17138C05527n0851R1419P5040j77767p3254b4511E00546I3864J21373K11617J89969
$$ 305527 254676 346095 421135 243368 170114 -24511 500546 93864 215237 426854 616823
17127F16823A68025k0417K14152A14498N8659J97786J3952j10287J31061j85951
$$ 616823 168025 147608 361760 114498 173157 370943 384895 274608 405669 219718
17117B19718j03244M32988j57375N2259K09024B22079A07846M75486j41138j54213
$$ 219718 116474 549462 392087 444346 653370 222079 107846 583332 442194 287981
17107B87981J0027J96259j94087j4092M52935B97403K2136K17859m0261P3380
$$ 287981 298008 494267 300180 286088 739023 297403 319539 537398 497137 570517
17097E70517j07291j74113F9033K59380j06253l7338k0399K63231J96097k37897
$$ 570517 463226 289113 69033 328413 222160 184822 164423 427654 623751 385854
17087C85854o9916A50032J42377J06024J85261F0679M93642B37568L37544j27230
$$ 385854 315938 150032 292409 398433 583694 60679 554321 237568 575112 447882
17077D47882n1950L3687r0806J15557J73049k26111L03379l00190O5714Q2568
$$ 447882 395932 429619 338813 454370 627419 401308 704687 404497 470211 552779
17067E52779m9152p719p1111O6687q1607J9466l0048J6534K8648j03245J75739
$$ 552779 503627 495908 424797 491484 409877 429343 399295 415829 444477 341232 516971
17056E16971J58681K9377l04535J02768J54745K6447J40405l51779j09215J52176
$$ 516971 675652 705029 400494 503262 658007 684454 824859 473080 363865 516041
17046E16041k08833K51800R8345l12446M44688m3636l72968K55338l1575l5560
$$ 516041 307208 559008 657353 344907 789595 745959 372991 628329 596754 561194
17036E61194p1972M01903k18885j05358K43354C05294K16883K08243j55960J08444
$$ 561194 489222 891125 672240 566882 810236 305294 522177 730420 574460 682904
17026F82904K36649l33343B70088K58451J46195p3160k0478J44688n015j18355
$$ 682904 919553 586210 270088 528539 674734 601574 581096 725784 720769 602414
17016F02414K67444m01361j18138M06519C49096M93845l02580O7481k9683P6072
$$ 602414 869858 468497 350359 756878 349096 842941 540361 607842 578159 654231
17006F54231k89477L37797k13207L02152k65608P63593k84911l43634P4520l47566
$$ 654231 364754 702551 489344 791496 525888 1289481 1004570 660936 735456 387890
16996C87890O00214l43718J74591K37445l79400P3963n3881l8472J33314j10177
$$ 387890 988104 644386 818977 1056422 677022 750985 697104 658632 791946 681769
16986F81769O3206L9193j65302K11782j50906L1968K60506r7292j80372K17776
$$ 681769 744975 784168 618866 830648 679742 711710 972216 874924 694552 912328
16976I12328K53101j95513P5216k33876j05979k7527K73964j13494k17958O5373
$$ 912328 1165429 969916 1045132 811256 705277 677750 951714 838220 620262 685635
16966F85635L58268r9296j40065K14942k65632n8145J80626N8000L82159m43214
$$ 685635 1043903 944607 804542 1019484 753852 695707 876333 934333 1316492 873278
16956H73278o9035L12545j77096j33452J06964j10828J07093L04867j19681j00376
$$ 873278 804243 1116788 939692 806240 913204 802376 909469 1214336 1094655 994279
16946I94279J70002P1521k26262J5293K29441q7040j02221L65211k76227l9127
$$ 994279 1164281 1235802 1009540 1024833 1254274 1167234 1065013 1430224 1153997 1114870
16936A114870K86207l44320M29411j68106k35695J42160m7015K27911r9170j11128
$$ 1114870 1401077 1056757 1486168 1318062 1082367 1224527 1177512 1405423 1306253 1195125
16926A195125j3648K07711L1355j16590R4212M8515n0284K41976N7114l53077
$$ 1195125 1181477 1389188 1420543 1303953 1398165 1446680 1396396 1638372 1695486 1342409
16916A342409j03426L76424K8399O033k74266J43412k25690N03940j37741M2917
$$ 1342409 1238983 1615407 1643806 1649839 1375573 1518985 1293295 1797235 1659494 1702411
16906A702411j53479k64653L04225q9321J74189J44112J07922j74981k07522m5772
$$ 1702411 1548932 1284279 1588504 1499183 1673372 1817484 1925406 1750425 1542903 1497131
16896A497131M16020p3681L9319j77975J89883R5445q9640q1474K47059n5922
$$ 1497131 1913151 1839470 1878789 1700814 1890697 1986142 1896502 1815028 2062087 2006165
16886B006165J41242n06219M10050j79171J74259K59069K3086q7230K77273k55814
$$ 2006165 2147407 1641188 2051238 1872067 2046326 2305395 2328481 2241251 2518524 2262710
16876B262710K45320l47525K91541J4589j88324J58863J78263j48892K05435L6854
$$ 2262710 2508030 2160505 2452046 2466635 2278311 2437174 2615437 2466545 2671980 2708834
16866B708834J48871j36537J11881j61249P6721j9893M2992M4933R1733K01514
$$ 2708834 2857705 2721168 2833049 2671800 2748521 2728628 2771620 2816553 2908286 3109800
16856C109800m390j08569K51295o9080P3403j69129L95466K39488m78913j14679
$$ 3109800 3105410 2996841 3248136 3179056 3252459 3083330 3478796 3718284 3239371 3124692
16846C124692L33897P6588R3655K33697o9151J18511m8836N30482l95427j32973
$$ 3124692 3458589 3535177 3628832 3862529 3793378 3911889 3863053 4393535 3998108 3865135
16836C865135J82307J65579l2795K03596k48053L10457n2118L53058j25190K37921
$$ 3865135 4047442 4213021 4180226 4383822 4135769 4446226 4394108 4747166 4621976 4859897
16826D859897j97464J83599L48391J49154j27087N06867l90475L41356j96101
$$ 4859897 4662433 4846032 5194423 5343577 5216490 5723357 5332882 5674238 5478137
16817E478137M98630N021r4234N95034R2969k20514J24300J56374J86634J20207
$$ 5478137 5976767 5981788 5887554 6482588 6575557 6355043 6479343 6635717 6822351 6942558
16807F942558J29886J39027M19820k78432K30853L84523L89407j05188K20798
$$ 6942558 7072444 7211471 7631291 7352859 7583712 7968235 8357642 8252454 8473252
16798H473252K67404l1503j78809O76283N09340J78471J26247O60085L6035K760
$$ 8473252 8740656 8709153 8530344 9206627 9715967 9894438 10020685 10680770 10716805 10719565
16788A0719565L20314M9826Q78172r9393K39757L29095O06908O24144j8247M08852
$$ 10719565 11039879 11089705 11967877 11868484 12108241 12437336 13044244 13668388 13650141 14058993
16778A4058993N62320M48499M59304M56742M51164R11094J10215Q18749O57472
$$ 14058993 14621313 15069812 15529116 15985858 16437022 17348116 17458331 18277080 18934552
16769A8934552M35910J285212L16325P06068J098440L78551J251389P85082J001776
$$ 18934552 19370462 20655674 20971999 21678067 22776507 23155058 24406447 25191529 26193305
16760B6193305J181785P41305J096450J236493J357367J313905J566456J429710
$$ 26193305 27375090 28116395 29212845 30449338 31806705 33120610 34687066 36116776
16752C6116776J595332J730141J877088K250493J634859K620802J997268K506124
$$ 36116776 37712108 39442249 41319337 43569830 45204689 47825491 49822759 52328883
16744E2328883K639744K919818L214429L107636L335519L868116L600163L902674
$$ 52328883 54968627 57888445 61102874 64210510 67546029 71414145 75014308 78916982
16736G8916982M528071M555503M720578N092550N479634N372156N457312N773316
$$ 78916982 83445053 88000556 92721134 97813684 103293318 108665474 114122786 119896102
16728A19896102O403881N950909N545303O283216N056413N604006M833806M066253
$$ 119896102 126299983 132250892 137796195 144079411 149135824 154739830 159573636 163639889
16720A63639889L615464K675614J886640L86158L07019j380913k076716k828576
$$ 163639889 167255353 169930967 171817607 172203765 172510784 171129871 169053155 166224579
16712A66224579l913090m490783n143700n508587o122975n804379n959147o074600
$$ 166224579 162311489 157820706 152677006 147168419 141045444 135241065 129281918 123207318
16704A23207318o164237o319550n629719n359968n638471n109885m441806m946728
$$ 123207318 117043081 110723531 105093812 99733844 94095373 88985488 84543682 79596954
16696G9596954m477225m010876l727438l537987l329145k879731l082749k609941
$$ 79596954 75119729 71108853 67381415 63843428 60514283 57634552 54551803 51941862
16688E1941862k666855k634551j934254k377991j676159k237921j426464j922120
$$ 51941862 49275007 46640456 44706202 42328211 40652052 38414131 36987667 35065547
16680C5065547j304889j516798j509549j457632r22406j036386j264620q71138
$$ 35065547 33760658 32243860 30734311 29276679 28354273 27317887 26053267 25182129
16672B5182129j037651q08806j023060p66890n56184r56356n90923r36528n06295
$$ 25182129 24144478 23335672 22312612 21545722 20989538 20033182 19442259 18505731 17999436
16663A7999436m67627m27997q11306p01629p14320k13726l74142o29971m15447
$$ 17999436 17531809 17103812 16292506 15590877 14876557 14662831 14288689 13658718 13243271
16654A3243271L7938p50658o01431Q180l66393k24846l63906l84910l75137l50415
$$ 13243271 13281209 12530551 11929120 11937300 11570907 11346061 10982155 10597245 10222108 9871693
16644I871693m43983J27200m6548m44585m951n06447l56460l01711j36691j86939
$$ 9871693 9427710 9554910 9508362 9063777 9058826 8552379 8195919 7894208 7757517 7570578
16634G570578n0516j57339j93283k37043k22735j13481k54937K63971l37400j45131
$$ 7570578 7520062 7362723 7169440 6932397 6709662 6596181 6341244 6605215 6267815 6122684
16624F122684J41186k75566j35772m86644K31206k58371J13676m36160J7692j51551
$$ 6122684 6263870 5988304 5852532 5365888 5597094 5338723 5452399 5016239 5033931 4882380
16614D882380n1746k89585O2474K08944j703l07167k71856L10031m65588Q8137
$$ 4882380 4830634 4541049 4603523 4812467 4810764 4503597 4231741 4541772 4076184 4164321
16604D164321k13103r1595J19744j48799l59376K83816j16356r4919j22333J61704
$$ 4164321 3951218 3859623 3979367 3830568 3471192 3755008 3638652 3543733 3421400 3583104
16594C583104m56279L86796k71150J71215k60880n4857j69334K44107r1459n18512
$$ 3583104 3126825 3513621 3242471 3413686 3152806 3097949 2928615 3172722 3081263 2562751
16584B562751L13457P5849l00448L71630k46137k07815K87359k81094m94772M69728
$$ 2562751 2876208 2952057 2651609 3023239 2777102 2569287 2856646 2575552 2080780 2550508
16574B550508J07770l4138j84950j4706k1509r9190k410L973k7564j44120K2048
$$ 2550508 2658278 2624140 2439190 2424484 2402975 2303785 2301375 2305348 2277784 2133664 2155712
16563B155712N0052l00351P8261m8552L76154r8265l43145l07303M45877j02643
$$ 2155712 2205764 1905413 1983674 1935122 2311276 2213011 1869866 1562563 2008440 1905797
16553A905797K17837n65445K43337l1640p6344N5702K2399Q7871p2226l38191
$$ 1905797 2123634 1558189 1801526 1769886 1693542 1749244 1771643 1859514 1787288 1449097
16543A449097J9267M00211r095K4147m62027K90535k62689J05652k23650J8643
$$ 1449097 1468364 1868575 1859480 1883627 1421600 1712135 1449446 1555098 1331448 1350091
16533A350091K33592k23657K68561l01539O4092k0687K2449k9155R3330p3936
$$ 1350091 1583683 1360026 1628587 1327048 1391140 1370453 1392902 1363747 1457077 1383141
16523A383141j04213J20247K2165m84499R5822K51791K56606n16836K31075j63898
$$ 1383141 1278928 1399175 1421340 936841 1032663 1284454 1541060 1024224 1255299 1091401
16513A091401K07109k17388j6764J51888l86046K85169J37966j26982j14938J83471
$$ 1091401 1298510 1081122 1064358 1216246 830200 1115369 1253335 1126353 1011415 1194886
16503A194886j54875k1451J27805l6366J6075k39246k08288J07294J98703L3685
$$ 1194886 1040011 1018560 1146365 1109999 1126074 886828 678540 785834 984537 1018222
16493A018222k22403M70833m36132L94323j58288n17590J28084L31539j17507
$$ 1018222 795819 1266652 830520 1224843 1066555 548965 677049 1008588 891081
16484H91081J20165M9764K25875k01076q0063k73108J53157r7268n4981j81716
$$ 891081 1011246 1061010 1286885 1085809 1005746 732638 885795 788527 733546 551830
16474E51830M03729j94350l19595L78754k26507q687L44282l87808J92883j74629
$$ 551830 955559 761209 441614 820368 593861 585174 929456 541648 734531 559902
16464E59902M49585l07137P138k39056R2871K49767C48633K79423J36152j42316
$$ 559902 1009487 702350 709488 470432 563303 813070 348633 628056 764208 621892
16454F21892J8918M3404K98117B75744O70999j85946k00091r8439P8175K15427
$$ 621892 640810 684214 982331 275744 946743 760797 560706 462267 540442 755869
16444G55869C09163Q5870L51586k05631Q5775J3769L70083D95389K7708k2201
$$ 755869 309163 395033 746619 540988 626763 640532 1010615 495389 523097 500896
16434E00896L9038K16113j26674K91165l85853j45996K37321p7218j17546K36750
$$ 500896 539934 756047 629373 920538 534685 388689 626010 548792 431246 667996
16424F67996k37635A76100L66503j85279M20343l41307r0468K46487B50860R8679
$$ 667996 430361 176100 542603 357324 777667 436360 345892 592379 250860 349539
16414C49539J91463M6835K7872j19280K10538j13195B73787J11726K7221j42738
$$ 349539 541002 587837 615709 496429 706967 593772 273787 385513 412734 269996
16404B69996K13002k41044J68588o3269Q2020J02539k60823K602R9518L06026
$$ 269996 482998 241954 410542 347273 429293 531832 271009 273611 373129 679155
16394F79155l03180J19373H8719K68308L60178k59956j31961R2622A45196M25768
$$ 679155 375975 495348 88719 357027 717205 457249 325288 417910 145196 570964
16384E70964j54237j99296K79753K47649k86682R4139k21339p8945j7651I6955
$$ 570964 416727 217431 497184 744833 458151 552290 330951 252006 234355 96955
16373C22808L7174J68028j79620o7237J46545j68349M24782k45123j06682p4107
$$ 322808 359982 528010 348390 281153 427698 259349 684131 439008 332326 258219
16363B58219o7090q9611J80945M8729J07590j18229A34572N1577q9398K72535
$$ 258219 191129 101518 282463 331192 438782 320553 134572 186149 96751 369286
16353C69286l6247H0084J70925K33000M4698j61909j54480J53183m6826i6206
$$ 369286 333039 80084 251009 484009 528707 366798 212318 365501 318675 -96206
16342B48567r7139b01668A37865K41081j24476J23159j24214a23714B50369O3222
$$ 248567 151428 -201668 137865 378946 254470 377629 253415 -123714 250369 313591
16332C13591j21013J8438o7875b35153C15818o3885J3181J15857j65989G7540
$$ 313591 192578 211016 143141 -235153 315818 251933 265114 380971 214982 77540
16321C38926H1748M80946k69321A09241L61578P4834j21626j47543L2175C6302
$$ 338926 81748 562694 293373 109241 470819 545653 424027 276484 308659 36302
16310E08500k17890j7427J37756F5255K84107K94162A60570K26693A0180R6481
$$ 508500 290610 273183 410939 65255 349362 643524 160570 387263 10180 106661
16300A06661M8021J24116H8265L62919p8457a37607A02642J71534d9547A24425
$$ 106661 154682 278798 88265 451184 372727 -137607 102642 274176 -49547 124425
16289B05685R2320j700a58709C86090h6153A93433k7311B3700Q7878K4692O3647
$$ 205685 298005 296305 -158709 386090 -86153 193433 166122 23700 111578 136270 199917
16278A99917j2146h7571B76630a26012A07980M1176r993o9366J24379a4901j10155
$$ 199917 187771 -87571 276630 -126012 107980 149156 139163 69797 194176 -14901 -125056
16267a25056A18864e989F75538B8034J07209K386j4642J50429j22169a55625H9227
$$ -125056 118864 -5989 675538 28034 135243 137629 122987 273416 151247 -155625 89227
16255B59194K95431i5480m9149A14787h6311B55865j17428a85905A97725B2024
$$ 259194 554625 -95480 -144629 114787 -86311 255865 138437 -185905 197725 22024
16244G6915c5342B2862J07945J31833J2858j35041F8709K00949G7925P6699N973
$$ 76915 -35342 22862 130807 262640 275498 140457 68709 269658 77925 154624 160597
16233A60597e3500A7110R2001a51064I9623a15964C26568G5338N9909a7096C21018
$$ 160597 -53500 17110 109111 -151064 99623 -115964 326568 75338 135247 -17096 321018
16221c14793D17419j96677n3290a75877B9975K3489J01856k7501J32315j26520
$$ -314793 417419 220742 167452 -175877 29975 53464 155320 127819 260134 133614
16211A33614M2008G2972J18718G9627b15974G6222B4870Q2919C2598a25933N4001
$$ 133614 175622 72972 191690 79627 -215974 76222 24870 107789 32598 -125933 -71932
16200g1932j1096k0605G6482K58230m234a3262k95802L7283A9174a20652C72253
$$ -71932 -83028 -103633 76482 334712 330478 -13262 -309064 -271781 19174 -120652 372253
16188B51419A01072e9474b4714q3342B21935f4948A27673J89171d8276B03460
$$ 251419 101072 -59474 -24714 -108056 221935 -64948 127673 316844 -48276 203460
16177A49011a30333O4794r1822G6482B5465L66462A01467J97959C7830a79354
$$ 149011 -130333 -65539 -157361 76482 25465 391927 101467 299426 37830 -179354
16166A21738k491f9946c980C74752a70243D67199A35736E8505h0676B94467c04739
$$ 121738 119247 -69946 -3980 374752 -170243 467199 135736 58505 -80676 294467 -304739
16154f8211d580J162E7978J33569b8927B00441l2835h1219B90030B7905b2334
$$ -68211 -4580 -3418 57978 191547 -28927 200441 167606 -81219 290030 27905 -22334
16142C2812P5291M4955b32214F8682K763a87624d2076I490h4093A00320g0516
$$ 32812 108103 153058 -232214 68682 71445 -187624 -42076 9490 -84093 100320 -70516
16130b18828h787A9144L42476F1995K1757D134L50778A66796J8809A6730J11943
$$ -218828 -8787 19144 361620 61995 83752 4134 354912 166796 185605 16730 128673
16119A28673a36833G2355b71551b4620p0426l8524O3915E0370J12382b44187B79768
$$ 128673 -136833 72355 -271551 -24620 -95046 -133570 -69655 50370 162752 -244187 279768
16107H4102K17826A4923a52292C87813E9485b3335B78548J4250C3248L09508D5238
$$ 84102 301928 14923 -152292 387813 59485 -23335 278548 292798 33248 342756 45238
16095a364A51339J32979D7036K10445a09375A34265a21443j33567j3378A61614
$$ -1364 151339 284318 47036 257481 -109375 134265 -121443 -255010 -268388 161614
16084H5138J9380c2550k23462F5645J92336E3983J8403R2963F9869c0677A44559
$$ 85138 104518 -32550 -256012 65645 257981 53983 72386 165349 69869 -30677 144559
16072C2115J06849K10376d1950D0156a83629A6148K21021C8063a58144F5398Q3024
$$ 32115 138964 349340 -41950 40156 -183629 16148 237169 38063 -158144 65398 148422
16061A48422C9042Q3694a14033d659A15666c5318F8470b64797B8662a16573E3359
$$ 148422 39042 122736 -114033 -4659 115666 -35318 68470 -264797 28662 -116573 53359
16049B44864E3948b39955G8553J24853a48314N4266A953M30898a79948d5561e008
$$ 244864 53948 -239955 78553 203406 -148314 -94048 1953 432851 -179948 -45561 -5008
16037F0824a12850a7304o7352A16733l9863K3666M152J09041j02488g1723a1970
$$ 60824 -112850 -17304 -84656 116733 76870 100536 104688 213729 111241 -71723 -11970
16025h8714D1218a47416O6236I5084i5329B3434O1930k9842b19285R8536k19321
$$ -88714 41218 -147416 -81180 95084 -95329 23434 85364 55522 -219285 -120749 -340070
16014c40070O9596a12496m5603c5058j46925j97420J49803B51453a98885e9984
$$ -340070 -270474 -112496 -158099 -35058 -181983 -379403 -229600 251453 -198885 -59984
16003h894j02191A66056J45927F8299L97811A89063P3170i6101k38633H3466c47156
$$ -8894 -111085 166056 311983 68299 466110 189063 262233 -96101 -334734 83466 -347156
15991b29097A23672h9791j67542h2076A46652E3149K2402K64138k6687J95596
$$ -229097 123672 -89791 -257333 -82076 146652 53149 75551 339689 313002 508598
15981E08598k22969J60982D605J63632K31742I9073l2786J6187a94914A52627
$$ 508598 285629 446611 4605 168237 399979 99073 66287 82474 -194914 152627
15970f7022k45963C8493d3723k66432A03765c2974B03327a16163I6245J34064
$$ -67022 -312985 38493 -43723 -310155 103765 -32974 203327 -116163 96245 230309
15960B30309A1962c05147e4175b4340c284j93755H8982l3492c96601a58540a1520
$$ 230309 11962 -305147 -54175 -24340 -3284 -197039 88982 55490 -396601 -158540 -11520
15948C03385C8865N178k386P168P2638a70717j23144M7974J07897D6525K2209
$$ 303385 38865 44043 41657 48825 121463 -170717 -293861 -245887 -137990 46525 68734
15937F8734f1602B0398N8653b28436i3738C25657a73414c8977q1864k43891A49904
$$ 68734 -61602 20398 79051 -228436 -93738 325657 -173414 -38977 -120841 -364732 149904
15925d3274k58076a41352A62060O1364c20470B1846a90290m7737Q7277b0666A30479
$$ -43274 -301350 -141352 162060 223424 -320470 21846 -190290 -238027 -150750 -20666 130479
15913a60606A01867g3230A3516g7806j43548D0153N1405a65542p9800a14273H0132
$$ -160606 101867 -73230 13516 -77806 -221354 40153 91558 -165542 -245342 -114273 80132
15901A33309B6477m267a10373k01288B21427c1816F207K4156i8403M1508j80676
$$ 133309 26477 22210 -110373 -311661 221427 -31816 6207 30363 -98403 -56895 -237571
15890b37571g9492J1144c0874q9977m111a0010H0032N715c02085A5674a88790
$$ -237571 -79492 -68348 -30874 -120851 -124962 -10010 80032 85747 -302085 15674 -188790
15878a54477N734A50186K86290h7718K6670A3245b2126B17450E3487h1661B3563
$$ -154477 -148743 150186 436476 -87718 -61048 13245 -22126 217450 53487 -81661 23563
15866H3734a25203M2738j26765A21562H762a05421j0882j96493d6813D8074j7488
$$ 83734 -125203 -82465 -209230 121562 8762 -105421 -116303 -312796 -46813 48074 30586
15855C0586c0656l33755a30157B94694l8882F1014h9151c2074j4261J3880A43470
$$ 30586 -30656 -364411 -130157 294694 255812 61014 -89151 -32074 -46335 -32455 143470
15843F7232L2490l3530K70040j59450g6546B02072a97220R2139k2061I2819J32305
$$ 67232 99722 66192 336232 176782 -76546 202072 -197220 -105081 -127142 92819 225124
15832B25124m0849E193a26626g65H5745k7660a44709b8360G9740C5438a51135
$$ 225124 184275 5193 -126626 -765 85745 58085 -144709 -28360 79740 35438 -151135
15820a06723A69905q2783Q6542d2363C32631d2855j76620A07639h9663l6175I1205
$$ -106723 169905 87122 173664 -42363 332631 -42855 -219475 107639 -89663 -125838 91205
15808d3050r0357b6285J0024C0156a81260B9998J04075f3478j07220e4460A44073
$$ -43050 -133407 -26285 -16261 30156 -181260 29998 134073 -63478 -170698 -54460 144073
15796A36270J18767a89256r4254A99344B524J05244b23452K6817D2089b2238i576
$$ 136270 255037 -189256 -283510 199344 2524 107768 -223452 -196635 42089 -22238 -9576
15784A9598c11072G7862c20104F9095C2912b38318L8144e5703j53474B07710a36610
$$ 19598 -311072 77862 -320104 69095 32912 -238318 -200174 -55703 -209177 207710 -136610
15772b84010c3585D27691b11472G7874P6238d7563l8033A68626a79626B9721L3494
$$ -284010 -33585 427691 -211472 77874 154112 -47563 -85596 168626 -179626 29721 63215
15761F3215e649B73175A02264L65880A90352J86755i5884k76460a7605A05142
$$ 63215 -5649 273175 102264 468144 190352 377107 -95884 -372344 -17605 105142
15750E8970c05944G6582b8613F9436K35774A39591C0283J7175c819B29598a65869
$$ 58970 -305944 76582 -28613 69436 305210 139591 30283 47458 -3819 229598 -165869
15738b17335O8158A15168d9548m3775o7045d9789C4805b2828B0504b8672f236
$$ -217335 -149177 115168 -49548 -93323 -160368 -49789 34805 -22828 20504 -28672 -6236
15726b46503d3156G3107R2947a6632l14684e8594m8395E5658a07919A87444G6508
$$ -246503 -43156 73107 166054 -16632 -331316 -58594 -106989 55658 -107919 187444 76508
15714h1986A6850L87725a5397p6868A8040c39365a8349A08566b83333D9431K7848
$$ -81986 16850 404575 -15397 -92265 18040 -339365 -18349 108566 -283333 49431 77279
15703G7279B4786a44623p3740D7634g4085q6037p0258H2973i9853F0253f9598
$$ 77279 24786 -144623 -218363 47634 -74085 -160122 -230380 82973 -99853 60253 -69598
15691C57154C0942L86487D7663M0180j9846a01430D2621a75201A31575d22548
$$ 357154 30942 417429 47663 87843 67997 -101430 42621 -175201 131575 -422548
15680d4200C51371b99057L9071Q6496A57431A0040f9419j1671C0737R0037f7329
$$ -44200 351371 -299057 -259986 -173490 157431 10040 -69419 -81090 30737 120774 -67329
15668f7949F6463f3034m4621l1394l1741B48483a0125j7229j64230K542A75686
$$ -67949 66463 -63034 -107655 -139049 -170790 248483 -10125 -27354 -191584 -189042 175686
15656a98776i8408F3682c86372B73633f176p484q7736j48462I4755B5440L0383
$$ -198776 -98408 63682 -386372 273633 -6176 -13660 -101396 -249858 94755 25440 55823
15645E5823b92808b0396k96657J53689f5672P841E0637f4374C7747h5542k1353
$$ 55823 -292808 -20396 -317053 -163364 -65672 -57831 50637 -64374 37747 -85542 -106895
15634a06895r3397C8176c4519k13741a15554l12942A45788b05527C32093d0925
$$ -106895 -200292 38176 -34519 -248260 -115554 -428496 145788 -205527 332093 -40925
15623A69023a55987A07553a35275A52311a07041d0252B524b30833A92569f3313
$$ 169023 -155987 107553 -135275 152311 -107041 -40252 2524 -230833 192569 -63313
15612a18424k08800A1475a1899r2305k58500Q240a3925E5855B524J54305b12935
$$ -118424 -327224 11475 -11899 -104204 -362704 -354464 -13925 55855 2524 156829 -212935
15600E0642c3127q7610q3627j03761A74155J86996A24976f2996a4782A67534J1923
$$ 50642 -33127 -120737 -204364 -308125 174155 361151 124976 -62996 -14782 167534 179457
15589A79457c23457A39507J54440D4089c56389A89245G7327a80026M3203E8423
$$ 179457 -323457 139507 293947 44089 -356389 189245 77327 -180026 -136823 58423
15578D9665i8620A33029b6113A86640a57116A94481h2253m4906I0024D880N3620
$$ 49665 -98620 133029 -26113 186640 -157116 194481 -82253 -127159 90024 4880 58500
15567E8500K43697k8995A31819b43466b0389D94K84279M4089a1458G812R0728
$$ 58500 302197 273202 131819 -243466 -20389 494 284773 328862 -11458 7812 98540
15556I8540D5628Q3516E8867c27058a26982n1975E247b8604B65137a97j9909B51356
$$ 98540 45628 129144 58867 -327058 -126982 -178957 5247 -28604 265137 -197 -20106 251356
15543a17062d5485R205A52802c7310A96149a94317D22428j64908D0293b02826
$$ -117062 -45485 -36280 152802 -37310 196149 -194317 422428 257520 40293 -202826
15532b32878G0226a11429C1055c76677g2059a1850H0202Q96L01160A74763B2422
$$ -232878 70226 -111429 31055 -376677 -72059 -11850 80202 81098 382258 174763 22422
15520A7508J8128N3573f4916C2895J5721J2019B0254J2660a50100B7715a29108
$$ 17508 35636 89209 -64916 32895 48616 60635 20254 32914 -150100 27715 -129108
15508b02641A29470l7735L8168d1947j8078a3152k3434m7818j64424c3007l7528
$$ -202641 129470 91735 129903 -41947 -60025 -13152 -36586 -84404 -248828 -33007 -70535
15497g0535K5516k06536J14691k00946d3877D383a50845n3146f6759k00195H7021
$$ -70535 -45019 -251555 -136864 -337810 -43877 4383 -150845 -203991 -66759 -266954 87021
15485c1786C48442h8536a9971j51116A10541c0995B77578A6249K27113b47981
$$ -31786 348442 -88536 -19971 -171087 110541 -30995 277578 16249 243362 -247981
15474g0552A17222a12656j35166L1474a6206j57598k7723B18189e0772I1006b02574
$$ -70552 117222 -112656 -247822 -216348 -16206 -173804 -201527 218189 -50772 91006 -202574
15462a00825j8444M5436j42014r540G8768a27252o5295A08980J17688a59359c9706
$$ -100825 -119269 -73833 -215847 -225387 78768 -127252 -192547 108980 226668 -159359 -39706
15450A00007f4179j08218g872k13051h0346E1752b48328I9759d86224I0569g620
$$ 100007 -64179 -172397 -7872 -220923 -80346 51752 -248328 99759 -486224 90569 -7620
15438A90577G3703g3391A20095c31292B48591f349B6323b57112J17411J9029l8287
$$ 190577 73703 -73391 120095 -331292 248591 -6349 26323 -257112 -139701 -120672 -158959
15427a58959J118f9671A62746H1363c4366j7623C50364F455b74601A10000E0565
$$ -158959 -157841 -69671 162746 81363 -34366 -51989 350364 6455 -274601 110000 50565
15415a4344B25802I2429f8932j15028A53495a36814D8422a04200j32418k7778
$$ -14344 225802 92429 -68932 -183960 153495 -136814 48422 -104200 -236618 -264396
15405b64396b5091A27567k1407b81636N3760b0175A9722J69341L6197a41784A02290
$$ -264396 -25091 127567 106160 -281636 -227876 -20175 19722 189063 225260 -141784 102290
15393C6434K407b56893A12968E163K08625r3239M4936c55850c3847I5995a26218
$$ 36434 38841 -256893 112968 5163 213788 120549 165485 -355850 -33847 95995 -126218
15381B23352j05541c6674A78212a89654R3672A22259L40459k16685g6214K2952
$$ 223352 117811 -36674 178212 -189654 -95982 122259 462718 246033 -76214 -53262
15371e3262a948G179a83066G7526N1453n7923e9536D9346a69048B35089l8970
$$ -53262 -1948 7179 -183066 77526 128979 71056 -59536 49346 -169048 235089 196119
15360A96119a58786k37900a51517H4140M9057J54562j31257b34044K1772k01395
$$ 196119 -158786 -396686 -151517 84140 133197 287759 156502 -234044 -212272 -413667
15350d13667J51416J13900A9901J87914q9150j4311M2622b0876A51421c29842
$$ -413667 -262251 -148351 19901 207815 118665 104354 146976 -20876 151421 -329842
15339B37519a59712P4994k47295b4180n5699c3482A39374a3768A51774k9630b06879
$$ 237519 -159712 -84718 -332013 -24180 -79879 -33482 139374 -13768 151774 122144 -206879
15327a86072B36086c13051c1553A62242b84014C4735K79505f9485j76879B8677
$$ -186072 236086 -313051 -31553 162242 -284014 34735 314240 -69485 -246364 28677
15316B27191n1731d3293E2335L46407a56574M0202F3122j389L9596j2258i9687
$$ 227191 175460 -43293 52335 398742 -156574 -116372 63122 61733 101329 89071 -99687
15304B0444R6972J26579b76018A87809i3525G1607B8256J83631q0405a271C32676
$$ 20444 117416 243995 -276018 187809 -93525 71607 28256 211887 131482 -1271 332676
15292A04635b48382B73056d3399j2711A82276A4667b82771f0341q7522B85111
$$ 104635 -248382 273056 -43399 -56110 182276 14667 -282771 -60341 -147863 285111
15281A99440a66667A05101g6366j26140A25575Q9766F7960a96636n344A24299
$$ 199440 -166667 105101 -76366 -202506 125575 215341 67960 -196636 -201980 124299
15270b61963A632J51337B3934O3663P7373i7724E3827K43127a267E0349a19068
$$ -261963 1632 152969 23934 87597 164970 -97724 53827 296954 -1267 50349 -119068
15258A44787L39081g8649C21637b8304A97640G2921k772L47583j74696K43913
$$ 144787 483868 -78649 321637 -28304 197640 72921 70149 417732 243036 486949
15248D86949R28723l97657l45926Q38358o35407B72577b4030D4828e0022j07122
$$ 486949 1415672 1018015 672089 1510447 875040 272577 -24030 44828 -50022 -157144
15238a57144B29130a41896c9698C1270J46213a16046J5754A69661B1082N3659
$$ -157144 229130 -141896 -39698 31270 177483 -116046 -100292 169661 21082 74741
15228G4741a99516I347c46903A47086n9481J44653g1773F429K28370E8198J95347
$$ 74741 -199516 9347 -346903 147086 87605 232258 -71773 6429 234799 58198 253545
15217B53545a03635L9085C15949a1813A35464a50113A62142n293B743J51639Q3533
$$ 253545 -103635 -64550 315949 -11813 135464 -150113 162142 156849 2743 154382 237915
15206B37915M4301c6234H7615J73231j06018g6787B14434G9960b9934B94291b8488
$$ 237915 282216 -36234 87615 260846 154828 -76787 214434 79960 -29934 294291 -28488
15194A24739b8306B09005M9173m2227a10295A1626P1175a71323e6535F8877k3108
$$ 124739 -28306 209005 258178 215951 -110295 11626 82801 -171323 -56535 68877 45769
15183D5769a69293A12739K06597m392a63780D08805k03274g2214B2579L819K0802
$$ 45769 -169293 112739 319336 314944 -163780 408805 205531 -72214 22579 26398 47200
15172D7200J10834A3116k933J80826l4453m3610d5851A62494G8905J1773a7047
$$ 47200 158034 13116 10183 191009 156556 112946 -45851 162494 78905 90678 -17047
15160C66340A23063l4744k8258f502B44808C4229N7829J19803b53194a11661A80333
$$ 366340 123063 88319 60061 -6502 244808 34229 92058 211861 -253194 -111661 180333
15148E8979J98855i9529D8486J12963a64845H3133B8690P551m213J11076P3258
$$ 58979 257834 -99529 48486 161449 -164845 83133 28690 36241 32028 143104 216362
15137B16362R2961j2255H6083J62204J412b18556C42608b53582a07396q6614a6886
$$ 216362 309323 297068 86083 248287 249699 -218556 342608 -253582 -107396 -194010 -16886
15125B90728A38748b6420A95032M1551F5712J40892F0980k2672J0529i2142K7017
$$ 290728 138748 -26420 195032 236583 65712 206604 60980 38308 48837 -92142 -65125
15114f5125E1421J18760f6386A29410O0772j2946a92000k4110q587B15020b05883
$$ -65125 51421 170181 -66386 129410 190182 177236 -192000 -216110 -224697 215020 -205883
15102C58354b79885C946J12197j0539D2363a15481q8505h5117A53275q949c55272
$$ 358354 -279885 3946 116143 105604 42363 -115481 -203986 -85117 153275 144326 -355272
15090a99904h5311J1586J0611J9983C77054A03516b79118A39771N6927b217D97229
$$ -199904 -85311 -73725 -63114 -43131 377054 103516 -279118 139771 196698 -2217 497229
15078A59763A0591a00505A45922O5858Q7920q5349A9664P7987B8267n776R3648
$$ 159763 10591 -100505 145922 211780 299700 214351 19664 97651 28267 22491 116139
15067A16139A3087K0670J84332a76023A64923n7809K01713D643O9730J57403J5649
$$ 116139 13087 33757 218089 -176023 164923 107114 308827 4643 74373 231776 247425
15056B47425G3626K12721j6252B5946L2529R3242J94166j70347J3821i362p447
$$ 247425 73626 286347 270095 25946 58475 151717 345883 175536 189357 -9362 -16809
15045a6809C42225A8296M62938D7363j8781K25475R088p7808J59463j71143C455
$$ -16809 342225 18296 481234 47363 28582 254057 263145 185337 344800 173657 3455
15033D11182A970a1337j10611B23365F8758Q4701E6641Q9442J76329r4871Q4854
$$ 411182 1970 -11337 -121948 223365 68758 153459 56641 146083 322412 227541 312395
15022C12395l0655A29328n61J24088I0569O0741a81424d1164A87374Q7020a52638
$$ 312395 281740 129328 128767 252855 90569 151310 -181424 -41164 187374 274394 -152638
15010b62660E8139J7070Q5444J92433F7016K11595R3856f8665b0336C82091J68620
$$ -262660 58139 75209 160653 353086 67016 278611 372467 -68665 -20336 382091 550711
14999E50711k55270a76679B04833o5267L38352A08102P3361l3083c09206A519
$$ 550711 295441 -176679 204833 139566 477918 108102 181463 148380 -309206 1519
14988E0859J33474O6350D9437L15866j35311L78143e5757j72790B42953R153b5670
$$ 50859 184333 250683 49437 365303 229992 608135 -55757 -228547 242953 252106 -25670
14976A14023P169L55049B26005k0999N3901o5629R5946p4250J17245M5186j67120
$$ 114023 121192 476241 226005 205006 258907 193278 289224 214974 332219 377405 210285
14965B10285j01582L53162B30174J5752D5554A2203K57634n6506c7197K933A24137
$$ 210285 108703 461865 230174 245926 45554 12203 269837 213331 -37197 -34264 124137
14953D0155K96777a50746C34264j37448a14216D44705b0978F2006c9571A34299
$$ 40155 336932 -150746 334264 196816 -114216 444705 -20978 62006 -39571 134299
14942H7273J58981N1084j39268J73021A08803J22811J72539A45216J07391n3926
$$ 87273 246254 297338 158070 331091 108803 231614 404153 145216 252607 198681
14932A98681N68205G7896K82585J89588I4277J51024J94243H8701L10440A95543
$$ 198681 766886 77896 360481 550069 94277 245301 439544 88701 399141 195543
14921C49265J52149A97966L6441G8542P1256K33205A32846J5169a85474H0327
$$ 349265 501414 197966 234407 78542 149798 383003 132846 148015 -185474 80327
14910F1057P5233P7068J09356M8012A32999M20502B28220r0709K9913O5097l7953
$$ 61057 136290 213358 322714 370726 132999 553501 228220 137511 167424 232521 194568
14899A94568k0845Q1058J09216j27700Q9663j2774m8402K03615A62963K90496
$$ 194568 173723 254781 363997 236297 325960 313186 264784 468399 162963 453459
14889D53459C7690J88042K57124C5543J49666J81338j81182P6441k4825P8563
$$ 453459 37690 225732 482856 35543 185209 366547 185365 261806 236981 315544
14879C15544A06749d1247B38395J48042A84595J38017O3960A36216J27818K59943
$$ 315544 106749 -41247 238395 386437 184595 322612 386572 136216 264034 523977
14869E23977j27770A75513M13909k91420J3775J11937j89705J97475D3297J70645
$$ 523977 396207 175513 589422 298002 311777 423714 234009 431484 43297 213942
14859B13942J03078N8750J47597k23420J64664J04827k81367J75352J12506j58828
$$ 213942 317020 375770 523367 299947 464611 569438 288071 463423 575929 417101
14849D17101j8503o1328J5432p3568K78166j72172q511o3864j40953K20507J84453
$$ 417101 398598 337270 352702 279134 557300 385128 376617 312753 171800 392307 576760
14838E76760k23433O223o3197K9215K11392p7604O6619k33179J86419j34805K50963
$$ 576760 353327 359550 296353 325568 536960 459356 525975 292796 479215 344410 595373
14827E95373A75538J09546K32211J22654B82456j1598J97319j32479p5611O4277
$$ 595373 175538 285084 517295 639949 282456 270858 468177 335698 260087 324364
14817C24364o0025K49740A27690N7971L45220p2468j07718O4597j08514J88055
$$ 324364 264339 514079 127690 185661 530881 458413 350695 415292 306778 494833
14807D94833j74705K35125B19512L9639L28891k44316J8637K26472B22058J71948
$$ 494833 320128 555253 219512 259151 588042 343726 362363 588835 222058 394006
14797C94006k2086L99383B71427q5837M7816N72097k33822j33861A72745Q3131
$$ 394006 371920 771303 271427 185590 233406 805503 571681 437820 172745 255876
14787B55876K80415j40261j26626L28303k10299J09038J46876A92969M57875j62550
$$ 255876 536291 396030 269404 597707 387408 496446 643322 192969 650844 488294
14777D88294j99181P2947J89680J12564l14993K38273J3268j97957q1188J22251
$$ 488294 289113 362060 551740 664304 349311 587584 600852 402895 321707 443958
14767D43958O880j30104J69576q9731Q0150K46467j40578M2525l6138N4730k28019
$$ 443958 450838 320734 490310 400579 480729 727196 586618 629143 593005 647735 419716
14756D19716L64382j28512j02482j72106k2860K39672B30280K29302J67806M4924
$$ 419716 784098 655586 553104 380998 358138 597810 230280 459582 627388 672312
14746F72312m8745j52256J14884K20500J06357m13708k47392N21622q3472k47457
$$ 672312 623567 471311 586195 806695 913052 499344 251952 773574 690102 442645
14736D42645K86246j47719L69800l23042q8626k9736M37766l64702j11333J16713
$$ 442645 728891 581172 950972 627930 539304 509568 947334 582632 471299 588012
14726E88012j51488L82284j61444J8811L17990m75941K823K43743J14595D33201
$$ 588012 436524 818808 657364 676175 994165 518224 521047 764790 879385 433201
14715F45687j80642J40680K3951R4289r4924J1020K04930n5348j08040J3505N8519
$$ 645687 465045 605725 629676 723965 629041 640061 844991 789643 681603 695108 753627
14704G53627K6782n3562J7384O2231l07148L51398j77536J95645k95853M36722
$$ 753627 780409 726847 744231 806462 499314 850712 673176 868821 572968 1009690
14694A009690k84092J45639J6627O3172m18973N86572l19034M7713R3894m4652
$$ 1009690 725598 871237 887864 951036 532063 1118635 799601 847314 941208 896556
14684H96556M4782l9835m35726N41541k64763J06414Q4995o1986O0416j73496
$$ 896556 941338 901503 465777 1007318 742555 848969 933964 871978 932394 758898
14674G58898J65811k24837r7277L07438n0494P9899K13680k95167j02921L57033
$$ 758898 924709 699872 602595 910033 859539 939438 1153118 857951 755030 1112063
14664A112063j76410m2412J96095P8750o2640j61050O4093P2968J01014k05747
$$ 1112063 935653 893241 1089336 1168086 1105446 944396 1008489 1081457 1182471 976724
14654I76724J0200l84154L96531J48213N9428j44359J44746j2816j18065l2111
$$ 976724 986924 602770 999301 1147514 1206942 1062583 1207329 1194513 1076448 1044337
14644A044337O2129J21714K9584n6119l55405j03377R3194M03728k28377J37594
$$ 1044337 1106466 1228180 1257764 1201645 846240 742863 836057 1239785 1011408 1149002
14634A149002J89331l36198K02255K07885k51230o9939j4505K98539K9881m23077
$$ 1149002 1338333 1002135 1204390 1412275 1161045 1091106 1076601 1375140 1405021 981944
14624I81944J24085M0028J65270J37639n07191J17208K34220K21692l31129p4342
$$ 981944 1106029 1146057 1311327 1448966 941775 1058983 1293203 1514895 1183766 1109424
14614A109424L8856K44519j70061J12972p6446j396P672J74805R0789p4555m8859
$$ 1109424 1148280 1392799 1222738 1335710 1259264 1257868 1265540 1440345 1531134 1456579 1407720
14603A407720K26059m29986K52383J60458N1097K06546l02036j39041J87924l87685
$$ 1407720 1633779 1203793 1456176 1616634 1667731 1874277 1572241 1433200 1621124 1233439
14593A233439L16128k89338M50837Q4403k34649L54029n16092K32232k05196L95069
$$ 1233439 1549567 1260229 1711066 1795469 1560820 1914849 1398757 1630989 1425793 1820862
14583A820862o8625j97578P4275K10397k77365M59073j87425K54286j40088j02490
$$ 1820862 1752237 1554659 1628934 1839331 1561966 2021039 1833614 2087900 1947812 1845322
14573A845322K56685k34815J95120m6202n5303K66920p6414q0780L33982j71054
$$ 1845322 2102007 1867192 2062312 2016110 1960807 2227727 2151313 2070533 2404515 2233461
14563B233461J08084J11217r1575k44924O51254J05493l21545n855M98261R8048
$$ 2233461 2341545 2452762 2361187 2116263 2767517 2873010 2551465 2545610 3043871 3141919
14553C141919L89693P10650k4825J201974K169842L961934R115176K0614672J167316
$$ 3141919 3531612 4242262 4217437 5419411 7589253 11551187 20666363 41281035 42448351
14544D2448351A8578009G343293l286672j572185m49886l5153j74330J35939k64221
$$ 42448351 18578009 7343293 4056621 2484436 2034550 1999397 1825067 1961006 1696785
14535A696785J6156N4854J4823K41481l3950r1343J48102p1490K64479l55597
$$ 1696785 1712941 1767795 1782618 2024099 1990149 1898806 2046908 1975418 2239897 1884300
14525A884300J65975j25767L38953P636J53056k14431J74199J01891l980k12105
$$ 1884300 2050275 1924508 2263461 2271097 2424153 2209722 2383921 2485812 2481832 2269727
14515B269727L4880k57059N19507j61442K21564J06143k05892K13502J707K9952
$$ 2269727 2304607 2047548 2567055 2405613 2627177 2733320 2527428 2740930 2742637 2772589
14505B772589r2875K99037l54501L44767j29026n9199N39721k62524O4251k86738
$$ 2772589 2679714 2978751 2624250 2969017 2839991 2780792 3320513 3057989 3122240 2835502
14495B835502K18091j6094k63360L19092K335K78370L4138p9930j94746M5594
$$ 2835502 3053593 3037499 2774139 3093231 3095566 3373936 3408074 3328144 3133398 3178992
14485C178992L65672o9930J01310j90397L357m52L32092l50908J02993J48203
$$ 3178992 3544664 3474734 3576044 3385647 3389004 3388552 3720644 3369736 3472729 3620932
14475C620932p1077M08895m25566L34190M1559J3334m0330K95803J37904j66527
$$ 3620932 3549855 3958750 3533184 3867374 3908933 3922267 3881937 4177740 4315644 4149117
14465D149117l24282N44917K49971r574m50314L01086k19981J79903K98421L38773
$$ 4149117 3824835 4369752 4619723 4610149 4159835 4460921 4240940 4420843 4719264 5058037
14455E058037l18807M1351R2490k3014J61697o0047N2649L39483j17388q624N20301
$$ 5058037 4739230 4780581 4873071 4850057 5011754 4951707 5004356 5343839 5226451 5217827 5738128
14444E738128n26715O46867j54965n65169O14430k39356M43740k65288L87972
$$ 5738128 5211413 5858280 5703315 5138146 5752576 5513220 5956960 5691672 6079644
14435F079644j28106J18597j212L49562k7212L94912m00525J81859J35183K59679
$$ 6079644 5951538 6070135 6068923 6418485 6391273 6786185 6385660 6567519 6702702 6962381
14425F962381m4566J32456J49155J83825k307J02826l11521K62738M16569j24222
$$ 6962381 6917815 7050271 7199426 7383251 7380944 7483770 7172249 7434987 7851556 7727334
14415G727334L66680J6545Q0242J41119L88600L1110j41064M70059k03863L24913
$$ 7727334 8094014 8110559 8190801 8331920 8720520 8751630 8610566 9080625 8876762 9201675
14405I201675J33479J78472j42385K81362K03434K82248N9404J58397j91345N24990
$$ 9201675 9335154 9513626 9371241 9652603 9856037 10138285 10197689 10356086 10164741 10689731
14395A0689731K85832K5963K26901L48656K73900o6821L0769M15302J89742Q3281
$$ 10689731 10975563 11001526 11228427 11577083 11850983 11784162 11814931 12230233 12419975 12503256
14385A2503256K65810J60419K51289M48427K83446K27129J7603N21304L68316
$$ 12503256 12769066 12929485 13180774 13629201 13912647 14139776 14157379 14678683 15046999
14376A5046999J23617J08637M94379J36390K99743M05992N00766J46504M37079
$$ 15046999 15170616 15279253 15773632 15910022 16209765 16615757 17116523 17263027 17700106
14367A7700106M52110L48540O02058L24802J42649L60027R10847K85438K02488
$$ 17700106 18152216 18500756 19102814 19427616 19570265 19930292 20841139 21126577 21329065
14358B1329065O70275O90518J48077P01666N20772P23417M10301O18618O20204
$$ 21329065 21999340 22689858 22837935 23539601 24060373 24783790 25194091 25812709 26432913
14349B6432913R44487L22316R61681Q07132P89055L04385J054367P81252J473526
$$ 26432913 27377400 27699716 28661397 29468529 30257584 30561969 31616336 32397588 33871114
14340C3871114K60243R31784J088225J077798R89844J105784J200818J638243
$$ 33871114 34131357 35063141 36151366 37229164 38219008 39324792 40525610 42163853
14332D2163853J009743J085157J774570J556962J270157J589090J330196J997017
$$ 42163853 43173596 44258753 46033323 47590285 48860442 50449532 51779728 53776745
14324E3776745J880693J781753K040097J952531K365348K570075K371564K362971
$$ 53776745 55657438 57439191 59479288 61431819 63797167 66367242 68738806 71101777
14316G1101777K627363K826142K896468L375067L066855L542170L867050L793476
$$ 71101777 73729140 76555282 79451750 82826817 85893672 89435842 93302892 97096368
14308I7096368M279934M486962M286150N027106N142162N569335O034701N837651
$$ 97096368 101376302 105863264 110149414 115176520 120318682 125888017 131922718 137760369
14300A37760369O684180O942765P411437P482626Q488180Q640147R019400J0082485
$$ 137760369 144444549 151387314 158798751 166281377 174769557 183409704 192429104 202511589
14292B02511589R863122J0444513J1348998J1717651J2415912J2188567J3383456
$$ 202511589 212374711 222819224 234168222 245885873 258301785 270490352 283873808
14285B83873808J3603992J3293151J4260394J4091787J4068723J4114895J4093271
$$ 283873808 297477800 310770951 325031345 339123132 353191855 367306750 381400021
14278C81400021J3386481J2668155J1537047J0617620Q408552N079092J125006
$$ 381400021 394786502 407454657 418991704 429609324 438017876 443096968 444221974
14271D44221974L02003O97285j435411l936674n049296o404677q182987j0679554
$$ 444221974 444523977 445221262 443785851 439849177 434799881 428395204 420212217 409532663
14263D09532663j2812454j4190100j4636586j5039288j5411222j5162643j5246168
$$ 409532663 396720209 382530109 367893523 352854235 337443013 322280370 307034202
14256C07034202j4668994j3540737j3702819j2964584j2481520j2054922j1169395
$$ 307034202 292365208 278824471 265121652 252157068 239675548 227620626 216451231
14249B16451231j0794720j0134470r831910r025412q457148p704910p527115p327084
$$ 216451231 205656511 195522041 185690131 176664719 168207571 160502661 152975546 145648462
14241A45648462o796405o261486o008272n073075n354159n055651m821981m626334
$$ 145648462 138852057 132590571 126582299 121509224 116155065 111099414 106277433 101651099
14233A01651099l998259l931761l091206l797458l673477k913702l311433k695725
$$ 101651099 97652840 93721079 90629873 86832415 83158938 80245236 76933803 74238078
14225G4238078l138846k013476k596469k630064k169935j719170k042309k149590
$$ 74238078 71099232 69085756 66489287 63859223 61689288 59970118 57927809 55778219
14217E5778219j530418k090162j504578j277660j416310j537231j747050j366681
$$ 55778219 54247801 52157639 50653061 49375401 47959091 46421860 44674810 43308129
14209D3308129j385051o81534j027070j274336j179813j028340j149649j039942
$$ 43308129 41923078 41241544 40214474 38940138 37760325 36731985 35582336 34542394
14201C4542394n59657p07276q89064j197130q79628p47416o81080j54211j017186
$$ 34542394 33982737 33275461 32386397 31189267 30309639 29562223 28881143 28726932 27709746
14192B7709746q67444p87796m88595p07033m12780n29575q88271k11166l28735
$$ 27709746 26842302 26054506 25565911 24858878 24446098 23916523 23028252 22817086 22488351
14183B2488351n80487j71326p87428n36765l35953n07396m21109j23730p61061
$$ 22488351 21907864 21736538 20949110 20412345 20076392 19568996 19147887 19024157 18263096
14174A8263096j59451l71808j09533m82714m74880l22863j93209k57656n02935
$$ 18263096 18103645 17731837 17622304 17139590 16664710 16341847 16148638 15890982 15388047
14165A5388047k37400N3526l92888l86432l22729j30923n23686J78066l71652
$$ 15388047 15150647 15204173 14811285 14424853 14102124 13971201 13447515 13625581 13253929
14156A3253929j56193m74496j25691r4439k33500k29449L6773r8213n47268k12388
$$ 13253929 13097736 12623240 12497549 12403110 12169610 11940161 11976934 11878721 11331453 11119065
14146A1119065k43424n5695R5812o91277J61428k10547m19390L80873m74373j28048
$$ 11119065 10875641 10819946 10915758 10224481 10385909 10175362 9755972 10136845 9662472 9534424
14136I534424k8665K3206l53291J34942n36066J01442j03788l84768L65847o13310
$$ 9534424 9505759 9528965 9175674 9310616 8774550 8875992 8772204 8387436 8753283 8139973
14126H139973r6706J18731l13858J46554k53712L4781L39509o08154k81156j15389
$$ 8139973 8043267 8161998 7848140 7994694 7740982 7775763 8115272 7507118 7225962 7110573
14116G110573J14094j49995k95927K80137j36095J38212k28700q9581k94382N6518
$$ 7110573 7224667 7074672 6778745 7058882 6922787 7060999 6832299 6742718 6448336 6504854
14106F504854k01915Q3940k3096k91577Q6805q0209N8173n29621L11135l21559
$$ 6504854 6302939 6386879 6363783 6072206 6159011 6078802 6136975 5607354 5918489 5596930
14096E596930K6148J20715m54568K32624N21559o29629o3415j21851K04945m58919
$$ 5596930 5623078 5743793 5289225 5521849 6043408 5413779 5350364 5228513 5433458 4974539
14086D974539j52241J56265j69715K01152l6980P5732L9337m37028J03407J9175
$$ 4974539 4822298 4978563 4808848 5010000 4973020 5048752 5088089 4651061 4754468 4773643
14076D773643k30341R0518J66762m01637j20947J80021J9714j22935K28620l99935
$$ 4773643 4543302 4633820 4800582 4398945 4277998 4458019 4477733 4354798 4583418 4183483
14066D183483J30437J2909j2939j96159Q7044l34215L49949O7180R0909l16770
$$ 4183483 4313920 4326829 4313890 4117731 4204775 3870560 4220509 4287689 4378598 4061828
14056D061828j11032K69998l77514N7668j53600j50956K22081j98358k49972j8146
$$ 4061828 3950796 4220794 3843280 3900948 3747348 3596392 3818473 3620115 3370143 3351997
14046C351997L68656l32622j40183O4087J00818n0546k50816R1211J1050L2494
$$ 3351997 3720653 3388031 3247848 3311935 3412753 3362207 3111391 3202602 3213652 3246146
14036C246146k9992k6531j85285n4198o6770L74774l525k29986j07905j90889
$$ 3246146 3216154 3189623 3004338 2950140 2883370 3258144 3254619 3024633 2916728 2725839
14026B725839M66425n23790L16199k26519O5677r7102k2331N5475k13547j29014
$$ 2725839 3192264 2668474 2984673 2758154 2823831 2726729 2704398 2759873 2546326 2417312
14016B417312J84422l7562K81143m37754Q8146j27858K41328J6811j35093K52036
$$ 2417312 2601734 2564172 2845315 2407561 2495707 2367849 2609177 2625988 2490895 2742931
14006B742931n74725r3953J95118J94081j32151j85014J35256k09705K57635k59567
$$ 2742931 2168206 2074253 2269371 2463452 2331301 2146287 2281543 2071838 2329473 2069906
13996B069906L06007k95938j88638K79436n5051N08147L03158O03349K945664
$$ 2069906 2375913 2079975 1891337 2170773 2115722 2623869 2927027 3530376 6476040
13987F476040P157112J9749457J2974894B3061654j1058695m344331j900870j406171
$$ 6476040 13633152 33382609 46357503 23061654 12002959 7658628 5757758 4351587
13979D351587m63096p95093K31869k11332q2703j03960l1639l07641j57232j48210
$$ 4351587 3888491 3093398 3325267 3113935 3031232 2927272 2895633 2587992 2430760 2282550
13969B282550r4407K45270m0782J7396k40569J43148R8274O29k08619L5710q7045
$$ 2282550 2188143 2433413 2392631 2410027 2169458 2312606 2410880 2411509 2202890 2238600 2151555
13958B151555j75276K64778j82146K81328l10182J89272m63695L12798k42276
$$ 2151555 1976279 2241057 2058911 2340239 2030057 2219329 1755634 2068432 1826156
13949A826156K02368N8296J38083l09706J03227j32293P1261p0184j61979j22282
$$ 1826156 2028524 2086820 2224903 1915197 2018424 1886131 1957392 1887208 1725229 1602947
13939A602947R8704o0837L49689p9963k32649j5024P3959j87266L12302l21467
$$ 1602947 1701651 1640814 1990503 1910540 1677891 1662867 1736826 1549560 1861862 1540395
13929A540395j20218L54799j79450J51123Q5530j11588l13415M87809k94685j57151
$$ 1540395 1420177 1774976 1595526 1746649 1832179 1720591 1407176 1894985 1600300 1443149
13919A443149n6954J43209J36820k5251K34322o27696o513L46375j91834j29061
$$ 1443149 1386195 1529404 1666224 1640973 1875295 1247599 1241086 1587461 1395627 1266566
13909A266566o7582K43423k3995j27266k15886L29142l22326P67191l82368j78801
$$ 1266566 1198984 1442407 1418412 1291146 1075260 1404402 1082076 1849267 1466899 1288098
13899A288098K40365n30423M68763k67300K45145J22004j33207o7056M4216P7800
$$ 1288098 1528463 998040 1466803 1199503 1444648 1566652 1433445 1366389 1410605 1488405
13889A488405k83725j26284q0559K70398j78841M19602p0201l93383L33128K22837
$$ 1488405 1204680 1078396 997837 1268235 1089394 1508996 1438795 1045412 1378540 1601377
13879A601377l89184M459k73509M19304l09779K35636K29089k3251l82937K58575
$$ 1601377 1212193 1216652 943143 1362447 1052668 1288304 1517393 1494142 1111205 1369780
13869A369780l00573J95441j35943J95833j55230M0172K85648l61714K73380l52293
$$ 1369780 1069207 1264648 1128705 1324538 1169308 1209480 1495128 1133414 1406794 1054501
13859A054501k00960J76824L28663j81774l80700K33461k02982M06050p6278k02826
$$ 1054501 853541 1030365 1359028 1177254 796554 1030015 827033 1233083 1156805 953979
13849I53979L22606R042l39564J46412J06210r8586J60132l45928k0625O2460
$$ 953979 1276585 1285627 946063 1092475 1198685 1100099 1260231 914303 893678 956138
13839I56138L7363n088J59019J00164m30435K39706J29211q1674k78615J21415
$$ 956138 993501 988413 1147432 1247596 817161 1056867 1186078 1104404 825789 947204
13829I47204j32582Q6026r8317P2356q8118K90333k70658J09963L87045m31188
$$ 947204 814622 900648 802331 874687 786569 1076902 806244 916207 1303252 872064
13819H72064j16005Q7280k541K38322k42437l9290N4279l0902k0172j58448N030
$$ 872064 756059 843339 840798 1079120 836683 797393 851672 820770 800598 642150 647180
13808F47180K26963J46423m7292j12669k71072J29064K84078n6342D49999M51625
$$ 647180 874143 1020566 973274 860605 589533 718597 1002675 946333 449999 901624
13798I01624j29421L98795m27541K56135m06991M62429l90883J92413k1969q3674
$$ 901624 772203 1170998 743457 999592 592601 1055030 664147 856560 834591 750917
13788G50917k1472j11655K42746l13850O99560E61413K36212j54997J82278q9440
$$ 750917 729445 617790 860536 546686 1246246 561413 797625 642628 824906 735466
13778G35466Q479J7999J26109B75285N26218N1879k17595R3182j59517J67093
$$ 735466 743945 761944 888053 275285 801503 853382 635787 728969 569452 736545
13768G36545p958J32206Q1249j72670J96878l38954J30195l32470K96353j05622
$$ 736545 728587 860793 942042 769372 966250 627296 757491 425021 721374 615752
13758F15752O6582l04926M76031k5944j5810k24256K00030m10k73224K66696k68708
$$ 615752 682334 377408 853439 827495 811685 587429 787459 787049 513825 780521 511813
13747E11813m6711B16866P27346k42453K82847n067k71929p0752m9465J23728
$$ 511813 465102 216866 944212 701759 984606 979539 707610 636858 587393 711121
13737G11121k26195L35432k06494k31572M88395k04317m0709l8544N9100j53045
$$ 711121 484926 820358 613864 382292 870687 666370 625661 587117 646217 493172
13727D93172K47824N041l30587L38798o2499C26273K73081J80877j69k81962L13733
$$ 493172 740996 746037 415450 754248 691749 326273 599354 780231 780062 498100 811833
13716H11833l45134K04284J59318j56670M9368J29344j35119A93817K76961o8431
$$ 811833 466699 670983 830301 673631 722999 852343 717224 193817 470778 402347
13706D02347M55892B77057J89139J14362I9637N05003p8449J17198J95242l69893
$$ 402347 858239 277057 466196 580558 99637 604640 526191 643389 838631 468738
13696D68738J44688n1983Q920k39228K22620K701j48865Q2225k32250M05965k43322
$$ 468738 613426 561443 570363 331135 553755 556456 407591 489816 257566 663531 420209
13685D20209m1290J78863m2152j51091J95596J76011l39527n6143L86171B40320
$$ 420209 378919 557782 515630 364539 560135 736146 396619 340476 726647 240320
13674E37827R1843o1952J39435J73939l31442j28660j41593M09898k46592J00738
$$ 537827 629670 567718 707153 881092 549650 420990 279397 689295 442703 543441
13664E43441j86616L05174j87876j45563K21644j33198J90457j51551j2877P1313
$$ 543441 356825 661999 474123 328560 550204 417006 607463 455912 443035 514348
13654E14348l7381J29463j11442j24864L11109k21181M0743B15485L24864j66998
$$ 514348 476967 606430 494988 370124 681233 460052 500795 215485 540349 373351
13644C73351K20270j15377J09371k30043k4627J46247j78184K28948j59141M6456
$$ 373351 593621 478244 587615 357572 332945 479192 301008 529956 370815 417271
13634D17271k0727l7537K39295j81227A74848K96513L07224l39572A92860J88816
$$ 417271 396544 359007 598302 417075 174848 471361 778585 439013 192860 381676
13624C81676L3774A05561M19535k3365l1270j63844p7767Q7816J33459J00900
$$ 381676 415450 105561 525096 501731 470461 306617 228850 316666 450125 551025
13614E51025J95793l59965J98934A06846P01700B30694K86087J68026j36828p3094
$$ 551025 746818 386853 585787 106846 808546 230694 516781 684807 547979 474885
13604D74885B01127M27583H5058K40329L9614q3593K01481P0833k39732J02154
$$ 474885 201127 628710 85058 325387 365001 281408 482889 553722 313990 416144
13594D16144J8617A52523M38082A92555M51637m4622r7137j81052M5428k9168
$$ 416144 434761 152523 590605 192555 644192 599570 502433 321381 366809 337641
13584C37641P1638K14234k11881N1868J3896J15791k36380P6777l6254j84678
$$ 337641 409279 623513 411632 463500 477396 593187 356807 433584 397330 212652
13574B12652M6598A01532K44275J3542J03815C7631N13722j33832K6546j31384
$$ 212652 259250 101532 345807 359349 463164 37631 551353 417521 444067 312683
13564C12683K88229r0234q5510j41112M4833r4406D0615L82257J78374H6885m1468
$$ 312683 600912 510678 425168 284056 328889 234483 40615 422872 601246 86885 45417
13553D5417K44064r9343L48246j86849q4136R1604D1325K12247R4516C8946M17769
$$ 45417 289481 190138 538384 351535 267399 359003 41325 253572 348088 38946 456715
13542D56715A77983L88800k79605p2242K13372Q78j95497J57169I8010J57559
$$ 456715 177983 566783 287178 214936 428308 429186 233689 390858 98010 255569
13532B55569M41705A17940L18417j23641Q7311p8830P4330J10928j37655K7250
$$ 255569 697274 117940 436357 312716 400027 321197 395527 506455 368800 396050
13522C96050m3708A59891L10769j83467j09955R6866h5951A42614K57984A99909
$$ 396050 352342 159891 470660 287193 177238 274104 -85951 142614 400598 199909
13511a73701C85456o4585J17620K63547B72070J94880G7844C1820K88070I3317
$$ -173701 385456 320871 438491 702038 272070 466950 77844 31820 319890 93317
13500E56087k17337o309L62093l16046A61287L01028b07639D42428j64569j06527
$$ 556087 338750 332441 694534 378488 161287 462315 -207639 442428 277859 171332
13490A71332k4878A6961J68019J16203A5635O31069B03020F7128L81200p0254
$$ 171332 146454 16961 184980 301183 15635 646704 203020 67128 448328 378074
13480C78074i0041A49999n8941m991J52177R6887n8118K81477B25899o9610K7710
$$ 378074 -90041 149999 91058 86067 238244 335131 277013 558490 225899 156289 183999
13469A83999J27806R2884j31418j15827J73403P036J16823L9828A62273J43129
$$ 183999 311805 404689 273271 157444 330847 337883 454706 494534 162273 305402
13459C05402K89483B87206j10068K98314k16418K6384A12472J46317p2331J60381
$$ 305402 594885 287206 177138 475452 259034 285418 112472 258789 186458 346839
13449C46839B3683J61668A1726P2825B6147L16712n8554B6662L60764n2362B4035
$$ 346839 23683 185351 11726 84551 26147 342859 284305 26662 387426 335064 24035
13437C83308o3076D53i6341A22862J05281E6487P6535L81040j97582j27863J02736
$$ 383308 320232 453 -96341 122862 228143 56487 133022 514062 316480 188617 291353
13426B91353O9662L204A34560J64729P755j26249J39105j58400J15679H4928M52724
$$ 291353 361015 364219 134560 299289 307044 180795 319900 161500 277179 84928 537652
13415E37652r8469I5379h9087I1950L38826j91421J27771l3092H0371l462a09204
$$ 537652 439183 95379 -89087 91950 430776 239355 367126 334034 80371 76909 -109204
13403C59045j04813m8712N7145r455A05635Q8996O172j5116J59552j43730L5707
$$ 359045 254232 205520 262665 253210 105635 194631 200803 185687 345239 201509 237216
13392B37216A12593E1705b3472A97085J33410A6404Q8607J15324A00665a7154
$$ 237216 112593 51705 -23472 197085 330495 16404 105011 220335 100665 -17154
13381A23531J89816E2259e3610C51900P4037j25760A05284J15679J81522a69293
$$ 123531 313347 52259 -53610 351900 425937 300177 105284 220963 402485 -169293
13370A25311J07357M8574M00292A79292K46359A29148k6335K93905k7713N7482
$$ 125311 232668 281242 681534 179292 425651 129148 102813 396718 369005 426487
13360D26487b1842A68059M0833G0217L390K78872j8511H6661K20252P3379a44711
$$ 426487 -21842 168059 208892 70217 73607 352479 333968 86661 306913 380292 -144711
13348C89008k1662e6839B40430J31463P21j21807J04037F939L82625L8702C9669
$$ 389008 367346 -56839 240430 371893 372614 250807 354844 6939 389564 428266 39669
13336D4451K74359L3320K174j29127M5328Q5019A13709J45558I6559K70360O1974
$$ 44451 318810 352130 354304 225177 270505 355524 113709 259267 96559 366919 428893
13325D28893j89542n518O4714A5735J14768l0584K89756n5114C3252A822J21754
$$ 428893 239351 233833 298547 15735 130503 99919 389675 334561 33252 1822 123576
13314A23576E2313L01025j1724E7580J77559N9779B5449K47830l7932A00372L04360
$$ 123576 52313 353338 341614 57580 235139 294918 25449 273279 235347 100372 404732
13303D04732A15348b58567B93005A8415e3363E1478J36058i794A9191B403K45471
$$ 404732 115348 -258567 293005 18415 -53363 51478 187536 -9794 19191 2403 247874
13292B47874H0831L85278J20296k41469a35312B3647N5686a03121A21377J2651
$$ 247874 80831 466109 586405 344936 -135312 23647 79333 -103121 121377 134028
13282A34028D1052J71285a9698j04035C59497b888r2146A366a40691e9208C37431
$$ 134028 41052 212337 -19698 -123733 359497 -2888 -95034 1366 -140691 -59208 337431
13270a71728C11553P9395A72031C3664R8500L65184l9903a45552A70236I622K9942
$$ -171728 311553 390948 172031 33664 132164 497348 457445 -145552 170236 9622 39564
13259C9564K78688c1211j83225A72468A4144M72085F9467K7358B3974O192J14317
$$ 39564 318252 -31211 -214436 172468 14144 486229 69467 96825 23974 30166 144483
13248A44483l1104a85223B26028j2503b8663k13947B15225a2998B64963l0054
$$ 144483 113379 -185223 226028 213525 -28663 -242610 215225 -12998 264963 234909
13238B34909P7974O0133a7110A12731j0432P7336e9502A23519D1262b9967G3765
$$ 234909 312883 373016 -17110 112731 102299 179635 -59502 123519 41262 -29967 73765
13226A23135m8866J65327J39012E3564J83189A05054N6355R6580B3225d6377C01882
$$ 123135 74269 239596 378608 53564 236753 105054 161409 257989 23225 -46377 301882
13214e609o4520D0418M29593A62345N3719r9157a02063E2112d4923E5863L22855
$$ -5609 -70129 40418 470011 162345 216064 116907 -102063 52112 -44923 55863 378718
13203C78718N6034k14085J20365A25992O1846a30220A00712J15635g4053b4210
$$ 378718 434752 220667 341032 125992 187838 -130220 100712 216347 -74053 -24210
13192g5835B28900J84708J0422j81515m0627l0795A6449J57676a32948A47655
$$ -75835 228900 413608 424030 242515 201888 171093 16449 174125 -132948 147655
13181A33355k12A81a02931B93080A01418f2558A85338M32837l06602A09820K36143
$$ 133355 133143 181 -102931 293080 101418 -62558 185338 618175 311573 109820 345963
13170C45963p4999i7927h839B03030P8279F7831e5845B44842H5603J71767a4343
$$ 345963 270964 -97927 -8839 203030 281309 67831 -55845 244842 85603 257370 -14343
13158B22880G512a09248H3051m0566Q0454K15449d3208A00574O4517O0390R4567
$$ 222880 7512 -109248 83051 42485 122939 338388 -43208 100574 165091 225481 320048
13147C20048A17526n881N3094D1109g1595A21935g1357n466B03755Q8018j29912
$$ 320048 117526 111645 164739 41109 -71595 121935 -71357 -76823 203755 291773 161861
13136A61861B1227M5913a87118g4654B90778j08885k428m727C6853C511K12527
$$ 161861 21227 67140 -187118 -74654 290778 181893 179465 174738 36853 3511 216038
13125B16038I7872b9791B12400B4888K65178F6123Q2272e4030B94247a29958B32767
$$ 216038 97872 -29791 212400 24888 290066 66123 148395 -54030 294247 -129958 232767
13113f3685A57508D0629i6368C54323r4636j1065D2916J1989B6617O1671a46251
$$ -63685 157508 40629 -96368 354323 259687 248622 42916 54905 26617 88288 -146251
13101A65805D6803J04187L8182K6325a3148k3104C8112Q5526E1634R0327R4412
$$ 165805 46803 150990 189172 215497 -13148 -36252 38112 123638 51634 141961 236373
13090B36373P2151j51793E8828a82482b671C47385D187a1576C5002J63475r1315
$$ 236373 308524 156731 58828 -182482 -2671 347385 4187 -11576 35002 198477 107162
13079A07162M3943F1540a73152B60085D5185J08972J20544j18243J51103a54568
$$ 107162 151105 61540 -173152 260085 45185 154157 274701 156458 307561 -154568
13068B09820e1574b4585m7636A57068a23696o5414B40881Q369A13910A3272J96646
$$ 209820 -51574 -24585 -72221 157068 -123696 -189110 240881 249250 113910 13272 209918
13057B09918J23105I3533a14113L0319B08393a66512B36313K1506r5230D6843
$$ 209918 333023 93533 -114113 -83794 208393 -166512 236313 257819 162589 46843
13046B05394i2546A5422J12430P765a25259l09F1240K32902K2202j29719q3299
$$ 205394 -92546 15422 127852 135617 -125259 -125568 61240 294142 316344 186625 103326
13035A03326L5034L4891m0719i1644D96754B33731J67589H1723J59853a36681
$$ 103326 138360 173251 132532 -91644 496754 233731 401320 81723 241576 -136681
13024h0636C23915B6660O6956M4057h690B91794a65352A27789K60245a45790C06787
$$ -80636 323915 26660 93616 137673 -8690 291794 -165352 127789 388034 -145790 306787
13012C27875f3650A69339n4257L77698c2944B15372N3206B4472R0197c7343B9817
$$ 327875 -63650 169339 115082 492780 -32944 215372 268578 24472 114669 -37343 29817
13000C63820a62702C01916e8764I4139L48798k08514a71717B20675I3719J21451
$$ 363820 -162702 301916 -58764 94139 442937 234423 -171717 220675 93719 215170
12990B15170C6600L53400b7577B02129F9988j8067J10929b54005A80294j0250
$$ 215170 36600 390000 -27577 202129 69988 51921 162850 -254005 180294 170044
12980A70044k7691J58385a69539f1904K3918F0816A2922J17524c48961a37926
$$ 170044 142353 300738 -169539 -61904 -37986 60816 12922 130446 -348961 -137926
12969a6718I4810J77036a25259D967a41868l1279O5600E9888b13318B75686r6773
$$ -16718 94810 271846 -125259 4967 -141868 -173147 -107547 59888 -213318 275686 178913
12958A78913o2597m5807K58169a07350R862F1854K99810a27746a740k72820A05437
$$ 178913 116316 70509 328678 -107350 -97488 61854 361664 -127746 -1740 -274560 105437
12946E7720b21355g4112E5431J84279b3237A34449o157c1234A01524i8497B9438
$$ 57720 -221355 -74112 55431 239710 -23237 134449 128292 -31234 101524 -98497 29438
12934i9058l145B45122E0193e4604j59923D84675C4197J92940O2093B5442K30469
$$ -99058 -102203 245122 50193 -54604 -214527 484675 34197 227137 289230 25442 255911
12923B55911j04012l0038a14469E8321J77553j9846B1675K02830a2916m4523j26372
$$ 255911 151899 121861 -114469 58321 235874 216028 21675 224505 -12916 -57439 -183811
12912a83811B3500K95672B9240J23239C8909K09994R1322a23862E2592O4325j3956
$$ -183811 23500 319172 29240 152479 38909 248903 340225 -123862 52592 116917 102961
12901A02961a62651A20539J04809P956R7248q2605a16685o0053o8806E4629K09211
$$ 102961 -162651 120539 225348 233304 330552 247947 -116685 -176738 -245544 54629 263840
12890B63840a97892a9819j93590N4543C26a74942j07911A22512D714f9924E3106
$$ 263840 -197892 -19819 -213409 -158866 326 -174942 -282853 122512 4714 -69924 53106
12878c712j53991B79394e800j3691C77977c0010D03777A56574i1885k6651a241
$$ -3712 -157703 279394 -5800 -19491 377977 -30010 403777 156574 -91885 -118536 -1241
12866H9484J15086L180a69735C53257H9567N8485g7021d533l0765m4723B67035
$$ 89484 204570 207750 -169735 353257 89567 148052 -77021 -4533 -35298 -80021 267035
12854E3616a35594A69217G5945j6397K00942e8308B99662C0331J14761K28561
$$ 53616 -135594 169217 75945 59548 260490 -58308 299662 30331 145092 373653
12844C73653I9832L8180D0980b43026B86910P614B5801d6670A53085f2851b3755
$$ 373653 99832 138012 40980 -243026 286910 294524 25801 -46670 153085 -62851 -23755
12832a85304C1537J48774B4379d7882q7961A87179l6247f6859A05572J41835l6602
$$ -185304 31537 180311 24379 -47882 -135843 187179 150932 -66859 105572 247407 210805
12821B10805A9001J26545F4533B8443e48831B16452a51386M805B3528J97958B3669
$$ 210805 19001 145546 64533 28443 -548831 216452 -151386 -146581 23528 221486 23669
12809a9337A51315R1254G4842N8563a52245j23923B4657O872J78674Q8419a27955
$$ -19337 151315 242569 74842 133405 -152245 -276168 24657 31529 210203 298622 -127955
12797f4503r5515A70234J03816j27263J14384b28023P0635d5528A78803f6277
$$ -64503 -160018 170234 274050 146787 261171 -228023 -157388 -45528 178803 -66277
12786A14910a97752D02990B3621a71865N6053B92247a85875A29491g3545j27013
$$ 114910 -197752 402990 23621 -171865 -115812 292247 -185875 129491 -73545 -200558
12776b00558k6841J01518A95826H1255N1584Q5836a31452G1397e9854c749B59223
$$ -200558 -227399 -125881 195826 81255 132839 218675 -131452 71397 -59854 -3749 259223
12764g1203B48356f2106D3660J93855G9425K12839b86486C5918a66487B18494
$$ -71203 248356 -62106 43660 237515 79425 292264 -286486 35918 -166487 218494
12753B34303m4015n8937a84352C06315I7391K13283E329c0147n3341l9635A65263
$$ 234303 190288 131351 -184352 306315 97391 310674 5329 -30147 -83488 -123123 165263
12741h9880B42798n5509l7700J15802R1552j36934B6736J32055R9719J2689A8845
$$ -89880 242798 187289 149589 265391 356943 220009 26736 158791 258510 271199 18845
12729C49734a75061b5738A38168L0552E5052h9686G5747a03986B66968b42498
$$ 349734 -175061 -25738 138168 168720 55052 -89686 75747 -103986 266968 -242498
12718a94216C00477a44516D6469J6211a08296D87726A01339a05736D09680j96217
$$ -194216 300477 -144516 46469 62680 -108296 487726 101339 -105736 409680 213463
12708B13463I7906M25395j53433m6470q8494J86738A05200J14547F4202P9404
$$ 213463 97906 523301 369868 323398 234904 421642 105200 219747 64202 143606
12698A43606C3231c7852D7236a85470b9356B1019R5427f7827K67A68383L6681
$$ 143606 33231 -37852 47236 -185470 -29356 21019 116446 -67827 -67560 168383 205064
12687B05064D425a07195C00909A16700N7895B8135N44298B28959J90347j81603
$$ 205064 4425 -107195 300909 116700 174595 28135 572433 228959 419306 237703
12677B37703g6405G7051a11536A30164K8593m4318D4267a20169Q00A95235K39352
$$ 237703 -76405 77051 -111536 130164 158757 114439 44267 -120169 -119369 195235 434587
12666D34587A04960i1828G41546B9934a10854A35643l1602k0402B7440J08120
$$ 434587 104960 -91828 741546 29934 -110854 135643 104041 83639 27440 135560
12656A35560J2450j7277k9613J714M5032K5367h1890A19538a42277k28074C51861
$$ 135560 148010 130733 101120 102834 147866 173233 -81890 119538 -142277 -370351 351861
12644d3568F6761J36176R1523A31779b5687a404I8280b2191C14864D1160O3347
$$ -43568 66761 202937 294460 131779 -25687 -1404 98280 -22191 314864 41160 104507
12633A04507A8966f954B37736r650a20929B60037j15862o6894k1412J73999a22317
$$ 104507 18966 -6954 237736 228086 -120929 260037 144175 77281 55869 229868 -122317
12621B01246d3146B83131j8152a15685m9696G0622a22655l467A27863K8894J54900
$$ 201246 -43146 283131 264979 -115685 -165381 70622 -122655 -126122 127863 156757 311657
12610C11657b90069H1763b03680H7426a82266M8330C07546A22883B9845K903J82001
$$ 311657 -290069 81763 -203680 87426 -182266 -133936 307546 122883 29845 32748 214749
12599B14749m436b96028B17850g3281F386a27291I6300Q6503k6553l367a99409
$$ 214749 210313 -296028 217850 -73281 6386 -127291 96300 182803 156250 152883 -199409
12587A77259c01328A36823O6737H1217J47960j07598c02313D12279j47642j2633
$$ 177259 -301328 136823 203560 81217 229177 121579 -302313 412279 264637 252004
12577B52004n0601a70310l0802B27928f8142F9548M7258E7182i310p4882n4209
$$ 252004 201403 -170310 -201112 227928 -68142 69548 116806 57182 -9310 -84192 -138401
12566a38401B25759l8278J16910a01138B24911E2906J9494Q4441f5156o5076D5598
$$ -138401 225759 187481 304391 -101138 224911 52906 72400 156841 -65156 -130232 45598
12554g1765j65887B48972N339B086Q431J61965O793E3038A2876J28231a53506
$$ -71765 -237652 248972 254311 2086 10517 172482 179275 53038 12876 141107 -153506
12542a24810B4139a61287K1123e2492A0196d0814C25670b9715F210L31376F1148
$$ -124810 24139 -161287 -140164 -52492 10196 -40814 325670 -29715 6210 337586 61148
12530c73169B26511c2368r3963a5134B09225b89574f4143C81756A66047K1180
$$ -373169 226511 -32368 -126331 -15134 209225 -289574 -64143 381756 166047 187227
12520A87227L255a81733C1543a66602b3025q4548j46266A2980J48001C7485J08486
$$ 187227 190482 -181733 31543 -166602 -23025 -107573 -253839 12980 160981 37485 145971
12509A45971a35509C17331A0990d0593M425A06507b30728G0844A9464K96693I941
$$ 145971 -135509 317331 10990 -40593 -36168 106507 -230728 70844 19464 316157 9941
12497b44070A91254m3920C9837Q8428f2143l09905e7500f061r2753k2239k3731
$$ -244070 191254 147334 39837 128265 -62143 -372048 -57500 -6061 -98814 -121053 -144784
12486a44784A0044a30320j49255E0922J1295O649k3881L06622b66317D4681a02628
$$ -144784 10044 -130320 -279575 50922 62217 68866 44985 351607 -266317 44681 -102628
12474B00358d7171P207b190A7218J48803b45228Q9072G8117a60733P0085A11689
$$ 200358 -47171 -39964 -2190 17218 166021 -245228 -156156 78117 -160733 -90648 111689
12462A84701b50536e7705G4876b07907A04136J38965H3759k0158L92293G975L90514
$$ 184701 -250536 -57705 74876 -207907 104136 243101 83759 63601 455894 7975 398489
12451C98489F9218l4165g4823j75259O2383l4961D07008a2296q7898H8630e2046
$$ 398489 69218 35053 -74823 -250082 -187699 -222660 407008 -12296 -100194 88630 -52046
12439A32250a69731b9350l77400A27518a34873j2924A44206o0337L24124b72955
$$ 132250 -169731 -29350 -406750 127518 -134873 -147797 144206 83869 407993 -272955
12428C6589b59029F9033J24673R7806K9561q413D9974e6881k84597i1385B0652
$$ 36589 -259029 69033 193706 291512 321073 312660 49974 -56881 -341478 -91385 20652
12416g8731D9422B4257Q42e8405k76584J20092R0698I6215Q3292a14572A05012
$$ -78731 49422 24257 25099 -58405 -334989 -214897 -124199 96215 179507 -114572 105012
12404e8244k39070J41086A94696J66888A55704J38780g0168A12457l7916N2691
$$ -58244 -297314 -156228 194696 361584 155704 294484 -70168 112457 74541 127232
12394A27232M52362e19930A9953h5782B43759j19580J64654A26256E2531a3070
$$ 127232 579594 -519930 19953 -85782 243759 124179 288833 126256 52531 -13070
12383b38166A78393p6714b5139j80910B77560I4303j5710k4677c097k17400O8716
$$ -238166 178393 101679 -25139 -206049 277560 94303 78593 53916 -3097 -220497 -151781
12372a51781b3740B06855J23894n2742F2449b56549a05430j7684m2476r8609b2490
$$ -151781 -23740 206855 330749 278007 62449 -256549 -105430 -123114 -165590 -264199 -22490
12360b20206A45812E7307M57J85669i2481h192A13116O8038q9712M8318R6804
$$ -220206 145812 57307 57764 243433 -92481 -8192 113116 181154 91442 139760 236564
12349B36564a14868D8643Q7761b3936m04273J42932D21756B06832D6323a47601
$$ 236564 -114868 48643 136404 -23936 -428209 -285277 421756 206832 46323 -147601
12338A37283a32362d0022q8085A12540a54121D4511a27930A77177G0848K10016
$$ 137283 -132362 -40022 -128107 112540 -154121 44511 -127930 177177 70848 280864
12328B80864H5264a24217A83795a85091B26796e8938F4760B3130a47677A90521
$$ 280864 85264 -124217 183795 -185091 226796 -58938 64760 23130 -147677 190521
12317b1314j33986K6483A61337f5247H8735a0977I7354b21887B67543b40825A81638
$$ -21314 -155300 -128817 161337 -65247 88735 -10977 97354 -221887 267543 -240825 181638
12305G7792J51413d043H2380A9877b34003B97226D679L58037C6927J04400O1474
$$ 77792 229205 -4043 82380 19877 -234003 297226 4679 362716 36927 141327 202801
12294B02801a50640A03943j9226N4028J32702c6323A02561J34776D1435K75614
$$ 202801 -150640 103943 84717 138745 271447 -36323 102561 237337 41435 317049
12284C17049A2020a83587E1073a54247E6376K64355B7327J77457r6967J70500
$$ 317049 12020 -183587 51073 -154247 56376 320731 27327 204784 107817 278317
12274B78317L03167k45534G8514h6518b6645D830J8721L6713N4571N0571J414
$$ 278317 581484 335950 78514 -86518 -26645 4830 23551 60264 114835 165406 166820
12263A66820i5535g798A51608b7352j45801A47986J68587a8986M863B40786I6693
$$ 166820 -95535 -7798 151608 -27352 -173153 147986 316573 -18986 -14123 240786 96693
12251G0377N1087a33373B53893F1500J72570c8200J0532A58361a16995C39862
$$ 70377 121464 -133373 253893 61500 234070 -38200 -27668 158361 -116995 339862
12240b33674A46341J47377a46516C31215d0567C49825f5719a7976A25046l8981
$$ -233674 146341 293718 -146516 331215 -40567 349825 -65719 -17976 125046 86065
12230H6065a17585I2305b0995A92535L0163M4212E7699J5504k7190b3848H0184
$$ 86065 -117585 92305 -20995 192535 222698 266910 57699 73203 46013 -23848 80184
12218A88882K760N6481R9892P0164A39400c719D12905d573B08033Q3963j36427
$$ 188882 191642 248123 348015 418179 139400 -3719 412905 -4573 208033 291996 155569
12207A55569F6673L5341a44968C27448j28559b75636A05602L06318j68068a63102
$$ 155569 66673 102014 -144968 327448 198889 -275636 105602 411920 243852 -163102
12196C38081h5819B83582J15212j86164J43399a1646B93699A4687L33918a16318
$$ 338081 -85819 283582 398794 212630 356029 -11646 293699 14687 348605 -116318
12185B98511B1101L59879o7704A6149K14063b82852D13936f0480B05366K12547
$$ 298511 21101 380980 313276 16149 230212 -282852 413936 -60480 205366 417913
12175D17913C8762J93604k6326o1769a30492C03363G5855K40316g2949I9984b4019
$$ 417913 38762 232366 206040 144271 -130492 303363 75855 316171 -72949 99984 -24019
12163b1932A39320f4856C7243O8540k6572J83635j11415K51146d750j29187A30963
$$ -21932 139320 -64856 37243 105783 79211 262846 151431 402577 -4750 -133937 130963
12151I10c6638B74322j00064M9834K3721c024B16500q5276D6950a6395B44625
$$ 910 -36638 274322 174258 224092 247813 -3024 216500 131224 46950 -16395 244625
12139B94180I4697K61940A28542a09541D8938j4682L4964E06J41495b012m213
$$ 294180 94697 356637 128542 -109541 48938 34256 69220 506 142001 -2012 -6225
12128f225k35373J01315c7193J1253E5595K58211a61048O3289K6845B21103a56226
$$ -6225 -241598 -140283 -37193 -25940 55595 313806 -161048 -97759 -70914 221103 -156226
12116a19452p0375C2549M8390f048j65611A60809n0218B7375M6478J05955h3589
$$ -119452 -189827 32549 80939 -6048 -171659 160809 110591 27375 73853 179808 -83589
12104i2407B11691o5672b6578l163C2582c7037j72124B52267J6673a63011O3483
$$ -92407 211691 146019 -26578 -29741 32582 -37037 -209161 252267 268940 -163011 -99528
12093i9528n1165F6199C2147J9305Q6058A8873a53619B599Q7243F093J95578r0392
$$ -99528 -150693 66199 32147 51452 137510 18873 -153619 2599 89842 6093 201671 111279
12081A11279C245L13404J163632M89268G09030A28148K63271A45295g0518B01573
$$ 111279 3245 316649 1480281 1969549 709030 128148 391419 145295 -70518 201573
12070a35183F590d4983A62168m2714A6053a75162B36442a86880b7964A93261d2056
$$ -135183 6590 -44983 162168 119454 16053 -175162 236442 -186880 -27964 193261 -42056
12058c29002Q8527A9732d9338j06607R463K3957G1511J20079a06692b3970r5999
$$ -329002 -240475 19732 -49338 -155945 -146482 -122525 71511 191590 -106692 -23970 -119969
12047a19969a9929j22056M8699D9872P2243f2100F2446f5026I1f9716A90736i3057
$$ -119969 -19929 -141985 -93286 49872 122115 -62100 62446 -65026 91 -69716 190736 -93057
12034f6844F0991N960b58728k5941F1726R1737g9151j84430A90562a19229j06937
$$ -66844 60991 66951 -258728 -284669 61726 153463 -79151 -263581 190562 -119229 -226166
12023b26166b0883B09673b75119A13912g1789k44002c4669A33150B4333O559a09939
$$ -226166 -20883 209673 -275119 113912 -71789 -315791 -34669 133150 24333 30892 -109939
12011d8822C26316j51905c6571G9254f8296G6915J50707i7712K5407C2608e7881
$$ -48822 326316 174411 -36571 79254 -68296 76915 227622 -97712 -72305 32608 -57881
11999b97329A46839c5652A13229P899a81981A78499P984D7215A5081c03829a1307
$$ -297329 146839 -35652 113229 121128 -181981 178499 186483 47215 15081 -303829 -11307
11987e8962A84201i8104D4226J28308J11452J34086e800G3513J13827B1420J05387
$$ -58962 184201 -98104 44226 172534 283986 418072 -5800 73513 187340 21420 126807
11976A26807c6645q3561n0581E296a46457K3415B47166C4332J07005b73056c4611
$$ 126807 -36645 -120206 -170787 5296 -146457 -123042 247166 34332 141337 -273056 -34611
11964D43K46972D9812j3385j1922b96810J7642c1318B30628o482r1518a2884j71473
$$ 443 247415 49812 36427 24505 -296810 -279168 -31318 230628 224146 132628 -12884 -184357
11952a84357b1605k58785A99043e174j41414H8915k9855b0302n4149l9927A95209
$$ -184357 -21605 -280390 199043 -5174 -146588 88915 59060 -20302 -74451 -114378 195209
11940g2553A72974a73516O9699j14198L5335A449a52060B1098K6670P4918A592
$$ -72553 172974 -173516 -103817 -218015 -182680 1449 -152060 21098 47768 122686 1592
11928C31062H7557i8572b1156q5172E8718L9575a09164q6961g8779B25420o9361
$$ 331062 87557 -98572 -21156 -106328 58718 98293 -109164 -196125 -78779 225420 156059
11917A56059b05469B74464a54107I4255J2290m6979a23831C6926K2774a05496
$$ 156059 -205469 274464 -154107 94255 106545 59566 -123831 36926 59700 -105496
11906A02831Q6489h6481j05389B47873g5704j32954Q3109B33913c8268k42389
$$ 102831 189320 -86481 -191870 247873 -75704 -208658 -125549 233913 -38268 -280657
11896b80657A45762h8211j34853A02176M6422O82j965a73707J29L0286B14087
$$ -280657 145762 -88211 -223064 102176 148598 149280 147315 -173707 -173578 -143292 214087
11884I5222A0046J37690b45466a10746q2950j08231A62388a28937p3158g583B6575
$$ 95222 10046 147736 -245466 -110746 -193696 -301927 162388 -128937 -202095 -7583 26575
11872h9038A78299a60937C25913b7780o486A17949J4201a34949k11202H8046i532
$$ -89038 178299 -160937 325913 -27780 -34266 117949 132150 -134949 -346151 88046 -9532
11860F5118K903J21314a36071l081C4029b4285A67984c7070E7261d1591j58975
$$ 65118 68021 189335 -136071 -139152 34029 -24285 167984 -37070 57261 -41591 -200566
11849b00566e3578a8874B65657b08144A86694p6769j143D8697L9888i2190K4196
$$ -200566 -53578 -18874 265657 -208144 186694 109925 108782 48697 88585 -92190 -67994
11838f7994B87173B9132K81501H7572c60032h1636b4757l95866A80570C1967b55169
$$ -67994 287173 29132 310633 87572 -360032 -81636 -24757 -420623 180570 31967 -255169
11826b76049f0307C5028a67640h3348j81468B25538g8238G7006L7395c945q527
$$ -276049 -60307 35028 -167640 -83348 -264816 225538 -78238 77006 114401 -3945 -12472
11815a2472j28096R11k84169e0487E139a35248a2744A47247M5610b28499B0668
$$ -12472 -140568 -139657 -423826 -50487 5139 -135248 -12744 147247 192857 -228499 20668
11803B1030b8069C34181b88213i1109A80940a68178j7706E3466d9115q2156F515
$$ 21030 -28069 334181 -288213 -91109 180940 -168178 -185884 53466 -49115 -131271 6515
11791a01440L8522A57464d4491A4799a89322b1884B32418c04383a00306H455f0798
$$ -101440 -62918 157464 -44491 14799 -189322 -21884 232418 -304383 -100306 8455 -60798
11779b22271g0455H8157a55280B8910a46182D18938A51171J71589k3705B8039
$$ -222271 -70455 88157 -155280 28910 -146182 418938 151171 322760 299055 28039
11768B69643E5660Q5233F2047M619b90370C03415j21475I0260c92160B77327a06528
$$ 269643 55660 140893 62047 66666 -290370 303415 181940 90260 -392160 277327 -106528
11756C5970a10511K3523D9452j0344a18751C4462R4720K96602g5186A71939E1354
$$ 35970 -110511 -86988 49452 39108 -118751 34462 129182 425784 -75186 171939 51354
11744a66262A77568o7957J3962B0116Q2995f4769H7633L4813K52381a13795A27466
$$ -166262 177568 109611 123573 20116 103111 -64769 87633 122446 374827 -113795 127466
11732f3751A3217h1198A18649K3966n8655b10878A54440a48413P133o5465H3538
$$ -63751 13217 -81198 118649 142615 83960 -210878 154440 -148413 -141280 -206745 83538
11720D51954a1441j89479A43411b3236C22352a91012i1397A80987h854q9225B20248
$$ 451954 -11441 -200920 143411 -23236 322352 -191012 -91397 180987 -8854 -98079 220248
11708A8827b39615A08790L6043R7182C1413J06815l6178P0174F6110i1163a2697
$$ 18827 -239615 108790 144833 242015 31413 138228 102050 172224 66110 -91163 -12697
11696I2578i3581A62505a10684d523m37494a03427P743A28069L75695C5756i9086
$$ 92578 -93581 162505 -110684 -4523 -442017 -103427 -95684 128069 503764 35756 -99086
11684B30293G3009G967K992K3915J01577a2420A08104M8539e9655A98870J24880
$$ 230293 73009 7967 10959 34874 136451 -12420 108104 156643 -59655 198870 323750
11673C23750a52860A0920J53342N7621N0159G1724M6089e0672k98209J38294I5161
$$ 323750 -152860 10920 164262 221883 272042 71724 117813 -50672 -348881 -210587 95161
11661A7612G837M19928e5363B02305K2132H6827M5055h712A36360N1173r1424
$$ 17612 7837 427765 -55363 202305 224437 86827 131882 -8712 136360 187533 96109
11650I6109d2983J9576l2760j5281n1830A20567a30643q5465l4063A45017K38029
$$ 96109 -42983 -23407 -56167 -71448 -123278 120567 -130643 -216108 -250171 145017 383046
11639C83046A2652J2962J79574F0945K2432P0149G0552P8255b68411H2015C6568
$$ 383046 12652 25614 205188 60945 83377 153526 70552 148807 -268411 82015 36568
11627h6782r116C49789N8024j35199F2319g704B41360a17026d0981C17395j22073
$$ -86782 -95898 349789 407813 272614 62319 -7704 241360 -117026 -40981 317395 195322
11616A95322a67798A01865g2258F9089a75897c4569g878j17412e7432b845C9053
$$ 195322 -167798 101865 -72258 69089 -175897 -34569 -7878 -125290 -57432 -2845 39053
11604a08410C20206j03315K2769b50732c7583A79018B6061b7678A87886b50824
$$ -108410 320206 216891 239660 -250732 -37583 179018 26061 -27678 187886 -250824
11593g8730D9294j6174a78965B22866c2892I1517K5482N9714j5490D0469L3507
$$ -78730 49294 33120 -178965 222866 -32892 91517 116999 176713 161223 40469 73976
11582G3976J730P8504A848O406J54983k5162L1415b10670D3092M35679A89328
$$ 73976 75706 154210 1848 8254 163237 138075 169490 -210670 43092 478771 189328
11570B9281M06910j69190k2846a08185C9396b2645A36326b6415D637M78524E0309
$$ 29281 436191 267001 244155 -108185 39396 -22645 136326 -26415 4637 483161 50309
11558b32496A44290n1868c5446A99444c87466J03679H8260R5101b85966F9236
$$ -232496 144290 92422 -35446 199444 -387466 -283787 88260 183361 -285966 69236
11547d0758A61108a17122D2054a79432D09686e737C24459l3169j08852d6916A59551
$$ -40758 161108 -117122 42054 -179432 409686 -5737 324459 291290 182438 -46916 159551
11535B4061K69683K24401b29670B33723B3485b5893A7909b88367R6127b2961A26318
$$ 24061 293744 518145 -229670 233723 23485 -25893 17909 -288367 -192240 -22961 126318
11523C5916M8387a47336E7517L4591J75984B7059O330Q3308c037m4669B2834L5816
$$ 35916 84303 -147336 57517 92108 268092 27059 33389 116697 -3037 -47706 22834 58650
11511E8650c6504D0851i256C21721D1692K62138g9335B82991F369K80003O9920
$$ 58650 -36504 40851 -9256 321721 41692 303830 -79335 282991 6369 286372 356292
11500C56292j37085J84459n315a582k05727A11570a85652A88441h7513A28839
$$ 356292 219207 403666 398351 -1582 -207309 111570 -185652 188441 -87513 128839
11489D92025o9703F7341K02179k4072K3869d5718B29584A07037J90696i279o4647
$$ 492025 422322 67341 269520 245448 269317 -45718 229584 107037 297733 -9279 -73926
11478g3926A59722J69103j50612p6180o711O9550P5898I340M93819A19220J99545
$$ -73926 159722 328825 178213 102033 95322 164872 240770 9340 503159 119220 318765
11467C18765n8453A01958P0042b556A72322J90234q5591A21574K04335j08962
$$ 318765 260312 101958 172000 -2556 172322 362556 276965 121574 325909 216947
11457B16947D2107J1325O8239N5424j2254r83a7125I3148L77663I8868J48386
$$ 216947 42107 53432 121671 177095 164841 163858 -17125 93148 470811 98868 247254
11446B47254n5056a407r4421J4782A22986Q69F895K24552N8015E3586N4376J04246
$$ 247254 192198 -1407 -95828 -81046 122986 123855 6895 231447 289462 53586 107962 212208
11434B12208b69560A52516b01596g5823b317A9328J70813J92674d2926A69937
$$ 212208 -269560 152516 -201596 -75823 -2317 19328 190141 382815 -42926 169937
11423c62028a3768k36537A99604J22103a75989A5994d5226J6678p0970k49677
$$ -362028 -13768 -250305 199604 321707 -175989 15994 -45226 -28548 -99518 -349195
11413c49195A88221a86021A37656l2019K9563J58158b31774B09210k1262a90359
$$ -349195 188221 -186021 137656 105637 135200 293358 -231774 209210 187948 -190359
11402C4374k082h0734j82453H5522A6230J16433k2772A9795e54B33447N9575b13046
$$ 34374 32292 -80734 -263187 85522 16230 132663 109891 19795 -554 233447 293022 -213046
11389g527j25496m8520G3011b00613O6510j13077I6509J06928o2074l4764L9233
$$ -7527 -133023 -181543 73011 -200613 -134103 -247180 96509 203437 141363 106599 145832
11378A45832J36634A23275c6907A7904J46059j5079F2883a53708C04673A36022
$$ 145832 282466 123275 -36907 17904 163963 148884 62883 -153708 304673 136022
11367A35970n4227b96655A23967e2279j96725a12697I6001a58625H3516J26252
$$ 135970 81743 -296655 123967 -52279 -249004 -112697 96001 -158625 83516 209768
11357B09768f3600r7432B251L32652b10235D66920c8019I9518a18367E7825B8846
$$ 209768 -63600 -161032 2251 334903 -210235 466920 -38019 99518 -118367 57825 28846
11345d51036e5832j74621B81397A5680d5942m5938J206M4328h884j14480D8968
$$ -451036 -55832 -230453 281397 15680 -45942 -91880 -90674 -46346 -8884 -123364 48968
11333D7801J07606J002h5025G2417a38678D77a95426a5416I6750f6160b5345n2817
$$ 47801 155407 156409 -85025 72417 -138678 477 -195426 -15416 96750 -66160 -25345 -78162
11321g8162c4163r1197A43028E3630e6281H2814a28349N40a9380j3840c939j85084
$$ -78162 -34163 -125360 143028 53630 -56281 82814 -128349 -127809 -19380 -33220 -3939 -189023
11309a89023j2010F4328K2588a93663R6697G1964K0169a00417J1692j486k32292
$$ -189023 -201033 64328 86916 -193663 -96966 71964 92133 -100417 -88725 -90211 -322503
11298c22503e5295A0450h6776I2084O0190a94895B27786g4329A05936R052e4539
$$ -322503 -55295 10450 -86776 92084 152274 -194895 227786 -74329 105936 114988 -54539
11286B418M0791b68417H8830B1449h6113m7734j80240J42305B42399o6618E1966
$$ 2418 43209 -268417 88830 21449 -86113 -133847 -314087 -171782 242399 175781 51966
11274A69344K3940p3259h8416j60870h3463B71325a16260l4427m0801d4538n0168
$$ 169344 193284 120025 -88416 -249286 -83463 271325 -116260 -150687 -191488 -44538 -94706
11263i4706H1981a93901m0294J16201D1195K8788a8767D8274L0240e0159j86443
$$ -94706 81981 -193901 -234195 -117994 41195 69983 -18767 48274 78514 -50159 -236602
11252b36602D9148a31906A03141c10120J32121F6578B2331b29484A57041b16968
$$ -236602 49148 -131906 103141 -310120 -177999 66578 22331 -229484 157041 -216968
11241a1299k16296K5515B00638l0005b7868C8861b59381j522B3295c9290o2139
$$ -11299 -227595 -202080 200638 170633 -27868 38861 -259381 -260903 23295 -39290 -101429
11230a01429A07526a953A45974n0905b13203j04523g1121L5058a4380j2565j49435
$$ -101429 107526 -1953 145974 95069 -213203 -317726 -71121 -36063 -14380 -26945 -176380
11219a76380B00693a06459c8936j1868A65788i3450A86988b34678g6386A3285
$$ -176380 200693 -106459 -38936 -50804 165788 -93450 186988 -234678 -76386 13285
11208b09384J9014B5478f0388A98558c96835h6676c1535a2766D8377b13801C81635
$$ -209384 -190370 25478 -60388 198558 -396835 -86676 -31535 -12766 48377 -213801 381635
11196A75936b21883R6748j17104F2784d8885k7004l2834b8079m6606j22354b9611
$$ 175936 -221883 -125135 -242239 62784 -48885 -75889 -108723 -28079 -74685 -197039 -29611
11184c26040B83991g7700L6377j32245M9158c2080j17633N0393j4774K8942q6042
$$ -326040 283991 -77700 -41323 -173568 -124410 -32080 -149713 -99320 -114094 -85152 -171194
11173a71194I1842a06819e3295B77982B8186Q8333L5985c2142k40526A82042a18371
$$ -171194 91842 -106819 -53295 277982 28186 116519 152504 -32142 -272668 182042 -118371
11161b59990h2367A22509R7404A6442b07240h0590B59134g23j01101L7341m9685
$$ -259990 -82367 122509 219913 16442 -207240 -80590 259134 -723 -101824 -64483 -114168
11150a14168G5106k0980a19075j11234b4081m8939I1407N6508B4490e8464E1204
$$ -114168 75106 54126 -119075 -230309 -24081 -73020 91407 147915 24490 -58464 51204
11138g9717f230A732a40682H8744b50078g2713l473B34214H4753K1366d08437
$$ -79717 -6230 1732 -140682 88744 -250078 -72713 -76186 234214 84753 106119 -408437
11126C17429q7584K48187G7025K10002a8289j05166e9315j44035B97549c1958
$$ 317429 229845 478032 77025 287027 -18289 -123455 -59315 -203350 297549 -31958
11115A83593c47256D34518f6459K6668l50557a75901C492a56446A33886A549L17166
$$ 183593 -347256 434518 -66459 -39791 -390348 -175901 3492 -156446 133886 1549 318715
11104C18715p6035B8811J48242J23456j49438J38450f5803I7441m5614R3234N7017
$$ 318715 242680 28811 177053 300509 151071 289521 -65803 97441 51827 145061 202078
11093B02078E4270k353P6386J84078E4469J14899r350J1289K25135a6585E30641
$$ 202078 54270 51917 128303 312381 54469 169368 160018 171307 396442 -16585 530641
11081B75559j18324J89736p8682L1790J06534E6701K99173D3940K35656K9227
$$ 275559 157235 346971 268289 300079 406613 56701 355874 43940 279596 308823
11071C08823J98209J37768l13961J79807k17248O5949K07088j71925A92012L02354
$$ 308823 507032 644800 330839 510646 293398 359347 566435 394510 192012 494366
11061D94366o8607J23203J40177j35797j95150K23044p6168J35500k69048K53330
$$ 494366 425759 548962 689139 553342 358192 581236 505068 640568 371520 624850
11051F24850j86127L19668C72474N83836m01720O8968M2544L3249A91433N57713
$$ 624850 438723 758391 372474 956310 554590 623558 666102 699351 191433 749146
11041G49146l68096L00981k78742K22473j09447j86210M09389J53073l11022j94665
$$ 749146 381050 682031 403289 625762 516315 330105 739494 892567 581545 386880
11031C86880L89583l69630l3206k4919M28900J69830C43753K36299J29530C07813
$$ 386880 776463 406833 373627 348708 777608 947438 343753 580052 709582 307813
11020H45796k54914r277j29261m4089J33556L59968C27440O64009l67405j32910
$$ 845796 590882 581605 452344 408255 541811 901779 327440 991449 624044 491134
11010D91134Q4920J4203l1638q821k18896O36383k58342j46015q4438l9672L14289
$$ 491134 576054 590257 558619 549798 330902 967285 708943 562928 478490 438818 753107
10999G53107k9722Q3692j25250M7024j86774R9620K16692j95664O0543m6057j65299
$$ 753107 723385 807077 681827 728851 542077 641697 858389 662725 723268 677211 511912
10988E11912n0103M42452J33734l94873K83248j79662K70439Q890K15929j15894
$$ 511912 461809 904261 1037995 643122 926370 746708 1017147 1026037 1241966 1126072
10978A126072J68083L7836K87658M21360L32517k23040K42929K75212J01933l66717
$$ 1126072 1294155 1331991 1619649 2041009 2373526 2150486 2393415 2668627 2770560 2403843
10968B403843k69180J74034k21376j94234q7888k91529k8558L00773j65129P8362
$$ 2403843 2134663 2308697 2087321 1893087 1805199 1513670 1485112 1785885 1620756 1699118
10958A699118K79527n75304N69929j15635n8923j63554m52406j71645m10065J00600
$$ 1699118 1978645 1403341 1973270 1857635 1798712 1635158 1182752 1011107 601042 701642
10948G01642J96445l99934B08234o794o5541K89006l9390p8661O270F3741e6435
$$ 701642 898087 498153 208234 201440 135899 424905 385515 306854 313124 63741 -56435
10936B54064d4640A82762K17387I2592J59013c6640B61429i0357A13285J2843
$$ 254064 -44640 182762 400149 92592 251605 -36640 261429 -90357 113285 126128
10926A26128M8415b37512A17044D207K06560B5407K85883i025B19509c47503d010
$$ 126128 174543 -237512 117044 4207 210767 25407 311290 -9025 219509 -347503 -4010
10914H6908i4215m3657C15509M8221c14903E4683L8468a74473j06551J16447G6392
$$ 86908 -94215 -137872 315509 363730 -314903 54683 93151 -174473 -281024 -164577 76392
10902a0654B2061J18932a3068I0439b74810e2435A94157a8069A30360q675j0848
$$ -10654 22061 140993 -13068 90439 -274810 -52435 194157 -18069 130360 121685 110837
10891A10837h7688I7061A9780b12883R4825c366A67984a35272H4700J0389a17096
$$ 110837 -87688 97061 19780 -212883 -118058 -3366 167984 -135272 84700 95089 -117096
10879a05183N0598A62027K19405h6307I9573a53906B03802b20385k14218D0199
$$ -105183 -54585 162027 381432 -86307 99573 -153906 203802 -220385 -434603 40199
10868C0289N5470k3018J72053k318a57345b2549E981K7356M1565a96222B60979
$$ 30289 85759 62741 234794 232476 -157345 -22549 5981 33337 74902 -196222 260979
10856a16177G5197i8515r8742A0605R0932K700J41763a00365C8959J31524f4562
$$ -116177 75197 -98515 -197257 10605 101537 104237 246000 -100365 38959 170483 -64562
10844b83912A47231F9364a60063q4356A01178P455c1106C76642F1534K05926A6697
$$ -283912 147231 69364 -160063 -244419 101178 108633 -31106 376642 61534 267460 16697
10832a34332n5648A16532i1073l1888A31649A8893a67194B21595C6474a08985
$$ -134332 -189980 116532 -91073 -122961 131649 18893 -167194 221595 36474 -108985
10821A96375a75524B1081a1451A57210a74294a3911E1605c1234j86921K6785G5820
$$ 196375 -175524 21081 -11451 157210 -174294 -13911 51605 -31234 -218155 -191370 75820
10809A2287b20344R1875k14108A31234d7829l8567B7561c08607R3566R9408j28376
$$ 12287 -220344 -128469 -342577 131234 -47829 -86396 27561 -308607 -215041 -115633 -244009
10798b44009j7990H0620h389k08944H6694D1349f1709r0172n0355f7183j89398
$$ -244009 -261999 80620 -8389 -217333 86694 41349 -61709 -151881 -202236 -67183 -256581
10787b56581g7332b9087r0063A5465b08081M6465B63846a68043P7162B75512D1112
$$ -256581 -77332 -29087 -119150 15465 -208081 -161616 263846 -168043 -90881 275512 41112
10775B03795H355e3898r015l2883l04953D25903A33628a08492e30j54577F0164
$$ 203795 8355 -53898 -62913 -95796 -400749 425903 133628 -108492 -530 -155107 60164
10763C1294e6816A68810n381b83287F3448f0128r8714o814M5216j1049e5993j23834
$$ 31294 -56816 168810 163429 -283287 63448 -60128 -158842 -165656 -120440 -131489 -55993 -179827
10751a79827q5334D45635j98310A1729J38722c13463B28692D1284A3806L94404
$$ -179827 -265161 445635 247325 11729 150451 -313463 228692 41284 13806 408210
10741D08210b62937A912J31745b10575a4160o0800j18109G450a96673j9534g3307
$$ 408210 -262937 1912 133657 -210575 -14160 -74960 -193069 7450 -196673 -216207 -73307
10729h0170D0428j1213b49170B48531j22531k5809c43040f8566j03768j04402
$$ -80170 40428 29215 -249170 248531 126000 100191 -343040 -68566 -172334 -276736
10719b76736a03514B9914b46796c4398l62720a71918B8684K47871a88867A2342
$$ -276736 -103514 29914 -246796 -34398 -397118 -171918 28684 276555 -188867 12342
10708b185A51214F5922a46212l95703J45565E7681f6535A33787b40039i5454c7730
$$ -2185 151214 65922 -146212 -541915 -396350 57681 -66535 133787 -240039 -95454 -37730
10696b4886E7690c46726L240J27318A69095I984h490j27396A41396b57588D0147
$$ -24886 57690 -346726 -343486 -216168 169095 9984 -8490 -135886 141396 -257588 40147
10684c92913B82644d4255E6329d7519o5232j29817P4454L5700c6113A21512J30400
$$ -392913 282644 -44255 56329 -47519 -112751 -242568 -168114 -132414 -36113 121512 251912
10673B51912D4631j0286g5757a4958l9174C7986K26538o2801H2534M3431b12990
$$ 251912 44631 34345 -75757 -14958 -54132 37986 264524 201723 82534 125965 -212990
10661a58916A18822b90740A19146g9336A0954J32341b76282a0876E4884a34850
$$ -158916 118822 -290740 119146 -79336 10954 143295 -276282 -10876 54884 -134850
10650a01527M2231A0029c93687A72377F8276j9234a32350J5646E3477k1302a04951
$$ -101527 -59296 10029 -393687 172377 68276 49042 -132350 -116704 53477 32175 -104951
10638b15404Q6902A3576L46481a42124A55269h1636A39815d4458j6202J0801h501
$$ -215404 -128502 13576 360057 -142124 155269 -81636 139815 -44458 -60660 -49859 -8501
10626d4699H4578J6462J8240K9488b73765A69293R4205A13467g9086p6090C4391
$$ -44699 84578 101040 119280 148768 -273765 169293 263498 113467 -79086 -155176 34391
10614I1262m5512K37544g4624C9697h8557B4864c2296A16445C2369J80841d10815
$$ 91262 45750 283294 -74624 39697 -88557 24864 -32296 116445 32369 213210 -410815
10602A07025L9608p781L0192l1753D0143b5117m6761q9038r1773M3301B57600
$$ 107025 146633 138852 169044 137291 40143 -25117 -71878 -160916 -252689 -209388 257600
10590h17p2377L3170A22850K24137I8565c7810j55806h3734j04053l2459b9595
$$ -817 -73194 -40024 122850 346987 98565 -37810 -193616 -83734 -187787 -220246 -29595
10578b72324k4559J13798j36539R8920C3570f7054j33210K1894C008K36054i4804
$$ -272324 -296883 -183085 -319624 -220704 33570 -67054 -200264 -178370 3008 239062 -94804
10566i0417d1607k68204a2201F1545J61060b5978A18746J17712f7488l4109j90205
$$ -90417 -41607 -309811 -12201 61545 222605 -25978 118746 236458 -67488 -101597 -291802
10555b91802f6082j31152A4436K5354k431a03156j40181A25752g6699A70553H2664
$$ -291802 -66082 -197234 14436 39790 37359 -103156 -243337 125752 -76699 170553 82664
10543I5417N8928K3314B9567h3153j94599k81595e8303i649j72641A30631i6448
$$ 95417 154345 177659 29567 -83153 -277752 -559347 -58303 -9649 -182290 130631 -96448
10531E0016b7615J1477l24279b8215k87680P9575A65086f1101j60087g1288C2413
$$ 50016 -27615 -16138 -340417 -28215 -315895 -236320 165086 -61101 -221188 -71288 32413
10519b4073A03386a78605A24925J13758b12341j60338A69202n1709b95180j03522
$$ -24073 103386 -178605 124925 238683 -212341 -372679 169202 117493 -295180 -398702
10509c98702J82911A81794A6379a93078j8662A10670b17125A87861I3887a65777
$$ -398702 -215791 181794 16379 -193078 -211740 110670 -217125 187861 93887 -165777
10498B15928c46050A55459a69281A38525a58774J2066F4131g1689D0919c01486
$$ 215928 -346050 155459 -169281 138525 -158774 -146708 64131 -71689 40919 -301486
10487C1188K13300a41632e2014A10403a8648B93418l3280J55650o2714L54369
$$ 31188 244488 -141632 -52014 110403 -18648 293418 260138 415788 353074 707443
10477G07443B11299I233N1747b07375F4196A7916b8144A4490d0271k57989l9218
$$ 707443 211299 9233 60980 -207375 64196 17916 -28144 14490 -40271 -298260 -337478
10466c37478C67065j65673p1877O1688b38188B32491c52424c9020A77192F8390
$$ -337478 367065 201392 129515 191203 -238188 232491 -352424 -39020 177192 68390
10455D6863N4515a610l12798B00884c58023c3624j52322B28492a52651l557D6654
$$ 46863 101378 -1610 -314408 200884 -358023 -33624 -185946 228492 -152651 -156208 46654
10443A40340a39288A21582c2152q2336H6709a6520H7014a09277A96567J99683
$$ 140340 -139288 121582 -32152 -114488 86709 -16520 87014 -109277 196567 396250
10433C96250a04335B2567b06134G4469J82172g6591K9497R083F5232N704k8348
$$ 396250 -104335 22567 -206134 74469 256641 -76591 -47094 -38011 65232 70936 42588
10422D2588b28068F3377I35J09179a93191R4553I5133q840j061A1056K69781i3853
$$ 42588 -228068 63377 935 110114 -193191 -98638 95133 86293 85232 11056 280837 -93853
10409A85678A0731c50099j23602a86023A55380J5009n1028b93019G0058e022D3223
$$ 185678 10731 -350099 -473701 -186023 155380 170389 119361 -293019 70058 -5022 43223
10397a37004B67670a00331i372B07118j9306o2548m8270L7611a30226j34287G9645
$$ -137004 267670 -100331 -9372 207118 187812 125264 76994 114605 -130226 -264513 79645
10385B13132g2887j83830b636C08939a26957M2256B23108e2811l3235C47599N2181
$$ 213132 -72887 -256717 -2636 308939 -126957 -84701 223108 -52811 -86046 347599 399780
10374C99780A00630j8967b92398A00140N72525C06035H7601J87526J92748n9504
$$ 399780 100630 81663 -292398 100140 672665 306035 87601 275127 467875 408371
10364D08371l5142k8172j05274j4076J43679j45901c2384A10731O6692D6196J52175
$$ 408371 373229 345057 239783 225707 369386 223485 -32384 110731 177423 46196 198371
10353A98371J90906G2233N50371l151j7038B51817n154m8265K36748J08512r2502
$$ 198371 389277 72233 622604 619453 602415 251817 246663 198398 435146 543658 451156
10342D51156A19221K92208p1860j39552J02094A29184f2336c0565j11196F6868
$$ 451156 119221 411429 339569 200017 302111 129184 -62336 -30565 -141761 66868
10331A67391J4826N2515j02774a45835b2807j26103B5375c11927A6750J67951
$$ 167391 182217 234732 131958 -145835 -22807 -148910 25375 -311927 16750 184701
10321A84701r0469J22830l6900H951J24711R3105a48302G3138B1123c1387N763
$$ 184701 94232 217062 180162 8951 133662 226767 -148302 73138 21123 -31387 -25624
10310b5624A8868C664J20948c37708C24183b15287B05178a82361H9437b55861
$$ -25624 18868 3664 124612 -337708 324183 -215287 205178 -182361 89437 -255861
10299b22187B27744p7321e7349B5286L08447i0824E1147a44430B04763a66084
$$ -222187 227744 150423 -57349 25286 333733 -90824 51147 -144430 204763 -166084
10288i5309A86008b9954A7217R2107C8259L71727F0288b19032A29401b21348a4921
$$ -95309 186008 -29954 17217 109324 38259 409986 60288 -219032 129401 -221348 -14921
10276a14729j14411A77297a62594B86669Q2112b20082a3665j52857A75095K29584
$$ -114729 -229140 177297 -162594 286669 368781 -220082 -13665 -166522 175095 404679
10266D04679j37921M5771b34697b3578C17759a8687D84019A70936K73945j08132
$$ 404679 266758 312529 -234697 -23578 317759 -18687 484019 170936 444881 336749
10256C36749o0465g8090C24287D6011b2194j76324K8930c922B0504a96198C8161
$$ 336749 276284 -78090 324287 46011 -22194 -198518 -169588 -3922 20504 -196198 38161
10244b3171j69959B7687b55234d9139A22036b92527R6031M5388r2664a16862K8763
$$ -23171 -193130 27687 -255234 -49139 122036 -292527 -196496 -151108 -243772 -116862 -88099
10233h8099j52587E2304a44313A20809a3325A18757a47444k4196N0655a0026j53144
$$ -88099 -240686 52304 -144313 120809 -13325 118757 -147444 -171640 -120985 -10026 -163170
10222a63170A39557J8920b02394A49497l3939N1237E3744a42663N2880K2672D6910
$$ -163170 139557 158477 -202394 149497 115558 166795 53744 -142663 -89783 -67111 46910
10210E1478e9531A72288N0662A05230a29345A49450k9059b59844k8325A08105
$$ 51478 -59531 172288 222950 105230 -129345 149450 120391 -259844 -288169 108105
10199C61649c01078i104E6115K8898l0359J13148j4032c4633k635B52200a72080
$$ 361649 -301078 -9104 56115 85013 54654 167802 153770 -34633 -37268 252200 -172080
10187B2077J4974a58993P0004D8962N7243a79393h5571a7768j82796N0680c4717
$$ 22077 37051 -158993 -88989 48962 106205 -179393 -85571 -17768 -200564 -149884 -34717
10175D2899a48303j40280a23017b9326p2567A73615a83531a5599H6166c87917
$$ 42899 -148303 -288583 -123017 -29326 -101893 173615 -183531 -15599 86166 -387917
10164b16257a02371B18154P446e1467k69864J53360A34817c2136k43914i9958
$$ -216257 -102371 218154 225600 -51467 -321331 -167971 134817 -32136 -276050 -99958
10153g0511a6770A92653d7386j237A88712a04042J2505a5033k88454A61399a3898
$$ -70511 -16770 192653 -47386 -48623 188712 -104042 -91537 -15033 -303487 161399 -13898
10141A80002Q7370a22338k47584c1800B41976a8781A5001a71356H7060a75696
$$ 180002 267372 -122338 -369922 -31800 241976 -18781 15001 -171356 87060 -175696
10130a91665B36355a52323L1622I784J00471e0835G528J84351f34913i2314L9104
$$ -191665 236355 -152323 -120701 9784 110255 -50835 7528 191879 -634913 -92314 -53210
10119e3210K5326p9170k92149A03663K8893b55292c3064A01224e3279k6739A45430
$$ -53210 -27884 -107054 -399203 103663 132556 -255292 -33064 101224 -53279 -80018 145430
10107i9965F6577a42620k01461A99700a58891B0478J08148a64758g0639a8634
$$ -99965 66577 -142620 -344081 199700 -158891 20478 128626 -164758 -70639 -18634
10096a86047D7689i5500A0525J23346d1480m2631j99645b8087j69304b1120j33388
$$ -186047 47689 -95500 10525 133871 -41480 -84111 -283756 -28087 -197391 -21120 -154508
10085a54508G3249g6113n6648L3970D2721j769a9328k22186P7944h0001b2644
$$ -154508 73249 -76113 -132761 -98791 42721 40952 -19328 -241514 -163570 -80001 -22644
10073C0053g8946A29561b18817A1327L8532a86370F0486b92388a08453A55565
$$ 30053 -78946 129561 -218817 11327 49859 -186370 60486 -292388 -108453 155565
10062I3959B5682a37429B5851b8626d024k16971A39759b45850J9705i6609n3615
$$ 93959 25682 -137429 25851 -28626 -4024 -220995 139759 -245850 -226145 -96609 -150224
10051a50224O4327j12619Q3735M1858A22669e684C5697K4038i0099r4635c9488
$$ -150224 -85897 -198516 -114781 -72923 122669 -5684 35697 59735 -90099 -184734 -39488
10039E860c71971A5532b84295C01249b75554A90098I1043k5074g0216J4478m0886
$$ 5860 -371971 15532 -284295 301249 -275554 190098 91043 65969 -70216 -55738 -96624
10028i6624L7969G9047a03076k1735b023A52330O4479d5430j27173K5325F0937
$$ -96624 -58655 79047 -103076 -124811 -2023 152330 216809 -45430 -172603 -147278 60937
10016f4788j76086A07030a16428k11978J42957A10061e8229H0886P7913g9833
$$ -64788 -240874 107030 -116428 -328406 -185449 110061 -58229 80886 158799 -79833
10005a58195B56423J02337C5709a79094r7I8145c00159a3102A71851b36110j38132
$$ -158195 256423 358760 35709 -179094 -179191 98145 -300159 -13102 171851 -236110 -374242
9994c74242f5604E1052J33492a84600N3107p5324B52029A07715M3869a93960l0756
$$ -374242 -65604 51052 184544 -184600 -131493 -206817 252029 107715 151584 -193960 -224716
9983b24716B4029K71027G4253k8691R8057h88l02817C3049J75232b72336a10395
$$ -224716 24029 295056 74253 45562 143619 -888 -303705 33049 208281 -272336 -110395
9971b8423j43023C1158J15455n3799k4259c7051B07232a37386B68813q1122G2514
$$ -28423 -171446 31158 146613 92814 68555 -37051 207232 -137386 268813 187691 72514
9959F5068a43688A33552a22002q7821A08710a86090b6643l02841b6766k04230
$$ 65068 -143688 133552 -122002 -209823 108710 -186090 -26643 -329484 -26766 -230996
9949b30996b5272j46504j58077k450a03797N0664B08984a5345C00125c66726M2249
$$ -230996 -25272 -171776 -329853 -332303 -103797 -53133 208984 -15345 300125 -366726 -324477
9938c24477f3270B1634g7208j0894B72917h9768J513j30080f3407A80884a91376
$$ -324477 -63270 21634 -77208 -88102 272917 -89768 -88255 -218335 -63407 180884 -191376
9926h7562A45571a77107d6860k50634A68365D1014a65688B88286g1104J3154B5354
$$ -87562 145571 -177107 -46860 -297494 168365 41014 -165688 288286 -71104 -57950 25354
9914f179n6057B2718G635b79813j00678E9581O3376N9515b04768a7009B80170
$$ -6179 -62236 22718 7635 -279813 -380491 59581 122957 182472 -204768 -17009 280170
9902d76002A01884K94824h5811j73545E2434a22475B02235A00457f1685B81475
$$ -476002 101884 396708 -85811 -259356 52434 -122475 202235 100457 -61685 281475
9891F6080c39779R1668H9390J07142I2143O4003a15500k75020J35867A17259e8866
$$ 66080 -339779 -248111 89390 196532 92143 156146 -115500 -390520 -254653 117259 -58866
9879f9988p9500b8412l0119B9896b97338i247C8901a13115j76551j17171A40989
$$ -69988 -149488 -28412 -58531 29896 -297338 -9247 38901 -113115 -289666 -406837 140989
9867G5250a76677j7376F1961J60370a79652A3025d94756C17280G0909a42619A37654
$$ 75250 -176677 -194053 61961 222331 -179652 13025 -494756 317280 70909 -142619 137654
9855A33822E0082c4286k16902A4357i8435A72602l0128C1361b24787j14914f3807
$$ 133822 50082 -34286 -251188 14357 -98435 172602 142474 31361 -224787 -339701 -63807
9843e2409B61072c0558I4172b4805n5604A49308b36010E0858b5041k14652a12182
$$ -52409 261072 -30558 94172 -24805 -80409 149308 -236010 50858 -25041 -239693 -112182
9831e0883j60509j1741K8218j3805D6951Q2820c55188a32680D535M351J10122
$$ -50883 -211392 -223133 -194915 -208720 46951 129771 -355188 -132680 4535 8886 119008
9820A19008b66588A93971C7212K26152b87292c499k05504A71051b74766H6157
$$ 119008 -266588 193971 37212 263364 -287292 -3499 -209003 171051 -274766 86157
9809b58476N4510N9767D1741h9737D38147a26265E4891M2321R6784g5007A09027
$$ -258476 -203966 -144199 41741 -89737 438147 -126265 54891 97212 193996 -75007 109027
9797h1647k21513g3805o7591f7136C5178J31065B7125b06689q2969K8614i5780
$$ -81647 -303160 -73805 -141396 -67136 35178 166243 27125 -206689 -289658 -261044 -95780
9785g7299H0114J93283p9064a20958N4363B2870b47415P987A7699b48250J2878
$$ -77299 80114 273397 194333 -120958 -66595 22870 -247415 -239428 17699 -248250 -235372
9774b35372A45160a99184J9499O692Q3120k94847A67329b30244B1211L3560i1049
$$ -235372 145160 -199184 -179685 -172993 -89873 -384720 167329 -230244 21211 54771 -91049
9762b23004A11053b14901m4979h9634j02100B34619m6908E6631h4485j80624c5436
$$ -223004 111053 -214901 -259880 -89634 -191734 234619 187711 56631 -84485 -265109 -35436
9750A25372b78963J7187b4164j55010A70742d1292a0022k08654A08641D2075R0368
$$ 125372 -278963 -261776 -24164 -179174 170742 -41292 -10022 -218676 108641 42075 132443
9739A32443K9928a03610A25387K651H914a10067n264J2242B9778a69586N3336
$$ 132443 162371 -103610 125387 128038 8914 -110067 -115331 -103089 29778 -169586 -116250
9728a16250F8000g8072p570A35580c46464h0313L1573j56128a8900o5516l3147
$$ -116250 68000 -78072 -85642 135580 -346464 -80313 -48740 -204868 -18900 -84416 -117563
9717a17563B9173J05512f5137j93431a23984j2620B7403h7959l0080B5836n259
$$ -117563 29173 134685 -65137 -258568 -123984 -136604 27403 -87959 -118039 25836 20577
9706B0577J24403a34174j3528m4085A29092g341k35584A72733a94734n5518h6995
$$ 20577 144980 -134174 -147702 -191787 129092 -7341 -242925 172733 -194734 -250252 -86995
9694g7589o6512K2425q2002R3434o3406j29880J21237I6194b94551e9883a860
$$ -77589 -144101 -121676 -203678 -110244 -173650 -303530 -182293 96194 -294551 -59883 -1860
9682G0287c5438A29255E664J48920J36897b10970a9644m2955k14592a17746r8525
$$ 70287 -35438 129255 5664 154584 291481 -210970 -19644 -62599 -277191 -117746 -216271
9671b16271J03030A13793a00600k74639A24113f6299A20137C7076d1153C76690
$$ -216271 -113241 113793 -100600 -375239 124113 -66299 120137 37076 -41153 376690
9660b80089a13519k49447j68543K27640e1305j4834j64129h3264A06300a44731
$$ -280089 -113519 -362966 -531509 -303869 -51305 -66139 -230268 -83264 106300 -144731
9649A65275b3313B0537b15136H8472H129b56270O9795Q8333C14957i1063A75540
$$ 165275 -23313 20537 -215136 88472 8129 -256270 -186475 -98142 314957 -91063 175540
9637A7354J5109a25957c7712G5761a24739m3341n8349P6059K3200C3402L39792
$$ 17354 32463 -125957 -37712 75761 -124739 -168080 -226429 -150370 -127170 33402 373194
9626C73194e51631a1747k79406N4646J3929A35562e7491k12225R1042d934k03162
$$ 373194 -551631 -11747 -291153 -236507 -222578 135562 -57491 -269716 -178674 -4934 -208096
9615b08096J6904f0583A56120g2609G4321i7837G9302b53316H6090b6273D5503
$$ -208096 -191192 -60583 156120 -72609 74321 -97837 79302 -253316 86090 -26273 45503
9603a55914j0630R76d0331G4020J08982c54783C21258b16722A20817B1514a64680
$$ -155914 -166544 -165568 -40331 74020 183002 -354783 321258 -216722 120817 21514 -164680
9591a85365L5175j16682d1869k5732j1408k713l4515E4574R6445L00045a44494
$$ -185365 -150190 -266872 -41869 -67601 -79009 -81722 -116237 54574 151019 451064 -144494
9579A1260b05299Q1865A13201a47712j54324J29733r824H5303E907J10865j5418
$$ 11260 -205299 -123434 113201 -147712 -302036 -172303 -182127 85303 5907 116772 101354
9568A01354c45948f7728G1052b20708j04879B15287b17228a7180A81202b50628
$$ 101354 -345948 -67728 71052 -220708 -325587 215287 -217228 -17180 181202 -250628
9557a36894L3978B1557a59430P6514m42130e0647q7961C25631c39032J2860J00913
$$ -136894 -102916 21557 -159430 -82916 -525046 -50647 -138608 325631 -339032 -326172 -225259
9546b25259D9706e2011G6944N1751e2866A13339h3178B8399R2971b23815R3893
$$ -225259 49706 -52011 76944 128695 -52866 113339 -83178 28399 121370 -223815 -129922
9535a29922k12592b4068j96690j01706H5505c963j7292k59304D30526a10039A38440
$$ -129922 -342514 -24068 -220758 -322464 85505 -3963 -21255 -280559 430526 -110039 138440
9523h6591I2773m6188c22589J36232B17411d25022A88038b2491l0207D4105J74769
$$ -86591 92773 46585 -322589 -186357 217411 -425022 188038 -22491 -52698 44105 218874
9512B18874G460d00222A89267a16300M7125r5204N9331j35953O5343O616m2240
$$ 218874 7460 -400222 189267 -116300 -69175 -164379 -105048 -241001 -175658 -169042 -211282
9501b11282B9189c23122a22851I4500b55171a05531J6241q3576A57605K7978C1727
$$ -211282 29189 -323122 -122851 94500 -255171 -105531 -89290 -172866 157605 185583 31727
9489a34809N1818a8374j1099l61974N1323g932n3514e156n9918A2589K3962d6849
$$ -134809 -82991 -18374 -29473 -391447 -340124 -7932 -61446 -5156 -65074 12589 36551 -46849
9476a10462d4391j36583d6758B0921a97522E8562a31531A39171A7898m197a96092
$$ -110462 -44391 -180974 -46758 20921 -197522 58562 -131531 139171 17898 13701 -196092
9464a45002d5712A53511K3788a62116j66040E5463F23K47008g2395A03020b8236
$$ -145002 -45712 153511 177299 -162116 -328156 55463 623 247631 -72395 103020 -28236
9452B32925I9058c9292q3713G8475d54410B10138C1633c89842a71893H3563a533
$$ 232925 99058 -39292 -123005 78475 -454410 210138 31633 -389842 -171893 83563 -1533
9440A48924O3534a90273K541d2460j52037C50748a87320p471j76540J71684H2239
$$ 148924 212458 -190273 -187732 -42460 -194497 350748 -187320 -194791 -371331 -199647 82239
9428e5739c99F8469N4178J38400a39650A98041p1482J83594a1475B46967a44501
$$ -55739 -399 68469 122647 261047 -139650 198041 126559 310153 -11475 246967 -144501
9416g0325q4775N2779G4174c47313a31053m41323b73909a25914A43298c34615
$$ -70325 -155100 -102321 74174 -347313 -131053 -572376 -273909 -125914 143298 -334615
9405B37487B4733K8667c9809l8928A98421p4227C7216G541O5159j1457f6160q5192
$$ 237487 24733 53400 -39809 -78737 198421 124194 37216 7541 72700 61243 -66160 -151352
9393a51352G4879i0241A13938a71207D7453J6846P736k5680J23950c64231A20122
$$ -151352 74879 -90241 113938 -171207 47453 64299 72035 46355 170305 -364231 120122
9381a70958j31965a03619k42624E4789d6403k77956I8222L37909f3021m1582k30371
$$ -170958 -302923 -103619 -346243 54789 -46403 -324359 98222 436131 -63021 -104603 -334974
9370c34974M7415B66676A6618a84896l2907e7860D44566a36431l295B2256b47716
$$ -334974 -287559 266676 16618 -184896 -217803 -57860 444566 -136431 -139726 22256 -247716
9358C34339a35026k8762A480a94215f5108a141C4977a49874k33347J55907A15924
$$ 334339 -135026 -163788 1480 -194215 -65108 -1141 34977 -149874 -383221 -227314 115924
9346c60361B3038e3886k29840A29481E6090M9923J81212a4308k93002A0047a2256
$$ -360361 23038 -53886 -283726 129481 56090 106013 287225 -14308 -307310 10047 -12256
9334b25775C0730e3981H0983b19670K4583k71286J69471J33514A63615e4128j09782
$$ -225775 30730 -53981 80983 -219670 -195087 -466373 -296902 -163388 163615 -54128 -163910
9323a63910e4681B97511C7316O4790B2821J01411a44668O1480b1647j95543B4856
$$ -163910 -54681 297511 37316 102106 22821 124232 -144668 -83188 -21647 -217190 24856
9311a64465l4977H3537K1335N9951C9328K07638b81657f5252E7744f2580l1667
$$ -164465 -199442 83537 104872 164823 39328 246966 -281657 -65252 57744 -62580 -94247
9300i4247k74103J52727J8234M4689A11608c2323p1598N0147d027k15947m0640
$$ -94247 -368350 -215623 -197389 -152700 111608 -32323 -103921 -53774 -4027 -219974 -260614
9289b60614J02079G719f2926C3114J91217e99748H2093a50751J8288C519J29293
$$ -260614 -158535 7719 -62926 33114 224331 -599748 82093 -150751 -132463 3519 132812
9278A32812m3891a97394h8465n6942b3081j17830B1380a35621k75799a05869A62816
$$ 132812 88921 -197394 -88465 -145407 -23081 -140911 21380 -135621 -411420 -105869 162816
9266d4758l24922a4063l33807A51837o302b97158A93658i8135A04027b98247M4688
$$ -44758 -369680 -14063 -347870 151837 145535 -297158 193658 -98135 104027 -298247 -253559
9255b53559d547k51508P3170K9863l4782c4995o5756A06201l2507a06107j08396
$$ -253559 -4547 -256055 -182885 -153022 -187804 -34995 -100751 106201 73694 -106107 -214503
9244b14503a06508E3790e7319J6802C6758J70192a96639h7890K287i127B27094
$$ -214503 -106508 53790 -57319 -40517 36758 206950 -196639 -87890 -85603 -9127 227094
9232b7505k01670d7871C619J60496a37917k77549g6625a3705B23496m6376a70127
$$ -27505 -229175 -47871 3619 164115 -137917 -415466 -76625 -13705 223496 177120 -170127
9220i4347p817B0217J03174g7688j97857a06411j09894N5589A71651f5808H5932
$$ -94347 -102164 20217 123391 -77688 -275545 -106411 -216305 -160716 171651 -65808 85932
9208A17863m9046a10569J0814G8789f2384j61466A20510c7980j39975H9252e177
$$ 117863 68817 -110569 -99755 78789 -62384 -223850 120510 -37980 -177955 89252 -5177
9196e842A9575P3326c29489B2727b37914k62487b33533J0506R7540r0772b2063
$$ -5842 19575 92901 -329489 22727 -237914 -500401 -233533 -223027 -125487 -216259 -22063
9184b1118C8618a22557C9338k19c19646a6797m8813j89044A09416a51650I9114
$$ -21118 38618 -122557 39338 39119 -319646 -16797 -65610 -254654 109416 -151650 99114
9172a72905d1448k63560A20064D9822a22883d0259B21329i3413n9775F0892a17400
$$ -172905 -41448 -305008 120064 49822 -122883 -40259 221329 -93413 -153188 60892 -117400
9160c38187n2635C44467j33294b82712j2305a45420a7327j25272c0388j13013
$$ -338187 -390822 344467 211173 -282712 -295017 -145420 -17327 -142599 -30388 -143401
9150a43401a9060j39503D9135c69479b0846k61062A6154c67559a0437k91685J06758
$$ -143401 -19060 -158563 49135 -369479 -20846 -281908 16154 -367559 -10437 -302122 -195364
9139a95364j24452A17312f5977F2848a13034b5414A71120o5542m6368b7135j04312
$$ -195364 -319816 117312 -65977 62848 -113034 -25414 171120 105578 59210 -27135 -131447
9128a31447r406l13556i7771m8272k99911D0545O8854J58997c81488B8946b14031
$$ -131447 -140853 -454409 -97771 -146043 -445954 40545 109399 268396 -381488 28946 -214031
9116E8756b81695f1746q3113C70862b40581A06403A8588L1201b3175k2360q3083
$$ 58756 -281695 -61746 -144859 370862 -240581 106403 18588 49789 -23175 -45535 -128618
9105a28618p6397H337f5654F0500g9912d077l12081B26216a49641C42182a56035
$$ -128618 -205015 8337 -65654 60500 -79912 -4077 -316158 226216 -149641 342182 -156035
9093d8620j18294P7868E0401K01450F9540a68059e2954k1905k13241j88166a4042
$$ -48620 -166914 -89046 50401 251851 69540 -168059 -52954 -74859 -288100 -476266 -14042
9081A45255N4581J29185b82060a15111C634a01214A4454a8835G4814a09551J1782
$$ 145255 199836 329021 -282060 -115111 3634 -101214 14454 -18835 74814 -109551 -97769
9070i7769b023j41750o2972O1997C17013a56673O9433j869j31378e9104I5511
$$ -97769 -2023 -143773 -206745 -144748 317013 -156673 -87240 -89109 -220487 -59104 95511
9058A44248b59095R3701k7316J7047c6316j88294j9377a16825A17698e1221h019
$$ 144248 -259095 -165394 -192710 -175663 -36316 -224610 -243987 -116825 117698 -51221 -8019
9046I8169a83379G98a31669e030A06642b7309A71369G0245b68061j3484J27398
$$ 98169 -183379 798 -131669 -5030 106642 -27309 171369 70245 -268061 -281545 -154147
9035a54147B93486d01921A11821k3838b88816B49757e5878j41549o3239G5766
$$ -154147 293486 -401921 111821 87983 -288816 249757 -55878 -197427 -260666 75766
9024F526J8955M0370i4003D3124P5163C0795N5893K09737a52351N8349M0635A88443
$$ 6526 25481 65851 -94003 43124 118287 30795 86688 296425 -152351 -94002 -53367 188443
9011d302n0352l4839A67911b48081n1867J33420E9987h1580B66675r0253f438
$$ -4302 -54654 -89493 167911 -248081 -299948 -166528 59987 -81580 266675 176422 -6438
8999a76435E2649k5798R1826C2893a94192C04768a48603A39175a47649l04072
$$ -176435 52649 26851 118677 32893 -194192 304768 -148603 139175 -147649 -451721
8989d51721c0107l0766A13041D2981b29303M1425N2198c0412A61373i3841A21017
$$ -451721 -30107 -60873 113041 42981 -229303 -187878 -135680 -30412 161373 -93841 121017
8977B37016n7927h5040k32983A41397c82381G7681B3642a13484k19154H1969J5551
$$ 237016 179089 -85040 -318023 141397 -382381 77681 23642 -113484 -332638 81969 97520
8966I7520a99796d9145j89412j06110a45842F8914b47634e7144k74358J23445
$$ 97520 -199796 -49145 -238557 -344667 -145842 68914 -247634 -57144 -331502 -208057
8956b08057O0207L0061a2639j67267p2926a06551b9209F6056K1606a50528I5756
$$ -208057 -147850 -117789 -12639 -179906 -252832 -106551 -29209 66056 87662 -150528 95756
8944b02088h2202A15149a39445d0356g79A88281c59600I7657b20892G0671A2696
$$ -202088 -82202 115149 -139445 -40356 -779 188281 -359600 97657 -220892 70671 12696
8932H0411B6156h4000E7403a31706r8049p9319B3357O2267j8175b9577J1852E27673
$$ 80411 26156 -84000 57403 -131706 -229755 -309074 23357 85624 67449 -29577 -17725 527673
8919A78919b70171a34901C50865j50267B5999Q9193R7676b1600L771I3128f203
$$ 178919 -270171 -134901 350865 200598 25999 115192 212868 -21600 -17829 93128 -6203
8907d9608p7453A5076L7375R4162M8469a00974B45262A11589b14309A11220i684
$$ -49608 -127061 15076 52451 146613 195082 -100974 245262 111589 -214309 111220 -9684
8895d8161j3742l30183H8295a63838k28433A40171c10150N9732I4305a61332O2102
$$ -48161 -61903 -392086 88295 -163838 -392271 140171 -310150 -250418 94305 -161332 -99230
8884i9230b3604n5130j19413B7829b24627H9329k6430b23802B98537E1251f3705
$$ -99230 -23604 -78734 -198147 27829 -224627 89329 62899 -223802 298537 51251 -63705
8872E0368B3186M1092a82944f9167m4441a4168E4619K78195a42492c8779q8023
$$ 50368 23186 64278 -182944 -69167 -113608 -14168 54619 332814 -142492 -38779 -126802
$$ [...]
##END NTUPLES=NMR SPECTRUM
##END=
