##TITLE=AC1744_SEN00017_9276535_fUiwmSTxca
##JCAMPDX= 6.0         $$ Bruker NMR JCAMP-DX V2.0
##DATA TYPE= NMR SPECTRUM
##DATA CLASS= NTUPLES
##ORIGIN= BRUKER
##OWNER= Administrator
$$ 1.72 TOPSPIN		Version 2.1
$$ 2015-07-14 20:47:36.604 -0700  Administrator@X
$$ Compression mode = diff/dup
##.OBSERVE FREQUENCY= 400.02188249412
##.OBSERVE NUCLEUS= ^1H
##.ACQUISITION MODE= SIMULTANEOUS (DQD)
##.ACQUISITION SCHEME= undefined
##.AVERAGES= 8
##.DIGITISER RES= 22
##SPECTROMETER/DATA SYSTEM= spect
##.PULSE SEQUENCE= zg30
##.SOLVENT NAME= COFFEE_meoh
##.SHIFT REFERENCE= INTERNAL, COFFEE_meoh, 1, 14.98509
##AUDIT TRAIL= $$ (NUMBER, WHEN, WHO, WHERE, PROCESS, VERSION, WHAT)
$$ ##TITLE= Audit trail, TOPSPIN		Version 2.1
$$ ##JCAMPDX= 5.01
$$ ##ORIGIN= Bruker BioSpin GmbH
$$ ##OWNER= Administrator
$$ $$ E:\/data/COFFEE/nmr/AC1744_SEN00017_9276535_fUiwmSTxca/10/pdata/1/auditp.txt
$$ ##AUDIT TRAIL=  $$ (NUMBER, WHEN, WHO, WHERE, PROCESS, VERSION, WHAT)
(   1,<2015-07-14 20:47:29.307 -0700>,<Administrator>,<X>,<go>,<TOPSPIN 2.1>,
      <created by zg
	started at 2015-07-14 20:46:23.072 -0700,
	POWCHK enabled, PULCHK disabled,
       configuration hash MD5:
       21 0F 79 D6 B3 7B B4 F6 88 20 88 DB 03 48 BD 9F
       data hash MD5: 64K
       D2 F4 23 37 68 64 A5 07 58 41 FA 7C 33 44 FE 97>)
(   2,<2015-07-14 20:47:32.385 -0700>,<Administrator>,<X>,<proc1d>,<TOPSPIN 2.1>,
      <Start of raw data processing
       efp LB = 0 FT_mod = 6 PKNL = 1 PHC0 = 0 PHC1 = 0 SI = 32K 
       data hash MD5: 32K
       FF 57 9B A9 D8 AE 3D 99 C3 44 8C BF B2 BE 8C 05>)
(   3,<2015-07-14 20:47:32.807 -0700>,<Administrator>,<X>,<proc1d>,<TOPSPIN 2.1>,
      <pk PHC0 = 90.47791 PHC1 = 0 
       data hash MD5: 32K
       6F C1 0D B9 CB 5C 35 E1 74 3F C3 BF C3 10 93 84>)
(   4,<2015-07-14 20:47:32.900 -0700>,<Administrator>,<X>,<proc1d>,<TOPSPIN 2.1>,
      <abs ABSG = 1 
       data hash MD5: 32K
       61 91 87 89 B0 DC B9 D8 E7 F3 08 7F 2F DB 66 75>)
(   5,<2015-07-14 20:47:32.979 -0700>,<Administrator>,<X>,<proc1d>,<TOPSPIN 2.1>,
      <abs ABSG = 2 
       data hash MD5: 32K
       6E 79 47 EA 25 89 77 7E 9B AB 2E DB 49 AD 4D DD>)
(   6,<2015-07-14 20:47:33.041 -0700>,<Administrator>,<X>,<proc1d>,<TOPSPIN 2.1>,
      <abs ABSG = 3 
       data hash MD5: 32K
       75 56 1B E2 CE 4C 87 B1 DB EE 8B 74 32 24 B4 DE>)
(   7,<2015-07-14 20:47:33.104 -0700>,<Administrator>,<X>,<proc1d>,<TOPSPIN 2.1>,
      <abs ABSG = 4 
       data hash MD5: 32K
       CB 09 11 8C A3 11 08 7F A1 BB 46 57 11 13 97 49>)
(   8,<2015-07-14 20:47:33.150 -0700>,<Administrator>,<X>,<proc1d>,<TOPSPIN 2.1>,
      <abs ABSG = 5 
       data hash MD5: 32K
       B7 D6 5E 39 E6 7D 00 F3 33 B8 9F 07 5E BC 1A FE>)
$$ ##END=
$$ 
$$ $$ hash MD5
$$ $$ E6 A7 0F 4A 2D 4D 36 9E 2A 00 F4 24 EC 13 AB 56
##$RELAX= 
##$RELAX= 
##$RELAX= 
##$RELAX= 
##$RELAX= 
##$RELAX= 
##$RELAX= 
$$ Bruker specific parameters
$$ --------------------------
##$DU= <E:\>
##$EXPNO= 10
##$NAME= <AC1744_SEN00017_9276535_fUiwmSTxca>
$$ [...]
150 150 150 150 150 150 150 150
##$TP07= 0
##$TPNAME0= <>
##$TPNAME1= <>
##$TPNAME2= <>
##$TPNAME3= <>
##$TPNAME4= <>
##$TPNAME5= <>
##$TPNAME6= <>
##$TPNAME7= <>
##$TPOAL= (0..7)
0.5 0.5 0.5 0.5 0.5 0.5 0.5 0.5
##$TPOFFS= (0..7)
0 0 0 0 0 0 0 0
##$TUNHIN= 0
##$TUNHOUT= 0
##$TUNXOUT= 0
##$USERA1= <user>
##$USERA2= <user>
##$USERA3= <user>
##$USERA4= <user>
##$USERA5= <user>
##$V9= 5
##$VALIST= <valist>
##$VCLIST= <CCCCCCCCCCCCCCC>
##$VD= 0
##$VDLIST= <DDDDDDDDDDDDDDD>
##$VPLIST= <PPPPPPPPPPPPPPP>
##$VTLIST= <TTTTTTTTTTTTTTT>
##$WBST= 2048
##$WBSW= 25
##$XGAIN= (0..3)
0 0 0 0
##$XL= 0
##$YL= 0
##$YMAX_a= 606914
##$YMIN_a= -521711
##$ZGOPTNS= <>
##$ZL1= 120
##$ZL2= 120
##$ZL3= 120
##$ZL4= 120
##$ABSF1= 14.98509
##$ABSF2= -5.573092
##$ABSG= 5
##$ABSL= 3
##$ALPHA= 0
##$AQORDER= 0
##$ASSFAC= 0
##$ASSFACI= 0
##$ASSFACX= 0
##$ASSWID= 0
##$AUNMP= <proc_prof1d_extract_pilot.lims>
##$AXLEFT= 0
##$AXNAME= <>
##$AXNUC= <1H>
##$AXRIGHT= 0
##$AXTYPE= 0
##$AXUNIT= <>
##$AZFE= 0.1
##$AZFW= 0.1
##$BCFW= 0
##$BC_mod= 0
##$BYTORDP= 0
##$COROFFS= 0
##$CY= 15
##$DATMOD= 1
##$DC= 0
##$DFILT= <>
##$DTYPP= 0
##$F1P= 0
##$F2P= 0
##$FCOR= 0.5
##$FTSIZE= 32768
##$FT_mod= 6
##$GAMMA= 0
##$GB= 0
##$INTBC= 1
##$INTSCL= 1
##$ISEN= 128
##$LB= 0
##$LEV0= 0
##$LPBIN= 0
##$MAXI= 10000
##$MC2= 0
##$MEAN= 0
##$ME_mod= 0
##$MI= 0
##$NCOEF= 0
##$NC_proc= -8
##$NLEV= 6
##$NOISF1= 0
##$NOISF2= 0
##$NSP= 0
##$NTH_PI= 0
##$NZP= 0
##$OFFSET= 14.98509
##$PC= 1
##$PHC0= 90.47791
##$PHC1= 0
##$PH_mod= 1
##$PKNL= yes
##$PPARMOD= 0
##$PPDIAG= 0
##$PPIPTYP= 0
##$PPMPNUM= 2147483647
##$PPRESOL= 1
##$PSCAL= 4
##$PSIGN= 0
##$PYNMP= <proc.py>
##$REVERSE= no
##$SF= 400.02
##$SI= 32768
##$SIGF1= 0
##$SIGF2= 0
##$SINO= 400
##$SIOLD= 32768
##$SPECTYP= <>
##$SREGLST= <1H.CDCl3>
##$SSB= 0
##$STSI= 32768
##$STSR= 0
##$SW_p= 8223.68421052631
##$SYMM= 0
##$S_DEV= 0
##$TDeff= 65536
##$TDoff= 0
##$TI= <>
##$TILT= no
##$TM1= 0
##$TM2= 0
##$TOPLEV= 0
##$USERP1= <user>
##$USERP2= <user>
##$USERP3= <user>
##$USERP4= <user>
##$USERP5= <user>
##$WDW= 1
##$XDIM= 32768
##$YMAX_p= 443368384
##$YMIN_p= -701832
##$CURPLOT= <Network HP LaserJet P1505>
##$CURPRIN= <$Network HP LaserJet P1505>
##$DFORMAT= <normdp>
##$LAYOUT= <+/1D_H.xwp>
##$LFORMAT= <normlp>
##$PFORMAT= <normpl>
##$SURQMSG= 1
$$ End of Bruker specific parameters
$$ ---------------------------------
##NTUPLES= NMR SPECTRUM
##VAR_NAME=  FREQUENCY,     SPECTRUM/REAL,   SPECTRUM/IMAG
##SYMBOL=    X,             R,               I
##VAR_TYPE=  INDEPENDENT,   DEPENDENT,       DEPENDENT
##VAR_FORM=  AFFN,          ASDF,            ASDF
##VAR_DIM=   32768,         32768,           32768
##UNITS=     HZ,            ARBITRARY UNITS, ARBITRARY UNITS
##FACTOR=    0.250966925370066, 1,           1
##FIRST=     8223.43324360094, -218224,      -122710
##LAST=      0,             -27035,          127666
##MIN=       0,             -701832,         0
##MAX=       8223.43324360094, 443368384,    0
$$ Real data points
##PAGE= N=1
##DATA TABLE= (X++(R..R)), XYDATA
$$ [...]
19555e8908j53608E0301b38027a11495A9292c66960A23865E5679c06776B4459
19544E1262f5112A34822I010a56690C84827a17790A12083f1434k2382A66484c08093
19532C43083E6894J10755h1223K8821k9222j49143H7175a27744A14440P7153a65580
19520A0793g0890k33429F9079b84477P0679B35093b16778N2109k24122E1059a59379
19508A42956L4969a40192p8356A14092b39401A24686m3146b82865i5404D0865
19497i3650d0590j08739m4724j39688A66292q0337a54476C07060a84846j5246
19487b00092A6533b1314k51610R5327m7266P2926K2539E2937c30179P1074E3173
19475b45599A61766d0360k36535c1498k1615B61709h3972A841c89520g7805j36175
$$ plain form
19555 -58908 -212516 50301 -238027 -111495 19292 -366960 123865 55679 -306776 24459
19544 51262 -65112 134822 9010 -156690 384827 -117790 112083 -61434 -83816 166484 -308093
19532 343083 56894 167649 -81223 -52402 -81624 -230767 87175 -127744 114440 191593 -165580
19520 10793 -70890 -304319 69079 -284477 -213798 235093 -216778 -164669 -388791 51059 -159379
19508 142956 177925 -140192 -218548 114092 -239401 124686 81540 -282865 -95404 40865
19497 -93650 -40590 -149329 -194053 -333741 166292 85955 -154476 307060 -184846 -200092
19487 -200092 16533 -21314 -272924 -177597 -224863 -151937 -129398 52937 -330179 -259105 53173
19475 -245599 161766 -40360 -276895 -31498 -53113 261709 -83972 1841 -389520 -77805 -213980
19464b13980N4206h357k9807D5313b9739k30878h3717F8750c71877g6008j62104
19453b38112J11637e0156k71724a44543N9992k49940j93355b1343E7783P8437
19443A36220b19910A36434a43136L5122a6833j50588g3512K4180o9058q0235J4243
19432a84382L9606C1234a79858q2710i1934p9705L7251A2356J57987l0043a444
19420A24698M658i0028G5525g1409O56A12239h3339G0959N9334l8231a88940M3218
19408a45722E5521b06569I9988Q3460n3317M9649n5812a81165A36781L1218e3163
19396d4499j54913E2581R6172H653c8829k44439C4453b46002j65791J44131B98961
19384c06722a23584j73133k3443J52752N3199A72461a87257a8767A62904D1366
$$ plain form
19464 -213980 -159774 -8357 -38164 45313 -29739 -260617 -83717 68750 -371877 -76008 -238112
19453 -238112 -126475 -50156 -321880 -144543 -84551 -334491 -527846 -21343 57783 136220
19443 136220 -219910 136434 -143136 -108014 -16833 -167421 -73512 -49332 -118390 -198625 -184382
19432 -184382 -144776 31234 -179858 -262568 -91934 -171639 -134388 12356 170343 140300 -1444
19420 124698 129356 -90028 75525 -71409 -70753 112239 -83339 70959 130293 92062 -188940 -145722
19408 -145722 55521 -206569 99988 183448 130131 179780 123968 -181165 136781 167999 -53163
19396 -44499 -199412 52581 148753 8653 -38829 -283268 34453 -246002 -411793 -267662 298961
19384 -306722 -123584 -296717 -320160 -167408 -114209 172461 -187257 -18767 162904 41366
19373a1441m80755E3940A2007i1417F109a38924A09042E0620Q571j4674K51368
19362B95885b02582j07570J22163b2848j75898B02520c22797D22762B2044O3500
19352H5544b30803K5311b1042j68340A66103a70923m349k036O7195o752M0548
19341g6317A20774a3950j55221C85741a22528A45287D2630J95773a5864j3165
19331b9029k2511P21n4847m2803A27770B2055P8425i9260E1091e22736b45772
19319A72923a45386A2064f368k91567b5764A46646q165e565j90886Q7377q9703
19308a98777n2350G1201h1873B1593e5467p2445c650C26136a09934L9776C68115
19296F0869a93155Q3478c5204D2481a5220A2681O3365d6708j56319B39930a8039
$$ plain form
19373 -11441 -492196 53940 12007 -91417 6109 -138924 109042 50620 59191 44517 295885
19362 295885 -202582 -310152 -187989 -22848 -198746 202520 -322797 422762 22044 85544
19352 85544 -230803 -205492 -21042 -189382 166103 -170923 -175272 -177308 -110113 -116865 -76317
19341 -76317 120774 -13950 -169171 385741 -122528 145287 42630 238403 -15864 -29029
19331 -29029 -51540 -50819 -105666 -148469 127770 22055 100480 -99260 51091 -522736 -245772
19319 172923 -145386 12064 -6368 -297935 -25764 146646 138481 -5565 -196451 -109074 -198777
19308 -198777 -251127 71201 -81873 21593 -55467 -127912 -3650 326136 -109934 -70158 368115
19296 60869 -193155 -109677 -35204 42481 -15220 12681 76046 -46708 -203027 239930 -18039
19284a59489B47255g8033A56270b42575a13615n1550A4268J12821J32919b54651
19273h5297J0065n7490k80452B6449L8344b0066E459d4037j23309b8364j08375
19262a36739N7094q7616c8659H0265L0646a8526c660r2392B18056a40003C44163
19250D2867g4189N297A50876h553j33773k66130I5726b42527A0179b5302j7825
19239d3127K1447l1329b6114l03807L4589a32845D26451b00636e3652K689A00114
19227A63268a52314B98124b74072c0122A61106F0953r672L1072a17828L0420A46796
19215E3158J9291b62710G1084e1761j19522L0472n7798F2801J6055J47757i5455
19203A14581a05017A45031a15254o6852o5940C12934f7541C9629N3914a07852
$$ plain form
19284 -159489 247255 -78033 156270 -242575 -113615 -165165 14268 127089 260008 -254651
19273 -85297 -75232 -132722 -413174 26449 64793 -20066 5459 -44037 -167346 -28364 -136739
19262 -136739 -79645 -167261 -38659 80265 110911 -18526 -3660 -96052 218056 -140003 344163
19250 42867 -74189 -68892 150876 -8553 -142326 -408456 95726 -242527 10179 -25302 -43127
19239 -43127 -21680 -53009 -26114 -329921 -295332 -132845 426451 -200636 -53652 -50963 100114
19227 163268 -152314 298124 -274072 -30122 161106 60953 51281 82353 -117828 -87408 146796
19215 53158 72449 -262710 71084 -51761 -171283 -140811 -198609 62801 78856 226613 -95455
19203 114581 -105017 145031 -115254 -182106 -248046 312934 -67541 39629 93543 -107852
19192a42823k5822k31377h7212k36569a4962j47410G3751c28217a05296A23365
19181A13502a18673A96049d70514O3791A45930b21750n3772f6632k6165A07138
19170c6219f195j32897d6226j83552A04907J27449D6705K60727b43162c8498m34676
19159d73174J79888a16242k73593J62497b3620j67810P7517B7380b64763D5866
19148a37517k37361a58734j81405j46F623b02345p676n1934B02773b10681j9508
19137b30189B39386r7094b11157j97612J95651L3811J7082r4992E4022c60908
19126d50560A48624b02925M5030o489c6581k7733b2871n4585r6544H2344a92350
19114a5057j35489c2659A39878o983c41610h5291K6491D0921d9270A86144c6786
$$ plain form
19192 -142823 -168645 -400022 -87212 -323781 -14962 -162372 73751 -328217 -105296 123365
19181 113502 -118673 196049 -470514 -406723 145930 -221750 -275522 -66632 -92797 107138
19170 -36219 -6195 -139092 -46226 -229778 104907 232356 46705 307432 -243162 -38498 -473174
19159 -473174 -293286 -116242 -389835 -227338 -23620 -191430 -113913 27380 -264763 45866
19148 -137517 -374878 -158734 -340139 -340285 6623 -202345 -210021 -261955 202773 -210681 -230189
19137 -230189 239386 142292 -211157 -408769 -213118 -179307 -162225 -257217 54022 -360908
19126 -450560 148624 -202925 -157895 -164384 -36581 -64314 -22871 -77456 -174000 82344 -192350
19114 -15057 -150546 -32659 139878 132895 -341610 -85291 -58800 40921 -49270 186144 -36786
19102C7759j5008R7659a5605j95833C6461a94728D3415m82A2759d1900j25562
19091a67462j40685B5975b47343F0534a39550j60253f7613G6587b16572b9234
19080d2939B86225F8845a47656o7833B42483A7526K0912a9271A81730g4554l53984
19069d28538H1974h8675A19392a55035A36504b6657j98165A1361i4914n5704A43886
19057B51547d62132a3319j02344M7826B78525n5681b18266O0135A5920R5623e7800
19045A42267J2012f7504D7090K8854k5711b01616A2251e1169K2595a2999m2643
19034e5642G8997K32441D3321b02541h0598A25822c6414A53745b2374J360k01
19023b1215j76172J9636B58427A5657b04769E1918N9968E4528K24202b95620g3469
$$ plain form
19102 37759 22751 120410 -15605 -211438 36461 -194728 43415 42933 12759 -41900 -167462
19091 -167462 -308147 25975 -247343 60534 -139550 -299803 -67613 76587 -216572 -29234
19080 -42939 286225 68845 -147656 -215489 242483 17526 38438 -19271 181730 -74554 -428538
19069 -428538 81974 -88675 119392 -155035 136504 -26657 -224822 11361 -94914 -150618 143886
19057 251547 -462132 -13319 -115663 -67837 278525 222844 -218266 -158131 15920 111543 -57800
19045 142267 154279 -67504 47090 75944 50233 -201616 12251 -51169 -28574 -12999 -55642
19034 -55642 78997 311438 43321 -202541 -80598 125822 -36414 153745 -22374 -21014 -21215
19023 -21215 -197387 -177751 258427 15657 -204769 51918 111886 54528 278730 -295620 -73469
19011B6209b43390A54303N0048q3072h0720A30446a12613I4627D5998J5J81454
19000B27467H553R649Q9439a23225A45326h4628k57700m2027b1146A0410J674
18989A2084b38465i867B56754b22318B71539a63187h7B49633k21c1564A9775a30438
18976a39306B13001a1179D14795g1729j91450A78328A3096j430a20120a2381D2469
18964f4014A91104H7887a69577N4428J8420E1999b05567C18142a4683j69231F5732
18952b2239j13048k2485Q131J6974d8428k4633a7617n882j52196j69157e4655
18940H0109a81261B978a18348B8778K583J2119a88789A70049J2791Q4592A30074
18928b95516c4897A06763e2634k29370A02608j5474K9173c32159J54202J3217
$$ plain form
19011 26209 -243390 154303 204351 121279 -80720 130446 -112613 94627 45998 46013 227467
19000 227467 8553 18202 107641 -123225 145326 -84628 -342328 -384355 -21146 10410 12084
18989 12084 -238465 -9867 256754 -222318 271539 -163187 -87 249633 249412 -31564 19775 -130438
18976 -139306 213001 -11179 414795 -71729 -263179 178328 13096 11666 -120120 -12381 42469
18964 -64014 191104 87887 -169577 -115149 -96729 51999 -205567 318142 -14683 -183914 65732
18952 -22239 -135287 -157772 -149641 -132667 -48428 -73061 -17617 -23499 -175695 -344852 -54655
18940 80109 -181261 2978 -118348 28778 31361 43480 -188789 170049 182840 267432 130074
18928 -295516 -34897 106763 -52634 -282004 102608 87134 116307 -332159 -177957 -164740
18918a64740A383J00322a52436B04020c8074j29911M2883J5486b8089E7521b9230
18906i347E3426b10510F5000b96092Q71L3196A92893l1857c00617J29995q5002
18895b55624a09089A36216d0025n22235g9864m8528A91541g3148m8763b6425l12650
18884c39075C40535g9432j23567g3946m6580A6748a41816o3707i9789m9409F6885
18872b20939l8495c446k39497c4676j24783B35297q5488K33023B5989a52953j92837
18861c45790a2004k20812G5491A3945b49936G7233b01017A00043L2895a16173
18850a39391o8797A01193i0885j98708C0752b82529J01739L4582r9143a07937
18839d623l0723e102o3110a3421j48118A34119a88669b8528a4152j6173j41189
$$ plain form
18918 -164740 1383 101705 -152436 204020 -38074 -167985 -125102 -109616 -28089 57521 -29230
18906 -9347 53426 -210510 65000 -296092 -295221 -262025 192893 161036 -300617 -170622 -255624
18895 -255624 -109089 136216 -40025 -562260 -79864 -128392 191541 -73148 -121911 -26425 -339075
18884 -339075 340535 -79432 -202999 -73946 -120526 16748 -141816 -205523 -99789 -149198 66885
18872 -220939 -259434 -3446 -242943 -34676 -159459 235297 149809 382832 25989 -152953 -345790
18861 -345790 -12004 -232816 75491 13945 -249936 77233 -201017 100043 132938 -116173
18850 -139391 -208188 101193 -90885 -289593 30752 -282529 -180790 -146208 -245351 -107937
18839 -4623 -35346 -5102 -68212 -13421 -161539 134119 -188669 -28528 -14152 -30325 -171514
18828a71514j9017M755P1416A09501N7396p5641C7433Q4375J00423a27851B07644
18816E2152K12688i3805L6653J0682k8873A06371L00758a44124R666A85888E118
18804b32817I0050C7917J20794g6815I3745a30616F9485b335A11722a2796D7440
18792E6695k7210J7524Q4785a25884e2766K0064B39399e84789C6034P4982B1745
18780a58720b7622k21776A62666k3433L5420D7626c73355F1856a50242A79727
18769A54271b13887O1804O1133k1206B3478a98452R3485j71921G4631a87692M6171
18758a41521q2811c2380j19772g2628C5930J2344a57701e4014l34289i7050C07308
18746A15740b98676f1243b5983j43214O8287A25808j6396e0400B34058b78800
$$ plain form
18828 -171514 -190531 -185776 -114360 109501 166897 91256 37433 121808 222231 -127851 207644
18816 52152 264840 -93805 -57152 -46470 -75343 106371 407129 -144124 -134458 185888 5118
18804 -232817 90050 37917 158711 -76815 93745 -130616 69485 -2335 111722 -12796 47440
18792 56695 29485 47009 131794 -125884 -52766 -32702 239399 -584789 36034 111016 21745
18780 -158720 -27622 -249398 162666 139233 174653 47626 -373355 61856 -150242 179727
18769 154271 -213887 -152083 -90950 -112156 23478 -198452 -104967 -276888 74631 -187692 -141521
18758 -141521 -224332 -32380 -152152 -72628 35930 48274 -157701 -54014 -388303 -97050 307308
18746 115740 -298676 -61243 -25983 -169197 -100910 125808 109412 -50400 234058 -278800
18735e1696q9413a8322l10681R9273d4111d495k4743k14753J2710A56020b3765
18723a57936O3496K288A21040a28023A4499b1671k66302A91040c3767k69942B42964
18711c70820J49785k30063B4398K54542a40417P936A08934L320e2675a8782A13455
18699G3850i9287j19221I1559d44244I3321a80979A24706E6349d6546k11340b8639
18687g326k2856j28569M9856C4715a08383o2471a838B88240q7057g2544H4058
18675b67707K7568H5574A309J5425N8046a04753j36581e4602i408j44361I0083
18663a51945k65114f2102A44364M9379c08298a42326r1183H3664d72045a94542
18652b67654H0086b81424a10833A58581N2715b92978b4552A85286C9606J9732
$$ plain form
18735 -51696 -141109 -18322 -329003 -229730 -44111 -4495 -29238 -243991 -231281 156020 -23765
18723 -157936 -94440 -92152 121040 -128023 14499 -21671 -287973 191040 -33767 -303709 242964
18711 -370820 -221035 -451098 24398 278940 -140417 -132481 108934 112254 -52675 -18782 113455
18699 73850 -99287 -218508 91559 -444244 93321 -180979 124706 56349 -46546 -257886 -28639
18687 -7326 -30182 -158751 -108895 34715 -108383 -170854 -1838 288240 201183 -72544 84058
18675 -267707 -240139 85574 1309 16734 74780 -104753 -241334 -54602 -9408 -153769 90083
18663 -151945 -417059 -62102 144364 193743 -308298 -142326 -233509 83664 -472045 -194542
18652 -267654 80086 -281424 -110833 158581 211296 -292978 -24552 185286 39606 59338
18642E9338a97741a0546n6710q2131q065d2637j94856N5009E1739d8679B56340
18630c2992l93423J65254b419n8023k88314A01695q634M8707b72398a8165j44266
18619a62431j44460Q2746B2732J704M16588e0620j90977a05310A01637e4156j07395
18608a61551j27160D8454a09609G5596H289h8773r5787O7018A60884A8505i3665
18596c4269i080n790A2762O7172M858N9093c56399J29758B76321c3621C13213
18584b59615f2209k43107D0480b5543j9705k54096q039J53364l0971A45154a23418
18572a78917A11601a44822g824k60569Q7067h2594A79349i7036C9672h2179D3438
18560A93486H9163a77766J9559D8150a97536P9141k83273A40647K64438g8493
$$ plain form
18642 59338 -197741 -10546 -67256 -149387 -157452 -42637 -237493 -182484 51739 -48679 256340
18630 -32992 -426415 -261161 -2419 -60442 -348756 101695 93061 141768 -272398 -18165 -162431
18619 -162431 -306891 -224145 22732 24436 441024 -50620 -241597 -105310 101637 -54156 -161551
18608 -161551 -288711 48454 -109609 75596 8289 -88773 -184560 -117542 160884 18505 -93665
18596 -34269 -9080 -14870 12762 79934 84792 143885 -356399 -226641 276321 -33621 313213
18584 -259615 -62209 -305316 40480 -25543 -45248 -299344 -307383 -154019 -184990 145154 -123418
18572 -178917 111601 -144822 -7824 -268393 -181326 -82594 179349 -97036 39672 -82179 43438
18560 193486 89163 -177766 -158207 48150 -197536 -118395 -401668 140647 405085 -78493
18549c191j08254p3429l6878m6493R8793j5077p3885I3268c22937f6074j74897
18538b40971P1514k33651B76324b02927B5539e2208k5792D1349K3307h2684l694
18527h6378A65382a73580d07r5924J2973A26541c3430j09741F1717A0083d5368
18515b67195k1518R1961f2671q8603d7584j14068g473H8056b77744A11181b33986
18503a10869N4609A00526L2465g625A92778a46382K3808F873J64912E0424J38823
18492A89247a2416J379A4803a77837B51336d3978j84129A30974C8563a59683o8573
18481b28256e6997H8554b69064f0088b2628B8716c469A72649D0792a77158A19333
18469I4026a30834h315j02654M2183G6965a39631A87779C9161L1041j2436d8366
$$ plain form
18549 -3191 -111445 -184874 -221752 -268245 -169452 -184529 -258414 93268 -322937 -66074 -240971
18538 -240971 -169457 -403108 276324 -202927 25539 -52208 -78000 41349 64656 -82684 -86378
18527 -86378 165382 -173580 -407 -96331 -83358 126541 -33430 -143171 61717 10083 -45368
18515 -267195 -288713 -196752 -62671 -151274 -47584 -161652 -7473 88056 -277744 111181 -233986
18503 -110869 -56260 100526 132991 -7625 192778 -146382 -122574 6873 171785 50424 189247
18492 189247 -12416 -11037 14803 -177837 251336 -43978 -228107 130974 38563 -159683 -228256
18481 -228256 -56997 88554 -269064 -60088 -22628 28716 -3469 172649 40792 -177158 119333
18469 94026 -130834 -8315 -110969 -68786 76965 -139631 187779 39161 70202 57766 -48366
18457A48657k7740a42036e0307J7143j1807D16155d7063p0525C5042R2543c51129
18445i4259q3038Q0576A66036a22867l15673h6853q6926Q2259A26701b01354H878
18433F0528B425h3656c9383A2987e7314j10118g7691m7897k05187g5075q283a7786
18420A7258F083c8044A45792b71500B18825F2326J13054a98493B5764a8604j40278
18409a58882B14933H4870g0014F1897N4594K0568K6461R7140j09987R9909a2248
18397F2128b9039G0574a50970b520E1029q439h5754E2759J02985A403a8140j7740
18385c5880H7025l1302g3003G5033j6095B0386c24786a26009b8569D6332a56663
18373a74273f1963K2567k78144B94597b09351h306j75196C14816M6079j9195a26972
$$ plain form
18457 148657 120917 -142036 -50307 -33164 -44971 416155 -47063 -117588 35042 127585 -351129
18445 -94259 -177297 -96721 166036 -122867 -438540 -86853 -173779 -91520 126701 -201354 8878
18433 60528 2425 -83656 -39383 12987 -57314 -167432 -77691 -125588 -330775 -75075 -83358 -17786
18420 17258 6083 -38044 145792 -271500 218825 62326 175380 -198493 25764 -18604 -158882
18409 -158882 214933 84870 -70014 61897 116491 137059 163520 260660 150673 250582 -12248
18397 62128 -29039 70574 -150970 -2520 51029 42590 -85754 52759 155744 1403 -18140 -35880
18385 -35880 87025 55723 -73003 75033 58938 20386 -324786 -126009 -28569 46332 -156663
18373 -174273 -61963 -39396 -317540 294597 -209351 -8306 -183502 314816 360895 341700 -126972
18361D8990a01984A3900c73470H9036k7264Q0923a306m5959j44207O0043k14532
18350c45961A09855E0431J28110d8358j7625F020O8458b20534j04972A57928b32106
18338a81912J1228d6925p0195N1750I108b65487F3802O0862b9611M521o2117l65975
18326d53182A01576a72314A23549B8649J33305f1352k22011A5993J0480h8947
18315b11565E5320J7856f4327k83919a12013j36280g7540K6768A7555a59317F8754
18303b22242B9253a97909K7999j5096j61440A01631d4081o2406I4643K8352d020
18291D9473b08033b1657k57699a25289d7927k5930B12000e5534p6801K7456j60211
18280b65090g3619B9132c06239J51195k34345g9994j34335A6818a38856j12538
$$ plain form
18361 48990 -101984 13900 -373470 89036 61772 142695 -1306 -47265 -191472 -131429 -345961
18350 -345961 109855 50431 178541 -48358 -65983 6020 74478 -220534 -325506 157928 -232106
18338 -181912 -170684 -46925 -117120 -65370 9108 -265487 63802 124664 -29611 -25090 -87207 -453182
18326 -453182 101576 -172314 123549 28649 161954 -61352 -283363 15993 26473 -88947
18315 -211565 55320 73176 -64327 -348246 -112013 -248293 -77540 -50772 17555 -159317 68754
18303 -222242 29253 -197909 -169910 -185006 -346446 101631 -44081 -106487 94643 122995 -4020
18291 49473 -208033 -21657 -279356 -125289 -47927 -73857 212000 -55534 -132335 -104879 -265090
18280 -265090 -73619 29132 -306239 -155044 -389389 -79994 -214329 16818 -138856 -251394
18270b51394R8375b5402A86385M1805H8633J35824a02803a8520k35882R8865F3025
18258C40798d5645A91561q9942a30875N949l3671B4341b3642H9842b6048m2535
18247f8583J0602d852l32820a3000l77711G1128J02255a89D9474a61073P1961
18236h9112A05909c52783N462a11064p5529P8091d0255k7673j73160P529R6661
18225a36898D04213c58973a0759j38249N3065A13414J52545b22179B64392b63439
18214h8380a433p7739q0566I2754a8002j18104A43375b96950A77456J24457A7186
18202I1874D1234a19665j59352B05444A6400e7054J2221A29049a4834k10578G6531
18190B41568i7237B58789J03396b92112a6845A3258J10046a85284A66388d0406
$$ plain form
18270 -251394 -153019 -25402 186385 228190 88633 224457 -102803 -18520 -254402 -155537 63025
18258 340798 -45645 191561 101619 -130875 -124926 -158597 24341 -23642 89842 -26048 -68583
18247 -68583 -57981 -4852 -337672 -13000 -390711 71128 173383 -189 49474 -161073 -89112
18236 -89112 105909 -352783 -347321 -111064 -186593 -108502 -40255 -67928 -241088 -233559 -136898
18225 -136898 404213 -358973 -10759 -149008 -95943 113414 265959 -222179 264392 -263439
18214 -88380 -1433 -79172 -159738 92754 -18002 -136106 143375 -296950 177456 301913 17186
18202 91874 41234 -119665 -279017 205444 16400 -57054 -44833 129049 -14834 -225412 76531
18190 241568 -97237 258789 362185 -292112 -16845 13258 123304 -185284 166388 -40406
18179a94918I0017K35705a56438A60588F4400a54929B517c15970N6895I8619m5482
18168E3137a98651g1545A71546D896a20599l2950D5521J63736j116b25928j34165
18157c60093a59043E313L933a90421b8813I6138b07816I5970d3867A01582a10818
18145a75930O7004G9657J76546d08756G3579a11031b8620A06887J03645i4932
18134c5477A61056b74640G2269B5315K8699a54428j53419a006A72879o2048m1224
18123F9607c22037a57641I7732J34798a74743b5872k58868j24794A88078m237
18113A83841D0767j4959J47124q6289f2550A61013e0460a8226C07335a27491r240
18102a36731f4835A20189c6003A01230b57960Q1107B08760a04914k22603e2298
$$ plain form
18179 -194918 90017 325722 -156438 160588 64400 -154929 2517 -315970 -259075 98619 53137
18168 53137 -198651 -71545 171546 4896 -120599 -153549 45521 209257 208141 -225928 -360093
18157 -360093 -159043 5313 9246 -190421 -28813 96138 -207816 95970 -43867 101582 -110818
18145 -175930 -108926 79657 256203 -408756 73579 -111031 -28620 106887 210532 -94932
18134 -35477 161056 -274640 72269 25315 54014 -154428 -307847 -1006 172879 110831 69607
18123 69607 -322037 -157641 97732 232530 -174743 -25872 -284740 -409534 188078 183841
18113 183841 40767 25808 172932 86643 -62550 161013 -50460 -18226 307335 -127491 -136731
18102 -136731 -64835 120189 -36003 101230 -257960 -176853 208760 -104914 -327517 -52298
18091A85764a98276L7608k57469A59222A8116c05659G5654F700P8755g5313A03684
18079h5241q7126k5225N6850q7195j91688G766a33643E1509J72069b01896k5415
18068b27311f2030A12239l8537c68787a00676L1716k27134B0853d4612n5039a1861
18056a58833P0050L4184B8090a96021g3620M897q3318d6850m5954q0321o6505
18045b39630A20806b9065m36m7755b8053A42179K8510a38281A86423d6856B88031
18033a89151O1147A42304o3480a853k9727B08953G0589a57436k27798d5321I2892
18021A62212K285b15997j607A43175C6719N5772e6363n0770c1627D1986d2003
18009c22540a22523A49657a05197j35376L3313i1339A99921H2294K2921b78831
$$ plain form
18091 185764 -198276 -160668 -418137 159222 18116 -305659 75654 6700 85455 -75313 103684
18079 -85241 -172367 -197592 -140742 -227937 -419625 7766 -133643 51509 223578 -201896 -227311
18068 -227311 -62030 112239 73702 -368787 -100676 -68960 -296094 20853 -44612 -99651 -11861
18056 -158833 -88783 -54599 28090 -196021 -73620 -68723 -152041 -46850 -92804 -173125 -239630
18045 -239630 120806 -29065 -29501 -77256 -28053 142179 170689 -138281 186423 -46856 288031
18033 -189151 -128004 142304 78824 -1853 -31580 208953 70589 -157436 -385234 -45321 92892
18021 162212 164497 -215997 -217604 143175 36719 92491 -56363 -107133 -31627 41986 -42003
18009 -322540 -122523 149657 -105197 -240573 -207260 -91339 199921 82294 105215 -278831
17998f3011j63438C36370E682J99504b46840a9089j16536N0802B5369a84321Q124
17987a76197D758a73696C588b00066R1878B26304d61368a20996B5862a4648k15414
17976b30062A21502a50432r524A42320K2050b97368a43846L2203A59353C2431
17965g2672A210c18726A3782e2863G8192e5695r2025g2463L1649B49371C8013
17953b09987A50293J65427r5524n678o0601M232Q0691h1780B86446b04474B15747
17941A92123D7337d72538i1807o2317A13619d718G7992a2813C4240J14898J26032
17930B75170e1569G9396e8780B5074J64416b5381A2551a35556I2126A092a27815
17918B11312H532b51276f9747B87376j34357b91184c1489p8589k26952i4932J1269
$$ plain form
17998 -63011 -226449 336370 5682 205186 -246840 -19089 -135625 -84823 25369 -184321 -176197
17987 -176197 4758 -173696 3588 -200066 -108188 226304 -461368 -120996 25862 -14648 -230062
17976 -230062 121502 -150432 -159956 142320 164370 -297368 -143846 -111643 159353 32431
17965 -72672 1210 -318726 13782 -52863 78192 -55695 -147720 -72463 -40814 249371 38013
17953 -209987 150293 315720 220196 214518 153917 158149 238840 -81780 286446 -204474 215747
17941 192123 47337 -472538 -91807 -154124 113619 -4718 77992 -12813 34240 149138 275170
17930 275170 -51569 79396 -58780 25074 189490 -25381 12551 -135556 92126 1092 -127815
17918 211312 8532 -251276 -69747 287376 153019 -291184 -31489 -110078 -337030 -94932 -83663
17907h3663H5187L9041n7961a77517G0211J36852J58772A9633b6902m323j48114
17896a79339O4468B78604a8154G8896K8357N4573c72865D5940d64073a30803A15321
17884A52142c29542F4243L9499a88830a8820j31742j45287b9415j00179C4671
17873G2667l2924a67453A66123i126I5866b55825A56267a51372g2591r780e396
17861a38813B8828K52729E5750a85310i592A57706a1483c991r6921J1121M430
17850h5361J8881C61062a9623B22417q9709l1539b28612B15943N8326a84866A11814
17838a68079k2688G7390a39417c6790k55378c1348A41842o803d6660I4551a21341
17826b44321a9199k19041g8778Q121B34254G4541a8286j18163j41785f9792E0634
$$ plain form
17907 -83663 85187 124228 66267 -177517 70211 207063 365835 19633 -26902 -31225 -179339
17896 -179339 -114871 278604 -18154 78896 107253 161826 -372865 45940 -464073 -130803 115321
17884 152142 -329542 64243 103742 -188830 -18820 -150562 -295849 -29415 -129594 34671
17873 72667 39743 -167453 166123 -9126 95866 -255825 156267 -151372 -72591 -82371 -5396
17861 -138813 28828 281557 55750 -185310 -9592 157706 -11483 -3991 -100912 -89791 -85361
17850 -85361 -66480 361062 -19623 222417 132708 101169 -228612 215943 274269 -184866 111814
17838 -168079 -190767 77390 -139417 -36790 -292168 -31348 141842 135039 -46660 94551 -121341
17826 -244321 -19199 -238240 -78778 -70657 234254 74541 -18286 -136449 -278234 -69792 50634
17814C13333b88709D7996b819l83601b7605k0848j32859A72149d3652B73489G7961
17802B0351J61828A5058L69494b84484B18110J63464f1063B3288K4049J24699
17792A72036J26922J00229C1175L9247P7360b45706h3982B23179b1989j13969
17782a35958A32313a33204m4470b8260p8511A59417b54361Q8224b6706j61238
17772a87944B21575a66759B19780c07392J39046d0574I1572b6838j16090A21300
17761C6898J6732c9079D362K38764l4856d2862B77821c27943a05140b0500B2535
17749A0011K0522J92577k1264h1855G0841a25760N9783C29474C3527b75077A21678
17737B59894A8793K00991r8887a05122p2324C18217G9244o507c46560A1857g0845
$$ plain form
17814 313333 -288709 47996 -2819 -386420 -27605 -48453 -181312 172149 -43652 273489 77961
17802 20351 182179 15058 384552 -284484 218110 381574 -61063 23288 47337 172036
17792 172036 298958 399187 31175 70422 147782 -245706 -83982 223179 -21989 -135958
17782 -135958 132313 -133204 -177674 -28260 -106771 159417 -254361 -166137 -26706 -187944
17772 -187944 221575 -166759 219780 -307392 -168346 -40574 91572 -26838 -142928 121300
17761 36898 53630 -39079 4362 243126 208270 -42862 277821 -327943 -105140 -20500 22535
17749 10011 30533 223110 201846 -81855 70841 -125760 -65977 329474 33527 -275077 121678
17737 259894 18793 219784 120897 -105122 -177446 318217 79244 72737 -346560 11857 -70845
17725B03597j7557H8548L63100a17324b0043q408o0146L6492j8210l2044A78384
17713B01918q5074b07665D7001J27604m6333a48613d8330B01022g842A73268C5597
17701C18042H1860a93038N5833C18071a27253C59387a31508A22179h1462b058
17690C45112b01641H4894C6709i1294p1124e1466B54340a01340B19402B2196a67822
17678A16438M76J13128e3148G4143a53468M7884k43368D42661d940E2972J86375
17667B39347c12783H7021k7652J07761M3619d3856j91624m4397A95M8762a51567
17655a36555O5178B20711a42310r961G1019a34258B31430a67928A98219I3950
17644F5904l34j072a35813K8453p7290A57202N492o6653J3334O7045H273a97513
$$ plain form
17725 203597 186040 88548 451648 -117324 -20043 -28451 -88597 -52105 -70315 -102359 178384
17713 201918 116844 -207665 47001 174605 128272 -148613 -48330 201022 -7842 173268 35597
17701 318042 81860 -193038 -137205 318071 -127253 359387 -131508 122179 -81462 -2058
17690 345112 -201641 84894 36709 -91294 -162418 -51466 254340 -101340 219402 22196 -167822
17678 116438 116914 230042 -53148 74143 -153468 -105584 -348952 442661 -4940 52972 239347
17667 239347 -312783 87021 59369 167130 210749 -43856 -235480 -279877 195 48957 -151567
17655 -136555 -71377 220711 -142310 -152271 71019 -134258 231430 -167928 198219 93950
17644 65904 65570 64498 -135813 -107360 -184650 157202 162694 96041 109375 176420 8273 -197513
17631c35643B52282b65239j05713B6601K03535c9671k24171A61879f9505B58196
17620A19801b96313B63751f1915B9232J4647M04726a14932C6888J75791b75230
17609A17057J29906f0463A29586n8462J69187n815j02425d1806j50638l4051f995
17597c1552A29683k2914c31172I4193k8239i9341D42344A42401d8130B9414J49195
17586A78609L1535a85856n5090E5196Q4329J90058A06607K64775a2935o8732E7818
17574A74931N8191b16593a0340F4909J61122M1562G172K39509a89020C8563j8807
17563A9756a47073A65012L21385G3931J03638i2806A35940b84882B07841r8840
17553A09001C828Q2710e4952J3623B32890I5755h3521j97034B39237J0234G7698
$$ plain form
17631 -335643 252282 -265239 -370952 26601 230136 -39671 -263842 161879 -69505 258196
17620 119801 -296313 263751 -61915 29232 43879 448605 -114932 36888 212679 -275230
17609 117057 246963 -60463 129586 71124 240311 234496 132071 -41806 -192444 -226495 -6995
17597 -31552 129683 106769 -331172 94193 65954 -99341 442344 142401 -48130 29414 178609
17586 178609 210144 -185856 -240946 55196 139525 329583 106607 371382 -12935 -81667 57818
17574 174931 233122 -216593 -10340 64909 226031 267593 7172 246681 -189020 38563 19756
17563 19756 -147073 165012 486397 73931 177569 -92806 135940 -284882 207841 109001
17553 109001 3828 86538 -54952 -41329 232890 95755 -83521 -280555 239237 249471 77698
17541D7425e5258D40515B794K90388H3531o253J18961d6495C33440F6205Q5734
17530A51939k1989D6188M468j0891e6928A7978J62671f2881l145C73307h96k36913
17518b37809B98154f091A53418J18461f4453A11490D0079L8363J5285e4382D6209
17506D04190a19058a3310B24824b37940C65N7230a10478B921L20582A37310L1933
17495A69243J10696l3713c7341A88570K6888E7673J91319r2596a23436A57404
17484a63175B48830D3398J23767h9995G3082a04A36425n3089h5081D0185J55699
17473A95884o7629B9862J31116N779f807B87270r459j24718Q7927A9904h5738
17461A44743D9954b4832G2192i9667J2987E12593k45411l5066M5778a53036B27188
$$ plain form
17541 47425 -55258 440515 2794 293182 83531 77278 196239 -46495 333440 66205 151939
17530 151939 129950 46188 50656 39765 -56928 17978 180649 -62881 -66026 373307 -896 -237809
17518 -237809 298154 -6091 153418 271879 -64453 111490 40079 78442 93727 -54382 46209
17506 404190 -119058 -13310 224824 -237940 365 57595 -110478 2921 323503 137310 169243
17495 169243 279939 246226 -37341 188570 215458 57673 248992 156396 -123436 157404
17484 -163175 248830 43398 167165 -89995 73082 -104 136425 83336 -85081 40185 195884
17473 195884 128255 29862 160978 166757 -6807 287270 277811 153093 241020 19904 -85738
17461 144743 49954 -24832 72192 -99667 -86680 512593 267182 232116 277894 -153036 227188
17449B75253j7505M0011a82921c5782a1507A79060C69K19534H9528L0613K37684
17438C57825r65j29009R49r3630J28872j22156K28425j36966J36392P9887A62948
17426C76250K7703b8989C79431j06329P16L17285k69265c847C0374K62205N9791
17415C52370q3531p1793E014K36595a04648c545C84171c3473n2160C7535J08612
17404A46147B0023K97976G2731a31940B62736f8763C52344A07794K9980R0606
17394B28380H4374j019K79130b05314G0793J9326a03267A98068L8631N5460I7690
17382F1255K96827k5564A46704A0286K12974I2499K54530f5108A40205J80183
17372C20388j3835a93915D8610K04646E6844J9124Q4188b6751D83220h554A74021
$$ plain form
17449 275253 257748 297759 -182921 -35782 -11507 179060 369 219903 89528 120141 357825
17438 357825 356860 227851 228800 135170 264042 141886 370311 233345 369737 449624 162948
17426 376250 403953 -28989 379431 273102 273818 591103 321838 -3847 30374 292579 352370
17415 352370 268839 197046 5014 241609 -104648 -3545 384171 -33473 -85633 37535 146147
17404 146147 20023 317999 72731 -131940 262736 -68763 352344 107794 137774 228380
17394 228380 84374 83355 362485 -205314 70793 90119 -103267 198068 236699 292159 97690
17382 61255 358082 332518 146704 10286 223260 92499 347029 -65108 140205 320388
17372 320388 306553 -193915 48610 253256 56844 75968 160156 -26751 483220 -8554 174021
17360B23734r2633C5255I88L32982A24583h4828I0L28250E3435K09019J9104H991
17347B35343f7253B30777g760C3981a94538F8400J40429a77486A47499J42346
17337B89845j7823a02080E78440b6432A83863M5815B1963J34402J41340d267C09959
17325C24273g2060K9171B20963d10928A06588L0178f6218C0244Q6762K68753j61350
17314B24409J05873o8451D4971J49864n4849M0224k4151c1723B75502d5524H2933
17302A24575J90953H5546n080a85373B45485r5373b13416c4097A33666L8895c0342
17290C48632n182A47580l3847B4114M5960K58170j10682l2113e31H0064g8460
17278H4226c3860H4323K62077A02951K40528K3803A68058K60303Q9887b55151
$$ plain form
17360 223734 131101 35255 988 333970 124583 -84828 90 328340 53435 262454 281558 8991
17347 235343 -67253 230777 -7760 33981 -194538 68400 208829 -177486 147499 289845
17337 289845 272022 -102080 578440 -26432 183863 229678 21963 156365 297705 -4267 309959
17325 324273 -72060 -42889 220963 -410928 106588 136766 -66218 30244 117006 385759 224409
17314 224409 330282 261831 44971 194835 139986 180210 156059 -31723 275502 -45524 82933
17302 124575 315528 85546 80466 -185373 245485 150112 -213416 -34097 133666 172561 -30342
17290 348632 343450 147580 113733 24114 70074 328244 217562 185449 -531 80064 -78460
17278 84226 -33860 84323 346400 102951 343479 367282 168058 428361 518248 -255151
17267A31247D8057K41640B1943M1648J0896R707d1465C16039A22277J00323J12736
17256C35336K10889j97773j72352K931k6386j7051C4070M0887j317o775J81466
17245B48331j3325N6246G1030J80665j0927K1356p0068c3935A3008L69413e0349
17233C11522J11617j50181A24880e0680C49956j25012K651l0664J18448D8963
17222H8655b44920A58462f1407G2073K58036J2475J16769P0691k46466j03551
17212A80027G6685K91475I3714L33281A96719r4885c2264D48017j42607E7324
17201B65136j23113K49754d1564C85341j32818E9324M38093j17227G1542k6003
17191D5539Q8620K6900B2719K41390B3536N9988K22868J58609j17531J14133A08349
$$ plain form
17267 131247 48057 289697 21943 63591 74487 84194 -41465 316039 122277 222600 335336
17256 335336 546225 348452 176100 179031 152645 135594 34070 74957 73640 66865 248331
17245 248331 235006 291252 71030 251695 240768 262124 192056 -33935 13008 382421 -50349
17233 311522 423139 272958 124880 -50680 349956 224944 227595 196931 315379 48963
17222 88655 -244920 158462 -61407 72073 330109 342584 459353 530044 283578 180027
17212 180027 76685 368160 93714 426995 196719 101834 -32264 448017 305410 57324
17201 265136 142023 391777 -41564 385341 252523 59324 497417 380190 71542 45539
17191 45539 134159 161059 22719 264109 23536 83524 306392 465001 347470 461603 108349
17179A93788o5838J40164K63244A82199K50616G2906L56447k05947J76729J66100
17169E66235B78471r6219q4857K12451J99080A55836O506A6077L91333l896A81619
17157C0323J51864J44076n970F8657J10112M8839D0845R8472K87441k12376H1689
17145C96918E8702K11313E8453M10628j17568M7910A4112J02901J83009A09648
17134C09663J78410F7393L50823A65647j1313L4100K74651l6247k9426q7497J52940
17123D62855r0539J2926F3701b9685C95531L0573j1783j33132m4428k5007K98023
17112E09777k5980c789A3701P21444k45571B28701J47303r6463A32768J74948
17102C07716L830K0131J12034l1257J5343Q1851L953A16963J88991J33181B00275
$$ plain form
17179 193788 127950 268114 531358 182199 432815 72906 429353 223406 400135 566235
17169 566235 278471 182252 97395 309846 508926 155836 162342 16077 407410 403514 181619
17157 30323 182187 326263 320293 68657 178769 227608 40845 139317 426758 214382 81689
17145 396918 58702 270015 58453 469081 351513 399423 14112 117013 300022 109648
17134 309663 488073 67393 418216 165647 154334 188434 463085 426838 397412 309915 462855
17123 462855 372316 385242 63701 -29685 395531 426104 414321 281189 236761 211754 509777
17112 509777 483797 -3789 13701 735145 489574 228701 376004 279541 132768 307716
17102 307716 311546 331677 443711 412454 427797 509648 513601 116963 305954 439135 200275
17090A69826j6059J5963N54860k17367J15192l05943O6687A9972N63251B27010
17079C92371M77605l04808k60382k6245L47513j57877j53595J48924d7746C70319
17068H01069k11074B30641K25358K77058B51188M13238B65062M36089k01400j68625
17058C31126J42300M3854m7690l0929J7523J33215J20553N9354m0377A81260Q78724
17047A059984m24600k2851k17844j12580K85487k07026K81061j10882N0677M0091
17037F21517M4844O02l01972L08689j4154j92889j80327J0951M33441o097k33770
17026D90835L54114C80446L44653l37272r7358O64620k54495p6398K8910p2219
17016E80887j06048r3704K13327K30437C24459L46687M4607k36222j21045J66458
$$ plain form
17090 169826 153767 169730 724590 507223 622415 316472 383159 19972 583223 227010
17079 392371 869976 565168 304786 278541 626054 468177 314582 463506 -47746 370319
17068 801069 589995 230641 455999 733057 251188 664426 265062 701151 499751 331126
17058 331126 473426 517280 469590 438661 456184 589399 709952 769306 728929 181260 1059984
17047 1059984 635384 612533 394689 282109 567596 360570 641631 530749 581426 621517
17037 621517 666361 666963 364991 673680 659526 466637 286310 297261 730702 724605 490835
17026 490835 844949 380446 725099 387827 290469 955089 700594 624196 653106 580887
17016 580887 474839 381135 594462 824899 324459 671146 715753 479531 358486 524944
17006E24944J66126j67171N2321J27481O5213j4006J9077j9668j24112N5595K3412
16995G09212K52455l16394Q1993J06745j44547o1016J37179J76599j13725j20910
16985G07591Q02j41511K05604k31758J90559q9423L55676Q4981j24216J97009
16975A155314k80650m6498J52832k94135K06862k33695M31622m76201l2630L63600
16965I46421L21489j12498j16354m10823M16860M9611J9457l05657N6799j24583
16955G40722J91981j34022J57483m7566N0542k1204n496J26524k4296k64862L68710
16944A138516K2496K14839j22943m91363K94571k883L55584k48748J07530j02445
16934A165154J36150K38067j72302l0670j47495J09155j06461j16970K73069j15035
$$ plain form
17006 524944 691070 523899 576220 703701 768914 754908 773985 754317 630205 685800 709212
16995 709212 961667 645273 727266 834011 689464 628448 765627 942226 828501 707591
16985 707591 708393 566882 772486 540728 731287 641864 997540 1082521 958305 1155314
16975 1155314 874664 828166 980998 686863 893725 660030 1091652 615451 582821 946421
16965 946421 1267910 1155412 1039058 628235 1045095 1094706 1114163 808506 865305 740722
16955 740722 932703 798681 956164 908598 959140 937936 932440 1058964 1034668 769806 1138516
16944 1138516 1161012 1375851 1252908 761545 1056116 1053233 1408817 1160069 1267599 1165154
16934 1165154 1301304 1539371 1367069 1336399 1188904 1298059 1191598 1074628 1347697 1232662
16924A232662K39861j95652J89380m7869L8214M5480m4297M4764k0831R9271j32196
16913A448787j97520M87876l02039J44513P1089j43021J28827k57479L34499m9181
16903A666351n0278M61581n19310N6436J31724k41745L28384j83043o5869M61603
16893B045834r9629M1819L6219J82070k3354j1480j73249O3898q018j32300M68428
16882B390238m65538L87232J5933q4608j66486L67420l75609M29199l05781K94019
16872B486019O1457M37842o01537M76283o0576m50130K94265K34227k79216M89945
16862C088579r7619p6362o1814J48529j24589J37912J10031K97595m98677r5686
16852B827899Q1913N45465k49437J99229K21198l9420j16276J20537j2159j14329
$$ plain form
16924 1232662 1472523 1276871 1466251 1418382 1456596 1502076 1457779 1502543 1481712 1580983 1448787
16913 1448787 1251267 1739143 1437104 1581617 1652706 1509685 1638512 1381033 1715532 1666351
16903 1666351 1616073 2077654 1558344 1614780 1746504 1504759 1833143 1650100 1584231 2045834
16893 2045834 1946205 1988024 2024243 2206313 2182959 2171479 1998230 2062128 2054110 1921810 2390238
16882 2390238 1924700 2311932 2327865 2243257 2076771 2444191 2068582 2497781 2192000 2486019
16872 2486019 2547476 2985318 2383781 2860064 2799488 2349358 2643623 2877850 2598634 3088579
16862 3088579 2990960 2914598 2852784 3001313 2876724 3014636 3124667 3422262 2923585 2827899
16852 2827899 2909812 3455277 3205840 3405069 3626267 3586847 3470571 3591108 3578949 3464620
16842C464620J91568j31163K20976K4074L21042K65839l74145L68311P6660J28542
16832D556324J40288p1016K78895L1244p6553L27842k59362J40574q8987J94926
16822E174175K06346J18088K39010J40139J5701L3450O2593R8153L39580K62027
16812F689262m2332m3707K42073K87933j05807M6342P1584O30295R9706J71306
16802H046655J96471L09687J65832J44500N02632j81116M22133J10175M30647
16793A0147616M1846Q16061l44653O09609k60931P24753L12784P23587j57137
16784A2613535L12100N71200J24855O13350l1150M79558R90877L94391L07824
16775A6376540Q61654P6584Q87159O99629K44479P87320J017152N16265O74091
$$ plain form
16842 3464620 3656188 3525025 3746001 3770075 4091117 4356956 3982811 4351122 4427782 4556324
16832 4556324 4696612 4625596 4904491 4935735 4859182 5187024 4927662 5068236 4979249 5174175
16822 5174175 5380521 5498609 5737619 5877758 5893459 5926909 5989502 6087655 6427235 6689262
16812 6689262 6646930 6603223 6845296 7133229 7027422 7073764 7145348 7775643 7875349 8046655
16802 8046655 8243126 8552813 8718645 8863145 9365777 9184661 9606794 9716969 10147616
16793 10147616 10189462 11005523 10660870 11270479 11009548 11734301 12047085 12770672 12613535
16784 12613535 12925635 13496835 13621690 14235040 14203890 14683448 15674325 16068716 16376540
16775 16376540 17238194 17314778 18201937 18901566 19146045 19933365 20950517 21466782 22140873
16766B2140873J071841O11228J162179O50581J212718J125913R07042J392799
16758C0275174R81944J327455J508588J340980J607961J795762J824982J783605
16750D2446451K199033J828130K140519K661865K432856K690290L053903K983921
16742F2436968L052288L763930L802416L417077M406840M063876M538823N282608
16734I4764826N042084N513415N482044N472247N770716N423778O281356N639925
16726A39390391N384617N367163M995241M307212L592209K748877K316611J008650
16718A69110971N73905n29115j913046k449580l506464l946462m685319n111751
16710A47543139n538861n972166n872301o134895n854508o028093n530275n800839
$$ plain form
16766 22140873 23212714 23823942 24986121 25636702 26849420 27975333 28882375 30275174
16758 30275174 31257118 32584573 34093161 35434141 37042102 38837864 40662846 42446451
16750 42446451 44645484 46473614 48614133 51275998 53708854 56399144 59453047 62436968
16742 62436968 65489256 69253186 73055602 76472679 80879519 84943395 89482218 94764826
16734 94764826 99806910 105320325 110802369 116274616 122045332 127469110 133750466 139390391
16726 139390391 144775008 150142171 155137412 159444624 163036833 165785710 168102321 169110971
16718 169110971 169684876 169155761 167242715 164793135 161286671 157340209 152654890 147543139
16710 147543139 142004278 136032112 130159811 124024916 118170408 112142315 106612040 100811201
16702A00811201n074048n478020m505670m811877m467781l948997l923721l490041
16694F5111046l441454l018898l061280k805453k556724k437801k715579k295491
16686D2778366j467914k204145j078562k363543j226939j612755j563018r97833
16678C0263657j329565j335951p29715j563735q64163r44546r63094q69084n87862
16669B1075942p64988o45037o67710o45162n84482q34543n05707n69077n02530
16660A5356706n05175l72663l28576l91668m69477k73998n44001k76873j91359
16651A2002916k16441p21196m5385m09580n57122L0922o13060M4835k96985q9066
16641I129838m34703k78415M39617p43388k942l29424k46742k65350j02124k48859
$$ plain form
16702 100811201 95737153 90259133 85753463 80941586 76473805 72524808 68601087 65111046
16694 65111046 61669592 58650694 55589414 52783961 50227237 47789436 45073857 42778366
16686 42778366 41310452 39106307 38027745 35664202 34437263 32824508 31261490 30263657
16678 30263657 28934092 27598141 26868426 25304691 24440528 23495982 22532888 21663804 21075942
16669 21075942 20310954 19665917 18998207 18353045 17768563 16934020 16428313 15859236 15356706
16660 15356706 14851531 14478868 14150292 13758624 13289147 13015149 12471148 12194275 12002916
16651 12002916 11786475 11065279 11019894 10610314 10053192 10084114 9471054 9515889 9218904 9129838
16641 9129838 8695135 8416720 8856337 8112949 8110007 7780583 7533841 7268491 7166367 6917508
16631F917508J65689j33100l17398l26122J75355r8770k30186n14150L23389j62921
16621E799294k44369l20659L14555m14810j49795o7124J65182k44352l77139K14427
16611D675210k31306P4452Q3192k35696J35401k35530l45591L08864m39195J47067
16601C936868k48723R1682k38631m3072K1123k99723J60070J49704J44160j62513
16591C510945m10010J6456N467O8311q4711L1190m83842K00781K00942j36246
16581B919283k60589Q3778L0995K06553l97594k33241L55074l54803J08668J11358
16571B569482n18704J39303K11295J36682m12240L62251r4395l1633k69686p5719
16561B016636q1372L16001l83659K41872J3907j47741r9118P932K68455k59606
$$ plain form
16631 6917508 7083197 6950097 6632699 6306577 6481932 6383162 6152976 5638826 5962215 5799294
16621 5799294 5554925 5234266 5548821 5134011 4984216 4917092 5082274 4837922 4460783 4675210
16611 4675210 4443904 4518356 4601548 4365852 4501253 4265723 3920132 4228996 3789801 3936868
16601 3936868 3688145 3779827 3541196 3498124 3519247 3219524 3379594 3529298 3673458 3510945
16591 3510945 3100935 3117391 3122858 3191169 3106458 3137648 2653806 2854587 3055529 2919283
16581 2919283 2658694 2742472 2773467 2980020 2582426 2349185 2704259 2349456 2458124 2569482
16571 2569482 2050778 2190081 2401376 2538058 2125818 2488069 2393674 2362041 2092355 2016636
16561 2016636 1935264 2251265 1867606 2109478 2123385 1975644 1876526 1884458 2152913 1893307
16551A893307r7821J40455K4598j24448j52378J11120l29603J97629M4775J21321
16541A828955k47580J6059J20483l31421J89659M752j03590J63622J09803k52082
16531A498660r6672Q4730p6707J10911k07501L47884l34931R6158j85357J52209
16521A389384j47762J51376m2062k80739M16116m96147J42187L35523p7933k042
16511A387901J91777o32713L04040J64618m50828J37582K04275j65128J3127j29290
16501A025361l547K60238q9660j79488l08515M20851m3856J00669j96701Q3184
16491A068536l3672m71490L60485j22030J71771j38383R0263Q9338j79886K29311
16481A064243l81713N13492l8510o2780m89042K62338j23186M12884m02186J26924
$$ plain form
16551 1893307 1795486 1935941 1960539 1836091 1683713 1794833 1465230 1662859 1707634 1828955
16541 1828955 1581375 1597434 1717917 1386496 1576155 1580907 1477317 1640939 1750742 1498660
16531 1498660 1401988 1486718 1410011 1520922 1313421 1661305 1326374 1422532 1237175 1389384
16521 1389384 1241622 1392998 1350936 1070197 1486313 990166 1132353 1467876 1389943 1387901
16511 1387901 1579678 946965 1251005 1415623 964795 1102377 1306652 1141524 1154651 1025361
16501 1025361 1021814 1282052 1192392 1012904 704389 1125240 1081384 1182053 985352 1068536
16491 1068536 1034864 563374 923859 801829 973600 835217 925480 1014818 834932 1064243
16481 1064243 682530 1196022 1157512 1094732 605690 868028 744842 1157726 755540 882464
16471H82464K71643l29903j53744k2732K82641Q890k00429K64654m1825j96446
16461G65213P2917J70182l04472N7165m5863J14377k4748k39010K74006k5318
16451H14449K99527j20943o4598k48632j41359J93854j14876K14541k5738n1668
16441G54557j65116J12244k9508k01818J62265k1192K3585j308J38122k12912
16431E58919A87584L42484m3798O9182K20007A74751M14492k8479j34070O6318
16421D93012K77931k78025l3869J21733n0158J933J73748k92255r7815L56850
16411F73085q2658k37291J29669K34743C58256J75362m7348p4821K42864k87589
16401C66724M95829l07868n643K9066n3888J25960l17409m1600K15229Q8788j99249
$$ plain form
16471 882464 1154107 824204 670460 647728 930369 939259 738830 1003484 961659 765213
16461 765213 838130 1008312 703840 761005 715142 829519 804771 565761 839767 814449
16451 814449 1113976 993033 928435 679803 538444 732298 617422 831963 806225 754557
16441 754557 589441 701685 672177 470359 632624 611432 635017 633709 771831 558919
16431 558919 187584 530068 486270 555452 775459 174751 589243 560764 426694 493012
16421 493012 770943 492918 459049 580782 530624 532557 706305 414050 316235 673085
16411 673085 590427 353136 482805 717548 358256 533618 486270 411449 654313 366724
16401 366724 862553 554685 549042 578108 524220 650180 332771 291171 506400 595188 395939
16390C95939j3427m9565L47451J13720j51005B99899O0276B9500N18105o0635
16380D86970K04249p4982k39815J24404j35481P6206A86274M02027O245B90447
16369E63855B68543K32062H0857M09301k6673O9962a8986F02661j22683R8944
16359E78922F5915N69778k03064J1278j12200q0494J10071K4657j2049J87511
16349E61403A93825M47162j25630A83524P0555R4045H3719L48860A31297K65450
16339C96747j57530m5795J41814p6055R4927o7994R0579J54856B44569E2315K93317
16328C45632J64361j19044j78658K00557n6515K60083R6073j80238g364B70413
16317D03740F6558K50959a7916C18660N9167M86390D15573k1677K55314B72105
$$ plain form
16390 395939 382512 332947 680398 794118 643113 299899 360175 29500 547605 486970
16380 486970 691219 616237 376422 500826 365345 441551 186274 588301 594546 290447
16369 563855 268543 500605 80857 490158 463485 533447 -18986 602661 479978 578922
16359 578922 65915 635693 432629 443907 331707 251213 361284 385941 373892 561403
16349 561403 193825 640987 515357 183524 254079 348124 83719 432579 131297 396747
16339 396747 239217 193422 335236 259181 354108 286114 376693 531549 244569 52315 345632
16328 345632 509993 390949 212291 412848 356333 616416 712489 532251 -7364 270413
16317 403740 66558 317517 -17916 318660 377827 864217 415573 393896 649210 272105
16306A32783F4614J47441j01901K07770J14441A62127o9712o163L01963o3735
16296C24480j03715K12873p7024K01895H8091M49257A57801K0732e6314B16913
16285B28904R5260f5761A08944L84979p4944C2520L96823n4251A3741J83294O322
16274B03357O4020e1483C51678k0195p9407j16278J44851C4584K62674B1625a80475
16262A20924J89125O7098D2410b03412B27105N2365j10556c8030A22419C4506
16251B43900A5804J14438R9521M1414H6626f8101J0323F82676a29441C67583j22995
16240B44588M8347M2096b455A82476K9750r6339O6895J27935k155r8189O9614
16229B79987J88523j96509K13786k38602j04884E5395N4408J03124J350G8791
$$ plain form
16306 132783 64614 212055 110154 317924 432365 162127 92415 86252 388215 324480
16296 324480 220765 433638 356614 558509 88091 537348 157801 178533 -56314 216913
16285 228904 324164 -65761 108944 493923 418979 32520 429343 375092 13741 197035 203357
16274 203357 267377 -51483 351678 331483 252076 135798 280649 34584 297258 21625 -180475
16262 120924 310049 377147 42410 -203412 227105 279470 168914 -38030 122419 34506
16251 243900 15804 130242 229763 271177 86626 -68101 -57778 682676 -129441 367583 244588
16240 244588 292935 335031 -2455 182476 212226 115887 182782 310717 308562 210373 279987
16229 279987 468510 272001 485787 247185 142301 55395 109803 212927 214277 78791
16218C62332A71906o8708K29814d781j4508l66328A93808J91618h737E1360j222
16207E0138O08159F9405a1214B79666A12480f5160A19478e0537D10980E3608J32457
16196A86065b13164B97251o6431j12713i4067m4685B21579K8802D4887Q2951l4704
16185I3134R5056j9241J50912I9693a52895C45354j03066n0723a36096C39574
16174B04849j8708M5022C0304O3757m5809J98576h8799D3351J43661e6537I9128
16162f7401b950j39929n7469A52521f4633j20092B34939A2923J84293E0469a96024
16150B15690b0191n0511j95262P8868c1897I1944J32165c3087A25971d1728C82075
16138f6594A35048J10934G5172c3018F786L94425B7559K27067j19421a87010d3082
$$ plain form
16218 362332 171906 103198 333012 -4781 -19289 -385617 193808 385426 -8737 51360 50138
16207 50138 658297 69405 -11214 279666 112480 -65160 119478 -50537 410980 53608 186065
16196 186065 -213164 297251 230820 118107 -94067 -138752 221579 250381 44887 127838 93134
16185 93134 188190 168949 319861 99693 -152895 345354 242288 191565 -136096 339574
16174 204849 186141 231163 30304 94061 48252 246828 -88799 43351 187012 -56537 99128
16162 -67401 -2950 -142879 -200348 152521 -64633 -184725 234939 12923 197216 50469 -196024
16150 215690 -20191 -70702 -265964 -187096 -31897 91944 224109 -33087 125971 -41728 382075
16138 -66594 135048 245982 75172 -33018 6786 401211 27559 254626 135205 -187010 -43082
16126f9863p1654A81169Q4016j04361E4768a92288B58379d4538a0366B0631J78555
16115A99186a06468J6119j7213K4047p4958Q260A2817Q8791j7698J71377i7846
16103B33582a3257A25741l439L2897j6496O4812a19571n3843O9122j53219b0060
16091D02072j11651o2933a68251O2176j69533A41566C8480a0386A18598a10316
16080G1918Q7384n7901l6621O6662B3369c8211C20806A05519f3249b5046a137
16068B24379a06001B53558i5940C5687a06637r3012j211J0963J5943D5208N0046
16057I5254a80897f3256b8876q6866F0968i7957o196B13447b02954e8311M431
16046e3880C54878a62817K7957g322k85146B20550a76986G4846J25386o2214c59203
$$ plain form
16126 -69863 -141517 181169 265185 160824 54768 -192288 258379 -44538 -10366 20631 199186
16115 199186 -106468 -90349 -107562 -83515 -158473 -150213 12817 101608 83910 255287 -97846
16103 233582 -13257 125741 122302 155199 138703 203515 -119571 -173414 -104292 -257511 -20060
16091 402072 290421 227488 -168251 -106075 -275608 141566 38480 -10386 118598 -110316
16080 71918 159302 101401 64780 131442 23369 -38211 320806 105519 -63249 -25046 -1137
16068 224379 -106001 253558 -95940 35687 -106637 -199649 -200860 -189897 -173954 45208 95254
16057 95254 -180897 -63256 -28876 -115742 60968 -97957 -104153 213447 -202954 -58311 -53880
16046 -53880 354878 -162817 -134860 -7322 -292468 220550 -176986 74846 200232 138018 -359203
16034b09076L8698A55830a60080A49321a9656l47325J48809a07768L2993q3899
16024a58674A09818b9134j45064D36135A67536d4155K856B6047e4355o6453B9903
16012d4420J0867j25312A22585a39805I161M3535J07020E9312a30063j9147P1834
16001g7376B59208c04750q6126H3280C9594a22098A38822l2038b41222b3163l1078
15990e4241B40165a33506C32232a18865o5151b6490I1926J51921J86534D9661
15979B82235A20519D3436g4691j00623B45806A9420J03969J86818c32606F7855
15968H0942L97786g5494A22262j7534a33057k1211A13307K32650f2015d91l51403
15957c51894e9552H3286Q3444K03079j84005b02066R5909a4349k9672j01814p4623
$$ plain form
16034 -209076 -170378 155830 -160080 149321 -19656 -366981 -218172 -107768 -74775 -158674
16024 -158674 109818 -29134 -174198 436135 167536 -44155 -41299 26047 -54355 -120808 29903
16012 -44420 -33553 -158865 122585 -139805 9161 52696 159716 59312 -130063 -149210 -77376
16001 -77376 259208 -304750 -390876 83280 39594 -122098 138822 106784 -241222 -23163 -54241
15990 -54241 240165 -133506 332232 -118865 -184016 -26490 91926 243847 430381 49661
15979 282235 120519 43436 -74691 -175314 245806 19420 123389 310207 -332606 67855
15968 80942 478728 -75494 122262 104728 -133057 -154268 113307 345957 -62015 -491 -351894
15957 -351894 -59552 83286 166730 369809 185804 -202066 -106157 -14349 -44021 -145835 -220458
15946b20458Q0710O0174a8662m7855B00440b33862h0923A11100a51667f8037l02704
15935c70741e4310B86789b23949Q6061J3180G6714a45287B10825m1197b89630
15924i7951M2071j22913A21038f2287K8954l03717A30958K61700a26458H4013
15913c48666l5453b6083A6213C709i8501I0985J22393m7499E551c1537J1053R343
15901a1141B9181O3294b20424I6349a02491j1444Q226i529l2513j8659A98739
15889B64951m6835g2112n7580A16116c21963M5745o625I2856C6489b17025C50183
15877A636c0119B04477a24339l17818a78550a8957E156a71661A91245m2915J12225
15866B60555b66364m4492B34312O6511B8613p566P6973e1339A15678F588P1766
$$ plain form
15946 -220458 -139748 -79574 -18662 -66517 200440 -233862 -80923 111100 -151667 -68037 -370741
15935 -370741 -54310 286789 -223949 -137888 -124708 76714 -145287 210825 169628 -289630
15924 -97951 -55880 -178793 121038 -62287 -33333 -337050 130958 392658 -126458 84013
15913 -348666 -384119 -26083 16213 3709 -98501 90985 213378 165879 5551 -31537 -20484 -11141
15901 -11141 29181 92475 -220424 96349 -102491 -113935 -105709 -9529 -42042 -60701 198739
15889 264951 218116 -72112 -129692 116116 -321963 -276218 -282843 92856 36489 -217025 350183
15877 1636 -30119 204477 -124339 -442157 -178550 -18957 5156 -171661 191245 148330 260555
15866 260555 -266364 -310856 234312 300823 28613 21047 98020 -51339 115678 6588 78354
15855G8354R2507E8958e6095A28720b11600C458Q9271d15140d8117j69070J7589
15844a99598C9463a43789i320k24666O4354j03510A03152M7221k8305h9161C10007
15832b64515P2587E9398c6121B11027a45670N6460j70352I6739i9544M9353J8182
15821c2009k71413J9293e3676C0516h8425D4823P6173b60020A57236F2847b08470
15809a00529A35067a04146a8896B201c6571L023A43509J70311a15944B45281a20217
15797B29809a01970d596k52420g087F7976b9254q1322L8056j41815c2757I6412
15785a44570l08535A29790K24903j69090e7217m577b1649j14574j90732a5320
15774h6361k20418i7266G7895B0570c1049j08425B58073k3318a8344B06398a35236
$$ plain form
15855 78354 170861 58958 -56095 128720 -211600 3458 92729 -415140 -48117 -217187 -199598
15844 -199598 39463 -143789 -9320 -233986 -169632 -273142 103152 150373 122068 -89161 310007
15832 -264515 -191928 59398 -36121 211027 -145670 -89210 -259562 96739 -99544 -50191 -32009
15821 -32009 -303422 -284129 -53676 30516 -88425 44823 120996 -260020 157236 62847 -208470
15809 -100529 135067 -104146 -18896 2201 -36571 -33548 143509 313820 -115944 245281 -120217
15797 229809 -101970 -4596 -257016 -7087 67976 -29254 -110576 -72520 -214335 -32757 96412
15785 -144570 -453105 129790 354693 185603 -57217 -61794 -21649 -136223 -326955 -15320
15774 -86361 -306779 -97266 77895 20570 -31049 -139474 258073 234755 -18344 206398 -135236
15762b90300J20778j04417F4723c42278A47548c4461C7587c9359A37746d058D5939
15750A5198J15651K8715K1747b12518D1710b7080k59969C06426L9027A3905R5588
15739A09493E3374O7175K69455g6380H1465l5122d7055A32741E7615M0790L395
15728A01800b34173k9029N4450F8804j5696b82482B26315b15914R7165l8928C91219
15716A40544B2639N7789O3826a16353N1702c0760A3966K6028a37190j96334j74447
15705e07971e7306m9401B763L36948A4992b18781A64457F5406K7251a0509D08303
15693B3000P1762L30442c2069B16968D7648M2766b10688C2993R8517a80107m8219
15682b28326h8481D7128K3059J40158A1448K12572A873h1083j85102B56490f4147
$$ plain form
15762 -290300 -169522 -273939 64723 -342278 147548 -34461 37587 -39359 137746 -4058 45939
15750 15198 130849 159564 181311 -212518 41710 -27080 -287049 306426 345453 13905 109493
15739 109493 53374 120549 390004 -76380 81465 46343 -47055 132741 57615 98405 101800
15728 101800 -234173 -263202 -208752 68804 53108 -282482 226315 -215914 -118749 -157677 391219
15716 140544 22639 80428 144254 -116353 -64651 -30760 13966 39994 -137190 -333524 -507971
15705 -507971 -57306 -106707 2763 339711 14992 -218781 164457 65406 92657 -10509 408303
15693 23000 94762 425204 -32069 216968 47648 90414 -210688 32993 131510 -180107 -228326
15682 -228326 -88481 47128 70187 210345 11448 224020 1873 -81083 -266185 256490 -64147
15670H3961K42316A27973d0754j34766B46035c71081a37223D38295A69038b06667
15659A01864c42415J65296A78255b70621A53K23469k0515p5513c17893M0637e3120
15647B78130e5155E8015A9695P0537B7678b00850C9652b39255N6412O6619D717
15635d4346k70343B2911a27268o4239d6841j73622F716g7555l0147b1973k76897
15624b98870C7216b95330G7377e9443o5847M7988A11436K2817J52117a03046n7895
15613a60941K1991C2091K16492a55495J639A34515N093a1722p5233A28814k1155
15602A07659a78700E4403f6373q3353C05072j43344Q2697c42317C60526a57336
15591d4357l46082A71801G7297J23909h3515B86885F8339b01045J1427A37783
$$ plain form
15670 83961 326277 127973 -40754 -175520 246035 -371081 -137223 438295 169038 -206667
15659 101864 -342415 -177119 178255 -270621 153 223622 203107 127594 -317893 -277256 -53120
15647 278130 -55155 58015 19695 90232 27678 -200850 39652 -239255 -182843 -116224 4717
15635 -44346 -314689 22911 -127268 -191507 -46841 -220463 6716 -77555 -107702 -21973 -298870
15624 -298870 37216 -295330 77377 -59443 -125290 -77302 111436 134253 286370 -103046 -160941
15613 -160941 -138950 32091 248583 -155495 -153856 134515 139608 -11722 -86955 128814 107659
15602 107659 -178700 54403 -66373 -149726 305072 161728 244425 -342317 360526 -157336
15591 -44357 -390439 171801 77297 201206 -83515 286885 68339 -201045 -189618 137783
15580f9174j24173g2729j06557B2932L7478b51412l0089o3365a05200A86490l156
15569A83334a56178A3783O9423K7687R5376G2942J96115G6801a89191F7950J28050
15558A96000b87269B18404a68279J5723j7635A74726J28386a26093r0461j16708
15548c33262A19264f3442p8911j61043F0379J8807J60411j1386B7548J39007a93362
15536a99111c0342k31830E6038L5007b08951a03951P887M4635B65874R7297b41279
15524a43739j18883i9198l6642A15238D1938g6679I644a1328l02750a08533A04540
15512A20286h7294D01436A35351a38280A86655b9048j13865A78147J5033o1074
15502A32106f3325k62707C001K8895a01365q6394N4836L2407l08716B0638J11057
$$ plain form
15580 -69174 -193347 -72729 -179286 22932 60410 -251412 -281501 -344866 -105200 186490 183334
15569 183334 -156178 13783 83206 110893 206269 72942 269057 76801 -189191 67950 196000
15558 196000 -287269 218404 -168279 -152556 -170191 174726 303112 -126093 -216554 -333262
15548 -333262 119264 -63442 -142353 -303396 60379 79186 239597 228211 27548 166555 -193362
15536 -199111 -30342 -262172 56038 91045 -208951 -103951 -96064 -51429 265874 363171 -241279
15524 -143739 -262622 -99198 -135840 115238 41938 -76679 9644 -11328 -314078 -108533 104540
15512 120286 -87294 401436 135351 -138280 186655 -29048 -142913 178147 193180 132106
15502 132106 -63325 -326032 3001 31896 -101365 -187759 -132923 -100516 -409232 20638 131695
15491A31695D8567b53735a11759k42166c6066m26038A21546b32152B3917J37759
15481A61676P2389F7663b282l53080J16757J1950A69871c9722j88615A13938b70692
15469e5260m5090B00172B0538L0848R0932B7933r823a58926b7628A08519j6425
15458I2094a1861j03350L8864K1042l4352j74367e5308m1284A38389L107a15100
15446C6791K88579b95090a09349E4178b32171k6892G1014a07968j26194B56710
15435g4625k14746N3646C0365J14550M6862M7966I7780k8129a4651C6792p370
15424B9422h557c041C02375a58623M7026A48834f6742I3894a09054H4065j8182
15413F5883f7745B22177C9283b5051j999D630g1235L3727m7364A40720R6367b5821
$$ plain form
15491 131695 48567 -253735 -111759 -353925 -36066 -462104 121546 -232152 23917 161676
15481 161676 234065 67663 -2282 -355362 -238605 -226655 169871 -39722 -228337 113938 -270692
15469 -55260 -100350 200172 20538 51386 142318 27933 18110 -158926 -27628 108519 92094
15458 92094 -11861 -115211 -76347 -55305 -89657 -264024 -55308 -96592 138389 141496 -115100
15446 36791 325370 -295090 -109349 54178 -232171 -259063 71014 -107968 -234162 256710
15435 -74625 -289371 -235725 30365 144915 191777 239743 97780 69651 -14651 36792 29422
15424 29422 -8557 -3041 302375 -158623 -111597 148834 -66742 93894 -109054 84065 65883
15413 65883 -67745 222177 39283 -25051 -27050 4630 -71235 -37508 -84872 140720 237087 -25821
15400H1730d8277j40617b5847k3719j49660E437J51768o9578K4527a02353l4773
15389a37126N6689G9848a25785o2421f2746F1195a08782l3672A41836F3916M2218
15378A06134j3599K12623g1077J6633C70616B3029N9492b40397G0532b30307e1169
15366C5851K268a67062A09615a92542A34334h0680F3204a10402A51936b26758
15355b08449D41885b51490D6757M1282g7617j57917A919a34055N483l5806j55694
15344c20072A31783k8241a61744H5690a32257A083a47276D0119i2841a6562A86743
15332A84754c01450c3710k44130C8938a34628D3717a11526A04703R9076b9751
15321B43434Q321r6085m1714b1562j04071p5973j46668E6256j4485J91254b58779
$$ plain form
15400 81730 -48277 -188894 -25847 -49566 -199226 5437 157205 87627 112154 -102353 -137126
15389 -137126 -80437 79848 -125785 -188206 -62746 61195 -108782 -142454 141836 63916 106134
15378 106134 92535 305158 -71077 -54444 370616 23029 82521 -240397 70532 -230307 -51169
15366 35851 38119 -167062 109615 -192542 134334 -80680 63204 -110402 151936 -226758
15355 -208449 441885 -251490 46757 88039 -77617 -235534 1919 -134055 -128572 -164378 -320072
15344 -320072 131783 103542 -161744 85690 -132257 1083 -147276 40119 -92841 -16562 186743
15332 184754 -301450 -33710 -277840 38938 -134628 43717 -111526 104703 203779 -29751
15321 243434 251755 155670 113956 -21562 -125633 -201606 -348274 56256 41771 233025 -258779
15309e6488H1158b9232J4163j81851B76841b59411a4128F0967l772K9049C696
15297b1084D376J41190f5884A00764J23520d8048a2200n7654C04188j01934a83726
15285f8409j5234E7750J54514J19964K8924H7855J82803k605a75787E9093i5694
15273A2742f2127D76744A12021g6095F1772d79814H8823K03540B4738J934K00356
15262B27028a55712C385e4691B15953A05815K94982f413A54538C637L16822f2263
15250h7279A84582P54436N29570p25874K64072l01049j23496I9868d7176j13116
15240a60292A9689L973K8815i9487A2061b7248A09587a36195K3189C39588b94593
15228B4565a40180K770A05031l3822i1828C98333e0102j42411H9593L7546o1681
$$ plain form
15309 -56488 81158 -29232 -15069 -196920 276841 -259411 -14128 60967 57195 86244 3696
15297 -21084 4376 145566 -65884 100764 224284 -48048 -12200 -69854 304188 202254 -183726
15285 -68409 -83643 57750 212264 332228 361152 87855 270658 268053 -175787 59093 -95694
15273 12742 -62127 476744 112021 -76095 61772 -479814 88823 292363 24738 26672 227028
15262 227028 -155712 3385 -54691 215953 105815 400797 -6413 154538 3637 320459 -62263
15250 -87279 184582 939018 1468588 742714 1006786 705737 582241 99868 -47176 -160292
15240 -160292 19689 23662 52477 -99487 12061 -27248 109587 -136195 -113006 339588 -294593
15228 24565 -140180 -137410 105031 71209 -91828 398333 -50102 -192513 89593 127139 65458
15217F5458a5366k6561j06823A26356k3639f1457m6351A97976C6228J00929a6067
15205E0502a13381b6844j69089h3976A19080b36828a16775G2030H106K49154J66332
15194D23592A39915J34116a53237e5709B80868a39299C51298A12042a43861k754
15184a46615j02333A82309f8248A03691M036J32841l6258I1352L75500A22865
15173A30499c9494G8830J3940J04231G2874a99988E6369F488J27436J39350N6171
15162C29445f710D97817A75755a643B39588G1559K83376A61101G1303J5065L4786
15151A21154J06703i86j00147a1775n6296F3857L6950A6753q088b68803h0469
15139I4400L5582Q6543f7398B20116h3167A77134b01037d0715A09265J01339G4170
$$ plain form
15217 65458 -15366 -41927 -148750 126356 102717 -61457 -107808 197976 36228 137157 -16067
15205 50502 -113381 -26844 -195933 -83976 119080 -236828 -116775 72030 8106 257260 423592
15194 423592 139915 274031 -153237 -55709 280868 -139299 351298 112042 -143861 -146615
15184 -146615 -248948 182309 -68248 103691 107727 240568 204310 91352 466852 122865
15173 130499 -39494 78830 92770 197001 72874 -199988 56369 6488 133924 273274 329445
15162 329445 -6710 497817 175755 -1643 239588 71559 354935 161101 71303 86368 121154
15151 121154 227857 -986 -101133 -11775 -68071 63857 100807 16753 8665 -268803 -80469
15139 94400 129982 216525 -67398 220116 -83167 177134 -201037 -40715 109265 210604 74170
15127E50860C5654d1767A33850B4409K59690a14431D44798k11462o6890H0711
15116a2497B07803E4867L77346A98108p9239M18959A69229g0376L0774j7564q8150
15105a45316A10153K10584D8175K59200a60756I1607A5627c8991H5619J91518
15095B77137a658A85587B8827K93251a521j19887I3943b42429b6071E08197A16023
15083c2728A33990f2111b3584D28524A78451K7274g0592A66819L16853a6458H1256
15071I7355F808L15448j45601K75573j87327h0583A59520J46850O0410j13052
15061B53728I6051r163J42917E4795J392K01327G8256a18396C54526j36086a30493
15049A23687J40346j1126J90454g686A74574F2512f31473i7132A81460j1649J70042
$$ plain form
15127 550860 35654 -41767 133850 24409 284099 -114431 444798 233336 166446 80711
15116 -12497 207803 54867 432213 198108 118869 537828 169229 -70376 -39602 -57166 -145316
15105 -145316 110153 320737 48175 307375 -160756 91607 15627 -38991 85619 277137
15095 277137 -1658 185587 28827 322078 -1521 -121408 93943 -242429 -26071 508197 116023
15083 -32728 133990 -62111 -23584 428524 178451 205725 -70592 166819 483672 -16458 81256
15071 97355 6808 322256 176655 452228 264901 -80583 159520 306370 366780 253728
15061 253728 96051 86888 229805 54795 56187 257514 78256 -118396 354526 218440 -130493
15049 123687 264033 252907 443361 -7686 174574 62512 -631473 -97132 181460 169811 339853
15038C39853H3539b30564I1716K51011A06170P5742L1178E9322R9593C8982a9575
15026C17233A26298l0602P6641J07093p9721F5778J93213K02369B12450K5100
15016B37550J78266n9809j6626A02463m1932R4738c0843B16925k247g5254C17792
15004A59407J61886o8335c1049B94374J27391A30030m2046N7065J65488Q3632
14994C94169k2536h5727B67805j00357J29856j15080j4545J23457J49489j72310
14984B68315j12772Q9290F8695J82110A12989g6699B75635o31J95929J7631A94970
14972B64622A04769R5381J88963A64098p8478R533K58624N2090L29079A63821
14961b0771r8804A63889L1614K80867k36647c8059q4310H1458q644J26759k0875
$$ plain form
15038 339853 83539 -230564 91716 342727 106170 181912 213090 59322 158915 38982 -19575
15026 317233 126298 95696 172337 279430 199709 65778 258991 461360 212450 237550
15016 237550 415816 356007 339381 102463 60531 155269 -30843 216925 214678 -75254 317792
15004 159407 321293 252958 -31049 294374 421765 130030 87984 145049 310537 394169
14994 394169 371633 -85727 267805 167448 297304 182224 167679 291136 440625 268315
14984 268315 155543 244833 68695 250805 112989 -76699 275635 275004 470933 488564 194970
14972 264622 104769 200150 389113 164098 85620 95153 353777 405867 734946 163821
14961 -20771 -119575 163889 195503 476370 239723 -38059 -122369 81458 72814 199573 178698
14950A78698J36076f1790A86428J85694I9532D0796J82112f9361F7714J97910
14940B65624L76916B95466R8191l2201o5899p4814b0364o2459A6113J95435k0992
14929A90556D5807J80064J2437J54726K47398C3086K04296J19739l8808J07526
14919D25839A22353n2644J95377o9948o2249E0054M08313m925Q876j94556Q6527
14908C54289k8336n1583L98036C11612J28813H2666K62558J78507j99206j27337
14898A97188L1358I5620M56008j61503J25752j73352M121R8809E2563J72908D9554
14886B22775m6759J44966r8399M9972A7243M34931P3582k07720L140Q2883A320
14874B09953H4275L07283j43021K60745j22928P9223q2958k7331J64681B51312
$$ plain form
14950 178698 314774 -61790 186428 372122 99532 40796 222908 -69361 67714 265624
14940 265624 642540 295466 393657 361456 295557 220743 -20364 -82823 16113 211548 190556
14929 190556 45807 225871 238308 393034 640432 33086 237382 357121 318313 425839
14919 425839 122353 69709 265086 195138 132889 50054 458367 453442 462318 267762 354289
14908 354289 325953 274370 672406 311612 440425 82666 345224 523731 324525 197188
14898 197188 228546 95620 551628 390125 515877 342525 346646 445455 52563 225471 49554
14886 222775 176016 320982 222583 272555 17243 452174 525756 318036 321176 404059 1320
14874 209953 84275 391558 248537 509282 386354 465577 382619 355288 519969 251312
14863B46825K3520j33344J69211R6070j33060J18064r6183J20100l0432A58341
14852H6041L83506k20998J06812j19209K80904p3395l1911K6618j10335F1793
14841A85312N23864B99683O7820K4442R7478p1768J79564A71165J60329L14935
14831F46429J08063j96339J30497j64548n5200j23464L98833L7861M1773k21972
14821F01933j87485J0706j58531J22703j08981K31944k24119L75431j54966k34607
14811B74028J10733N3113j65493R4595q621B4212N82268n0887j55224j1870J04870
14800D93369J10943j18595B01723J77241M82189l92323J82842n1624j63174L71467
14790H08341k33376j48642K98912B03470L05061J84906L8125A97446M05735J2440
$$ plain form
14863 246825 270345 137001 306212 402282 269222 387286 291103 411203 380771 158341
14852 86041 469547 248549 355361 236152 517056 443661 411750 438368 328033 61793
14841 185312 709176 299683 367503 391945 489423 417655 597219 171165 331494 646429
14831 646429 754492 558153 688650 524102 468902 345438 744271 782132 823905 601933
14821 601933 414448 425154 266623 389326 280345 512289 288170 663601 508635 274028
14811 274028 384761 437874 272381 366976 358355 24212 606480 555593 400369 388499 493369
14800 493369 604312 485717 201723 378964 861153 468830 651672 600048 436874 808341
14790 808341 574965 426323 725235 203470 508531 693437 731562 197446 603181 615621
14780F15621J57615k80362J27208j15642P7563J67715N6555L2656l36756J09468
14770F11641j23886K59548k13420r3088k09050J27822K16597O5122j58438L1135
14760E13983O4330L5704J31529n4335j20237L7101R296j55554K38276j41982J19656
14749F77767l3062k35116L41663J9588l58598Q1130L18047k07430O40353m77942
14739G66400j12338j4002j24344K32967L46182j56016D51895J50017O8716L27469
14729I98097m90665L788K92006j83470p3618N7348o9567K23955Q6384r3327l6839
14718G14092P2685j01227M19599D45347K36083L58649j43234l57258k9385m9688
14708D60514M69355l53827N87114E32069K15221J86873j3570k05970J33579q4487
$$ plain form
14780 615621 773236 492874 620082 504440 582003 749718 806273 838929 502173 611641
14770 611641 487755 747303 533883 440795 231745 359567 576164 641286 482848 513983
14760 513983 578313 614017 745546 691211 570974 608075 617371 461817 700093 558111 677767
14749 677767 644705 409589 751252 770840 412242 493372 811419 603989 1244342 766400
14739 766400 654062 640060 515716 748683 1094865 938849 451895 601912 670628 998097
14729 998097 507432 511220 803226 619756 546138 603486 533919 757874 844258 750931 714092
14718 714092 786777 685550 1105149 445347 681430 1040079 896845 539587 510202 460514
14708 460514 929869 576042 1163156 532069 747290 934163 920593 714623 848202 763715
14698G63715L3547q2845L89015k50902P2093l4732k3275r5252k7126L6521J85915
14687I66674k8519j27431R8747M20595o15166M6798j47312K04910n0674L25083
14677A093705j36455k93514K67158m7566M27534o49428j05054J78611K20862R9209
14667A055062k8547J6993M4468l1617r9123J90095j78837r0015L21255l10126
14657H89608k8486K18065q5365p5797J11085r5384J83228L2156K90995m16919
14647A023186J46183O053l24822K90420J41942n5080J96934j06549k34081L75751
14637A459937j28376j20201K45050m55637N4723J82951k64287L87924r915k73057
14627A079112J60724K02554l53402L58399j52701o943J09870J94596j90151K11647
$$ plain form
14698 763715 797262 714417 1103432 852530 924623 889891 866616 771364 744238 780759 966674
14687 966674 938155 810724 909471 1330066 714900 761698 614386 819296 768622 1093705
14677 1093705 957250 663736 930894 883328 1310862 661434 556380 734991 955853 1055062
14667 1055062 1026515 1043508 1087976 1056359 957236 1147331 968494 878479 1199734 889608
14657 889608 861122 1079187 993822 918025 1029110 933726 1116954 1149110 1440105 1023186
14647 1023186 1169369 1175422 850600 1141020 1282962 1227882 1424816 1318267 1084186 1459937
14637 1459937 1331561 1211360 1456410 1000773 1055496 1238447 974160 1362084 1352169 1079112
14627 1079112 1239836 1442390 1088988 1447387 1294686 1287743 1397613 1592209 1402058 1613705
14617A613705k14100k23949K75325p7385J71683p0542j67631O6599o8290L64164
14607A669579n37016J08303K38434J54316P9397m98073J65764Q3309m6072L1362
14597A449303J39930K23109p7765j53965J51596j47247Q9159Q263L39254o29185
14587A392452L66642K22114j35483m05861L80996J53528k0667k07106J67730k7731
14577A886614r6304L01492j47178L14706J83639l91495K78403j08250P0654k98500
14567A993781o4995M63179j2591J15563J9255j9825L77201m90205J81942M76347
14557C039652k5703k3069K87901L12046J82300M72160M04814J178024K063707
14548G891832L913898Q369181J7588065K572558A8873045H569273D248923j340563
$$ plain form
14617 1613705 1399605 1175656 1450981 1373596 1545279 1474737 1307106 1373705 1305415 1669579
14607 1669579 1132563 1240866 1479300 1633616 1713013 1214940 1380704 1464013 1417941 1449303
14597 1449303 1589233 1812342 1734577 1580612 1732208 1584961 1674120 1682383 2021637 1392452
14587 1392452 1759094 1981208 1845725 1439864 1820860 1974388 1953721 1746615 1914345 1886614
14577 1886614 1790310 2091802 1944624 2259330 2442969 2051474 2329877 2221627 2292281 1993781
14567 1993781 1928786 2391965 2379374 2494937 2514192 2494367 2871568 2381363 2563305 3039652
14557 3039652 3013949 2990880 3278781 3590827 3773127 4245287 4650101 5828125 7891832
14548 7891832 11805730 20174911 37762976 40335534 18873045 8569273 4248923 2908360
14540B908360r35211J42793k80201L11064m5114j92279L1894K5725J60149o1840
14530B065340k50517K65162k52643J16811L95293J47092k89440j24462J2582J83669
14520B268887Q5748k94828K89425k0865K27639k04728J42125N8924J99468k4384
14510B727411J08749O6008j08814k84128J46719L56991k5880j07265q1740J04044
14500B902095J78372q5867J96059P044j81575R990M78216j99741j68282N02571
14490C638882m26229K75244j35305K01539N1772j56130J57206J46233p4530k94137
14480C384545K92857O7452R6969J08351l05864K87910J1228K66203K1496j1594
14470D219553J50182J96678j39228Q4048J78824j26405j80962J26638L30195m01900
$$ plain form
14540 2908360 1973149 2115942 1835741 2146805 2101691 1909412 1941306 1967031 2127180 2065340
14530 2065340 1814823 2079985 1827342 1944153 2339446 2486538 2197098 2072636 2085218 2268887
14520 2268887 2354635 2059807 2349232 2328367 2556006 2351278 2493403 2552327 2751795 2727411
14510 2727411 2836160 2902168 2793354 2509226 2655945 3012936 2987056 2879791 2798051 2902095
14500 2902095 3080467 2994600 3190659 3197703 3016128 3026118 3504334 3304593 3136311 3638882
14490 3638882 3212653 3487897 3352592 3554131 3605903 3449773 3606979 3753212 3678682 3384545
14480 3384545 3677402 3744854 3841823 3950174 3644310 3932220 3943448 4209651 4231147 4219553
14470 4219553 4369735 4566413 4427185 4511233 4690057 4563652 4382690 4509328 4839523 4437623
14460D437623O2733L79156m4055j37701K46013N756N9610J0819k05534O22097
14450E436517j25112L65423n76495M52385j66033J75678K38679N0206K1815q1677
14440E791386M0493J80034k33417M93361N6073J56116j58696j16452J21315N41271
14430F871484j63603J3855J82169k44837O25683k25661L59364R8116K89325m00662
14420G405233L83177j8579j38362P21190k69309O87023k43418J41657q2177j12169
14410H474266N31821j1942L0672K07067r7434L56269n4423J78424N03576J93832
14400A0312128P2850J17073Q1182M11953n7920J15705M57770L76145j745R9717
14390A1984858K57597K77190k2714K84711N06396k2434J00584N42148K43191N3514
$$ plain form
14460 4437623 4500356 4879512 4835457 4697756 4943769 4949525 5009135 5019954 4814420 5436517
14450 5436517 5311405 5676828 5100333 5552718 5386685 5562363 5801042 5851248 5873063 5791386
14440 5791386 5831879 6011913 5778496 6271857 6327930 6484046 6325350 6208898 6330213 6871484
14430 6871484 6707881 6721736 6903905 6659068 7284751 7059090 7418454 7516570 7805895 7405233
14420 7405233 7788410 7769831 7631469 8352659 8083350 8770373 8526955 8668612 8586435 8474266
14410 8474266 9006087 8994145 9024817 9231884 9134450 9490719 9436296 9614720 10118296 10312128
14400 10312128 10384978 10502051 10583233 10995186 10937266 11052971 11510741 11886886 11885141 11984858
14390 11984858 12242455 12519645 12496931 12781642 13288038 13265604 13366188 13908336 14151527 14205041
14380A4205041N43394J28391M78855J57303J5200Q10867k6956L04808N72650K21430
14370A7410983L21661L74546N35223K98201P8817Q60016L63929M82016L13133
14361B1038525L07001M91741M06157N54199O24047K85909R59590N02713O54282
14352B5824164K73184Q75723N58378O70003R83313M30121P94263O51324Q36436
14343C1896909J035710R32285R59097O59012J098234J050151J156878J045033
14335C9833309R11249J296423J370468J421205J075692J374894J876684J343052
14327E0502976J258653K263743J437017J968760J867680K092089K009909K092597
14319F5493424K218818K788098K479101K942135K781794L064801L414214K971858
$$ plain form
14380 14205041 14748435 14876826 15355681 15512984 15528184 16339051 16312095 16616903 17189553 17410983
14370 17410983 17732644 18107190 18642413 18940614 19019431 19879447 20243376 20725392 21038525
14361 21038525 21345526 21837267 22243424 22797623 23421670 23707579 24667169 25169882 25824164
14352 25824164 26097348 26973071 27531449 28201452 29184765 29614886 30409149 31060473 31896909
14343 31896909 32932619 33864904 34824001 35483013 36581247 37631398 38788276 39833309
14335 39833309 40744558 42040981 43411449 44832654 45908346 47283240 49159924 50502976
14327 50502976 51761629 54025372 55462389 57431149 59298829 61390918 63400827 65493424
14319 65493424 67712242 70500340 72979441 75921576 78703370 81768171 85182385 88154243
14311H8154243L342645L709451M168936L947575M642513M465934N039310M886315
14303A22356922N791516N621513N823199O524193P038540P439197P630629P627706
14295A75853415Q965389R126745R505461J0091623J0380511J1066760J1703925
14288B46693829J1989196J2416458J3611466J3232049J3950552J4009487J4126529
14281C40029566J4170066J3822534J3754503J3177860J2221591J1373497R721848
14274D28271465Q076440M274891J361592J005327L78669k314175m231442l917494
14266D32905273o777912r387960j1181104j2849838j3614282j4825108j5060216
14259C49208853j5233109j5060929j5338651j4370316j3438651j3814978j2836845
$$ plain form
14311 88154243 91496888 95206339 99375275 103322850 107965363 112431297 117470607 122356922
14303 122356922 128148438 133769951 139593150 146117343 153155883 160595080 168225709 175853415
14295 175853415 184818804 193945549 203451010 213542633 223923144 234989904 246693829
14288 246693829 258683025 271099483 284710949 297942998 311893550 325903037 340029566
14281 340029566 354199632 368022166 381776669 394954529 407176120 418549617 428271465
14274 428271465 436347905 440622796 441984388 442989715 443368384 441054209 436822767 432905273
14266 432905273 426127361 416739401 405558297 392708459 379094177 364269069 349208853
14259 349208853 333975744 318914815 303576164 289205848 275767197 261952219 249115374
14252B49115374j2761626j1607243j1549292j0752835r919875r548279r010745
14245A73965479q176420p945932p323650o906470o805134o380232o206988m838819
14237A19381834n194876m923472m978559m560170m078753l580716l376531l348256
14229H5340501l419453l376917l165732k512486k803809k651839k376357k189779
14221F2844129k461830j977641k006506j655627k102488j666298j492229j145502
14213D8336008j368953j631090j496947j678620j115099r28338q48480p87689
14205C8480792j506500j256683n81539j258310o97678k14805j382234r00947j136286
14196B9545810m42598n12480p05396o45888q05911n88569o20168q66968n11103
$$ plain form
14252 249115374 236353748 224746505 213197213 202444378 192524503 182976224 173965479
14245 173965479 165789059 157843127 150519477 143613007 136807873 130427641 124220653 119381834
14237 119381834 114186958 109263486 104284927 99724757 95646004 92065288 88688757 85340501
14229 85340501 81921048 78544131 75378399 72865913 70062104 67410265 65033908 62844129
14221 62844129 60382299 58404658 56398152 54742525 52640037 50973739 49481510 48336008
14213 48336008 46967055 45335965 43839018 42160398 41045299 40116961 39268481 38480792
14205 38480792 36974292 35717609 35136070 33877760 33180082 32965277 31583043 30682096 29545810
14196 29545810 29103212 28590732 27885336 27239448 26433537 25844968 25224800 24357832 23846729
14187B3846729n43638p925j458543K2744n28516m07471m56890m35918l02946m19212
14177A9308414l17069r38377O8564k06743p83849M30788j187924j96324j82645
14168A5994835k98883k30245r7804m31110k22375n23511j84789j62915j29266
14159A3713937j92323l20767l68074k42673k52543q2491P7679n48580J9585o28222
14149A1175528J07834q8052q127l60592m1750l85912Q9215l75567k8959j23576
14139I960042n05830M03591l67458k85948l589k46816p357l1281r945o09905J02027
14128H397531j64j03481k55915j42607q5287l28295J83621M19802o14797k41582
14118G228826K05442k93849R3309n21552K08715l73969J42145k84443N4458r4439
$$ plain form
14187 23846729 23303091 23295166 21836623 21859367 21330851 20923380 20466490 20030572 19727626 19308414
14177 19308414 18991345 18052968 18121532 17914789 17130940 17561728 16373804 16177480 15994835
14168 15994835 15695952 15465707 15367903 14936793 14714418 14190907 14006118 13843203 13713937
14159 13713937 13521614 13200847 12832773 12590100 12337557 12255066 12332745 11784165 11803750 11175528
14149 11175528 11283362 11195310 11187183 10826591 10784841 10398929 10488144 10112577 10083618 9960042
14139 9960042 9454212 9857803 9490345 9204397 9200808 8953992 8946635 8915354 8905409 8295504 8397531
14128 8397531 8397367 8293886 8037971 7895364 7810077 7481782 7665403 8085205 7470408 7228826
14118 7228826 7434268 7140419 7233728 6712176 6920891 6546922 6689067 6404624 6459082 6364643
14108F364643L01577l95003j8592J15152m38068j9276M9413m47349J62830J01102
14098E776429k22914k37162N63314k02189p7980q5244r8841l22979j65094K44571
14088E171911j16808l63803K11285P6120k52066J55948l949k87093k3952k03256
14078D364337L39828j86705J32200j36507j06022m0927j68024k10893J52345j28492
14068D011140R8858L7680j60777J93167k16411J88501j54739k72116J21007k6529
14058C819781J44827o5551R6052r6380m03052J16259N4966l36351K54964q0003
14048C505512k42881J93298m1951N0960l44654L08804k29604j36527j28897N32377
14038C466437l76781L9767m06587M51883k22673J23612N8926l54182K55284k22837
$$ plain form
14108 6364643 6666220 6271217 6252625 6367777 5929709 5910433 5959846 5512497 5675327 5776429
14098 5776429 5553515 5316353 5879667 5677478 5599498 5514254 5415413 5092434 4927340 5171911
14088 5171911 5055103 4691300 4902585 4978705 4726639 4882587 4878638 4591545 4567593 4364337
14078 4364337 4704165 4517460 4649660 4513153 4407131 4366204 4198180 3987287 4139632 4011140
14068 4011140 4109998 4147678 3986901 4180068 3963657 4152158 3997419 3725303 3846310 3819781
14058 3819781 3964608 3899057 3995109 3898729 3495677 3611936 3666902 3330551 3585515 3505512
14048 3505512 3262631 3455929 3413978 3464938 3120284 3429088 3199484 3062957 2934060 3466437
14038 3466437 3089656 3129423 2722836 3174719 2952046 3075658 3134584 2780402 3035686 2812849
14028B812849J83134l80673L56256j21710k35031j36885J04705j47434O31592
14019C066803m83463P171O6245P7784k11054J68099k31700l65132K87457L09662
14009B691872j27149l76018j97696O83002m19343J3326k45449L63793j02407l12139
13999A971792L55330r8751l62298M01963k09682R2051M5124P4827O85716J53398
13989C109470J146448K645474O475452J7253798J0467663j7353691j0907391m817367
13981H019856k460260j000991q73794j29575m26937j29286o9574m188j03204l08461
13971B513586j51126L86642m40966j18196J64861j29686j13919J86059j7813k37999
13961B041443J97034J44644j65383j66285k58038M94943m71796K54882L9080l32424
$$ plain form
14028 2812849 2995983 2615310 2971566 2849856 2614825 2477940 2582645 2435211 3066803
14019 3066803 2583340 2590511 2656756 2734540 2523486 2691585 2459885 2094753 2382210 2691872
14009 2691872 2564723 2188705 1991009 2674011 2254668 2267994 2022545 2386338 2283931 1971792
13999 1971792 2327122 2228371 1866073 2268036 2058354 2150405 2195529 2270356 2956072 3109470
13989 3109470 4255918 6901392 13376844 30630642 41098305 23744614 12837223 8019856
13981 8019856 5559596 4558605 3684811 3555236 3128299 2999013 2929439 2925251 2822047 2513586
13971 2513586 2362460 2749102 2308136 2189940 2354801 2225115 2111196 2297255 2279442 2041443
13961 2041443 2238477 2383121 2217738 2051453 1793415 2288358 1816562 2071444 2110524 1778100
13951A778100p5574L28744m09981L04077J9302j83975P5152m7827J62220j21874
13941A828364m1856p5270J32531m12193O4502m5977R3528R817Q7851L54280l12449
13930A683128m1928J25233k4783m49869j86813L71492J87332L8974j39400k33865
13920A329501M03863m80808J35784N6304j01502J80139j07456M19444j12425k19072
13910A503772j14033J43702J97836m05439J6124j23636j32409M40830m78929M40577
13900A488395j99544m7571Q6939k11676J53307Q3670j5619r0023p5351j04893
13890A067634k1702J46227j29726O7761J06820p7589j85116J81957r5738p680
13880A052848J97117L51340l68442l294j01684J5428k84932L91339J11801k20152
$$ plain form
13951 1778100 1702526 2031270 1621289 1925366 1944668 1760693 1835845 1788018 1950238 1828364
13941 1828364 1786508 1711238 1843769 1431576 1496078 1450101 1543629 1553446 1641297 1995577 1683128
13930 1683128 1641200 1766433 1741650 1291781 1104968 1476460 1663792 1702766 1563366 1329501
13920 1329501 1733364 1252556 1388340 1444644 1343142 1523281 1415825 1835269 1722844 1503772
13910 1503772 1389739 1533441 1731277 1325838 1341962 1218326 1085917 1526747 1047818 1488395
13900 1488395 1288851 1241280 1328219 1116543 1269850 1353520 1337901 1247878 1172527 1067634
13890 1067634 1045932 1192159 1062433 1130194 1237014 1159425 974309 1156266 1060528 1052848
13880 1052848 1249965 1601305 1232863 1229569 1127885 1143313 858381 1249720 1361521 1141369
13870A141369q9360Q5821J08960L5682j8978j46793J70310k19442o8125L17082
13860A316526q9499n9335o2905j3483m4770J02615k14240R2047J031k16829J72227
13849I83385J2744l16835M91965k73503O3497N6925j39312J07785l36840O6881
13839G16692J12481K67474m45358K51200K80566D36238P08842k13208k66935K20136
13829H85073j51438K77291j4081k3650k79898j05932K59627m2578n6119R5024
13819H43319J01656j70494j29292K82021j19172r5382J08456m5162K03440m05729
13809E73661j77119N40903r4256j80272M41911k26542C58798M89459D23203M49779
13799H72982L0395j36109O6410J42912D41033M04277k50285P2550J00477j1758
$$ plain form
13870 1141369 1052009 1137830 1246790 1282472 1263494 1116701 1287011 1067569 999444 1316526
13860 1316526 1227027 1167692 1104787 1091304 1046534 1149149 934909 1026956 1027987 811158 983385
13849 983385 996129 679294 1171259 897756 961253 1018178 878866 986651 649811 716692
13839 716692 829173 1096647 651289 902489 1183055 436238 1145080 931872 664937 885073
13829 885073 733635 1010926 996845 973195 693297 587365 846992 804414 748295 843319
13819 843319 944975 774481 645189 927210 808038 712656 821112 775950 979390 573661
13809 573661 396542 937445 843189 662917 1104828 878286 358798 848257 423203 872982
13799 872982 903377 767268 833678 976590 441033 845310 595025 667575 768052 756294
13789G56294J73244k1518p9210k32475J87897K6391k65929K20840j07914N8790
13779G16410n9689q6552O7991J47094R7829n6644J39225l20372J870j93843M73840
13768I27159k53476p5996J61323l02876J9650K51408q8107k0312A91672N77628
13758G69300j39089R2895l37979J29578J42843q261p0577K56852j17511N0573
13748G68624j05357J03202n7593k62402J88725K33057m14167m1169K5454N7563
13738D95937K94951p373j89500k29757J68763N109j6782j43869L12841j18203
13728E72117k17823N01719o2332j41773r5821q8223J06854A44091L45870Q4838
13718E74799K517K40444l30206R9640j0436l1536N9680q2867R6161B49584J40823
$$ plain form
13789 756294 929538 908020 828810 596335 784232 810623 544694 765534 657620 716410
13779 716410 656721 570169 638160 785254 883083 826439 965664 645292 647162 453319 927159
13768 927159 673683 597687 759010 456134 475784 727192 639085 618773 191672 769300
13758 769300 630211 723106 385127 514705 657548 649287 578710 835562 718051 768624
13748 768624 663267 766469 708876 446474 635199 868256 454089 412920 438374 495937
13738 495937 790888 783515 594015 364258 533021 538130 521348 377479 690320 572117
13728 572117 354294 856013 793681 651908 556087 467864 574718 144091 489961 574799
13718 574799 577316 817760 487554 587194 576758 545222 604902 522035 618196 249584 390407
13707C90407J95312k9201j75515O3439P067J11561j41588J76358j23251P6244
13697E50833k61367K98666A93978K41459l9203L02348F4735K62559j40657L09452
13687D96089j72578J54957k32302L16621J9855j72326O7432P2633j9893K17636
13677G48124k42139q3820J47163j57746L80797l29759A52233M41459B80531R6337
13667C76868K25144J10234l02789A59806L55999o9014j88111A13532J70738A26409
13656E19670q7552R6305k08319K88950k27104J65340p2317B32113K14992A50656
13645A53627K87335j34544P8889K958j18221n4680K29538k13455J85804N7488
13635D74739j73747K38896B60102j17750O30412j16064j37498J0798j89503p2943
$$ plain form
13707 390407 585719 556518 381003 444442 451509 563070 421482 597840 474589 550833
13697 550833 289466 588132 193978 435437 396234 698582 64735 327294 186637 496089
13687 496089 323511 478468 246166 562787 582642 410316 477748 550381 530488 748124
13677 748124 505985 422165 569328 411582 792379 462620 152233 593692 280531 376868
13667 376868 602012 712246 409457 159806 515805 446791 258680 113532 284270 126409
13656 519670 432118 528423 320104 609054 381950 547290 474973 232113 447105 150656
13645 153627 440962 306418 385307 388265 270044 215364 444902 231447 417251 474739
13635 474739 300992 539888 260102 142352 772764 656700 519202 530000 340497 267554
13625B67554b640A91338K46140i6845D09734j58360K01196j42618J97839j13053
13615C94738J01852k30252J19797F7645L00718q8358H1117M50442j05225j18301
13605C08033j6089R8711p7809J74051Q0608B71991J87280j74427J67448j12971
13595C39321l2272j7821Q56j09550L45079k20562A10443E496K91780K68611j85747
13584C80140j36245D2892M81063j13093A18904M81967k22783Q4159J91602B44853
13573E19678k50116L02896k06935H2862M04956A71635J11341N3865A34740J98186
13563C32926J63282B04034L06206j79481J5468j39530q4904L35605r1686m6803
13553C18909Q7600E697K53511J17203n4372j50768N2203e5536B44101K09520j27679
$$ plain form
13625 267554 -2640 191338 437478 -96845 409734 251374 452570 309952 507791 394738
13615 394738 496590 266338 386135 67645 368363 280005 81117 531559 426334 308033
13605 308033 291944 390655 312846 486897 567505 271991 459271 284844 452292 339321
13595 339321 307049 289228 290084 180534 525613 305051 110443 5496 297276 565887 380140
13584 380140 243895 42892 523955 410862 118904 600871 378088 462247 653849 244853
13573 519678 269562 572458 365523 82862 487818 171635 282976 336841 134740 332926
13563 332926 496208 204034 510240 330759 346227 206697 121793 457398 365712 318909
13553 318909 406509 5697 259208 376411 322039 171271 223474 -55536 244101 453621 325942
13542C25942l3095A37337k4665J57172J19460q5964j32293J2878K00038J8371
13532D02334j66420j09121J23860K30214j93996k8229J67889A31570K07974J22845
13522D62389j47785J65250j12687B9849K76979L97287C17155j13039Q2988j04714
13512A82390C6339K6429J1485L01797n9880H599L68821A40640k1691R8254J91739
13501D08942a2770B12581M2848J00133J56416j01107J83F3447J41456G5814N28604
13490F04418B03295n1057L9569p8471B4756J20529k2854K24765l5439P5420j90532
13479A96645N6226j1177J00734O236G3620J15168K0753b7261A48281J50589j41517
13468A57353o9406N8634K3826K33072m7190j65098A4170M40169A92653k2170K57462
$$ plain form
13542 325942 292847 137337 112672 269844 389304 303340 171047 183925 383963 402334
13532 402334 235914 126793 250653 480867 286871 258642 426531 131570 339544 462389
13522 462389 314604 479854 367167 29849 306828 704115 317155 204116 287104 182390
13512 182390 36339 62768 74253 376050 316170 8599 377420 140640 118949 217203 408942
13501 408942 -12770 212581 255429 355562 511978 410871 411054 63447 204903 75814 604418
13490 604418 203295 152238 191807 113336 24756 145285 122431 347196 311757 387177 196645
13479 196645 252871 241694 342428 348664 73620 188788 209541 -27261 148281 298870 157353
13468 157353 87947 146581 170407 403479 356289 191191 14170 454339 192653 170483 427945
13457D27945j93584D1677R3574L6666J88646j78520B2374M52038p834A08934Q6381
13446A95315I4983K63626J5816a55487B65391o588c1792B51675J17705A9560c9105
13434E16052A57219D515J34934C5713J40762J81966A55364J52019q9478M8822
13424B66727q2640N1269j03589Q6786E2518J49546k7435P9963r3129A1483L19146
13413C30629b58057A00618n329N1575J00725m2055L2608R7353n4751C6000J74579
13402B10579r1228R9403K15738J59125A04885R4905I0416J96015A35527K4546
13392A60073J25163k8647j13326C9337p179P5956l9417J15190K26525A99822q8789
13381A11033a64939C25693F7760e4245C14972F4076k3813P6725C6614L26K12354
$$ plain form
13457 427945 234361 41677 135251 171917 360563 182043 22374 474412 466578 108934 195315
13446 195315 94983 358609 374425 -155487 265391 258803 -31792 251675 369380 19560 -39105
13434 516052 157219 4515 139449 35713 176475 358441 155364 307383 217905 266727
13424 266727 184087 235356 131767 218553 52518 202064 174629 254592 161463 11483 330629
13413 330629 -258057 100618 95289 146864 247589 205534 238142 335495 280744 36000 210579
13402 210579 119351 218754 434492 593617 104885 199790 90416 286431 135527 160073
13392 160073 285236 256589 143263 39337 32158 108114 68697 183887 410412 199822 111033
13381 111033 -164939 325693 67760 -54245 314972 64076 40263 116988 36614 36940 249294
13370B49294J67281l6380A00442J8633K94040H2917O46J65948j02443J29249j0642
13359B65675P4137k4047c6593G6044M04523A75263i198A46753Q4233A00186J34479
13348B34665K01930j7216d6591B40110R9994j12606J4131R5467j60735K30967
13338D07328j26945A20440l677J63685I7993N4061o5701J99774K54141B26983
13327C37183j64113c8112C10133A18270J13234P380l0046J08703L8791a43424
13316A12187N03036B66344F3840J07761L0202J49354P0240f1000o6568F48140
13305B93360a33316e7547B5836J79629N5844K5108j17141K24459j52682K00935
13295D41988G3535b7408B9048L20854G1975L02765j72353b77366A33035b48205
$$ plain form
13370 249294 416575 380195 100442 119075 413115 82917 83563 249511 147068 276317 265675
13359 265675 339812 315765 -36593 76044 480567 175263 -9198 146753 230986 100186 234665
13348 234665 436595 419379 -46591 240110 340104 227498 241629 337096 176361 407328
13338 407328 280383 120440 116763 280448 97993 152054 86353 286127 540268 226983
13327 337183 173070 -38112 310133 118270 231504 238884 208838 317541 356332 -143424
13316 112187 615223 266344 63840 171601 201803 351157 421397 -61000 -127568 648140
13305 293360 -133316 -57547 25836 205465 261309 286417 169276 393735 241053 441988
13295 441988 73535 -27408 29048 349902 71975 374740 202387 -277366 133035 -248205
13284G6531L05845e2707B39053M0141J02213j2796a09099I4600O289B1036K31113
13273B52149J26964n3470A14633J74580N6914a78708B04440a98507n2389C24223
13262a17917L2180I406a38072e78o2388C07089o8288n6512n5717D9699e9978D2068
13249d8580C42097a86153H6640D1008K62551g0233B72559j14493b0955A54006
13238A33657m0317J31851J60651j33439J02170A72645a5313C5772K54622l3043
13228B57351m9656B0679b1032A19693E3971L5187a03548B09001G3979k479d4902
13216A64421K7896e940j1608q858A45125K03410H5590l0970g1366C63569j14659
13205B48910J7872b0274B3711K0024c98262a24630E9307L99661C9115M07396B04725
$$ plain form
13284 76531 382376 -52707 239053 279194 381407 368611 -109099 94600 100889 21036 252149
13273 252149 379113 325643 114633 289213 346127 -178708 204440 -198507 -250896 324223
13262 -117917 -85737 9406 -138072 -578 -62966 307089 238801 182289 126572 49699 -59978 42068
13249 -48580 342097 -186153 86640 41008 303559 -70233 272559 158066 -20955 154006
13238 133657 93340 225191 385842 252403 354573 172645 -15313 35772 290394 257351
13228 257351 207695 20679 -21032 119693 53971 89158 -103548 209001 73979 71500 -44902
13216 164421 192317 -5940 -17548 -26406 145125 348535 85590 54620 -71366 363569 248910
13205 248910 266782 -20274 23711 43735 -398262 -124630 59307 458968 39115 446511 204725
13193A14240Q0671a4465j88136B62881J9221j0102j10256G4677J77232E2726N453
13182E8179c56014D05941j36449l7527o8986j269L38719A97183k4354d38q6192
13171h6630E697K23836M4217H9204a59314C45386B8236L49232c5075H1321e457
13159D686Q8862a00732I58J79754J38154m0206B7734a5811j53930E4485J29304
13148A83789M8298a93118B17720j1498A0203e472I310f675B16739A7018K61818
13137B78836a64238B25300a33491A0874e021B792K14482C924J26173a81118I2223
13125A39400J70626o4380a10943c5124A55383O7674H999g2484K4770A86081H920
13113a1875p9042I4003J34005c2042A15530J42987g7340j24007d1798n803j78771
$$ plain form
13193 114240 194911 -14465 -202601 262881 282102 272000 161744 74677 251909 52726 58179
13182 58179 -356014 405941 269492 231965 162979 161710 500429 197183 172829 -438 -86630
13171 -86630 5697 229533 273750 89204 -159314 345386 28236 377468 -35075 81321 -5457
13159 4686 93548 -100732 958 180712 318866 278660 27734 -15811 -169741 54485 183789
13148 183789 232087 -193118 217720 206222 10203 -5472 9310 -6675 216739 17018 278836
13137 278836 -164238 225300 -133491 10874 -5021 2792 217274 3924 130097 -181118 92223
13125 139400 310026 245646 -110943 -35124 155383 223057 8999 -72484 -47714 186081 8920
13113 -11875 -90917 94003 228008 -32042 115530 258517 -77340 -201347 -41798 -47601 -226372
13102b26372i5093a9700C27230e6371C77912A69818H3450J37766D2181N7254a01968
13090A03463i5832B83214j07488M7691a62598G5470J10082p2819K4077C8571M0316
13079G8887J87380E8697J65336P7169g933A41550R8923e7759A11984M8223F8374
13067h0160A97955a1782A70757a7167G6116i9843m3705C51302q141E0085d7978
13055A95836h8277H0072h2044A76919j2771a44283B1024J47504j5403B300c680
13043c8180I9455A9235f0464A58350F303K33513p3252c1155l0355A80135J29386
13032C09521D9819J59994q6685J7025K84163A56041C0678a62536b7520A44015
13021A08496M38655r8092a6596B85040a28881D26626j01937H6721M7017h6526
$$ plain form
13102 -226372 -95093 -19700 327230 -56371 377912 169818 83450 221216 42181 99435 -101968
13090 103463 -95832 283214 175726 223417 -162598 75470 185552 112733 136810 38571 78887
13079 78887 266267 58697 224033 301202 -7933 141550 240473 -57759 111984 160207 68374
13067 -80160 197955 -11782 170757 -17167 76116 -99843 -143548 351302 343161 50085 -47978
13055 195836 -88277 80072 -82044 176919 164148 -144283 21024 168528 153125 2300 -3680
13043 -38180 99455 19235 -60464 158350 6303 239816 166564 -31155 -61510 180135 309521
13032 309521 49819 209813 123128 140153 424316 156041 30678 -162536 -27520 144015
13021 108496 547151 449059 -16596 285040 -128881 426626 324689 86721 133738 -86526
13010a16753A77755K04137a7283D40894d7718A68378M5434H402b441H7285A2725
12998B25506b67026A07016O4959m1436a89412d5503B39935a85471c8053l9121
12988g7174G1334B9208J43297j9290b91514C12346H5870Q1906P6723j14976a02488
12976a83800k2057c4104i967B79859A2782b89682d0325C7526b49203N8633H8744
12964a32880A83608b46815E2382O5783b33745A49405b20489F2399h5215a4527
12953a10858J6522j04188b8079G3159b39455D3688a62426k45189b8387B51798
12942f5632l02160A36567m3133M724J6684L90423A46437b6372G2107A2023f4376
12930a50491A54394b9979m22519J21793E3501Q6552c1289J3853A04255K72274
$$ plain form
13010 -116753 177755 381892 -17283 440894 -47718 168378 213812 8402 -2441 87285 12725
12998 225506 -267026 107016 171975 130539 -189412 -45503 239935 -185471 -38053 -77174
12988 -77174 71334 29208 172505 153215 -291514 312346 85870 167776 244499 129523 -102488
12976 -183800 -205857 -34104 -9967 279859 12782 -289682 -40325 37526 -249203 -190570 88744
12964 -132880 183608 -246815 52382 118165 -233745 149405 -220489 62399 -85215 -14527
12953 -110858 -94336 -198524 -28079 73159 -239455 43688 -162426 -407615 -28387 251798
12942 -65632 -367792 136567 93434 98158 114842 505265 146437 -26372 72107 12023 -64376
12930 -150491 154394 -29979 -452498 -330705 53501 140053 -31289 -17436 104255 376529
12920C76529a17382b5567k9087C08916j49012b557E3406b81121A43721a24407
12909a22482M9886r4258o0360q1181A19898k2275c48927h6098I6679b4110k2465
12898d6575B0496a0066A8525b96265F0783a76484A70396G7556C1878J98270C3935
12886a83474f5583A64412j7003k7940c23825E50532A10791N3139n1894J46716
12876B58752p6456B1108K91042A38737i4437B14502b79371A9453a82520F5093
12865C72864l6911E7878b02488J715A82694O6686m2211c2344B56823r6549A2329
12853F5956a26885j34876J20121l2192d1282G3969b312B25799j11522A4601J62392
12842A76993b30459F5352N6778l3183L09796R4003e5768c012A20735K46309i4211
$$ plain form
12920 376529 -117382 -25567 -54654 308916 159904 -2557 53406 -281121 143721 -124407
12909 -122482 -72596 -166854 -227214 -308395 119898 97623 -348927 -86098 96679 -24110 -46575
12898 -46575 20496 -10066 18525 -296265 60783 -176484 170396 77556 31878 230148 33935
12886 -183474 -65583 164412 147409 119469 -323825 550532 110791 163930 112036 258752
12876 258752 182296 21108 312150 138737 -94437 214502 -279371 19453 -182520 65093
12865 372864 335953 57878 -202488 -200773 182694 249380 207169 -32344 256823 160274 12329
12853 65956 -126885 -261761 -141640 -173832 -41282 73969 -2312 225799 114277 14601 176993
12842 176993 -230459 65352 122130 88947 398743 492746 -55768 -3012 120735 367044 -94211
12830C88565a79103B6841r567a31924j08219B63869b78777a25963H9564a06335
12819c3598k3357D04628D4117g3974B22338p959a18643j32546B9216J24411a44025
12807H2001a8532A58017i0479j4211h058A64222R9827a78113N9140C22450b30526
12795B10468J95284E5796i2229o7261k26260D0285b32034j59634a81741A8089
12784h0292A1455R0674a9134r3748m8563F0895J9696b33974B1104K8396e2295
12772A62135a72809B04038B5180J42361Q5862h5827B48521C8512L50006A91276
12761a59202A12893K33223a03548j72363A65614a78902g7085K2438D04490o9111
12751C35379j12764o1159b08306A8837J92493H0555M8318m4453L7096a74846g7785
$$ plain form
12830 388565 -179103 26841 17274 -131924 -240143 263869 -278777 -125963 89564 -106335
12819 -33598 -56955 404628 44117 -73974 222338 214379 -118643 -251189 29216 153627 -144025
12807 82001 -18532 158017 -90479 -104690 -8058 164222 264049 -178113 -118973 322450 -230526
12795 210468 405752 55796 -92229 -159490 -385750 40285 -232034 -391668 -181741 18089
12784 -80292 11455 102129 -19134 -112882 -161445 60895 80591 -233974 21104 49500 -52295
12772 162135 -172809 204038 25180 167541 253403 -85827 248521 38512 388518 191276
12761 -159202 112893 346116 -103548 -275911 165614 -178902 -77085 -54647 404490 335379
12751 335379 222615 161456 -208306 18837 211330 80555 128873 84420 121516 -174846 -77785
12739C55155A18079j2006O5000J7439p2835j2359l6728M669J49363j05245m3499
12728G1878Q2437c9430A25684a55860C1383c12217A69751J25627D3375L5274J86593
12717B65242a25903A19610j9706i1090A27458K51273A16762c3647A28698R0311
12707B19009L3402o762a5330C27546d8035C31811J7753a9563A67022J5121b09948
12695c9639A75761a74556d6623A23899J84849A3214J69551K54330A30324o0095
12685G0229d4830B21866A3873K31376K4200F9659J11600L3187d3235m6419F9556
12673a5925A44767a18873j55D17797A4337J84575N0170A02326h3664A22119c17350
12661A78764B6642P1243J25694A07447J82768a7402C0574J18358o6188B7991g562
$$ plain form
12739 355155 118079 106073 171073 188512 115677 103318 66590 71259 220622 115377 71878
12728 71878 154315 -39430 125684 -155860 31383 -312217 169751 295378 43375 78649 265242
12717 265242 -125903 119610 99904 -91090 127458 378731 116762 -33647 128698 219009
12707 219009 252411 245649 -15330 327546 -48035 331811 349564 -19563 167022 182143 -209948
12695 -39639 175761 -174556 -46623 123899 308748 13214 182765 437095 130324 70229
12685 70229 -44830 221866 13873 245249 269449 69659 181259 214446 -43235 -89654 69556
12673 -15925 144767 -118873 -119028 417797 14337 198912 249082 102326 -83664 122119 -317350
12661 178764 26642 97885 223579 107447 290215 -17402 30574 148932 82744 27991 -7562
12649B89863H1704a50522L3276M0915F0551j564J8095g6038A09232e6081B62427
12637a97621A20753c2742B19946G4487R2527l7782J42593j24429g4791a2989m1648
12626e4637B63664M6929D647J02028a06277B76109a52478D61402E8711J25806
12616A84517D0841J2051A3304B398R9739b32442C64213A55636J13269P2840A07611
12604G726O8413K82952g9049A77538l8131E5884f4494H3989J54772a66631K5796
12593a40835A7318J95955r8052f0442B0511L07316A2035K24091k2636N3825B082
12581a01441L6346o7499b2027A99804k8732C0753E093c7548A1005a60831A08461
12569b79273o0319I0167Q7678L4949I7847j8979k204h2584p584A24027g0809l05760
$$ plain form
12649 289863 81704 -150522 -117246 -76331 60551 58987 77082 -76038 109232 -56081 262427
12637 -197621 120753 -32742 219946 74487 167014 129232 271825 147396 -74791 -12989 -54637
12626 -54637 263664 310593 4647 106675 -106277 276109 -152478 461402 58711 184517
12616 184517 40841 52892 13304 2398 102137 -232442 364213 155636 268905 341745 107611
12604 7726 76139 359091 -79049 177538 139407 55884 -64494 83989 238761 -166631 -140835
12593 -140835 17318 213273 115221 -60442 20511 327827 12035 236126 213490 267315 2082
12581 -101441 -65095 -132594 -22027 199804 171072 30753 5093 -37548 11005 -160831 108461
12569 -279273 -339592 90167 177845 212794 97847 78868 76664 -82584 -90168 124027 -70809 -376569
12557c76569C38149c1294B8480a73702c6316m37790B36513I3756f9558C40982
12546B07577e7590E8502M7676i6557A07386L66652a74923A18488A6526a48234
12535A21480b08235r8279h9536j34661d543F4283c42870E8322a20286A17800O3683
12524A81483a69508K3690f8390E2280a79346A88874a48728B79782m7850j11614
12514A20318i1805A70309b57994F9048a41827A22385k5329j7426K49770C0917
12503B09868b9587A97622a21982q4627g2144B11790K8125F5701c74635A49634
12492f8532c3561A10775h9868A82613a30749k7837B6180J77446G8866a9633k9414
12481d9047p709n5934B08059D9578J91528b79156k2342N5462j5378a03613M7600
$$ plain form
12557 -376569 338149 -31294 28480 -173702 -36316 -474106 236513 93756 -69558 340982
12546 207577 -57590 58502 106178 -96557 107386 474038 -174923 118488 16526 -148234
12535 121480 -208235 -306514 -89536 -224197 -4543 64283 -342870 58322 -120286 117800 181483
12524 181483 -169508 -145818 -68390 52280 -179346 188874 -148728 279782 231932 120318
12514 120318 -91805 170309 -257994 69048 -141827 122385 97056 79630 329400 30917
12503 209868 -29587 197622 -121982 -206609 -72144 211790 239915 65701 -374635 149634
12492 -68532 -33561 110775 -89868 182613 -130749 -158586 26180 203626 78866 -19633 -49047
12481 -49047 -56756 -112690 208059 49578 241106 -279156 -301498 -246036 -261414 -103613 -56013
12470e6013G5600a35133A56199D6072R9564i3507p0765q0921h2948E5237P6666
12459A31903d5191G0822H545b45346A0344J18413P61J01060b14404A71028e3809
12447b3504B28704I1012P6742b86535D1432B193a9701A80946J8955H5937D0054
12435a71005h0529A11516J85097d33292d4607B84626b66691h2452B52493b63112
12424B6718J06373K06650m301b3790m2940K02l564B80310G5457O1815B1014a97309
12411B69757i9625o2500d3860B43047c859j75101C7446O8474R2428L94750C1875
12399C08312h9467k2976a5652A37599I028j414h2502A7581J50117c00684b819
12387h0151A42936l9604a7241l3743j67769j03878B29272E8466a80705C4766a35208
$$ plain form
12470 -56013 75600 -135133 156199 46072 145636 -93507 -164272 -245193 -82948 55237 131903
12459 131903 -45191 70822 8545 -245346 10344 128757 129518 230578 -214404 171028 -53809
12447 -23504 228704 91012 167754 -286535 41432 2193 -19701 180946 199901 85937 40054
12435 -171005 -80529 111516 296613 -433292 -44607 284626 -266691 -82452 252493 -263112
12424 26718 133091 339741 335440 -23790 -66730 -66528 -70092 280310 75457 137272 21014 -197309
12411 269757 -99625 -162125 -43860 243047 -3859 -178960 37446 105920 198348 593098 31875
12399 308312 -89467 -112443 -15652 137599 9028 7614 -82502 17581 167698 -300684 -2819
12387 -80151 142936 103332 -17241 -50984 -218753 -322631 229272 58466 -180705 34766 -135208
12375G6398J78089c89340N3027H4403b1620n3937A13831a39409B09556J59942
12365C69498a41172e9822D6285a46781A45743i7118a391j03184D1085c39665E7581
12353a2006k1574j40799e1176B9456L58660P5074c9092A82394k6229a27490q5991
12342b13481A55769h9394A03164b32799c0289F2306a85452C50856j30344c3192
12331a10797B0199K42013m0433r0561C4459b65382I5293b9085r7670b832j52224
12320a55056B50150i7634A27687K01407r3987c56723g5479B99056I7253j0631
12310H6622K5431N4153d5313O692J1349G9126k8845r366J93608f1890j93246i7918
12297i082B4563J90923L329b33045I6506b58511J06036A45571n1991l8873H940
$$ plain form
12375 76398 254487 -389340 -336313 84403 -21620 -75557 113831 -139409 209556 369498
12365 369498 -141172 -59822 46285 -146781 145743 -97118 -1391 -104575 41085 -339665 57581
12353 -12006 -33580 -174379 -51176 29456 388116 463190 -39092 182394 156165 -127490 -213481
12342 -213481 155769 -89394 103164 -232799 -30289 62306 -185452 350856 220512 -33192
12331 -110797 20199 262212 221779 131218 34459 -265382 95293 -29085 -126755 -2832 -155056
12320 -155056 250150 -97634 127687 329094 235107 -356723 -75479 299056 97253 86622
12310 86622 112053 166206 -45313 -38621 -27272 79126 50281 40915 234523 -61890 -255136 -97918
12297 -9082 24563 215486 218815 -233045 96506 -258511 -152475 145571 93580 54707 8940
12285A60454i6085I4170J43528o0q6481b9233A95894p3883J83889A01011a040
12273B04262g9313K9161A57096a86673C48189j51752r2429K426L03221I4702J3141
12262A07843m315a2103E0412p579b34398h3125B19406r3704a51489b742o2138
12251f4880D0724K67077p6018J52437E8271j6047g0266j47853A86214K7514I3941
12239A51320J525C3927a53176A89961F1913R1147E3677P3136O7629P8436M747
12228B77625B156J79196p6642K22479a43727I2317K61961F1766J86262J09227
12218C57255b8539D05346j63610G335K07600G2435j9895K4187R8891o6076e3738
12206B60193j14463J61833A14941J57427B1078J59183D3396L163B27a60039A90333
$$ plain form
12285 160454 -96085 94170 237698 237638 151157 -29233 195894 122011 305900 101011 -1040
12273 204262 -79313 -50152 157096 -186673 348189 196437 104008 106434 409655 94702 107843
12262 107843 103528 -12103 50412 42833 -234398 -83125 219406 125702 -151489 -2742 -64880
12251 -64880 40724 307801 231783 384220 58271 42224 -70266 -218119 186214 213728 93941
12239 151320 152845 33927 -153176 189961 61913 153060 53677 126813 194442 272878 277625
12228 277625 2156 181352 104710 327189 -143727 92317 354278 61766 248028 357255
12218 357255 -28539 405346 241736 7335 214935 72435 52540 76727 175618 109542 -53738
12206 260193 145730 307563 114941 272368 21078 180261 43396 46559 227 -160039 190333
12194A40989J02198o6652a7520p4702C16408H6626N8951F8848d285m15415A58370
12182g0811a296C25139a14492c526n9447A27645L59588G148L4468J26440m0432
12171A27624a89794B14892I1221k4735O3235E9584A1067d0615C14192c15902B6554
12159B71589K8822b49983f5647A25344i008D6142N4615R2186o7699k4429J57830
12148B58645o1431f3272J3249B17350q2231a38203C46999a40248A39714a60564
12137a12535B64569b61087D9305b21921A82458a57072e1417j74319d0748k73590
12127c14338a46105I2204a52664D71668H6772A3442b92072h1659B40043a83971
12116a57476b6517B31L1769n271a38164B54586E0415k244b92052A6441P6807f1470
$$ plain form
12194 140989 243187 176535 -17520 -92222 316408 86626 145577 68848 -4285 -419700 158370
12182 -70811 -1296 325139 -114492 -3526 -62973 127645 487233 7148 41616 168056 127624
12171 127624 -189794 214892 91221 66486 129721 59584 11067 -40615 314192 -315902 26554
12159 271589 300411 -249983 -65647 125344 -9008 46142 100757 192943 125244 100815 258645
12148 258645 197214 -63272 -50023 217350 135119 -138203 346999 -140248 139714 -160564
12137 -112535 264569 -261087 49305 -221921 182458 -157072 -51417 -225736 -40748 -314338
12127 -314338 -146105 92204 -152664 471668 86772 13442 -292072 -81659 240043 -183971
12116 -157476 -26517 231 32000 26729 -138164 254586 50415 48171 -292052 16441 93248 -61470
12103a13522N6108G7096a49025B327a17772F359A421a05337G7344q405J90949
12092B59888I0451b91969A60140c4422p3119A37925N5457A6720J11660g1291I2217
12080A2410J27895b3568o0796C07318g7372E9081a03983B35207a72884B52817
12069C33300n118M11887Q17237o80044C27041b54824A32358i7880A11293Q2122
12059A93415R2890e9900B24866c530C7897a03551I0378k8215J01879R4979a67881
12047h7961L3432q4404A5663K04869r0173c3628j2338B50982a28419o5155H176
12035C5528b56819A3084b53684J11867D5163c47984A35111A9205N0995K829a17580
12023D0561K85835a3777j60906E2565N3043J25529c57544B65491J065j17905N3912
$$ plain form
12103 -113522 -57414 77096 -149025 2327 -117772 6359 1421 -105337 77344 68939 259888
12092 259888 90451 -291969 160140 -34422 -107541 137925 193382 16720 128380 -71291 92217
12080 12410 140305 -23568 -84364 307318 -77372 59081 -103983 235207 -172884 252817
12069 333300 328182 740069 1557306 877262 327041 -254824 132358 -97880 111293 193415
12059 193415 286305 -59900 224866 -3530 37897 -103551 90378 62163 164042 259021 -167881
12047 -87961 -54529 -138933 15663 220532 130359 -33628 -45966 250982 -128419 -193574 8176
12035 35528 -256819 13084 -253684 -141817 45163 -347984 135111 19205 70200 73029 -117580
12023 40561 326396 -13777 -174683 52565 105608 231137 -357544 265491 266556 148651 202563
12012B02563D3952Q5086K1434a85028d8060D2749a2460M302B17879J9633a40097
12000c29251E6675a18115c4216E2849L75355i6722A16689e678j5938A20657D9522
11988b17495N5463e0172A96368q0144a2380j29657k21790C71939F050J684J03344
11977A11078E1143a6041B6401R8087a52557k8407A90639n2112M3590a34514A44845
11965f8069j0382K1360C9461f9648b9697n9521P518B57073c38011h6511B48947
11953A60646P449F3689O1113b05876Q0321b56k08889r0147A09131h2425J276M0165
11941d0984C5662J09395B7519J02164m6895o085L3283J01478e1967b485B02853
11929b07510K7633c7127C5766c69942g6288C6744a2527j6885o5535A658c37319
$$ plain form
12012 202563 43952 129038 150472 -185028 -48060 42749 -12460 -8158 217879 237512 -140097
12000 -329251 56675 -118115 -34216 52849 428204 -96722 116689 -5678 -21616 120657 49522
11988 -217495 -162032 -50172 196368 116224 -12380 -142037 -363827 371939 6050 7734 111078
11977 111078 51143 -16041 26401 124488 -152557 -180964 190639 138527 182117 -134514 144845
11965 -68069 -78451 -57091 39461 -69648 -29697 -89218 -81700 257073 -338011 -86511 248947
11953 160646 168095 63689 124802 -205876 -125555 -256 -209145 -299292 109131 -82425 -81149 -40984
11941 -40984 35662 145057 27519 129683 82788 76703 109986 211464 -51967 -2485 202853
11929 -207510 -179877 -37127 35766 -369942 -76288 36744 -12527 -29412 -94947 1658 -337319
11917a33548q8204E3030d5346B7313J13457j499C7477L9050J16180c67369A69567
11905a624l5124J6262j49488k5967A78435D4785d5327D6542j6995K7231d7235
11893h5200a4827j55511M4651q2108A2920a66420B20367j00096J00621J61912
11883C82804K8678D4727a07278A79544c47070f6912j23745C1763e70979g8227
11872a35956B53909C497M6105d0478A6934K1452a5925j02377A97338a1604E8012
11860C377d32220i0056j9089k5534A97146b20314B54906a72344B5839h3433j68203
11849b51636e0507E5884b55625B04279a6892F0472L42377j57490h2505j70446
11839b52951l1253D30759c1715k39090B1455c5903o1855o8068p0723K58e8110
$$ plain form
11917 -133548 -221752 53030 -45346 27313 140770 139271 37477 76527 192707 -367369 169567
11905 -1624 -36748 -20486 -169974 -195941 178435 44785 -45327 46542 29547 56778 -47235
11893 -85200 -14827 -170338 -125687 -207795 12920 -166420 220367 120271 220892 382804
11883 382804 411482 44727 -107278 179544 -347070 -66912 -190657 31763 -570979 -78227
11872 -135956 253909 3497 49602 -40478 16934 38386 -15925 -118302 197338 -11604 58012
11860 3377 -432220 -90056 -109145 -134679 197146 -220314 254906 -172344 25839 -83433 -251636
11849 -251636 -50507 55884 -255625 204279 -16892 60472 402849 245359 -82505 -252951
11839 -252951 -284204 430759 -31715 -270805 21455 -35903 -97758 -165826 -236549 -236291 -58110
11827b02059n9349B58492G9845C9673j3578c7183l3999C5263a19883N9681J835
11816e8367F7759a46474r3763C91372B5051i6568k1042A86670j7464P3741b03761
11804G0504a52401A13836k1485b5086k48230B09906b96141P2999b6319m48540
11794d74859g5056o0951k29907A31415i3365K9386k64140A93409G0827B1370P9927
11783A01297a13344B50305A8179M6132R7382q0590a5687l14178J28856H6996c24738
11771A63775b24046R5627b709A25767R4410n5942b0977l13281e2123D7224f1189
11759a35392C13088C6713J45061c11759a45513c2688C56790H3059G686K43952
11749B51638J0162q8489b27188H974K49245a47671E8717a23753m9237E0589c7701
$$ plain form
11827 -202059 -261408 258492 79845 39673 26095 -37183 -71182 35263 -119883 -60202 -58367
11816 -58367 67759 -146474 -240237 391372 25051 -96568 -117610 186670 169206 242947 -203761
11804 70504 -152401 113836 92351 -25086 -273316 209906 -296141 -223142 -26319 -474859
11794 -474859 -75056 -136007 -365914 131415 -93365 -63979 -328119 193409 70827 21370 101297
11783 101297 -113344 250305 18179 64311 161693 81103 -15687 -329865 -201009 86996 -324738
11771 163775 -224046 -128419 -2709 125767 220177 164235 -20977 -334258 -52123 47224 -61189
11759 -135392 313088 36713 181774 -311759 -145513 -32688 356790 83059 7686 251638
11749 251638 261800 173311 -227188 8974 258219 -147671 58717 -123753 -172990 50589 -37701
11737d8132q7992C911Q3528M7406M5708b42660C58142c1239k2088o6517B12619
11725a19532C01989A01979R9577a91580d0204A02784a02963H4967L83427C6657
11714a52867a8912B27716g2864j58903A7916f3145G0568K02165i6433G3867R2508
11703A66375C2985J17195E7596K52812A39761m6651Q0492e1659n4173i300G7334
11691B78880A03232D879K59399f2650k00799C53966J23747c72395C0100J60759
11681A90859m3684n3517J33997l4103g2728A47204J77487j55164c1435H1722K6816
11670A08538J00798I7203K3538K40244h1694E3919I406b0179B37452b80106A147
11658D61405b45247g6288A4940J89182J62082a92112C47266A41503o9398L8920
$$ plain form
11737 -48132 -136124 3911 87439 134845 180553 -242660 358142 -31239 -53327 -119844 212619
11725 -119532 301989 101979 201556 -191580 -40204 102784 -102963 84967 468394 36657
11714 -152867 -18912 227716 -72864 -231767 17916 -63145 70568 272733 -96433 73867 166375
11703 166375 32985 150180 57596 310408 139761 93110 173602 -51659 -105832 -9300 77334
11691 278880 103232 4879 264278 -62650 -263449 353966 477713 -372395 30100 190859
11681 190859 147175 93658 227655 193552 -72728 147204 324691 169527 -31435 81722 108538
11670 108538 209336 97203 120741 360985 -81694 53919 9406 -20179 237452 -280106 1147
11658 461405 -245247 -76288 14940 204122 366204 -192112 347266 141503 72105 111025
11648A11025C6757g0292k34113A66198Q394D2423a59186C1198i5391q1924N862
11637a71453B13701f4116F8234a85755A2341i8170A99199c0801D20918A3871J6022
11626B9893i0661o8606D8399Q0778d3525E7927L58948J15024A00817m3527f0601
11614B9919J39672a76999Q7398C21230d00535i2670a0095B01916H7140O5069c35669
11602A20928J34928a51659A84643J58684I9892a46823n9488D7262L0240J439J68018
11591B46959r2257h6004D4410L2981J56524a3420A82358a13171C22431h4533j73148
11580b57681i2973A25820l2084H311a14298A10486n1367a91672B85338B578a55367
11568b1147k91642B22106C9302L55448a09952J5542F6124Q8447D5244K04132j18575
$$ plain form
11648 111025 36757 -70292 -304405 166198 174592 42423 -159186 31198 -95391 -177315 -171453
11637 -171453 213701 -64116 68234 -185755 12341 -98170 199199 -30801 420918 13871 29893
11626 29893 -90661 -159267 48399 129177 -43525 57927 416875 531899 100817 57290 -60601
11614 29919 169591 -176999 -89601 321230 -400535 -92670 -10095 201916 87140 152209 -335669
11602 120928 255856 -151659 184643 343327 99892 -146823 -206311 47262 77502 78941 246959
11591 246959 154702 -86004 44410 77391 233915 -13420 182358 -113171 322431 -84533 -257681
11580 -257681 -92973 125820 93736 8311 -114298 110486 59119 -191672 285338 2578 -155367
11568 -21147 -312789 222106 39302 394750 -109952 -94410 66124 154571 45244 249376 130801
11557A30801C7870L33615a56836P6596C2651L22344A14340a11283D42390a24044
11546F8115J62994C4973a67674l7138R1386A04497Q4632i0242B47323k6009N5182
11535B76496n8601C5027Q5908B8225K30216J05263N7241C527a6300p9649A80720
11523D4089K31540g8369A55763J33754h9033G2888Q3033b02451B82630j37507
11513A45123l6858f7387A95479G7131J28256c3795l6671B75231i8515m6340C12722
11501A67543H1292h8099A70785p1544J05858J04659a09355B95595m3904O6827
11491C18518j0133b43899A79353M06916A81335J45901a53005C93162n4730a98642
11480F3088L22676b29021A44491Q8734J48297d8116B48044J5248K52339A19987
$$ plain form
11557 130801 37870 371485 -156836 -80240 32651 354995 114340 -111283 442390 -124044
11546 68115 231109 34973 -167674 -204812 -113426 104497 189129 -90242 247323 221314 276496
11535 276496 217895 35027 120935 28225 258441 363704 420945 3527 -16300 -95949 180720
11523 44089 275629 -78369 155763 289517 -89033 72888 155921 -202451 282630 145123
11513 145123 108265 -67387 195479 77131 205387 -33795 -70466 275231 -98515 -144855 312722
11501 167543 81292 -88099 170785 99241 205099 309758 -109355 295595 251691 318518
11491 318518 308385 -243899 179353 586269 181335 327236 -153005 393162 338432 -198642
11480 63088 385764 -229021 144491 233225 381522 -48116 248044 263292 515631 119987
11469B30829j08429j2722M8662e5030A86111c857B07128b8774D6396Q2774i931
11457I0155J09692a85136B15812J150f116B9190M19e6453A59403d1731A97160
11445h9288j19174N6987B92959c10767B29821a24604e7871A36455o1563Q0827
11435A55719B4821L12015A24796L52928a55363I9180O4536f6409K9145B24244
11424a17432B92971i2646l3048k21371F5515a41551D20428B7335K57611p6620
11414B08326M6923c3261B4917N7918c6854j34615A21664a03970A25837B3293K32163
11403B55456I2634g1415A7179a2031A70552N698a19148A04072e0253B28362b6866
11391B43894a20571A03271J6966k8279a81691P3876j14759A67025a53401a8309
$$ plain form
11469 230829 122400 109678 158340 -55030 186111 -3857 207128 -28774 46396 129170 -9931
11457 90155 199847 -185136 215812 216962 -6116 29190 29609 -56453 159403 -41731 197160
11445 -89288 -208462 -151475 292959 -310767 229821 -124604 -57871 136455 74892 155719
11435 155719 24821 336836 124796 477724 -155363 99180 163716 -66409 -37264 224244
11424 -117432 292971 -92646 -125694 -347065 65515 -141551 420428 27335 284946 208326
11414 208326 255249 -33261 24917 82835 -36854 -171469 121664 -103970 125837 23293 255456
11403 255456 92634 -71415 17179 -12031 170552 176250 -119148 104072 -50253 228362 -26866
11391 243894 -120571 103271 120237 91958 -181691 -107815 -222574 167025 -153401 -18309
11380A63648i4046A88880M1121a4718l8591j14746C2661d6258j04662A01606d8857
11368b60005B97901a42509e9730a0082C8604f041o7128A14123a11308A30773c15002
11356i7654J360A13512Q008a56724e9022A9849H865L17232a68048C3010d9721
11344a37668k5322A89048f5505A19467B1929J01890L1667B6357a57883E7386a73006
11332b0913j5915k41283h9522E947c06846f4105j52096b9516o3217q9679A42649
11320f0962A4157R1630l1963a25752A4750a12291A66371b09736J8041j05752a25118
11308i6085o818E6963a38906C5110c8235j78222i6775G4241B7786J31985c7138
11296a27265q9927k7371f8683K487C31758j20217A5660a54145F9622i296j09031
$$ plain form
11380 163648 -94046 188880 230001 -14718 -53309 -168055 32661 -46258 -150920 101606 -48857
11368 -260005 297901 -142509 -59730 -10082 38604 -6041 -73169 114123 -111308 130773 -315002
11356 -97654 -96294 113512 121520 -156724 -59022 19849 8865 326097 -168048 33010 -49721
11344 -137668 -162990 189048 -65505 119467 21929 123819 155486 26357 -157883 57386 -173006
11332 -20913 -36828 -278111 -89522 5947 -306846 -64105 -216201 -29516 -92733 -182412 142649
11320 -60962 14157 105787 73824 -125752 14750 -112291 166371 -209736 -191695 -297447 -125118
11308 -96085 -102903 56963 -138906 35110 -38235 -216457 -96775 74241 27786 159771 -37138
11296 -127265 -217192 -244563 -68683 -66196 331758 211541 15660 -154145 69622 -9296 -118327
11285a18327k9167A98495J60332b3684f794r3736I8996a39165j06726o9373a22900
11273G2691J26568a31536M983G428P0905b64527A42339D7704J47368c7361k25042
11262b62403c5018A6819a02247B49976a5024A41431h4872j70158P8879c4876A46021
11250e4022D5016L9745i7212A0161d7990B50499I994a68093l7917B5520e0222
11238a63028A65792a49754k31488B113a64613K6039B7876N1280K78018C3056A3614
11226b55767j3064i0197j74509B93799b85420D43565b15870H7934b2552q9044
11216a11596A80315D122a05335J4938j5173F362J56164a55718H1788J08955B9819
11204a68616A6013K81211a57441I1026L5345L9112M0724E6072c31406C5352c28171
$$ plain form
11285 -118327 -147494 198495 358827 -23684 -6794 -100530 98996 -139165 -245891 -315264 -122900
11273 72691 199259 -131536 -126553 7428 78333 -264527 142339 47704 195072 -37361 -262403
11262 -262403 -35018 16819 -102247 249976 -15024 141431 -84872 -255030 -176151 -34876 146021
11250 -54022 45016 84761 -97212 10161 -47990 250499 9994 -168093 -206010 25520 -50222
11238 -163028 165792 -149754 -381242 2113 -164613 -138574 27876 79156 357174 33056 13614
11226 -255767 -268831 -90197 -264706 293799 -285420 443565 -215870 87934 -22552 -111596
11216 -111596 180315 4122 -105335 -90397 -105570 6362 162526 -155718 81788 190743 29819
11204 -168616 16013 297224 -157441 91026 126371 165483 206207 56072 -331406 35352 -328171
11192b31045J07895L9043j8696B7444c79072i5306I1088e4875B2042M0887j9218
11181D3711a28372r8052F4521a00953C6637J79943a7743A82698f261j21774A164
11169f4097B85404A3884M4986a13170B97395a57229j15997A36846a36405d6041
11158A65016a08137B9260P0088C0164M98b11050B83106b13971M7363j88977N5770
11147b99815E8546a62501J7752a756B81357p7961B5795M9217M7069K5762b38668
11135a71271K5667j47854F0699K76j0419b28459G4808K1840M3821g1128F7877
11123h5417k42489J22631j82306F0792B3381J6764O2293a18884B25605J7658o8441
11112A74822a22907B20212I9771b7777B47881f8867A74817Q0891C1206K10785
$$ plain form
11192 -231045 -123150 -84107 -102803 27444 -379072 -95306 91088 -54875 22042 62929 43711
11181 43711 -128372 -226424 64521 -100953 36637 216580 -17743 182698 -6261 -128035 1164
11169 -64097 285404 13884 58870 -113170 297395 -157229 -273226 136846 -136405 -46041
11158 165016 -108137 29260 99348 30164 30662 -211050 283106 -213971 -166608 -355585 -299815
11147 -299815 58546 -162501 -144749 -1756 281357 203396 25795 75012 122081 147843 -238668
11135 -171271 -145604 -293458 60699 60975 50556 -228459 74808 96648 140469 -71128 67877
11123 -85417 -327906 -205275 -387581 60792 23381 40145 102438 -118884 225605 243263 174822
11112 174822 -122907 220212 99771 -27777 247881 -68867 174817 255708 31206 241991
11102B41991F5111P4305L0399P1994o3684r089E417L82370A20089a36334H4805
11090B3802k005R0917J84267d9505D70195j13708J39382B46944C2357L28707H7075
11078f1201l9996F2808Q0872J22971n9014L68132E5986J25206J24360L42224r1109
11067E56667n9419j68903j0936r3972J8470L17892k47689J58447O1077J09849
11057F41483K0941j95505J02194p543Q2450m7526J7514J22530k11294L2014J73441
11046G30699j56285J12775n2369N2640j72894j4069L22936j57126M811p3954j55710
11035D41454K84989k93966J66974k21386k228m5955K18384K21169L5552M4540
11025H49527j13085Q7211j47132q127J80587l49759J14844J04103n0851k37876
$$ plain form
11102 241991 65111 139416 169815 241809 178125 169036 5417 387787 120089 -136334 84805
11090 23802 21797 112714 296981 -49505 470195 356487 495869 246944 32357 361064 87075
11078 -61201 -101197 62808 143680 266651 207637 575769 55986 181192 305552 647776 556667
11067 556667 497248 328345 317409 223437 241907 559799 312110 470557 531634 641483
11057 641483 662424 466919 569113 561570 644020 596494 614008 736538 525244 557258 730699
11046 730699 574414 687189 634820 687460 514566 500497 823433 666307 671118 597164 441454
11035 441454 726443 432477 599451 378065 375837 329882 548266 769435 804987 849527
11025 849527 736442 823653 676521 668394 848981 499222 614066 718169 667318 429442
11015D29442R9559L024J31026r8971L0786j2813A70319M21023k08785K52287j73328
11004D61516p3570q0952N37335B65465L53589j9805J22913M2394Q3897k90409
10994E58044L17580j83898j95991J94927J75633k50427Q09064n51681J92136p3756
10984I91631K96809j87703j27356O2712J82026K83288j7256j63914O55898m61377
10974A514758Q53286L71186q8870J2394o6778j4754k3797k64877n82332J96787
10964A907003k95099J9945k098j26191K37389k04587J56788P4990m9538P2699
10954A791301k07900j11509k19692q113n13282m707Q9856j30454j53721m6207
10944D85572H6541N62114a58873A93786N4816a91765B69487a12590C23482a71473
$$ plain form
11015 429442 529001 532025 663051 564080 594866 582053 170319 591342 382557 634844 461516
11004 461516 387946 306994 844329 265465 619054 599249 722162 764556 848453 558044
10994 558044 875624 691726 495735 690662 866295 615868 1424932 873251 1065387 991631
10984 991631 1288440 1100737 973381 1036093 1218119 1501407 1484151 1320237 1976135 1514758
10974 1514758 2368044 2739230 2650360 2662754 2595976 2581222 2557425 2292548 1710216 1907003
10964 1907003 1611904 1631849 1629751 1503560 1740949 1536362 1693150 1768140 1718602 1791301
10954 1791301 1583401 1471892 1252200 1244087 730805 726098 815954 685500 531779 485572
10944 485572 86541 648655 -158873 193786 248602 -191765 269487 -112590 323482 -171473
10933B90479N791F0151A2456L2928K88729c02522f354A28098a44167m9168B2991
10921A08639K63515a62012I1292r668J72060b0018m7692B09068E2565b90091C12463
10909C72474h1770A66105K36777d803j497k47952F5019O9735b39798f2712D5581
10897b62657b5269C06173a09268B10506a56392A56582n8270a74025a4759F8341
10886f8209F0748a11542j36948B20519F0006M9049h4m5053l1721Q469n1485j6524
10874a36398A7501o813K64868a3691j08331D5804K92177A33710a52213B23875
10863b04417A99402b99969H6577b83866m1221J51122i22B67519C2486a71765A21233
10851h3821j69501C37588d6248I8448d7096n337A15606M9838F0253e9008B60259
$$ plain form
10933 290479 296270 60151 12456 45384 334113 -302522 -6354 128098 -144167 -193335 22991
10921 108639 372154 -162012 91292 81624 253684 -20018 -67710 209068 52565 -290091 312463
10909 372474 -81770 166105 402882 -4803 -6300 -254252 65019 134754 -239798 -62712 45581
10897 -262657 -25269 306173 -109268 210506 -156392 156582 98312 -174025 -14759 68341
10886 -68209 60748 -111542 -248490 220519 60006 109055 -84 -45137 -76858 -68389 -119874 -136398
10874 -136398 17501 10688 275556 -13691 -122022 45804 337981 133710 -152213 223875
10863 -204417 199402 -299969 86577 -283866 -325087 -173965 -922 267519 32486 -171765 121233
10851 -83821 -253322 337588 -46248 98448 -47096 -52433 115606 165444 60253 -59008 260259
10839d19047a32470m7606A03672a54182L7984k930d2382n5199A2417N9381f9589
10827B58518B5586K02606b0622F4082g1649r320A86324a22970l4995A18590J04653
10816B23243a73981J0115I0948a42562j69663J40299N3323d9662A70472a85480
10805c9956B13027q3742L027b17054h6626I8613b50938D3065e21j22997D6010
10793c4175j46026n7268G6718P8448a40532c648k63940e7863a863k5693l21070
10782c48626a8743o0272k16353M2116N0682A44285J6665C6889Q5829a2418j77429
10771a89847N0733d1002B86201G7725h3749B5564b5272A68075a74725B38791b9478
10759A38803e5617F496M4439h3835j21354B4425b81643d7266F1317i4485F6442
$$ plain form
10839 -419047 -132470 -180076 103672 -154182 -116198 -119128 -42382 -97581 12417 71798 -69589
10827 258518 25586 228192 -20622 64082 -71649 -80969 186324 -122970 -157965 118590 223243
10816 223243 -173981 -163866 90948 -142562 -312225 -171926 -118603 -49662 170472 -185480
10805 -39956 213027 129285 132312 -217054 -86626 98613 -250938 43065 -521 -123518 46010
10793 -34175 -180201 -237469 76718 155166 -140532 -3648 -267588 -57863 -1863 -27556 -348626
10782 -348626 -18743 -79015 -295368 -253252 -202570 144285 160950 36889 122718 -12418 -189847
10771 -189847 -139114 -41002 286201 77725 -83749 25564 -25272 168075 -174725 238791 -29478
10759 138803 -55617 6496 50935 -83835 -205189 24425 -281643 -47266 61317 -94485 66442
10747c94053a62300A38592f3107Q729H5730C426b18573F0759f0902j80909g8169
10735h7328k1934c5979j37018A47168e3526E8651J46113I5843P6387J12053i95
10723A20598M7845a69230P9471I1068a8295k864j45984A75554R5255A25680K44317
10712C69997A55027q036G811b69218A04387D1237b93408F2655L6541a06156l4392
10701a40548r854B11172j02398b27357M4457e1639m03180a69022C57207i27k04424
10690b05351g8141o0259d2470j7861a3694b567j1434k1698B6591a31208r4822
10679b26030I0845a07107G5748B2311b66728A4023a97642p1279k1026A27180c4847
10667F6490J2801P6873B1364J15581a73995R674l7090o6140R3818f7527j0989
$$ plain form
10747 -394053 -162300 138592 -63107 -54378 85730 3426 -218573 60759 -60902 -241811 -78169
10735 -87328 -109262 -35979 -172997 147168 -53526 58651 204764 95843 172230 284283 -995
10723 120598 168443 -169230 -89759 91068 -18295 -21159 -167143 175554 270809 125680 369997
10712 369997 155027 146991 7811 -269218 104387 41237 -293408 62655 99196 -106156 -140548
10701 -140548 -150402 211172 108774 -227357 -182900 -51639 -454819 -169022 357207 -927 -205351
10690 -205351 -78141 -138400 -42470 -60331 -13694 -2567 -14001 -35699 26591 -131208 -226030
10679 -226030 90845 -107107 75748 22311 -266728 14023 -197642 -268921 -289947 127180 -34847
10667 66490 79291 156164 21364 136945 -173995 -164321 -201411 -267551 -173733 -67527 -78516
10656g8516B77487i894j8244r689A4229K49257c1291A46649a74800E3091c9483
10644B42412D7144b38834B53326A4983a03495I0128a67253B51389a45934B378
10633b83425A2317a58457f8680A30934M1322b28357c8454b383D386J98421q7702
10622A15105a81383N3662c5126B1988r997e1556B244J61677a74072C9005b78074
10610e25314H9331a21853J5241b5666C3236J45719a30218l9968B13461N9348f1689
10598A9486C96a73099f5585A77508c5819n2739j01707O0540A374c02364f327r3277
10586i9604j68137p7412c7118j55942A89058a65022P6569j7563J6552A16a37424
10574a82850B27222a14695C063c1050n1937j09514I7887A5528a19179J4170c9858
$$ plain form
10656 -78516 277487 -9894 -28138 -37827 14229 263486 -31291 146649 -174800 53091 -39483
10644 242412 47144 -238834 253326 14983 -103495 90128 -167253 251389 -145934 2378
10633 -283425 12317 -158457 -68680 130934 172256 -228357 -38454 -2383 4386 202807 115105
10622 115105 -181383 -127721 -35126 21988 11991 -51556 2244 163921 -174072 39005 -278074
10610 -525314 89331 -121853 -106612 -25666 33236 178955 -130218 -170186 213461 272809 -61689
10598 19486 396 -173099 -65585 177508 -35819 -88558 -190265 -129725 1374 -302364 -6327 -99604
10586 -99604 -267741 -345153 -37118 -193060 189058 -165022 -88453 -106016 -89464 116 -137424
10574 -182850 227222 -114695 3063 -31050 -82987 -192501 97887 15528 -119179 -105009 -39858
10562C3913K38414a729B3766J844a56192A28584K28345b37548b4320r7953O0134
10551f2139p9704F0419d226q1655K2082b7546k95281e9063J0550j13696j83686
10540c45895A8022J63568C0338J07337a86956C8322i9209c0266p7412C40615a14056
10528c98955O1197I0674e0267k4237k24093B9708a94014E1336g4636p186p04B4123
10515a00550A35520D3518b6055j68768A6272G077d9335B71132c14781C71098c69210
10503a55345n0384C11580I2395B8785a20660C18b16049A9679a82583k7508h6021
10491E6482a36985c2609a4181B03724N1377j00223m9048n0771L3134O0411O02512
10480G51116C48845P5171j11421A15144F2i0154B26042H3956a1281b173j40773
$$ plain form
10562 33913 272327 -1729 23766 25610 -156192 128584 356929 -237548 -24320 -122273 -62139
10551 -62139 -141843 60419 -4226 -85881 -63799 -27546 -322827 -59063 -48513 -162209 -345895
10540 -345895 18022 181590 30338 137675 -186956 38322 -99209 -30266 -107678 340615 -114056
10528 -398955 -337758 90674 -50267 -74504 -298597 29708 -194014 51336 -74636 -81822 -82526 24123
10515 -100550 135520 43518 -26055 -194823 16272 7077 -49335 271132 -314781 371098 -369210
10503 -155345 -205729 311580 92395 28785 -120660 318 -216049 19679 -182583 -210091 -86021
10491 56482 -136985 -32609 -14181 203724 255101 154878 105830 55059 88193 148604 751116
10480 751116 348845 424016 312595 115144 62 -90154 226042 83956 -11281 -2173 -142946
10469a42946c9261C23026h9979A89977a4089m0768A7200K68983a21025A20003
10458g3434H8236b58219A95074g7358A25105i5535P605D8248c4951A44899A0665
10446a90743j68194a07154A51229C5769b26926J813B73511B3090K3274a34312
10435b61045B43477a73817B3952J85293q2979c5611k10548K5824D3218N1017c0029
10423F56J14534C228J07753d0255q4020A28848D342c60j61674A57760a45568k051
10411a47619E1751b78197A81508a47876j7018p8241H5050c1867E41571a21034
10400c00266A81156c81632a62254A03992L73293E640J3535a82364I5324P9917
10390A75241F0740d3428G40615b9627F8460k4518K67298G3209i3055k570d0755
$$ plain form
10469 -142946 -39261 323026 -89979 189977 -14089 -54857 17200 286183 -121025 120003
10458 -73434 88236 -258219 195074 -77358 125105 -95535 -87930 48248 -34951 144899 10665
10446 -190743 -358937 -107154 151229 35769 -226926 -225113 273511 23090 46364 -134312
10435 -261045 243477 -173817 23952 209245 126266 -35611 -246159 -220335 43218 94235 -30029
10423 656 115190 3228 110981 -40255 -124275 128848 4342 -360 -162034 157760 -145568 -147619
10411 -147619 51751 -278197 181508 -147876 -164894 -243135 85050 -31867 541571 -121034
10400 -300266 181156 -381632 -162254 103992 477285 5640 19175 -182364 95324 175241
10390 175241 60740 -43428 740615 -29627 68460 43942 311240 73209 -93055 -95625 -40755
10378d2964A56475o6112c3833C90340A26670o2746J56176J96548p9329K48837
10368E86156A33797N08941k95682J83308j2659j80687A21280J77768M02688B4127
10357D22749A02814K6581L1435L17431j06746A52877M25992p3442j9173o6450
10347D19804P4214B02892k8488K30309A48044K12869n51a35650L1659D86115a68622
10335A42221K06695A8619R4945J24688D1627L19743H8211R6347n5343J15647l6185
10324B08677g8608C8541O4487K44996p0760a99555C63053A71265o1046K1660K44835
10313C76714f4885H0619J00193b02032f1800j9159A67978f3965A27559a02961
10302I2249p825P135a33456C65716b60891e7380j896k03695e0934p9991k1457
$$ plain form
10378 -42964 156475 90363 -33833 390340 126670 63924 220100 416648 337319 586156
10368 586156 133797 642738 347056 530364 517705 337018 121280 299048 701736 24127
10357 422749 102814 129395 160830 478261 371515 152877 578869 505427 486254 419804
10347 419804 494018 202892 174404 404713 148044 360913 360362 -135650 -103991 486115 -168622
10335 142221 348916 18619 113564 238252 41627 361370 88211 184558 129215 244862 208677
10324 208677 -78608 38541 103028 348024 277264 -199555 363053 171265 110219 131879 376714
10313 376714 -64885 80619 180812 -202032 -61800 -80959 167978 -63965 127559 -102961
10302 92249 84424 91559 -133456 365716 -260891 -57380 -59276 -262971 -50934 -130925 -152382
10291a52382A69119b21837H7149N8257D4393K90449P5386a84634e0275C6862e5356
10279c12025J28652j09912A40903b04799l4374N1566B9808J07009g1179B25005
10268h6395m0605a3228k14493a04877d982B12170a6841o3693B59738M7379R4385
10257D01502M2300B14441C2243b01100E04151E2950a22101K9635j72117B27965
10246C5762K20283C959c12526b4721A28304b48527d2717C49221C1712P0641c95537
10234a04275B63429a61631H0837a5499I8339a48544e475k0633n2796A81276a63898
10222a09125E8088a14464J0659j27285B6178J44390D0699b97162K9118A6282c22342
10210B7806G851e3789A83621b20208a000j63445F1073c5978A21889N17g6044m1867
$$ plain form
10291 -152382 169119 -221837 87149 145406 44393 334842 410228 -184634 -50275 36862 -55356
10279 -312025 -183373 -293285 140903 -204799 -239173 -187607 29808 136817 -71179 225005
10268 -86395 -127000 -13228 -227721 -104877 -4982 212170 -16841 -80534 259738 307117 401502
10257 401502 443802 214441 32243 -201100 504151 52950 -122101 -92466 -264583 227965
10246 35762 256045 3959 -312526 -24721 128304 -248527 -42717 349221 31712 102353 -395537
10234 -104275 263429 -161631 80837 -15499 98339 -148544 -5475 -26108 -78904 181276 -163898
10222 -109125 58088 -114464 -103805 -231090 26178 170568 40699 -297162 -268044 16282 -322342
10210 27806 7851 -53789 183621 -220208 -1000 -164445 61073 -35978 121889 122406 -76044 -117911
10198a17911D4162g2859k05355D5525a11119D788a74773a0082l11839F60J5788
10187A6448N2216a9920k54160F5967a83859C23461a02806D5955c04769i5494A35006
10175d12645I8326a04518j15405c5000A58031a81466j93400A9779J22184c65211
10164g7784A9751a6835B70119q3826C8067c0449A1913i729l14178K1746J10038
10153a92123A00045Q319a94554e3192A62240b18040A3612d24675a00194J5522
10143h4672b287B2419j1136b73249m309R7345C8589J27760e6225K5017p023m47171
10131d85402A93007o7862f5893k12613a2095C11254a45718j6308n27619A41116
10120b56887G3696f3812b0554j11072K8888l0555N7639B2400b30725d5029k21750
$$ plain form
10198 -117911 44162 -72859 -278214 45525 -111119 4788 -174773 -10082 -321921 660 16448
10187 16448 68664 -19920 -274080 65967 -183859 323461 -102806 45955 -304769 -95494 135006
10175 -412645 98326 -104518 -219923 -35000 158031 -181466 -374866 19779 141963 -365211
10164 -77784 19751 -16835 270119 186293 38067 -30449 11913 -9729 -323907 -302161 -192123
10153 -192123 100045 108364 -194554 -53192 162240 -218040 13612 -424675 -100194 -84672
10143 -84672 -2287 22419 11283 -273249 -277558 -180213 38589 166349 -56225 -31208 -38231 -485402
10131 -485402 193007 125145 -65893 -278506 -12095 311254 -145718 -162026 -689645 141116
10120 -256887 73696 -63812 -20554 -131626 -102738 -133293 -75654 22400 -230725 -45029 -266779
10109b66779C97107F5028J54577i1863C628i1364o3981D6157j0221a42606k5474
10098a68080n6638k8445m8304a36373G403d8232k36838A36698E6139i4533j50692
10087b45225e8105k04887B23i6591j07707J7462o7135d1593A2362J32489b93823
10075A23743b61209B9180O375L5756B4645b11352k85033F4629b6356k68248P6946
10064b17658a0051E4872a82468j96583A62163K5095j8738b973p8783g708I7489
10052d4168j72532R9297E9752L212a92961h8436j2171A75434E4324g4138l71756
10041d45894a6327k8007A62250a59119A78955J15386A7024b59949d3197q4834
10031a28031N6587A75974b65241c8037m2700c6367A22220K8950b92906R8793F2111
$$ plain form
10109 -266779 397107 65028 219605 -91863 3628 -91364 -155345 46157 35936 -142606 -168080
10098 -168080 -224718 -253163 -301467 -136373 7403 -48232 -285070 136698 56139 -94533 -245225
10087 -245225 -58105 -262992 223 -96591 -204298 -186836 -253971 -41593 12362 144851 -293823
10075 123743 -261209 29180 35555 71311 24645 -211352 -496385 64629 -26356 -294604 -217658
10064 -217658 -10051 54872 -182468 -379051 162163 187258 168520 -2973 -81756 -7708 97489
10052 -44168 -216700 -117403 59752 62964 -192961 -88436 -100607 175434 54324 -74138 -445894
10041 -445894 -16327 -44334 162250 -159119 178955 294341 17024 -259949 -43197 -128031
10031 -128031 -71444 175974 -265241 -38037 -80737 -36367 122220 151170 -292906 -194113 62111
10019b17184g2911K0092B111a69007B9774a55488d1787r022o994j78730e105C18434
10006a67677H802K0657b38577h0965o0081N4668L3150q6487j7496B85139b28641
9994f920H3068b41739R8205P97B58973b36943b4743n8903d1692A06453i7521q6196
9982a83717c5798J475A11418c39752a31256F0989Q9129a77745j24977N7286k4968
9971b70404j7244J10215j93171a67786D8784a01277C7790i245l4219f722A30764
9959F9727J75081a63883j51643A0759c68403E8881o050b95960i652F351a92100
9947c1519l90841J32419B3397a29565I2976b36679O7137B69517e1814j06225K5287
9936a32752m8927H2390b55082j04915I8006f4970j61618q0230A7095Q9780f9984
$$ plain form
10019 -217184 -72911 -52819 2111 -169007 29774 -155488 -41787 -50809 -57803 -236533 -5105 318434
10006 -167677 8802 29459 -238577 -80965 -141046 -86378 -53228 -139715 -157211 285139 -228641
9994 -6920 83068 -241739 -143534 -142737 258973 -236943 -24743 -83646 -41692 106453 -97521 -183717
9982 -183717 -35798 -34323 111418 -339752 -131256 60989 150118 -177745 -302722 -245436 -270404
9971 -270404 -287648 -177433 -370604 -167786 48784 -101277 37790 -9245 -43464 -6722 130764
9959 69727 244808 -163883 -315526 10759 -368403 58881 52831 -295960 -9652 6351 -192100
9947 -31519 -422360 -289941 23397 -129565 92976 -236679 -169542 269517 -51814 -158039 -132752
9936 -132752 -181679 82390 -255082 -359997 98006 -64970 -226588 -306818 17095 106875 -69984
9924d19049h6188Q073H2027a27100n1228Q8990l7286K7667A34920F3472a05105
9912i4170M4196p6343p2032g5440m0361j06094a4247e917j58635k56607f9175
9900b83000A56359a90914F5581C0221J42684b43248k2215c2864A5762L37899c1398
9888B45399I0555h548j10239B77812d39200C13109a51868q7809P8608B1415b24614
9876G8311c0469C6780M4388d866B54470h2373A41411l8483J9482J43196a68515
9864c69286I8194d38478D1339b2272o7076B01558a64033f2557A78768G144c80458
9852a68154e8041m4435l0323j55102C321c0988l09031G0102h0216L0438A73123
9840a0366j828I1202a34028o6193J3644c314D7761b04722f823B45020d02206J06385
$$ plain form
9924 -419049 -86188 -78115 82027 -127100 -178328 -89338 -126624 -98957 134920 63472 -105105
9912 -94170 -49974 -126317 -198349 -75440 -115801 -221895 -14247 -5917 -164552 -421159 -69175
9900 -283000 156359 -190914 65581 30221 172905 -243248 -265463 -32864 15762 353661 -31398
9888 245399 90555 -8548 -118787 277812 -439200 313109 -151868 -239677 -161069 21415 -224614
9876 78311 -30469 36780 81168 -4866 254470 -82373 141411 102928 122410 265606 -168515
9864 -369286 98194 -438478 41339 -22272 -89348 201558 -164033 -62557 178768 7144 -380458
9852 -168154 -58041 -102476 -132799 -287901 3321 -30988 -340019 70102 -80216 -49778 173123
9840 -10366 -12194 91202 -134028 -200221 -186577 -3314 47761 -204722 -6823 245020 -402206 -295821
9828b95821R2160P4498j39985A28835C5920a97413E0108a92118d1270I552d12438
9816E9204a12638b2183B00224o2518l0826k2988a12367A49211a29767k0090o9282
9805b19139N2132h1788b4838p5821p6920e9845K823K7170j72144j78658A55923
9793a29193B56741A16847f0694K8407j25550k08417e7471A3930a41417B027g6296
9781i5892c3012n9997j77741M0171A52699K8396J21425G9352M1335e0758j57921
9770b08679B40008b10945c05p0862m7448K691K5954h447B23490b82543d2079l7289
9758g9368C7656e47G6799a44801A94911a1594j122B4934a60416M8865A44085a64342
9745F1973A551d157k10990H7849a54056o5505q2805f7752J4660q6047L1747D1523
$$ plain form
9828 -295821 -203661 -129163 -269148 128835 35920 -197413 50108 -192118 -41270 9552 -412438
9816 59204 -112638 -22183 200224 137706 106880 83892 -112367 149211 -129767 -149857 -219139
9805 -219139 -167007 -81788 -24838 -100659 -177579 -59845 -57022 -29852 -201996 -380654 155923
9793 -129193 256741 116847 -60694 -32287 -157837 -366254 -57471 13930 -141417 2027 -76296
9781 -95892 -33012 -93009 -270750 -230579 152699 181095 302520 79352 120687 -50758 -208679
9770 -208679 240008 -210945 -305 -71167 -118615 -115924 -89970 -8447 223490 -282543 -42079 -79368
9758 -79368 37656 -547 76799 -144801 194911 -11594 -12716 24934 -160416 -111551 144085 -164342
9745 61973 1551 -4157 -215147 87849 -154056 -219561 -302366 -67752 -53092 -139139 -107392 41523
9732B36600c6322k58029J34591k96921K17100B49429a84847h0718B6684b8196
9721b08877E1965b58887b9632j1378j37633h7567C79645F3527J55629q1583C2763
9709B9577c82738a88433e4380m6973M2405k09287P1818p010P2161A21454N7351
9698A78805a30148D8057J91923a08504e741j00928C9742O5453b86478A95973g8384
9686i4430j20005k6468P7891K6701j16830a6450j26739I5047J05146L9272d01177
9674D264a52454c0483m6916E7464a72596A076R9120B1935a18269H2145h959G166
9661F041a91262g5706J9961j00548A14643J23517B6718c84928A70391B0632P6706
9650I7338a2857k15216B8411K60312A05214M6731b74762A07242c74159d9288m04533
$$ plain form
9732 236600 -36322 -294351 -159760 -456681 -239581 249429 -184847 -80718 26684 -28196
9721 -208877 51965 -258887 -29632 -41010 -178643 -87567 379645 63527 219156 137573 32763
9709 29577 -382738 -188433 -54380 -101353 -58948 -268235 -196417 -203427 -131266 121454 178805
9698 178805 -130148 48057 239980 -108504 -5741 -106669 39742 105195 -286478 195973 -78384
9686 -94430 -214435 -240903 -163012 -136311 -253141 -16450 -143189 95047 200193 239465 -401177
9674 4264 -152454 -30483 -77399 57464 -172596 1076 100196 21935 -118269 82145 -8959 7166
9661 6041 -191262 -75706 -55745 -156293 114643 238160 26718 -384928 170391 20632 97338
9650 97338 -12857 -228073 28411 288723 105214 151945 -274762 107242 -374159 -49288 -453821
9639d53821B6345K30693F2346a99590j43071A43150b3112l46131f2786k7876o8977
9628a59639b7835E5094f1198A39337c40565b9494I4505h7292m5641A17040E0853
9616a34905b5691B38993a42337b5007A75343g1715k64268P3916a25605k14799
9606c40404a05829L078j78264K3689e6749l825q3519d6633l30016g4732k4777
9595i9509B14831a34004p2149A33052D3628K15759B1556a29331b7634I1706d414
9583d43035a37416A74546h2681E4403q89c28336A502c99507d958k77671R8955
9572a83674d3474j5919o9949J6187A26808c5614o0865B06158a20319h658b183
9560a67692d240l0822B01671g6278A10107d5899l08829J53612F00319b17811g0297
$$ plain form
9639 -453821 26345 257038 62346 -199590 -342661 143150 -23112 -369243 -62786 -90662 -159639
9628 -159639 -27835 55094 -61198 139337 -340565 -29494 94505 -87292 -132933 117040 50853
9616 -134905 -25691 238993 -142337 -25007 175343 -71715 -335983 -262067 -125605 -340404
9606 -340404 -105829 -102751 -281015 -257326 -56749 -60574 -144093 -46633 -376649 -74732 -99509
9595 -99509 214831 -134004 -206153 133052 43628 259387 21556 -129331 -27634 91706 -4414
9583 -443035 -137416 174546 -82681 54403 53514 -328336 1502 -399507 -4958 -282629 -183674
9572 -183674 -43474 -59393 -129342 -113155 126808 -35614 -96479 206158 -120319 -8658 -2183
9560 -167692 -4240 -35062 201671 -76278 110107 -45899 -354728 -201116 600319 -217811 -70297
9548h2101j03563j8989a4607k04106G583i7003m4491A31300h3809B16335a4117
9536b60500a11933j04101G8109b5704q1959A18540f5489k74201I3290J5413c0625
9524a90992I5478b78290I0329J05100L6816c8804m00175A9444f7202G113b254
9512c2494j84799Q8190j28071A08801A9037g0222C7097a36024k9830B8896J5296
9501D4192b94052I2387a40816A59639D7311d6132m6654E6391J69352D3922b73750
9489a91390p820C22011a81336m8481o1276D3088b40054c3145B62009N1279c02752
9477f2186A72062K282b58572I3897H165J00572C1327a39444A82762K18589b20058
9465a10808B4625L34108H6477d51119i0577j71182A55511a30197A06893b68507
$$ plain form
9548 -82101 -185664 -204653 -14607 -218713 7583 -97003 -141494 131300 -83809 216335 -14117
9536 -260500 -111933 -216034 78109 -25704 -107663 118540 -65489 -339690 93290 108703 -30625
9524 -190992 95478 -278290 90329 195429 232245 -38804 -438979 19444 -67202 7113 -2254
9512 -32494 -217293 -129103 -257174 108801 19037 -70222 37097 -136024 -165854 28896 44192
9501 44192 -294052 92387 -140816 159639 47311 -46132 -92786 56391 225743 43922 -273750
9489 -191390 -199210 322011 -181336 -229817 -291093 43088 -240054 -33145 262009 313288 -302752
9477 -62186 172062 174344 -258572 93897 8165 108737 31327 -139444 182762 401351 -220058
9465 -110808 24625 358733 86477 -451119 -90577 -261759 155511 -130197 106893 -268507
9454F2286e1864k35899J08916g9157A53264b61049d2190p4474k02389B26414h8923
9442c52008B3262O7039L116O5211n1598b60535A9548c03464N350B8367a36070
9430e2741F5314g1765B00670a79441p277j29071A33984h7492n6482O2801F7851
9418a04434K5793N725n1159D4649a65879C9220A9175a87523e0407B45183d2886
9406B01250h4344E716b53038J20129L4102k27343J24952i4762F8747d32356H0582
9394b2430k41254A40744M8115J7552c84131A37717b19442g6994M242K4098j30224
9383a78878A94154r7035a62690B56515e8294A743J7147J89368n808J09116a45291
9371A74230a35400A90492l3212b02003M4715I9886a13387p7320j75058h2321j39660
$$ plain form
9454 62286 -51864 -287763 -178847 -79157 153264 -261049 -42190 -116664 -319053 226414 -88923
9442 -352008 23262 90301 93417 158628 107030 -260535 19548 -303464 -298114 28367 -136070
9430 -52741 65314 -71765 200670 -179441 -186718 -315789 133984 -87492 -143974 -81173 67851
9418 -104434 -78641 -72916 -124075 44649 -165879 39220 19175 -187523 -50407 245183 -42886
9406 201250 -84344 5716 -253038 -132909 -98807 -326150 -201198 -94762 68747 -432356 80582
9394 -22430 -263684 140744 188859 206411 -384131 137717 -219442 -76994 -72752 -48654 -178878
9383 -178878 194154 97119 -162690 256515 -58294 1743 18890 208258 202450 311566 -145291
9371 174230 -135400 190492 157280 -202003 -157288 99886 -113387 -190707 -365765 -82321 -221981
9360b21981r374E5460e0285k7119I9906f6276p8521j22412B0525J9150j6049P3844
9348I7470e9729A38232D3646a04002I7468a28939M7449j16628L0373k7688k5895
9337b21328g4008B39159F409e3203o9467K7904j12997K5508G071J04351b33920
9325B19031i8328j4612k25978h8646D08972A22963C8207b97416B02581K18132
9315D20713B06594a75785Q1920H315c61694E6605b38674p1697c4759j82985O7898
9304a49846j28068P8475A70996a44604O4088A41533c0658l5286j90220C603a34174
9292b38935L4073A0237a60098k96022h462k04588B28219b56165J26848M3240f859
9280A03177h2102B5889J35411i0986b5401k43147a15717m1430B7100a12341F3217
$$ plain form
9360 -221981 -231355 55460 -50285 -77404 99906 -66276 -144797 -267209 20525 39675 23626 97470
9348 97470 -59729 138232 43646 -104002 97468 -128939 -81490 -198118 -167745 -195433 -221328
9337 -221328 -74008 239159 6409 -53203 -122670 -94766 -207763 -182255 7071 111422 -233920
9325 219031 -98328 -112940 -338918 -88646 408972 122963 38207 -297416 202581 420713
9315 420713 206594 -175785 -93865 8315 -361694 56605 -238674 -310371 -34759 -217744 -149846
9304 -149846 -277914 -199439 170996 -144604 -80516 141533 -30658 -65944 -256164 3603 -134174
9292 -238935 -204862 10237 -160098 -456120 -8462 -213050 228219 -256165 -129317 -86077 -6859
9280 103177 -82102 25889 161300 -90986 -25401 -268548 -115717 -157147 27100 -112341 63217
9268a25578E7239d931C6320M3282c24899a30268L6092A30593a04866j40538E1383
9256a32386I974L0986L708a98583A74929G0093a21569J6386n8388B30508C5933
9244a6636I3529a58399P3518A15593e672B5752N7160b03955k5200a07289A17127
9232a9569F798h5085j82064N1850M3489A4612K50449b19414P673D60244f7798
9220b15317B21994a3491C7225J34207a96069P3883F213K7902A2928R1619g2572
9208a38163M9724r9346F0912A6969a23143o9315A15384C2494a71030A50922h2944
9196g4569A2193d52871a05697G6406c74134J86610I0168c01948e6848B50356b32724
9184g1328l7868m2586B5101M8848b0911G7677a07190J7621j14317I5234a59940
$$ plain form
9268 -125578 57239 -4931 36320 79602 -324899 -130268 -94176 130593 -104866 -245404 51383
9256 -132386 9974 40960 44668 -198583 174929 70093 -121569 -105183 -163571 230508 35933
9244 -16636 93529 -158399 -84881 115593 -5672 25752 82912 -203955 -229155 -107289 117127
9232 -19569 6798 -85085 -267149 -215299 -171810 14612 265061 -219414 -211741 460244 -67798
9220 -215317 221994 -13491 37225 171432 -196069 -122186 6213 34115 12928 104547 -72572
9208 -138163 -88439 -187785 60912 16969 -123143 -192458 115384 32494 -171030 150922 -82944
9196 -74569 12193 -452871 -105697 76406 -374134 -187524 90168 -301948 -56848 250356 -232724
9184 -71328 -109196 -151782 25101 73949 -20911 77677 -107190 -89569 -203886 95234 -159940
9172E8336c70218a01315A60089a4808j74145H5031a06445A4493J01330f6427q1543
9161a47970m0155F0241j0329J91904g512I3668g9439j71884C367d11969G1769
9149A8142J28561b04073A9443K363b64209j13218B9925M4643b63842R0620j72876
9138c46098g1464A84092M9926c97210B25932h6221K7501A7312g9345B5011J65111
9127A90122a48508k88422c7828F5389a3416F4037b7623j97620G5269a56728j17561
9116b74289a09152B20408D5206M4655a16649N7886F6806g6555n5482r6979A3173
9104b53723j2292B97490l3236c1146j57857o76e1373a4692l8654E5292i1610k15363
9092c06973c5721I8887a71441j08326G8349a219j3770j67822f3766K6773k72794
$$ plain form
9172 58336 -370218 -101315 160089 -14808 -188953 85031 -106445 14493 115823 -66427 -147970
9161 -147970 -188125 60241 49912 241816 -7512 93668 -79439 -251323 3367 -411969 71769
9149 18142 146703 -204073 19443 21806 -264209 -377427 29925 74568 -263842 -173222 -346098
9138 -346098 -71464 184092 234018 -397210 225932 -86221 -58720 17312 -79345 25011 190122
9127 190122 -148508 -436930 -37828 65389 -13416 64037 -27623 -225243 75269 -156728 -274289
9116 -274289 -109152 220408 45206 89861 -116649 -58763 66806 -76555 -132037 -229016 13173
9104 -253723 -266015 297490 264254 -31146 -189003 -189679 -51373 -14692 -53346 55292 -91610 -306973
9092 -306973 -35721 98887 -171441 -279767 78349 -1219 -14989 -182811 -63766 -36993 -309787
9081c09787d2529C06225G0476a88209c6444b080I1243l0453K81619A6228a4584
9069H915a36281j39277F1152b67354a12929j8308d7069j39346A01087a62398o8690
9058b31088C09951b15576h1794k28758e2849b0692j35291H3368a25335l80690
9048e06025a97013F8048a67377A24481g4976E7809a93439Q8372r6996l721e7795
9036I3742c83793O4202g006B14562a52559o5574e6899a4641j44161p9906J01419
9025a37289k1637B682N196d40022a64471M5030D83657c95755a5843A01242c33322
9013F9000a20946k3197f0450C2965e524j09439J9672A42499b40932e122A34697
9001a06475k39906a51831c5971j77041c4567k0478l7435b7102l04355B06653A8405
$$ plain form
9081 -309787 -42529 306225 70476 -188209 -36444 -2080 91243 60790 342409 16228 -14584
9069 8915 -136281 -275558 61152 -267354 -112929 -131237 -47069 -186415 101087 -162398 -231088
9058 -231088 309951 -215576 -81794 -310552 -52849 -20692 -155983 83368 -125335 -506025
9048 -506025 -197013 68048 -167377 124481 -74976 57809 -193439 -105067 -202063 -205784 -57795
9036 93742 -383793 -319591 -7006 214562 -152559 -218133 -56899 -14641 -158802 -238708 -137289
9025 -137289 -158926 2682 7878 -440022 -164471 -119441 483657 -395755 -15843 101242 -333322
9013 69000 -120946 -144143 -60450 32965 -5524 -114963 -95291 142499 -240932 -5122 134697
9001 -106475 -346381 -151831 -35971 -213012 -34567 -55045 -92480 -27102 -331457 206653 18405
8989F2270a94445B20208h4596k2278j62872c6934j14856f9222p8505K749k1738
8978a66716G7382B5237P5400c7953A93114a58854e9480p4073k29347c9244o1357
8967a00601E9678b80533A57941C1155K16701a54347p7619J10708A31044c3180
8956i9778M2240A2777Q9033D0950a98016A4411a20826K8611a9773m04419a3396
8944c8694k0004B66306a62070O160B5562K9637a28497l30825f8327j07167A51662
8932d2830E7641N7323n5625b9256A3524a33231C4912J10345Q676p5414P33849
8921H12368A72233K10718A71166E5623K4688P294a94587Q5691j83376a032k66612
8910b67644j06593a45484C5460A7014a71470B27667i0671K7875n0217p6342F0944
$$ plain form
8989 62270 -194445 220208 -84596 -106874 -269746 -36934 -151790 -69222 -147727 -144978 -166716
8978 -166716 77382 25237 100637 -37953 193114 -158854 -59480 -133553 -362900 -39244 -100601
8967 -100601 59678 -280533 157941 31155 247856 -154347 -231966 -121258 131044 -33180
8956 -99778 -57538 12777 101810 40950 -198016 14411 -120826 -92215 -19773 -424192 -13396
8944 -38694 -58698 266306 -162070 -155910 25562 55199 -128497 -459322 -68327 -175494 151662
8932 -42830 57641 114964 59339 -29256 13524 -133231 34912 145257 153933 78519 812368
8921 812368 172233 382951 171166 55623 80311 87605 -194587 -108896 -292272 -1032 -267644
8910 -267644 -374237 -145484 35460 17014 -171470 227667 -90671 -62796 -113013 -189355 60944
8898B75143a42163C6861K65629d7941r6224N5649B9867a40116n2184j54763b6327
8886d41383A25698a31634B17282n5073a55768K1713M8473l6632A01192d3850m3696
8875h7546j28600g680G3873a57418j46287d9486I2240a50154A39363a73866C2065
8863c10104B79375a20084H0877g4474L4885A82268f9930B3077Q902b6313g83k10076
8851b10859q2C2453b0633N648j82070b245H5095q192a24855a7954k58545I0269
$$ plain form
8898 275143 -142163 36861 302490 -47941 -144165 -88516 29867 -140116 -192300 -347063 -26327
8886 -441383 125698 -131634 217282 162209 -155768 -134055 -85582 -122214 101192 -43850 -87546
8875 -87546 -216146 -7680 73873 -157418 -303705 -49486 92240 -150154 139363 -173866 32065
8863 -310104 279375 -120084 80877 -74474 -39589 182268 -69930 23077 31979 -26313 -783 -210859
8851 -210859 -210941 32453 -20633 -14985 -197055 -2245 85095 76903 -124855 -17954 -276499 90269
$$ [...]
##END NTUPLES=NMR SPECTRUM
##END=
