##TITLE=AC1744_SEN00017_9276535_fUiwmSTxca
##JCAMPDX= 6.0         $$ Bruker NMR JCAMP-DX V2.0
##DATA TYPE= NMR SPECTRUM
##DATA CLASS= NTUPLES
##ORIGIN= BRUKER
##OWNER= Administrator
$$ 1.72 TOPSPIN		Version 2.1
$$ 2015-08-07 22:15:14.563 -0700  Administrator@X
$$ Compression mode = diff/dup
##.OBSERVE FREQUENCY= 400.02188249412
##.OBSERVE NUCLEUS= ^1H
##.ACQUISITION MODE= SIMULTANEOUS (DQD)
##.ACQUISITION SCHEME= undefined
##.AVERAGES= 8
##.DIGITISER RES= 22
##SPECTROMETER/DATA SYSTEM= spect
##.PULSE SEQUENCE= zg30
##.SOLVENT NAME= COFFEE_meoh
##.SHIFT REFERENCE= INTERNAL, COFFEE_meoh, 1, 14.98509
##AUDIT TRAIL= $$ (NUMBER, WHEN, WHO, WHERE, PROCESS, VERSION, WHAT)
$$ ##TITLE= Audit trail, TOPSPIN		Version 2.1
$$ ##JCAMPDX= 5.01
$$ ##ORIGIN= Bruker BioSpin GmbH
$$ ##OWNER= Administrator
$$ $$ E:\/data/COFFEE/nmr/AC1744_SEN00017_9276535_fUiwmSTxca/30/pdata/1/auditp.txt
$$ ##AUDIT TRAIL=  $$ (NUMBER, WHEN, WHO, WHERE, PROCESS, VERSION, WHAT)
(   1,<2015-08-07 22:15:07.172 -0700>,<Administrator>,<X>,<go>,<TOPSPIN 2.1>,
      <created by zg
	started at 2015-08-07 22:14:01.344 -0700,
	POWCHK enabled, PULCHK disabled,
       configuration hash MD5:
       21 0F 79 D6 B3 7B B4 F6 88 20 88 DB 03 48 BD 9F
       data hash MD5: 64K
       01 CB CF 50 77 EC F5 42 B1 D2 72 9B 41 34 BE 43>)
(   2,<2015-08-07 22:15:10.391 -0700>,<Administrator>,<X>,<proc1d>,<TOPSPIN 2.1>,
      <Start of raw data processing
       efp LB = 0 FT_mod = 6 PKNL = 1 PHC0 = 0 PHC1 = 0 SI = 32K 
       data hash MD5: 32K
       A0 31 EF 45 24 0B 40 1A 8D B5 1C 1D BC 71 5E AA>)
(   3,<2015-08-07 22:15:10.672 -0700>,<Administrator>,<X>,<proc1d>,<TOPSPIN 2.1>,
      <pk PHC0 = 91.75781 PHC1 = 0 
       data hash MD5: 32K
       9E 59 B6 41 80 D5 E7 73 8B 88 FE 39 AC 09 C1 80>)
(   4,<2015-08-07 22:15:10.781 -0700>,<Administrator>,<X>,<proc1d>,<TOPSPIN 2.1>,
      <abs ABSG = 1 
       data hash MD5: 32K
       7C 29 45 1E B0 D3 4D AB 55 55 8F 1D 6F 28 BC 29>)
(   5,<2015-08-07 22:15:10.844 -0700>,<Administrator>,<X>,<proc1d>,<TOPSPIN 2.1>,
      <abs ABSG = 2 
       data hash MD5: 32K
       A9 24 91 FF A6 FF 09 70 A6 0A 36 F5 82 5C 4F 92>)
(   6,<2015-08-07 22:15:10.906 -0700>,<Administrator>,<X>,<proc1d>,<TOPSPIN 2.1>,
      <abs ABSG = 3 
       data hash MD5: 32K
       7F BC B7 CF B9 6D 81 F2 1D 70 E7 8C 5C DA 72 E0>)
(   7,<2015-08-07 22:15:10.969 -0700>,<Administrator>,<X>,<proc1d>,<TOPSPIN 2.1>,
      <abs ABSG = 4 
       data hash MD5: 32K
       15 7D 7E BA C7 E1 98 CD 04 EE 55 FA FB 1A A9 C9>)
(   8,<2015-08-07 22:15:11.047 -0700>,<Administrator>,<X>,<proc1d>,<TOPSPIN 2.1>,
      <abs ABSG = 5 
       data hash MD5: 32K
       CF E7 EC 1C C0 4E E7 57 5A 26 8B A5 6D A2 89 4D>)
$$ ##END=
$$ 
$$ $$ hash MD5
$$ $$ A1 74 44 B1 43 63 F3 00 53 A2 09 BB F3 03 CC C8
##$RELAX= 
##$RELAX= 
##$RELAX= 
##$RELAX= 
##$RELAX= 
##$RELAX= 
##$RELAX= 
$$ Bruker specific parameters
$$ --------------------------
##$DU= <E:\>
##$EXPNO= 30
##$NAME= <AC1744_SEN00017_9276535_fUiwmSTxca>
$$ [...]
150 150 150 150 150 150 150 150
##$TP07= 0
##$TPNAME0= <>
##$TPNAME1= <>
##$TPNAME2= <>
##$TPNAME3= <>
##$TPNAME4= <>
##$TPNAME5= <>
##$TPNAME6= <>
##$TPNAME7= <>
##$TPOAL= (0..7)
0.5 0.5 0.5 0.5 0.5 0.5 0.5 0.5
##$TPOFFS= (0..7)
0 0 0 0 0 0 0 0
##$TUNHIN= 0
##$TUNHOUT= 0
##$TUNXOUT= 0
##$USERA1= <user>
##$USERA2= <user>
##$USERA3= <user>
##$USERA4= <user>
##$USERA5= <user>
##$V9= 5
##$VALIST= <valist>
##$VCLIST= <CCCCCCCCCCCCCCC>
##$VD= 0
##$VDLIST= <DDDDDDDDDDDDDDD>
##$VPLIST= <PPPPPPPPPPPPPPP>
##$VTLIST= <TTTTTTTTTTTTTTT>
##$WBST= 2048
##$WBSW= 25
##$XGAIN= (0..3)
0 0 0 0
##$XL= 0
##$YL= 0
##$YMAX_a= 600920
##$YMIN_a= -512646
##$ZGOPTNS= <>
##$ZL1= 120
##$ZL2= 120
##$ZL3= 120
##$ZL4= 120
##$ABSF1= 14.98509
##$ABSF2= -5.573092
##$ABSG= 5
##$ABSL= 3
##$ALPHA= 0
##$AQORDER= 0
##$ASSFAC= 0
##$ASSFACI= 0
##$ASSFACX= 0
##$ASSWID= 0
##$AUNMP= <proc_prof1d_extract_pilot.lims>
##$AXLEFT= 0
##$AXNAME= <>
##$AXNUC= <1H>
##$AXRIGHT= 0
##$AXTYPE= 0
##$AXUNIT= <>
##$AZFE= 0.1
##$AZFW= 0.1
##$BCFW= 0
##$BC_mod= 0
##$BYTORDP= 0
##$COROFFS= 0
##$CY= 15
##$DATMOD= 1
##$DC= 0
##$DFILT= <>
##$DTYPP= 0
##$F1P= 0
##$F2P= 0
##$FCOR= 0.5
##$FTSIZE= 32768
##$FT_mod= 6
##$GAMMA= 0
##$GB= 0
##$INTBC= 1
##$INTSCL= 1
##$ISEN= 128
##$LB= 0
##$LEV0= 0
##$LPBIN= 0
##$MAXI= 10000
##$MC2= 0
##$MEAN= 0
##$ME_mod= 0
##$MI= 0
##$NCOEF= 0
##$NC_proc= -8
##$NLEV= 6
##$NOISF1= 0
##$NOISF2= 0
##$NSP= 0
##$NTH_PI= 0
##$NZP= 0
##$OFFSET= 14.98509
##$PC= 1
##$PHC0= 91.75781
##$PHC1= 0
##$PH_mod= 1
##$PKNL= yes
##$PPARMOD= 0
##$PPDIAG= 0
##$PPIPTYP= 0
##$PPMPNUM= 2147483647
##$PPRESOL= 1
##$PSCAL= 4
##$PSIGN= 0
##$PYNMP= <proc.py>
##$REVERSE= no
##$SF= 400.02
##$SI= 32768
##$SIGF1= 0
##$SIGF2= 0
##$SINO= 400
##$SIOLD= 32768
##$SPECTYP= <>
##$SREGLST= <1H.CDCl3>
##$SSB= 0
##$STSI= 32768
##$STSR= 0
##$SW_p= 8223.68421052631
##$SYMM= 0
##$S_DEV= 0
##$TDeff= 65536
##$TDoff= 0
##$TI= <>
##$TILT= no
##$TM1= 0
##$TM2= 0
##$TOPLEV= 0
##$USERP1= <user>
##$USERP2= <user>
##$USERP3= <user>
##$USERP4= <user>
##$USERP5= <user>
##$WDW= 1
##$XDIM= 32768
##$YMAX_p= 438188419
##$YMIN_p= -703417
##$CURPLOT= <Network HP LaserJet P1505>
##$CURPRIN= <$Network HP LaserJet P1505>
##$DFORMAT= <normdp>
##$LAYOUT= <+/1D_H.xwp>
##$LFORMAT= <normlp>
##$PFORMAT= <normpl>
##$SURQMSG= 1
$$ End of Bruker specific parameters
$$ ---------------------------------
##NTUPLES= NMR SPECTRUM
##VAR_NAME=  FREQUENCY,     SPECTRUM/REAL,   SPECTRUM/IMAG
##SYMBOL=    X,             R,               I
##VAR_TYPE=  INDEPENDENT,   DEPENDENT,       DEPENDENT
##VAR_FORM=  AFFN,          ASDF,            ASDF
##VAR_DIM=   32768,         32768,           32768
##UNITS=     HZ,            ARBITRARY UNITS, ARBITRARY UNITS
##FACTOR=    0.250966925370066, 1,           1
##FIRST=     8223.43324360094, 95042,        149642
##LAST=      0,             -2999,           -201088
##MIN=       0,             -703417,         0
##MAX=       8223.43324360094, 438188419,    0
$$ Real data points
##PAGE= N=1
##DATA TABLE= (X++(R..R)), XYDATA
$$ [...]
19555e7222A22142J75513n9984b7861k73945a35573L8163n228j04152i101j06093
19544a15194J7409j3611j67947b1425B70578G1774K94921b38711j7189A8565g3177
19532C6799J53799a38333b9819l26441K6814B8363e3644j15901k66861C33166
19521F7017a49688J4242C3528a2971G0861B0145K438c59886A20813e8776l57599
19510d16375f5091j06172c294k56101A64470o5332e54344a05764L8899o3489I0796
19498a05661A33274C4296J17409a58911P8109n366A13875P4785a25498C2074a12936
19486e8714A63703g7997I7839a19870m3327d2178n55357a21298l92873A24368
19475b13558l9623A21399B419M7109A4176b36769A52156b31678A20858E9912d4093
$$ y = [-57222, 122142, 297655, 237671, -27861, -301806, -135573, -97410, -102638, -206790, -9101, -115194, -97785, -111396, -279343, -21425, 270578, 71774, 366695, -238711, -255900, 18565, -73177, 36799, 190598, -138333, -29819, -356260, -329446, 28363, -53644, -169545, -436406, 333166, 67017, -149688, -135446, 33528, -12971, 70861, 20145, 22583, -359886, 120813, -58776, -416375, -65091, -171263, -3294, -259395, 164470, 99138, -554344, -105764, -66865, -130354, 90796, -105661, 133274, 34296, 151705, -158911, -80802, -86168, 113875, 188660, -125498, 32074, -112936, -58714, 163703, -77997, 97839, -119870, -163197, -42178, -597535, -121298, -514171, 124368, -213558, -253181, 121399, 2419, 49528, 14176, -236769, 152156, -231678, 120858, 59912, -44093]
19463c14188E6162c683A92756b43036a16754l6413O5913A42724B5905K5845e116
19451A49606D5227e4323j17511h5331G8517O0003O6588A01643e6444j35879b0000
19439b54389g067B58946d62354a35999l6203A95213e9682B25363i8878A87379
19428A7299O0281E293a36723l68582B5628d73188a60247E3166P2132c37446D9765
19416a9045q3983D9838b00209j56260a10061j98965d6010A53644a37466A10484
19405a53120b8111k49321d2872O39k08180D17764b4851A06703b1652j20381l2872
19394a74905l4677h7978j42750a0106E5406a89443B84120f3519A64409c14553
19383A22138c92267a50082L9440a9368B59525A2752a34227M756B00056a25823
$$ y = [-314188, 56162, -3683, 192756, -243036, -116754, -153167, -87254, 142724, 25905, 51750, -5116, 149606, 45227, -54323, -171834, -85331, 78517, 138520, 205108, 101643, -56444, -192323, -20000, -254389, -7067, 258946, -462354, -135999, -172202, 195213, -59682, 225363, -98878, 187379, 17299, 77580, 5293, -136723, -505305, 25628, -473188, -160247, 53166, 125298, -337446, 49765, -19045, -103028, 49838, -200209, -356469, -110061, -309026, -46010, 153644, -137466, 110484, -153120, -28111, -277432, -42872, -42233, -250413, 417764, -24851, 106703, -21652, -142033, -174905, -209582, -87978, -230728, -10106, 55406, -189443, 284120, -63519, 164409, -314553, 122138, -392267, -150082, -110642, -19368, 259525, 12752, -134227, -129471, 200056, -125823]
19372F0091a78808o4372a14891L4941a0791A84139H654c0485P602A99989h0944
19360A7969a98845N5083E2556O0720E2043a51879M5716A45961e6283A18881l0265
19349H8616a22249l4216j534k35280o5377Q0893J72299A2153b76730h3529k37317
19338c20846e2527q7646B05661b66311b1529A58651b56827O0908N76k4907j169
19327b21419K2524H6071a09001A4246a66872g260k89640k1130A68266e5009A50084
19315A21100k5147b65555e9867A58541l6411O2403d4863k42122L3137e9169j02494
19304a61663j15925A55504c4183G5322a9018A9206d52618h1650j12143L3324K4537
19293a35932J2742L6090J0055E4491J70333G5837g758A8116R482K29881c8854
$$ y = [60091, -178808, -243180, -114891, -79950, -10791, 184139, 8654, -30485, -22883, 199989, -80944, 17969, -198845, -143762, 52556, 113276, 52043, -151879, -106163, 145961, -56283, 118881, 88616, -122249, -156465, -157999, -393279, -458656, -377763, -205464, 12153, -276730, -83529, -320846, -52527, -140173, 205661, -266311, -21529, 158651, -256827, -195919, -195343, -220250, -221419, -198895, 86071, -109001, 14246, -166872, -7260, -296900, -318030, 168266, -55009, 150084, 121100, 95953, -265555, -59867, 158541, 122130, 184533, -44863, -286985, -253848, -59169, -161663, -277588, 155504, -34183, 75322, -19018, 19206, -452618, -81650, -193793, -160469, -135932, -123190, -87100, -77045, 54491, 224824, 75837, -7758, 18116, 27598, 257479, -38854]
19281H9359R6415a75007o5249a09406B957c0898A11372b01145B81213h0323a4344
19269B76766j36432j5512b00623F2242a39850j97436e9432j78831A67372B2461
19258G8666b38570A2732d56359c1159F1563J50637n3614D8070d56383K15059K9037
19247b12287R4596k24132H5383J4767D1510a11361A0960f305D2523d34642C67463
19235a5873B04014a86448f3866r2001a9372B27570A08579a9688E3181B5753a20158
19223A79211c97467a05228A38923b35178n0930J38406C20637h3323c9668j35108
19213a74776N4588A17661a21495N2587E910f6383j21756A63630a49807j17647
19203b67454J13184d0379A15904a28095i773j68778d4666m16795B116b81576D0314
$$ y = [89359, 185774, -175007, -240256, -109406, 2957, -30898, 111372, -201145, 281213, -80323, -14344, 276766, 140334, 124822, -200623, 62242, -139850, -337286, -59432, -238263, 167372, 22461, 78666, -238570, 12732, -456359, -31159, 61563, 212200, 158586, 48070, -456383, -241324, -212287, -117691, -341823, 85383, 100150, 41510, -111361, 10960, -6305, 42523, -434642, 367463, -15873, 204014, -186448, -63866, -155867, -19372, 227570, 108579, -19688, 53181, 25753, -120158, 179211, -397467, -105228, 138923, -235178, -286108, -147702, 320637, -83323, -39668, -174776, -120188, 117661, -121495, -68908, 5910, -66383, -188139, 163630, -149807, -267454, -154270, -40379, 115904, -128095, -9773, -178551, -44666, -461461, 2116, -281576, 40314]
19191B9607J49254F7185B9444a00289D1529a88251B244d27827A02422h5009q2266
19180a67275A40208c90671B919g7261k31241G4412A4845c12890A22463n9503b21898
19168a44864j12704I8981b78678G4059N03J03044q5218P0163a08080j70065J06756
19157a71389N703M2416j95436R3785c5623I9311f8893q6502C4307a26223i847
19145b7210G4306h1402m0403B15902a15281A61554b41903E8945k3433l477a05464
19133D6464f4272D1597L9700k5880j6042b8793B1843b19761A63823c72382K6304
19122c46078A11903D0165a56331g2206j8284l21956a16445o5300c7045G7578J54634
19111B32212b53960e5683o3735A16139Q182K211d0859F9736a22144j53157e8263
$$ y = [29607, 178861, 67185, 29444, -100289, 41529, -188251, 2244, -427827, 102422, -85009, -167275, 140208, -390671, 2919, -77261, -308502, 74412, 14845, -312890, 122463, 62960, -221898, -144864, -257568, 98981, -278678, 74059, 74562, 177606, 92388, 162551, -108080, -278145, -171389, -165686, -123270, -318706, -224921, -35623, 99311, -68893, -155395, 34307, -126223, -9847, -27210, 74306, -81402, -121805, 215902, -115281, 161554, -241903, 58945, 35512, 32035, -105464, 46464, -64272, 41597, 81297, 55417, 39375, -28793, 21843, -219761, 163823, -372382, -346078, 111903, 40165, -156331, -72206, -90490, -412446, -116445, -181745, -37045, 77578, 232212, -253960, -55683, -119418, 116139, 124321, 126532, -40859, 69736, -122144, -275301, -58263]
19099B2469a22236l19315A59754o7606O653g1867C5167a9469k31494J6164k35238
19088d70037a97481B0070b30071A60844a87976B467g5622L3102k90013J33841
19078a98692C7071J03794F8681a64214E7945a1544B03330a04214C67506b88247
19067b50678J13422B63008h8212j20346E9849a56660P6427j87950B29181b15615
19056a50380o4151H5027O3007C0805d12955a63021I6142J01026P0731a70166d3844
19044a86052k14700B57670a28564K4652q1125C5209a24939D9295e862k63677C5663
19032I8684m8407a74001l2926C71381A14190g0092E0168J82019a03388o6645g2656
19020a76209Q1976j14487B13142l3135b14983B4350K5346J2739b5398I2051e9344
$$ y = [22469, -122236, -441551, 159754, 92148, 98801, -71867, 35167, -19469, -250963, -234799, -470037, -197481, 20070, -230071, 160844, -187976, 2467, -75622, -42520, -332533, -198692, 37071, 140865, 68681, -164214, 57945, -11544, 203330, -104214, 367506, -288247, -250678, -137256, 263008, -88212, -208558, 59849, -156660, -80233, -268183, 229181, -215615, -150380, -214531, 85027, 148034, 30805, -412955, -163021, 96142, 197168, 267899, -170166, -43844, -186052, -400752, 257670, -128564, -103912, -185037, 35209, -124939, 49295, -5862, -269539, 35663, 98684, 50277, -174001, -206927, 371381, 114190, -70092, 50168, 232187, -103388, -170033, -72656, -176209, -94233, -208720, 213142, 180007, -214983, 24350, 49696, 62435, -25398, 92051, -59344]
19008C9518N2624e6965B22459e0264D5522b90475g250D8230a27506j40391a20305
18996b06716A91583l3216B2363M6751a76847r8524A86187E412f7214K424D5943
18984e2166J5529B04498I6874c79435J35495A46430f6583c0976I557b86419k7115
18973c13534B79748p7729C8219K2780e8963P53q3318B5189a8316C44830G5923
18961b81859G6358O7532l8590J56099i3110F6824f8542L2627k3987A27414A1973
18949a02936j5166B22463b06202h8802B90416b5841q4764k1168n7552Q0672k91628
18938d00281b4499I6697d6226a9821j26334L4405N5394G9848K56226c08539a40894
18926f2070A44334c11303d2416A01014d8814A73429l1205g5943a9120o8013H3547
$$ y = [39518, 92142, -56965, 222459, -50264, 45522, -290475, -7250, 48230, -127506, -267897, -120305, -206716, 191583, 158367, 22363, 69114, -176847, -275371, 186187, 5412, -67214, -64790, 45943, -52166, -36637, 204498, 96874, -379435, -243940, 146430, -66583, -30976, 9557, -286419, -313534, 279748, 202019, 38219, 60999, -58963, -58210, -141528, 25189, -18316, 344830, 75923, -281859, 76358, 143890, 105300, 261399, -93110, 66824, -68542, -35915, -59902, 127414, 11973, -102936, -118102, 222463, -206202, -88802, 290416, -25841, -110605, -131773, -189325, -108653, -400281, -24499, 96697, -46226, -19821, -146155, -111750, -56356, 79848, 336074, -308539, -140894, -62070, 144334, -311303, -42416, 101014, -48814, 173429, 142224, -75943, -19120, -87133, 83547]
18914A855a92379A9504a80351g3918J2971m6359A6479h6160D2563d8035F5185
18902g9535j69800Q5852L1379l7988A928J039h4259K9548I7983a59755A5713i8447
18889a82758B08437l6238c10806a49439M9224k70508J43367J12086H0557J77768
18879B58325K6243a8916G3554B141K2349J66526c63191a03337A98332m0073a18044
18867b12854N9690f7090k04358O5880E9835B81J48978a72656H2216Q3867d34058
18855a54285F9344a26433E416b85802A75770i1837j31649g1458K7093B7078J81990
18844B09068b05042e4905E8071F909J20372D2424a45184B40258a43785B65704
18833b60256J13251l6790A0738a57139N5856J5596j38403i8389B69467j4872a7680
$$ y = [1855, -192379, 19504, -180351, -73918, -60947, -107306, 16479, -86160, 42563, -48035, 65185, -79535, -249335, -163483, -132104, -170092, 1928, 2967, -84259, -54711, 97983, -159755, 15713, -98447, -182758, 208437, 172199, -310806, -149439, -100215, -370723, -227356, -115270, 80557, 258325, 284568, -18916, 73554, 2141, 24490, 191016, -363191, -103337, 198332, 158259, -118044, -212854, -153164, -67090, -271448, -205568, 59835, 281, 149259, -172656, 82216, 166083, -434058, -154285, 69344, -126433, 5416, -285802, 175770, -91837, -223486, -71458, -44365, 27078, 209068, -205042, -54905, 58071, 6909, 127281, 42424, -145184, 240258, -143785, 265704, -260256, -147005, -183795, 10738, -157139, -101283, -85687, -224090, -98389, 269467, 254595, -17680]
18821F6211c1310B33381a43376j72725A95381a067C9953J68496a68819I4661f120
18809a00370C56567J44930a39142l6810B1220B410G37K30090a10155l9552A10527
18797b17017G9275A718a84755B67740a4724k8963B44786b39118h2508q1306F9277
18785A88098k1072H3476b07352C1635b49496O5187P5261C5172L2182a41828A30188
18773A26842a12408q48J2808B1937a59656N1527c5651q1568K7230H3232b42112
18761a26373m2270A2779i4892I5471l4777b23987c4795A6388a86419f7006r8086
18750a65092A8185c95149a05875A54136C0678b05068A34830h177G7622Q9012l1233
18739A35401a82338m4928P2987J2416J9030M0454j23870R5403A14347b07216l4050
$$ y = [66211, -31310, 233381, -143376, -316101, 195381, -1067, 39953, 208449, -168819, 94661, -6120, -100370, 356567, 501497, -139142, -175952, 21220, 2410, 737, 230827, -110155, -149707, 110527, -217017, 79275, 1718, -184755, 267740, -14724, -43687, 244786, -239118, -82508, -163814, 69277, 188098, 167026, 83476, -207352, 31635, -249496, -184309, -109048, 35172, 67354, -141828, 130188, 126842, -112408, -113256, -100448, 21937, -159656, -108129, -35651, -117219, -89989, 83232, -242112, -126373, -168643, 12779, -94892, 95471, 60694, -223987, -34795, 16388, -186419, -67006, -165092, 18185, -395149, -105875, 154136, 30678, -205068, 134830, -8177, 77622, 166634, 135401, -182338, -227266, -154279, -141863, -122833, -82379, -206249, -110846, 114347, -207216, -241266]
18728b41266P3774n5705P8571e5495i044G7758b37540m9971B57959g7663A08133
18716A58716a50355k96477J08437a45591C4120c77542a90j44699C48943d85814
18705A23078h1250H310K453a69910o2664E7717d8643A54040A9472L7982K2478
18694G9932b68440A3566a04731j81864R7832e0927C1211a25708A38662B1677b0047
18682a47741k04089A83448m5284a53136c6736C05029P6324b9926l04859A03364
18671a48090j07163C87634D3279L00874r5912a03559j75850R5793B00308O9605
18661B69913a7490j6846o1964A3604b58409a5942l39037B5084f9586j99668H5926
18649B2709b69422C3410a67967G5235b03783J01441K7022A07511c20113N0745
$$ y = [-241266, -167492, -223197, -144626, -55495, -9044, 77758, -237540, -287511, 257959, -77663, 108133, 158716, -150355, -446832, -338395, -145591, 34120, -377542, -190, -144889, 348943, -485814, 123078, -81250, 8310, 10763, -169910, -232574, 57717, -48643, 154040, 19472, 57454, 79932, -268440, 13566, -104731, -286595, -188763, -50927, 31211, -125708, 138662, 21677, -20047, -147741, -351830, 183448, 138164, -153136, -36736, 305029, 381353, -29926, -334785, 103364, -148090, -255253, 387634, 43279, 344153, 248241, -103559, -279409, -183616, 200308, 269913, -17490, -34336, -96300, 13604, -258409, -15942, -354979, 25084, -69586, -269254, 85926, 22709, -269422, 33410, -167967, 75235, -203783, -102342, -75320, 107511, -320113, -269368]
18639b69368G833b83763a19273j13388A91153a54057N2214K1367A4065J04716
18629A18781b04041D9178J7512b5872k79459A49099g8552c2186p8084D23557E2206
18617H214b56909P1395J0101p8853J00339C5585a41070A15884f3863n8561N8502
18606f3922j25801J3220K7351G2566K58075B2493N5437a7578C87055e5714N823
18595d9891k44236D24540a60734C21164a11958j2383J5546i354E9359b51299J19861
18584a31438A46579O1278f3631A32718c98769a44143K4894b3074A40057K08621
18574C48678A13405b25677e7073J1659j64066k6829C08904b95353C18063E7703
18563F4297b56219a01173j43399E9568Q0348m4384a89124D5659a93203c8572k76237
$$ y = [-269368, 7833, -283763, -119273, -232661, 191153, -154057, -101843, -80476, 14065, 118781, -204041, 49178, 66690, -25872, -305331, 149099, -78552, -32186, -110270, 423557, 52206, 8214, -256909, -185514, -175413, -254266, -153927, 35585, -141070, 115884, -63863, -122424, -63922, -189723, -176503, -149152, 72566, 330641, 22493, 77930, -17578, 387055, -55714, -49891, -294127, 424540, -160734, 321164, -111958, -124341, -108795, -9354, 59359, -251299, -131438, 146579, 207857, -63631, 132718, -398769, -144143, -119249, -23074, 140057, 348678, 113405, -225677, -57073, -45414, -209480, -236309, 308904, -295353, 318063, 57703, 64297, -256219, -101173, -244572, 59568, 139916, 95532, -189124, 45659, -193203, -38572, -314809]
18552c14809F4585g3075D4498b595A32368g3037m06796a43095j71231a23059c3704
18540a38711b3625l50135d6122j8539k66862a7338n4038r062L6643k57093a33415
18528a60100j00494a12657M9603a9640F6887J92453I4759b94363j5817j65031
18518d75211a45255J0116I2570b40579m5682g4254D7254R6004b19825g738j45814
18507a53552M7811C4842i2985e486k2952I7387a30145E4013b48012a7172j19702
18496a36874H8648a44637H7417Q0193a566I7226g3553j1430j68840i563j18448
18485a28011H6082J98490a71836r9313a7190j463H7523R7284a54498d3183r1273
18474a34456k40331c2050k91645G0485P6777b78830A4475e3962j54918Q029A25916
$$ y = [-314809, 64585, -73075, 44498, -2595, 132368, -73037, -479833, -143095, -314326, -123059, -33704, -138711, -23625, -373760, -46122, -64661, -331523, -17338, -71376, -80438, -43795, -300888, -133415, -160100, -260594, -112657, -63054, -19640, 66887, 259340, 94759, -294363, -310180, -475211, -145255, -135139, 92570, -240579, -286261, -74254, 47254, 143258, -219825, -7738, -153552, -105741, 34842, -92985, -5486, -28438, 97387, -130145, 54013, -248012, -17172, -136874, 88648, -144637, 87417, 167610, -1566, 97226, -73553, -84983, -253823, -9563, -128011, 86082, 284572, -171836, -271149, -17190, -18653, 87523, 184807, -154498, -43183, -134456, -374787, -32050, -323695, 70485, 147262, -278830, 14475, -53962, -208880, -200851, 125916]
18462C5357h006B76337b35654J2023C2000A5775a71623D6254Q3453b91114E9361
18450d5226a5983A26087h7137B10883b31290R5515O6975p9710P2820B3376J86078
18439B09454l6351a6557m6985a767A14578i9559A03332B1306Q7139c30026B56414
18427b53970J11549j55936E972J05623J12814I6731Q2047N86C8395a90899A06756
18415a46546f8443A38785d3125A85399a09668k65851F4260P2286J77160j20317
18405A93389o0101d0134A7471b47346A23274c3283j96765N2707e3405P73j83358
18394b35990C3111a44770k5346H6783a24538j6093j60310P8065B0656e6950a2045
18382A05983l580a51800I9446R3936a01019q9363A55983e596G9908C2758b0768
$$ y = [35357, -8006, 276337, -235654, -223631, 32000, 15775, -171623, 46254, 129707, -291114, 59361, -45226, -15983, 126087, -87137, 210883, -231290, -135775, -68800, -148510, -75690, 23376, 209454, 173103, -16557, -63542, -1767, 114578, -99559, 103332, 21306, 108445, -330026, 256414, -253970, -142421, -298357, 5972, 111595, 224409, 96731, 178778, 179364, 38395, -190899, 106756, -146546, -68443, 138785, -43125, 185399, -109668, -375519, 64260, 136546, 313706, 193389, 133288, -40134, 17471, -247346, 123274, -33283, -230048, -177341, -53405, -52632, -235990, 33111, -144770, -170116, 86783, -124538, -140631, -300941, -222876, 20656, -56950, -12045, 105983, 102403, -151800, 99446, 193382, -101019, -190382, 155983, -5596, 79908, 32758, -20768]
18370h7673m0928D5567h5955m0818C54089F9870b30411i2407B08905p2570o682
18359A29653o0797c04037o1429n4062d1328j05926N8598A2089a16776G0352J31020
18348B01372f1448n9975m5682P3529B75487J62522E3234a1366C3028K3895O9047
18337A25970o723j044c1596j19338c2458D5243i4057H2707B345J5009h6210k9642
18325a15852j46782E2909P5939c51951q3506A01874L33803F1507c37415A48463
18314f0543r4522N9621j77657J1422e7445j28780P7258F2138g165l02118h013
18302A82211c91015P7856J0714A18597a41546k9364m8146H7186i2074c2583B93297
18290a60617e0182K1405j54783N197j47213J59324o7308A61746J6871o6802a00306
$$ y = [-87673, -128601, 45567, -85955, -126773, 354089, 69870, -230411, -92407, 208905, 136335, 129653, 68856, -304037, -365466, -419528, -41328, -147254, -88656, 12089, -116776, 70352, 201372, -61448, -121423, -167105, -93576, 275487, 438009, 53234, -11366, 33028, 56923, 125970, 119247, 118203, -31596, -150934, -32458, 45243, -94057, 82707, 2345, 17354, -86210, -115852, -262634, 52909, 128848, -351951, -435457, 101874, 435677, 61507, -337415, 148463, -60543, -155065, -95444, -273101, -261679, -57445, -186225, -108967, 62138, -7165, -309283, -8013, 182211, -391015, -313159, -302445, 118597, -141546, -170910, -219056, 87186, -92074, -32583, 293297, -160617, -50182, -28777, -183560, -178363, -325576, -166252, -233560, 161746, 178617, 111815, -100306]
18278A09126a45553I8647B1213a01941A61638r967a48311A50720G2467m519f3875
18266B33238c5480E4642M7709b83895l18523B52794B7981a25505J5142E0894J53627
18255B04521m7829F5579c55338C8535o539J39719f9024a008H0629R8906d9249
18243A49227e6139k79618D6100J47157B6301a15801N1265A5554J50168E301j84
18232E117J79J33810d35318b0723l11256M9906A26483J99727a29725B52329A3835
18220F1672J14580l1586a36990F7350H37c3336l11569b2619A47178J56444c7656
18208I1750B9240a85204A61554c73466A18233K02913d0808n5269C1863L0961N9963
18197A22787m5106c51868a52987e0027K3744j01479A2238d3394A32286n9175k7533
$$ y = [109126, -145553, 98647, 21213, -101941, 161638, 151671, -148311, 150720, 72467, 67948, -63875, 233238, -35480, 54642, 102351, -283895, -602418, 252794, 27981, -125505, -110363, 50894, 204521, 156692, 65579, -355338, 38535, 31996, 171715, -69024, -1008, 80629, 179535, -49249, 149227, -56139, -335757, 46100, 193257, 26301, -115801, -64536, 15554, 165722, 5301, 5117, 5296, 139106, -435318, -20723, -331979, -282073, 126483, 326210, -129725, 252329, 13835, 61672, 176252, 144666, -136990, 67350, 837, -33336, -344905, -22619, 147178, 303622, -37656, 91750, 29240, -185204, 161554, -373466, 118233, 321146, -40808, -96077, 31863, 62824, 122787, 77681, -351868, -152987, -50027, -26283, -127762, 12238, -43394, 132286, 73111, 45578]
18186D5578O9594l3954j5255a5442j60117N854A17899b2547B22597f1124h882
18174A58107F5874E218a932k55036A27160m3321b71502a06125j3406A44483e5635
18162a36611J8245D4213J03559a58617B87310I3824c4064k3667a744E9166J54791
18151B13957a0075n7563j29819j05661I5830c16271K6081A13018Q4475O3167a97414
18139a68223a2129j70177e5532j74498c8411r1714m1814A46001g668m4719E345
18127A04004J12693b14395R2413r0752K0260n2975C06114o662a22389B3668a90916
18115a13167k34662g2557L99o1339r0687I335K0073h487k30497r2532A67154D3200
18102G3608a22814l22164h0111b1849r4612n7197m2231A97897a24534j20122J10436
$$ y = [45578, 115172, 81218, 65963, -15442, -175559, -169705, 117899, -22547, 222597, -61124, -8882, 158107, 65874, 5218, -1932, -256968, 127160, 83839, -271502, -106125, -119531, 144483, -55635, -136611, -118366, 44213, 147772, -158617, 287310, 93824, -34064, -57731, -1744, 59166, 213957, -10075, -67638, -197457, -303118, 95830, -316271, -290190, 113018, 197493, 260660, -197414, -168223, -12129, -182306, -55532, -230030, -38411, -130125, -171939, 146001, -7668, -52387, 5345, 104004, 216697, -214395, -121982, -212734, -192474, -245449, 306114, 299452, -122389, 23668, -190916, -113167, -347829, -72557, -72158, -133497, -224184, 9335, 29408, -8487, -238984, -331516, 167154, 43200, 73608, -122814, -444978, -80111, -21849, -116461, -173658, -215889, 197897, -124534, -244656, -134220]
18091a34220j26976b9554A51709b30061L5740G5088a11212H8158A1317Q5013J75989
18080B72319f8378m9886G0978J12045N0011b79197a13326j17400a7480E2659J75219
18069B27878i7580k25196A31236A8639a67039N699c1111A47010c01204O1823E0342
18057E2585J98106F8242P7008h9883A23983a3707B92592A12290a23768b2929k48071
18046b71000A6506J8757r380N4948C4389a19068K8885j5973J5239B97271a28015
18034B8777E822a65374N7146M2055j34171c7031k89512A18516a56281A16405K4905
18023A41310C3638Q4836C9571c7590a5796A36790b2486A37382h1643l68686A95157
18011h0620D6560K9067J14299a41986j8652B56898H7045h8590a5595A52106b37216
$$ y = [-134220, -261196, -29554, 151709, -230061, -194321, 75088, -111212, 88158, 11317, 96330, 272319, -68378, -118264, 70978, 183023, 233034, -279197, -113326, -230726, -17480, 52659, 227878, -97580, -322776, 131236, 18639, -167039, -161340, -31111, 147010, -301204, -239381, 50342, 52585, 250691, 68242, 145250, -89883, 123983, -13707, 292592, 112290, -123768, -22929, -271000, 16506, 35263, 25883, 80831, 34389, -119068, -90183, -106156, -90917, 297271, -128015, 28777, 5822, -165374, -108228, -66173, -200344, -37031, -326543, 118516, -156281, 116405, 141310, 33638, 118474, 39571, -37590, -15796, 136790, -22486, 137382, -81643, -450329, 195157, -80620, 46560, 75627, 189926, -141986, -160638, 256898, 87045, -88590, -15595, 152106, -237216]
17999b2621M860k81565a08865c9599j85483i2857j35818J00792H7010a87193A55275
17987E2487g1876C49625H3943N4908B0674e7662K5062E3163N5342a87287f3153
17975C4832f8878o6561A3405b66811A36841C768g0853D4700j684P2159b327n6708
17963e9035j02072m707A66507C5092g4996D4617i4350l55948J87564a02829k69360
17952c72189A34402F6118a64090j63752I6918a91350A70803e0117A55425P0975
17942B26400q4999b34031P1254B85841b21256J2908e9155F5372O2879e086B46453
17930A53156G3131J29061G6449c09338A0126D2P5076M7061a95392R7050B09393
17918B19647g8302b750C13858d57792A05507m135g246E4811O4478e6861C48637
$$ y = [-22621, -17761, -299326, -108865, -39599, -225082, -92857, -228675, -127883, 87010, -187193, 155275, 52487, -71876, 349625, 83943, 138851, 20674, -57662, -32600, 53163, 108505, -187287, -63153, 34832, -68878, -135439, 13405, -266811, 136841, 3768, -70853, 44700, 43016, 115175, -2327, -59035, -161107, -165814, 166507, 35092, -74996, 44617, -94350, -450298, -262734, -102829, -372189, 134402, 66118, -164090, -327842, 96918, -191350, 170803, -50117, 155425, 226400, 141401, -234031, -162777, 285841, -221256, -208348, -59155, 65372, 128251, -5086, 246453, 153156, 73131, 202192, 76449, -309338, 10126, 42, 75118, 122179, -195392, -98342, 209393, 219647, -78302, -2750, 313858, -457792, 105507, 101372, -7246, 54811, 119289, -56861, 348637]
17906a1935F1359a67088b6625B91961a96800G1532a91087B05628i0801m09042
17896d99843K29608J24721j89482O2501A57110n4177e8354B4310b08884A32764
17885A99537a24142K3997j53026j30706b9091j7852j34011B31760c17653I0940
17874a33088A0248J83532a04384A16382F83i7240C70113d67110e4670B02056b81989
17862b8413k86419K0821I3045b4550A25533o2575a65879G7211a02501B86100F3353
17850a94098A07666j4613b52734F7918i7933I9378c56292a54496k42610G2983
17839H5285a2921E0804i5164I1963a27046b7228L09n2368C25167G632c1956A88445
17826C7496a35172C37881j13507G3623R3138P5366F198h0380l0760N3241A55589
$$ y = [-11935, 61359, -167088, -26625, 291961, -196800, 71532, -191087, 205628, -90801, -499843, -270235, -145514, -334996, -272495, 157110, 102933, -58354, 24310, -208884, 132764, 199537, -124142, -100145, -253171, -383877, -29091, -46943, -180954, 231760, -317653, 90940, -133088, 10248, 193780, -104384, 116382, 683, -97240, 370113, -467110, -54670, 202056, -281989, -28413, -314832, -294011, 93045, -24550, 125533, 62958, -165879, 77211, -102501, 286100, 63353, -194098, 107666, 93053, -252734, 67918, -97933, 99378, -356292, -154496, -397106, 72983, 85285, -12921, 50804, -95164, 91963, -127046, -27228, -26919, -79287, 325167, 7632, -31956, 188445, 37496, -135172, 337881, 224374, 73623, 166761, 242127, 6198, -80380, -111140, -57899, 155589]
17814B3689c0946B45407E7251a84773G794K06702a37416A27193J34692E3959J13378
17803A67337b974q6376B22718a39917h23A13739A1295K5087b12134e0574D8025
17791D69460F6689L3401a55717C8044b7093A65234b74685f8803D78190e4094j53474
17780b07568A48745g9643A34065R5346d3691j97979H177b48758j962j9069F3740
17768H8756K98406e0732I4851f8652j16415A94413a85435d6061A07776m6862B0581
17756F9683b75275F3291a07692h77j5068j22440I4750P3346G493J41213h5891
17744G8710l6318j9079f8470j34163d9224A26366a3096B12808a65253k71396G8615
17732H5546a41062q1521f9180l1808d9588H5111O6571C4536a4280l1952k78921
$$ y = [23689, -30946, 245407, 57251, -184773, 7794, 214496, -137416, 127193, 261885, 53959, 167337, -2974, -89350, 222718, -139917, -823, 113739, 11295, 36382, -212134, -50574, 48025, 469460, 66689, 100090, -155717, 38044, -27093, 165234, -274685, -68803, 478190, -54094, -207568, 148745, -79643, 134065, 229411, -43691, -241670, 8177, -248758, -250720, -269789, 63740, 88756, 387162, -50732, 94851, -68652, -185067, 194413, -185435, -46061, 107776, 60914, 20581, 69683, -275275, 63291, -107692, -877, -15945, -138385, 94750, 168096, 7493, 148706, -85891, 78710, 42392, 23313, -68470, -202633, -49224, 126366, -13096, 212808, -165253, -436649, 78615, 85546, -141062, -222583, -69180, -100988, -49588, 85111, 151682, 34536, -14280, -46232, -325153]
17721c25153I2667a43308a2792B25577M0985A07075M1436B9328d55595C2726Q3646
17710A16372m2242d36363A62482a91398r3754G8809a89242H1541a43315p2023
17700b15338F2921a0645p1128l15012D410h2606A36431R061N4610a46890m103
17689a50993b7625j78364Q7067E5026K58071A28406l9653J83003j27892c2240
17678a62220q7621C5571Q0073e6063l54040a7077j95808l1391A1907K15422B7872
17666b18635F995N1343J9157k5169J09532C129J7181J40996a55600C21022j21298
17655A99724a74507A39731A2507K9125P6677K83780a03453A66387E9931d354C19985
17643a24712J4996C09963j42809B086c0169k9448A41590a6894n4153e585k98943
$$ y = [-325153, 92667, -143308, -12792, 225577, 266562, 107075, 148511, 29328, -455595, 32726, 116372, 74130, -436363, 162482, -191398, -285152, 78809, -189242, 81541, -143315, -215338, 62921, -10645, -81773, -396785, 4410, -82606, 136431, 145492, 200102, -146890, -150993, -27625, -205989, -118922, 55026, 313097, 128406, 88753, 271756, 143864, -32240, -162220, -249841, 35571, 115644, -56063, -410103, -17077, -212885, -244276, 11907, 227329, 27872, -218635, 6995, 58338, 77495, 52326, 161858, 3129, 20310, 161306, -155600, 321022, 199724, -174507, 139731, 12507, 41632, 118309, 402089, -103453, 166387, 59931, -4354, 319985, -124712, -109716, 309963, 167154, 2086, -30169, -59617, 141590, -16894, -71047, -5585, -304528]
17632c04528a36457F8319A3072f6830C5688a72120B62998E8897b6947j66472A47524
17620i6708B68853E9544a68367A72221b71720D8417e9672j62712j18407C6840
17609a7600A70487a03028O883B02668E7282a76317g4722k326C00943a14932k89603
17598d04535A83764a08495B72393B6683P0553b16437Q8123A46631a95718A43586
17587B84852a8314D1026a27745A5341h6628A05525L8524a81723F9773b10310A09843
17575g6901A8494d4750B3916M6330a53714A01202C0593R0485m7286L44223I1077
17563a08937J3663F8124b3076F7803J16935c2926H0750a5823A28445a60704A69485
17551A0352R7025h9091l4694A89162a03306A62396L3467l4633J20746g1533q1374
$$ y = [-304528, -136457, 68319, 13072, -66830, 35688, -172120, 262998, 58897, -26947, -193419, 147524, -96708, 268853, 59544, -168367, 172221, -271720, 48417, -59672, -222384, -340791, 36840, -17600, 170487, -103028, -96145, 202668, 57282, -176317, -74722, -77048, 300943, -114932, -404535, 183764, -108495, 272393, 26683, 97236, -216437, -128314, 146631, -195718, 143586, 284852, -18314, 41026, -127745, 15341, -86628, 105525, 144049, -181723, 69773, -210310, 109843, -76901, 18494, -44750, 23916, 70246, -153714, 101202, 30593, 121078, 73792, 418015, 91077, -108937, -95274, 68124, -23076, 67803, 184738, -32926, 80750, -15823, 128445, -160704, 169485, 10352, 107377, -89091, -123785, 189162, -103306, 162396, 195863, 161230, 281976, -71533, -152907]
17540a52907q9324d6071A43687J13081D9518a5795I5009J85833a92260O3447A25045
17528A18362e3471C13775A03431l4368K5181c61993B52539A00148C6806a48753
17517B27821j03854d6691j68840B35835j3214d6468F32792G6206a87682C55055
17506G8572d1492I5714A4735L8581L4591h372A45353c31042C77749j67017b03199
17494g4178J8326k8553A95331C2422a85068B04574J4981p9356J4018K12132I5458
17482a76588G2916K59858G5166J74258i9182r0903e5786r6101A01108b1881F7587
17470A72363O3622A02201K41127C3323J05421N8331A0169M138R8177h5730C8286
17458f2958C35004l5447J1375a28053P370B00189K59999A53436E7752M9271L75498
$$ y = [-152907, -242231, -46071, 143687, 256768, 49518, -15795, 95009, 280842, -192260, -128813, 125045, 118362, -53471, 313775, 103431, 69063, 94244, -361993, 252539, 100148, 36806, -148753, 227821, 123967, -46691, -215531, 235835, 222621, -46468, 632792, 76206, -187682, 355055, 78572, -41492, 95714, 14735, 53316, 87907, -8372, 145353, -331042, 377749, 210732, -203199, -74178, -55852, -84405, 195331, 32422, -185068, 204574, 219555, 140199, 154217, 366349, 95458, -176588, 72916, 332774, 75166, 249424, -99182, -190085, -55786, -151887, 101108, -21881, 67587, 172363, 235985, 102201, 343328, 33323, 138744, 197075, 10169, 14307, 112484, -85730, 38286, -62958, 335004, 299557, 310932, -128053, -120683, 200189, 460188, 153436, 57752, 107023, 482521]
17447D82521A37303E9746L31723A80995K04160j35713C7227L06928G6531j3681
17437F2850R1895R0846p7830j0836J01926b04403H4209K35505J03435d2926G5084
17425C60845j45601c2286D29649c257B90271G5772J94767j03702K47861A17126
17414H9827M3562Q4179j2902D7652k2114G03K29826j6663I8681a43849C60954
17402A04408K10715B1690J63891k9783F2614K73245o9349j05210J79224c2615
17391C79935E0929J67692q4875J30278c709E14870i1149B9202h0875B66279j25407
17380A40872l8740B6510K00163j5976l9456C4657b002C69038d4397I5364A6916
17368b37456B72625A24364l5556L4089b99708g5035J06H6750b8778E37276d24962
$$ y = [482521, 137303, 59746, 391469, 180995, 385155, 249442, 37227, 344155, 76531, 62850, 154745, 245591, 167761, 156925, 258851, -204403, 84209, 319714, 423149, -42926, 75084, 360845, 215244, -32286, 429649, -3257, 290271, 75772, 270539, 166837, 414698, 117126, 89827, 133389, 217568, 204666, 47652, 25538, 703, 230529, 213866, 98681, -143849, 360954, 104408, 315123, 21690, 185581, 155798, 62614, 335859, 266510, 161300, 340524, -32615, 379935, 50929, 218621, 133746, 264024, -3709, 514870, -91149, 29202, -80875, 266279, 140872, 102132, 26510, 226673, 210697, 171241, 34657, -2002, 369038, -44397, 95364, 16916, -237456, 272625, 124364, 88808, 122897, -299708, -75035, -74929, 86750, -28778, 537276, -424962]
17356A55073f0665A41317A6355L2023h302A26153n6796a5460F3259H537J54271
17345A62808J37117I8635M0002f724B69498J7268n2373b19311A94729A2455K73155
17334B85610a71733B34307c9374A93090c3379q5450A21386a0275B54324k4757
17324B29567L482N6210E1318L65976h3271B8098J13558J39549K1816f0852j61047
17313b21899E32291E7912a513C45884c5448A92400J82026A26062J06670J17505
17303C50237A51116C4185J36232Q4445p5414q1501A5395J10568K77439A31980
17292a54894A47974o2982J66369A24407k7584a25452A47199J81793l859A17176
17281B08401p617n7041g2461A94078b5772j21302D88310e2340C19281d2644E8288
$$ y = [155073, -60665, 141317, 16355, 48378, -8302, 126153, 69357, -15460, 63259, 8537, 162808, 299925, 98635, 138637, -6724, 269498, 286766, 234393, -219311, 194729, 12455, 285610, -171733, 234307, -39374, 193090, -33379, -118829, 121386, -10275, 254324, 229567, 233049, 289259, 51318, 417294, -83271, 28098, 141656, 281205, 303021, -60852, -221899, 532291, 57912, -1513, 345884, -35448, 192400, 374426, 126062, 232732, 350237, 151116, 34185, 170417, 254862, 179448, 97947, 15395, 125963, 403402, 131980, -154894, 147974, 84992, 251361, 124407, 96823, -125452, 147199, 328992, 325133, 117176, 208401, 200784, 143743, -72461, 194078, -25772, -147074, 488310, -52340, 319281, -42644, 58288]
17269C30982G4034L47050m2594Q663j54671a15203A68208O5736J18737A67613
17258B52519J16702J25567f8296B17191K05527d9462J1982B5798R0605O2580F2724
17246D12857j61856K8372G1097J00388q3725l3063L4390b225C47675a93C90101
17234e3701B23090c1350B88808j22049R7553p6168J12169H8591P6132K47425A16805
17222H711g9327B05187K1010p9433A9667J21670M7240J47264G1552J56963b01134
17210a62143B22008o859J81896j6014A86968J36476M0546q0056K6104A13670M81864
17199E95534B21133J28703H9561L52757i890D26888j43819p2362K04918H1526
17188C11409i2023C65605j71560k9942l6841K6064K34581E8259K49503j0701Q7946
$$ y = [330982, 74034, 421084, 378490, 387153, 232482, -115203, 168208, 233944, 352681, 167613, 252519, 369221, 494788, -68296, 217191, 422718, -49462, -37480, 25798, 116403, 178983, 62724, 412857, 251001, 279373, 71097, 171485, 87760, 54697, 89087, -2225, 347675, -193, 390101, -53701, 223090, -31350, 288808, 166759, 264312, 188144, 300313, 88591, 164723, 412148, 116805, 8711, -79327, 205187, 226197, 146764, 19667, 141337, 188577, 335841, 71552, 228515, -201134, -162143, 222008, 215149, 397045, 381031, 186968, 323444, 363990, 283934, 310038, 113670, 595534, 221133, 349836, 89561, 442318, -9890, 426888, 283069, 210707, 415625, 81526, 311409, -92023, 365605, 194045, 164103, 127262, 153326, 387907, 58259, 307762, 297061, 385007]
17177C85007j60701L22306A83244d9954D57984F9417K54101A21809N7851q7617
17167I2043K69435A00368L32150R2933B47802L11436A62015J66843E2957M42248
17157D95205k28733K77101j45368j20479j14264J31817J46009j61925A15257K17784
17147C33041A63488J08322L24949B29984J92812J7909j88802J36285m4658K12353
17137E55883A38979L20737j3782n9339j66115M5707K06261C6995J73090J69094
17127C79179j62862R9143G9464M95762n2738k53264K08173j51927J01818J65263
17117E92551j67538N5872K71664A62276J55358E1518a53616B91375M8113K96727
17107F36215P278B57471J31886l61q5293K14180B51132L02095m1988k23586J51713
$$ y = [385007, 224306, 546612, 183244, -49954, 457984, 69417, 323518, 121809, 179660, 92043, 361478, 100368, 432518, 525451, 247802, 559238, 162015, 328858, 52957, 495205, 266472, 543573, 398205, 277726, 163462, 295279, 441288, 279363, 115257, 333041, 163488, 271810, 596759, 229984, 422796, 440705, 251903, 388188, 343530, 555883, 138979, 459716, 445934, 386595, 220480, 266187, 472448, 36995, 210085, 379179, 216317, 315460, 79464, 575226, 522488, 269224, 477397, 325470, 427288, 592551, 425013, 480885, 752549, 162276, 317634, 51518, -153616, 291375, 339488, 636215, 643493, 257471, 389357, 388996, 303703, 517883, 251132, 553227, 511239, 287653, 439366]
17096D39366K8603r1544r7103M90415J36648C63642p0084K70706j81121l975j60544
17085B18624K72362P5773j59834J1897A84999F2624N60845B98975R219L56503
17075F64697C28944m4112J26921p9747J4197J74472j07959j6660j93147K78554
17065D81463J70532k93497K92655j38933J3869J30709k6439B02656K69877k18454
17055B54079L48545k39548M23374l21165J8829p2421L92616l86562P5250j3743
17045D79254J70961k56489p9046J47485L68517B86959O4172K83272m3358J26790
17035G17835l01053A42358N37361A36717L62981L23043l58446J11638J43026l18992
17025C99967J58740J79385A60739N76246k32655J06503k8730L11442k21912K72270
$$ y = [439366, 467969, 376425, 279322, 769737, 906385, 363642, 293558, 564264, 383143, 379168, 218624, 490986, 566759, 406925, 418822, 184999, 62624, 623469, 298975, 308194, 664697, 328944, 284832, 411753, 332006, 346203, 520675, 412716, 396056, 202909, 481463, 651995, 358498, 651153, 512220, 526089, 656798, 630359, 202656, 472533, 254079, 602624, 363076, 786450, 465285, 484114, 411693, 804309, 417747, 492997, 479254, 650215, 393726, 314680, 462165, 830682, 286959, 351131, 634403, 591045, 717835, 416782, 142358, 679719, 136717, 499698, 822741, 464295, 575933, 718959, 399967, 558707, 738092, 160739, 736985, 504330, 610833, 582103, 893545, 671633, 943903]
17015I43903j77637k00562j01306J0751J34190K82384l04865J57498j6678J80231
17005I07909N4488k38864o5449K20681J86082j93448K15309k76517q5375o9622
16995F55194J40084J21332k02565o7968l292N1501L1091j30703N23187m29016
16985F88845k7689K02335K36547m3209l9512m0809k73696R9404j13723K11588
16975I00081J69117q4426O5844N5525r7443P7349l4790K82785m31484l42542n693
16964E54323m0545L59013L00920j40333j89742j03433Q0565R7715P9651J40828
16954A138962r3785Q7750j32933N91807l20259K5141k95180K79564j98531r2321
16944I90215K63765l33045L57161k2570k33480R8800o4888R7688L97725m15498
$$ y = [943903, 766266, 565704, 464398, 475149, 609339, 891723, 586858, 744356, 727678, 907909, 962397, 723533, 658084, 878765, 1064847, 871399, 1086708, 810191, 724816, 655194, 795278, 916610, 714045, 646077, 642785, 694286, 725377, 594674, 1117861, 688845, 661156, 863491, 1100038, 1056829, 1017317, 976508, 702812, 802216, 688493, 900081, 1069198, 984772, 1050616, 1106141, 1008698, 1086047, 1051257, 1334042, 902558, 560016, 554323, 513778, 872791, 1173711, 1033378, 843636, 740203, 820768, 918483, 998134, 1138962, 1045177, 1132927, 999994, 1591801, 1271542, 1296683, 1001503, 1281067, 1082536, 990215, 1253980, 920935, 1278096, 1255526, 1022046, 1120846, 1055958, 1153646, 1551371, 1135873]
16934A135873N1260O732K39315K16042M5406k11673m62938J64666J93411l2583
16924A345511r6168M50048j08156j50674Q1905q8803N3631K46885j19640j07009
16914A507530K02184R7430p0629r7495P9384R0831o5975J23723j17682j19233
16904A630068K82858k04688K22569j34642P2700j40901K92869O0244k76010J40085
16894A945152k91800L65014l31369K00039J72268j28388q2500M55808j30726J18869
16884B292367l27447K73404r362J83953k48792L14411K69k28477J7484J14249
16874B382059J05442j861M31530n35522P4320J77167P7170j562L33082k45576
16864B796249J35628J14132K13207l67418n0546L28457J23762j83389L18472P5551
$$ y = [1135873, 1187133, 1193865, 1433180, 1649222, 1694628, 1482955, 1020017, 1184683, 1378094, 1345511, 1249343, 1699391, 1591235, 1440561, 1522466, 1433663, 1487294, 1734179, 1614539, 1507530, 1709714, 1807144, 1736515, 1639020, 1718404, 1809235, 1743260, 1866983, 1749301, 1630068, 1912926, 1708238, 1930807, 1796165, 1868865, 1727964, 2020833, 2081077, 1805067, 1945152, 1653352, 2018366, 1686997, 1887036, 2059304, 1930916, 1848416, 2304224, 2173498, 2292367, 1964920, 2238324, 2228962, 2412915, 2164123, 2478534, 2478803, 2250326, 2267810, 2382059, 2487501, 2485640, 2917170, 2381648, 2455968, 2633135, 2710305, 2708743, 3041825, 2796249, 2931877, 3046009, 3259216, 2891798, 2841252, 3169709, 3293471, 3110082, 3428554, 3504105]
16854C504105j60222o7537l6675J56447J41910j28628J74797K59047K09974k01332
16844C851886l3455J55517J86935q4163L5577K51063l0272r096L17500l35768
16834D305724L77042r7841J34515N67174q5155m47086M71333J8806j00352M44538
16824E588698j65048K9466N46302k26532K43602L9307R7146L93281l31293K10806
16814F425735O2580K40156M3362N33298j65254J87496j56873K52000M11509R7282
16804G931291M64217j33356K71701J57313M64367j69822M11426K92148J62954
16795I852239K90437J93392L29164K48572K00780M93745M97314j80124N44925
16786A2470444N01384K50955J07996N54140O34894K96743K63878N71451P76163
$$ y = [3504105, 3343883, 3276346, 3239671, 3396118, 3538028, 3409400, 3584197, 3843244, 4053218, 3851886, 3818431, 3973948, 4160883, 4076720, 4112297, 4363360, 4333088, 4323992, 4641492, 4305724, 4682766, 4584925, 4719440, 5286614, 5201459, 4754373, 5225706, 5244512, 5144160, 5588698, 5423650, 5453116, 5999418, 5772886, 6016488, 6055795, 6152941, 6546222, 6214929, 6425735, 6488315, 6728471, 6771833, 7305131, 7139877, 7327373, 7170500, 7422500, 7834009, 7931291, 8395508, 8262152, 8533853, 8691166, 9155533, 8985711, 9397137, 9689285, 9852239, 10142676, 10336068, 10665232, 10913804, 11114584, 11608329, 12105643, 11925519, 12470444, 12971828, 13222783, 13330779, 13884919, 14519813, 14816556, 15080434, 15651885, 16428048]
16777A6428048K1167N17117P03047L13703O85155M29917O49070P51782Q19274
16768B1318280R11535Q02041P45192O97794J110228J095659R72423Q50871J356139
16759B9860162J076845J179978J125385J467614J670883J546107J620239J477914
16751D1025127K386518J957333J711183K651201K401016K320560K672071L119326
16743F0244335K885057L168716L384225L431853L746452L795889M370129M159727
16735H9186383M685599M684626M796211N132986M938016N171441N053588N180833
16727A28829683N176038M984365M377371M164301L733024K675207K451185J661954
16719A58053128Q01210J67489o14318j674846k390998k898309l559548l966883
$$ y = [16428048, 16449215, 16966332, 17669379, 17983082, 18668237, 19098154, 19747224, 20499006, 21318280, 22229815, 23031856, 23777048, 24474842, 25585070, 26680729, 27653152, 28504023, 29860162, 30937007, 32116985, 33242370, 34709984, 36380867, 37926974, 39547213, 41025127, 43411645, 45368978, 47080161, 49731362, 52132378, 54452938, 57125009, 60244335, 63129392, 66298108, 69682333, 73114186, 76860638, 80656527, 85026656, 89186383, 93871982, 98556608, 103352819, 108485805, 113423821, 118595262, 123648850, 128829683, 134005721, 138990086, 143367457, 147531758, 151264782, 153939989, 156391174, 158053128, 158854338, 159021827, 158407509, 156732663, 154341665, 151443356, 147883808, 143916925]
16711A43916925m609490m810856m980350n438954n532209n151685n483012m881197
16703A03029172m901780n474141m539782l958455m576791m227775l484591l711011
16695F8154846l363507l110573l463890k725953k682325k567359k412879k205925
16687D5622435j728455k155306j717797k350697j460423j428938j469956j412096
16679C1898767j162387j553116r54513r35659j013160j345158q67660j057120
16671B3009994p83449n13745p59799r28372o31741q40909k50055r52275j36288
16662A7213361p81627l79107m48829n34405k92368p68087l30700m42078j43622
16653A3092538o08425l79646k13507n70637j4382l72907l798l86160l58365k30968
$$ y = [143916925, 139307435, 134496579, 129516229, 124077275, 118545066, 113393381, 107910369, 103029172, 98127392, 92653251, 88113469, 84155014, 79578223, 75350448, 71865857, 68154846, 64791339, 61680766, 58216876, 55490923, 52808598, 50241239, 47828360, 45622435, 43893980, 41738674, 40020877, 37670180, 36209757, 34780819, 33310863, 31898767, 30736380, 29183264, 28228751, 27293092, 26279932, 24934774, 24067114, 23009994, 22226545, 21712800, 20953001, 20024629, 19392888, 18551979, 18301924, 17349649, 17213361, 16431734, 16052627, 15603798, 15069393, 14777025, 14008938, 13678238, 13236160, 13092538, 12484113, 12104467, 11890960, 11320323, 11305941, 10933034, 10929236, 10543076, 10184711, 9953743]
16643I953743p12797K91135q48816K68717l86528n0010j90649m48392j41997R0760
16633G825166j75275Q5239m48715l91864L08386j17177m69677m14800K3113J50988
16623F375384l13620p487m61229J37505r7648m6994n29047L03511l00614J35413
16613E195174m38048l9032l12397M48961m2065m76909k01887L92575K1013l32403
16603D214982l67916K59243n2907n5962O0640j82345O1629k87169j6424J97268
16593C831039l04183j46343o1248J89251n68279J93061N8648p744l9049j80161
16583B964992j77324M14483l14260L027j60691L5071k28790l09929K76556J60984
16573B664119R978o1635o8988J6737l06197M7998N2291J05189l11988O8436j95607
$$ y = [9953743, 9240946, 9532081, 8683265, 8951982, 8565454, 8515444, 8324795, 7876403, 7734406, 7825166, 7649891, 7735130, 7286415, 6894551, 7202937, 7085760, 6616083, 6201283, 6224396, 6375384, 6061764, 6054277, 5593048, 5730553, 5632905, 5585911, 5056864, 5360375, 5059761, 5195174, 4757126, 4718094, 4405697, 4854658, 4812593, 4335684, 4133797, 4526372, 4547385, 4214982, 3847066, 4106309, 4053402, 3997440, 4058080, 3875735, 3937364, 3650195, 3633771, 3831039, 3526856, 3380513, 3319265, 3508516, 2940237, 3133298, 3191946, 3184202, 3145153, 2964992, 2787668, 3202151, 2887891, 2890918, 2730227, 2765298, 2536508, 2226579, 2503135, 2664119, 2674097, 2612462, 2543474, 2560211, 2254014, 2302012, 2354303, 2459492, 2147504, 2215940, 2020333]
16562B020333J20418K44621l33154J91842J21597k84895n7672J28486j15988J31416
16552B167004j34958k19230o4307K04967k92804N8210Q7988j18289J6307L12251
16542B017139j15447R3303j49582k50047J74136Q9728l42240r7295M79736l48517
16532A550914L59110j00517m30579K03914J24052k62060l23205j49375O10980
16523A583234m19875J10223K33257m5673J24523q7451j60453m8070L3578j81545
16513A141748K25100j9343k76684K4269j27227K68435K78992l51413R0424j29899
16503A124402J79205k10209p4674M4863K25035J59781k08145l19813p9988K37629
16493A078086j29565K06511l0839k7789k27502J9070J19039j57824K01675j38807
$$ y = [2020333, 2140751, 2385372, 2052218, 2244060, 2365657, 2080762, 2023090, 2151576, 2035588, 2167004, 2032046, 1812816, 1748509, 1953476, 1660672, 1718882, 1806870, 1688581, 1704888, 2017139, 1901692, 1994995, 1845413, 1595366, 1769502, 1859230, 1516990, 1419695, 1899431, 1550914, 1910024, 1809507, 1378928, 1582842, 1706894, 1444834, 1121629, 972254, 1583234, 1163359, 1273582, 1506839, 1461166, 1585689, 1498238, 1337785, 1289715, 1323293, 1141748, 1366848, 1347505, 1070821, 1095090, 967863, 1236298, 1515290, 1163877, 1254301, 1124402, 1303607, 1093398, 1018724, 1063587, 1288622, 1448403, 1240258, 920445, 840457, 1078086, 948521, 1155032, 1124193, 1096404, 868902, 887972, 1007011, 849187, 1050862, 912055]
16483I12055q4553M14048l83146n4670L27389j04562p3413O8102m16144J96902
16473H02008j75086K09617j5296k5653n381j13380M47502E43958R7732M2266L81650
16462A065606l73529O9547j56429N2699k50756N71283m61975K36849R3156K39729
16452A086180n32279L29947j30294k26792L58924j44675J62765C53884L03031
16443F56915n1188P4302J42684C26597M73465j86511K78988j46045l46044J20312
16433E20762l504o7856K36052j36117Q0066j30134j28851M2595K73847J83876
16423H70736M1035k90708J46569l39123k2824K65275q1145K62337l84799J9875
16413D87228k27364j07174K22218K39780K90583l74843o6753K7115K29070B69456
$$ y = [912055, 827502, 1241550, 858404, 803734, 1131123, 1026561, 953148, 1021250, 605106, 802008, 626922, 836539, 821243, 795590, 790209, 676829, 1124331, 543958, 641690, 683956, 1065606, 692077, 761624, 605195, 657894, 407138, 978421, 516446, 753295, 846451, 1086180, 553901, 883848, 753554, 526762, 885686, 741011, 903776, 353884, 656915, 605727, 680029, 822713, 326597, 800062, 613551, 892539, 746494, 400450, 520762, 517258, 449402, 685454, 549337, 629403, 499269, 370418, 413013, 686860, 870736, 911771, 621063, 767632, 428509, 405685, 670960, 589815, 852152, 467353, 487228, 259864, 152690, 374908, 614688, 905271, 530428, 463675, 490790, 719860, 269456]
16402H53228B92130K5436j5551P1783J02418J49455J74120r1189k27331n712j84762
16391B90797J12385M5067O6321k49647M3984j1733K70038P5268C09755J8963K67604
16380E96322N4852B93474K72621A67720L13401j43936l3118J10763j8304j07126
16370B89400J83600N1419A78096L56872O4208B21239l5815M4755L02353j96187
16360C36345K12263J11532A54296M69279n9369B40650J95268D1772M92545A26682
16349C06008L68938B87931N00797B71842M45462B90723j9314j2115R172L97327
16339F65793n9344k16168k411J25377B45222p6302K26836g214B45925n0576K13536
16328D08885A06609N5507L30577J37932k32474H8617C9733N18873A37324K05580
$$ y = [853228, 292130, 317566, 302015, 373798, 476216, 625671, 799791, 708602, 481271, 475559, 290797, 403182, 448249, 514570, 264923, 308907, 297174, 567212, 642480, 309755, 328718, 596322, 651174, 293474, 566095, 167720, 481121, 337185, 304067, 414830, 396526, 289400, 473000, 524419, 178096, 534968, 599176, 221239, 185424, 230179, 532532, 336345, 548608, 660140, 154296, 623575, 564206, 240650, 435918, 41772, 534317, 126682, 306008, 674946, 287931, 788728, 271842, 717304, 290723, 271409, 259294, 268466, 665793, 606449, 390281, 387870, 513247, 245222, 168920, 395756, -7214, 245925, 195349, 408885, 106609, 162116, 492693, 630625, 398151, 88617, 39733, 558606, 137324, 342904]
16318C42904j62167J25180O2139L9083L8998I4775b3954D41630l3034J63633k13726
16307C58503a76598A67073p7119L47459A90926a145C47342j13469A04637r683
16297I4954K95809j40943K6002j21547P9032K6630A12107d9154D19205O210B07860
16285I0126J07032K64158a63255A94365F2013c306A31895n3799R2332J43881N3296
16274C67605J92781k67261a93A12812K86384L487j69584a2445A4966L31983a8839
16262E0196K09514j1361J34674j64587q3784E0819J36058N7149K30248N4951k51422
16251B77803o5656D0165J96520a01824F121K5669J22697b30505c0392B30087Q0729
16240C10816A42495e376A2167J85969b60833C36073F1375K04940M1562o2334A18431
$$ y = [342904, 180737, 305917, 368056, 407139, 446137, 94775, -23954, 441630, 408596, 572229, 358503, -176598, 167073, 89954, 437413, 190926, -1145, 347342, 233873, 104637, 94954, 390763, 249820, 275822, 154275, 233307, 259937, 112107, -49154, 419205, 425415, 207860, 90126, 197158, 461316, -163255, 194365, 62013, -3306, 131895, 78096, 170428, 314309, 367605, 560386, 293125, -193, 112812, 399196, 402683, 233099, -12445, 14966, 346949, -18839, 50196, 259710, 248349, 383023, 218436, 134652, 50819, 186877, 244026, 474274, 529225, 277803, 212147, 40165, 236685, -101824, 6121, 31790, 154487, -230505, -30392, 230087, 310816, 142495, -5376, 12167, 198136, -260833, 336073, 61375, 266315, 307877, 245543, 118431]
16228C40229c5822D07660j78318K09363B7830J04535M49970j42802j52326K21748
16218E08955A69088h3146D48244A10204J07768J04055j26472i666C2599J30829
16208A63428C9541b97801B78178R241a44810d7732A9329L42590j38372f234D94171
16196A17263b7919j7087J0885k6378D21738n9037j28267P4994n2444H2111A0001
16184F8715J77997b34450B02715K0654a09797j56195A85806q7575a44294D38391
16173A47447L6531n736m4692J97792M7608A36368c38321a34918C5073g4037m1741
16162a15778c9801C5471A867J12855d9810E06476o5810n2383j74928j0508E7892
16150C10683C8143R6418k5353D73J60224J36379h4461A00952J58738J22022j86470
$$ y = [340229, -35822, 407660, 229342, 438705, 27830, 132365, 582335, 439533, 287207, 508955, 169088, -83146, 448244, 110204, 217972, 322027, 195555, -9666, 32599, 163428, 39541, -297801, 278178, 287419, -144810, -47732, 19329, 361919, 223547, -6234, 494171, 117263, -27919, -45006, -34121, -60499, 421738, 362701, 234434, 309428, 256984, 82111, 10001, 68715, 246712, -234450, 202715, 223369, -109797, -265992, 185806, 98231, -144294, 438391, 147447, 183978, 178242, 133550, 331342, 378950, 136368, -338321, -134918, 35073, -74037, -115778, -39801, 35471, 1867, 114722, -49810, 506476, 440666, 388283, 213355, 202847, 57892, 310683, 38143, 134561, 109208, 473, 160697, 297076, -84461, 100952, 259690, 381712, 195242]
16139A95242d7817A42363N9088K1782J42617F7167N0837c4765k71887A90242J13472
16128C03714c41318J240a17810H0375d7613q2068B7479L8432J5465h3145n229
16117h8374A58840K07311a36436B59153F6896h6442K250R968k29845B79571a33948
16105C78052B3596O7413B7648a0047E59289F6067J51011R2004h0449A39864O6762
16094B06626a35840a1549I0128J83961j19909a92782d412A70126d2061A01227
16083f1846A9231L01750a44905I2998b25971d711G31J08047e5276A74775a1614
16071H7874K28097A15395m9489M3721k5162f8794n0330K4824j51566Q8097f0814
16059g4371D2077h0613H3058b11716d9860F1083k1335M7352e0599a0772B5854
$$ y = [195242, -47817, 142363, 201451, 223233, 365850, 67167, 118004, -34765, -306652, 190242, 303714, -341318, -340078, -117810, 80375, -47613, -129681, 27479, 65911, 81376, -83145, -88374, 158840, 366151, -136436, 259153, 66896, -86442, -84192, -74224, -304069, 279571, -133948, 378052, 23596, 91009, 27648, -10047, 559289, 66067, 217078, 309082, -80449, 139864, 206626, -135840, -11549, 90128, 274089, 154180, -192782, -4412, 170126, -42061, 101227, -61846, 19231, 320981, -144905, 92998, -225971, -4711, 731, 108778, -55276, 174775, -11614, 87874, 315971, 115395, 65906, 109627, 84465, -68794, -119124, -94300, -245866, -157769, -60814, -74371, 42077, -80613, 83058, -211716, -49860, 61083, 39748, 87100, -50599, -10772, 25854]
16047a59582a8425j97219B23560a25684k8958A20166b2861G7897L17528j77172
16037B18253J68516j56751p9689D4312g6138j89247J04369E1514a2853A93151
16026B54441a69504N3601L9237E3821J04664d83123a64644b4352B73847o7618
16016B06229h0402F9786b24652A1645K7860j2710L47818i117j4672C3177h0762
16004a79176a7066K723j7702A28563a37268k086A24052L0821b63949J06594L0275
15993a27080j35920A14878k331a06791A57829L03630a19286G8999L8769J45390
15983B63158r862C561J44158h4684r2990Q4499k0969d842j90155B3721e0122A17256
15970a24265o1894A43373a10676l30347K10823E8641K7188d88862f9177H4832
$$ y = [-159582, -18425, -215644, 223560, -125684, -154642, 120166, -22861, 77897, 395425, 218253, 386769, 230018, 150329, 44312, -76138, -265385, -161016, 51514, -12853, 193151, 254441, -169504, -115903, -76666, 53821, 158485, -483123, -164644, -24352, 273847, 206229, -80402, 69786, -224652, 11645, 39505, 26795, 374613, -9117, -23789, 33177, -80762, -179176, -17066, -14343, -32045, 128563, -137268, -139354, 124052, 154873, -263949, -157355, -127080, -263000, 114878, 112547, -106791, 157829, 461459, -119286, 78999, 117768, 263158, 253296, 3561, 147719, -84684, -177674, -93175, -114144, -4842, -194997, 23721, -50122, 117256, -124265, -186159, 143373, -110676, -441023, -230200, 58641, 85829, -488862, -69177, 84832]
15959D4235h0636j76830d3484l552j96364I9221c37402J39396Q5916f752C21930
15947H9753M7066b12156h2281j81519B8232J80936j0384R2951E3519a2755A04806
15935a7087B86257M4041c0997j01664j52755A14100d9765B33835o0462c5057H4536
15923A49230R8249O6203r0852K4126a0697B01393l8019b27762D3284b21742G9969
15911F0716B568K6265l199K7877b5684B0394a20719B2431I633a32213A09630a72073
15898h662j0923F5338N6464C3733h8924b0876I5424i1048A08257b221p55B34460
15885d3939B05864i9820K8788m9422A86757b1621j26468b8260j20640M7564D08928
15873b73271A93144C7833a85435j15002J03011j78976d6997l7642A82043a32136
$$ y = [44235, -80636, -257466, -43484, -47036, -243400, 99221, -337402, -198006, -112090, -6752, 321930, 89753, 136819, -212156, -82281, -263800, 28232, 209168, 198784, 291735, 53519, -12755, 104806, -17087, 286257, 330298, -30997, -132661, -285416, 114100, -49765, 233835, 173373, -35057, 84536, 149230, 247479, 313682, 222830, 246956, -10697, 201393, 163374, -227762, 43284, -221742, 79969, 60716, 2568, 28833, 25634, 53511, -25684, 20394, -120719, 22431, 9633, -132213, 109630, -172073, -8662, -19585, 65338, 121802, 33733, -88924, -20876, 95424, -91048, 108257, -2221, -2976, 234460, -43939, 205864, -99820, -71032, -120454, 186757, -21621, -148089, -28260, -148900, -101336, 408928, -273271, 193144, 37833, -185435, -300437, -197426, -376402, -46997, -84639, 182043, -132136]
15862B4564f41704B47384j06024D8043a63954E7105g949o3271k5876j08632g8396
15850b12466j04046b3514m40075J80480i6100d026I5516a2812E779b36768B30581
15838a52892a8673A59535c72542a18098j75450c9476I4325a71935A79618B7946
15827a8701l9080A84058l5823a00112B29374c89036P2116g74n2472r2555a9583
15815D1576h5688A13274R5275g9128J3912j34243m3973K6243A6367J45360a19857
15803I248b8382A59952A6211i6677B69861J05673b37409d195C05874d257j14427
15792a18684a5154I4704C7873j4664b56729C16167b1228j0427E6398f6143B53850
15780D0406M3496a72475B68167F7054J3965h9142j19701h6962o3801F1388K21255
$$ y = [24564, -641704, 247384, 141360, 48043, -163954, 57105, -7949, -71220, -97096, -205728, -78396, -212466, -316512, -23514, -463589, -283109, -96100, -4026, 95516, -12812, 5779, -236768, 230581, -152892, -18673, 159535, -372542, -118098, -293548, -39476, 94325, -171935, 179618, 27946, -18701, -57781, 184058, 148235, -100112, 229374, -389036, -316920, -774, -53246, -145801, -19583, 41576, -85688, 113274, 208549, -79128, -65216, -199459, -243432, -217189, 16367, 161727, -119857, 9248, -28382, 159952, 16211, -96677, 269861, 375534, -237409, -4195, 305874, -4257, -118684, -15154, 94704, 37873, 23209, -256729, 316167, -21228, -31655, 56398, -66143, 253850, 40406, 83902, -172475, 268167, 67054, 81019, -89142, -208843, -86962, -150763, 61388, 282643]
15769B82643c21536c5478j7290o643a5787A9760a970l86957A48428a678A62320
15757a82619A68014k5814a97033B14184I0599b27136F0417B378K25821B1601e7666
15745A54253a07036c7930p6E0079k3616J00234O6553J50550c5650G3311J76c13849
15732a14922A22174K26714a6996j37005P0336A22176A3276a41208b9003q174j63404
15721b00581P3451N6084G6347a49410d2173A85181O6612b05277N9359B4586J12052
15710A36638o7365L3912B9534N6842c91395A26507L67825A29458i9763k34682
15700c34445a8504r4106K8470C16644a34156G9598J2171D5592Q5238N9130f1967
15688a04050b9595a1896k37024H9527b51076i6384j6527a4166j30210e1618n7786
$$ y = [282643, -321536, -35478, -52768, -59411, -15787, 19760, -1970, -388927, 148428, -1678, 162320, -182619, 168014, 142200, -197033, 214184, 90599, -227136, 60417, 2378, 228199, 21601, -57666, 154253, -107036, -37930, -38006, 50079, 26463, 126697, 193250, 343800, -35650, 73311, 73487, -313849, -114922, 122174, 348888, -16996, -154001, -83665, 122176, 13276, -141208, -29003, -37177, -200581, -127130, -71046, 76347, -149410, -42173, 185181, 251793, -205277, -145918, 24586, 136638, 69273, 103185, 29534, 86376, -391395, 126507, 494332, 129458, -99763, -334445, -18504, -112610, -84140, 316644, -134156, 79598, 91769, 45592, 130830, 189960, -61967, -104050, -29595, -11896, -248920, 89527, -251076, -96384, -112911, -14166, -144376, -51618, -109404]
15677a09404l10010A94415m6611D581N6862C470K1996K3708b33472d0928D5242
15665G2114K0062c7946A13993b8573k85447B93017a84056H5432b11110d4446r7547
15654a41993I1168D4552M5905b41466d6807b0597m39933K24360a0548I7497i3538
15642d1958P386A0138a36144a655j49140j46430A48085a39525j0168B3448Q9644
15631A13092a563m1619A03506b86277F0006a9382h780o0194c861A20475b44316
15619a21537A66134B6072i6596A95707N9434b06077g5748B74661H6450Q5870c2711
15607g6400B54245p5419a57434B36539p7466b64064J20411C4413b36501H7615
15596H6766k3274C1199b6908r6071o434A32620a91711F5010J83594c6667A23651
$$ y = [-109404, -419414, 194415, 147804, 4581, 61443, 3470, 25466, 49174, -233472, -40928, 45242, 72114, 92176, -37946, 113993, -28573, -314020, 293017, -184056, 85432, -211110, -44446, -141993, 91168, 44552, 90457, -241466, -46807, -20597, -460530, -236170, -10548, 97497, -93538, -41958, -34572, 10138, -136144, -1655, -150795, -297225, 148085, -139525, -149693, 23448, 113092, -1563, -43182, 103506, -286277, 60006, -19382, -8780, -68974, -3861, 120475, -244316, -121537, 166134, 26072, -96596, 195707, 255141, -206077, -75748, 274661, 86450, 172320, -32711, -76400, 254245, 178826, -157434, 236539, 159073, -264064, -143653, 34413, -236501, 87615, 86766, 63492, 31199, -26908, -122979, -129413, 132620, -191711, 65010, 248604, -36667, 123651]
15584i4192B0326a22367J9330j66118a02815A02993a00754C41371G6022d4829
15573b00646a4192j26911k380E8974c2896I6966P541D0005d7404B80583h3303
15561b07352P6978k0909q1687h2858A02616b12107A74270J06084a2989F7617d53978
15549g9027G442a67835D9840L3367L3093a1958F6172J17835b28068j55123i2573
15537b59434A71142a58373D2647a61640f8604I6737a70709A20977e2060B92697
15526g1338l1118d3363A84460J89383b03611C0700c6858m1156D856K52073a25897
15514C05218a93103G2651j3058J01506B6106b75048B02573K5165b98338G3458
15503B19106l0124A9102K08235f1795k5861i767A32779a50071N271j24003a22051
$$ y = [-94192, 20326, -122367, -103037, -269155, -102815, 102993, -100754, 341371, 76022, -44829, -200646, -14192, -141103, -143483, 58974, -32896, 96966, 104507, 40005, -47404, 280583, -83303, -207352, -130374, -151283, -232970, -82858, 102616, -212107, 174270, 280354, -12989, 67617, -453978, -79027, 7442, -167835, 49840, 83207, 116300, -11958, 66172, 184007, -228068, -383191, -92573, -259434, 171142, -158373, 42647, -161640, -68604, 96737, -170709, 120977, -52060, 292697, -71338, -102456, -43363, 184460, 373843, -203611, 30700, -36858, -78014, 4856, 256929, -125897, 305218, -193103, 72651, 59593, 161099, 26106, -275048, 202573, 227738, -298338, 73458, 219106, 188982, 19102, 227337, -61795, -87656, -9767, 132779, -150071, -144800, -268803, -122051]
15491A38524E566b9748D4457a10889B3360b43868e4705l43391c0165j15526C5908
15479f6463n8443d4856b378A0203b9422A04955f4477A0628b81597J06788d0102
15467c46409a17492K9850E2643b8390r8510G3946b28955a61D08617A71674l5166
15456A36508o4602c35418c702o850H5554c9716E8759a83121F9168B5901c4183
15444A5804J23922a0491L283j97859d7901k71952C0647J3921a13754o1636A61428
15432a86384C28664b10468i769k2117A83266b84176A89877h8452A77931c3270
15421B42608i1742C02832a13674c8702A8123c4841j82790A05668A8467J30931
15411A49398c08790h6419n560B01661i3538C67099j5267I1669K12121b19710I3849
$$ y = [138524, 5566, -29748, 44457, -110889, 23360, -243868, -54705, -398096, -30165, -145691, 35908, -66463, -124906, -44856, -2378, 10203, -29422, 104955, -64477, 10628, -281597, -174809, -40102, -346409, -117492, -87642, 52643, -28390, -126900, 73946, -228955, -161, 408617, 171674, 136508, 71906, -335418, -3702, -10552, 85554, -39716, 58759, -183121, 69168, 25901, -34183, 15804, 139726, -10491, -7208, -205067, -47901, -319853, 30647, 44568, -113754, -175390, 161428, -186384, 328664, -210468, -9769, -31886, 183266, -284176, 189877, -88452, 177931, -33270, 242608, -91742, 302832, -113674, -38702, 18123, -34841, -217631, 105668, 18467, 149398, -308790, -86419, -91979, 201661, -93538, 367099, 351832, 91669, 303790, -219710, 93849]
15399c12963A53648c3266A95602D4175A9210b35178F2620b50077A21025a66782
15388B68525c5352A59375g3749A16299K9380n395l6952A8759O5252g9161D8624
15376b50341B05682C0643a10974A37524h3085C90142H3319a62778I960J73202
15366A83162b306G8098j6041a34743g144j789p2114B4566a41430I9038m7839h450
15353A39948d18987A28029l9016b67007J31249i788H3775M5227K4384c4198N227
15342b8971C61845A20664J35312i3728q8257i924l04116A17661A0394J08469a01567
15330d7829J3689H7484d29071F8054d8869I7409N0123j1800m2282c1035B6059
15318E1169N2639a95017m2620e0076F9143j6149a3130F1433j4477R2666b45369
$$ y = [-312963, 153648, -33266, 195602, 44175, 19210, -235178, 62620, -250077, 121025, -166782, 268525, -35352, 159375, -73749, 116299, 145679, 140284, 103332, 18759, 84011, -79161, 48624, -250341, 205682, 30643, -110974, 137524, -83085, 390142, 83319, -162778, 9960, 183162, -2306, 78098, 62057, -134743, -7144, -8933, -81047, 24566, -141430, 99038, 51199, -8450, 139948, -418987, 128029, 89013, -267007, -135758, -9788, 83775, 129002, 153386, -34198, -28971, 361845, 120664, 255976, -93728, -181985, -9924, -314040, 117661, 10394, 118863, -101567, -47829, -34140, 87484, -429071, 68054, -48869, 97409, 147532, 135732, 93450, -31035, 26059, 51169, 103808, -195017, -237637, -50076, 69143, 52994, -13130, 61433, 46956, 139622, -245369]
15306C01742n0295a98278i0920H0302j8891f7836K3704A55708J16058b18905e9062
15294D4612J74238E7408K40762G881R9264O7272N0828l9543e28470A10996R2941
15283B03937e7911A3562g2059B6086c01266A42572c6225I91L9259b18192I7658
15271E3581J4365J36444P8791A5157a72562A54552a7938B1735b22806C82246E8127
15259A12646a8903p0065j4632a8409B80894j33021k0168h6664I8503M30365p136
15248E21732Q05312j61293K24618n51034D13142A40998L0876K2063c4433B44088
15237A05507K4795h1816A03004L5125m5157e7207J687k04480H5484L4705g6338
15225D3479a27528B50899b96583c2914A64464a43252D12045a3117A26309P9057
$$ y = [301742, 251447, -198278, -90920, 80302, 61411, -67836, -44132, 155708, 271766, -218905, -59062, 44612, 218850, 57408, 298170, 7881, 107145, 174417, 225245, 185702, -528470, 110996, 203937, -57911, 13562, -72059, 26086, -301266, 142572, -36225, 991, 40250, -218192, 97658, 53581, 67946, 204390, 283181, 15157, -172562, 154552, -17938, 21735, -222806, 382246, 58127, 112646, -18903, -88968, -103600, -18409, 280894, 147873, 127705, -86664, 98503, 528868, 521732, 1327044, 1165751, 1390369, 839335, 413142, 140998, 171874, 193937, -34433, 244088, 105507, 130302, -81816, 103004, 138129, 92972, -57207, -55520, -260000, 85484, 120189, -76338, 43479, -127528, 250899, -296583, -32914, 164464, -143252, 412045, -13117, 126309, 205366]
15215B05366J3895F367B337a62221A44663b94421P1434B37300n419c28094A25372
15203D3191a0751A86134B3047K05050k2136m4180i8055C85248A71999a19668C16651
15191g1135G599K94869J46964i2593D21676B03114j4693m8614m0268e1075k03411
15180b54486B54181c09866A62432a27817A03206J14194i3041G3988J4407c9228
15169a74567E9210L34745A0152L3096a65072A28346Q2965a1243B45501a9188m6000
15158f5188A18198A6202b0090D8767K33745a60233A33186F4329J02651c122p7744
15147h0866B55791L2390B3715g3711C23782a76488D50701I436N50068k46694a54121
15135A99717b02652o6105D8189K7151K43420C6404i6877I3471J78031K11478a61295
$$ y = [205366, 219261, 6367, 2337, -162221, 144663, -294421, -222987, 237300, 231881, -328094, 125372, 43191, -10751, 186134, 23047, 228097, 205961, 161781, -98055, 385248, 171999, -119668, 316651, -71135, 7599, 302468, 449432, -92593, 421676, 203114, 188421, 139807, 99539, -51075, -254486, 254181, -309866, 162432, -127817, 103206, 217400, -93041, 73988, 88395, -39228, -174567, 59210, 393955, 10152, 43248, -165072, 128346, 211311, -11243, 245501, -19188, -65188, 118198, 16202, -20090, 48767, 282512, -160233, 133186, 64329, 166980, -3122, -80866, 255791, 288181, 23715, -73711, 323782, -176488, 450701, 9436, 559504, 312810, -154121, 199717, -202652, -268757, 48189, 75340, 318760, 36404, -96877, 93471, 271502, 482980, -161295]
15123C55768A46152F7308R2899D2519J4114b41549E4749J88948j03408c11976
15112D34833h5411A77736K5163B0503J40315F8959J03302A7789R0232J12858i1224
15100D18886j10786m5015A9649J72755k414A8554e25732C24339H237M3399o529
15089D5107c6002j47179A17364J19388p6516e6888F1231K8741J15702F7381N7408
15078A24789J46337A24905J65647a60730M3813A35012i3596C03392K14954k23131
15068B95215q7308L26h9930A74602G845J18758J58378A3928J90010n8652J8065
15057A63351a4239j9573B15200m630m1243l6675K34150l7941F7144a19287C67803
15045i6198D0024J54380b71118A50561D7212K56318B1929K02538a17138A05672
$$ y = [355768, 146152, 67308, 160207, 42519, 56633, -241549, 54749, 243697, 140289, -311976, 434833, -85411, 177736, 202899, 20503, 160818, 68959, 172261, 17789, 108021, 220879, -91224, 418886, 308100, 263085, 19649, 192404, 189990, 18554, -525732, 324339, 8237, 51636, 45107, -36002, -183181, 117364, 236752, 160236, -56888, 61231, 89972, 205674, 67381, 124789, 271126, 124905, 290552, -160730, -116917, 135012, -93596, 303392, 518346, 295215, 207907, 208233, -89930, 174602, 7845, 126603, 284981, 13928, 203938, 145286, 163351, -14239, -33812, 215200, 210570, 169327, 132652, 366802, 328861, 67144, -119287, 367803, -96198, 40024, 194404, -271118, 150561, 47212, 303530, 21929, 224467, -117138, 105672]
15034C32536a16024B87290A17189k7201M5973k9770k8930J42326j1704D4933J55136
15023B00069L4358J01006A67140L7538N1795M0713q6591L51752B5641L25112C4009
15011B77173J4970j43397J79897H961K70353H026L71695b56930d5492I2820k6984
15000F5836J40556n2287N7501q4049J96414b11829D22229j94118j3022G8296L23695
14989D01991H5966J81688k334J55717A90908J87059k9322q2225K6227k8693I5749
14977F6190K92333A48907L21590j71362A35791i2959B49181J37932o7585j27731
14967A91797J63961j47414Q0636o9522R1660l028q5324k8989m2844n2956N0067
14956A48044R1617D4783M33098A41979J8955m9992R7744f1710B96564m8747j7246
$$ y = [332536, -116024, 287290, 117189, 89988, 135961, 106191, 77261, 219587, 207883, 44933, 200069, 234427, 335433, 167140, 204678, 256473, 297186, 210595, 562347, 25641, 350753, 34009, 277173, 292143, 148746, 328643, 8961, 279314, 8026, 379721, -256930, -45492, 92820, 65836, 206392, 154105, 211606, 127557, 323971, -211829, 422229, 228111, 215089, 78296, 401991, 85966, 267654, 265320, 421037, 190908, 377967, 348645, 266420, 292647, 263954, 95749, 66190, 358523, 148907, 470497, 299135, 135791, -92959, 249181, 387113, 319528, 191797, 355758, 208344, 288980, 219458, 311118, 308090, 222766, 193777, 150933, 97977, 148044, 239661, 44783, 477881, 141979, 160934, 110942, 208686, -61710, 296564, 247817, 230571]
14945B30571m6885G4573L58193j16050D2975M56692e1180C94466M5226J2511A54058
14933C21799E5926K97076D8569M12754D3335K71533n9189P2898l2648o1510E0025
14921B24486e2219B62589O580r5536J26517K5598D2487M12923B22240J43969l510
14910C62699j74172K41147A85255R7984O8440a20442G9984L01564J21385B22109
14899A96359J97077K1463Q2317j89859r385i7171F5802R8570L30179j83810A22516
14887C55885B8844K30183J38532j02835A26886L79325k16744J8221J20609K0703
14877D49000B20923J48486j54494p0945J83126J8663M4173A29607L19401r074
14867D39934j34677k5947Q9661j72922J85446p3626N6436J25575p919A94834j4276
$$ y = [230571, 183686, 74573, 432766, 316716, 42975, 499667, -51180, 394466, 439692, 452203, 154058, 321799, 55926, 353002, 48569, 461323, 43335, 314868, 255679, 328577, 295929, 234419, 50025, 224486, -52219, 262589, 269169, 173633, 300150, 325748, 42487, 455410, 222240, 366209, 362699, 188527, 429674, 185255, 283239, 351679, -120442, 79984, 381548, 502933, 222109, 196359, 393436, 414899, 497216, 307357, 297972, -97171, 65802, 164372, 494551, 310741, 122516, 355885, 28844, 259027, 397559, 294724, 126886, 506211, 289467, 307688, 428297, 449000, 220923, 369409, 214915, 143970, 327096, 345759, 389932, 129607, 449008, 439934, 305257, 279310, 368971, 196049, 381495, 307869, 364305, 489880, 481961, 194834, 180558]
14856A80558K26129R7581B04708E1292L10220l4969m2190j6285K43277A09159
14845F36756q5378j74378j73389p2527K55851N5088L29091C76546K80721H8988
14834C96310P3450j34723J35215j496j72431n3627O276J89601q840j1217Q4904
14823E03422A49028d2056D55700j50795M86646q9464k54729M64933j48492k94502
14813D69297k09827K12215J66225J02445k46620p4478j35173Q4359j00824R622
14803B77241J52871K21072j74603j16910J69814L3133O6867M0669j39328j84655
14793C46171P42310D69432j26318n623K36305k74815L76033B71217J47431O9234
14783D87882k30419N09353l79398Q8072J51499j64988R990L07163l22899P7167
$$ y = [180558, 406687, 504268, 204708, 51292, 361512, 326543, 284353, 268068, 511345, 109159, 636756, 551378, 377000, 203611, 131084, 386935, 442023, 771114, 376546, 657267, 88988, 396310, 469760, 335037, 470252, 468756, 296325, 242698, 248974, 438575, 429735, 418518, 503422, 149028, -42056, 455700, 304905, 791551, 702087, 447358, 912291, 763799, 469297, 259470, 471685, 637910, 740355, 493735, 419257, 284084, 368443, 267619, 277241, 430112, 651184, 476581, 359671, 529485, 562618, 629485, 670154, 530826, 346171, 1088481, 469432, 343114, 337491, 573796, 298981, 675014, 271217, 418648, 487882, 257463, 766816, 387418, 475490, 626989, 462001, 471991, 779154, 456255, 533422]
14773E33422j85307J35665K34884l07418J2035J35764q9769M79881D67494N424
14763D72918J86743k75772K97320j49578m7262m0455r7683K64600j37773R5183
14753E68241J6236k73178M82263l79984J26210J26728j69279K63831k6768k82820
14743D51480J07614J20488k2744l294J06518j92884J41071l37265R2749J59510
14733F23243q8734O2765P4299M8044k2790J59440r5273j8254Q5060j80486o516
14722F40798J97806o3316O7766m7753o0759J36195O6081k71241K00346l46533
14712E19390N48013l65872K82559j83212l52189M39177k91193L29808m57950K83243
14702G51774J26546r7307k6684M6888L1265j0682l63307K60670K13358k72019
$$ y = [533422, 348115, 483780, 718664, 411246, 423281, 559045, 469276, 949157, 467494, 472918, 659661, 383889, 681209, 531631, 484369, 443914, 346231, 610831, 473058, 568241, 584477, 311299, 793562, 413578, 539788, 666516, 497237, 761068, 734300, 451480, 559094, 679582, 656838, 653544, 760062, 567178, 708249, 370984, 463733, 623243, 534509, 597274, 671573, 719617, 696827, 856267, 760994, 742740, 827800, 647314, 640798, 838604, 775288, 843054, 795301, 734542, 870737, 936818, 665577, 865923, 519390, 1067403, 701531, 984090, 800878, 448689, 887866, 596673, 926481, 468531, 751774, 878320, 781013, 754329, 801217, 832482, 821800, 458493, 719163, 932521, 660502]
14692F60502Q6731K73941j5659k01938J83874q8827m9456k21214J08565j37665
14682E98854K22188O4347j85732J62940J60512k95717K96294l92033L95179J0723
14672A037555p2371J46020P4062k61091l26498J54046J92830J58632m7291k84021
14662G71873N16860l82374K14699k38472L80652L2590j58979K36580q1361o4666
14652A227402J72039k65359l00942N03258m43939L65776k801r2567o8924P2858
14642A166801J31482j42898J71896K1196k21072K26624p9729k18323K81339k26559
14632A110757p4916M91067l06037r6871J62010K03781m75095J22529J28428L8537
14622A304190m9178j97496M31260j48435J90762K00273m25961L73929k30463j39416
$$ y = [660502, 747233, 1021174, 1005515, 803577, 987451, 898624, 849168, 627954, 736519, 598854, 821042, 885389, 699657, 862597, 1023109, 727392, 1023686, 631653, 1026832, 1037555, 965184, 1111204, 1185266, 924175, 597677, 751723, 944553, 1103185, 1055894, 771873, 1288733, 906359, 1121058, 882586, 1263238, 1295828, 1136849, 1373429, 1292068, 1227402, 1399441, 1134082, 833140, 1336398, 892459, 1258235, 1255434, 1162867, 1093943, 1166801, 1298283, 1155385, 1327281, 1348477, 1127405, 1354029, 1274300, 1055977, 1337316, 1110757, 1035841, 1526908, 1220871, 1124000, 1286010, 1489791, 1014696, 1137225, 1265653, 1304190, 1255012, 1057516, 1488776, 1340341, 1531103, 1731376, 1305415, 1679344, 1448881, 1309465]
14612A309465Q260N890L22368o5602j38656j26813K00297J76184k04848Q1238
14602A567783K06378l57455n2282j12232K99178J49020k74926K71213j10651J43709
14592A729735k8954L11710j88189k4692j74146K53303J69755j70852j58536J35358
14582A854492j19529n1795J66177J09637J46543K08789j27356j19185j35255j47762
14572A784756k548M48581k30376j76739M29772k25587K28371r3551J69109j42940
14562B188848K83386J78894L2543M1962J78654P0513q9802M85117K55967K31048
14552C857130M66375O98171Q03310K047397N116754Q535411J4725215K998231
14544C9247994A7890949G794320C854897j216460m56148l91798J65971k61152
$$ y = [1309465, 1317725, 1323615, 1645983, 1580381, 1441725, 1314912, 1515209, 1691393, 1486545, 1567783, 1774161, 1416706, 1364424, 1252192, 1551370, 1700390, 1425464, 1696677, 1586026, 1729735, 1700781, 2012491, 1824302, 1799610, 1625464, 1878767, 2048522, 1877670, 1719134, 1854492, 1734963, 1683168, 1849345, 1958982, 2105525, 2314314, 2186958, 2067773, 1932518, 1784756, 1782208, 2230789, 2000413, 1823674, 2253446, 2027859, 2256230, 2162679, 2331788, 2188848, 2472234, 2651128, 2683671, 2725633, 2904287, 2974800, 2884998, 3370115, 3626082, 3857130, 4323505, 5021676, 5824986, 7872383, 12989137, 21524548, 36249763, 39247994, 17890949, 7794320, 3854897, 2638437, 2182289, 1790491, 1956462, 1695310]
14536A695310P887J67999L75304j47131o8708n5531j43039N0266M96677P7079
14526B456113l28240J39497j03983J95808k09655J46781J5279K66559k88099K85084
14516B575144j32175m44862O60511J40343k59152o9751J66096l08400L57020r997
14506B674777K72849l86348M37179q6884N8893K91498k04337J79999m61779K80656
14496C056503p182Q5339J04796J50516l34041q2487L54817J23647j33136J32780
14486C451552J27731q6174j98912K70537k09738K63715O5391r8240o8481J41571
14476C658952n1934L48693l59841K75541l9635K47801k13649J48460K11779L83771
14466D609938k94914M49431k15754k67935L21047k07906K60606k20151L81020
$$ y = [1695310, 1703197, 1871196, 2246500, 2099369, 2030661, 1975130, 1832091, 1882357, 2379034, 2456113, 2127873, 2267370, 2163387, 2359195, 2149540, 2296321, 2311600, 2578159, 2290060, 2575144, 2442969, 1998107, 2658618, 2798961, 2539809, 2470058, 2636154, 2327754, 2684774, 2674777, 2947626, 2561278, 2998457, 2911573, 2970466, 3261964, 3057627, 3237626, 2775847, 3056503, 3049321, 3134660, 3239456, 3389972, 3055931, 2973444, 3328261, 3451908, 3318772, 3451552, 3579283, 3493109, 3294197, 3564734, 3354996, 3618711, 3684102, 3585862, 3517381, 3658952, 3607018, 3955711, 3595870, 3871411, 3831776, 4079577, 3865928, 4014388, 4226167, 4609938, 4315024, 4764455, 4548701, 4280766, 4601813, 4393907, 4654513, 4434362, 4815382]
14457D815382m8354P0067J77431O548o0561N8169j74411K42025Q3560M05982l71757
14446E204081L36319l30161K37306L76815l03070J44671J34110L17960k91516
14437E826515L12182j20961k0211k9129K96984n468K84658Q2761p1323L11430
14427F867438J07868J21396o7687q8882J39196K16926J44212J95748j19712L23754
14417G840257l5898J36729l8510K27362J06127N194L46741J19854M59179j57445
14407I009590r1203K70645J48427j03213L63465M88941J09458j22109K33703P3171
14397A0380875L08612M75327o1853K09446m9558L94685K46480J78647J7759K67722
14387A2368142P0680L30258K47975K71656M79958m5001J27792M56104J99922O44359
$$ y = [4815382, 4767028, 4837095, 5014526, 5021074, 4960513, 5018682, 4844271, 5086296, 5169856, 5575838, 5204081, 5540400, 5210239, 5447545, 5824360, 5521290, 5665961, 5800071, 6118031, 5826515, 6138697, 6017736, 5997525, 5968396, 6265380, 6259912, 6544570, 6627331, 6556008, 6867438, 6975306, 7096702, 7029015, 6940133, 7079329, 7296255, 7440467, 7636215, 7516503, 7840257, 7804359, 7941088, 7902578, 8129940, 8236067, 8241261, 8588002, 8707856, 9167035, 9009590, 8918387, 9189032, 9337459, 9234246, 9597711, 10086652, 10196110, 10074001, 10307704, 10380875, 10689487, 11164814, 11102961, 11312407, 11262849, 11657534, 11904014, 12082661, 12100420, 12368142, 12438822, 12769080, 13017055, 13288711, 13768669, 13723668, 13851460, 14307564, 14507486, 15151845]
14377A5151845k81941N85176K80814J63302L48183J67179M91822k2904N07347
14368A7390823M71634N06993M14848r8743L78653M53803P97071q9233N99264N02583
14358B1327696O72126N01770N11727M49544N67883N96709M58801P21536N95792
14349B6403584O45238M54359J043065L99910R75534O94881R09805P31859P18277
14340C2976512R48628P74198J471656O97479R98014J393505Q55987J067330J445663
14331D2628972J345858J454207J262076J482508J337170J541914K052710J625060
14323E4730475J822069J922621K168469K260646K186648K656141J916880K734503
14315G2398452K852464K845634L309046L128171K924222L474226M200331L867170
$$ y = [15151845, 14869904, 15455080, 15735894, 15899196, 16247379, 16414558, 16906380, 16883476, 17390823, 17862457, 18369450, 18784298, 18685555, 19064208, 19518011, 20315082, 20225849, 20825113, 21327696, 21999822, 22501592, 23013319, 23462863, 24030746, 24627455, 25086256, 25807792, 26403584, 27048822, 27503181, 28546246, 28946156, 29921690, 30616571, 31526376, 32258235, 32976512, 33925140, 34699338, 36170994, 36868473, 37866487, 39259992, 40115979, 41183309, 42628972, 43974830, 45429037, 46691113, 48173621, 49510791, 51052705, 53105415, 54730475, 56552544, 58475165, 60643634, 62904280, 65090928, 67747069, 69663949, 72398452, 75250916, 78096550, 81405596, 84533767, 87457989, 90932215, 95132546, 98999716]
14307I8999716M504619M142418M546093N316280M988915N596086N656534O267141
14299A40017802O671572O967107P428281Q124085Q187640Q968555R458760R370988
14291B05194790J0656259J0658000J1609698J1674117J2673804J2950440J3367092
14284B88784200J3599585J4044598J3842338J4269605J4264593J3887173J3563911
14277C86256003J3038787J1849130J0824381Q665985M795784Q80958j78302J492056
14269D37624782N63637k536910l769884n801662q519782j0918735j2051540j3862796
14261C80727110j4396126j4951923j5159386j5421231j4937110j4960255j3260625
14254B77640454j3664666j3180487j3078974j1731322j1481832j0877244j0061566
$$ y = [98999716, 103504335, 107646753, 112192846, 117509126, 122498041, 128094127, 133750661, 140017802, 146689374, 153656481, 161084762, 169208847, 177396487, 186365042, 195823802, 205194790, 215851049, 226509049, 238118747, 249792864, 262466668, 275417108, 288784200, 302383785, 316428383, 330270721, 344540326, 358804919, 372692092, 386256003, 399294790, 411143920, 421968301, 430634286, 435430070, 436311028, 436132726, 437624782, 438188419, 435651509, 431881625, 426079963, 417560181, 406641446, 394589906, 380727110, 366330984, 351379061, 336219675, 320798444, 305861334, 290901079, 277640454, 263975788, 250795301, 237716327, 225985005, 214503173, 203625929, 193564363]
14247A93564363r881687r102980q356890p770208p705915p269821o918801o135704
14239A30422357o138541n131492m871689n332283m810607m385441l991814m055661
14231I1704829l290006l374006l477686l437455l248000k658107k638340k544376
14223F7036853k269438k335418j796045k452327j725746j978098k051618j420075
14215E1008088j509824j357786j441868j382829j758991r74030j459756j005527
14207D0117477p71654j432744j309240r07025r42800q31971q76577p70515r22884
14198C1352067p38451j097472n70751j006246l20743o16316r57167o40606l69658
14189B5034657q72986m13309n77744l50125q48634j98940n83472R937q43077m52587
$$ y = [193564363, 183682676, 174579696, 166222806, 158452598, 150746683, 143476862, 136558061, 130422357, 124283816, 119152324, 114280635, 108948352, 104137745, 99752304, 95760490, 91704829, 88414823, 85040817, 81563131, 78125676, 74877676, 72219569, 69581229, 67036853, 64767415, 62431997, 60635952, 58183625, 56457879, 54479781, 52428163, 51008088, 49498264, 48140478, 46698610, 45315781, 43556790, 42582760, 41123004, 40117477, 39345823, 37913079, 36603839, 35696814, 34754014, 33922043, 33045466, 32274951, 31352067, 30613616, 29516144, 28945393, 27939147, 27618404, 27002088, 26044921, 25404315, 25034657, 24161671, 23748362, 23170618, 22820493, 21971859, 21772919, 21189447, 21199384, 20356307, 19903720]
14179A9903720m83444k20671n77896j30350o23661l85874j64571q68673o8272
14170A6380308j43425n58639m6854n90695j62967k01709j98197n48687l99811
14161A3529324M5204n37914K76518m16371l00195r4789J2074l46112m62889o2775
14151A1642075j5174m65895j26870j38867k52990q7284M7054j97768m67066q3280
14141I853935k729k77068n6801m61708M46360n35462l77113J11193k0130j33607
14131H546870j90192k03489K17545l36341l78205J12605J42996l4952m51351Q2751
14121G508237n06088K61733m62647M84086k36085j86741k0872j20843k85635J11450
14111F546595O1645r5253j49790k70359m3982o702J04987m30393J5823k27300
$$ y = [19903720, 19420276, 19199605, 18621709, 18491359, 17867698, 17481824, 17317253, 16448580, 16380308, 16236883, 15678244, 15631390, 15040695, 14877728, 14676019, 14477822, 13929135, 13529324, 13574528, 13036614, 13313132, 12896761, 12596566, 12501777, 12513851, 12167739, 11704850, 11642075, 11626901, 11161006, 11034136, 10895269, 10642279, 10554995, 10602049, 10404281, 9937215, 9853935, 9851206, 9574138, 9517337, 9055629, 9501989, 8966527, 8589414, 8700607, 8680477, 8546870, 8356678, 8153189, 8370734, 8034393, 7656188, 7768793, 7911789, 7876837, 7425486, 7508237, 7002149, 7263882, 6801235, 7285321, 7049236, 6862495, 6841623, 6720780, 6435145, 6546595, 6608240, 6512987, 6363197, 6092838, 6048856, 6042154, 6147141, 5716748, 5732571, 5505271]
14101E505271K91336m55656J06580Q358J91262j58008j77986k7336m0384J40728
14091E384165j97036M2585k13224j64483p6406P8447r6762J03607j65964q0944
14081D613985l4835k70719J44872m5780k0636j16043M28865k99053k56596J03834
14071D247894k75453m9999l1937J70101l51347o876K51560k78348J48744k42951
14061C581388K64101j74622K94214o71719M26671l86534J59402J47941n31009
14052C109833J61292J35570k7394j78661J87204j76596l4990J7777j2345L913
14042C185603p1011p4273j55845J65881j93792Q5133l32309L09168j85921M00198
14032C132832l48657L13457k16459M8306n1669j08415q0736p5596J41438K23737
$$ y = [5505271, 5796607, 5340951, 5447531, 5455889, 5647151, 5489143, 5311157, 5283821, 5243437, 5384165, 5187129, 5229714, 5016490, 4852007, 4775601, 4854048, 4757286, 4860893, 4694929, 4613985, 4579150, 4308431, 4453303, 4407523, 4386887, 4270844, 4699709, 4400656, 4144060, 4247894, 3972441, 3922442, 3890505, 4060606, 3709259, 3702383, 3953943, 3675595, 3824339, 3581388, 3845489, 3670867, 3965081, 3293362, 3720033, 3333499, 3492901, 3640842, 3109833, 3271125, 3406695, 3379301, 3200640, 3387844, 3211248, 3176258, 3194035, 3181690, 3185603, 3114592, 3040319, 2884474, 3050355, 2856563, 2941696, 2609387, 2918555, 2732634, 3132832, 2784175, 3097632, 2881173, 2929479, 2877810, 2769395, 2688659, 2613063, 2754501, 2978238]
14022B978238m26500K1589L3166k82150o117j27723L47957l04737l2560R1238
14012B292401L893q1698J24736l6426l933k86643k52267N92168n7389k58008L5647
14001B072481K5778k9963l13776M78388j98913j35680J58042l6317L1304K14689
13991B266033J14069N63460Q22926L903263P656171J4513368J0978075j8103401
13983B2713964j0683085m890128j776110p72556r35478n22236k79536m4395m60924
13974B349516J84044m976p9830J32486k43236k56030L05054l38765J93676j46133
13964B095806J5535l5464m0340L6087m5342n3810k40438o4469M56198n63590N19925
13953B080098r7896M4669m46891M1287L66128o1089k69891J3408k4129J45274
$$ y = [2978238, 2551738, 2573327, 2606493, 2324343, 2318226, 2190503, 2538460, 2233723, 2201163, 2292401, 2296294, 2214596, 2339332, 2302906, 2298973, 2012330, 1760063, 2352231, 2294842, 2036834, 2072481, 2098259, 2068296, 1754520, 2232908, 2033995, 1898315, 2056357, 2020040, 2051344, 2266033, 2380102, 2943562, 3766488, 7669751, 15325922, 29839290, 40817365, 22713964, 12030879, 7140751, 5364641, 4592085, 3656607, 3134371, 2854835, 2810440, 2349516, 2533560, 2528584, 2448754, 2581240, 2338004, 2081974, 2387028, 2048263, 2241939, 2095806, 2111341, 2075877, 2035537, 2071624, 2026282, 1972472, 1732034, 1667565, 2123763, 1560173, 2080098, 1982202, 2026871, 1579980, 1621267, 1987395, 1926306, 1656415, 1669823, 1645694, 1790968]
13943A790968l58647J14722q2863L57783l51601M51871m8030m19998J43578M7505
13933A645288J01014N1082k79112r2693K02906j0701j64154J65610p6094l28393
13923A214753J20572J32442m03732R0104M74419J26883k34350k64884J97666m4339
13913A409534J26290j66493j32895K66931l56434M2101L06190Q1758q9514k99102
13903A188366j85202M88558j84354k04927L31938r0257J4705j19436j22084j62692
13893I54615n7727L90991r75M2524p1192j71406J51796j12661O8846j1044M2543
13882A226310R0457j63879j02137J34797J7115q3729k2147j51484K37536j11297
13872A071542k92149L39835j07754P847P7773J52994L705j92258n3892L1615n7994
$$ y = [1790968, 1432321, 1547043, 1464180, 1821963, 1470362, 1922233, 1874203, 1454205, 1597783, 1645288, 1746302, 1797384, 1518272, 1425579, 1628485, 1617784, 1453630, 1619240, 1543146, 1214753, 1335325, 1467767, 1064035, 1154139, 1628558, 1755441, 1521091, 1256207, 1453873, 1409534, 1535824, 1369331, 1236436, 1503367, 1146933, 1189034, 1495224, 1576982, 1487468, 1188366, 1003164, 1491722, 1307368, 1102441, 1434379, 1344122, 1358827, 1239391, 1117307, 954615, 896888, 1287879, 1286904, 1329428, 1258236, 1086830, 1238626, 1125965, 1194811, 1183767, 1226310, 1316767, 1152888, 1050751, 1185548, 1202663, 1118934, 1096787, 945303, 1182839, 1071542, 779393, 1119228, 1011474, 1019321, 1097094, 1250088, 1253793, 1061535, 1007643, 1039258, 981264]
13861I81264J05866j05050M82936m96847J15311k61549J67585J44548k68130M39042
13851A304976k73767J67345k10833l77588N54919k85809J47672j91544K48928
13842A084299j73213K5258M0569o6018K2667L3140L0226j39949M4271K6089r4005
13831H33334J07299j68145J452J85245k64135Q7105j17647J24444L17537n22637
13821E83852K06670j45324K48370k10588K52128l17064L04200k45082L3485P1440
13811G82087N0275l949j29087k789p7307J48564L3976K3494O7778k41431J40102
13800G91713q9446k88870J89780j2736L28180j35029j33874L65422k55182j52208
13790F07750J01458B72411L41474K23276j88183J41626p7449Q4808k45220M7610
$$ y = [981264, 1087130, 982080, 1465016, 968169, 1083480, 821931, 989516, 1134064, 865934, 1304976, 1031209, 1198554, 987721, 610133, 1165052, 879243, 1026915, 835371, 1084299, 911086, 936344, 976913, 910895, 933562, 966702, 996928, 856979, 901250, 927339, 833334, 940633, 772488, 773940, 959185, 695050, 782155, 664508, 788952, 1106489, 583852, 790522, 645198, 893568, 682980, 935108, 618044, 922244, 677162, 710647, 782087, 832362, 828413, 699326, 696537, 619230, 767794, 801770, 825264, 893042, 651611, 791713, 702267, 413397, 603177, 590441, 918621, 783592, 649718, 1015140, 759958, 607750, 709208, 272411, 613885, 837161, 648978, 790604, 713155, 797963, 552743, 600353]
13780F00353J17542J66297k23872J58051k83859q1061O6727K41334C09085O29506
13770I38591o9102C38616N98710k31639O247p8462J95611j92274K6810J57447
13760H21066P1089k59020j99060r1391K59614p0303K37049j49126q7775P1801
13750F03944m3053J34428n6890R6724k49790M8347L70294m6713C11527K23259
13740E34786J01910j38233K42236j98035M5956o2298J56385k07564J46439k79601
13730C41981K76406j20729j00244N2698p8931L50961l16767O0821m8224J98824
13720F16796k35324J89739l9650k50781K40851k6143k4786K31917l36211K93073
13710F59481M4443l25215J00451J77428l19873K18732l9437J21915j57502J75072
$$ y = [600353, 717895, 884192, 660320, 818371, 534512, 453451, 520178, 761512, 309085, 938591, 869489, 338616, 937326, 705687, 711934, 633472, 829083, 636809, 663619, 821066, 892155, 633135, 434075, 342684, 602298, 531995, 769044, 619918, 532143, 603944, 560891, 695319, 638429, 735153, 485363, 533710, 904004, 857291, 311527, 534786, 636696, 498463, 740699, 542664, 588620, 526322, 682707, 475143, 621582, 341981, 618387, 497658, 397414, 450112, 371181, 722142, 405375, 466196, 417972, 616796, 381472, 571211, 531561, 280780, 521631, 495488, 470702, 702619, 366408, 659481, 703924, 378709, 479160, 656588, 336715, 555447, 516010, 637925, 480423, 655495]
13700F55495l11809L56113k48358A21594M03485O0878N0594B47663K48930n4254
13690D42339J04138j147n7130r0214P6084L9338A76942J04414j26314K31802J12093
13679D98937P8988L7960k50427L30478k63579P0944j99942J63186l3492j49208
13669B83845J21934O9680p67j55402M31425j79409j35349r8879H0177N44814j21379
13658E03612j14050O9662J08004r6930j88289M13178B72383K06657j67035J05991
13648D17996J72545j57994J07390B54213J96441j37899j35617M12266B04101J49151
13638C53252J70882K01571B73741K07402O8131k40463Q7544Q7638A57823J77046
13628C34869j28275K84131q9090J20636j74266K31154Q1177G0402M9963D5902
$$ y = [655495, 343686, 699799, 451441, 121594, 525079, 585957, 636551, 247663, 496593, 442339, 546477, 545330, 488200, 397986, 474070, 513408, 176942, 281356, 155042, 386844, 498937, 577925, 615885, 365458, 695936, 432357, 503301, 303359, 466545, 433053, 283845, 405779, 475459, 474692, 319290, 750715, 571306, 435957, 337078, 80177, 624991, 503612, 389562, 459224, 567228, 470298, 282009, 695187, 272383, 479040, 312005, 417996, 590541, 432547, 539937, 254213, 450654, 312755, 177138, 589404, 204101, 353252, 524134, 725705, 273741, 481143, 549274, 308811, 396355, 483993, 157823, 334869, 206594, 490725, 401635, 522271, 348005, 579159, 660336, 70402, 120365, 45902]
13617A90478K52832N1225k38262K30391G6486M33418B18291L06997k26453O0687
13607C59522A54692J5641L02542N2194j13857j02570A25515J54253K47111j96243
13597C30636r4949Q8266k6313K69263m5160A30961O6337A9312L30796l3345j31
13586C16632p6140r7171L92192E9197J23264J36190j44543Q2471J32592q6990
13576C02181k3319Q254J90783j45085M2923n9131J1310J7101H1475L69573j20258
13565C30790j20269M40096l17671L17358a57785H76K80244l5978A6980K39588
13555B56568M5341r2741J25445J62521k37045J9443I6967M2703o961O9961M3018
13544B45688L01003d5212f878G06413C06483K07317r4425j64361o5427K40000
$$ y = [190478, 443310, 494535, 256273, 486664, 76486, 509904, 218291, 525288, 298835, 359522, 154692, 170333, 472875, 525069, 411212, 308642, 125515, 279768, 526879, 330636, 235687, 323953, 297640, 566903, 521743, 130961, 197298, 19312, 350108, 316763, 316632, 240492, 143321, 535513, 59197, 182461, 318651, 174108, 256579, 389171, 302181, 278862, 287116, 477899, 332814, 375737, 316606, 327916, 345017, 81475, 451048, 330790, 210521, 650617, 332946, 650304, -157785, 876, 281120, 245142, 16980, 256568, 301909, 209168, 334613, 497134, 260089, 279532, 96967, 139670, 132709, 202670, 245688, 546691, -45212, -6878, 706413, 306483, 513800, 419375, 255014, 189587, 429587]
13534D29587A3567L01401D5710J42716K08518l5218K0891G0525J94045M274K08773
13523D77617A14619M2952P7951C5663N74148K8414A29688R6192J26605H5348K97008
13512C82356I1733L6508L8239J40514A39590n944L16281R3587k33150j21288L9842
13501B28918J35735H2914P2671L61479B33799l7086m5241k737M04047k60916m4318
13490B47548M0690i113A38714l9560O0783K49273A92822a3913E5630J54033J67462
13479C77125j69560L7889A09790J4734F736K82593A16815N6262J22042k4112o2797
13468B08210K12820A69428D3440M8253L65120k21510I2000l8281Q1530K66690
13458D01939j15951o0829E6704K91549e5799C24779p5582J9412P4367q9266a03692
$$ y = [429587, 13567, 314968, 45710, 188426, 396944, 361726, 382617, 70525, 264570, 268844, 477617, 114619, 157571, 235522, 35663, 609811, 638225, 129688, 225880, 352485, 85348, 382356, 91733, 128241, 166480, 306994, 139590, 133646, 449927, 543514, 310364, 189076, 228918, 364653, 82914, 155585, 517064, 233799, 196713, 151472, 148735, 552782, 291866, 247548, 288238, -9113, 138714, 99154, 159937, 409210, 192822, -13913, 55630, 209663, 377125, 207565, 245454, 109790, 124524, 6736, 289329, 116815, 173077, 295119, 271007, 208210, 421030, 169428, 43440, 91693, 456813, 235303, 92000, 53719, 135249, 401939, 285988, 225159, 56704, 348253, -55799, 324779, 249197, 268609, 342976, 253710, -103692]
13446C81368f2521B70399j6030i963B29632M2477F94K14259K79661H4550a20574
13434B57420I5544J20286r2401B417a812A58177m7786J00510J40483A39787K30917
13423C70704A37338k5612R4037O9469j01094j7053P597c4248B74744J10864A82406
13411C49248E2849a65778C77199J94937B80447n162a25895C46625A0190L82498
13401C92688A18163a0428A22765r150O7782a84699H215a61163E7058K84361D9625
13389E8656J81361P5406A49966K58297I1585M8101K05875j49533m4874K63102
13379D14256j10438J48858k05088p6068R8189J2976B6888K5877M14369j11068
13369C56066g9362H1472Q5331k1874r417g062B13544A9639K15798j05048J86554
$$ y = [381368, -62521, 270399, 254369, -9963, 229632, 272109, 694, 214953, 494614, 84550, -120574, 257420, 95544, 215830, 123429, 2417, -1812, 158177, 110391, 210901, 351384, 139787, 370704, 137338, 111726, 205763, 275232, 174138, 157085, 164682, -34248, 274744, 385608, 182406, 349248, 52849, -165778, 377199, 572136, 280447, 275285, -125895, 346625, 10190, 392688, 118163, -10428, 122765, 113615, 181397, -184699, 8215, -161163, 57058, 341419, 49625, 58656, 240017, 315423, 149966, 408263, 91585, 139686, 345561, 196028, 151154, 414256, 303818, 452676, 247588, 171520, 269709, 282685, 26888, 52765, 467134, 356066, -79362, 81472, 166803, 144929, 135512, -7062, 213544, 19639, 235437, 130389, 316943]
13358C16943d1264B13081A5236b49095B78304G3516J84184R3129r3747K45879
13348E02961j15662A23489N1523L50094B30903J9358j02423M00577r0822j73229
13338B84364A29097E8246a23069B54321J03111A12105J62330J99234j22933K6933
13328C77669b0896B99875f2085A59222C2791A3123b18495B42759k6685c7645A98528
13316C40728j51298J9138e3569C81176A23433b9729i756A73124e5306p641p2137
13305a35084B65675N3933H9497L9974L71655D5853i2966B68367K31381E8571K26874
13294B85445k527F370a40404K3959E8117Q9051D8895J10296k2388J50727j43411
13283A44119J42577E8597O6455j406K26703a5655B71469h7386A99734a2450B43094
$$ y = [316943, -41264, 213081, 15236, -249095, 278304, 73516, 257700, 350829, 257082, 502961, 387299, 123489, 175012, 525106, 230903, 250261, 147838, 548415, 457593, 284364, 129097, 58246, -123069, 254321, 357432, 112105, 274435, 473669, 350736, 377669, -20896, 299875, -62085, 159222, 32791, 13123, -218495, 242759, 216074, -37645, 198528, 340728, 189430, 208568, -53569, 381176, 123433, -29729, -9756, 173124, -55306, -62947, -135084, 265675, 319608, 89497, 129471, 501126, 45853, -92966, 268367, 499748, 58571, 285445, 282918, 6370, -140404, -116445, 58117, 147168, 48895, 159191, 136803, 287530, 144119, 286696, 58597, 125052, 123646, 350349, -15655, 271469, -87386, 199734, -12450, 243094]
13271E6703i2030B03080Q1108J9268j06977K7465p122j06819Q9918G2551J27544
13260B00095a42635A82223B6086J08558E2724J03615R3084A15730m8264a52301
13249A84350B8898R5104f1070A6649a81769A36008l9659a99680A83805a2537q6472
13238i9009j40241A76466J80435j36452I7024J31683J21357j27821e2519A15975
13227A08732a74604H9265M8862b7651A64099D2226K57500A8316R6267J98183e5786
13215A84470F5914J24351E1295J60473a19995B34752g0309a2730B42271D899J75300
13204A80199a11089c5548A92895g8659C3312e8008H9372O1308R378K95068A53598
13192i3639B81281a2815F3419a15408E9238a51135F9017k7032D793K11169m4432
$$ y = [56703, -92030, 203080, 284188, 303456, 196479, 223944, 216822, 110003, 199921, 72551, 200095, -142635, 182223, 26086, 134644, 52724, 156339, 249423, 115730, 67466, -152301, 184350, 28898, 124002, -61070, 16649, -181769, 136008, 96349, -199680, 183805, -12537, -99009, -239250, 176466, 356901, 220449, 97024, 228707, 350064, 222243, -52519, 115975, 108732, -174604, 89265, 138127, -27651, 164099, 42226, 299726, 18316, 114583, 312766, -55786, 184470, 65914, 190265, 51295, 211768, -119995, 234752, -70309, -12730, 242271, 4899, 180199, -111089, -35548, 192895, -78659, 33312, -58008, 89372, 150680, 160058, 455126, 153598, -93639, 281281, -12815, 63419, -115408, 59238, -151135, 69017, 41985, 4793, 215962, 171530]
13181A71530a46777A36816A1416c2579E1003a27150A92183C3575c9729D94783
13170e0166j56393E6294P880G490J59116k3616b3794m1989C06585a15408c1290
13158C1104a01301a8832j86992P9092F1412o833J1256K86320A59121L7565k8324
13147A68362q3869B3015K91415b65906O9067A94363J03351d9886B81591q1879
13137A99712a11146p0283A13675K50500j5775e3606D1132e5107H2664B9525J94561
13126B24086c317o3565o7502E2192a37634r8486B25746a42145B81106a23664N3509
13115g0155k5188C045P2879h1284A9275K71649n9589g7932A18425g8656A9112
13103a16490A37718C2476a42352A68736J04388a08118C54198J56478d9994a2479
$$ y = [171530, -146777, 136816, 11416, -32579, 51003, -127150, 192183, 33575, -39729, 494783, -50166, -206559, 56294, 64174, 7490, 166606, 142990, -23794, -65783, 306585, -115408, -31290, 31104, -101301, -18832, -205824, -126732, 61412, 54579, 65835, 352155, 159121, 196686, 168362, 84493, 23015, 314430, -265906, -196839, 194363, 297714, -49886, 281591, 199712, -111146, -181429, 113675, 364175, 348400, -53606, 41132, -55107, 82664, 29525, 224086, -3317, -66882, -134384, 52192, -137634, -236120, 225746, -142145, 281106, -123664, -70155, -95343, 3045, 75924, -81284, 19275, 290924, 231335, -77932, 118425, -78656, 19112, -116490, 137718, 32476, -142352, 168736, 273124, -108118, 354198, 510676, -49994, -12479]
13092B9624J71111b18695A52672F5648a21775a7876l19517a54734B75949b62043
13081A85641D8213a48125E2596K05933O5282F665J06325J4927P7929n5981J81759
13070C31624H4908h0799c7363B11588F5417a40773C37689J0002r8799J4461A7287
13058F7416R8635Q8344j22008i5209A68879H2752K16996A17746h502C21369C5212
13046A92931a08003D8942M24191j4284A54017c4009E9695N1097D1298i7656b7393
13034a27175l1819E7614J84830G1232d5917d178C67224A29157Q1680k5069R9O920
13022A92787F4735a30425A94849D6797C84b80455A2767K52520I6321K20878c0815
13010e5524i057E7929d21819A1514e0885D32235k12217c3431R238n2056B173K77179
$$ y = [29624, 200735, -218695, 152672, 65648, -121775, -17876, -337393, -154734, 275949, -262043, 185641, 48213, -148125, 52596, 258529, 323811, 6665, 112990, 127917, 205846, 149865, 331624, 84908, -80799, -37363, 211588, 65417, -140773, 337689, 347691, 248892, 263353, 17287, 67416, 166051, 254395, 132387, -95209, 168879, 82752, 299748, 117746, -8502, 321369, 35212, 192931, -108003, 48942, 473133, 458849, 154017, -34009, 59695, 110792, 41298, -97656, -27393, -127175, -158994, 57614, 242444, 71232, -45917, -4178, 367224, 129157, 210837, 185768, 185867, 192787, 64735, -130425, 194849, 46797, 384, -280455, 12767, 265287, 96321, 317199, -30815, -55524, -9057, 57929, -421819, 11514, -50885, 432235, 220018, -33431, -24193, -76249, 2173, 279352]
12998B79352j5929P9537C4412R0239n1687N1094M9232n701a47886E4246b6667
12986a03563A1464J47585A0468J95463q558C3453J40968J8404a8837B57810l5959
12975B21851b79383A77821a44592O5704A12656k9752J6411D3727a21649j24713
12965b46362A53113c73384A7457L72646a64649d8133A20309a56988M2204B37860
12954b83353C07408j43713J09956C4153L6056B0517J40271E9538O7960a17980
12943i8347d202A35701J1974m2699P4670B185K61623a58864H7285J30050a30530
12931A96470c04538C03130P1752a64196B16599D6182a40908A73187E6533i2445
12920G1783e0156B59513I4077b20130F7874b54777b7272J003B7074c6668j49743
$$ y = [279352, 263423, 342960, 34412, 124651, 72964, 124058, 173290, 167589, -147886, 54246, -26667, -103563, 11464, 159049, 10468, 205931, 197373, 33453, 174421, 192825, -18837, 257810, 221851, -279383, 177821, -144592, -78888, 112656, 82904, 99315, 43727, -121649, -246362, 153113, -373384, 17457, 390103, -164649, -48133, 120309, -156988, -114784, 237860, -283353, 307408, 163695, 273651, 34153, 70209, 20517, 160788, 59538, 127498, -117980, -98347, -4202, 135701, 147675, 104976, 179646, 2185, 263808, -158864, 87285, 217335, -130530, 196470, -304538, 303130, 374882, -164196, 216599, 46182, -140908, 173187, 56533, -92445, 71783, -50156, 259513, 94077, -220130, 67874, -254777, -27272, -26269, 27074, -36668, -186411]
12909a86411E8533A0648J99750B0062K37486I7366b49096A87923a11344e664D1879
12897c5470C57284k8398a327F2968a32184A55311a68681N336l3441j65637e5435
12885h7790A93625C4057p333f2019n3427c1478j76997Q1241e89D605a69271L0010
12873a39261A01069D4460M1805j8715a54181f0381j328l9251d3558A33000e7469
12861g099l63865J24981A19456k1792e215A01432O8176k3174k8143L2303G1150
12849c9753A55350D1357K7790f2131A18230J74012D0211d7855A26743c01428B39741
12837B9007M982j3161O9978h8175G7484f7591b1813k02895b8388B68152g6732
12825B8304d9635B4410L8289J10742a46890L0025C9025Q9442P161K7390l8508
$$ y = [-186411, 58533, 10648, 210398, 20062, 257548, 97366, -249096, 187923, -111344, -5664, 41879, -35470, 357284, 328886, -1327, 62968, -132184, 155311, -168681, -163345, -196786, -362423, -55435, -87790, 193625, 34057, 26724, -62019, -115446, -31478, -208475, -127234, -589, 4605, -169271, -139261, 101069, 44460, 86265, 67550, -154181, -60381, -61709, -100960, -43558, 133000, -57469, -7099, -370964, -245983, 119456, 97664, -5215, 101432, 169608, 146434, 118291, 150594, 71150, -39753, 155350, 41357, 69147, -62131, 118230, 292242, 40211, -47855, 126743, -301428, 239741, 29007, 33989, 20828, 90806, -88175, 77484, -67591, -21813, -224708, -28388, 268152, -76732, 28304, -49635, 24410, 62699, 173441, -146890, -116865, 39025, 128467, 135628, 163018, 124510]
12814A24510b41548K9569G8327K24628I013i987C9161L1080b2642D23047f9057
12802c3551A28091J6352B5476N134J29785A8785a71813P7153A88661e7920p3527
12791a31447b945j29929p7421H5405L2421n4559P910a06674n1520B36097E2729
12779D06874i9752A818M5478J93125o5133H1889b29722A34175M9134q6467J7724
12768A14566B0926q684a08692k2982N0116H0199P6701e2259B74378r5602a16313
12756B01214H9633a02900A6941c31374F8296a4075A15504D6575b819A10757Q8487
12745A99244a15720A4146K33039a16858A35507J1190m0787g758E44422k62549
12735B81873G7473J69494h613k27946B5355J17164J37017c1916D3403J76789c325
$$ y = [124510, -241548, -211979, 78327, 302955, 9013, -9987, 39161, 70241, -22642, 423047, -69057, -33551, 128091, 144443, 25476, 30610, 160395, 18785, -171813, -94660, 188661, -57920, -131447, -2945, -132874, -210295, 85405, 117826, 63267, 71177, -106674, -158194, 236097, 52729, 406874, -99752, 1818, 47296, 240421, 175288, 81889, -229722, 134175, 183309, 96842, 114566, 20926, 12242, -108692, -131674, -81558, 80199, 156900, -52259, 274378, 178776, -116313, 201214, 89633, -102900, 16941, -331374, 68296, -14075, 115504, 46575, -2819, 110757, 199244, -115720, 14146, 247185, -116858, 135507, 146697, 105910, -7758, 544422, 281873, 77473, 246967, -8613, -236559, 25355, 142519, 279536, -31916, 43403, 220192, -3325]
12723a10331A61431m6992A9941i9734A28341e5547d973j82285C7580J50426c9940
12711I8691a49162B73653n4110a05846A41187C6030P7652J42647q3625E8751a03599
12699G0691P6679L01332I1814O1684a26678f2314a8006A76634J52083C4538J8771
12688E3309L2420a33752L9970A72426c6517J6320k1805q2031A64234J90468A9492
12676B8044g9900B50677P3577B105h4808B35228F5558c3697j36289B9623M65439
12665D95062h762A4615k221l29K12791q3858M01329B39433J98828n5859A45158
12653C22729I5313N8959h0143I1681J22324b11115G5495e3558A89068a14777A18281
12641e5260m4460a7406D98550d2064l9465J4320j31964C93112i5729A76537b76598
$$ y = [-110331, 161431, 114439, 19941, -99734, 128341, -55547, -4973, -187258, 37580, 188006, -39940, 98691, -149162, 273653, 219543, -105846, 141187, 36030, 113682, 256329, 172704, 58751, -103599, 70691, 147370, 448702, 91814, 153498, -126678, -62314, -18006, 176634, 328717, 34538, 53309, 85729, -133752, -93782, 172426, -36517, -20197, -42002, -124033, 164234, 354702, 19492, 28044, -79900, 250677, 324254, 2105, -84808, 235228, 65558, -33697, -169986, 29623, 495062, -8762, 14615, 12394, 12065, 224856, 140998, 542327, 239433, 438261, 382402, 145158, 322729, 95313, 154272, -80143, 91681, 214005, -211115, 75495, -53558, 189068, -114777, 118281, -55260, -99720, -17406, 498550, -42064, -81529, -67209, -199173, 393112, -95729, 176537, -276598]
12629B36586j03018L9830b1605C9206B187a28864D0048a13523d2006A65588e591
12617B0651J22424a592j04348J953A7203a32965P698A57403n411b21671I8813
12605A85898g9035E7709b4739D1804K23511a14018j023A0445J07357k241K6671
12594A42232D6662J78581G1087o706d2387B52839b4947B1099a1498I6717a07270
12582b56748C47421a2404p1197A17414n1979k6104Q5974a40330E8483e434H515
12570e8785A10374a30466A3525K46691r0332i0827j4262J9045p495j22078G1180
12558c1122G0945d4981k12075I5104f96n31j28124A37292J36899H5664g7365l11420
12546c88785L028a56873B72328b51311C8325c89170a0606j10255B72599I1702
$$ y = [236586, 133568, 173398, -21605, 39206, 2187, -128864, 40048, -113523, -42006, 165588, -5591, 20651, 143075, -1592, -105940, -103987, 17203, -132965, -125267, 157403, 151992, -221671, 98813, 185898, -79035, 57709, -24739, 41804, 265315, -114018, -115041, 10445, 117802, 115561, 142232, 46662, 225243, 71087, 64381, -42387, 252839, -24947, 21099, -11498, 96717, -107270, -256748, 347421, -12404, -83601, 117414, 65435, 39331, 125305, -140330, 58483, -5434, 8515, -58785, 110374, -130466, 13525, 260216, 169884, -90827, -105089, -86044, -93539, -215617, 71180, -31122, 70945, -44981, -257056, 95104, -696, -1227, -129351, 137292, 274191, 85664, -77365, -388785, -385757, -156873, 272328, -251311, 38325, -389170, -10606, -120861, 272599, 91702]
12535b77888A53393b18389c5776j90680B3756N670F352a04595B03485O6929J95410
12524D65824a24124B89980a07911m7904A8984J53571J3127M7982N0246d97601
12513B9018f4426a7013k73838a7648m0232A74734b2709C21773A06348c05712D0149
12501a04851D35855D8395b6223j5920G9309h8143e739I1667j0446l7168b09646
12489A000L98061a6276j05973A13592J71868A08088o447o9B8989f7817D7370A4801
12476b01972f7821b1078B64340E5555i8865r3275p9432a0862A50754E6502K4948
12465H1450L6221O6830m9619a33847n8300i1062A16472d6040r4070k78341A82848
12453B16677j6482A8186J87521H0884j8912J66835a62138O7797E2366J84964H7994
$$ y = [-277888, 153393, -218389, -35776, -226456, 23756, 29426, 6352, -104595, 203485, 270414, 465824, -124124, 289980, -107911, -155815, 18984, 172555, 185682, 233664, 283910, -497601, 29018, -64426, -17013, -290851, -17648, -57880, 174734, -22709, 321773, 106348, -305712, 40149, -104851, 435855, 48395, -26223, -42143, 79309, -88143, -5739, 91667, 81221, 44053, -209646, 1000, 399061, -16276, -122249, 113592, 285460, 108088, 101641, 101572, 28989, -67817, 47370, 14801, -201972, -67821, -21078, 264340, 55555, -98865, -192140, -271572, -10862, 150754, 56502, 81450, 117671, 184501, 134882, -133847, -192147, -91062, 116472, -46040, -140110, -418451, 182848, 216677, 200195, 18186, 205707, 80884, 61972, 228807, -162138, -94341, 52366, 237330, 87994]
12441C73061A47308N9207Q0132j07181c05307a30847e7408D7619d6525G6420P9694
12430A56114a48666B1316g6027D5565K577a37255K3300D0604h3007c4565j5183
12419d9748j32826i150k63409A25133B6018d0542B15127k5255b30690q2801I2202
12407a7997r3813L3464j62546G7997J57545a67412F3264K01976a60819B1481J25767
12396A47248h5610A40543O8184c8156A24034a21728a2124F4114j9687N2319f7313
12384a37714A06679Q752a76854C64805J88448A72086C629L15623i6642J5190j12852
12373a94304a193j85996b9331I918b28230G4444N733a37275p1577B74546K1793
12362B96339c57338B23605h6287k13934J39594B9843Q2359C0534c98572e7712
$$ y = [373061, 147308, 206515, 286647, 179466, -305307, -130847, -57408, 47619, -46525, 76420, 156114, -148666, 21316, -76027, 45565, 48142, -137255, -113955, 40604, -83007, -34565, -49748, -182574, -9150, -272559, 125133, 26018, -40542, 215127, 189872, -230690, -313491, 92202, -17997, -111810, -78346, -240892, 77997, 235542, -167412, 63264, 265240, -160819, 21481, 147248, -85610, 140543, 208727, -38156, 124034, -121728, -12124, 64114, 44427, 96746, -67313, -137714, 106679, 115431, -176854, 364805, 553253, 172086, 3629, 319252, -96642, -81452, -194304, -1193, -187189, -29331, 9918, -228230, 74444, 80177, -137275, -208852, 274546, 296339, -357338, 223605, -86287, -300221, -160627, 29843, 112202, 30534, -398572, -57712]
12351g0401E7407b34700c3854k14870C90494b24967B85618a85453q2569D5644
12340B02767d09369B69298j18055d7865C5253f6537G4913b70441b0756k06567
12330b27323e7281j48148A66654F7631e2841j8158j89089E2361e34689B80943
12319D6087R7484a45457b4372A77776a51836L6031B97273F3787c49063B3983c7846
12307A04925C5230b505j50166C60508d023m17375C04106d7212F1824c28052C20866
12295a32951C25097a77302D59337b01601d0322j6572D2925c93679A1836d5022
12284A95889q9189M6355a9693j30557B0997l127c914E2183K57926B5392L34321
12273C59713j38417F0756Q3068k9666j2139J89326o3704n2465b04173B57336B5107
$$ y = [-70401, 57407, -234700, -33854, -248724, 390494, -224967, 285618, -185453, -268022, 45644, 202767, -409369, 269298, 151243, -47865, 35253, -66537, 74913, -270441, -20756, -227323, -57281, -205429, 166654, 67631, -52841, -70999, -260088, 52361, -534689, 280943, 46087, 143571, -145457, -24372, 177776, -151836, -115805, 297273, 63787, -349063, 23983, -37846, 104925, 35230, -2505, -152671, 360508, -4023, -421398, 304106, -47212, 61824, -328052, 320866, -132951, 325097, -177302, 459337, -201601, -40322, -56894, 42925, -393679, 11836, -45022, 195889, 106700, 153055, -19693, -150250, 20997, 17870, -3914, 52183, 310109, 25392, 359713, 221296, 60756, 143824, 114158, 102019, 291345, 227641, 175176, -204173, 257336, 25107]
12261a89983a7644A19979D649J62258J5907a37528A83170a07105A2970h8462A18448
12249a47651A87900J68709A08395N9746a9128j09917B26065J32930c0357m113
12239c4470f547B43767a9121h467k1973j48232A79220g5241H652J42661k9038
12228A22275J05925D8538L06930K0918b25691C63120A41978f0711B41607J64767
12218D06374j55856q93E811L87575A78162J25029H7245J67943f1561A83924g026
12206A54039l2867J38011D0765L29649a544C53840D5125L6911L5309L01444F0551
12194C17283b8935A60241k8267R4745l6575p6237R6160h0702B18697G8519K16591
12183B95110c02724B07554a30511A67765i5780B38059K46091A5250J27409a65327
$$ y = [-189983, -17644, 119979, 4649, 166907, 182814, -137528, 183170, -107105, 12970, -88462, 118448, -147651, 187900, 356609, 108395, 168141, -19128, -129045, 226065, 358995, -30357, -34470, -6547, 243767, -19121, -8467, -30440, -178672, 179220, -75241, 8652, 151313, 122275, 228200, 48538, 355468, 376386, -225691, 363120, 141978, -60711, 241607, 406374, 250518, 249625, 5811, 393386, 178162, 303191, 87245, 255188, -61561, 183924, -7026, 154039, 121172, 259183, 40765, 370414, -1544, 353840, 45125, 82036, 117345, 418789, 60551, 317283, -28935, 160241, 131974, 226719, 190144, 113907, 210067, -80702, 218697, 78519, 295110, -302724, 207554, -130511, 167765, -95780, 238059, 484150, 15250, 142659, -165327]
12172e30679C74004j07626b58379d5347J4965C29782j53705G6213J63455a53171
12161B23562a58509A46690L361i8691F4202B247L20679K115a56771H6074j2894
12150G3180A1709b00671B4241K04291K77596d3878D32111p5610I7651K87320a49745
12138A8731K07377f64j44656G0640a16348A58529b3954A69389h3108q0981A6454
12126c3021A00887b83920h4990k29389c0353I9664J12294c30495M7859B09802
12115a51209C0007N8242M9001a96563E9283a8518q663k39905b9764l5929H3930
12103A23565n221h4854A44697a46725M7852L2557k8015b7752r7784G7381a18682
12091f8549D9065b0412A05968b93755Ra46142f8639A98764r2917b22765A35254
$$ y = [-530679, 374004, 266378, -258379, -45347, -30382, 329782, 176077, 76213, 239668, -153171, 223562, -158509, 146690, 150051, -98691, 64202, 2247, 322926, 325041, -156771, 86074, 73180, 11709, -200671, 24241, 228532, 506128, -43878, 432111, 356501, 97651, 384971, -149745, 18731, 226108, -664, -145320, 70640, -116348, 158529, -23954, 169389, -83108, -164089, 16454, -33021, 100887, -283920, -84990, -314379, -30353, 99664, 211958, -330495, -282636, 209802, -151209, 30007, 88249, 137250, -196563, 59283, -18518, -27181, -267086, -29764, -65693, 83930, 123565, 118344, -84854, 144697, -146725, -98873, -66316, -94331, -27752, -125536, 77381, -118682, -68549, 49065, -20412, 105968, -293755, -293746, -146142, -68639, 198764, 105847, -222765, 135254]
12079A96542k5178J7704o2961J09075d5886J6534k3306B32943K35862J28711R12448
12068A509964l22750B65221j03053a63990P152C82342e2118o2144j6932A97109
12057A76930a89463D3535i0090B21867d4622c84l9909I210Q8407K7290a89233
12045A07969J8275D9047a36907d5601H9506k4864a048n307C61600a31756c4486
12033i2854a6893C9091h2782C23509A46402J10961C4766f1705D7522b59487I4199
12021A67106a6250H4280i2497c8702n3037Q99l25641E7772a38069j37629j1469
12010b87167c7958j2453b653C2961g6225E3392O1154J10471c9503k95052B363
11998i1278j71596a10577j70549c7541G7416j8169O4578l2177a85878q869L3468
$$ y = [196542, 171364, 189068, 126107, 235182, -45886, -29352, -52658, 232943, 468805, 597516, 1509964, 1187214, 265221, 162168, -163990, -156838, 382342, -52118, -114262, -131194, 197109, 176930, -189463, 43535, -90090, 221867, -44622, -384, -40293, 9210, 97617, 124907, -189233, 107969, 126244, 49047, -136907, -45601, 89506, 64642, -1048, -6355, 361600, -131756, -34486, -92854, -16893, 39091, -82782, 323509, 146402, 257363, 34766, -61705, 47522, -259487, 94199, 167106, -16250, 84280, -92497, -38702, -91739, -90840, -416481, 57772, -138069, -275698, -287167, -37958, -50411, -2653, 32961, -76225, 53392, 114546, 225017, -39503, -334555, 2363, -91278, -262874, -110577, -281126, -37541, 77416, 59247, 123825, 91648, -185878, -194747, -161279]
11987a61279M8032A58029n5814f4455j36153j32673P7673A00402J9568C3305a012
11975G1948O991J40964A01040i8814G4675j0064b12707C2397i2896L1323A73460
11963B67527d8184j47771A9544c8419H1467a23179M8829j7782j36256f1772D3294
11951H0288J2303q114d1906I7171M7666a7655k03098a7305E073e5222o8475C23487
11938c31647e9800n7167j63725e8196A97500D9194f6926j00329C9057c47934J63396
11927a84538D34136I8949J4376a96370B96760A16481e9248j3437B29592b10699
11916A06702a85936m3717K9082A853g619B33621E1827a4812B43240L9252l2197
11905B50295G3021J7910C8865c5239j99458H8449b62122A21325b8403A6027c35340
$$ y = [-161279, -113247, 158029, 102215, -64455, -200608, -333281, -255608, 100402, 119970, 33305, -1012, 71948, 78939, 219903, 101040, -98814, 74675, 64611, -212707, 32397, -92896, -61573, 173460, 267527, -48184, -195955, 19544, -38419, 81467, -123179, -74350, -92132, -228388, -61772, 43294, 80288, 92591, 84477, -41906, 97171, 144837, -17655, -220753, -17305, 5073, -55222, -123697, 323487, -331647, -59800, -116967, -280692, -58196, 197500, 49194, -66926, -167255, 39057, -347934, -184538, 434136, 98949, 113325, -196370, 296760, 116481, -59248, -72685, 229592, -210699, 106702, -185936, -229653, -200571, 1853, -7619, 233621, 51827, -14812, 243240, 282492, 250295, 73021, 90931, 38865, -35239, -234697, 88449, -262122, 121325, -28403, 16027, -335340]
11893a02651I9699a54236H46P7741a60583b7243I786R0282g400E3191b01227P2803
11881a28424L6067A1210P2178B6599J19206b29412F7502G790a06959j60465E0479
11869a00626M2526j27673K9027j02036A00335J9306g1810k49432A11600O862a27392
11857h0293j7169L1927J9711D2190a56455P1706k04337P2573G0214i8871A04512
11845d1209D7229a94885l6681G5202b4146D1848f3930A11841L09144A44397D049
11833i5100k75743i499E906K3640f7744E7906J27368K6409b7528l698p3299f760
11820A54550F1863k3896f2244o8195A21578E5612j6917E976K10583a50275p460
11809a57735A31562a54227M0328A51240b8808m6597j88866B36533a43323f2432
$$ y = [-102651, 99699, -154236, 846, 78587, -160583, -27243, 9786, 100068, -7400, 53191, -201227, -128424, -92357, 11210, 83388, 26599, 145805, -229412, 67502, 7790, -106959, -267424, 50479, -100626, -58100, -185773, -156746, -258782, 100335, 119641, -71810, -321242, 111600, 118462, -127392, -80293, -97462, -65535, -45824, 42190, -156455, -84749, -289086, -216513, 70214, -98871, 104512, -41209, 47229, -194885, -231566, 75202, -24146, 41848, -63930, 111841, 420985, 144397, 4049, -95100, -370843, -9499, 5906, 29546, -67744, 57906, 185274, 211683, -27528, -31226, -104525, -6760, 154550, 61863, 37967, -62244, -130439, 121578, 55612, 38695, 5976, 216559, -150275, -157735, 131562, -154227, -113899, 151240, -28808, -75405, -264271, 236533, -143323, -62432]
11798a22332r5098O1962B0230a73323D2039K500b05915h3441D43612e4986m2038
11787i7024J4217A2464b64326D1391R3782k2514E4028c25377C2215N4669a39896
11775a80224G346M782Q1326g4511A93534c08041A19950R6621j03989p077L8524
11764A44029f8447j2937k59551d5264A36870P8095G3635j3730M5994i5887A75289
11752A43833a63542N0542A59565A7627a7040j91491c4726m3363A54076P963a17493
11740C34581A8175c8833I841J45068k4590a27270j26272f6946B06322h3383A6869
11728C13053e1145m63815C34471a72350H2980j6805c9274j1503G8515K7804a63402
11716a58594A00564J9808J11173a58834O0385B3992d8666j58777B67862b6394
$$ y = [-122332, -217430, -155468, 20230, -173323, 42039, 44539, -205915, -83441, 443612, -54986, -97024, -82807, 12464, -264326, 41391, 135173, 112659, 54028, -325377, 32215, 86884, -139896, -180224, 7346, 12128, 93454, -74511, 193534, -308041, 119950, 216571, 112582, 105505, 144029, -68447, -81384, -340935, -45264, 136870, 214965, 73635, 59905, 105899, -95887, 175289, 143833, -163542, -113000, 159565, 17627, -17040, -208531, -34726, -78089, 154076, 162039, -117493, 334581, 18175, -38833, 9841, 154909, 130319, -127270, -253542, -66946, 206322, -83383, 16869, 313053, -51145, -514960, 334471, -172350, 82980, 66175, -39274, -50777, 78515, 106319, -163402, -158594, 100564, 120372, 231545, -158834, -98449, 23992, -48666, -207443, 267862, -26394]
11705a89504C45407f0684B27131m9922b70079K1873J0443L5064A40653C9095f106
11693E2964A6198O7486g3270E0829J5195B0070N9623J951a93873g8422A35497
11681A98919J359E4615k5159J7238J05662o0994a11221C4937a10017A14569K17586
11670C32155A06087a19895j22134C34871C1402j965K6895A6436K35566h9458i604
11658b114j70502C261O0156m08m006B7036m558O0979A9870M6909J90382a98560
11645a09101A76020c5798A610a22907C79147A60452h4512B54047a0478j65928
11635a76406B06686b9993A53048l2107n6153f3666A67766N8785p2746b11586C34567
11623a2966A38620j3465D5094M9279K20214D0316c4863H4150d00477f0662j18504
$$ y = [-189504, 345407, -60684, 227131, 177209, -270079, -248206, -237763, -202699, 140653, 39095, -6106, 52964, 16198, 83684, -73270, 50829, 66024, 20070, 79693, 81644, -193873, -78422, 135497, 198919, 200278, 54615, 29456, 46694, 152356, 91362, -111221, 34937, -110017, 114569, 332155, 106087, -119895, -242029, 334871, 31402, 29437, 56332, 16436, 252002, -89458, -9604, -2114, -172616, 3261, 63417, 63009, 59003, 27036, 22478, 83457, 19870, 66779, 257161, -198560, -109101, 176020, -35798, 1610, -122907, 379147, 160452, -84512, 254047, -10478, -176406, 206686, -29993, 153048, 120941, 64788, -63666, 167766, 226551, 153805, -211586, 334567, -12966, 138620, 125155, 45094, 94373, 314587, 40316, -34863, 84150, -400477, -60662, -179166]
11612a79166O6325A51420N6111a10250B00349o783h7289A43961J26344j223A30661
11600e3618l90539K14417D867J61880M8567b97639A88986H2658K28783a17410
11589i8284M0447H2847K01270A41014M187J15982A29966J5908j3108F4105h9385
11577b15481K5938C4952L44885A1527K03199o0606J05418A05933b4859h566r0165
11566i8731I3304c5687B48471C5163h5617m1956E03414a15353m8906B68932I052
11554F2095a672j74195B5415J66797q0293B8376K38901I3156A5546g3132A84280
11542H9402e1198H6940R6915J87311b03900d7327E0038K982J688J40336H4248
11530A74071G0179J73088Q9071A25687P5641a12622a9640A31747b0408q6561r7887
$$ y = [-179166, -112841, 151420, 207531, -110250, 200349, 193566, -87289, 143961, 270305, 269082, 130661, -53618, -444157, -229740, 4867, 166747, 215314, -297639, 188986, 82658, 311441, -117410, -98284, -57837, 82847, 284117, 141014, 145201, 261183, 129966, 145874, 132766, 64105, -89385, -215481, -189543, 34952, 379837, 11527, 214726, 154120, 259538, 105933, -24859, -8566, -98731, 93304, -35687, 248471, 35163, -85617, -127573, 503414, -115353, -164259, 268932, 9052, 62095, -1672, -175867, 25415, 192212, 111919, 28376, 267277, 93156, 15546, -73132, 184280, 89402, -51198, 86940, 183855, 371166, -203900, -47327, 50038, 53020, 54708, 195044, 84248, 174071, 70179, 243267, 332338, 125687, 201328, -112622, -19640, 131747, -20408, -106969, -204856]
11519b04856C36746p7472r7012K0238c9754H5157a99078A30099B2067a3625B12399
11507a40885A15793J60973K50848k48887O5210b14258b5456B82127j09730J12854
11497B85251F7731L51493A5990N8993a18285G5551O1082o1170a85651C1821K5959
11486E7780J18716b0203B47192R8926r4557J45954a0770C49196D9147J14484a48856
11474b7138B23976a10970A54374J62796n5101q5886K6434I3500P8415F6820a37819
11462E3093L283i4973A50025J61856j38679c4802A59430o2910B787M7247j6920
11451C3114K31776j08389m4638b60833I9531a00236B75242G6607a46923H8389
11440A28942J7377B9612K8050e9689E2219d3966q8476H409J13515b7594A46806
$$ y = [-204856, 336746, 259274, 162262, 182500, -39754, 85157, -199078, 130099, 22067, -13625, 212399, -140885, 115793, 276766, 527614, 278727, 343937, -214258, -25456, 282127, 172397, 285251, 67731, 419224, 15990, 74983, -118285, 75551, 136633, 75463, -185651, 31821, 57780, 176496, -20203, 247192, 346118, 251561, 397515, -10770, 349196, 49147, 163631, -148856, -27138, 223976, -110970, 154374, 317170, 262069, 176183, 202617, 93500, 171915, 66820, -137819, 53093, 56376, -94973, 150025, 311881, 173202, -34802, 159430, 96520, 2787, 50034, 33114, 264890, 156501, 111863, -260833, 99531, -100236, 275242, 76607, -146923, 88389, 128942, 146319, 29612, 57662, -59689, 52219, -43966, -132442, 8409, 121924, -27594, 146806]
11428A9760b70698e1834A27447h422r7067A73352f9692p8335g1630A23086i054
11416B469f4041r853A42392K50056F1614k4917N082i5840o9460B17427m2729A2455
11403B95056A27785J11052I9482l625J93672f1133J3433B04433E3751N4936m6413
11392F2274c0768A89379a69967F0074N3381D4879b56351B90659b0965E9930N9829
11381A19759J05799a04393k84978A08111k7561j3109d6518k0882A02448N7860
11371A60308L1419o9464i0214C5024a19453e3960A27337D955Q740b29849o0218
11360b90067G2153I98a85179O5848B27749a08122B4346b55207M9948d5333p6220
11349a21553n3465A10219k6578b26188h6530A00168m6388k1231a6386A93980m7434
$$ y = [19760, -270698, -51834, 127447, -8422, -105489, 173352, -69692, -148027, -71630, 123086, -9054, 2469, -64041, -73894, 142392, 392448, 61614, 36697, 41779, -95840, -165300, 217427, 174698, 12455, 295056, 127785, 238837, 99482, 95857, 289529, -61133, -47700, 204433, 53751, 108687, 62274, -30768, 189379, -169967, 60074, 113455, 44879, -256351, 290659, -20965, 59930, 119759, 225558, -104393, -389371, 108111, 80550, 67441, -46518, -67400, 102448, 160308, 191727, 122263, -90214, 35024, -119453, -53960, 127337, 4955, 13695, -229849, -290067, 72153, 998, -185179, -119331, 227749, -108122, 24346, -255207, -205259, -45333, -121553, -175018, 110219, 83641, -226188, -86530, 100168, 53780, 32549, -16386, 193980, 146546]
11338A46546a70467F3375K07858c26856a7998k42532C51825F549L0022f5333H874
11326a0262c803j67564A47196A6044L7181a23821m3578J9178A49813a0517j38814
11315a49331D7268A9241b09925e5846d355l21041A162f8825k7554k70749b1161
11303b18322A50444a34732O4500k29779i5983K334B67051r7902c74568p4822A50204
11291H1088a63947l637j4936d7624m3719m1591o4757j0919a6145C11237f9062
11279A09886n0571a29519q5904a6013A28431a47487l762A1734b63225a27336d3909
11267F5042K85735A64820e8280j6001J6057j70817A49031a68875Q873e0247r7194
11256a47441C01716a14659k32569f3657j8139J5478k68464e0798p1818m1709I5317
$$ y = [146546, -170467, 63375, 271233, -326856, -17998, -260530, 351825, 6549, 36571, -65333, 8874, -10262, -3803, -171367, 147196, 16044, 53225, -123821, -167399, -148221, 149813, -10517, -149331, 47268, 19241, -209925, -55846, -4355, -325396, 1162, -68825, -96379, -367128, -21161, -218322, 150444, -134732, -70232, -300011, -95983, -93649, 267051, 169149, -374568, -449390, 150204, 81088, -163947, -167584, -182520, -47624, -91343, -132934, -197691, -208610, -16145, 311237, -69062, 109886, 59315, -129519, -215423, -16013, 128431, -147487, -151249, 11734, -263225, -127336, -43909, 65042, 350777, 164820, -58280, -74281, -58224, -229041, 149031, -168875, -160002, -50247, -147441, 301716, -114659, -347228, -63657, -81796, -66318, -334782, -50798, -122616, -164325, 95317]
11244a25883a9285K169A19590J89979c64366J59668K415h547j3334A13469h1241
11232A873i7871j35663B3271i0393k31690A62297c02499R1417h2464j55101b4932
11220a76836C67166c25553F559b24905A44856f7451A3236a74779B37361a01431
11209h6159A42048P517J41477i2092q3970L4952q3350F6967a60865A27259D4696
11197B68479d7994k3446B02256b2726C8027A6023b47161A5573J29869j3923a05126
11185a69413k45721A77013b2317G9508b81289c0898J3962j5683j14205F2741c19293
11173c964B4994a95075f7770B93958l9071e8372p815B64585d6729k13935M9929
11162b10735g0016p167b1729B66229a29870j5757l17032a8782k48471E804i4950
$$ y = [-125883, -19285, -17116, 119590, 309569, -364366, -204698, -202283, -8547, -21881, 113469, -81241, 1873, -97871, -233534, 23271, -90393, -322083, 162297, -302499, -211082, -82464, -237565, -24932, -176836, 367166, -325553, 6559, -224905, 144856, -67451, 13236, -174779, 237361, -101431, -86159, 142048, 149565, 291042, -92092, -176062, -141110, -224460, 66967, -160865, 127259, 44696, 268479, -47994, -71440, 202256, -22726, 38027, 16023, -247161, 15573, 145442, 131519, -105126, -169413, -415134, 177013, -22317, 79508, -281289, -30898, -16936, -32619, -146824, 62741, -319293, -3964, 24994, -195075, -67770, 293958, 254887, -58372, -66187, 264585, -46729, -260664, -210735, -70016, -77183, -21729, 266229, -129870, -145627, -462659, -18782, -267253, 5804, -94950]
11150a91630G636f0499A01556J02908j7541a47496a3257A54895d3213J5936p0347
11139i7624b2816k39999F3305a24591A1175h9687p1355B248e8559B40396A11674
11127b18283Q9002F0426g7832A5059N7922K58523A22245k809B7143J37115K03309
11116C67567j56182f3972l25514B00342k6923a35563A80130a02698A82976H0173
11105B18044r1058Q2910H1429J77211c0083A30109d6402B66618L1254p5304I1054
11093A54028k1729J49032L68043j48782r5358j28147n9171j4116K11641E9343
11082D79537A95775C6237a3716E7735M15260a50673B89101A41421M3824a06742
11071B65181H6628J12215K95459r5954L1785L9226j60486j9449K5908K23958M5204
$$ y = [-191630, 7636, -60499, 101556, 204464, 186923, -147496, -13257, 154895, -43213, -27277, -97624, -22816, -262815, 63305, -124591, 11175, -89687, -161042, 2248, -58559, 240396, 111674, -218283, -129281, 60426, -77832, 15059, 72981, 331504, 122245, 119436, 27143, 164258, 367567, 211385, -63972, -389486, 200342, 173419, -135563, 180130, -102698, 182976, 80173, 218044, 126986, 209896, 81429, 258640, -30083, 130109, -46402, 266618, 297872, 222568, 91054, 154028, 132299, 281331, 649374, 500592, 405234, 277087, 217916, 203800, 415441, 59343, 479537, 195775, 36237, -13716, 57735, 472995, -150673, 289101, 141421, 185245, -106742, 265181, 86628, 198843, 494302, 398348, 430133, 469359, 308873, 289424, 315332, 539290, 584494]
11060E84494j49368L05604C35082K82516m1588k65169O10455D02717j1730J97115
11050E88102J02470j36429k37509L73989j3808j88470M1804P7962K92034j69604
11040G30541K35722C78547J07883M65766m70143M39K64873G0771N76929j98191
11030D49509J92408p5997K12905j0523k98746J30347K06781j18376o3484P65O1570
11019F87159O6544j49283q7705r6629J74883L0565K01370p4266J53091l27844
11009E77885K86481C64201K77659J51550j68921J51602j05974Q3172l6161K4851
10999G41979r2214P4970o1230L78009m10622J4755J8187q9699L50234j66921l5106
10988G22342L22035K1135k00487j9611l1712L21984n4873j4709L35585J03296
$$ y = [584494, 435126, 740730, 335082, 617598, 576010, 310841, 921296, 402717, 390987, 588102, 690572, 554143, 316634, 690623, 676815, 488345, 530149, 608111, 900145, 730541, 966263, 378547, 486430, 952196, 482053, 482492, 747365, 70771, 647700, 449509, 641917, 565920, 778825, 768302, 469556, 599903, 806684, 688308, 624824, 625589, 687159, 753703, 604420, 516715, 420086, 594969, 625534, 826904, 752638, 905729, 577885, 864366, 364201, 641860, 793410, 624489, 776091, 670117, 753289, 717128, 741979, 649765, 724735, 663505, 1041514, 630892, 645647, 663834, 574135, 924369, 757448, 722342, 1044377, 1065512, 865025, 845414, 813702, 1135686, 1080813, 1066104, 1401689, 1504985]
10978A504985n5824O2383M6912M58480K34923J56003K09340k54529K85824k3937
10968B624560m13174J52946l05575j07954j72099K6419l28350J63726k12456K31222
10958A659265M5476j40284q0051L18764q0062l02141l38825k40289J32432k44048
10948G30237m8096j74111J94493C10739R4107b32749C55377D9996L21112A05164
10937B11896p2218J57323j21974p30h4241e634p9016G2083K21452n3438F0961
10925A43533F751g7740A62383n4681J8530M3966b7004C02362M4099a66759j9392
10914a86151k2389J912G6465a83946j7167B4675b37604A65723a42605c0236J2849
10903a7387n8473E9981Q7927O0475d902B78618b17573A22915b81930a13967j5237
$$ y = [1504985, 1449161, 1511544, 1558456, 2016936, 2251859, 2407862, 2617202, 2362673, 2648497, 2624560, 2211386, 2364332, 2058757, 1950803, 1778704, 1805123, 1476773, 1640499, 1428043, 1659265, 1704741, 1564457, 1484406, 1803170, 1723108, 1420967, 1082142, 841853, 974285, 730237, 682141, 508030, 702523, 310739, 404846, -232749, 355377, 49996, 371108, 105164, 211896, 139678, 297001, 175027, 174297, -84241, -5634, -84650, 72083, 293535, 240097, 60961, 143533, 6751, -77740, 162383, 107702, 126232, 170198, -27004, 302362, 346461, -166759, -186151, -208540, -206628, 76465, -183946, -201113, 24675, -237604, 165723, -142605, -30236, -17387, -75860, 59981, 147908, 208383, -4902, 278618, -217573, 122915, -281930, -113967, -129204]
10892a29204n1124j19195e1056q6826j703H3662K496f9477D3719a29273r4824
10881b24097d3040j39126A91057A3613g6566K7641G8617L9263d0047J8479D7632
10869A7814P551b71301J34539B23479A450a37998a3781A79677a97795I0490c08603
10857i2362m4680e8736l4324B82239I0942B1703R8501a8616k81246a45768F7024
10845C31828D0289c02923A91645A3142M2280b05783C01721A49222R7107a13357
10834d1224A55020l915f5929B14184b27139A02602O2988J04337e7909b1656j20937
10823a42593K3779m47341g7035A45057B5422b00004A55428D5976a89999K7336
10813a62663O2779l921n2290m9902b9216H125f77j8487A82227D3441J82496B9029
$$ y = [-129204, -180328, -299523, -51056, -137882, -139585, 83662, 86158, -69477, 43719, -129273, -224097, -43040, -182166, 191057, 13613, -76566, -48925, 78617, 117880, -40047, -21568, 47632, 17814, 25365, -271301, -136762, 223479, 1450, -137998, -13781, 179677, -197795, 90490, -308603, -92362, -137042, -58736, -93060, 282239, 90942, 21703, 120204, -18616, -299862, -145768, 67024, 331828, 40289, -302923, 191645, 13142, 55422, -205783, 301721, 149222, 246329, -113357, -41224, 155020, 151105, -65929, 214184, -227139, 102602, 165590, 269927, -57909, -21656, -142593, -118814, -566155, -77035, 145057, 25422, -200004, 155428, 45976, -189999, -162663, -99884, -103805, -156095, -205997, -29216, 8125, -677, -19164, 182227, 43441, 225937, 29029]
10800b29301A92392m5881a81542O6575m2599k5583A95573f7401l97734a59035
10789C7173c77192B5406J10424c04119J46334O5577H4582c18969a41137j04665
10779b45802e4229J3828j01277r0862a09633j37133D7677b15690B40515r4261
10769A46254A6564a91102b0422I2405J3340J29070B0482b03326l29714A45344
10758d2566m1674B43710a60361K7284k44232g6681B22626J7503D1129K26148a1595
10746C23a81801I9728a97412p98C0384J28608F4737N7659c40948J38253H6474
10734A01673a26923e4836m6312m4947j78949A69708i8468J0277E0033b8691j28673
10723a57364F2068b11283e7753p1105b204A39971Q1231A6981L94685A31232m473
$$ y = [-229301, 192392, 146511, -181542, -114967, -157566, -183149, 195573, -67401, -465135, -159035, 37173, -377192, 25406, 135830, -304119, -157785, -92208, 84582, -318969, -141137, -245802, -54229, -40401, -141678, -232540, -109633, -246766, 47677, -215690, 240515, 146254, 16564, -191102, -20422, 92405, 105745, 234815, 20482, -203326, -533040, 145344, -42566, -84240, 243710, -160361, -133077, -377309, -76681, 222626, 240129, 41129, 267277, -11595, 323, -181801, 99728, -197412, -198210, 30384, 158992, 64737, 122396, -340948, -202695, 86474, 101673, -126923, -54836, -101148, -146095, -325044, 169708, -98468, -88191, 50033, -28691, -157364, 62068, -211283, -57753, -128858, -2204, 139971, 221202, 16981, 411666, 131232, 126759]
10712A26759a4121o1278p738A2440Q5355a5217j8659A6863M9727a22501A25473
10700a3333p747j23900F9520J89522a74550d7585E0016c66602A6271Q6605b05420
10688G7059a45223B2391K53470g7363j26576M3762P8185d081A17288N3050o9097
10677A01241m7161B4257b0857k15740B74830E3838b81866I8865b3825j69874P8550
10666a15149o8327A45499L3338n6440c5679D9865a62933b2739q8607B2586J21268
10655A43854b6322H1325k5054a46130m7j5196D3941h6464k10044a4103A27724
10643A62912c22414L0020I9286K7485P3732C5616e7585m387D4173J75880a90955
10631b07711K9806B96548a75597h0549F1511k9364b73618A5518a06001k19104
$$ y = [126759, -14121, -75399, -83137, 12440, 97795, -15217, -33876, 16863, 66590, -122501, 125473, -13333, -21080, -144980, 69520, 259042, -174550, -47585, 50016, -366602, 16271, 102876, -205420, 77059, -145223, 22391, 275861, -77363, -203939, -160177, -81992, -4081, 117288, 170338, 101241, 54080, 24257, -20857, -236597, 274830, 53838, -281866, 98865, -23825, -193699, -115149, -183476, 145499, 178837, 122397, -35679, 49865, -162933, -22739, -111346, 22586, 143854, -26322, 81325, 56271, -146130, -146177, -161373, 43941, -86464, -296508, -14103, 127724, 162912, -322414, -292394, 99286, 126771, 200503, 35616, -57585, -61972, 44173, 220053, -190955, -207711, -177905, 296548, -175597, -80549, 61511, 32147, -273618, 15518, -106001, -325105]
10621c25105D7860c566k17790f1652b4519G7906J16776f3098a4863A84611H6430
10609c10226B27582a9742k40736A4342c1903j12195k3893A66401b51714m1144
10599b92858i3788d2692D15417b14902j56455g9818o1084A33567a34837I773b85710
10587d0344j0596B73470b07022j43320e4293n751j18324D9068g0163l587j37953
10576b11703A23422a22598d9265F7321J08497a27045D37627H3868a29232j4557
10566a43789C0625a94593B02017a47088J5547H9917b06433E348a05800A78563
10555c95411a08403A7915e3532A4818K21602A15798b44126A42173b68200A39558
10544e0290k1095d317A60423G5323a58201A48567c06725D4217J90384a74877J1837
$$ y = [-325105, 47860, -3566, -221356, -61652, -24519, 77906, 194682, -63098, -14863, 184611, 86430, -310226, 227582, -19742, -260478, 14342, -31903, -144098, -167991, 166401, -251714, -292858, -93788, -42692, 415417, -214902, -371357, -79818, -140902, 133567, -134837, 9773, -285710, -40344, -50940, 273470, -207022, -350342, -54293, -60044, -178368, 49068, -70163, -73750, -211703, 123422, -122598, -49265, 67321, 175818, -127045, 437627, 83868, -129232, -143789, 30625, -194593, 202017, -147088, -131541, 89917, -206433, 5348, -105800, 178563, -395411, -108403, 17915, -53532, 14818, 236420, 115798, -244126, 142173, -268200, 139558, -50290, -71385, -4317, 160423, 75323, -158201, 148567, -306725, 44217, 234601, -174877, -163040]
10533a63040F5628c77987D3978b47095H9119f720F9146a55567A45039i9265A10505
10521E1005E853d6216B9884J84437j02513c81388B35782a25440e8312B81875a20629
10509A04455C0545c37940E1585d2919k42640A3897a36354B36214O5016f8718A01908
10497A13782a36005j12032c1527Q825m9394j64611A96449h8836r3958A31529k1030
10486A10499a30937C9251J3580c099B23566K27801J46849j27019j64008l6353
10476B70836J11392A4996Q246a66919B61297a10869B85861F559a00985d5554G9211
10464B38936F6542f7081j8298H8450J25195f4463A59981m1038k9382A35K2339
10453B2474K0870c96822G2290h3280F4925k661b17304P2505F815c03337B8812
$$ y = [-163040, 65628, -377987, 43978, -247095, 89119, -6720, 69146, -155567, 145039, -99265, 110505, 51005, 5853, -46216, 29884, 214321, 111808, -381388, 235782, -125440, -58312, 281875, -120629, 104455, 30545, -337940, 51585, -42919, -285559, 13897, -136354, 236214, 301230, -68718, 101908, 113782, -136005, -248037, -31527, -22702, -72096, -236707, 196449, -88836, -182794, 131529, 110499, -130937, 39251, 52831, -3099, 223566, 451367, 598216, 471197, 307189, 270836, 382228, 14996, 23242, -166919, 261297, -110869, 285861, 6559, -100985, -45554, 79211, 238936, 66542, -67081, -85379, 88450, 213645, -64463, 159981, 118943, 89561, 135, 22474, 43344, -396822, 72290, -83280, 64925, 62264, -217304, -144799, 6815, -303337, 28812]
10441b65614A37607a58753f8880j48363O5503C04387a34362j32074l1790H7862
10430b6969G2363N4361b07653B478J27987a539B22239E591h9738E1121o5i3024
10417A25161a95792B7143a20673I6102a53290f2355k33643g1302P311B25385e7840
10405c36854j5737c0609J3418j30646K0146H64J70138f9466A38086f7543A38536
10393F7531J6373d73230d4527F617J21771j2623a35347C257Q0547K30327p4268
10382B39863c86689a77912A70987J31136b71044F0778J0731L51050j56981K3333
10372B88911l1254J58868J37243A50359N04423k56212p9299J35994A73794J333
10362A75127J83031F0980M63244k20592J14308j79393R7204F6871k222O3693K7693
$$ y = [-265614, 137607, -158753, -68880, -217243, -151740, 304387, -134362, -266436, -298226, 87862, -26969, 72363, 126724, -207653, 2478, 130465, -1539, 222239, 5591, -89738, 51121, 51056, -93024, 125161, -195792, 27143, -120673, 96102, -153290, -62355, -295998, -71302, -63991, 225385, -57840, -336854, -352591, -30609, -17191, -147837, -127691, 864, 171002, -69466, 138086, -67543, 138536, 67531, 83904, -473230, -44527, 6617, 128388, 115765, -135347, 3257, 83804, 314131, 239863, -386689, -177912, 170987, 302123, -271044, 60778, 71509, 422559, 265578, 288911, 257657, 416525, 553768, 150359, 654782, 398570, 319271, 455265, 173794, 175127, 358158, 60980, 524224, 303632, 417940, 238547, 335751, 66871, 64649, 128342, 156035]
10351A56035K35605M1135m8735n1850j0700J75519j6138m4589p7855J1255l0800
10340C38882a43198I7282a50462B11219L29871k34514F1003a32247A4933K19728
10330B34661a24584l2762k0292B58904c24952B78209I0905L28011j66734r800
10320B42382n1325R7077F9314K91869a05748C03116F5484L46016b46190C32561
10309I5224j5143c99268b8408F0494i6741B06103D2475M4715b90323a23866A22054
10297b9723o5881G0565J30275a08569A33764J68286b82978A34102C6061b19646
10286a26583P228B1484a50572E6187g000A41083b34579J15557A4848f0186K5688
10275c4498A80545f1223j05304m5880B08586H2446L265L9834L01275A39679k55
$$ y = [156035, 391640, 432775, 384040, 332190, 321490, 497009, 480871, 436282, 358427, 369682, 338882, -143198, 97282, -150462, 211219, 541090, 306576, 61003, -132247, 14933, 234661, -124584, -157346, -177638, 258904, -324952, 278209, 90905, 418916, 252182, 242382, 191057, 288134, 69314, 361183, -105748, 303116, 65484, 411500, -246190, 332561, 95224, 80081, -399268, -28408, 60494, -96741, 206103, 42475, 87190, -290323, -123866, 122054, -29723, -95604, 70565, 200840, -108569, 133764, 302050, -282978, 134102, 36061, -219646, -126583, -119355, 21484, -150572, 56187, -7000, 141083, -234579, -119022, 14848, -60186, -34498, 180545, -61223, -166527, -212407, 208586, 82446, 85711, 125545, 426820, 139679, 139424]
10264A39424B5954J88525k6906J09637C9202L06889l4025K0763p1216A18689b68129
10252A81924a38604j00988p8508A10869m8627c48825a71557k5848c7992r3618
10242a31610k1889f0704j33359j9192H52J38153n81J09134A0387a65438o2998
10231b28436c995p6463L1341B311N244a89976e0271A3723b30559D5486b91223
10219g4190A03968b49362a22098j91960a8969j98482e1549G2009R392J46678N3601
10208B81680a40331p2165B48990b59301J04118A09968i2412j02054D34623b4806
10197A05413b3140H7645p936a69168j47208K4472a1079G9773N9455b04510M3392
10186a61118I3686a36141B5568c06759L7552A28915K17214a00783r333C2462M7230
$$ y = [139424, 25954, 214479, 187573, 297210, 39202, 346091, 312066, 332829, 261613, 118689, -268129, 181924, -138604, -239592, -318100, 110869, 62242, -348825, -171557, -197405, -37992, -131610, -153499, -60704, -194063, -213255, 852, 139005, 138424, 247558, 10387, -165438, -228436, -3995, -80458, -49117, 2311, 7555, -189976, -50271, 13723, -230559, 45486, -291223, -74190, 103968, -249362, -122098, -314058, -18969, -217451, -51549, 72009, 81401, 228079, 281680, -140331, -212496, 248990, -259301, -155183, 109968, -92412, -194466, 434623, -24806, 105413, -23140, 87645, 79709, -169168, -316376, -291904, -11079, 79773, 139228, -204510, -161118, 93686, -136141, 25568, -306759, -269207, 128915, 346129, -100783, -110116, 32462, 79692]
10175G9692b97168c0329E9902a28148l61347b6131j41575j30479C66136e5091
10164b61558A59338F7084J72770b25527j0298h4572J912j67439N3431O3715c0008
10152A12831a95845B4447h7604l1138H5415g1393H9688k2801a62595H4257k8235
10141E6022C386c06475e0841I5999b45022J12853H1886a46683j38182a4956m6008
10130f0964A52069a49638P2124j42912P6962A19512M1804C5127b47300a1476o9556
10119h1032A24581N6801b49642b7139q4021B2110a3849C9442f0004k81297i7433
10107f354G4073a36915o1111M2589A78573d2690C23942C959M8058a43617D7623
10095b13372A46495a69888a5346A40836n3418a9387I3798j1464A5760J0387a64728
$$ y = [79692, -297168, -30329, 59902, -128148, -489495, -26131, -167706, -298185, 366136, -55091, -261558, 159338, 67084, 239854, -225527, -235825, -84572, -82660, -250099, -196668, -132953, -30008, 112831, -195845, 24447, -87604, -118742, 85415, -71393, 89688, 66887, -162595, 84257, 56022, 3386, -306475, -50841, 95999, -245022, -132169, 81886, -146683, -284865, -14956, -60964, 152069, -149638, -77514, -220426, -143464, 119512, 161316, 35127, -247300, -11476, -81032, 124581, 181382, -249642, -27139, -111160, 22110, -13849, 39442, -60004, -341301, -97433, -6354, 74073, -136915, -198026, -155437, 178573, -42690, 323942, 3959, 52017, -143617, 47623, -213372, 146495, -169888, -15346, 140836, 87418, -19387, 93798, 82334, 15760, 26147, -164728]
10083f7018o6518j26921B05139a38293j21354k01237A11107c28139D55247a94270
10072a59755q5699a16610B54250h6903l98753K18937A96145h8889I3600C4451
10061A03161f740j44678B0832Q3089K2251K01680E5439M8879l506C1780a75741
10049A05207b11294M3191j51715b0469j82463D7211J16245a93191B7742a42293
10038a07676o6622D7017g914o6396A50287c04818A21402c22928B8026a0042E8375
10026A51817J33886G468b05565C3374d37529a31743a3724b118m3271k32425c8969
10014b20166B7018f5887l38092J98259a2990j538k197j01487A71621d7011A1919
10002c76758B00126A0805d0445j99165a9092A88084d57838B08200I910a49214
$$ y = [-67018, -133536, -260457, 205139, -138293, -259647, -460884, 111107, -328139, 455247, -194270, -159755, -245454, -116610, 254250, -86903, -485656, -266719, 196145, -88889, 93600, 34451, 103161, -6740, -151418, 20832, 103921, 126172, 327852, 55439, 104318, 100812, 31780, -175741, 105207, -211294, -168103, -319818, -20469, -202932, 47211, 163456, -193191, 27742, -142293, -107676, -174298, 47017, -7914, -74310, 150287, -304818, 121402, -322928, 28026, -10042, 58375, 151817, 285703, 7468, -205565, 33374, -437529, -131743, -13724, -2118, -45389, -277814, -38969, -220166, 27018, -65887, -403979, -205720, -12990, -14528, -16725, -118212, 171621, -47011, 11919, -376758, 200126, 10805, -40445, -239610, -19092, 188084, -457838, 208200, 9910, -149214]
9991A36048f1777j19502q918q7686J23829A74026a96039A11992b10920F3433b64685
9979A6500P2828l7836a11479m5162o5260A246a27606j1059F5377h6763k14346
9968c01109A07514i8823k51886N4098R7134L0816g4144G1030c12968C5040a13766
9956a43989B48161I1369a36356E0981J70505b14670j2058F3030f871j29273c8999
9944a45205d7858k05664a26592n3503j59495A243J5996f7728C17123B5295d6670
9932a14067C3836G071J88604a44090d8089j26443A2832c85153h3034A9803i4376
9920a03398F7481J93746o1770b64400d5870r2573I7578M8565c25562J24043f0112
9908E7633a181k36311f7934E7562a44090f9795k0445k60360A53398d23855a52917
$$ y = [136048, -61777, -181279, -190197, -277883, -154054, 174026, -196039, 111992, -210920, 63433, -264685, 16500, 89328, 51492, -111479, -156641, -221901, 1246, -127606, -138665, 65377, -86763, -301109, 107514, -98823, -350709, -296611, -199477, -168661, -74144, 71030, -312968, 35040, -113766, -143989, 248161, 91369, -136356, 50981, 221486, -214670, -226728, 63030, -6871, -136144, -38999, -145205, -47858, -253522, -126592, -180095, -339590, 1243, 17239, -67728, 317123, 25295, -46670, -114067, 33836, 7071, 195675, -144090, -48089, -174532, 12832, -385153, -83034, 19803, -94376, -103398, 67481, 261227, 199457, -264400, -45870, -138443, 97578, 146143, -325562, -201519, -60112, 57633, -1181, -237492, -67934, 57562, -144090, -69795, -90240, -350600, 153398, -423855, -152917]
9896c49890D8795K37168l9728a18968j17579R1602E4000K6585P0554l9811k370
9885A08958g2084p8438K5707j29309b0936m21936a97838J9504j15756j03286E2667
9873g7057C27151d94146A23654a17347A36633d1703p7942j35052m1629H1160c9440
9861a18436N7261k50687g0093k144j04326C22014c51189J29549I0099c4983F9659
9849a76009j69724b6188j73074N9303B0322a1078D42230c6907A04328b59856a09884
9837A64083b22387G476M2935b2952G4487J2221c20014a58069b2989F6504C0332
9825C67301j41383c65520D8836e9123j3320l4670p5700j37336j0263B30552D9777
9813b16784h7962C43379A5020P9950g0111p4093j62845a05506L3916q7553c8917
$$ y = [-349890, 48795, 285963, 246235, -118968, -236547, -144945, 54000, 80585, 151139, 111328, 108958, -72084, -150522, -124815, -254124, -20936, -442872, -197838, -178334, -294090, -397376, 52667, -77057, 327151, -494146, 123654, -117347, 136633, -41703, -119645, -254697, -296326, 81160, -39440, -118436, -61175, -311862, -70093, -72237, -176563, 322014, -351189, -221640, 90099, -34983, 69659, -176009, -345733, -26188, -199262, -139959, 20322, -11078, 442230, -36907, 104328, -259856, -109884, 164083, -222387, 7476, 50411, -22952, 74487, 86708, -320014, -158069, -22989, 66504, 30332, 367301, 225918, -365520, 48836, -59123, -72443, -107113, -182813, -320149, -330412, 230552, 49777, -216784, -87962, 343379, 15020, 94970, -70111, -144204, -307049, -105506, -71590, -159143, -38917]
9801A3972e5851k9360A52474J59308a74848a604H2345K7481j674j1361b0878B12000
9788A8918J19348o8125b00685o3233a00955I4337G199J27933b8926a0012k30954
9777b40966E0308b54187J03893L4285j64827I614c36359J33563N7831C76543A6325
9765c15768J06057L5427Q670A18116J17778a16655k38302G885a13203d554D1513
9753A43438a84810b9213C863Q5595a25627H5350b76870K0115A40100J4782P5260
9742B30142a21735k7689e1413A5379d329k02166a8713A33184b24508B38540C300
9730b49567A2308P7408c08136f5993a3982p8030q4458C8161b04410A5703L2469
9719D8172a72709B42689C6845N6021c92148B60523I8432a93252I4087a02086G7445
$$ y = [13972, -55851, -85211, 152474, 311782, -174848, -1604, 82345, 109826, 108152, 96791, -20878, 212000, 18918, 138266, 70141, -200685, -263918, -100955, 94337, 7199, 135132, -28926, -10012, -240966, 50308, -254187, -150294, -116009, -280836, 9614, -336359, -202796, -144965, 376543, 16325, -315768, -209711, -174284, -165614, 118116, 235894, -116655, -354957, 7885, -113203, -4554, 41513, 143438, -184810, -29213, 3863, 89458, -125627, 85350, -276870, -256755, 140100, 154882, 230142, -121735, -149424, -51413, 15379, -4329, -206495, -18713, 133184, -224508, 238540, 3300, -249567, 12308, 89716, -308136, -65993, -13982, -92012, -176470, 38161, -204410, 15703, 48172, -172709, 242689, 36845, 92866, -392148, 260523, 98432, -193252, 94087, -102086, 77445]
9707d1560j29028j65678a53102b8931i455H0609c19942A36356B4828E668J80205
9696A85873a11572c9053j20077D3966K49505g1899j46995o6093P6040N0397J9233
9685a39317k3013A60781C8254a67866A9754a15697l1715j03485r6896a63013H4818
9673a90072R1891G1200i4036J9485k74380L257a13752O210k18668i1896j32117
9662b24013a0394j16162l41847J59722a32896n3881O1691F4940L7141a15944K2535
9651i3409j16413j5622o1741B79759g8033e786A33217B8266d9649A46379d36346
9639D0984L7877b29432a00647A48488I923J65641a18761A32631J44344b5097A48437
9627d51261b1731k86960J41374C8026R9588b90434m8361J57336j05401g8460A43488
$$ y = [-41560, -170588, -336266, -153102, -28931, -9455, 80609, -319942, 136356, 24828, 5668, 185873, -111572, -39053, -159130, 43966, 293471, -71899, -218894, -284987, -208947, -158550, -139317, -162330, 160781, 38254, -167866, 19754, -115697, -147412, -250897, -347793, -163013, 84818, -190072, -98181, 71200, -94036, -74551, -348931, -345674, -113752, -107542, -326210, -91896, -224013, -10394, -126556, -468403, -308681, -132896, -186777, -125086, 64940, 102081, -115944, -93409, -209822, -225444, -287185, 279759, -78033, -5786, 133217, 28266, -49649, 146379, -436346, 40984, 78861, -229432, -100647, 148488, 9923, 175564, -118761, 132631, 276975, -25097, 148437, -451261, -21731, -308691, -167317, 38026, 137614, -290434, -338795, -181459, -286860, -78460, 143488]
9615b36574A23467D0842N319a46100A42650C7738c32940b3549C59910d1392D02498
9603a07004j53651g8260j92383A1953R5042K25481j29377c37100c9635D8976C063
9591b04296j14060g885B0177b75560P4172I5334j7854a29612B28266a4571n1912
9580f6483D3661b05259b160E7058i0932j93100i5061G7399C7299A0430L07083
9569C17513j23617a02228n0083B2618a54195b2197Q358j77811n0126N5781h5420
9557b82031J23592A61759i0799I7063d5351j57470F3825b0321n3377D8107A7386
9545F2027a44183A34301h8622j20961I0209a32741k9127B14849b39270E7365a05195
9533A22058D5160P5632a25809k22776a18181F8233d6519A19744g0917K3731j85022
$$ y = [-236574, 123467, 40842, 46161, -146100, 142650, 37738, -332940, -23549, 359910, -41392, 402498, -107004, -260655, -78260, -270643, 11953, 106995, 332476, 203099, -337100, -39635, 48976, 3063, -204296, -318356, -7885, 20177, -275560, -201388, 95334, 77480, -129612, 228266, -14571, -66483, 43661, -205259, -2160, 57058, -90932, -284032, -95061, 77399, 37299, 10430, 317513, 193896, -102228, -152311, 22618, -154195, -22197, -13839, -191650, -241776, -185995, -85420, -282031, -158439, 161759, -90799, 97063, -45351, -202821, 63825, -20321, -73698, 48107, 17386, 62027, -144183, 134301, -88622, -209583, 90209, -132741, -161868, 214849, -239270, 57365, -105195, 122058, 45160, 120792, -125809, -348585, -118181, 68233, -46519, 119744, -70917, -47186, -232208]
9522b32208D0495d44517A4005e7108b8053k72385j21618g8230j40258a02008j03545
9511b05553A60246a33914C81694i2196J4097B0828a22062C2163i846j68849e100
9499B84200a47794A63739c11392E7774d11464C54233E9596A4138a06221k06747
9489c12968C6980J54138a70003f2809o6201A87120o3608c0432A70789F3685g806
9477A61600e2244j99168e5710H2515C491b02713C0067c71928e056o8817k45091
9466c18964i8227E275a88104N4095L0842a2939k22609a15682E1301d82065c3962
9454b04713A33424a02521j44614D2386P7183g0212d112j75263n0226B26650D8716
9442a76302A81196a2574r5383K5190A28429A1153K08818C3800L05676A5627e1450
$$ y = [-232208, 40495, -444517, 14005, -57108, -28053, -300438, -422056, -78230, -218488, -102008, -205553, 160246, -133914, 381694, -92196, -78099, 20828, -122062, 32163, -9846, -178695, -5100, 284200, -147794, 163739, -311392, 57774, -411464, 354233, 59596, 14138, -106221, -312968, 36980, 191118, -170003, -62809, -129010, 187120, 123512, -30432, 170789, 63685, -7806, 161600, -52244, -251412, -55710, 82515, 3491, -202713, 30067, -371928, -5056, -73873, -318964, -98227, 5275, -188104, -134009, -103167, -12939, -235548, -115682, 51301, -482065, -33962, -204713, 133424, -102521, -247135, 42386, 119569, -70212, -4112, -179375, -229601, 226650, 48716, -176302, 181196, -12574, -107957, -82767, 128429, 11153, 219971, 33800, 339476, 15627, -51450]
9430B05869B151c1363C01812a91618L040D4560K61662d6293P714G0562O2500j6296
9418A16766A6303b53036j46065b9108j30939m7047d0979k35279g6014A57465a73308
9406e4681k49986A77799c23476a9213F7141K27858b63905a02136c6462G8416J621
9395H0037a10163p5826A34972e2390B4423a79798N2492L9370E6990b00577E0123
9383a39513E8943a55422F6062b51167g7432H7619c6918j3268l25498F4405a09783
9371B860N2274d2935k63330a38289B5246c00971a32671F938K15931n7328i723
9359c15275a26242N036A68970D0412a00670J9013j28200i53l40346b5757k16275
9348b42032Q2993A54016f1565A61696l7945a76471A57204e15573a44109r415A01459
$$ y = [205869, 2151, -31363, 301812, -191618, -188578, 44560, 306222, -46293, -38579, 70562, 133062, 116766, 16303, -253036, -399101, -29108, -160047, -207094, -40979, -276258, -76014, 157465, -173308, -54681, -304667, 177799, -323476, -19213, 67141, 294999, -263905, -102136, -36462, 78416, 80037, -110163, -185989, 134972, -52390, 24423, -179798, -127306, -87936, 56990, -200577, 50123, -139513, 58943, -155422, 66062, -251167, -77432, 87619, -36918, -50186, -375684, 64405, -109783, 2860, 55134, -42935, -306265, -138289, 25246, -300971, -132671, 6938, 222869, 165541, -9723, -315275, -126242, -121206, 168970, 40412, -100670, -81657, -209857, -953, -341299, -25757, -242032, -159039, 154016, -61565, 161696, 123751, -176471, 157204, -515573, -144109, -153524, 101459]
9336F5495L90286A53080a03936j48656f0947k74998A47887b8653g432n4491k58158
9325c20081a05712A45193A0784g6389J986j91122G2115b93596c5186E3253c6795
9313a5332o1407k14404O7547M6228B94787a67062n779O2098j84137B13305a13085
9301B77562J15690j60052a24377F3829O924c74997h281j28262A49196g2903h039
9289d31566E0837b40394E9568J48345a20302c1347A54916a29921j7898b5781k42787
9278b68568g2885m9269k8300j46610e7485A4543i2155L5994j06181B95061G7062
9266a59883B68749i0405k5253o1285Q4918H1415a37046E5173B7340d25620H1649
9254c66851A22012c21193A16194D7041b5220p9021A92170a07537B48520C1264
$$ y = [65495, 455781, 153080, -103936, -252592, -60947, -335945, 147887, -28653, -7432, -61923, -320081, -105712, 145193, 10784, -76389, -74403, -265525, 72115, -293596, -35186, 53253, -36795, -15332, -76739, -291143, -223596, -177368, 294787, -167062, -172841, -110743, -294880, 213305, -113085, 277562, 393252, 233200, -124377, 63829, 70753, -374997, -8281, -136543, 149196, -72903, -8039, -431566, 50837, -240394, 59568, 207913, -120302, -31347, 154916, -129921, -147819, -25781, -268568, -72885, -122154, -150454, -297064, -57485, 14543, -92155, -56161, -162342, 295061, 77062, -159883, 268749, -90405, -115658, -176943, -92025, 81415, -137046, 55173, 27340, -425620, 81649, -366851, 122012, -321193, 116194, 47041, -25220, -104241, 192170, -107537, 248520, 31264]
9243E6992k918N7493a36222r168a5140l2816n9316k25122D02391A44740g6524
9231h2270A67503b8177j38738c49j5134B08665a12019j01666R84C54146g6247
9219F718d4274h630n875j42064F0385k2180R9485a18948o6997O3188A10745f9020
9206b29070I5748b75601A11308i2090j50299L3008C22788e24004E2495B3117J80237
9195B03354C3198J48133a00765p5762j29324d8794j70036f8813j56351a07630
9184A5234b42066Q3738O7728k18621d9077E2422b08522G89L886Q844N2537g6696
9171a43652A46654b46467N7575C8456A6517c65251O3968G5688b1309k07946B9549
9159D7693i8570C128L0659J94209Q671a64687I7925d7367D1164c6384k37869P1932
$$ y = [56992, 54074, 111567, -136222, -145390, -15140, -47956, -107272, -332394, 402391, 144740, -76524, -82270, 167503, -28177, -166915, -349, -15483, 208665, -112019, -213685, -212701, 354146, -76247, 6718, -44274, -8630, -14505, -156569, 60385, 38205, 137690, -118948, -185945, -122757, 110745, -69020, -229070, 95748, -275601, 111308, -92090, -242389, -209381, 322788, -524004, 52495, 23117, 203354, 33198, 181331, -100765, -176527, -305851, -48794, -218830, -68813, -225164, -107630, 15234, -242066, -158328, -90600, -309221, -49077, 52422, -208522, 789, 4675, 13519, 66056, -76696, -143652, 146654, -246467, -188892, 38456, 16517, -365251, -301283, 75688, -21309, -229255, 29549, 47693, -98570, 3128, 33787, 227996, 236667, -164687, 97925, -47367, 41164, -36384, -274253, -202321]
9147b02321e5294a6487B14954a5430j69067d7567o2381B52212A6762N417a60320
9135I6389c9093m4967p0661k54127J45667e7084d843k58819j445B52993a8825
9123a76598C10660B7926c10184J50827M2285j76052G6407f6771J4319A8825b79325
9111A18293b15116A64886p2418a75179h1053j03059A87264F3589a090l98275A54722
9099C60182b08988j81838c3863k91570A15105b84021A29961a31114n6475j6925
9089b04514B8416a20040B34794C6914a19366B20846j08301b58307J11759b5826
9078A50420O3256q2446d7682H7287c43008i1745j2256A90704a40047d6863A95098
9066A40137e28168J99147a0181B62495d13550A24754a23322j20120A18499d8865
$$ y = [-202321, -55294, -16487, 214954, -15430, -184497, -47567, -109948, 252212, 16762, 22179, -160320, 96389, -39093, -84060, -154721, -408848, -263181, -57084, -4843, -263662, -265107, 252993, -18825, -176598, 310660, 27926, -310184, -159357, -117072, -293124, 76407, -66771, -52452, 18825, -279325, 118293, -215116, 164886, 92468, -175179, -81053, -184112, 187264, 63589, -1090, -399365, 154722, 360182, -208988, -390826, -33863, -325433, 115105, -284021, 129961, -131114, -187589, -204514, 28416, -120040, 234794, 36914, -119366, 220846, 112545, -258307, -146548, -25826, 150420, 213676, 131230, -47682, 87287, -343008, -91745, -104001, 190704, -140047, -46863, 195098, 140137, -528168, -329021, -10181, 262495, -413550, 124754, -123322, -243442, 118499, -48865]
9055g4477I8822h5630A62308c8316k48323A10944C4384J75171o9839a90330D5170
9043a07315J1379k31270p055J01324c0511n7648L6056F5852g5939j34685a2193
9031A03053J07282a36772A96300a5408o4297k4767G8269J12892a84394C1829a34694
9019b09619P4107A70370b31270B3841J92083A03330M0839B532b19012j6291A5839
9007A639f84484b13482A00679M39a53297A00981K5930D0239c58271D5518j953
8996D3565b16957f8993k23977F2000J5154a52213j34204I008h2531d1223B33459
8984a50668B14900b20634j20674E2206a44548j0375E7497f7818k64425B36064
8973A60582a96472Q5650c7698A17177a93528N9787G9879D900b2565m9999A1305
$$ y = [-74477, 98822, -85630, 162308, -38316, -286639, 110944, 34384, 209555, 139716, -190330, 45170, -107315, -95936, -327206, -334261, -232937, -30511, -88159, -52103, 65852, -75939, -210624, -12193, 103053, 210335, -136772, 196300, -15408, -79705, -104472, 78269, 191161, -184394, 31829, -134694, -209619, -135512, 170370, -231270, 23841, 215924, 103330, 144169, 2532, -219012, -235303, 15839, 1639, -684484, -213482, 100679, 101118, -153297, 100981, 126911, 40239, -358271, 45518, 43565, -216957, -68993, -292970, 62000, 77154, -152213, -286417, 9008, -82531, -41223, 233459, -150668, 214900, -220634, -341308, 52206, -144548, -154923, 57497, -67818, -332243, 236064, 160582, -196472, -110822, -37698, 117177, -193528, -133741, 79879, 4900, -22565, -72564, 11305]
8961B77800b8488j13593K3740m2252g5734A61995C0180K58892a05556A47615e3990
8949b26997A4052i9120k17100O0727k51251A92404a22305j00553a06234j05645
8939b11879E981a12418B2923a04479G0366a4311k11541F0708P4042a3587j73891
8928a87478R3258F6169b19418k73178E6336a17618a4657C23434A03264h1523o7520
8917a49043M0345H2567d5274m7464k1381K3525j35797A33758b16101c5591r7259
8906a32850b4103l23829h4920k04527a9532A01741a14345B9617b28566A03612
8895A1228J36605d5016k39123K0343a27298D8826a3836j68947A14983c54749h9639
8883b81383E9209J49884c18341i8092m3017N7690j25710a1962A950a10892B67085
$$ y = [277800, -28488, -142081, -118341, -160593, -75734, 161995, 30180, 289072, -105556, 147615, -53990, -226997, 14052, -99120, -316220, -255493, -506744, 192404, -122305, -222858, -106234, -211879, 5981, -112418, 22923, -104479, 70366, -14311, -225852, 60708, 134750, -13587, -187478, -94220, 66169, -219418, -492596, 56336, -117618, -14657, 323434, 103264, -81523, -149043, -108698, 82567, -45274, -92738, -114119, -90594, -226391, 133758, -216101, -35591, -132850, -24103, -347932, -84920, -289447, -19532, 101741, -114345, 29617, -228566, 103612, 11228, 147833, -45016, -284139, -263796, -127298, 48826, -13836, -182783, 114983, -354749, -89639, -281383, 59209, 209093, -318341, -98092, -141109, -83419, -209129, -11962, 1950, -110892, 267085]
8871a98179A70425c25997A35954a11888E3374K3350K78464a30457A82779D4912
8860H3355a67479e9976n1341l4365m0746R2856n3112n384p8394B18801n5710p0708
8848I2383c1506j47421A02055d4737j25203d140o7324E112Q9033a18504j05750
8837b24254L1922G3505J28202J33053a49011M8272b7220j3130G6142b49130e9831
$$ y = [-198179, 170425, -325997, 135954, -111888, 53374, 76724, 355188, -130457, 182779, 44912, 83355, -167479, -59976, -111317, -145682, -186428, -93572, -146684, -152068, -230462, 218801, 163091, 92383, -31506, -178927, 102055, -44737, -169940, -4140, -71464, 5112, 94145, -118504, -224254, -192332, 73505, 201707, 334760, -149011, -100739, -27220, -40350, 76142, -249130, -59831]
$$ [...]
##END NTUPLES=NMR SPECTRUM
##END=
