##TITLE=AC1749_SEN00022_9280973_mEKdDWcYx0
##JCAMPDX= 6.0         $$ Bruker NMR JCAMP-DX V2.0
##DATA TYPE= NMR SPECTRUM
##DATA CLASS= NTUPLES
##ORIGIN= BRUKER
##OWNER= Administrator
$$ 1.72 TOPSPIN		Version 2.1
$$ 2015-07-18 22:13:57.385 -0700  Administrator@X
$$ Compression mode = diff/dup
##.OBSERVE FREQUENCY= 400.02188249412
##.OBSERVE NUCLEUS= ^1H
##.ACQUISITION MODE= SIMULTANEOUS (DQD)
##.ACQUISITION SCHEME= undefined
##.AVERAGES= 64
##.DIGITISER RES= 22
##SPECTROMETER/DATA SYSTEM= spect
##.PULSE SEQUENCE= noesygpps1d.comp
##.SOLVENT NAME= COFFEE_meoh
##.SHIFT REFERENCE= INTERNAL, COFFEE_meoh, 1, 14.96075
##AUDIT TRAIL= $$ (NUMBER, WHEN, WHO, WHERE, PROCESS, VERSION, WHAT)
$$ ##TITLE= Audit trail, TOPSPIN		Version 2.1
$$ ##JCAMPDX= 5.01
$$ ##ORIGIN= Bruker BioSpin GmbH
$$ ##OWNER= Administrator
$$ $$ E:\/data/COFFEE/nmr/AC1749_SEN00022_9280973_mEKdDWcYx0/22/pdata/1/auditp.txt
$$ ##AUDIT TRAIL=  $$ (NUMBER, WHEN, WHO, WHERE, PROCESS, VERSION, WHAT)
(   1,<2015-07-18 22:13:52.072 -0700>,<Administrator>,<X>,<go>,<TOPSPIN 2.1>,
      <created by zg
	started at 2015-07-18 22:02:21.947 -0700,
	POWCHK enabled, PULCHK disabled,
       configuration hash MD5:
       21 0F 79 D6 B3 7B B4 F6 88 20 88 DB 03 48 BD 9F
       data hash MD5: 64K
       AC 85 78 3F DC F1 E8 08 AB 58 6B E0 90 56 F3 10>)
(   2,<2015-07-18 22:13:55.275 -0700>,<Administrator>,<X>,<proc1d>,<TOPSPIN 2.1>,
      <Start of raw data processing
       efp LB = 0.3 FT_mod = 6 PKNL = 1 PHC0 = 0 PHC1 = 0 SI = 128K 
       data hash MD5: 128K
       10 0C DE B2 17 D3 58 E8 2D BA 25 19 19 AF 9B 4E>)
(   3,<2015-07-18 22:13:56.150 -0700>,<Administrator>,<X>,<proc1d>,<TOPSPIN 2.1>,
      <pk PHC0 = -90 PHC1 = 0 
       data hash MD5: 128K
       F1 BC 9C 7B 44 35 60 90 2E 07 17 82 D9 15 CB BE>)
(   4,<2015-07-18 22:13:56.557 -0700>,<Administrator>,<X>,<proc1d>,<TOPSPIN 2.1>,
      <abs ABSG = 1 
       data hash MD5: 128K
       41 47 EF A7 23 06 7A F9 DF C6 68 BA E9 45 46 D1>)
(   5,<2015-07-18 22:13:56.650 -0700>,<Administrator>,<X>,<proc1d>,<TOPSPIN 2.1>,
      <abs ABSG = 2 
       data hash MD5: 128K
       E2 20 BA 45 03 90 81 3C 20 38 8E 41 37 37 89 F8>)
(   6,<2015-07-18 22:13:56.744 -0700>,<Administrator>,<X>,<proc1d>,<TOPSPIN 2.1>,
      <abs ABSG = 3 
       data hash MD5: 128K
       D9 3F 3F 31 F3 B0 72 75 1A 69 37 7F E8 3F 5D F0>)
(   7,<2015-07-18 22:13:56.838 -0700>,<Administrator>,<X>,<proc1d>,<TOPSPIN 2.1>,
      <abs ABSG = 4 
       data hash MD5: 128K
       93 38 12 7D E1 47 3C 86 99 38 56 D1 55 0E F8 E8>)
(   8,<2015-07-18 22:13:56.947 -0700>,<Administrator>,<X>,<proc1d>,<TOPSPIN 2.1>,
      <abs ABSG = 5 
       data hash MD5: 128K
       B4 6C 2B 3F 65 38 F9 9E E0 BA AE F0 7E 43 F6 CF>)
$$ ##END=
$$ 
$$ $$ hash MD5
$$ $$ 9C 8C 1A 65 C7 FD C5 4A 2A 31 D0 5E 17 E9 A3 AC
##$RELAX= 
##$RELAX= 
##$RELAX= 
##$RELAX= 
##$RELAX= 
##$RELAX= 
##$RELAX= 
##$RELAX= 
$$ Bruker specific parameters
$$ --------------------------
##$DU= <E:\>
##$EXPNO= 22
$$ [...]
150 150 150 150 150 150 150 150
##$TP07= 0
##$TPNAME0= <>
##$TPNAME1= <>
##$TPNAME2= <>
##$TPNAME3= <>
##$TPNAME4= <>
##$TPNAME5= <>
##$TPNAME6= <>
##$TPNAME7= <>
##$TPOAL= (0..7)
0.5 0.5 0.5 0.5 0.5 0.5 0.5 0.5
##$TPOFFS= (0..7)
0 0 0 0 0 0 0 0
##$TUNHIN= 0
##$TUNHOUT= 0
##$TUNXOUT= 0
##$USERA1= <user>
##$USERA2= <user>
##$USERA3= <user>
##$USERA4= <user>
##$USERA5= <user>
##$V9= 5
##$VALIST= <valist>
##$VCLIST= <CCCCCCCCCCCCCCC>
##$VD= 0
##$VDLIST= <DDDDDDDDDDDDDDD>
##$VPLIST= <PPPPPPPPPPPPPPP>
##$VTLIST= <TTTTTTTTTTTTTTT>
##$WBST= 2048
##$WBSW= 25
##$XGAIN= (0..3)
0 0 0 0
##$XL= 0
##$YL= 0
##$YMAX_a= 5676979
##$YMIN_a= -10486218
##$ZGOPTNS= <>
##$ZL1= 120
##$ZL2= 120
##$ZL3= 120
##$ZL4= 120
##$ABSF1= 14.96075
##$ABSF2= -5.597432
##$ABSG= 5
##$ABSL= 3
##$ALPHA= 0
##$AQORDER= 0
##$ASSFAC= 0
##$ASSFACI= 0
##$ASSFACX= 0
##$ASSWID= 0
##$AUNMP= <proc_prof1d_extract.lims>
##$AXLEFT= 0
##$AXNAME= <>
##$AXNUC= <1H>
##$AXRIGHT= 0
##$AXTYPE= 0
##$AXUNIT= <>
##$AZFE= 0.1
##$AZFW= 0.1
##$BCFW= 0
##$BC_mod= 0
##$BYTORDP= 0
##$COROFFS= 0
##$CY= 15
##$DATMOD= 1
##$DC= 0
##$DFILT= <>
##$DTYPP= 0
##$F1P= 0
##$F2P= 0
##$FCOR= 0.5
##$FTSIZE= 131072
##$FT_mod= 6
##$GAMMA= 0
##$GB= 0
##$INTBC= 1
##$INTSCL= 1
##$ISEN= 128
##$LB= 0.3
##$LEV0= 0
##$LPBIN= 0
##$MAXI= 10000
##$MC2= 0
##$MEAN= 0
##$ME_mod= 0
##$MI= 0
##$NCOEF= 0
##$NC_proc= -2
##$NLEV= 6
##$NOISF1= 0
##$NOISF2= 0
##$NSP= 0
##$NTH_PI= 0
##$NZP= 0
##$OFFSET= 14.96075
##$PC= 1
##$PHC0= -90
##$PHC1= 0
##$PH_mod= 1
##$PKNL= yes
##$PPARMOD= 0
##$PPDIAG= 0
##$PPIPTYP= 0
##$PPMPNUM= 2147483647
##$PPRESOL= 1
##$PSCAL= 4
##$PSIGN= 0
##$PYNMP= <proc.py>
##$REVERSE= no
##$SF= 400.020009738199
##$SI= 131072
##$SIGF1= 0
##$SIGF2= 0
##$SINO= 400
##$SIOLD= 131072
##$SPECTYP= <>
##$SREGLST= <1H.CDCl3>
##$SSB= 0
##$STSI= 131072
##$STSR= 0
##$SW_p= 8223.68421052631
##$SYMM= 0
##$S_DEV= 0
##$TDeff= 65536
##$TDoff= 0
##$TI= <>
##$TILT= no
##$TM1= 0
##$TM2= 0
##$TOPLEV= 0
##$USERP1= <user>
##$USERP2= <user>
##$USERP3= <user>
##$USERP4= <user>
##$USERP5= <user>
##$WDW= 1
##$XDIM= 131072
##$YMAX_p= 367234280
##$YMIN_p= -11243
##$CURPLOT= <Network HP LaserJet P1505>
##$CURPRIN= <$Network HP LaserJet P1505>
##$DFORMAT= <normdp>
##$LAYOUT= <+/1D_H.xwp>
##$LFORMAT= <normlp>
##$PFORMAT= <normpl>
##$SURQMSG= 1
$$ End of Bruker specific parameters
$$ ---------------------------------
##NTUPLES= NMR SPECTRUM
##VAR_NAME=  FREQUENCY,     SPECTRUM/REAL,   SPECTRUM/IMAG
##SYMBOL=    X,             R,               I
##VAR_TYPE=  INDEPENDENT,   DEPENDENT,       DEPENDENT
##VAR_FORM=  AFFN,          ASDF,            ASDF
##VAR_DIM=   131072,        131072,          131072
##UNITS=     HZ,            ARBITRARY UNITS, ARBITRARY UNITS
##FACTOR=    0.0627417313425164, 1,          1
##FIRST=     8223.62146879497, 1759,         -51201
##LAST=      0,             3637,            -51200
##MIN=       0,             -11243,          0
##MAX=       8223.62146879497, 367234280,    0
$$ Real data points
##PAGE= N=1
##DATA TABLE= (X++(R..R)), XYDATA
$$ [...]
61697D42641k732k726k971k849k428k160k038j717j264j102j223j194j003j185
$$ 442641 439909 437183 434212 431363 428935 426775 424737 423020 421756 420654 419431 418237 417234 416049
61683D16049j818k131j539n21L0j00n14r36j285j308q10j45J08j35m85p21r32
$$ 416049 414231 412100 410561 410040 410070 409970 409456 408520 407235 405927 405117 404972 405080 404945 404460 403739 402807
61666D02807j085r54n02K6M08N24K86j37k44K08O76M88r6j66N17J157R92J61o65
$$ 402807 401722 400768 400266 400292 400700 401224 401510 401373 401129 401337 402013 402501 402405 402239 402756 403913 404905 405066 404401
61647D04401r37l78Q76K072K343J792J489K009K514J843J25j298j466p54k41m94
$$ 404401 403464 403086 403962 406034 408377 410169 411658 413667 416181 418024 418149 416851 415385 414631 414390 413896
61631D13896j179j693j957k344k908l051k342j322r45j362j851j895j596j023
$$ 413896 412717 411024 409067 406723 403815 400764 398422 397100 396155 394793 392942 391047 389451 388428
61617C88428l8R83J102K7j342k107k508l222m147m665m693m698m851m919m875
$$ 388428 388390 389373 390475 390502 389160 387053 384545 381323 377176 372511 367818 363120 358269 353350 348475
61602C48475m920m925m455l421k309j735k043l136m363m824m247l359k934k767
$$ 348475 343555 338630 334175 330754 328445 326710 324667 321531 317168 312344 308097 304738 301804 299037
61588B99037k181j275r14j470k299k596k250j676j208q75m65J73P42N74n12j699
$$ 299037 296856 295581 294667 293197 290898 288302 286052 284376 283168 282293 281828 282001 282743 283317 282805 281106
61572B81106j982j318m63N5K15K4m45o74k28L38L0j048j665j198m10j15m2L50
$$ 281106 279124 277806 277343 277398 277613 277637 277192 276518 276290 276628 276658 275610 273945 272747 272337 272222 272180 272530
61554B72530P76O72K38J52N49R88J142R82N34J2r1M49J203J656J849K039K098
$$ 272530 273306 273978 274216 274368 274917 275905 277047 278029 278563 278575 278484 278933 280136 281792 283641 285680 287778
61537B87778J834J495J377J227P09J88K63P52R01N23J09j84p41j516j740j007
$$ 287778 289612 291107 292484 293711 294420 294608 294871 295623 296524 297047 297156 296972 296231 294715 292975 291968
61521B91968M1N34L19l17j292k473l184k721j282J13P03O03L03k7n35j207j660
$$ 291968 292009 292543 292862 292545 291253 288780 285596 282875 281593 281706 282409 283012 283315 283288 282753 281546 279886
61504B79886j480p02J41M83K21k92o84q64r01q02n09q7K41L16K76M53R38J343
$$ 279886 278406 277704 277845 278328 278549 278257 277573 276709 275808 275006 274497 274410 274651 274967 275243 275696 276634 277977
61486B77977J265R17R56J500J771J082j02n71K36J687K758K925K254J125P9m13
$$ 277977 279242 280159 281115 282615 284386 285468 285366 284795 285031 286718 289476 292401 294655 295780 295859 295446
61470B95446l34j15j01k16k04oK69N22O87P41P65Q55Q88N64j71r40j238q81j17
$$ 295446 295112 294997 294896 294680 294476 294470 294739 295261 295948 296689 297454 298309 299197 299761 299590 298650 297412 296531 296414
61451B96414N59P58N20K70K90L84K71J58M69J115J565J679J890K414K870K946
$$ 296414 296973 297731 298251 298521 298811 299195 299466 299624 300093 301208 302773 304452 306342 308756 311626 314572
61435C14572K904L043L138K853K366K087K066K098K120K079J732J098P96J285
$$ 314572 317476 320519 323657 326510 328876 330963 333029 335127 337247 339326 341058 342156 342952 344237
61421C44237K024K061J391R16J092J338J034M14L8m1j32k91l24k32j93k12j39
$$ 344237 346261 348322 349713 350629 351721 353059 354093 354507 354545 354504 354372 354081 353757 353525 353332 353120 352981
61404C52981q7n08j658l057l696k935j239J89O03L41R2q9o27j513k190k327k116
$$ 352981 352894 352386 350728 347671 343975 341040 339801 339990 340593 340934 341026 340937 340310 338797 336607 334280 332164
61387C32164j674q30K60Q90P22L66N12Q83P41J39j36K33P20R07J045J411J726
$$ 332164 330490 329660 329920 330810 331532 331898 332410 333293 334034 334173 334037 334270 334990 335897 336942 338353 340079
61370C40079J672J481J527J715J751J741J915K022J654J115J286K429L742M404
$$ 340079 341751 343232 344759 346474 348225 349966 351881 353903 355557 356672 357958 360387 364129 368533
61356C68533M506M591M750M786M937N689O900P672P374O369N539N348N583N738
$$ 368533 373039 377630 382380 387166 392103 397792 404692 412364 419738 426107 431646 436994 442577 448315
61342D48315N445M662L675K921K644K694K665K207J293K63m49p60j018j544k250
$$ 448315 453760 458422 462097 465018 467662 470356 473021 475228 476521 476784 476335 475575 474557 473013 470763
61327D70763k846l182l187k773k181k062k589k837j784J38J446J607J624K385
$$ 470763 467917 464735 461548 458775 456594 454532 451943 449106 447322 447460 448906 450513 452137 454522
61313D54522L497M301N024O087P076P417P453P862Q471Q680Q668R025R385Q629
$$ 454522 458019 462320 467344 473431 480507 487924 495377 503239 511710 520390 529058 538083 547468 556097
61299E56097O502L927J604o59k934m572n114n064n226n816o566p176p370p076
$$ 556097 562599 566526 568130 567471 564537 559965 554851 549787 544561 538745 532179 525003 517633 510557
61285E10557o751o978p547p570o686n444m235k773r92M24J029J389K135K925L120
$$ 510557 503806 496828 489281 481711 475025 469581 465346 462573 461581 462005 463034 464423 466558 469483 472603
61270D72603K907K925L180L219L081L261L829M386M788N325O144P104Q116R170
$$ 472603 475510 478435 481615 484834 487915 491176 495005 499391 504179 509504 515648 522752 530868 540038
61256E40038J0005J0236R722Q465O396L714J262o5k69j34k46n91j035j642k442
$$ 540038 550043 560279 570001 578466 584862 588576 589838 589773 589504 589370 589124 588533 587498 585856 583414
61241E83414l284m002m491m636m389l816k906j619l70J9o84j562j614r88m66j04
$$ 583414 580130 576128 571637 567001 562612 558796 555890 554271 553901 553920 553236 551674 550060 549072 548606 548502
61225E48502P13J984K897L117L311M051M904N118M664M114L822L703L597L465
$$ 548502 549215 551199 554096 557213 560524 564575 569479 574597 579261 583375 587197 590900 594497 597962
61211E97962L303L025K501J711R21N71P84J207J562K089L044M139N026O036P702
$$ 597962 601265 604290 606791 608502 609423 609994 610778 611985 613547 615636 618680 622819 627845 633881 641583
61196F41583R694J1105J1802J2554J3669J4403J4070J2914J1368R255O416L578
$$ 641583 651277 662382 674184 686738 700407 714810 728880 741794 753162 762417 768833 772411
61184G72411J786J163Q53J14r95j948k357k358k568l545n097o422p120p681q647
$$ 772411 774197 775360 776213 776327 775332 773384 771027 768669 766101 762556 757459 751037 743917 736236 727589
61169G27589r683r993r483q978r244j0228j1317j1999j2140j1830j1217j0475
$$ 727589 717906 707913 698430 689452 680208 669980 658663 646664 634524 622694 611477 601002
61157F01002r781r201q530p414n762l952k410j135J16J255J850J627O51q74k577
$$ 601002 591221 582020 573490 566076 560314 556362 553952 552817 552933 554188 556038 557665 558316 557442 554865
61142E54865l804m102l931m232n127n618m904l398k042j102j73J011K348L745
$$ 554865 551061 546959 543028 538796 533669 528051 523147 519749 517707 516605 516432 517443 519791 523536
61128E23536N211O625P823Q838R763J0590J1422J2636J4435J6400J7905J8863
$$ 523536 528747 535372 543195 552033 561796 572386 583808 596444 610879 627279 645184 664047
61116F64047J9710K0696K1581K2035K2013K1635K1023K0345J9796J9390J8820
$$ 664047 683757 704453 726034 748069 770082 791717 812740 833085 852881 872271 891091
61105H91091J7626J5520J2579R209N859K767p9k787n534q532j1790j4906j7341
$$ 891091 908717 924237 936816 946025 951884 954651 954572 951785 946251 937719 925929 911023 893682
61092H93682j8932j9897k0375k0280j9759j9374j9610k0279k0618j9954j8233
$$ 893682 874750 854853 834478 814198 794439 775065 755455 735176 714558 694604 676371
61081F76371j6066j4273j3236j2683j2119j1295j0133q537o613m831l491k286
$$ 676371 660305 646032 632796 620113 607994 596699 586566 578029 571416 566585 563094 560808
61069E60808r12K04M78K73N75J621K727L506M290N164N626N562N614O119O613
$$ 560808 559896 560100 560578 560851 561426 563047 565774 569280 573570 578734 584360 589922 595536 601655 608268
61054F08268O943P908J0044J2546J4292J5268J6169J7158J7940J8604J9473K0476
$$ 608268 615211 623119 633163 645709 660001 675269 691438 708596 726536 745140 764613 785089
61042G85089K1456K2761K4744K6941K8566K9546L0374L1224L1971L2853L4319
$$ 785089 806545 829306 854050 880991 909557 939103 969477 1000701 1032672 1065525 1099844
61031A099844L6323L8425M0358M2011M3152M3825M4649M6145M8153N0528N3804
$$ 1099844 1136167 1174592 1214950 1256961 1300113 1343938 1388587 1434732 1482885 1533413 1587217
61020A587217N8459O4223P1061Q0049R2045J06217J21525J39242J62440J93233
$$ 1587217 1645676 1709899 1780960 1861009 1953054 2059271 2180796 2320038 2482478 2675711
61010B675711K32193K80255L39051M09125M89881N82131O88769Q11532R47970
$$ 2675711 2907904 3188159 3527210 3936335 4426216 5008347 5697116 6508648 7456618
61001G456618J092242J237573J376885J500610J591533J618175J536146J309299
$$ 7456618 8548860 9786433 11163318 12663928 14255461 15873636 17409782 18719081
60993A8719081R44639N10616J12727j60605k78102k64133j72532o9274k9537j24592
$$ 18719081 19663720 20174336 20287063 20126458 19848356 19584223 19411691 19342417 19312880 19188288
60983A9188288l86279p75435j191643j525170j710329j741390j651753j485858
$$ 19188288 18802009 18026574 16834931 15309761 13599432 11858042 10206289 8720431
60975H720431j284353j079749q93323p33581o00143m90099m00856l29364k72003
$$ 8720431 7436078 6356329 5463006 4729425 4129282 3639183 3238327 2908963 2636960
60966B636960k25969j89608j61299j39135j21680j08021r6947q6983p7367o8265
$$ 2636960 2410991 2221383 2060084 1920949 1799269 1691248 1594301 1507318 1429951 1361686
60956A361686n9910n2211m5156l8909l3411k8542k4677k2407k1623k1452k1221
$$ 1361686 1301776 1249565 1204409 1165500 1132089 1103547 1078870 1056463 1034840 1013388 992167
60945I92167k0846k0199j8834j6640j4222j2269j0940j0135r856r971r978r498
$$ 992167 971321 951122 932288 915648 901426 889157 878217 868082 858226 848255 838277 828779
60933H28779q753q123p366n839l575j611q66q90k73J694M231O162P352Q569J0291
$$ 828779 820026 811903 804537 798698 795123 793512 792646 791756 791483 793177 797408 803570 810922 819491 829782
60918H29782J2310J4368J6420J8201J9309K0002K1154K2965K4432K4655K4026
$$ 829782 842092 856460 872880 891081 910390 930392 951546 974511 998943 1023598 1047624
60907A047624K3449K2881K1463J8804J5373J1717Q032M362N84l643q323j2625
$$ 1047624 1071073 1093954 1115417 1134221 1149594 1161311 1169343 1173705 1174289 1170646 1162323 1149698
60895A149698j5674j7735j9857k2328k4330k5237k5411k5451k5399k5111k4741
$$ 1149698 1134024 1116289 1096432 1074104 1049774 1024537 999126 973675 948276 923165 898424
60884H98424k4354k3592k2266k0895k0053j9525j8691j7548j6684j6242j5600
$$ 898424 874070 850478 828212 807317 787264 767739 749048 731500 714816 698574 682974
60873F82974j4289j2768j1793j1328j0546r013p381o646o933p415p384o941o548
$$ 682974 668685 655917 644124 632796 622250 613237 605856 599210 592277 584862 577478 570537 563989
60860E63989o344o213o151o182o161o019o040o461o931o829o096n269m768m563
$$ 563989 557645 551432 545281 539099 532938 526919 520879 514418 507487 500658 494562 489293 484525 479962
60846D79962m579m874n290n422n192n016n163n319n157m977n331o128o593o150
$$ 479962 475383 470509 465219 459797 454605 449589 444426 439107 433950 428973 423642 417514 410921 404771
60832D04771n055m028l470l133k510j424k12O99J274J777K283K547K476K418K667
$$ 404771 399716 395688 392218 389085 386575 385151 384939 385638 386912 388689 390972 393519 395995 398413 401080
60817D01080K848K253R23m3L58J751K728K516J779J502J596J202J14q60j053p74
$$ 401080 403928 406181 407104 407061 407419 409170 411898 414414 416193 417695 419291 420493 420607 419747 418694 417920
60801D17920p00r59j206j209r13k91M67Q20L86n63j462k120k696l248l758m349
$$ 417920 417220 416261 415055 413846 412933 412642 413109 413929 414315 413752 412290 410170 407474 404226 400468 396119
60785C96119m997n251m717l737l051k900k990l152l430l578l223k615k467k835
$$ 396119 391122 385871 381154 377417 374366 371466 368476 365324 361894 358316 355093 352478 350011 347176
60771C47176k860j968p09K9J51K23N79J054J375J393J047M89J18K44P59J309J670
$$ 347176 344316 342348 341639 341668 341819 342042 342621 343675 345050 346443 347490 347979 348097 348341 349100 350409 352079
60754C52079J881K143K653L324L726L577L253L308L542L225K364J961K504L016
$$ 352079 353960 356103 358756 362080 365806 369383 372636 375944 379486 382711 385075 387036 389540 392556
60740C92556K296M91j359k859m327n596n943n325m665m588m698m511m292m414
$$ 392556 394852 395343 393984 391125 386798 381202 375259 369934 365269 360681 355983 351472 347180 342766
60726C42766m519m093l411l174l364l268k596j929j836k106k151j820j489j521
$$ 342766 338247 334154 330743 327569 324205 320937 318341 316412 314576 312470 310319 308499 307010 305489
60712C05489j907k283k130j181J26Q46N27j81l12J58M18J70P4N34Q00Q5r49q38
$$ 305489 303582 301299 299169 297988 298114 298960 299487 299306 298994 299152 299570 299740 299814 300348 301148 301233 300284 299446
60694B99446O09J950K024J345J084J482J996K398K812L029K721K274K512L504
$$ 299446 300055 302005 304029 305374 306458 307940 309936 312334 315146 318175 320896 323170 325682 329186
60680C29186M389M602M517M607M714M606M561M841N025M575L735L202L085K866
$$ 329186 333575 338177 342694 347301 352015 356621 361182 366023 371048 375623 379358 382560 385645 388511
60666C88511K275J540Q09m9r38j467j558j583j712j697j542j724k312k539j850
$$ 388511 390786 392326 393135 393086 392148 390681 389123 387540 385828 384131 382589 380865 378553 376014 374164
60651C74164r13q01j457j842j505j119j334j912k352k678l138l591l740l658l587
$$ 374164 373251 372450 370993 369151 367646 366527 365193 363281 360929 358251 355113 351522 347782 344124 340537
60636C40537l429k950k288j835j631j354q60l94j89j85k11j80p2O2J9l52q47j004
$$ 340537 337108 334158 331870 330035 328404 327050 326190 325796 325607 325422 325211 325031 324959 325021 325040 324688 323841 322837
60618C22837o25K2N62Q28P58L21k21k86M12J374J786J437Q59N35M11L03L77P73
$$ 322837 322212 322234 322796 323624 324382 324703 324482 324196 324608 325982 327768 329205 330064 330599 331010 331313 331690 332463
60600C32463J081P45j5k84L78J306J610J261Q71P29O09L82K16J50M5pK55P10Q80
$$ 332463 333544 334289 334274 333990 334368 335674 337284 338545 339416 340145 340754 341136 341352 341502 341547 341540 341795 342505 343385
60581C43385P22Q19J512K342K770K943L314L893M408M894N596O463P246P947Q702
$$ 343385 344107 344926 346438 348780 351550 354493 357807 361700 366108 371002 376598 383061 390307 398254 406956
60566D06956R370R688R680R493Q916P593N604L382J123j242l530n229o001n889
$$ 406956 416326 426014 435694 445187 454103 461696 467300 470682 471805 470563 467033 461804 455803 449914
60552D49914n033l637k095p58M69J899L534N150O722Q233R371J0029J0908J2663
$$ 449914 444881 441244 439149 438391 438860 440759 444293 449443 456165 464398 473769 483798 494706 507369
60538E07369J4560J5012J3646J1747J0263Q535N647K123p48k608m044n329o159
$$ 507369 521929 536941 550587 562334 572597 581132 586779 588902 588154 585546 581502 576173 570014
60525E70014o437o420o095n204l965l075k841k852k669k327j973j470o41L34J071
$$ 570014 563577 557157 551062 545858 541893 538818 535977 533125 530456 528129 526156 524686 524045 524379 525450
60510E25450J500K081L396N476P678R480J1292J4010J7764K1732K5415K9269L3609
$$ 525450 526950 529031 532427 537903 545581 555061 566353 580363 598127 619859 645274 674543 708152
60497G08152L7596M0205M1608M2638M3169M2169L9253L5030K9696K2402J2597
$$ 708152 745748 785953 827561 870199 913368 955537 994790 1029820 1059516 1081918 1094515
60486A094515J210j0132k0559l0060l8556m5471n0052n1757n0546m7139m2802
$$ 1094515 1095725 1085593 1065034 1034974 996418 950947 900895 849138 798592 751453 708651
60475G08651l8569l4727l1104k7582k4135k0745j7546j4820j2682j0999r782r265
$$ 708651 670082 635355 604251 576669 552534 531789 514243 499423 486741 475742 465960 456695
60463D56695r342r326q606p325o024m957m057l332k863k558k302k157k137k012
$$ 456695 447353 438027 429421 422096 416072 411115 407058 403726 400863 398305 396003 393846 391709 389697
60449C89697j697j572j971k573k771k501k151j800j163l47Jm74j317j825j792
$$ 389697 388000 386428 384457 381884 379113 376612 374461 372661 371498 371151 371152 370678 369361 367536 365744
60434C65744j465j057o13j73J36J39k04n89m80K60J001J004M08L8L04P90J045
$$ 365744 364279 363222 362609 362436 362572 362711 362507 361918 361438 361698 362699 363703 364111 364149 364453 365243 366288
60417C66288J155J290J282J019P66P64R33J268J910K450J887k3j944k375j470
$$ 366288 367443 368733 370015 371034 371800 372564 373497 374765 376675 379125 381012 380989 379045 376670 375200
60402C75200n54j90J75Q05J215J309J697K453K660J905J245J765K909L298K714
$$ 375200 374646 374456 374631 375436 376651 377960 379657 382110 384770 386675 387920 389685 392594 395892 398606
60387C98606K199K369K738K742K534K475K573K705K844K803K266J328O39O80J207
$$ 398606 400805 403174 405912 408654 411188 413663 416236 418941 421785 424588 426854 428182 428821 429501 430708
60372D30708J636J703J516J268J092J059J070R46P48P78J131J489J544J385J287
$$ 430708 432344 434047 435563 436831 437923 438982 440052 440998 441746 442524 443655 445144 446688 448073 449360
60357D49360J343J527J905K515L213L868M601N506O297O545O217N646M956L890
$$ 449360 450703 452230 454135 456650 459863 463731 468332 473838 480135 486680 492897 498543 503499 507389
60343E07389K313N83q40j959l087m230m912m738l922l125k873l222l845m238m003
$$ 507389 509702 510285 509445 507486 504399 500169 495257 490519 486597 483472 480599 477377 473532 469294 465291
60328D65291l226k585k718l410l721l135k218j771j680j161kJ069J434J412J726
$$ 465291 462065 459480 456762 453352 449631 446496 444278 442507 440827 439666 439664 440733 442167 443579 445305
60313D45305K551L576M677O035P598Q961R974J1074J2720J4680J6174J6632J6043
$$ 445305 447856 451432 456109 462144 469742 478703 488677 499751 512471 527151 543325 559957 576000
60300E76000J4606J2364R327N622J311l685r094j3867j6755j7410j6611j5274
$$ 576000 590606 602970 612297 617919 619230 615545 606451 592584 575829 558419 541808 526534
60288E26534j3637j1573r242p097n453m402l895l691l423l044k930l271l631l505
$$ 526534 512897 501324 492082 484985 479532 475130 471235 467544 464121 461077 458147 454876 451245 447740
60274D47740l027k669k539k478k596l019l324k950k136j713j944k279k329k228
$$ 447740 444713 442044 439505 437027 434431 431412 428088 425138 423002 421289 419345 417066 414737 412509
60260D12509j992j356n11p0J3N72J726K257J270l33j001n44N2L35P38J372J681
$$ 412509 410517 409161 408650 408580 408593 409165 410891 413148 414418 414085 413084 412540 412592 412927 413665 415037 416718
60243D16718J437J140J135J087O14j55q65j259j060j52R46J407J195J273K378
$$ 416718 418155 419295 420430 421517 422131 421976 421111 419852 418792 418640 419586 420993 422188 423461 425839
60228D25839M035N199N359M642L318J776O99O53J494K595L559M371M964N105M838
$$ 425839 429874 435073 440432 445074 448392 450168 450867 451520 453014 455609 459168 463539 468503 473608 478446
60213D78446M653N016N853O621O865O620O314O279O397O322N932N383M713L729
$$ 478446 483099 488115 493968 500589 507454 514074 520388 526667 533064 539386 545318 550701 555414 559143
60199E59143K508J631J563J953J966J280L32m27j010j471j521j044o57j214k749
$$ 559143 561651 563282 564845 566798 568764 570044 570376 569949 568939 567468 565947 564903 564246 563032 560283
60184E60283m350n152n090m647m302m370m915n493n329m210k876k182k045j779
$$ 560283 555933 550781 545691 541044 536742 532372 527457 521964 516635 512425 509549 507367 505322 503543
60170E03543j231q95r22q26m11k98j004j980k213j530o89k77j06K29P18J121J442
$$ 503543 502312 501417 500495 499669 499258 498960 497956 495976 493763 492233 491544 491267 491161 491390 492108 493229 494671
60153D94671J854K236K128J292K49l8Q17K048K488J901J219J372K313L422M421
$$ 494671 496525 498761 500889 502181 502430 502392 503209 505257 507745 509646 510865 512237 514550 517972 522393
60138E22393N405O242O590O497O464O690O714O077N000M081L489K808J713M82
$$ 522393 527798 534040 540630 547127 553591 560281 566995 573072 578072 582153 585642 588450 590163 590645
60124E90645l01l65N2N57R23J083J047R54J057J412J681J462P28k33j247k291
$$ 590645 590344 589979 590031 590588 591511 592594 593641 594595 595652 597064 598745 600207 600935 600702 599455 597164
60108E97164l162l529l399l195l205l308l364l535l941m327m339l915l173k197
$$ 597164 594002 590473 587074 583879 580674 577366 574002 570467 566526 562199 557860 553945 550772 548575
60094E48575j207n97m50k80L65J268J880K109K261K357K119J642J469J798K058
$$ 548575 547368 546771 546321 546041 546406 547674 549554 551663 553924 556281 558400 560042 561511 563309 565367
60079E65367J617O15k72p39j169j982l011l794m381n410p118q660q913p895o834
$$ 565367 566984 567599 567327 566588 565419 563437 560426 556632 552251 546841 539723 531063 522150 514255 507421
60064E07421o667o999o821n823m561l654l211k961k598k059j591j416j282o98
$$ 507421 500754 493755 486934 481111 476550 472896 469685 466724 464126 462067 460476 459060 457778 457080
60050D57080L16J210J813K640L909M940N086M760M776N141N281N118N005M794
$$ 457080 457396 458606 460419 463059 466968 471908 476994 481754 486530 491671 496952 502070 507075 511869
60036E11869L922K450J136L71k41j125k224l395m604n544n737n278m941n281o049
$$ 511869 515791 518241 519377 519748 519507 518382 516158 512763 508159 502615 496878 491600 486659 481378 475329
60021D75329o654o753o268n296m228l491l069k692k473k771l393l620l195k669
$$ 475329 468675 461922 455654 450358 446130 442639 439570 436878 434405 431634 428241 424621 421426 418757
60007D18757k534k615k571k397k107j495n49L40Q26Q68M88j75m69K77J656K424
$$ 418757 416223 413608 411037 408640 406533 405038 404489 404829 405655 406523 407011 406836 406367 406644 408300 410724
59991D10724K223K140L016M106M228L448K693K222J544N35l48q77j231j428j327
$$ 410724 412947 415087 418103 422209 426437 429885 432578 434800 436344 436879 436531 435654 434423 432995 431668
59976D31668j136j248j560j619j412j383j619j663j249o67k70n5J37M23R59J807
$$ 431668 430532 429284 427724 426105 424693 423310 421691 420028 418779 418112 417842 417787 417924 418347 419306 421113
59960D21113K618K893K632K367K438K604K515K167J713J152M52k53p81j080j172
$$ 421113 423731 426624 429256 431623 434061 436665 439180 441347 443060 444212 444664 444411 443630 442550 441378
59945D41378j088r68j012j205j232q51k55M3k89j030j540j306m26M99J029J311
$$ 441378 440290 439322 438310 437105 435873 435022 434767 434810 434521 433491 431951 430645 430219 430718 431747 433058
59929D33058J783K553L293L674L715L673L736L907M145M516N104N766O068N685
$$ 433058 434841 437394 440687 444361 448076 451749 455485 459392 463537 468053 473157 478923 484991 490676
59915D90676M849M237M337N002N548N210L706J656K72J86O39L57q33j900k225
$$ 490676 495525 499762 504099 509101 514649 519859 523565 525221 525493 525679 526318 526675 525842 523942 521717
59900E21717k426l102l586k827j122L1j97r80r40L12J957K974L078K819K896L460
$$ 521717 519291 516189 512603 509776 508654 508685 508488 507508 506568 506880 508837 511811 514889 517708 520604 524064
59884E24064M128M622N050N509N812N884N961O071N703M530L129K322K042J467
$$ 524064 528192 532814 537864 543373 549185 555069 561030 567101 572804 577334 580463 582785 584827 586294
59870E86294K43j164k292l220m089m749n093n268n255m716l588k422j734j319
$$ 586294 586537 585373 583081 579861 575772 571023 565930 560662 555407 550691 547103 544681 542947 541628
59856E41628o83Q9M26K19J71R26K246L393M170N014N990O281N122K940R24l79
$$ 541628 540945 541034 541460 541679 541850 542776 545022 548415 552585 557599 563589 569870 574992 577932 578856 578477
59840E78477j339k101k038q21O79J217N00r18k651m603o254o795o096m938m022
$$ 578477 577138 575037 572999 572178 572857 574074 574574 573656 571005 566402 560148 553353 547257 542319 538297
59825E38297l358k774k514k833l386l471k793j724q50m77n46q08r93r03n47k23
$$ 538297 534939 532165 529651 526818 523432 519961 517168 515444 514594 514117 513571 512763 511770 510867 510320 510097
59809E10097l60j073j974k664l261m027m620m391l553l220l871m491l934k538
$$ 510097 509737 508664 506690 504026 500765 496738 492118 487727 484174 480954 477083 472592 468658 466120
59795D66120j540j334j295j088j065j327j364q95k75K12P46J400J814J794J617
$$ 466120 464580 463246 461951 460863 459798 458471 457107 456212 455937 456149 456895 458295 460109 461903 463520
59780D63520J460J082M69J66N26J085J190Q65O40P79J167J646K066K203K007J756
$$ 463520 464980 466062 466531 466697 467223 468308 469498 470363 471003 471782 472949 474595 476661 478864 480871 482627
59764D82627J708J773J769J736J745J727J730K042K645K954K593K165K637M025
$$ 482627 484335 486108 487877 489613 491358 493085 494815 496857 499502 502456 505049 507214 509851 513876
59750E13876N275N542N061M621M569M676M715M800N069N242M747L439K003J303
$$ 513876 519151 524693 529754 534375 538944 543620 548335 553135 558204 563446 568193 571632 573635 574938
59736E74938J379J408P94j72r25j360j571j325m53N23Q89P50P91J050P95j25p95
$$ 574938 576317 577725 578519 578347 577422 576062 574491 573166 572713 573236 574125 574875 575666 576716 577511 577386 576591
59719E76591n89k26o50j478j601r75o90j227j759j528r00n16k54K26O40O16N61
$$ 576591 576002 575776 575126 573648 572047 571072 570382 569155 567396 565868 564968 564452 564198 564424 565064 565680 566241
59702E66241J033J637J579J150J507K886M116M258L733L347L041K289J084j34
$$ 566241 567274 568911 570490 571640 573147 576033 580149 584407 588140 591487 594528 596817 597901 597767
59688E97767j144j902k228k084j857j908k130k316k546k805k768k452k572l596
$$ 597767 596623 594721 592493 590409 588552 586644 584514 582198 579652 576847 574079 571627 569055 565459
59674E65459m898n562n588n556n492m950l995l201k814k683k824l223l284k410
$$ 565459 560561 554999 549411 543855 538363 533413 529418 526217 523403 520720 517896 514673 511389 508979
59660E08979j079m07n87o69N0J304K536L401L500K681J767J887K790K946J703
$$ 508979 507900 507493 506906 506237 506287 507591 510127 513528 517028 519709 521476 523363 526153 529099 530802
59645E30802K27l70o61j786l563m794m891m281l510k845k429k165j657q05j60
$$ 530802 531029 530659 529998 528212 524649 519855 514964 510683 507173 504328 501899 499734 498077 497272 497112
59630D97112j72m77n26m83q43j555k202k714l204l448l280l224l854m697m655
$$ 497112 496940 496463 495937 495454 494611 493056 490854 488140 484936 481488 478208 474984 471130 466433 461778
59615D61778l475k016j036n15k52k78m16j48O77J500J781J676J695J968K146J852
$$ 461778 458303 456287 455251 454736 454484 454206 453790 453642 454319 455819 457600 459276 460971 462939 465085 466937
59599D66937J072K34j10J78O33P32N15L92M97O20O64O66M50k31j162j784j884
$$ 466937 468009 468243 468133 468311 468944 469676 470191 470583 471080 471700 472364 473030 473480 473249 472087 470303 468419
59582D68419j707j429j106j157k064l324l602k517j510k076l653m319l335j873
$$ 468419 466712 465283 464177 463020 460956 457632 454030 451513 450003 447927 444274 439955 436620 434747
59568D34747j126q85m24J51L12J91L09N30K90k24j05P81J330P29k80m39L06R77
$$ 434747 433621 432736 432312 432463 432775 432966 433275 433805 434095 433871 433766 434547 435877 436606 436326 435887 436193 437170
59550D37170J217J754L121M772N822O094O079O279O967Q202R722J1033J1955J2831
$$ 437170 438387 440141 443262 448034 453856 459950 466029 472308 479275 487477 497199 508232 520187 533018
59536E33018J3824J4171J2540Q308K403l160o654p743p344o400m982k787k07J745
$$ 533018 546842 561013 573553 581861 584264 581104 574450 566707 559363 552963 547981 545194 544987 546732
59522E46732K575K767K845K596J643K33j047k037k966l908m807n816p005p823
$$ 546732 549307 552074 554919 557515 559158 559391 558344 556307 553341 549433 544626 538810 531805 523982
59508E23982p524o241n152n266o277o898o156m229k145q31m54n77p63q98j000
$$ 523982 516458 510217 505065 499799 493522 486624 480468 476239 474094 473263 472809 472232 471469 470571 469571
59493D69571r98q25n10o0O01J375J888J920J792K096L003M011M492M394M378N148
$$ 469571 468573 467748 467238 467178 467779 469154 471042 472962 474754 476850 479853 483864 488356 492750 497128 502276
59477E02276O619P860Q060P329O291N123L535J629P7q19j548k455k964k310p30
$$ 502276 508895 516755 524815 532144 538435 543558 547093 548722 548799 547980 546432 543977 541013 538703 537973
59462E37973P58J562J998K663L838N452P187Q537R174R304R414R652R699R242
$$ 537973 538731 540293 542291 544954 548792 554244 561431 569968 579142 588446 597860 607512 617211 626453
59448F26453Q293P030N596M088K502O24j879n018q162j0264j0661r744q650q041
$$ 626453 634746 641776 647372 651460 653962 654586 652707 647689 639527 629263 618602 608858 600208 592167
59434E92167p454o285n081n049o178o842n705l301j069N26K084M010O078Q149
$$ 592167 584713 578428 573347 568298 562120 555278 549573 546272 545203 545729 547813 551823 557901 566050
59420E66050J0374J2627J4479J5913J7394J9111K0644K1613K2042K1772J9966
$$ 566050 576424 589051 603530 619443 636837 655948 676592 698205 720247 742019 761985
59409G61985J5663Q758L02p926j4055j6749j5816j2334p916l603M78M240O513
$$ 761985 777648 786406 786708 778782 764727 747978 732162 719828 711912 708309 708787 713027 719540
59396G19540N320k80q759j6966k2467k4789k4656k2827j9900j6528j3206j0162
$$ 719540 724860 724580 715821 698855 676388 651599 626943 604116 584216 567688 554482 544320
59384E44320p665o007m918l606j791j99M59M59M95P28R77J341J896K270K266K450
$$ 544320 536655 530648 525730 522124 520333 520134 520593 521052 521547 522275 523252 524593 526489 528759 531025 533475
59368E33475L271M117M224M074M760O165P086P120P131P660Q115P987P803Q290
$$ 533475 536746 540863 545087 549161 553921 560086 567172 574292 581423 589083 597198 605185 612988 621278
59354F21278R412J0742J2065J3189J3803J3996J4285J4801J5122J5177J5466J5940
$$ 621278 630690 641432 653497 666686 680489 694485 708770 723571 738693 753870 769336 785276
59342G85276J5568J3705J1059Q572O017K721r30l836n809p770j0252j2614j4025
$$ 785276 800844 814549 825608 834180 840197 842918 841988 838152 832343 824573 814321 801707 787682
59329G87682j4541j4831j5232j5496j5233j4400j3324j2290j1179r704q028o763
$$ 787682 773141 758310 743078 727582 712349 697949 684625 672335 661156 651452 643424 636661
59317F36661o152n610m486k969j767j029j65J224K789L987M845N836P169Q517
$$ 636661 630509 624899 620413 617444 615677 614648 614483 615707 618496 622483 627328 633164 640333 648850
59303F48850R485J0126J0820J1648J2032J1130Q548M540l37n548j0457j4249j6225
$$ 648850 658335 668461 679281 690929 702961 714091 722639 727179 726842 721294 710837 696588 680363
59290F80363j6237j4781j2700j0769r339q283p241n989m520k929j343R7J352K549
$$ 680363 664126 649345 636645 625876 616537 608254 601013 595024 590504 587575 586232 586329 587681 590230
59276E90230L742M714N231N447N769O341O963P531Q237R146R789R423P700N043
$$ 590230 593972 598686 603917 609364 615133 621474 628437 635968 644205 653351 663140 672563 680263 685306
59262F85306K323J26j650l435n275o803p890q837r696r894r020p618o589o095
$$ 685306 687629 687755 686105 682670 677395 670592 662702 653865 644169 634275 625255 617637 611048 604953
59248F04953n606m804l815k668j261J55J118J613J986K255K191K068K475L257
$$ 604953 599347 594543 590728 588060 586799 586954 588072 589685 591671 593926 596117 598185 600660 603917
59234F03917L524K953K221J838J405N08m57j031j524k384l317l775l883m105m408
$$ 603917 607441 610394 612615 614453 615858 616366 615909 614878 613354 610970 607653 603878 599995 595890 591482
59219E91482m448m335m354m206l353k073j330j517j995k040j619j078o30l50k07
$$ 591482 587034 582699 578345 574139 570786 568713 567383 565866 563871 561831 560212 559134 558504 558154 557947
59204E57947J05R51K114K825K656K040J624J496J415J386J531J589J219P04P39
$$ 557947 558052 559003 561117 563942 566598 568638 570262 571758 573173 574559 576090 577679 578898 579602 580341
59189E80341J339J614J007J94J24O07O65J21j48L36R03R19Q88J575K662L157K870
$$ 580341 581680 583294 584301 584495 584619 585226 585891 586012 585864 586200 587103 588022 588910 590485 593147 596304 599174
59172E99174K566K805L409M105M906N757O435O956P541Q052Q038P394O473N453
$$ 599174 601740 604545 607954 612059 616965 622722 629157 636113 643654 651706 659744 667138 673611 679064
59158F79064M171K668J281L8j393l028m378n128n429n417n080m768n041n754o063
$$ 679064 683235 685903 687184 687222 685829 682801 678423 673295 667866 662449 657369 652601 647560 641806 635743
59143F35743n703n500o078o827o830o199n732n678n560n033m256l535l065k925
$$ 635743 630040 624540 618462 611635 604805 598606 592874 587196 581636 576603 572347 568812 565747 562822
59129E62822l013l098l130l177k915j712M47K625L958M584N112N667O044O408
$$ 562822 559809 556711 553581 550404 547489 545777 546224 548849 552807 557391 562503 568170 574214 580622
59115E80622P180Q398R693J0760J1411J1411J0646R329P739O064M676M090M251
$$ 580622 587802 596200 605893 616653 628064 639475 650121 659450 667189 673253 677929 682019 686270
59102F86270M306L572K312J173K95m90j071j343j628k250k907l110k949k855k931
$$ 686270 690576 694148 696460 697633 697928 697438 696367 695024 693396 691146 688239 685129 682180 679325 676394
59087F76394l040l183l233k787j944j699k722m214m954n113n861p327q273p915
$$ 676394 673354 670171 666938 664151 662207 660508 657786 653572 648618 643505 637644 630317 622044 614129
59073F14129o907o118n447m448l343k727k755l082l362l392l044k367j624j065
$$ 614129 607222 601104 595657 591209 587866 585139 582384 579302 575940 572548 569504 567137 565513 564448
59059E64448p77p41p84o07j60J14j08l87lR53J632J605J296J096P25j34j099j448
$$ 564448 563671 562930 562146 561539 561379 561493 561385 560998 560995 561948 563580 565185 566481 567577 568302 568168 567069 565621
59041E65621r50l6O81Q89P59P77J216J784K068K243K895M131N340O016O360O878
$$ 565621 564671 564635 565316 566205 566964 567741 568957 570741 572809 575052 577947 582078 587418 593434 599794 606672
59025F06672P755Q868J0070J1161J1867J2098J1994J1549J0456Q587O404M483
$$ 606672 614427 623295 633365 644526 656393 668491 680485 692034 702490 711077 717481 721964
59013G21964K815R34j224k968l583l160k480k078j757j109j64P81J739K921M141
$$ 721964 724779 725713 724489 721521 717938 714778 712298 710220 708463 707354 707190 707971 709710 712631 716772
58998G16772M881N030N004M966M524L520K532K081J809J042j56j156j706k111
$$ 716772 721653 726683 731687 736653 741177 744697 747229 749310 751119 752161 752005 750849 749143 747032
58984G47032k575l032l536m204m683m221k515j89J718K672L074L789N138O437
$$ 747032 744457 741425 737889 733685 729002 724781 722266 722077 723795 726467 729541 733330 738468 744905
58970G44905O888O818P333Q600R400Q928Q046P878P981P099N207L464K315J000
$$ 744905 751793 758611 765944 774544 783944 792872 800918 808796 816777 823876 829083 832547 834862 835862
58956H35862r16k799m110n288o962r041j1049j2750j4024j4660j4618j4131j3339
$$ 835862 834946 832147 828037 822749 815787 806746 795697 782947 768923 754263 739645 725514 712175
58943G12175j2218j0942r828q811p540o067m911m347m162m149m265m286l938l414
$$ 712175 699957 689015 679187 670376 662836 656769 651858 647511 643349 639200 634935 630649 626711 623297
58929F23297l060k614j572l37L8n47r66o26l73j001j860j847j039l00J52P81J619
$$ 623297 620237 617623 616051 615714 615752 615205 614239 613613 613240 612239 610379 608532 607493 607193 607345 608126 609745
58912F09745K136K256K620L664N036O111O711P118P686Q531R483J0235J0625J0676
$$ 609745 611881 614137 616757 620421 625457 631568 638279 645397 653083 661614 671097 681332 691957 702633
58898G02633J0402R795R017Q424Q275Q651R597J1024J2494J3547J4323J5374J6749
$$ 702633 713035 722830 731847 740271 748546 757197 766794 777818 790312 803859 818182 833556 850305
58885H50305J7770J7899J7253J6045J4061J1139P720M443J503j266l979o724r575
$$ 850305 868075 885974 903227 919272 933333 944472 952192 956635 958138 956872 952893 946169 936594
58872I36594j2183j3796j4132j3918j4043j4478j4567j4083j3371j2587j1552
$$ 936594 924411 910615 896483 882565 868522 854044 839477 825394 812023 799436 787884
58861G87884j0392r718r893j0525j0959j0994j0850j0669j0310r605q593p502
$$ 787884 777492 767774 757881 747356 736397 725403 714553 703884 693574 683969 675376 667874
58849F67874o606o147o212o538o538n816m733m191m645n590o222o416o653p174
$$ 667874 661268 655121 648909 642371 635833 630017 625284 621093 616448 610858 604636 598220 591567 584393
58835E84393p622p519o725n437m035k943k326j968j617j315j095o36K91J297J904
$$ 584393 576771 569252 562527 557090 553055 550112 547786 545818 544201 542886 541791 541155 541446 542743 544647
58820E44647K404L449M806N406M829L941L625L562K869J504L73J89O59Q57J66
$$ 544647 547051 550500 555306 560712 565541 569482 573107 576669 579538 581042 581415 581604 582263 583120 583286
58805E83286j167k320k770k721k620k489k147j862k168l048l825m008l738l392
$$ 583286 582119 579799 577029 574308 571688 569199 567052 565190 563022 559974 556149 552141 548403 545011
58791E45011l142k989k766k101q70L47Q19O96Q94J873L156M125M627M686M296
$$ 545011 541869 538880 536114 534013 533143 533490 534309 535005 535899 537772 540928 545053 549680 554366 558662
58776E58662L705L275K892K101R27j26j013k238l831n074n587n783n885n452m415
$$ 558662 562367 565642 568534 570635 571562 571436 570423 568185 564354 559280 553693 547910 542025 536573 532158
58761E32158l683l932m472m130k720r30P03K009K754K804K505K328K335K358K415
$$ 532158 528475 524543 520071 515941 513221 512291 512994 515003 517757 520561 523066 525394 527729 530087 532502
58746E32502K569K772L108L718M183L761K692K470M012O273P470P173O310N614
$$ 532502 535071 537843 540951 544669 548852 552613 555305 557775 561787 568060 575530 582703 589013 594627
58732E94627N138M950N209N573N475N005M774M871M779M320L877L547K890J831
$$ 594627 599765 604715 609924 615497 620972 625977 630751 635622 640401 644721 648598 652145 655035 656866
58718F56866J114J410K407L282L762M242M900N155M295K438N38o82j479k552m048
$$ 656866 657980 659390 661797 665079 668841 673083 677983 683138 687433 689871 690409 689727 688248 685696 681648
58703F81648n604p143q985j1139j3107j4548j5491j5841j5375j4421j3752j3353
$$ 681648 676044 668901 659916 648777 635670 621122 605631 589790 574415 559994 546242 532889
58691E32889j2152r560o612m843m496m572m278l689l245l206l536l809l418k236
$$ 532889 520737 511177 504565 499722 495226 490654 486376 482687 479442 476236 472700 468891 465473 463237
58677D63237r29k48k01k39M0O77J590K662L773M895N941O559O584O629P480Q810
$$ 463237 462308 462060 461859 461620 461660 462337 463927 466589 470362 475257 481198 487757 494341 500970 508450 517260
58661E17260R319Q466P042N658L680M96l104n713o836o848o069m881m105m269
$$ 517260 526579 535045 542087 547745 551425 551921 548817 543104 536268 529420 523351 518470 514365 510096
58647E10096m792m750m098l357k591j602p52n89q71q13j22R48K212L395L743K723
$$ 510096 505304 500554 496456 493099 490508 488906 488154 487565 486694 485881 485759 486707 488919 492314 496057 498780
58631D98780R77l17p82q40o79j77L99O39Q37J648K886L630L534L234L280L535
$$ 498780 499757 499440 498658 497818 497139 496962 497361 498000 498837 500485 503371 507001 510535 513769 517049 520584
58615E20584L783M191M873N554N914N886N479M649L400J872L77n86p16n03q62
$$ 520584 524367 528558 533431 538985 544899 550785 556264 560913 564313 566185 566562 565976 565260 564757 563895
58600E63895j887k595k305j574j207j132r92j017j335j134L25K411L954M867N807
$$ 563895 562008 559413 557108 555534 554327 553195 552203 551186 549851 548717 549042 551453 555407 560274 566081
58585E66081O745P219P618Q699J0036J0374R546Q590P953P031N710M895N016N354
$$ 566081 572826 580045 587663 596362 606398 616772 626318 634908 642861 649892 655602 660497 665513 670867
58571F70867N446N999P643R776J1473J2825J4573J6835J8964K0451K1416K2266
$$ 670867 676313 682312 689955 699731 711204 724029 738602 755437 774401 794852 816268 838534
58559H38534K3098K3410K2425J9828J6089J1851P392L013n59k826m277n728p128
$$ 838534 861632 885042 907467 927295 943384 955235 962627 965640 965081 962255 957978 952250 945122
58546I45122p742p329o441n773n912p413j0247j3338j5552j6952j8261j9426j9747
$$ 945122 937380 930051 923610 917837 911925 904512 894265 880927 865375 848423 830162 810736 790989
58533G90989j9241j8611j7840j6075j3128j0068p934o708n828m911l713k140n74
$$ 790989 771748 753137 735297 719222 706094 696026 688092 681384 675556 670645 666932 664792 664218
58520F64218M01P31Q41Q48N40N9j48q8j88m94o95q67j390k122k456k243j939j843
$$ 664218 664619 665350 666191 667039 667579 667638 667490 667402 667214 666720 666025 665158 663768 661646 659190 656947 655008 653165
58502F53165j891k083k389k376j752j080j113j618j755j415j116q10R6J603L160
$$ 653165 651274 649191 646802 644426 642674 641594 640481 638863 637108 635693 634577 633767 633863 635466 638626
58487F38626M673O358P706P914P406P617R071J0850J2174J3282J4407J5053J4731
$$ 638626 643299 649657 657363 665277 672683 680300 689371 700221 712395 725677 740084 755137 769868
58474G69868J3551J1745R336O433L159n90m510p344q113p605p382p500o680m581
$$ 769868 783419 795164 804500 810933 814092 813502 808992 801648 793535 785930 778548 771048 764368 759787
58460G59787k298m74J432L698N708P184Q603R903J0169R088P447N747L581Q23
$$ 759787 757489 757015 758447 762145 767853 775037 783640 793543 803712 812800 820247 825994 829575 830398
58446H30398j830m006o114q228r682j0187j0173r714q372o414m831l785k378l51
$$ 830398 828568 824562 818448 810220 800538 790351 780178 770464 762092 755678 750847 747062 744684 744333
58432G44333J425K581L903N757P349Q152Q748R560J0052R798R171Q387P098N351
$$ 744333 745758 748339 752242 757999 765348 773500 782248 791808 801860 811658 820829 829216 836314 841665
58418H41665L727K154Qk297l499l662m392o191p524p341o697o752o903o252n376
$$ 841665 845392 847546 847554 845257 841758 838096 833704 827513 819989 812648 805951 799199 792296 786044 780668
58403G80668n200n309m711l322j662L1J475K203K465L168M299M694M014L399L469
$$ 780668 775468 770159 765448 762126 760464 760495 761970 764173 766638 769806 774105 778799 782813 786212 789681
58388G89681L286K295J554J918K607K837L352M877O471O912O554O399O432O188
$$ 789681 792967 795262 796816 798734 801341 804178 807530 812407 818878 825790 832344 838743 845175 851363
58374H51363N958O110O195N905N884O535P101P014P025P840Q854R391J0053J1558
$$ 851363 857321 863431 869626 875531 881415 887950 895051 902065 909090 916930 925784 935175 945228 956786
58360I56786J3278J4148J4022J3183J1558R464P911P146N999L712J275M5J87J254
$$ 956786 970064 984212 998234 1011417 1022975 1032439 1040350 1047496 1053495 1057207 1058482 1058527 1058714 1059968
58346A059968K956M546N053M951N888P971R240Q912Q913J0814J3355J4718J5234
$$ 1059968 1062924 1067470 1072523 1077474 1083362 1091333 1100573 1109485 1118398 1129212 1142567 1157285 1172519
58333A172519J5974J6576J6447J6425J7149J7351J5783J3429J1763J0276P770
$$ 1172519 1188493 1205069 1221516 1237941 1255090 1272441 1288224 1301653 1313416 1323692 1331462
58322A331462M852L028K442K438L222N066O945P764Q034Q773R814J0637J1580
$$ 1331462 1336314 1339342 1341784 1344222 1347444 1352510 1359455 1367219 1375253 1384026 1393840 1404477 1416057
58309A416057J2822J3562J3576J3995J5259J6103J5953J6222J7672J8755J8447
$$ 1416057 1428879 1442441 1456017 1470012 1485271 1501374 1517327 1533549 1551221 1569976 1588423
58298A588423J8306J9619K0890K0557J9908K0694K1995K2184K1995K2859K4115
$$ 1588423 1606729 1626348 1647238 1667795 1687703 1708397 1730392 1752576 1774571 1797430 1821545
58287A821545K4603K5150K6777K8293K8454K8521K9902L1341L1287L1008L2276
$$ 1821545 1846148 1871298 1898075 1926368 1954822 1983343 2013245 2044586 2075873 2106881 2139157
58276B139157L4100L4940L5975L8853M2292M4377M6154M9346N2665N4177N5234
$$ 2139157 2173257 2208197 2244172 2283025 2325317 2369694 2415848 2465194 2517859 2572036 2627270
58265B627270N8077O1471O2874O3173O5057O8196P0223P1067P2334P3815P4432
$$ 2627270 2685347 2746818 2809692 2872865 2937922 3006118 3076341 3147408 3219742 3293557 3367989
58254C367989P5112P7005P8710P9062Q0385Q4893R0328R3647R6480J02044J09179
$$ 3367989 3443101 3520106 3598816 3677878 3758263 3843156 3933484 4027131 4123611 4225655 4334834
58243D334834J14712J19396J26002J33734J40200J46786J56223J67007J76125
$$ 4334834 4449546 4568942 4694944 4828678 4968878 5115664 5271887 5438894 5615019
58234E615019J85113J97158K10611K21992K33138K48334K66437K83244K99676
$$ 5615019 5800132 5997290 6207901 6429893 6663031 6911365 7177802 7461046 7760722
58225G760722L20097L44328L69129L95793M28290M65613N04172N45913N95682
$$ 7760722 8080819 8425147 8794276 9190069 9618359 10083972 10588144 11134057 11729739
58216A1729739O52701P13567P81380Q62321R55732J057981J173783J312785J477706
$$ 11729739 12382440 13096007 13877387 14739708 15695440 16753421 17927204 19239989 20717695
58207B0717695J667947J892669K168007K505026K915395L426355M073490M879447
$$ 20717695 22385642 24278311 26446318 28951344 31866739 35293094 39366584 44246031
58199D4246031N854757P015529Q380968R957623J1750283J3785708J6092533J8644137
$$ 44246031 50100788 57116317 65497285 75454908 87205191 100990899 117083432 135727569
58191A35727569K1336599K4018311K6506547K8558366K9828927K9827353K7878030
$$ 135727569 157064168 181082479 207589026 236147392 265976319 295803672 323681702
58184C23681702K3222684J5423494M906400o865021j7898842k6529440l1955317
$$ 323681702 346904386 362327880 367234280 360369259 342470417 315940977 283985660
58177B83985660l4195472l3761811l1399522k7925377k4059047k0288096j6867033
$$ 283985660 249790188 216028377 184628855 156703478 132644431 112356335 95489302
58170I5489302j3908162j1442886r435129p809698o497791n448377m609027l925565
$$ 95489302 81581140 70138254 60703125 52893427 46395636 40947259 36338232 32412667
58162C2412667l361621k898239k514854k188108j907223j672469j478055j310867
$$ 32412667 29051046 26152807 23637953 21449845 19542622 17870153 16392098 15081231
58154A5081231j164834j041993r39473q48394p65478o93645o31255n72007n15379
$$ 15081231 13916397 12874404 11934931 11086537 10321059 9627414 8996159 8424152 7908773
58145G908773m66434m25256l86570l49769l19563k96453k75783k56429k41570
$$ 7908773 7442339 7017083 6630513 6280744 5961181 5664728 5388945 5132516 4890946
58136D890946k30480k18172k03806j91402j81567j70377j57191j45992j37933
$$ 4890946 4660466 4442294 4238488 4047086 3865519 3695142 3537951 3391959 3254026
58127C254026j29697j20338j12891j08014j02514r5467q9690q5891q1229p4945
$$ 3254026 3124329 3003991 2891100 2783086 2680572 2585105 2495415 2409524 2328295 2253350
58117B253350o9802o6674o3093n8460n5382n4442n2701m8913m5560m4170m3025
$$ 2253350 2183548 2116874 2053781 1995321 1939939 1885497 1832796 1783883 1738323 1694153 1651128
58106A651128m1022l9576l9205l8096l5554l3325l2233l0888k8749k7206k6704
$$ 1651128 1610106 1570530 1531325 1493229 1457675 1424350 1392117 1361229 1332480 1305274 1278570
58095A278570k5970k4827k4612k5173k4702k3056k2096k2204k1672k0093j9085
$$ 1278570 1252600 1227773 1203161 1177988 1153286 1130230 1108134 1085930 1064258 1044165 1025080
58084A025080j9090j8577j7071j5986j5929j6019j6213j7353j8689j8356j6595
$$ 1025080 1005990 987413 970342 954356 938427 922408 906195 888842 870153 851797 835202
58073H35202j5512j5529j5144j4220j4101j4376j3108j0593r326r703r410p734
$$ 835202 819690 804161 789017 774797 760696 746320 733212 722619 713293 703590 694180 686446
58061F86446o783p486p984p217o717p475q173p947p933q708q979q129p473p673
$$ 686446 679663 672177 664193 656976 650259 642784 634611 626664 618731 610023 601044 592915 585442 577769
58047E77769p508o372n466n401n143m386m405n483o084n663n619o409o471n292
$$ 577769 570261 563889 558423 553022 547879 543493 539088 533605 527521 521858 516239 509830 503359 498067
58033D98067m687n638o528o164n884o941q202q261p641p183o373m999m329m957
$$ 498067 493380 487742 481214 475050 469166 462225 454023 445762 438121 430938 424565 419566 415237 410280
58019D10280n392m511l439l359l424k657j926k168k456j763j023j402k046j546
$$ 410280 404888 400377 396938 393579 390155 387498 385572 383404 380948 379185 378162 376760 374714 373168
58005C73168l59J40j28m11p13j196j106M8J213J223N66L29L97J36k14l05p77k055
$$ 373168 372809 372949 372821 372410 371697 370501 369395 369443 370656 371879 372445 372774 373171 373307 373093 372788 372011 369956
57987C69956l045k593j448j136j574j407k07J067J497R33k74j371j531r26p88
$$ 369956 366911 364318 362870 361734 360160 358753 358546 359613 361110 362043 361769 360398 358867 357941 357153
57972C57153j659k410j895o63Oo2k15l21o77j076j046o25j74J38J47l25q41n80
$$ 357153 355494 353084 351189 350526 350532 350470 350255 349934 349257 348181 347135 346510 346336 346474 346621 346296 345455 344875
57954C44875K65L86p29j929k163j866j684j197l1R87J176J427K817M660N472N209
$$ 344875 345140 345526 344797 342868 340705 338839 337155 335958 335927 336914 338090 339517 342334 346994 352466 357675
57938C57675N101N697O484P099P652P980P747P148O654O225N551M724L905K710
$$ 357675 362776 368473 374957 382056 389708 397688 405435 412583 419237 425462 431013 435737 439642 442352
57924D42352P42j535l175l799l703l370l296l866m832n394n228m856m646m310
$$ 442352 443094 441559 438384 434585 430882 427512 424216 420350 415518 410124 404896 400040 395394 391084
57910C91084l845l979m905n490m672k912j390n01k8r8r12k047k951l678m397m688
$$ 391084 387239 383260 378355 372865 368193 365281 363891 363390 363362 363264 362352 360305 357354 353676 349279 344591
57894C44591m187l341k728k090r47L03Q07M91J25L53J176K122K506J948J010O98
$$ 344591 340404 337063 334335 332245 331298 331601 332408 332899 333024 333377 334553 336675 339181 341129 342139 342837
57878C42837J121J317P14j57p64j308j786j524m22M68M71L41Q44J387J185P27
$$ 342837 343958 345275 345989 345832 345068 343760 341974 340450 340028 340496 340967 341308 342152 343539 344724 345451
57862C45451Q57J319J487J733K664L730L955L488L093K698J779O57O6j61o50j176
$$ 345451 346308 347627 349114 350847 353511 357241 361196 364684 367777 370475 372254 372911 372977 372816 372166 370990
57846C70990j165j056j703k731l008k603k758l834m757m750m317m113l936l330
$$ 370990 369825 368769 367066 364335 361327 358724 355966 352132 347375 342625 338308 334195 330259 326929
57832C26929k384j531j036q92p81j88R74K035K374K262K335K600K645K447K227
$$ 326929 324545 323014 321978 321086 320305 320117 321091 323126 325500 327762 330097 332697 335342 337789 340016
57817C40016J842J143N14K65j36j304k825l806m159m386m445l895k918k140j589
$$ 340016 341858 343001 343515 343780 343644 342340 339515 335709 331550 327164 322719 318824 315906 313766 312177
57802C12177q53JO00J093J794K273J952J300J258J652J514Q38O66J321J894J789
$$ 312177 311324 311325 311925 313018 314812 317085 319037 320337 321595 323247 324761 325599 326265 327586 329480 331269
57786C31269J495J512J595J511J546J866K183K384K659K834K474J855J846K505
$$ 331269 332764 334276 335871 337382 338928 340794 342977 345361 348020 350854 353328 355183 357029 359534
57772C59534K817K196J293P88L21o95j986k882l350l814m324m513m200l559k793
$$ 359534 362351 364547 365840 366628 366949 366254 364268 361386 358036 354222 349898 345385 341185 337626 334833
57757C34833k032j428j163j284j529j281QK059L746M223L859L610L761L879L704
$$ 334833 332801 331373 330210 328926 327397 326116 326124 328183 331929 336152 340011 343621 347382 351261 354965
57742C54965L371K907K289J865J999K312K026J101K34k55p58j450j860j640j131
$$ 354965 358336 361243 363532 365397 367396 369708 371734 372835 373069 372814 372056 370606 368746 367106 365975
57727C65975q50q79r76r13o12k99m24j026j386q94m5J61l56p62o78n78p67q79
$$ 365975 365125 364246 363270 362357 361745 361446 361022 359996 358610 357716 357671 357832 357476 356714 356036 355458 354691 353812
57709C53812o92n87q36j120j129j011q69l82O74J951K868L133K775K039J339R07
$$ 353812 353120 352533 351697 350577 349448 348437 347568 347186 347860 349811 352679 355812 358587 360626 361965 362872
57693C62872M82k86j179j747k174l073m296m771l806j936j26J304K608L984N461
$$ 362872 363354 363068 361889 360142 357968 354895 350599 345828 342022 340086 339960 341264 343872 347856 353317
57678C53317P172R355J2131J5404J8924K2549K6526L1210L6261M0521M3151M4377
$$ 353317 360489 369844 381975 397379 416303 438852 465378 496588 532849 573370 616521 660898
57666F60898M4406M1976L4965K2486N869j2171k8629m0863m7485m9005m7026m2775
$$ 660898 705304 747280 782245 804731 810600 798429 769800 728937 681452 632447 585421 542646
57654E42646l6898l0348k4367j9523j5598j2478j0267q558o605m383k572j410
$$ 542646 505748 475400 451033 431510 415912 403434 393167 384609 378004 373621 371049 369639
57642C69639n44k9l42j190j484q91l08l20k82M75J528K142K276K171J709Q88K39
$$ 369639 369095 369066 368724 367534 366050 365159 364851 364531 364249 364724 366252 368394 370670 372841 374550 375438 375677
57625C75677R0M6k48m76l20j09k09l93m01m65p14p37l34j7j21r2O11J500J765
$$ 375677 375767 375813 375565 375089 374769 374660 374451 374058 373657 373192 372478 371741 371407 371390 371269 371177 371788 373288 375053
57606C75053J409R33L87l93j006q40k1P40J075J111Q77K55n98j291j557j238k41
$$ 375053 376462 377395 377782 377389 376383 375543 375522 376262 377337 378448 379325 379580 378982 377691 376134 374896 374655
57589C74655J047J651R56m80j522j665j154l00P15J539J776J423P90J36l13k81
$$ 374655 375702 377353 378309 377829 376307 374642 373488 373188 373903 375442 377218 378641 379431 379567 379254 378973
57573C78973K13P00Q59J005J473J906J706R91M47M17O80J067J645K293K637K624
$$ 378973 379186 379886 380745 381750 383223 385129 386835 387826 388273 388690 389370 390437 392082 394375 397012 399636
57557C99636K659L030L452L437K958K563K801L578M239M315M043L867L722L259
$$ 399636 402295 405325 408777 412214 415172 417735 420536 424114 428353 432668 436711 440578 444300 447559
57543D47559K677K601L098L456L256K970L117L387L210K680K361K401K440K247
$$ 447559 450236 452837 455935 459391 462647 465617 468734 472121 475331 478011 480372 482773 485213 487460
57529D87460K039K193K875L849M547M571M222M198M640M930M576L832L199K831
$$ 487460 489499 491692 494567 498416 502963 507534 511756 515954 520594 525524 530100 533932 537131 539962
57515E39962K737L033L617M049M152M280M646M873M614M134L809L532L094K704
$$ 539962 542699 545732 549349 553398 557550 561830 566476 571349 575963 580097 583906 587438 590532 593236
57501E93236K622K692K702K832L197L378K994K363K032J979J922K041K729L735
$$ 593236 595858 598550 601252 604084 607281 610659 613653 616016 618048 620027 621949 623990 626719 630454
57487F30454M271L964L246K812K988L534L861L534K801K360K523K963L366L762
$$ 630454 634725 638689 641935 644747 647735 651269 655130 658664 661465 663825 666348 669311 672677 676439
57473F76439M087M016L576L255L209L073K906L422M753N873O001N711N825O082
$$ 676439 680526 684542 688118 691373 694582 697655 700561 703983 708736 714609 720610 726321 732146 738228
57459G38228N931N781O279O954O914O385O262O468O229N697N816O554O766O042
$$ 738228 744159 749940 756219 763173 770087 776472 782734 789202 795431 801128 806944 813498 820264 826306
57445H26306N367N522O142O727P455Q345Q711Q196P550P638Q219Q397P864P127
$$ 826306 831673 837195 843337 850064 857519 865864 874575 882771 890321 897959 906178 914575 922439 929566
57431I29566O823P167P849Q182P731O951O821P627Q617R025Q937Q850Q911Q995
$$ 929566 936389 943556 951405 959587 967318 974269 981090 988717 997334 1006359 1015296 1024146 1033057 1042052
57417A042052R142R464R839J0041J0020R886R784R829J0015J0164J0197J0355
$$ 1042052 1051194 1060658 1070497 1080538 1090558 1100444 1110228 1120057 1130072 1140236 1150433 1160788
57405A160788J0826J1258J1135J0597J0278J0355J0347J0016R787R989J0303J0330
$$ 1160788 1171614 1182872 1194007 1204604 1214882 1225237 1235584 1245600 1255387 1265376 1275679 1286009
57393A286009J0240J0433J0911J1440J2011J2670J3141J3128J2885J3056J3838
$$ 1286009 1296249 1306682 1317593 1329033 1341044 1353714 1366855 1379983 1392868 1405924 1419762
57382A419762J4651J4744J3993J3022J2551J2793J3402J3898J4043J3883J3655
$$ 1419762 1434413 1449157 1463150 1476172 1488723 1501516 1514918 1528816 1542859 1556742 1570397
57371A570397J3636J3901J4247J4551J5055J5941J6668J6446J5440J4856J5365
$$ 1570397 1584033 1597934 1612181 1626732 1641787 1657728 1674396 1690842 1706282 1721138 1736503
57360A736503J6179J6232J5683J5501J5978J6546J6818J6979J7201J7377J7482
$$ 1736503 1752682 1768914 1784597 1800098 1816076 1832622 1849440 1866419 1883620 1900997 1918479
57349A918479J7578J7567J7416J7517J8194J8989J9132J8616J8175J8257J8661
$$ 1918479 1936057 1953624 1971040 1988557 2006751 2025740 2044872 2063488 2081663 2099920 2118581
57338B118581J9082J9332J9109J8376J7888J8494J9844K0657K0430K0017K0271
$$ 2118581 2137663 2156995 2176104 2194480 2212368 2230862 2250706 2271363 2291793 2311810 2332081
57327B332081K0989K1558K1867K2111K2294K2382K2506K2629K2433K1837K1247
$$ 2332081 2353070 2374628 2396495 2418606 2440900 2463282 2485788 2508417 2530850 2552687 2573934
57316B573934K1087K1444K2282K3462K4479K4811K4666K4801K5381K5749K5581
$$ 2573934 2595021 2616465 2638747 2662209 2686688 2711499 2736165 2760966 2786347 2812096 2837677
57305B837677K5493K6029K6751K6945K6701K6656K7012K7460K7858K8405K9161
$$ 2837677 2863170 2889199 2915950 2942895 2969596 2996252 3023264 3050724 3078582 3106987 3136148
57294C136148K9786K9871K9341K8617K8380K9001L0146L1166L1799L2248L2628
$$ 3136148 3165934 3195805 3225146 3253763 3282143 3311144 3341290 3372456 3404255 3436503 3469131
57283C469131L2816L2830L2928L3189L3410L3482L3506L3567L3746L4227L4936
$$ 3469131 3501947 3534777 3567705 3600894 3634304 3667786 3701292 3734859 3768605 3802832 3837768
57272C837768L5248L4686L3736L3244L3141L2647L1675L0980L0786L0379K9403
$$ 3837768 3873016 3907702 3941438 3974682 4007823 4040470 4072145 4103125 4133911 4164290 4193693
57261D193693K8487K8114K7824K7205K6754K7036K7736K8287K8769K9450L0084
$$ 4193693 4222180 4250294 4278118 4305323 4332077 4359113 4386849 4415136 4443905 4473355 4503439
57250D503439L0389L0661L1103L1062K9867K8062K6893K6720K6784K6419K5790
$$ 4503439 4533828 4564489 4595592 4626654 4656521 4684583 4711476 4738196 4764980 4791399 4817189
57239D817189K5322K5050K4736K4336K4110K4324K4791K4871K4302K3829K4408
$$ 4817189 4842511 4867561 4892297 4916633 4940743 4965067 4989858 5014729 5039031 5062860 5087268
57228E087268K5763K6577K6271K5728K5850K6361K6579K6459K6166K5436K4226
$$ 5087268 5113031 5139608 5165879 5191607 5217457 5243818 5270397 5296856 5323022 5348458 5372684
57217E372684K3198K2653K1625J9206J6183J4182J3495J2909J1529R608P619N554
$$ 5372684 5395882 5418535 5440160 5459366 5475549 5489731 5503226 5516135 5527664 5537272 5544891 5550445
57205E550445L407J446j85j575k693l441m039m774n517o065o661p489p961p383
$$ 5550445 5553852 5555298 5555113 5553538 5550845 5547404 5543365 5538591 5533074 5527009 5520348 5512859 5504898 5497515
57191E497515o184n476n537n717n799o310p293p945p916p979q832j0075j0958
$$ 5497515 5491331 5485855 5480318 5474601 5468802 5462492 5455199 5447254 5439338 5431359 5422527 5412452 5401494
57178E401494j1416j1707j1729j1396j1206j1651j2448j2998j3355j3997j4805
$$ 5401494 5390078 5378371 5366642 5355246 5344040 5332389 5319941 5306943 5293588 5279591 5264786
57167E264786j5044j4385j3329j2419j1533j0282q791p665p311p538p860p926
$$ 5264786 5249742 5235357 5222028 5209609 5198076 5187794 5179003 5171338 5164027 5156489 5148629 5140703
57155E140703p628p053o538o623p600r190j0952j3004j5965k0072k4757k9278
$$ 5140703 5133075 5126022 5119484 5112861 5105261 5096071 5085119 5072115 5056150 5036078 5011321 4982043
57143D982043l3361l6991l9976m2145m3718m5040m6064m6406m5740m3877m0673
$$ 4982043 4948682 4911691 4871715 4829570 4785852 4740812 4694748 4648342 4602602 4558725 4518052
57132D518052l6302l1381k6564k2135j8312j5668j4789j5627j7584k0017k2373
$$ 4518052 4481750 4450369 4423805 4401670 4383358 4367690 4352901 4337274 4319690 4299673 4277300
57121D277300k4095k4809k4446k2847j9618j4814r275l713K116Q584J5011K0441
$$ 4277300 4253205 4228396 4203950 4181103 4161485 4146671 4137396 4133683 4135799 4144383 4159394 4179835
57109D179835K5416L1929M1565N4659P1373R2426J18383J49343J86093K30868
$$ 4179835 4205251 4237180 4278745 4333404 4404777 4497203 4615586 4764929 4951022 5181890
57099E181890K86299L53992M34279N26271O27300P33084Q39613R44861J048096
$$ 5181890 5468189 5822181 6256460 6782731 7410031 8143115 8982728 9927589 10975685
57090A0975685J147824J240682J321202J381258J410197J397404J335857J223552
$$ 10975685 12123509 13364191 14685393 16066651 17476848 18874252 20210109 21433661
57082B1433661J063132Q62728O37242M05182J80203l5050k45867m56542o65489
$$ 21433661 22496793 23359521 23996763 24401945 24582148 24547098 24301231 23844689 23179200
57073B3179200q67542j057148j227172j366541j462519j506611j498364j444559
$$ 23179200 22311658 21254510 20027338 18660797 17198278 15691667 14193303 12748744
57065A2748744j356478j247406j129812j012451q99617p93244o95178o07241n30114
$$ 12748744 11392266 10144860 9015048 8002597 7102980 6309736 5614558 5007317 4477203
57056D477203m63123m05021l54629l11085k73861k42401k15548j91791j70264
$$ 4477203 4014080 3609059 3254430 2943345 2669484 2427083 2211535 2019744 1849480
57047A849480j51069j34390j19830j06954r5806q6372p7960o9706o1329n2974
$$ 1849480 1698411 1564021 1444191 1337237 1241431 1155059 1077099 1007393 946064 893090
57037H93090m4693l6590k9026k2123j5351q106m60P041J3953J9897K4288K6395
$$ 893090 848397 811807 782781 760658 745307 737201 736741 743782 757735 777632 801920 828315
57025H28315K5204J9056O416j2002l2357m9737o0959o5253o3400n7402n0148m3797
$$ 828315 853519 872575 878991 866989 834632 784895 723936 658683 595283 537881 487733 443936
57013D43936l8397l2980k7645k3414k0405j7583j4438j1614r705q532p864p714
$$ 443936 405539 372559 344914 321500 301095 283512 269074 257460 247755 239223 231359 223645
57001B23645p595o598m701l077k567k643k371j600o96K24J132J754K024K514L883
$$ 223645 216050 209452 204751 201674 199107 196464 194093 192493 191797 192021 193153 194907 196931 199445 203328
56986B03328O022Q085R154Q812P297N192K719m99m583q583j1203j2207j2365j2081
$$ 203328 209350 217435 226589 235401 242698 247890 250609 250110 245527 236944 225741 213534 201169 189088
56972A89088j1027r236p466o093m487k050P82L078M540N617O937Q856J1224J3435
$$ 189088 178061 168825 161359 155266 150779 148729 149511 152589 157129 162746 169683 178539 189763 203198
56958B03198J5005J6091J6829J6345J3308P630P99n719j1457j6106j8771j8854
$$ 203198 218203 234294 251123 267468 280776 288406 289205 283486 272029 255923 237152 218298
56946B18298j6990j4419j1835r301o766m209j623Q09K954N257Q347J1945J4973
$$ 218298 201308 186889 175054 165753 158987 154778 153155 153964 156918 162175 170522 182467 197440
56933A97440J7028J8844K0827K1999K1047J7660J2181M837l847j2411j9169k3320
$$ 197440 214468 233312 254139 276138 297185 314845 327026 331863 328016 315605 296436 273116
56921B73116k4900k4264k2217k0014j8326j6590j4056j1064q541o758n370m297
$$ 273116 248216 223952 201735 181721 163395 146805 132749 121685 113144 106386 101016 96719
56909I6719l671l173k327j363r69j204j311o39P47K340L577M086M019M055M717
$$ 96719 93048 89875 87548 86185 85216 84012 82701 82062 82809 85149 88726 92812 96831 100886 105603
56894A05603N788O787P752R072J0732J2215J3092J3366J3307J3167J2898J1909
$$ 105603 111391 118178 125930 135002 145734 157949 171041 184407 197714 210881 223779 235688
56882B35688R392N180P1m815q740j1323j2380j2017j0455p635l575P65L891N530
$$ 235688 245080 250260 250331 245516 236776 225453 213073 201056 190601 182966 179391 180156 184047 189577
56868A89577P132J0083J4121J8157K1843K5477K8936L1663L3384L4038L3227L0306
$$ 189577 196709 206792 220913 239070 260913 286390 315326 346989 380373 414411 447638 477944
56856D77944K4705J5943M082r146k0537k7652l0462l0221k7633k3031j7337j1404
$$ 477944 502649 518592 522674 513528 492991 465339 434877 404656 377023 353992 336655 325251
56844C25251n007K220R331J5011J9630K4875L1432L8445M5155N1479N6747N9321
$$ 325251 320244 322464 331795 346806 366436 391311 422743 461188 506343 557822 614569 673890
56832F73890N7904N2076M1332K5049M190j7958l7445n1611n9343o0684n6955n0426
$$ 673890 731794 783870 825202 850251 854441 836483 799038 747427 688084 627400 570445 520019
56820E20019m2969l5181k7021j8703j0647l128L676R793J5708K1945K8165L3368
$$ 520019 477050 441869 414848 396145 385498 382370 386046 395839 411547 433492 461657 495025
56808D95025L7102L9648M0623L8284L0859J8209J918j5542l1384m3094m9497n1195
$$ 495025 532127 571775 612398 650682 681541 699750 701668 686126 654742 611648 562151 510956
56796E10956m9597m5739m0219l3704k6887k0136j3674p921l256M90L982P759J1828
$$ 510956 461359 415620 375401 341697 314810 294674 281000 273079 269823 270313 274295 282054 293882
56783B93882J5783J9225K1907K3419K2797J8951J1752K459p302j6554k4618l0353
$$ 293882 309665 328890 350797 374216 397013 415964 427716 430175 422873 406319 381701 351348
56771C51348l2728l2062k9826k7138k4153k0853j7583j4623j1937r635p998o872
$$ 351348 318620 286558 256732 229594 205441 184588 167005 152382 140445 130810 122812 115940
56759A15940n682m310l362l267l670l936l764l104k084j227j116j536j539p26
$$ 115940 110258 105948 102586 99319 95649 91713 87949 84845 82761 81534 80418 78882 77343 76617
56745G6617J41K36k32m82l43k87n81q77p21q0O35R70P88L06j62m10k85K08O66
$$ 76617 76758 76994 76762 76280 75937 75650 75069 74192 73471 73391 74026 74996 75784 76090 75928 75518 75233 75441 76107
56726G6107N97K25L88J219J644R52J46O03J888K327J549R51J437K084J724O35
$$ 76107 76704 76929 77317 78536 80180 81132 81278 81881 83769 86096 87645 88596 90033 92117 93841 94476
56710I4476j6L00J202J949J936J115K51J30M58L45j73j73M63P15J84j65L08Q19
$$ 94476 94460 94760 95962 97911 99847 100962 101213 101343 101801 102146 101973 101800 102263 102978 103162 102997 103305 104124
56692A04124N84J53K89N92M21K48Q08J610J611Q95L83K40j65r14j364j267j050
$$ 104124 104708 104861 105150 105742 106163 106411 107219 108829 110440 111335 111718 111958 111793 110879 109515 108248 107198
56675A07198r59q39p54r30j108p33J61R69J393J666J933K140K429K938L235K756
$$ 107198 106239 105400 104646 103716 102608 101875 102036 103005 104398 106064 107997 110137 112566 115504 118739 121495
56659A21495J813J363J663J922J526Q26L81J13k80n93l85K10N28K44j72o8N28
$$ 121495 123308 124671 126334 128256 129782 130608 130989 131102 130822 130229 129844 130054 130582 130826 130654 130586 131114
56642A31114R08O17J15J48O54P81J19o72p91l72j89n50r99j007n98l00o48j625
$$ 131114 132022 132639 132754 132902 133556 134337 134456 133784 132993 132621 132432 131882 130883 129876 129278 128978 128330 126705
56624A26705k509k510j707j004j005j350j401j097p46m30r3Q0p9l23l12j70k55
$$ 126705 124196 121686 119979 118975 117970 116620 115219 114122 113376 112946 112853 112933 112854 112531 112219 112049 111794
56607A11794n74p84o92m04j00J08J81K64N77J061J391J432J311R63J70p59r73
$$ 111794 111220 110436 109744 109340 109240 109348 109529 109793 110370 111431 112822 114254 115565 116528 116698 115939 114966
56590A14966j48R50J460J448J506J842K252K529K368J436M9p34l59L95N25J66
$$ 114966 114818 115768 117228 118676 120182 122024 124276 126805 129173 130609 130658 129924 129565 129960 130485 130651
56574A30651J39O30J251J919K691L043K419J454J575L224N318O603O824O469O127
$$ 130651 130790 131420 132671 134590 137281 140324 142743 144197 145772 148996 154314 160917 167741 174210 180337
56559A80337O276O970P493O915N247L488K347J451J89j170j718j131k40j64j055
$$ 180337 186613 193583 201076 207991 213238 216726 219073 220524 220713 219543 217825 216694 216454 216290 215235
56544B15235j965k101j815j914k287k084j286j023j872k875k902k231j863j987
$$ 215235 213270 211169 209354 207440 205153 203069 201783 200760 198888 196013 193111 190880 189017 187030
56530A87030k088k055k075j877j151m86p95j930k802k809k241j465o89m24j087
$$ 187030 184942 182887 180812 178935 177784 177298 176503 174573 171771 168962 166721 165256 164567 164143 163056
56515A63056k102k418j967j677j880j781q26L37P07Q7r12j569j492q67l02o8L04
$$ 163056 160954 158536 156569 154892 153012 151231 150405 150742 151449 151536 150624 149055 147563 146696 146394 146326 146630
56498A46630J133J720J227J08m79m87r13j856k149j271k77j26k76K28J195J734
$$ 146630 147763 149483 150710 150818 150339 149852 148939 147083 144934 143663 143386 143260 142984 143212 144407 146141
56482A46141J573J115O78L85L72N10L47j82m31O4Q01J019O77L20K86N70J046J376
$$ 146141 147714 148829 149507 149892 150264 150774 151121 150939 150508 150572 151373 152392 153069 153389 153675 154245 155291 156667
56464A56667J080J84n35m34J97N85M02j18o10p20j94P42J400J420J167J043Q78
$$ 156667 157747 157931 157396 156962 157159 157744 158146 158028 157418 156698 156504 157246 158646 160066 161233 162276 163154
56447A63154M56J46L46P24P00M10M36P33O07j73r92j268j104p99k74N51J220J165
$$ 163154 163610 163756 164102 164826 165526 165936 166372 167105 167712 167539 166547 165279 164175 163376 163102 163653 164873 166038
56429A66038O01M10R81J625J495Q09O10J367K363K626J992R37j43j009j323r49
$$ 166038 166639 167049 168030 169655 171150 171959 172569 173936 176299 178925 180917 181854 181711 180702 179379 178430
56413A78430l88l27p41r22m70K14N47M98N13Q75J309J212M22l63k63O20J229J010
$$ 178430 178042 177715 176974 176052 175582 175796 176343 176841 177354 178229 179538 180750 181172 180809 180546 181166 182395 183405
56395A83405O41Q60J253R88K13k55k18j28n8L05P51P30M20N51J122J364J127J141
$$ 183405 184046 184906 186159 187147 187360 187105 186887 186759 186701 187006 187757 188487 188907 189458 190580 191944 193071 194212
56377A94212J595J678J054O64J293K260K400J665R03N45L82L47O48J198J516J292
$$ 194212 195807 197485 198539 199203 200496 202756 205156 206821 207724 208269 208651 208998 209646 210844 212360 213652
56361B13652O99J79P2L52O05M58O7l2M17J172J899K346K222J433N09K60P97J408
$$ 213652 214351 214530 214602 214954 215559 216017 216084 216052 216469 217641 219540 221886 224108 225541 226050 226310 227107 228515
56343B28515J466J053N74L28N28J193J868J964J552J273J407J595J587J648J940
$$ 228515 229981 231034 231608 231936 232464 233657 235525 237489 239041 240314 241721 243316 244903 246551 248491
56328B48491K164K079J912J945K087K070J799J368R43O47L63n4k39M42J671K028
$$ 248491 250655 252734 254646 256591 258678 260748 262547 263915 264858 265505 265868 265814 265575 266017 267688 269716
56312B69716R11k55J09J387J873J601K084L448M067L398L054M212N839O505O293
$$ 269716 270627 270372 270481 271868 273741 275342 277426 280874 284941 288339 291393 295605 301444 307949 314242
56297C14242N796M753K978J454J109J425J469J385J761K381K782L218M008M647
$$ 314242 320038 324791 327769 329223 330332 331757 333226 334611 336372 338753 341535 344753 348761 353408
56283C53408M649M504M764N002M743M618N364O540P415Q341R884J1281J1374J0575
$$ 353408 358057 362561 367325 372327 377070 381688 387052 393592 401007 409348 419232 430513 441887 452462
56269D52462J0408J1367J2679J3912J5414J7175J8727K0213K2341K5122K7803
$$ 452462 462870 474237 486916 500828 516242 533417 552144 572357 594698 619820 647623
56258F47623L0240L3232L7242M1804M6509N1704N7787O4476P1115P7291Q2881
$$ 647623 677863 711095 748337 790141 836650 888354 946141 1010617 1081732 1159023 1241904
56247A241904Q7903R2410R6259R9005J00245R9830R7470R2566Q4924P5221O4156
$$ 1241904 1329807 1422217 1518476 1617481 1717726 1817556 1915026 2007592 2092516 2167737 2231893
56236B231893N1525L6789K0326L391j2985k8423m2737n5609o6661p5413q1408
$$ 2231893 2283418 2320207 2340533 2343924 2330939 2302516 2259779 2204170 2137509 2062096 1980688
56225A980688q4761q6315q6827q6346q4717q2216p9162p5459p1099o6643o2563
$$ 1980688 1895927 1809612 1722785 1636439 1551722 1469506 1390344 1314885 1243786 1177143 1114580
56214A114580n8557n4141m9537m5329m1670l8372l5363l2532k9629k6809k4624
$$ 1114580 1056023 1001882 952345 907016 865346 826974 791611 759079 729450 702641 678017
56203F78017k2945k0691j7399j4208j2381j1580j0624r278q123p227o189n168
$$ 678017 655072 634381 616982 602774 590393 578813 568189 558911 550788 543561 537372 532204
56191E32204m676m565m292l915l807l630k689j208j67P2P0K53M13L06R8R9N47
$$ 532204 527528 522963 518671 514756 510949 507319 504630 503422 503255 503327 503397 503650 504063 504369 504467 504566 505113
56174E05113J451K343K569K234K284L118L867L783L513M063N188N956O309O890
$$ 505113 506564 508907 511476 513710 515994 519112 522979 526762 530275 534338 539526 545482 551791 558681
56160E58681P750Q399Q863R584J0488J1162J1741J2760J4322J6215J8536K1477
$$ 558681 566431 574830 583693 593277 603765 614927 626668 639428 653750 669965 688501 709978
56148G09978K4870K8618L3074L8270M3539M8658N4503O1597O8834P4777P9322
$$ 709978 734848 763466 796540 834810 878349 927007 981510 1043107 1111941 1186718 1266040
56137A266040Q2858Q4658Q3573P9608P3450O5259N5506M6265L9731L5774L2512
$$ 1266040 1348898 1433556 1517129 1596737 1670187 1735446 1790952 1837217 1876948 1912722 1945234
56126A945234K8945K5342K1399J5849Q095j108j0581j9232k6130l1401l6748m3713
$$ 1945234 1974179 1999521 2020920 2036769 2044864 2043756 2033175 2013943 1987813 1956412 1919664 1875951
56114A875951n1859n9817o7327p4561q0199q2167q0000p4792o7299n7994m8463
$$ 1875951 1824092 1764275 1696948 1622387 1542188 1460021 1380021 1305229 1237930 1179936 1131473
56103A131473m0553l4198k8055k2083j7456j4136j0812p363n095m210l178j134
$$ 1131473 1090920 1056722 1028667 1006584 989128 974992 964180 956817 951722 947512 944334 943200
56091I43200J028K471L556M631N358N721O250O880P009O893P432Q515R120R144
$$ 943200 944228 946699 950255 954886 960244 965965 972215 979095 986104 992997 1000429 1008944 1018064 1027208
56077A027208R473J0180J0417J0191J0485J1480J2383J3114J4345J5768J6275
$$ 1027208 1036681 1046861 1057278 1067469 1077954 1089434 1101817 1114931 1129276 1145044 1161319
56066A161319J5963J6060J6686J6704J5985J5796J6571J7320J7624J8187J9074
$$ 1161319 1177282 1193342 1210028 1226732 1242717 1258513 1275084 1292404 1310028 1328215 1347289
56055A347289J9333J8844J8602J8799J8530J7787J7786J8870K0012K0772K1812
$$ 1347289 1366622 1385466 1404068 1422867 1441397 1459184 1476970 1495840 1515852 1536624 1558436
56044A558436K3104K3623K3247K3152K3871K4757K5623K7043K8902L0520L2291
$$ 1558436 1581540 1605163 1628410 1651562 1675433 1700190 1725813 1752856 1781758 1812278 1844569
56033A844569L5197L8738M1431M3277M5518M8094M9758N0555N1685N2991N3255
$$ 1844569 1879766 1918504 1959935 2003212 2048730 2096824 2146582 2197137 2248822 2301813 2355068
56022B355068N2907N3708N5793N7755N9543O2326O5675O8070P0028P3422P7849
$$ 2355068 2407975 2461683 2517476 2575231 2634774 2697100 2762775 2830845 2900873 2974295 3052144
56011C052144Q1185Q3637Q7405R2333R5987R8264J01720J06890J11591J15445
$$ 3052144 3133329 3216966 3304371 3396704 3492691 3590955 3692675 3799565 3911156 4026601
56001D026601J20716J27872J34719J40770J48061J56872J65174J73094J83167
$$ 4026601 4147317 4275189 4409908 4550678 4698739 4855611 5020785 5193879 5377046
55992E377046J95313K06600K16878K29370K44757K60244K75697K94737L18247
$$ 5377046 5572359 5778959 5995837 6225207 6469964 6730208 7005905 7300642 7618889
55983G618889L42847L67512L95623M28648M64146N01954N45770N96621O51687
$$ 7618889 7961736 8329248 8724871 9153519 9617665 10119619 10665389 11262010 11913697
55974A1913697P11673P82125Q65352R58828J063867J187633J334614J505599J707959
$$ 11913697 12625370 13407495 14272847 15231675 16295542 17483175 18817789 20323388 22031347
55965B2031347J957220K266331K645472L116217L712239M459497N367439O444082
$$ 22031347 23988567 26254898 28900370 32016587 35728826 40188323 45555762 51999844
55957E1999844P704617R159867J0815805J2693874J4826847J7208972J9755061
$$ 51999844 59704461 68864328 79680133 92374007 107200854 124409826 144164887
55950A44164887K2316498K4717675K6752715K8138233K8443409K7026026K3093035
$$ 144164887 166481385 191199060 217951775 246090008 274533417 301559443 324652478
55943C24652478J6054106O095037n489281j6646119k5457547l0901521l2978567
$$ 324652478 340706584 346801621 341312340 324666221 299208674 268307153 235328586
55936B35328586l2334849k9838093k6337669k2537670j8908906j5682000j2929769
$$ 235328586 202993737 173155644 146817975 124280305 105371399 89689399 76759630
55929G6759630j0651301q802419p310140o103550n132068m352745l719486l195004
$$ 76759630 66108329 57305910 49995770 43892220 38760152 34407407 30687921 27492917
55921B7492917k759228k397258k090501j825665j600081j410722j247578j103266
$$ 27492917 24733689 22336431 20245930 18420265 16820184 15409462 14161884 13058618
55913A3058618r79098q75774p86934p07177o37945n80145n28776m80121m37066
$$ 13058618 12079520 11203746 10416812 9709635 9071690 8491545 7962769 7482648 7045582
55904G045582m02191l71990l42662l15627k92813k71975k50979k31669k15547
$$ 7045582 6643391 6271401 5928739 5613112 5320299 5048324 4797345 4565676 4350129
55895D350129k00378j84582j70413j59400j49147j37819j27430j19629j12473
$$ 4350129 4149751 3965169 3794756 3635356 3486209 3348390 3220960 3101331 2988858
55886B988858j04333r6879r1384q6138q0320p6430p5958p6456p5596p4427p3942
$$ 2988858 2884525 2787646 2696262 2610124 2529804 2453374 2377416 2300960 2225364 2150937 2076995
55875B076995p2265o8165o3861o1395n9440n6383n3416n1790n0026m6640m2896
$$ 2076995 2004730 1936565 1872704 1811309 1751869 1695486 1642070 1590280 1540254 1493614 1450718
55864A450718m0343l8188l5476l3194l1994l0448k7770k5594k4962k4284k2430
$$ 1450718 1410375 1372187 1336711 1303517 1271523 1241075 1213305 1187711 1162749 1138465 1116035
55853A116035k1022k1400k2092k1695k1558k3037k4609k4361k3106k2475k2027
$$ 1116035 1095013 1073613 1051521 1029826 1008268 985231 960622 936261 913155 890680 868653
55842H68653k0734j9382j9031j8877j7879j6759j6307j5514j3519j1546j0853
$$ 868653 847919 828537 809506 790629 772750 755991 739684 724170 710651 699105 688252
55831F88252j0572r593q747q977r230q370p429p699q309p966p576q667j0526j1255
$$ 688252 677680 668087 659340 650363 641133 632763 625334 617635 609326 601360 593784 585117 574591 563336
55817E63336j0654r931r491q925q316p899p230o125n306m933l838j537N76J454
$$ 563336 552682 542751 533260 524335 516019 508120 500890 494765 489459 484526 480688 479151 479727 481181
55803D81181K094L467M586M430M038M631N251M410K627J171l12k664m987n883
$$ 481181 483275 486742 491328 495758 499796 504427 509678 514088 516715 517886 517574 514910 509923 504040
55789E04040n935o661p778p775o610n761o030p111q768j0793j2286j2586j2356
$$ 504040 498105 491444 483666 475891 469281 463520 457490 450379 441611 430818 418532 405946 393590
55776C93590j2434j2332j1238r536p942o154l920k294k128k412j903j290j802
$$ 393590 381156 368824 357586 348050 340108 333954 330034 327740 325612 323200 321297 320007 318205
55763C18205k723k489j418j116j764k183k174k614l512l945l862m087m632m691
$$ 318205 315482 312993 311575 310459 308695 306512 304338 301724 298212 294267 290405 286318 281686 276995
55749B76995m248m051m131l867l371l287l439l076k318j925j913j805j848k542
$$ 276995 272747 268696 264565 260698 257327 254040 250601 247525 245207 243282 241369 239564 237716 235174
55735B35174l295l064k069j359j055n57j51o88j871k536k528k682l071k941k342
$$ 235174 231879 228815 226746 225387 224332 223775 223624 222936 221065 218529 216001 213319 210248 207307 204965
55720B04965k127k308k076j499j535k109j929o11N91P36M22M77P17O99O22Q08
$$ 204965 202838 200530 198454 196955 195420 193311 191382 190771 191362 192098 192520 192997 193714 194413 195035 195843
55704A95843J025R26M75k96j318k113k214k025k460l535m209l719k396r47K34
$$ 195843 196868 197794 198269 197973 196655 194542 192328 190303 187843 184308 180099 176380 173984 173037 173271
55689A73271R40J104J051J209J499J590J641K093K839L358L555L704L688L116
$$ 173271 174211 175315 176366 177575 179074 180664 182305 184398 187237 190595 194150 197854 201542 204658
55675B04658K125J256O14n6o56r18j157j859k624k512j460l95J73P01J573K353
$$ 204658 206783 208039 208653 208597 207941 207023 205866 204007 201383 198871 197411 197016 197189 197890 199463 201816
55659B01816K439J860J118O11L63P8m41q23m81K88L11q23j891j702q83r31k087
$$ 201816 204255 206115 207233 207844 208207 208285 207844 207021 206540 206828 207139 206316 204425 202723 201840 200909 198822
55642A98822l400m414n354n920n415m166l464l811m300m086l417k897k560k081
$$ 198822 195422 191008 185654 179734 174319 170153 166689 162878 158578 154492 151075 148178 145618 143537
55628A43537j307l95K16P5n82p46J08J102J098K86l30n66r83j559j723j572j761
$$ 143537 142230 141835 142051 142126 141544 140798 140906 142008 143106 143392 143062 142496 141513 139954 138231 136659 134898
55611A34898k234k323k054k071k296j968j168q68j281j488j062p11q71r49n20
$$ 134898 132664 130341 128287 126216 123920 121952 120784 119916 118635 117147 116085 115374 114503 113554 113034
55596A13034j09j40j57J93M00jn39n85l40k96l02J74J186K253K927L079K866K611
$$ 113034 112925 112785 112628 112821 113221 113220 112681 112096 111756 111460 111158 111332 112518 114771 117698 120777 123643 126254
55578A26254K457K222J941K293L849N991P455P835P806P861P751P181O118M284
$$ 126254 128711 130933 132874 135167 139016 145007 152462 160297 168103 175964 183715 190896 197014 201298
55564B01298J410j776l832m281m175m624n533o160o188n819n413n338n687n992
$$ 201298 202708 200932 197100 192819 188644 184020 178487 172327 166139 160320 154907 149569 143882 137890
55550A37890n763n244m972m658l542j807n75k72q4O02J265J238O70O6l39l03M50
$$ 137890 132127 126883 121911 117253 113711 111904 111329 111057 110973 111575 112840 114078 114748 114814 114475 114172 114622
55533A14622J545K001J462O60K68O8l56r19j439j985k402k275j728j473j735j921
$$ 114622 116167 118168 119630 120290 120558 120626 120270 119351 117912 115927 113525 111250 109522 108049 106314 104393
55517A04393j771j827k335k661k391k085k217k295j773j053p53o71k79L35P69
$$ 104393 102622 100795 98460 95799 93408 91323 89106 86811 85038 83985 83232 82561 82282 82617 83386
55502H3386R86R79M21o20j270r48l55m70j066j114l46M97P50M01k73r52j247j023
$$ 83386 84372 85351 85772 85152 83882 82934 82579 82109 81043 79929 79583 80080 80830 81231 80958 80006 78759 77736
55484G7736o33m07j61M05J094J491J553J437J069M18l9K75J246K065J984Q83o72
$$ 77736 77103 76696 76535 76940 78034 79525 81078 82515 83584 84002 83963 84238 85484 87549 89533 90416 89744
55467H9744j767j828j221q24q63o97L4O86M92l64j078j226q93k69M01P05M91J20
$$ 89744 87977 86149 84928 84104 83241 82544 82578 83264 83756 83392 82314 81088 80195 79926 80327 81032 81523 81643
55449H1643m3j64n69j121j356j070m74N3K12Q7K32J058K108K482K024J426J071
$$ 81643 81600 81436 80867 79746 78390 77320 76846 76899 77111 77198 77430 78488 80596 83078 85102 86528 87599
55432H7599O60J71K11Q78J223N37n43j029r42r12r63o44N1P30J291J797J916J267
$$ 87599 88259 88430 88641 89519 90742 91279 90736 89707 88765 87853 86890 86246 86297 87027 88318 90115 92031 93298
55414I3298J41p27r93q16l89J06L06Ln19q67j053j250j366j326j411j817k199
$$ 93298 93439 92712 91719 90903 90514 90620 90926 90929 90410 89543 88490 87240 85874 84548 83137 81320 79121
55397G9121k092j521p85K7Q75J491J674J558J247O48l3j76L79R36Q87M89K12j6
$$ 79121 77029 75508 74723 74750 75625 77116 78790 80348 81595 82243 82210 82034 82413 83349 84236 84725 84937 84921
55379H4921l15l38N1K58q3l29J51P60N42k97q56j036j406j892j808j131n58l13
$$ 84921 84606 84268 84319 84577 84494 84165 84316 85076 85618 85321 84465 83429 82023 80131 78323 77192 76634 76321
55361G6321Q7P78J221J055M72k95j098j538j303q03o33n55R4J071J374P86J93
$$ 76321 76408 77186 78407 79462 79934 79639 78541 77003 75700 74897 74264 73709 73803 74874 76248 77034 77227
55344G7227J78L15J98J20K73K15l18p93o42o2M64Q60J145R58M5j095j595j183
$$ 77227 77405 77720 77918 78038 78311 78526 78208 77415 76773 76711 77175 78035 79180 80138 80183 79088 77493 76310
55326G6310l24L99P08N66L3o59j105r66l76J6k63p45l99R39K081J931R00J77K9
$$ 76310 75986 76385 77093 77659 77692 77033 75928 74962 74586 74602 74339 73594 73195 74134 76215 78146 79046 79223 79252
55307G9252k33q19j098p57l37k90k92J16Q20J457J849J803J039k53j240j245m28
$$ 79252 79019 78200 77102 76345 76008 75718 75426 75542 76362 77819 79668 81471 82510 82257 81017 79772 79344
55290G9344N98J458J994J995J372M56k11l50j01J48M9l79o69l70L60Q82P65J42
$$ 79344 79942 81400 83394 85389 86761 87217 87006 86656 86555 86703 86752 86373 85704 85334 85694 86576 87341 87483
55272H7483n35q28n14J28L54k63j136j271n50J02o9p93j261j024k72M26N46R1
$$ 87483 86948 86120 85606 85734 86088 85825 84689 83418 82868 82970 82901 82108 80847 79823 79551 79977 80523 80614
55254H0614l62l85l11o37j080r58l71j17l57l28L77J146J377J287J143N87n78
$$ 80614 80252 79867 79556 78919 77839 76881 76510 76393 76036 75708 76085 77231 78608 79895 81038 81625 81047
55237H1047j592j630j010o37o05k54N44J092R44M74J99J48J46J75J75j04o99j172
$$ 81047 79455 77825 76815 76178 75573 75319 75863 76955 77899 78373 78572 78720 78866 79041 79216 79112 78413 77241
55219G7241j099o00p0M07J026J696J981J724J373J362J431J011J45m69m62k45
$$ 77241 76142 75542 75472 75879 76905 78601 80582 82306 83679 85041 86472 87483 87628 87159 86697 86452
55203H6452j84O4Q29J501J100k54j289j132k70L07L30J58k2l11n74m66%L22J65
$$ 86452 86268 86332 87161 88662 89762 89508 88219 87087 86817 87124 87454 87612 87590 87279 86705 86239 86239 86561 86726
55184H6726j94k51N3L15K63R0P3Q5k09p72j096p98r3M40M23n7n17m12L59J206
$$ 86726 86532 86281 86334 86649 86912 87002 87075 87160 86951 86179 85083 84285 84192 84632 85055 84998 84481 84069 84428 85634
55164H5634J387Q44K25M6K40N80R36R56J97j051j757j460r39r55j085o43p3k62
$$ 85634 87021 87865 88090 88136 88376 88956 89892 90848 91045 89994 88237 86777 85838 84883 83798 83155 83082 82820
55146H2820r18r40k52Q2l46o70k96J98K07J48N93J197J217O12m7l18p1O14J242
$$ 82820 81902 80962 80710 80792 80446 79776 79480 79678 79885 80033 80626 81823 83040 83652 83605 83287 83216 83830 85072
55127H5072J073J3j040j203n60K40Q48J182J068N72K90O34J037O10n55j411j284
$$ 85072 86145 86158 85118 83915 83355 83595 84443 85625 86693 87265 87555 88189 89226 89836 89281 87870 86586
55110H6586n66J4K69N05R24J343J371Q14j6m58j45N47Q75N27j25n27m81j44K77
$$ 86586 86020 86034 86303 86808 87732 89075 90446 91260 91244 90786 90641 91188 92063 92590 92465 91938 91457 91313 91590
55091I1590O68R07Q89P01O54Q62R67N43j45k88L86J131J129M90j49o05j051j265
$$ 91590 92258 93165 94054 94755 95409 96271 97238 97781 97636 97348 97734 98865 99994 100484 100335 99730 98679 97414
55073I7414q18K8M27L7o53j176j522j583r72K49J286J523J215R65R03P56L41l23
$$ 97414 96596 96624 97051 97088 96435 95259 93737 92154 91182 91431 92717 94240 95455 96420 97323 98079 98420 98097
55055I8097j016j281p81J28O51N30K32N4k45p11q64n05j48r5J47Q85J393R02j13
$$ 98097 97081 95800 95019 95147 95798 96328 96560 96614 96369 95658 94794 94289 94141 94046 94193 95078 96471 97373 97260
55036I7260n42k66j41n48q65n36R0L17k1m56m40J76J038J593J564J066L05n37
$$ 97260 96718 96452 96311 95763 94898 94362 94452 94769 94748 94292 93852 94028 95066 96659 98223 99289 99594 99057
55018I9057j073q63m3O27O58L89L00K55j38q08j397j772j869j385k54Q80J282
$$ 99057 97984 97121 97078 97705 98363 98752 99052 99307 99169 98361 96964 95192 93323 91938 91684 92564 93846
55001I3846J023O94N04K81O2K2m7l75n20J67J336J758Q53n53j268r67j47O07R71
$$ 93846 94869 95563 96067 96348 96410 96432 96385 96010 95490 95657 96993 98751 99604 99051 97783 96816 96669 97276 98247
54982I8247Q74N10K22K01M12P58J093J156Q33M86N91J070J356J115N38j08p36
$$ 98247 99121 99631 99853 100054 100466 101224 102317 103473 104306 104792 105383 106453 107809 108924 109462 109354 108618
54965A08618j169j086m97Q3J50k99q86j190r50k06N73P76K73l99n75r1O32R82
$$ 108618 107449 106363 105866 105949 106099 105800 104914 103724 102774 102568 103141 103917 104190 103791 103216 103125 103757 104739
54947A04739O71k6n30n51l09q2J27L00J84j99j93P00J826J962R29q7n3P59J472
$$ 104739 105410 105384 104854 104303 103994 103912 104039 104339 104523 104324 104131 104831 106657 108619 109548 109461 109408 110167 111639
54928A11639J828K201K749L161L172K978L041L637M522N077M909M282L756L409
$$ 111639 113467 115668 118417 121578 124750 127728 130769 134406 138928 144005 148914 153196 156952 160361
54914A60361K756J465k02j788l072l910m055l484k685k268k400k813l216l478
$$ 160361 163117 164582 164380 162592 159520 155610 151555 148071 145386 143118 140718 137905 134689 131211
54900A31211l519l309k950k597k296j952j469q20j03M68P26P11O51P10Q95J158
$$ 131211 127692 124383 121433 118836 116540 114588 113119 112299 112196 112664 113390 114101 114752 115462 116357 117515
54884A17515J426J580J612J769K281K990L507L760M014M321M392M130L807L516
$$ 117515 118941 120521 122133 123902 126183 129173 132680 136440 140454 144775 149167 153297 157104 160620
54870A60620K847J469l62k199l893n224n550m549l102k589l231l863l530k623
$$ 160620 163467 164936 164574 162375 158482 153258 147708 143159 140057 137468 134237 130374 126844 124221
54856A24221k070k088k283k451k565k279j242P0N58k32j500k121j821j137n75
$$ 124221 122151 120063 117780 115329 112764 110485 109243 109313 109871 109639 108139 106018 104197 103060 102485
54841A02485j89J12K71J92n6k38j40J93M77M72K56J09J85M48P94R58M68q26k152
$$ 102485 102296 102408 102679 102871 102815 102577 102437 102630 103107 103579 103835 103944 104129 104577 105371 106329 106797 105971 103819
54822A03819k334j157K92R03O34K6p11j494j797j185j09O02Q90J275J757J802
$$ 103819 101485 100328 100620 101523 102157 102183 101472 99978 98181 96996 96887 97489 98379 99654 101411 103213
54806A03213J386J068R07L65m92p31L1Q81R33N50N58Q98R44O32M56N58O24N01
$$ 103213 104599 105667 106574 106939 106447 105716 105747 106628 107561 108111 108669 109567 110511 111143 111599 112157 112781 113282
54788A13282L23J49m6j98l39o26q54l90Q64J919J849J093Q16J299J837K093K514
$$ 113282 113605 113754 113708 113510 113171 112545 111691 111301 112165 114084 115933 117026 117842 119141 120978 123071 125585
54771A25585L340M101M380M402M529M727M890N201N755O138N745M421K583P87
$$ 125585 128925 133026 137406 141808 146337 151064 155954 161155 166910 173048 178793 183214 185797 186584
54757A86584p35k107l467m641n346n677n981o201n848m884m025l742l549k870
$$ 186584 185849 183742 180275 175634 170288 164611 158630 152429 146581 141697 137672 133930 130381 127511
54743A27511k066j804j864j509p62l30l77l66j19K2J38P84J823K263J738J207
$$ 127511 125445 123641 121777 120268 119506 119176 118799 118433 118314 118336 118474 119258 121081 123344 125082 126289
54727A26289J591K504K996K968L101L766M661N278N220M302K787J342L70l93j353
$$ 126289 127880 130384 133380 136348 139449 143215 147876 153154 158374 162676 165463 166805 167175 166782 165429
54712A65429k439l372m192n031n616n514m794l999l407k712j528l0J097J277N88
$$ 165429 162990 159618 155426 150395 144779 139265 134471 130472 127065 124353 122825 122795 123892 125169 125757
54697A25757l21q54r43q37o81n31o00j071j687j918j578r69m49j53j15k16q0N02
$$ 125757 125436 124582 123639 122802 122121 121590 120990 119919 118232 116314 114736 113767 113318 113165 113050 112834 112754 113256
54679A13256J090J049M67J3j24m43j110j542j371j067j093j076n11K26L53j60
$$ 113256 114346 115395 115862 115875 115751 115308 114198 112656 111285 110218 109125 108049 107538 107764 108117 107957
54663A07957n84m91j48O4Q1n4l26n52m21Q6N50N87L02J48L23M90K16l62n83j80
$$ 107957 107373 106882 106734 106798 106879 106825 106499 105947 105526 105612 106162 106749 107051 107199 107522 108012 108228 107866 107283 107103
54643A07103K22o5p08p08J97J145J282O97om62n56k09L88P25N39J25k09n31q50
$$ 107103 107325 107260 106552 105844 106041 107186 108468 109165 109159 108697 108141 107932 108320 109045 109584 109709 109500 108969 108119
54624A08119p47J4Q96J156P77L41J57K3k56n40n95l45P3L81M05L82P14J284J399
$$ 108119 107372 107386 108282 109438 110215 110556 110713 110736 110480 109940 109345 109000 109073 109454 109859 110241 110955 112239 113638
54605A13638O80l56q87o69k0O55R69O06k51q96r06o49n94n73k78L4L9J13P12J284
$$ 113638 114318 113962 113075 112406 112386 113041 114010 114616 114365 113469 112563 111914 111320 110747 110469 110503 110542 110655 111367 112651
54585A12651Q41m20j094m13P45J118N88k8k04j28j87m97q54r15m53L54J046J328
$$ 112651 113492 113072 111978 111565 112310 113428 114016 113988 113784 113656 113469 112972 112118 111203 110750 111104 112150 113478
54567A13478J279J054O46L4n98r62q77m04J47L79J98j0J46M77L96k09o67l27N69
$$ 113478 114757 115811 116457 116491 115893 114931 114054 113650 113797 114176 114374 114364 114510 114987 115383 115174 114507 114180 114749
54548A14749J148J001O97J041J937K361J598K03o02l49L07O48O82P05O52L20j28
$$ 114749 115897 116898 117595 118636 120573 122934 124532 124735 124133 123784 124091 124739 125421 126126 126778 127098 126970
54531A26970m11n99q44r57p69o65j069j524j081L01J397J128k11j438j794j390
$$ 126970 126559 125960 125116 124159 123390 122725 121656 120132 119051 119352 120749 121877 121666 120228 118434 117044
54515A17044o71M5N20N77L08J01K57N70N29l6o80r31r16j008j013l48Q67J608
$$ 117044 116373 116418 116938 117515 117823 117924 118181 118751 119280 119244 118564 117633 116717 115709 114696 114348 115215 116823
54497A16823J211K44m06p66j326j870j725j012o16p83p22R1J019J244R25Q04J057
$$ 116823 118034 118278 117872 117106 115780 113910 112185 111173 110557 109774 109052 109143 110162 111406 112331 113135 114192
54480A14192J239J129J000J067J193J215J205J249J225R86O32M43N06N69L39r0
$$ 114192 115431 116560 117560 118627 119820 121035 122240 123489 124714 125700 126332 126775 127281 127850 128189 128099
54464A28099k97o1L37N17N05N84P29N62j02r14j366j304r46n24j12K33L61K09
$$ 128099 127802 127741 128078 128595 129100 129684 130413 130975 130873 129959 128593 127289 126343 125819 125707 125940 126301 126510
54446A26510%O1L43M03N6k33NM13K38m50p30k06L61J92l86n52j75L10O97R82R02
$$ 126510 126510 126571 126914 127317 127373 127140 127145 127558 127796 127346 126616 126410 126771 126963 126577 126025 125850 126160 126857 127839 128741
54425A28741L44r6K24R55J231R90Q80J003P58M2m86n63p20j113j009p1P88O31
$$ 128741 129085 128989 129213 130168 131399 132389 133269 134272 135030 135072 134586 134023 133303 132190 131181 131110 131898 132529
54407A32529r3k15N18J310J562J445J292J123Q26L84j47n32l74M28J295J425O73
$$ 132529 132436 132221 132739 134049 135611 137056 138348 139471 140297 140681 140534 140002 139628 140056 141351 142776 143449
54390A43449k75o45l26J10M7n17r85r13o36p62j177j113l11N10O97N82Q10J240
$$ 143449 143174 142529 142203 142313 142360 141843 140858 139945 139309 138547 137370 136257 135946 136456 137153 137735 138545 139785
54372A39785J178M70k63m38n2N33R46R65P03O21J052J749K175K118J742J232P35
$$ 139785 140963 141433 141170 140732 140680 141213 142159 143124 143827 144448 145500 147249 149424 151542 153284 154516 155251
54355A55251N25P38J035J002Q21J056J692J957J315J86o34r91j430k338l327l558
$$ 155251 155776 156514 157549 158551 159372 160428 162120 164077 165392 165578 164944 163953 162523 160185 156858 153300
54339A53300k652j230m31p76j618j937j558j186j272j342p45K95Q67N27j98n42
$$ 153300 150648 149418 148987 148211 146593 144656 143098 141912 140640 139298 138553 138848 139715 140242 140044 139502
54323A39502m00k34k90k81Q2N55O06Q5n86q70n93k4L56J67n29j143j080m53m7
$$ 139502 139102 138868 138578 138297 138379 138934 139540 139625 139039 138169 137576 137552 137908 138075 137546 136403 135323 134870 134823
54304A34823m16j274j917j985j532o87L96J315J658J452J137R76P69K05o68j407
$$ 134823 134407 133133 131216 129231 127699 127012 127408 128723 130381 131833 132970 133946 134715 134920 134252 132845
54288A32845j504q15J96P88P44O80J241K120K355J619O56K52K85J55k81o57p15
$$ 132845 131341 130526 130722 131510 132254 132934 134175 136295 138650 140269 140925 141177 141462 141617 141336 140679 139964
54271A39964m67M4O53R08N37L6J70Q38J100N13j71n3P20J300J264Q29K60k52l36
$$ 139964 139497 139541 140194 141102 141639 141675 141845 142683 143783 144296 144125 144072 144792 146092 147356 148185 148445 148193 147857
54252A47857K42R90J099M91j11k81l88p33q71k95O50J072N67m41j291j666j711
$$ 147857 148099 149089 150188 150679 150568 150287 149899 149166 148295 148000 148650 149722 150289 149848 148557 146891 145180
54235A45180j728j701j198m7J042J145M61J71O43P74k40j375j084M63J674J755
$$ 145180 143452 141751 140553 140506 141548 142693 143154 143325 143968 144742 144502 143127 142043 142506 144180 145935
54219A45935J389J245J078O08K20K39L08l0o74j268j614j527r06j95j19o27p53
$$ 145935 147324 148569 149647 150255 150475 150714 151022 150992 150318 149050 147436 145909 145003 144808 144689 144062 143309
54202A43309N2J086J316N74o32j833k569k313j154j01Mm23l55L81J002R30L90
$$ 143309 143361 144447 145763 146337 145705 143872 141303 138990 137836 137735 137739 137316 136961 137342 138344 139274 139664
54185A39664o2n5M23R18P41j81r42o68K94Q62O30J42j32k71m09m67n48q69j162
$$ 139664 139602 139547 139970 140888 141629 141448 140506 139838 140132 140994 141624 141766 141634 141363 140954 140487 139939 139070 137908
54166A37908q20J57R89J162J019J003R22M85j8k01l57j031j983k312j680p58k86
$$ 137908 137088 137245 138234 139396 140415 141418 142340 142825 142807 142606 142249 141218 139235 136923 135243 134485 134199
54149A34199j83K6L48M08K25L22Q76J282R25R3l50n2N35R40J200J468J557J235
$$ 134199 134016 134042 134390 134798 135023 135345 136221 137503 138428 138521 138171 138119 138654 139594 140794 142262 143819 145054
54131A45054O22k4o20j051r60k07P20J207J231J174J104Q52O13Q26J349J461R26
$$ 145054 145676 145652 145032 143981 143021 142814 143534 144741 145972 147146 148250 149102 149715 150541 151890 153351 154277
54114A54277M35O30J108R42q0j195j563j068k40K74J74l36p23o03j27K45L12L26
$$ 154277 154712 155342 156450 157392 157312 156117 154554 153486 153246 153520 153694 153358 152635 152032 151905 152150 152462 152788
54096A52788N35P30M92j27m75o7P04R28K97m43l46O34J627J884J540J308J552
$$ 152788 153323 154053 154545 154418 153943 153876 154580 155508 155805 155362 155016 155650 157277 159161 160701 162009 163561
54079A63561J879J691J061P92J509K871L955M275M119L979M035M253M444M080
$$ 163561 165440 167131 168192 168984 170493 173364 177319 181594 185713 189692 193727 197980 202424 206504
54065B06504K576J04k245l511l770l704l638l455l105k642j907p83L37Q57P82
$$ 206504 209080 209184 206939 203428 199658 195954 192316 188861 185756 183114 181207 180424 180761 181618 182400
54050A82400P06R81J394J732K162K790L252L100K419J814J770K222K808L434M373
$$ 182400 183106 184087 185481 187213 189375 192165 195417 198517 200936 202750 204520 206742 209550 212984 217357
54035B17357N626O440N976M552L579L926M847M996M064K783J756J063P11O82N98
$$ 217357 222983 229423 235399 239951 243530 247456 252303 257299 261363 264146 265902 266965 267676 268358 268956
54020B68956Q4n30o26l67n02j144j622j759k277l560m827n166m690m118l708l209
$$ 268956 269040 268510 267884 267517 267015 265871 264249 262490 260213 256653 251826 246660 241970 237852 234144 230935
54004B30935k486j662r29n66p56j111q71P5R10J025Q19Q29P69J49o89j097j210
$$ 230935 228449 226787 225858 225292 224536 223425 222554 222629 223539 224564 225383 226212 226981 227130 226441 225344 224134
53987B24134j619k283k714l043l763m490m134k564j082p99j382j908k141k331
$$ 224134 222515 220232 217518 214475 210712 206222 202088 199524 198442 197643 196261 194353 192212 189881
53973A89881k353j845r30j24L15M82M55K79K44O89J502K156K244J828J269R50
$$ 189881 187528 185683 184753 184629 184944 185426 185881 186160 186404 187093 188595 190751 192995 194823 196092 197042
53957A97042J091J600K135K466K663K822K760K271J565J161J296J720K052K126
$$ 197042 198133 199733 201868 204334 206997 209819 212579 214850 216415 217576 218872 220592 222644 224770
53943B24770J945J600J355J588K419L493M296M678M944N388N818N724M957M145
$$ 224770 226715 228315 229670 231258 233677 237170 241466 246144 251088 256476 262294 268018 272975 277120
53929B77120M165N236O738Q057R280J0780J2385J3410J3483J2885J1947J0464
$$ 277120 281285 286521 293259 301316 310596 321376 333761 347171 360654 373539 385486 395950
53917C95950P995M584R74j821l162l197k710k401k278j959j543j666k497l194
$$ 395950 403945 408529 409503 407682 404520 401323 398613 396212 393934 391975 390432 388766 386269 383075
53903C83075k888j905j444k109l317m186m485m513m556m718n060n552o045o456
$$ 383075 380187 378282 376838 374729 371412 367226 362741 358228 353672 348954 343894 338342 332297 325841
53889C25841o883p420p864p798o971n628m447l991m141m249l984l734l872l973
$$ 325841 318958 311538 303674 295876 288905 283277 278830 274839 270698 266449 262465 258731 254859 250886
53875B50886l313k073j381k007l498m744m998m240k999k000j593j399r54n92j097
$$ 250886 247573 245500 244119 242112 238614 233870 228872 224632 221633 219633 218040 216641 215687 215095 213998
53860B13998k347l131k642j490p95r26j550k281k716k471j774j446j677j544m77
$$ 213998 211651 208520 205878 204388 203593 202667 201117 198836 196120 193649 191875 190429 188752 187208 186731
53845A86731N72M22m89p74j80L24L13L56O82P32L10m0j31n26j357j834j422o08
$$ 186731 187303 187725 187236 186462 186282 186606 186919 187275 187957 188689 188999 188959 188828 188302 186945 185111 183689 183081
53827A83081L3O39J351J724J468J087J058J079P84N72R66J697K145K272K406K524
$$ 183081 183114 183753 185104 186828 188296 189383 190441 191520 192304 192876 193842 195539 197684 199956 202362 204886
53811B04886K446K349K504K820L184L810M675N159M911M566M793N123M675L670
$$ 204886 207332 209681 212185 215005 218189 221999 226674 231833 236744 241310 246103 251226 255901 259571
53797B59571L166L482L895L891L683L431K891K063J425J171R28M83J28j5l65j235
$$ 259571 262737 266219 270114 274005 277688 281119 284010 286073 287498 288669 289597 290080 290208 290193 289828 288593
53781B88593k281l003l399l801m325m778m925m713m332m090m036l839l336k978
$$ 288593 286312 283309 279910 276109 271784 267006 262081 257368 253036 248946 244910 241071 237735 234757
53767B34757l253l833l929l412k917k758k582k212k043k151j844p11M39L77j005
$$ 234757 231504 227671 223742 220330 217413 214655 212073 209861 207818 205667 203823 203112 203551 203928 202923
53752B02923k545l054k320j054k08j93n33m46R6L14j58n69j23P81J091O18J33
$$ 202923 200378 197324 195004 193950 193742 193549 193016 192570 192666 192980 192822 192253 192130 192911 194002 194620 194753
53735A94753N5k9l68m07L31J340J682J184N34L55O46J103J506J711J608J317J186
$$ 194753 194808 194779 194411 194004 194335 195675 197357 198541 199075 199430 200076 201179 202685 204396 206004 207321 208507
53718B08507J413J762J828J499J026O88N62O15Q43J233J704K153K515K724K724
$$ 208507 209920 211682 213510 215009 216035 216723 217285 217900 218743 219976 221680 223833 226348 229072 231796
53703B31796K602K561K645K565K050J348J138J826L022L892L986L591L272L129
$$ 231796 234398 236959 239604 242169 244219 245567 246705 248531 251553 255445 259431 263022 266294 269423
53689B69423K737J741L85p61j467j961k406k581k300j854j676j701j451q04k76
$$ 269423 272160 273901 274286 273525 272058 270097 267691 265110 262810 260956 259280 257579 256128 255324 255048
53674B55048l65q90j221j045o01j84K80R68J645J740J036Kp29j034j166j140p56
$$ 255048 254683 253793 252572 251527 250926 250742 251022 251990 253635 255375 256411 256413 255684 254650 253484 252344 251588
53657B51588k33k42r77j687j540o69J54N97R19J228J305J226J445K001K187J441
$$ 251588 251355 251113 250136 248449 246909 246240 246394 246991 247910 249138 250443 251669 253114 255115 257302 258743
53641B58743J97n39k36Q04J880K344J944J137R16J829L245L936L409K310J506
$$ 258743 258940 258401 258165 258969 260849 263193 265137 266274 267190 269019 272264 276200 279609 281919 283425
53626B83425J204J109J067J209J625K193K746L222L602L821L798L579L345L289
$$ 283425 284629 285738 286805 288014 289639 291832 294578 297800 301402 305223 309021 312600 315945 319234
53612C19234L452L737M058M415M753M904M800M675M831N174N257M860M292L899
$$ 319234 322686 326423 330481 334896 339649 344553 349353 354028 358859 364033 369290 374150 378442 382341
53598C82341L477K529J004n51j638k244k594k750k748k716k659k350j759j328
$$ 382341 385818 388347 389351 388800 387162 384918 382324 379574 376826 374110 371451 369101 367342 366014
53584C66014j401j632j438r43q55j431k135k457k492k478k331j957j564j287r72
$$ 366014 364613 362981 361543 360600 359745 358314 356179 353722 351230 348752 346421 344464 342900 341613 340641
53569C40641o12n24p18o31o1K22m35j332j205m2Q98R12O42Q12J144J084Q23Q98
$$ 340641 340029 339505 338787 338156 338095 338317 337882 336550 335345 335303 336201 337113 337755 338567 339711 340795 341618 342516
53551C42516J266J432J296J274J686K369K859K783K199J741K101L166M015M057
$$ 342516 343782 345214 346510 347784 349470 351839 354698 357481 359680 361421 363522 366688 370703 374760
53537C74760L761L896M445M880N203N943P106P876P728P249P463Q538R690J0288
$$ 374760 378521 382417 386862 391742 396945 402888 409994 417870 425598 432847 440310 448848 458538 468826
53523D68826J0588J1201J2130J2756J2729J2499J2748J3587J4679J5912J7423
$$ 468826 479414 490615 502745 515501 528230 540729 553477 567064 581743 597655 615078
53512F15078J8953J9860J9987K0021K0525K1078K0917K0164J9739K0074K0543
$$ 615078 634031 653891 673878 693899 714424 735502 756419 776583 796322 816396 836939
53501H36939K0295J9219J7883J6860J6363J6225J6053J5559J4941J4720J5099
$$ 836939 857234 876453 894336 911196 927559 943784 959837 975396 990337 1005057 1020156
53490A020156J5619J5686J5226J4647J4276J4138J4182J4377J4564J4444J3919
$$ 1020156 1035775 1051461 1066687 1081334 1095610 1109748 1123930 1138307 1152871 1167315 1181234
53479A181234J3215J2574J1886J0849R382P653N734L500J001j310k972m081n264
$$ 1181234 1194449 1207023 1218909 1229758 1239140 1246793 1252527 1256027 1257028 1255718 1252746 1248665 1243401
53466A243401p044r308j1426j2772j3200j3162j3337j4026j4883j5379j5418j5340
$$ 1243401 1236357 1227049 1215623 1202851 1189651 1176489 1163152 1149126 1134243 1118864 1103446 1088106
53454A088106j5428j5668j6017j6533j7117j7415j7158j6412j5361j4125j2958
$$ 1088106 1072678 1057010 1040993 1024460 1007343 989928 972770 956358 940997 926872 913914
53443I13914j2314j2323j2318j1347r126o303l753j904p36r7K02M57J001J952
$$ 913914 901600 889277 876959 865612 856486 850183 846430 844526 843790 843693 843895 844352 845353 847305
53429H47305L083L996M568N222O521Q414J0102J0856J0861J1000J1905J3441J5060
$$ 847305 850388 854384 858952 864174 870695 879109 889211 900067 910928 921928 933833 947274 962334
53416I62334J6372J7409J8506J9941K1537K2785K3518K4263K5578K7257K8692
$$ 962334 978706 996115 1014621 1034562 1056099 1078884 1102402 1126665 1152243 1179500 1208192
53405A208192K9836L1223L3001L4698L6172L7997M0422M2630M3738M4077M4659
$$ 1208192 1238028 1269251 1302252 1336950 1373122 1411119 1451541 1494171 1537909 1581986 1626645
53394A626645M5674M6436M6712M7076M7712M7828M6759M4994M3424M2108M0439
$$ 1626645 1672319 1718755 1765467 1812543 1860255 1908083 1954842 1999836 2043260 2085368 2125807
53383B125807L8211L5840L3653L1535K9233K6448K2798J8242J3533R617O506L349
$$ 2125807 2164018 2199858 2233511 2265046 2294279 2320727 2343525 2361767 2375300 2384917 2391423 2394772
53371B394772l31m192q084j2660j8421k4745l0522l5367l9483m2695m4492m5017
$$ 2394772 2394441 2390249 2382165 2369505 2351084 2326339 2295817 2260450 2220967 2178272 2133780 2088763
53359B088763m5131m5332m5213m4362m3153m2215m1544m0637l9263l7640l5938
$$ 2088763 2043632 1998300 1953087 1908725 1865572 1823357 1781813 1741176 1701913 1664273 1628335
53348A628335l4142l2471l1552l1851l3012l3943l3658l2058k9906k8007k6497
$$ 1628335 1594193 1561722 1530170 1498319 1465307 1431364 1397706 1365648 1335742 1307735 1281238
53337A281238k4948k2998k0721j8420j6316j4486j2941j1634j0554r792r454r491
$$ 1281238 1256290 1233292 1212571 1194151 1177835 1163349 1150408 1138774 1128220 1118428 1108974 1099483
53325A099483r768j0268j0960j1516j1461j0760r919r337q812p936o718n492m381
$$ 1099483 1089715 1079447 1068487 1056971 1045510 1034750 1024831 1015494 1006682 998746 992028 986536 982155
53312I82155l248k090j090k33P66K066L492M852O181P511Q682R649J0794J2592
$$ 982155 978907 976817 975727 975494 976260 978326 981818 986670 992851 1000362 1009044 1018693 1029487 1042079
53298A042079J4942J7154J8663J9564K0275K0926K1342K1471K1526K1639K1676
$$ 1042079 1057021 1074175 1092838 1112402 1132677 1153603 1174945 1196416 1217942 1239581 1261257
53287A261257K1511K1207K0733J9699J7683J4798J1663Q843O440M242K050k05
$$ 1261257 1282768 1303975 1324708 1344407 1362090 1376888 1388551 1397394 1403834 1408076 1410126 1409921
53275A409921k464m659o819r064j1354j3402j4975j6229j7467j8697j9750k0694
$$ 1409921 1407457 1402798 1395979 1386915 1375561 1362159 1347184 1330955 1313488 1294791 1275041 1254347
53263A254347k1730k2673k3078k3035k3270k4186k5223k5595k5306k4877k4416
$$ 1254347 1232617 1209944 1186866 1163831 1140561 1116375 1091152 1065557 1040251 1015374 990958
53252I90958k3604k2521k1806k1778k1946k1670k0958k0268j9849j9618j9495
$$ 990958 967354 944833 923027 901249 879303 857633 836675 816407 796558 776940 757445
53241G57445j9429j9157j8307j6881j5343j4076j2968j1682j0243r084q593q764
$$ 757445 738016 718859 700552 683671 668328 654252 641284 629602 619359 610275 601682 592918
53229E92918r254r592r364q476p361o714o861p507q225q966r892j0894j1592j1755
$$ 592918 583664 574072 564708 556232 548871 542157 535296 527789 519564 510598 500706 489812 478220 466465
53215D66465j1520j1178j0976j0988j0960j0426r289q124p558p385o847n786m950
$$ 466465 454945 443767 432791 421803 410843 400417 391128 383004 375446 368061 361214 355428 350478
53202C50478m959n483n778n631n359n199n130n163n346n525n430n013m519m193
$$ 350478 345519 340036 334258 328627 323268 318069 312939 307776 302430 296905 291475 286462 281943 277750
53188B77750m007l678k966k047j532j790k304k176j385r54j464k071j644m74M2
$$ 277750 273743 270065 267099 265052 263520 261730 259426 257250 255865 254911 253447 251376 249732 249258 249300
53173B49300o83j707j932j475j229j571k026k011j460p52k68j45l52q58j575k119
$$ 249300 248617 246910 244978 243503 242274 240703 238677 236666 235206 234454 234186 234041 233689 232831 231256 229137
53157B29137j987j171m53n70j227j384o04M01P40M04nj91l29m93m96l32l40o65
$$ 229137 227150 225979 225526 224956 223729 222345 221741 222142 222882 223286 223281 223090 222761 222268 221772 221440 221100 220435
53139B20435r00n42K95R37R15M66J98L88P68R24P89P30J130J832K124J520N52
$$ 220435 219535 218993 219288 220225 221140 221606 221804 222192 222960 223884 224673 225403 226533 228365 230489 232009 232561
53122B32561L54J245K137J833N97k63k33j10n47r62m95N77J180Q44O4n55q73j015
$$ 232561 232915 234160 236297 238130 238727 238464 238231 238121 237574 236612 236117 236694 237874 238718 238782 238227 237354 236339
53104B36339j176j622k366k828k396j375p92j094j580j376n05L60Q09R20Q20M87
$$ 236339 235163 233541 231175 228347 225951 224576 223784 222690 221110 219734 219229 219589 220398 221318 222138 222625
53088B22625M1j67J27P89J351J394Q36q0r99j599j590q54K86J131J217P39K17
$$ 222625 222666 222499 222626 223415 224766 226160 226996 226916 225917 224318 222728 221874 222160 223291 224508 225247 225464
53071B25464j56n11q16q07m92l40p09j302j419p63J37M11k27j091j275o96q8O8
$$ 225464 225308 224797 223981 223174 222682 222342 221633 220331 218912 218149 218286 218697 218470 217379 216104 215408 215320 215388
53053B15388O9K70M25K69K31P82J408J134K3p41m54K97O47M80K9p11j588j903
$$ 215388 215457 215727 216152 216421 216652 217434 218842 219976 219999 219258 218804 219101 219748 220228 220257 219546 217958 216055
53035B16055j167P3Q16P86M59K21J14K56P90J362J306N37k06k73J34L71K28Kj35
$$ 216055 214888 214961 215777 216563 217022 217243 217357 217613 218403 219765 221071 221608 221402 221129 221263 221634 221862 221864 221729
53016B21729m22r89j380r52K04J140J122N97O32J475K184J850O97l55q08q52p77
$$ 221729 221307 220318 218938 217986 218190 219330 220452 221049 221681 223156 225340 227190 227887 227532 226724 225872 225095
52999B25095o20l88j59L7K13K72J77K17P25J483J775J257N16M30J084J661J458
$$ 225095 224475 224087 223928 223965 224178 224450 224627 224844 225569 227052 228827 230084 230600 231030 232114 233775 235233
52982B35233P51M25Q63J485J513R31M67P12J537K416L043L435L602L349K490J172
$$ 235233 235984 236409 237272 238757 240270 241201 241668 242380 243917 246333 249376 252811 256413 259762 262252 263424
52966B63424n4o10m44j27k68q69j392j384q78k96j70q41k036k882k752k106j968
$$ 263424 263370 262760 262316 262189 261921 261052 259660 258276 257398 257102 256932 256091 254055 251173 248421 246315 244347
52949B44347k528k869k329j468j142j200q54o6L00k11r63j123o96k83j77j66m7
$$ 244347 241819 238950 236621 235153 234011 232811 231957 231891 232191 231980 231017 229894 229198 228915 228738 228572 228525
52932B28525J02J73J69J0m52j074j320q64r9K66J07q9p1j18k80j3Q89J511Q72
$$ 228525 228627 228800 228969 228979 228527 227453 226133 225269 225170 225436 225543 225454 225383 225265 224985 224972 225861 227372 228244
52913B28244n13j105l74O06Q31N84M81K55n98j606j776j013j72K24M24O58O79
$$ 228244 227731 226626 226252 226858 227689 228273 228754 229009 228411 226805 225029 224016 223844 224068 224492 225150 225829
52896B25829L81J63L13N10L06k04n14l32J62N39N08J80%K56O75O90J54n10q51
$$ 225829 226210 226373 226686 227196 227502 227298 226784 226452 226614 227153 227661 227841 227841 228097 228772 229462 229616 229106 228255
52877B28255q31o06k10L35Q38J100J186J316J539J681J651J625J798K028J849
$$ 228255 227424 226818 226608 226943 227781 228881 230067 231383 232922 234603 236254 237879 239677 241705 243554
52862B43554J037j1o89q92j027j274j284q07j91N6m1j79l90r18j595j955j950
$$ 243554 244591 244580 243891 242999 241972 240698 239414 238607 238416 238472 238431 238252 237862 236944 235349 233394 231444
52845B31444k048k495k951k992k569j847r89k89j19m60q08p92o06n82o33n05k80
$$ 231444 229396 226901 223950 220958 218389 216542 215553 215264 215145 214685 213877 213085 212479 211897 211264 210759 210479
52828B10479k33k90j16K53K84l19j041j040j69P42P94K2o70n92jL93L76L86P55
$$ 210479 210246 209956 209840 210093 210377 210058 209017 207977 207808 208550 209344 209366 208696 208104 208103 208496 208872 209258 210013
52809B10013J204J199O14j27m89k90J09M7p83j879k322j789r73p42j082j186o21
$$ 210013 211217 212416 213030 212903 212414 212124 212233 212280 211497 209618 207296 205507 204534 203792 202710 201524 200903
52792B00903N2j4q21j510j422q03k41K54J074K078K418J647N19J98Q42J501J320
$$ 200903 200955 200941 200120 198610 197188 196385 196144 196398 197472 199550 201968 203615 204134 204332 205174 206675 207995
52775B07995M04n82j134j128o89j91j11n68j159j393j170o71mP86J472J758J599
$$ 207995 208399 207817 206683 205555 204866 204675 204564 203996 202837 201444 200274 199603 199599 200385 201857 203615 205214
52758B05214J206P78M24L17O13J120J312R02K64P4N40J192J430J170Q07P28J029
$$ 205214 206420 207198 207622 207939 208552 209672 210984 211886 212150 212224 212764 213956 215386 216556 217363 218091 219120
52741B19120J581K178K581K627K374J963J370N27k71m46J41P98P46J00l00k5M12
$$ 219120 220701 222879 225460 228087 230461 232424 233794 234321 234050 233604 233745 234543 235289 235389 235089 235064 235476
52724B35476L15k68o59m06J82L70k61j363k103j990j403j160j514j835j401k95
$$ 235476 235791 235523 234864 234458 234640 235010 234749 233386 231283 229293 227890 226730 225216 223381 221980 221685
52708B21685P19J042P41K87Qq2j18j57r7J88O25R03Q06N57O39J172J617J346M42
$$ 221685 222404 223446 224187 224474 224482 224400 224282 224125 224028 224216 224841 225744 226550 227107 227746 228918 230535 231881 232323
52689B32323l00k84J83L40n2m96m86r5K88M72M72K54j96n64l75L83J028Q07k67
$$ 232323 232023 231739 231922 232262 232210 231714 231228 231133 231421 231893 232365 232619 232423 231859 231484 231867 232895 233702 233435
52670B33435j395j841j611j231r76o48j15L45M78N04P75J148J195R52R44J443
$$ 233435 232040 230199 228588 227357 226381 225733 225618 225963 226441 226945 227720 228868 230063 231015 231959 233402
52654B33402K162K782L220L217K301N96r39j601j831k431l228l285k289r52NN98
$$ 233402 235564 238346 241566 244783 247084 247680 246741 245140 243309 240878 237650 234365 232076 231124 231129 231727
52638B31727J107J442J345R00N34N91R99J274R24M3n65j64J038K012J936Q93l87
$$ 231727 232834 234276 235621 236521 237055 237646 238645 239919 240843 240886 240321 240157 241195 243207 245143 246036 245649
52621B45649j239j560j759k151k391j843o49J77J47J55J107K254K009L26j041
$$ 245649 244410 242850 241091 238940 236549 234706 234057 234234 234381 234536 235643 237897 239906 240232 239191
52606B39191q58J42O32M46J99J0l67o56l16M50P92L93j19p6M00O97M82J2j74K50
$$ 239191 238333 238475 239107 239553 239752 239762 239395 238739 238423 238873 239665 240058 239939 239863 240263 240960 241442 241454 241280 241530
52586B41530J120J954K386K339J868J064K14k57k04M7P6k23o71r73q22j78M46
$$ 241530 242650 244604 246990 249329 251197 252261 252475 252218 252014 252061 252137 251914 251243 250270 249448 249270 249716
52569B49716L68m31j229j458j247q90l75K08L83j7l81j53K14j09r87j446j053
$$ 249716 250084 249653 248424 246966 245719 244829 244454 244662 245045 245028 244647 244494 244708 244599 243612 242166 241113
52552B41113m50l36o34q42p41m78k89l06m27k84L31J017J090M51l09o47n49j92
$$ 241113 240663 240327 239693 238851 238110 237632 237343 237037 236610 236326 236657 237674 238764 239215 238906 238259 237710 237518
52534B37518L59R05J052P09L49M38Q52J132J099R41Q49Q92J059J185R83M30PJ70
$$ 237518 237877 238782 239834 240543 240892 241330 242182 243314 244413 245354 246203 247095 248154 249339 250322 250752 250759 250929
52516B50929P22J034Q75O43P41J104J508J986K638L186L024J812r1j778k441k070
$$ 250929 251651 252685 253560 254203 254944 256048 257556 259542 262180 265366 268390 270202 270111 268333 265892 263822
52500B63822j544j775k685l271k849j887j266j097q25k70J54K67M02O52N36j35
$$ 263822 262278 260503 257818 254547 251698 249811 248545 247448 246623 246353 246507 246774 247176 247828 248364 248229
52484B48229p08n58n2O7j34P2Q67J590J687J344J053J035J238J492J592J470J308
$$ 248229 247521 246963 246911 246978 246844 246916 247783 249373 251060 252404 253457 254492 255730 257222 258814 260284 261592
52467B61592J247J150J021J283K127K794K318Q90k90n65m35n65j012j641k440
$$ 261592 262839 263989 265010 266293 268420 271214 273532 274422 274132 273567 273132 272567 271555 269914 267474
52452B67474l105l119k604k364k658k762k218j649j668j780j241m00j76o16q95
$$ 267474 264369 261250 258646 256282 253624 250862 248644 246995 245327 243547 242306 241906 241730 241114 240219
52437B40219n35J46O56O63kr78j187J17K179L350K854J393L7p31q88n36N9N52
$$ 240219 239684 239830 240486 241149 241147 240169 238982 239099 241278 244628 247482 248875 248912 248181 247293 246757 246816 247368
52419B47368Q61J160J518J834K032K102K082K306L314N117O852P702P846P955
$$ 247368 248229 249389 250907 252741 254773 256875 258957 261263 264577 269694 276546 284248 292094 300049
52405C00049Q139Q020P488O527M620J355k480n350o660p076p193o861o024n216
$$ 300049 308188 316208 323696 330223 334843 336198 333718 328368 321708 314632 307439 300578 294554 289338
52391B89338m747m199l225k150j341n85M11J409J994K117J922J448Q54N98R79
$$ 289338 284591 280392 277167 275017 273676 273091 273502 274911 276905 279022 280944 282392 283246 283844 284823
52376B84823J804K718L551M208M607M885N254N511N146M104K890J803O61m76j058
$$ 284823 286627 289345 292896 297104 301711 306596 311850 317361 322507 326611 329501 331304 331965 331489 330431
52361C30431q86n89p13r28o40K8M75N11N06Q20J479K180K401J851J010P56J209
$$ 330431 329545 328956 328243 327315 326675 326703 327178 327689 328195 329015 330494 332674 335075 336926 337936 338692 339901
52344C39901J545J301J208K125L707M877N196N095N093N479O454P870R028R452
$$ 339901 341446 342747 343955 346080 349787 354664 359860 364955 370048 375527 381981 389851 398879 408331
52330D08331R681J0585J2118J3479J4390J5342J6575J7647J8204J8429J8431J7887
$$ 408331 418012 428597 440715 454194 468584 483926 500501 518148 536352 554781 573212 591099
52318E91099J6751J5784J5830J6796J7752J7942J7400J6670J6188J6006J5958
$$ 591099 607850 623634 639464 656260 674012 691954 709354 726024 742212 758218 774176
52307G74176J5962J6012J5929J5423J4560J3824J3406J2699J1038Q717O765N648
$$ 774176 790138 806150 822079 837502 852062 865886 879292 891991 903029 911746 918511 924159
52295I24159M729L145Q00j684l663m930n761o645p770q725q973q583q138p828
$$ 924159 928888 932033 932833 931149 927486 922556 916795 910150 902380 893655 884682 876099 867961 860133
52281H60133p119n570l526j677k13J184K660L972M916N680O679Q171J0015J1696
$$ 860133 853014 847444 843918 842241 842028 843212 845872 849844 854760 860440 867119 875290 885305 897001
52267H97001J2676J2899J2861J2976J3061J2748J2240J2189J2743J3235J3090
$$ 897001 909677 922576 935437 948413 961474 974222 986462 998651 1011394 1024629 1037719
52256A037719J2628J2476J2520J2052J0882R603Q585P337N261K601J21j867l587
$$ 1037719 1050347 1062823 1075343 1087395 1098277 1107880 1116465 1123802 1129063 1131664 1131785 1129918 1126331
52243A126331n186o585p919r445j0955j1851j2002j1997j2279j2472j2024j1091
$$ 1126331 1121145 1114560 1106641 1097196 1086241 1074390 1062388 1050391 1038112 1025640 1013616 1002525
52231A002525j0314r875r348q468p539o895o317n358m067l067k764k685j952l41
$$ 1002525 992211 982336 972988 964520 956981 950086 943769 938411 934344 931277 928513 925828 923876 923535
52217I23535J372K271K267K049K289L145M335N360N735N354M652M171M041M107
$$ 923535 924907 927178 929445 931494 933783 936928 941263 946623 952358 957712 962364 966535 970576 974683
52203I74683M343M753N002M740M242M246M971N833O204O025N546M987M602M598
$$ 974683 979026 983779 988781 993521 997763 1002009 1006980 1012813 1019017 1025042 1030588 1035575 1040177 1044775
52189A044775M656L966K087m16k454l374l429l507m452o273q084r097r506r898
$$ 1044775 1049431 1053397 1055484 1055068 1052614 1049240 1045811 1042304 1037852 1031579 1023495 1014398 1004892 994994
52175I94994j0099r440q020o669n550l950j836l92l11o35j60Q53J410J446J638
$$ 994994 984895 975455 967435 960766 955216 951266 949430 949038 948727 948092 947932 948785 950195 951641 953279
52160I53279K030K037J588J254J320J566J771J754J162K4p90n53J63K05m64p82
$$ 953279 955309 957346 958934 960188 961508 963074 964845 966599 967761 967785 966995 966442 966605 966810 966346 965564
52144I65564j42J005K052K770K881K151J022L33K89M88R70K296M438O571Q238
$$ 965564 965422 966427 968479 971249 974130 976281 977303 977636 977925 978413 979383 981679 986117 992688 1000926
52129A000926R829J1674J3559J5428J7641K0137K2213K3561K4763K6241K7488
$$ 1000926 1010755 1022429 1035988 1051416 1069057 1089194 1111407 1134968 1159731 1185972 1213460
52118A213460K7851K7386K6463K5144K3489K1897K0587J9274J7741J6224J4839
$$ 1213460 1241311 1268697 1295160 1320304 1343793 1365690 1386277 1405551 1423292 1439516 1454355
52107A454355J3292J1580J0288R657R025P809O314M940L302R91j445l234m665
$$ 1454355 1467647 1479227 1489515 1499172 1508197 1516006 1522320 1527260 1530562 1531553 1530108 1526874 1522209
52094A522209o639r257j1846j4157j6538j8911k0581k1122k0653j9207j6647j3447
$$ 1522209 1515570 1506313 1494467 1480310 1463772 1444861 1424280 1403158 1382505 1363298 1346651 1333204
52082A333204j0694q961p788o560n262l973k296Q8K711M817O412Q152J0229J2002
$$ 1333204 1322510 1313549 1305761 1299201 1293939 1289966 1287670 1287758 1290469 1295286 1301698 1309850 1320079 1332081
52068A332081J2932J3390J4049J4818J4979J4383J3851J4027J4375J3894J2490
$$ 1332081 1345013 1358403 1372452 1387270 1402249 1416632 1430483 1444510 1458885 1472779 1485269
52057A485269J0982R830Q628O970N027K998O12k322n374p958j0018j1818j3390
$$ 1485269 1496251 1506081 1514709 1521679 1526706 1529704 1530316 1527994 1522620 1514662 1504644 1492826 1479436
52044A479436j4624j5597j6430j7066j7549j8163j8909j9201j8650j7735j7132
$$ 1479436 1464812 1449215 1432785 1415719 1398170 1380007 1361098 1341897 1323247 1305512 1288380
52033A288380j6693j5797j4485j3487j3124j2950j2544j2049j1775j1765j1940
$$ 1288380 1271687 1255890 1241405 1227918 1214794 1201844 1189300 1177251 1165476 1153711 1141771
52022A141771j2186j2202j1721j0971j0464j0224r768q932q170p856p858q115
$$ 1141771 1129585 1117383 1105662 1094691 1084227 1074003 1064235 1055303 1047133 1039277 1031419 1023304
52010A023304q984j0565j2144j2965j3233j3778j4827j5795j6255j6499j6856
$$ 1023304 1014320 1003755 991611 978646 965413 951635 936808 921013 904758 888259 871403
51999H71403j7018j6476j5335j4197j3339j2518j1627j1049j1017j1085j0734
$$ 871403 854385 837909 822574 808377 795038 782520 770893 759844 748827 737742 727008
51988G27008j0310j0672j1887j2909j2925j2476j2629j3408j3738j2955j1675
$$ 727008 716698 706026 694139 681230 668305 655829 643200 629792 616054 603099 591424
51977E91424j0909j0809j0701j0087r088p903o285l936j196J085K455L297M138
$$ 591424 580515 569706 559005 548918 539830 531927 525642 521706 520510 521595 524050 527347 531485
51964E31485M884N107M831M491M225L777L052K136P28j614m350o000n880n082
$$ 531485 536369 541476 546307 550798 555023 558800 561852 563988 564716 563102 558752 552752 546872 541790
51950E41790m916n081m326k524q17J82J164K820M811O495P826R026R967J0481
$$ 541790 536874 531793 527467 524943 524126 524308 525472 528292 533103 539598 547424 556450 566417 576898
51936E76898J0751J0866J0346Q716O242L598J001j772m673p245r196j0644j1718
$$ 576898 587649 598515 608861 617577 623819 627417 628418 626646 621973 614728 605532 594888 583170
51923E83170j2318j2421j2256j1947j1234r820p914o096m591k930n37K472N369
$$ 583170 570852 558431 546175 534228 522994 513174 505260 499164 494573 491643 491106 493578 498947
51910D98947P637R349J0648J1308J1129J0311Q919O327K064k839o296p346p255
$$ 498947 506584 515933 526581 537889 549018 559329 568248 574575 576639 573800 567504 560158 552903
51897E52903p915r727j1698j3082j4037j4705j4673j3654j2110j0691r429p909
$$ 552903 544988 535261 523563 510481 496444 481739 467066 453412 441302 430611 421182 413273
51885D13273o016m072k322o85R58K530L928N182O312P211P793Q075Q016P441O321
$$ 413273 407257 403185 400863 400178 401136 403666 407594 412776 419088 426299 434092 442167 450183 457624 463945
51870D63945M944L542J938j01k292m010m994n430n308m320k633j173o43o39k72
$$ 463945 468889 472431 474369 474268 471976 467966 462972 457542 452234 447914 445281 444108 443465 442826 442554
51855D42554O22J396J533J083K89o51j433j869k343l454n092o361o629o181n602
$$ 442554 443176 444572 446105 447188 447477 446826 445393 443524 441181 437727 432635 426274 419645 413464 407862
51840D07862n028m340l637l092k579j890j103m33J64Q32J440J650J329O29k34
$$ 407862 402834 398494 394857 391765 389186 387296 386193 385760 385924 386756 388196 389846 391175 391804 391570
51825C91570j046j605j894k103k214j808o84N07Q23K38k43K05J301K158K286J784
$$ 391570 390524 388919 387025 384922 382708 380900 380216 380723 381546 381784 381541 381746 383047 385205 387491 389275
51809C89275R29No31p66o97r56j576j906j390k87O00P76L81k39r52j681k189k235
$$ 389275 390204 390209 389578 388812 388115 387159 385583 383677 382287 382000 382600 383376 383757 383518 382566 380885 378696 376461
51791C76461j898j515j327j374j639k030k190j686n72M72P85L81k25o44p41l53
$$ 376461 374563 373048 371721 370347 368708 366678 364488 362802 362230 362702 363487 363868 363643 362999 362258 361905
51775C61905O37J909K875L446M171N399O707P599Q250Q994R433Q873P497O146
$$ 361905 362542 364451 367326 370772 374943 380342 387049 394648 402898 411892 421325 430198 437695 443841
51761D43841M896K892o8k840m513n710p364q965r286q351p294o452n106l205j904
$$ 443841 448737 451629 451561 448721 444208 438498 431134 422169 412883 404532 397238 390786 385680 382475 380571
51746C80571j818k040j619q61l26M21J978L795M857N191N573O124O288N931N396
$$ 380571 378753 376713 375094 374233 373907 374328 376306 380101 384958 390149 395722 401846 408134 414065 419461
51731D19461M600L117J195k89r65j218j255q44p7M24L08k60j227k751m447n405
$$ 419461 424061 427178 428373 428084 427119 425901 424646 423802 423725 424149 424457 424197 422970 420219 415772 410367
51715D10367n228m329l050j393J52N48m22j558j713j128o04r3R25K160K533J498
$$ 410367 405139 400810 397760 396367 396519 397067 396645 395087 393374 392246 391642 391549 392474 394634 397167 398665
51699C98665l69j977k494j744l35P06R11Q18J060J346Q52n63k150l141l386l178
$$ 398665 398296 396319 393825 392081 391746 392452 393363 394181 395241 396587 397439 396876 394726 391585 388199 385021
51683C85021k915k895l035k867k071r25J05R36J700K249K381K381K706L191L169
$$ 385021 382106 379211 376176 373309 371238 370313 370418 371354 373054 375303 377684 380065 382771 385962 389131
51668C89131K522K103K867M847P109Q431Q025N912K894j1k186l513m023l707k603
$$ 389131 391653 393756 396623 401470 408579 417010 425035 430947 433841 433830 431644 428131 424108 420401 417798
51653D17798q72J239L382N107O063O067M980K753k44l254n784p945r799j0790
$$ 417798 416926 418165 421547 426654 432717 438784 443764 446517 446273 443019 437235 429290 419491 408701
51639D08701j0363q984p796p281o819n739m244l021k350j927j333m09P09J680
$$ 408701 398338 389354 381558 374277 367458 361719 357475 354454 352104 350177 348844 348435 349144 350824
51625C50824K131J901J180L96j24m65j029j938k591k216j007j38l01p07j74J159
$$ 350824 352955 354856 356036 356432 356308 355843 354814 352876 350285 348069 347062 346924 346623 345916 345742 346901
51609C46901K025J836J370J476J909J948J603J550K122K956L645M247N083O250
$$ 346901 348926 350762 352132 353608 355517 357465 359068 360618 362740 365696 369341 373588 378671 384921
51595C84921P475Q271Q155O802M221Q85k377m759n865n788m864l481k023p30M93
$$ 384921 392396 400667 408822 415624 419845 420730 418353 413594 407729 401941 397077 393596 391573 390843 391336
51580C91336J930L660N521P421R360J1071J2097J2423J2636J3165J3810J4316
$$ 391336 393266 396926 402447 409868 419228 430299 442396 454819 467455 480620 494430 508746
51568E08746J4858J5487J5677J5132J4666J5417J7396J9711K2064K5029K8663
$$ 508746 523604 539091 554768 569900 584566 599983 617379 637090 659154 684183 712846
51557G12846L1846L3375L2969L0729K6400J9900J2117M445k427q784j5055k1105
$$ 712846 744692 778067 811036 841765 868165 888065 900182 904627 902200 893416 878361 857256
51545H57256k6403l0534l3427l5171l5742l5025l3117l0440k7389k4133k0975
$$ 857256 830853 800319 766892 731721 695979 660954 627837 597397 570008 545875 524900
51534E24900j8595j7430j6893j5775j3477j0475p648n586m506m171l873l049k079
$$ 524900 506305 488875 471982 456207 442730 432255 424607 419021 414515 410344 406471 403422 401343
51521D01343j902k660l330k960j722m86J74K98L11P49J762K752K995K665K560
$$ 401343 399441 396781 393451 390491 388769 388283 388457 388755 389066 389815 391577 394329 397324 399989 402549
51506D02549K643J838k99k583l607l439l097k991k807k501k410k511k464k324
$$ 402549 405192 407030 406731 404148 400541 397102 394005 391014 388207 385706 383296 380785 378321 375997
51492C75997k418k600k336j569q96p97j203j794k238k237j825j572j969k708l089
$$ 375997 373579 370979 368643 367074 366178 365381 364178 362384 360146 357909 356084 354512 352543 349835 346746
51477C46746l015k937l014k995k885k964l068k666j821j325j614k189k404k184
$$ 346746 343731 340794 337780 334785 331900 328936 325868 323202 321381 320056 318442 316253 313849 311665
51463C11665j676q08L30J211J459J386J470J665J605J254R64J133K029L683N586
$$ 311665 309989 309181 309511 310722 312181 313567 315037 316702 318307 319561 320525 321658 323687 327370 332956
51448C32956O911P399P768Q802J0258J1197J1224J0837J0485R803Q021M917J240
$$ 332956 339867 347266 355034 363836 374094 385291 396515 407352 417837 427640 435661 440578 441818
51435D41818j739l107l030k678l315n277p787r677j0254r611q332p033o066n427
$$ 441818 440079 436972 433942 431264 427949 422672 414885 405208 394954 385343 377011 369978 363912 358485
51421C58485m748l528j676J04R07Q12J015K322L911M351L611L045L358L655L024
$$ 358485 353737 350209 348533 348637 349544 350356 351371 353693 357604 361955 365566 368611 371969 375624 378648
51406C78648K028J765K167K236J636J032R53J232J615K060K319K030J493J673
$$ 378648 380676 382441 384608 386844 388480 389512 390465 391697 393312 395372 397691 399721 401214 402887
51392D02887L025M899O503P884R563J1558J3449J5205J7414K0663K4968K9783
$$ 402887 405912 410811 417314 425198 434761 446319 459768 474973 492387 513050 538018 567801
51380E67801L4374L8217M1211M3542M5319M6389M6346M4437L9699L1821K1982
$$ 567801 602175 640392 681603 725145 770464 816853 863199 907636 947335 979156 1001138
51369A001138J2166L262n509j4873k3884l0865l5493l8923m1954m4060m4508m3507
$$ 1001138 1013304 1016566 1011057 996184 972300 941435 905942 867019 825065 781005 736497 692990
51357F92990m1781l9591l6748l3236k9361k5450k1690j8167j4885j1916r526p955
$$ 692990 651209 611618 574870 541634 512273 486823 465133 446966 432081 420165 410639 402684
51345D02684o999o196n461n151n318n397m869l884k948k372k255k582l040l117
$$ 402684 395685 389489 384028 378877 373559 368162 363293 359409 356461 354089 351834 349252 346212 343095
51331C43095k705k288k251k436k638k915l103k632j454m86m32p08l95K94N26L59
$$ 343095 340390 338102 335851 333415 330777 327862 324759 322127 320673 320187 319755 319047 318652 318946 319472 319831
51315C19831N57J123J333J187J561K660L576L663L242K605J594O06O64J721K151
$$ 319831 320388 321511 322844 324031 325592 328252 331828 335491 338733 341338 342932 343538 344202 345923 348074
51300C48074R52p07j252j055j577k940l926l980l668l262k353j045j49Q2L03Q54
$$ 348074 349026 348319 347067 346012 344435 341495 337569 333589 329921 326659 324306 323261 323112 323194 323497 324351
51284C24351J267J414K005L338M476M438L500K583J952J293O90O45J197J717J626
$$ 324351 325618 327032 329037 332375 336851 341289 344789 347372 349324 350617 351307 351952 353149 354866 356492
51269C56492R61J75l08l24K2N35J107J635J788J210L7j117j861k385k920l230
$$ 356492 357453 357628 357320 356996 357018 357553 358660 360295 362083 363293 363330 362213 360352 357967 355047 351817
51253C51817l028k591k477k669k496j512j89N30K11o38j162r75l41L36Q60J065
$$ 351817 348789 346198 343721 341052 338556 337044 336855 337385 337596 336958 335796 334821 334480 334816 335676 336741
51237C36741O45m68j757k540k653k435k136j708j128n18M4M92O10K66j62j37K84
$$ 336741 337386 336918 335161 332621 329968 327533 325397 323689 322561 322043 322087 322579 323189 323455 323293 323156 323440
51220C23440N22L44J57L12O92J149J720K191K109J623J646K659L847M110L547
$$ 323440 323962 324306 324463 324775 325467 326616 328336 330527 332636 334259 335905 338564 342411 346521 350068
51205C50068L241L763M586M859M240K940J467L08n14j459k759l837l989l410k947
$$ 350068 353309 357072 361658 366517 370757 373697 375164 375472 374958 373499 370740 366903 362914 359504 356557
51190C56557k878k697k181j864k130k446k090j218n41k24K59J145J807J504L78
$$ 356557 353679 350982 348801 346937 344807 342361 340271 339053 338512 338288 338547 339692 341499 343003 343381
51175C43381n84n32N30J906K846K983K377J417O20L43N56R39J193J243J203J256
$$ 343381 342797 342265 342795 344701 347547 350530 352907 354324 354944 355287 355843 356782 357975 359218 360421 361677
51159C61677J486J677J366L90o99j107p81n56j120k074k328j261O91K426K952
$$ 361677 363163 364840 366206 366596 365897 364790 364009 363453 362333 360259 357931 356670 357361 359787 362739
51144C62739K003J99j411k237k555k958l536l743l061j584n6O56K66o02r55m24
$$ 362739 364742 364941 363530 361293 358738 355780 352244 348501 345440 343856 343800 344456 344722 344120 343165 342741
51128C42741M57J055J384J798K252K340J963J536J441J616J746J720J782K263
$$ 342741 343198 344253 345637 347435 349687 352027 353990 355526 356967 358583 360329 362049 363831 366094
51114C66094L098L658L340K389J806K180K974L329L187L088L149K906K149J265
$$ 366094 369192 372850 376190 378579 380385 382565 385539 388868 392055 395143 398292 401198 403347 404612
51100D04612N85j9o85j178j245r71n33M9O45Q00K10p21j170p87l9M12M76N47P45
$$ 404612 405197 405178 404493 403315 402070 401099 400566 400615 401260 402060 402270 401549 400379 399592 399553 399965 400441 400988 401733
51081D01733N95l53j682k348j808n81M62J020J302J491J700K165K965L723M080
$$ 401733 402328 401975 400293 397945 396137 395556 396018 397038 398340 399831 401531 403696 406661 410384 414464
51066D14464M360N180O499P707Q646R871J1655J3375J4214J3944J2730J0696Q222
$$ 414464 418824 424004 430503 438210 446856 456727 468382 481757 495971 509915 522645 533341 541563
51053E41563O300N956P327R616J1838J3359J3853J3110J1096Q113M828J902o10
$$ 541563 547863 553819 561146 570762 582600 595959 609812 622922 634018 642131 646959 648861 648251
51040F48251l327o674r987j1956j2004j0783r358q454q626j0234j2728j4574j4604
$$ 648251 644924 638250 628263 616307 604303 593520 584162 575708 567082 556848 544120 529546 514942
51027E14942j3159j1354r587p445m766k043K42K021L368M366N244O175O887O984
$$ 514942 501783 490429 480842 473397 468631 466588 466830 468851 472219 476585 481829 488004 494891 501875
51013E01875O665O639P228Q050Q610Q709Q219P103N933N761O944Q535R287R051
$$ 501875 508540 515179 522407 530457 539067 547776 555995 563098 569031 574792 581736 590271 599558 608609
50999F08609Q695Q892R477R939J0090J0056R909R506Q681P496O308N482N099N066
$$ 608609 617304 626196 635673 645612 655702 665758 675667 685173 693854 701350 707658 713140 718239 723305
50985G23305N427O277P331P982Q055Q184R052J0458J1568J2051J2492J3638J5665
$$ 723305 728732 735009 742340 750322 758377 766561 775613 786071 797639 809690 822182 835820 851485
50972H51485J8372K1746K5972L0961L6190M1103M5591M9956N4356N8293O0854
$$ 851485 869857 891603 917575 948536 984726 1025829 1071420 1121376 1175732 1234025 1294879
50961A294879O1670O1466O1360O1551O1046N8812N4851M9952M4703L9115L3091
$$ 1294879 1356549 1418015 1479375 1540926 1601972 1660784 1715635 1765587 1810290 1849405 1882496
50950A882496K6850K0865J5616J1378Q006N029K236P9q74q73j018k273m749p928
$$ 1882496 1909346 1930211 1945827 1957205 1965211 1970240 1972476 1972555 1971681 1970808 1969790 1967517 1962768 1954840
50936A954840j1161j3837j5679j7151j9162k2003k4987k7545l0200l3827l8233
$$ 1954840 1943679 1929842 1914163 1897012 1877850 1855847 1830860 1803315 1773115 1739288 1701055
50925A701055m2250m5165m7355m9436n1376n2722n3185n2737n1412m9298m6504
$$ 1701055 1658805 1613640 1566285 1516849 1465473 1412751 1359566 1306829 1255417 1206119 1159615
50914A159615m3094l9229l5359l1883k8667k5292k1828j8863j6695j5053j3728
$$ 1159615 1116521 1077292 1041933 1010050 981383 956091 934263 915400 898705 883652 869924
50903H69924j2879j2387j1561j0012q267p078o442n839n056m178l123j825o86
$$ 869924 857045 844658 833097 823085 814818 807740 801298 795459 790403 786225 783102 781277 780591
50890G80591j33R7N66J196J447J396J817K922L867L938L671M207N861P877R393
$$ 780591 780458 780555 781121 782317 783764 785160 786977 789899 793766 797704 801375 805582 811443 819320 828713
50875H28713J0174J0429J0395J0295J0449J1184J2588J4376J6083J7532J9090
$$ 828713 838887 849316 859711 870006 880455 891639 904227 918603 934686 952218 971308
50864I71308K1417K4852K9055L3266L6946M0281M4015M8699N4168N9972O6204
$$ 971308 992725 1017577 1046632 1079898 1116844 1157125 1201140 1249839 1304007 1363979 1430183
50853A430183P3418Q1643R0054R7971J05633J13404J20772J26923J31982J36671
$$ 1430183 1503601 1585244 1675298 1773269 1878902 1992306 2113078 2240001 2371983 2508654
50843B508654J40735J42759J41769J38119J32357J24041J12369R7418Q0138O1533
$$ 2508654 2649389 2792148 2933917 3072036 3204393 3328434 3440803 3538221 3618359 3679892
50833C679892M2454K3904O851q133k0611k9892l5425l7493l6971l4440k9973k3817
$$ 3679892 3722346 3746250 3753101 3744968 3724357 3694465 3659040 3621547 3584576 3550136 3520163 3496346
50821C496346j6841j0228n035k127k288o162j3999k5300l8723n2745o6646q0579
$$ 3496346 3479505 3469277 3464242 3462115 3459827 3453665 3439666 3414366 3375643 3322898 3256252 3175673
50809C175673r4475j07280j17698j25251j30159j32457j31886j28459j22562j14591
$$ 3175673 3081198 2973918 2856220 2730969 2600810 2468353 2336467 2208008 2085446 1970855
50799A970855j05095r5066q5344p5808o5848n5699m6441l8565l1446k4579j8448
$$ 1970855 1865760 1770694 1685350 1609542 1543694 1487995 1441554 1402989 1371543 1346964 1328516
50788A328516j3577r540n702k428n74j10q4M5j19j036k506m054n539p055q572
$$ 1328516 1314939 1305399 1299697 1297269 1296695 1296585 1296501 1296546 1296427 1295391 1292885 1288831 1283292 1276237 1267665
50773A267665r956j1193j2389j3672j5123j6665j8009j8895j9372j9628j9628
$$ 1267665 1257709 1246516 1234127 1220455 1205332 1188667 1170658 1151763 1132391 1112763 1093135
50762A093135j9163j8229j7056j5745j4195j2482j0933r612q049n745k807J69
$$ 1093135 1073972 1055743 1038687 1022942 1008747 996265 985332 975720 967671 961926 959119 959288
50750I59288K754M990P128R308J1587J4088J6998K0382K4077K7869L1786L6128
$$ 959288 962042 967032 974160 983468 995055 1009143 1026141 1046523 1070600 1098469 1130255 1166383
50738A166383M1130M6643N2204N7336O1731O5323O8335P1098P3553P5149P5515
$$ 1166383 1207513 1254156 1306360 1363696 1425427 1490750 1559085 1630183 1703736 1778885 1854400
50727A854400P5042P4321P3104P0473O6103O0676N4690M7546L8382K7409J5705
$$ 1854400 1929442 2003763 2076867 2147340 2213443 2274119 2328809 2376355 2414737 2442146 2457851
50716B457851L959p833j9399k9608l7071m0974m1277l8554l3839k8214k2276j6170
$$ 2457851 2461810 2453977 2434578 2404970 2367899 2326925 2285648 2247094 2213255 2185041 2162765 2146595
50704B146595j0174m856o11K462L936K817j568q681j7280k6640l6723m7170n6757
$$ 2146595 2136421 2131565 2130954 2133416 2137352 2140169 2138601 2129920 2112640 2086000 2049277 2002107 1945350
50691A945350o4193o9139p2038p3103p1898o8087o2309n5869m9497m2764l4941
$$ 1945350 1881157 1812018 1739980 1666877 1594979 1526892 1464583 1408714 1359217 1316453 1281512
50680A281512k6292j8052j1174n457q4N352J0626J5393J9553K3138K6086K8153
$$ 1281512 1255220 1237168 1225994 1220537 1220453 1225805 1236431 1251824 1271377 1294515 1320601 1348754
50668A348754K8956K8208K6118K3408K0793J8498J6401J4499J2916J1657J0660
$$ 1348754 1377710 1405918 1432036 1455444 1476237 1494735 1511136 1525635 1538551 1550208 1560868
50657A560868J0053J0038J0485J0908J0905J0488J0006R941J0705J2360J4585
$$ 1560868 1570921 1580959 1591444 1602352 1613257 1623745 1633751 1643692 1654397 1666757 1681342
50646A681342J7139K0201K3927K7816L1108L3782L6508L9451M1783M2714M2471
$$ 1681342 1698481 1718682 1742609 1770425 1801533 1835315 1871823 1911274 1953057 1995771 2038242
50635B038242M1698M0364L7969L4633L1239K8471K6216K4075K1940J9781J6963
$$ 2038242 2079940 2120304 2158273 2192906 2224145 2252616 2278832 2302907 2324847 2344628 2361591
50624B361591J1975L037j0512k6935m2322n2732n6459n4261m7883l8964k9163
$$ 2361591 2373566 2376603 2366091 2339156 2296834 2244102 2187643 2133382 2085499 2046535 2017372
50613B017372k0177j2941p228k469J235L289L364J477k435q444j6146k4598l2874
$$ 2017372 1997195 1984254 1977026 1974557 1975792 1979081 1982445 1983922 1981487 1973043 1956897 1932299 1899425
50600A899425m0413m6923n2239n6312n9100o0505o0529n9345n7069n3711m9589
$$ 1899425 1859012 1812089 1759850 1703538 1644438 1583933 1523404 1464059 1406990 1353279 1303690
50589A303690m5454m1723l7881l3269k8330k4339k1834k0136j8574j7309j6478
$$ 1303690 1258236 1216513 1178632 1145363 1117033 1092694 1070860 1050724 1032150 1014841 998363
50578I98363j5347j3186j0467q296o860n292l027m81J777L782N777P708R477J1278
$$ 998363 983016 969830 959363 951067 944207 938915 935888 935407 937184 940966 946743 954451 963928 975206
50564I75206J3235J5048J6469J7870J9868K2452K4939K6839K8398L0104L1885
$$ 975206 988441 1003489 1019958 1037828 1057696 1080148 1105087 1131926 1160324 1190428 1222313
50553A222313L3087L3180L2323L1071K9680K7957K5873K4007K3069K3186K4001
$$ 1222313 1255400 1288580 1320903 1351974 1381654 1409611 1435484 1459491 1482560 1505746 1529747
50542A529747K5429K7833L1349L5543L9951M4575M9551N4723N9932O5434P1461
$$ 1529747 1555176 1583009 1614358 1649901 1689852 1734427 1783978 1838701 1898633 1964067 2035528
50531B035528P7570Q3019Q7836R2887R8662J04404J08737J10883J10891J08967
$$ 2035528 2113098 2196117 2283953 2376840 2475502 2579906 2688643 2799526 2910417 3019384
50521C019384J05066R9137R1343Q1720O9882N5453L8792K0957K793j5612l4214
$$ 3019384 3124450 3223587 3314930 3396650 3466532 3521985 3560777 3581734 3584527 3568915 3534701
50510C534701n2026o7436p9606q9006r6257j00956j02061r9121r2549q2924p0701
$$ 3534701 3482675 3415239 3335633 3246627 3150370 3049414 2947353 2848232 2755683 2672759 2602058
50499B602058n6603m1614k6360j0945M270J8155K9356L7127M1377M2137L9253
$$ 2602058 2545455 2503841 2477481 2466536 2470806 2488961 2518317 2555444 2596821 2638958 2678211
50488B678211L2414K1248N671j3485l4290n4470p2384q7247r8719j06658j11180
$$ 2678211 2710625 2731873 2737544 2724059 2689769 2635299 2562915 2475668 2376949 2270291 2159111
50477B159111j12571j11067j07016j01116r4194q6666p8600p0334o2615n5930
$$ 2159111 2046540 1935473 1828457 1727341 1633147 1546481 1467881 1397547 1334932 1279002
50467A279002n0025m4448l9267l4865l1102k7214k2685j7863j3516r959o875l848
$$ 1279002 1228977 1184529 1145262 1110397 1079295 1052081 1029396 1011533 998017 988058 981183 977335
50455I77335q04J990M070M949M480L273K508L006M502O017O938P526Q356R503
$$ 977335 976531 978521 982591 987540 992020 995293 997801 1000807 1005309 1011326 1018264 1025790 1034146 1043649
50441A043649J0481J0797J0323R232P841O562N780N584N729O025O613P747R379
$$ 1043649 1054130 1064927 1075250 1084482 1092323 1098885 1104665 1110249 1115978 1122003 1128616 1136363 1145742
50428A145742J1221J3081J4843J6179J6798J7142J8306K0804K3812K6218K8138
$$ 1145742 1156963 1170044 1184887 1201066 1217864 1235006 1253312 1274116 1297928 1324146 1352284
50417A352284L0636L4050L7505M0336M3118M6642N0509N3546N5262N6119N6457
$$ 1352284 1382920 1416970 1454475 1494811 1537929 1584571 1635080 1688626 1743888 1800007 1856464
50406A856464N5887N3829N0137M5097L9187L2887K6330J9132J0878J722p939j8163
$$ 1856464 1912351 1966180 2016317 2061414 2100601 2133488 2159818 2178950 2189828 2191550 2183611 2165448
50394B165448k9160m0275n0061n7570o2991o6696o8342o7360o3772n8058n0653
$$ 2165448 2136288 2096013 2045952 1988382 1925391 1858695 1790353 1722993 1659221 1601163 1550510
50383A550510m2093l3230k4673j6301p881J18O879J2147J6107J8545J8865J6986
$$ 1550510 1508417 1475187 1450514 1434213 1426332 1426450 1433329 1445476 1461583 1480128 1498993 1515979
50371A515979J3481Q622K018o486j5988k5008l2559l8488m3046m6464m8777m9828
$$ 1515979 1529460 1538082 1540100 1533614 1517626 1492618 1460059 1421571 1378525 1332061 1283284 1233456
50359A233456m9461m7837m5417m2590l9523l6439l3756l1673k9762k7292k3958
$$ 1233456 1183995 1136158 1090741 1048151 1008628 972189 938433 906760 876998 849706 825748
50348H25748k0194j6724j3900j1449q813n743k545K99K682M907P235R558J1598
$$ 825748 805554 788830 774930 763481 754668 748925 746380 746679 749361 754268 761503 771061 782659
50335G82659J3185J4252J4622J3948J1839Q144L275j707n598p807q546q297p265
$$ 782659 795844 810096 824718 838666 850505 858649 861924 860217 854619 846812 838266 829969 822704
50322H22704n501l283j150M39J328J641J720J954K478L037L300L366L675M393
$$ 822704 817203 813920 812770 813209 814537 816178 817898 819852 822330 825367 828667 832033 835708 840101
50308H40101N083N170M649M107M073M485M872M872M506M130M241N164O758Q426
$$ 840101 845184 850354 855003 859110 863183 867668 872540 877412 881918 886048 890289 895453 902211 910637
50294I10637R636J0344J0738J0787J0432J0215J1095J3357J6118J8292J9738K0858
$$ 910637 920273 930617 941355 952142 962574 972789 983884 997241 1013359 1031651 1051389 1072247
50282A072247K1255J9409J3994N283m824j3869k0005k2646k2413k0387j7266j3383
$$ 1072247 1093502 1112911 1126905 1132188 1127364 1113495 1093490 1070844 1048431 1028044 1010778 997395
50270I97395r365o304m949m994n472n756n815n712n281m465l581k977k574k032
$$ 997395 988030 981726 976777 971783 966311 960555 954740 949028 943747 939282 935701 932724 930150 928118
50256I28118j275n33J89J313L072M981O400P496R114J1520J3924J5616J7067J9195
$$ 928118 926843 926310 926499 927812 930884 935865 942265 949761 958875 970395 984319 999935 1017002 1036197
50242A036197K1870K3887K4495K4193K3861K3744K3554K2957K1597J9149J5892
$$ 1036197 1058067 1081954 1106449 1130642 1154503 1178247 1201801 1224758 1246355 1265504 1281396
50231A281396J2764J0273P662L795j361o838j2101j7523k3313k8708l2656l4739
$$ 1281396 1294160 1304433 1312095 1315890 1314529 1307691 1295590 1278067 1254754 1226046 1193390 1158651
50219A158651l5051l3686l0881k7331k3715k0131j6510j3507j2252j3094j5149
$$ 1158651 1123600 1089914 1059033 1031702 1007987 987856 971346 957839 945587 932493 917344
50208I17344j7306j9154k0649k1440k1122j9898j8354j6714j4847j2941j1495
$$ 917344 900038 880884 860235 838795 817673 797775 779421 762707 747860 734919 723424
50197G23424j0543r512q160p065o778o943o811o287n863n736n627n442n433n605
$$ 723424 712881 703369 695209 688144 681366 674423 667612 661325 655462 649726 644099 638657 633224 627619
50183F27619n567n172m783m622m352l696l081l169l922m582m510l693k543j487
$$ 627619 622052 616880 612097 607475 603123 599427 596346 593177 589255 584673 580163 576470 573927 572440
50169E72440p71l28J79R56J756K203K367K707L421M223M834N377O063O759P207
$$ 572440 571669 571341 571520 572476 574232 576435 578802 581509 584930 589153 593987 599364 605427 612186 619393
50154F19393P498P963Q600Q904Q455P374O052M616K981J333J41l85n27m88P6J609
$$ 619393 626891 634854 643454 652358 660813 668187 674239 678855 681836 683169 683310 682925 682398 681910 681986 683595
50138F83595L905O265Q412J0783J3809J7315K0848K4229K7449L0382L3028L5844
$$ 683595 687500 693765 702177 712960 726769 744084 764932 789161 816610 846992 880020 915864
50126I15864L9245M2789M5359M6355M6261M5810M4987M3369M1257L9783L9646
$$ 915864 955109 997898 1043257 1089612 1135873 1181683 1226670 1270039 1311296 1351079 1390725
50115A390725M0094L9525L6972L2611K6904J9718J0607k70j1895k2994l2668m0485
$$ 1390725 1430819 1470344 1507316 1539927 1566831 1586549 1597156 1596886 1584991 1561997 1529329 1488844
50103A488844m6235m9857n1461n1354n0004m7873m5174m1814l7782l3487k9456
$$ 1488844 1442609 1392752 1341291 1289937 1239933 1192060 1146886 1105072 1067290 1033803 1004347
50092A004347k5719k1873j7865j4316j1775j0008q388o778n516m608l530j983
$$ 1004347 978628 956755 938890 924574 912799 902791 894403 887625 882109 877501 873971 871988
50080H71988m09N81J030J460K045K396K233J825J489R36l67k243l753m358m723
$$ 871988 871579 872160 873190 874650 876695 879091 881324 883149 884638 885574 885207 882964 879211 874853 870130
50065H70130n863p687q961q800p691o797o617o699o465n865n226m754m313l610
$$ 870130 864267 856580 847619 838819 831128 824331 817714 811015 804550 798685 793459 788705 784392 780782
50051G80782k532j307k72N69J569K931M369N479O289P180Q289R321J0046J0631
$$ 780782 778250 776943 776671 777240 778809 781740 786109 791588 797877 805057 813346 822667 832713 843344
50037H43344J1256J1630J1268J0275R472R424R624R059P550N982M994M042K270
$$ 843344 854600 866230 877498 887773 897245 906669 916293 925352 932902 938884 943878 947920 950190
50024I50190m8j749k289k315k579l090l601m180m745m651l474j854p66j03J336
$$ 950190 950142 948393 946104 943789 941210 938120 934519 930339 925594 920943 917469 915615 914849 914746 916082
50009I16082M358Q446J2378J5329J7281J8821K0705K3222K5819K7595K8228K8141
$$ 916082 920440 928886 941264 956593 973874 992695 1013400 1036622 1062441 1090036 1118264 1146405
49997A146405K7758K7013K5649K3573K0683J6716J1540N324j808j0032j9348k9001
$$ 1146405 1174163 1201176 1226825 1250398 1271081 1287797 1299337 1304661 1302853 1292821 1273473 1244472
49985A244472l7641m4109m7992m9558m9376m7938m5467m1990l7682l3038k8616
$$ 1244472 1206831 1162722 1114730 1065172 1015796 967858 922391 880401 842719 809681 781065
49974G81065k4672k1109j7790j4793j2373j0721r752r203q800q305p461o078m319
$$ 781065 756393 735284 717494 702701 690328 679607 669855 660652 651852 643547 636086 630008 625689
49961F25689k690j587q72p0J181K940N027P045Q496R213R549R826R725Q619O533
$$ 625689 622999 621412 620540 620470 621651 624591 629618 636663 645159 654372 663921 673747 683472 692091 698624
49946F98624M298K670J679R82L74k89j338k993m960o644p851r016j0664j2697
$$ 698624 702922 705592 707271 708253 708627 708338 707000 704007 699047 692403 684552 675536 664872 652175
49932F52175j4367j4969j4517j3547j2372j0871r107p629o731n843m289k405j109
$$ 652175 637808 622839 608322 594775 582403 571532 562425 554796 548065 542222 537933 535528 534419
49919E34419n06K10J346K199K337K459L265M257M512M223M480N719P301Q591R564
$$ 534419 533913 534123 535469 537668 540005 542464 545729 549986 554498 558721 563201 568920 576221 584812 594376
49904E94376J0231J0330R982R942J0675J1605J1790J1003R651P838N211J844j351
$$ 594376 604607 614937 624919 634861 645536 657141 668931 679934 689585 697423 702634 704478 703127
49891G03127l530m985o774r284j1602j2642j2513j2303j2590j2810j2217j0992
$$ 703127 699597 694612 687838 678554 666952 654310 641797 629494 616904 604094 591877 580885
49879E80885r955r505r285q778p871o781n733m727l549k039m55O50J093J371K080
$$ 580885 570930 561425 552140 543362 535491 528710 522977 518250 514701 512662 512207 512857 513950 515321 517401
49864E17401L229M459N690P120Q647R810J0363J0549J0707J0907J1073J1173J1149
$$ 517401 520630 525089 530779 537899 546546 556356 566719 577268 587975 598882 609955 621128 632277
49851F32277J0860J0147Q804O614L724R18r92k119l374n224p100q287q923r566
$$ 632277 643137 653284 662088 668702 672426 673344 672352 670233 666859 661635 654535 646248 637325 627759
49837F27759j0170j0204r626r029q662p936o282m035k032n82O29J753K558L087
$$ 627759 617589 607385 597759 588730 580068 572132 565850 561815 559783 559201 559830 561583 564141 567228
49823E67228L970N623P521Q764R192R422R899J0428J0676J0523R796Q243O070
$$ 567228 571198 576821 584342 593106 602298 611720 621619 632047 642723 653246 663042 671285 677355
$$ [...]
##END NTUPLES=NMR SPECTRUM
##END=
