##TITLE=AC1750_SEN00023_9280823_mYdIHHmsZ0
##JCAMPDX= 6.0         $$ Bruker NMR JCAMP-DX V2.0
##DATA TYPE= NMR SPECTRUM
##DATA CLASS= NTUPLES
##ORIGIN= BRUKER
##OWNER= Administrator
$$ 1.72 TOPSPIN		Version 2.1
$$ 2015-07-17 19:51:34.088 -0700  Administrator@X
$$ Compression mode = diff/dup
##.OBSERVE FREQUENCY= 400.02188249412
##.OBSERVE NUCLEUS= ^1H
##.ACQUISITION MODE= SIMULTANEOUS (DQD)
##.ACQUISITION SCHEME= undefined
##.AVERAGES= 64
##.DIGITISER RES= 22
##SPECTROMETER/DATA SYSTEM= spect
##.PULSE SEQUENCE= noesygpps1d.comp
##.SOLVENT NAME= COFFEE_meoh
##.SHIFT REFERENCE= INTERNAL, COFFEE_meoh, 1, 14.96104
##AUDIT TRAIL= $$ (NUMBER, WHEN, WHO, WHERE, PROCESS, VERSION, WHAT)
$$ ##TITLE= Audit trail, TOPSPIN		Version 2.1
$$ ##JCAMPDX= 5.01
$$ ##ORIGIN= Bruker BioSpin GmbH
$$ ##OWNER= Administrator
$$ $$ E:\/data/COFFEE/nmr/AC1750_SEN00023_9280823_mYdIHHmsZ0/12/pdata/1/auditp.txt
$$ ##AUDIT TRAIL=  $$ (NUMBER, WHEN, WHO, WHERE, PROCESS, VERSION, WHAT)
(   1,<2015-07-17 19:51:28.822 -0700>,<Administrator>,<X>,<go>,<TOPSPIN 2.1>,
      <created by zg
	started at 2015-07-17 19:39:59.354 -0700,
	POWCHK enabled, PULCHK disabled,
       configuration hash MD5:
       21 0F 79 D6 B3 7B B4 F6 88 20 88 DB 03 48 BD 9F
       data hash MD5: 64K
       96 53 8B 38 15 8F E8 4E 41 1A 70 72 F7 DA BC 66>)
(   2,<2015-07-17 19:51:32.260 -0700>,<Administrator>,<X>,<proc1d>,<TOPSPIN 2.1>,
      <Start of raw data processing
       efp LB = 0.3 FT_mod = 6 PKNL = 1 PHC0 = 0 PHC1 = 0 SI = 128K 
       data hash MD5: 128K
       47 70 C2 43 EB 07 47 BE CA 4D FD CA EA 3D 48 1E>)
(   3,<2015-07-17 19:51:33.197 -0700>,<Administrator>,<X>,<proc1d>,<TOPSPIN 2.1>,
      <pk PHC0 = 268.2697 PHC1 = 0 
       data hash MD5: 128K
       20 07 9F B8 85 F5 86 82 79 98 89 6D A0 E8 C9 4B>)
(   4,<2015-07-17 19:51:33.588 -0700>,<Administrator>,<X>,<proc1d>,<TOPSPIN 2.1>,
      <abs ABSG = 1 
       data hash MD5: 128K
       9A B1 20 BE B3 81 76 F7 F3 38 84 C2 4F 26 0F 6C>)
(   5,<2015-07-17 19:51:33.682 -0700>,<Administrator>,<X>,<proc1d>,<TOPSPIN 2.1>,
      <abs ABSG = 2 
       data hash MD5: 128K
       56 63 D6 2A ED 03 49 56 4A 23 49 E2 4C 4B FA 91>)
(   6,<2015-07-17 19:51:33.760 -0700>,<Administrator>,<X>,<proc1d>,<TOPSPIN 2.1>,
      <abs ABSG = 3 
       data hash MD5: 128K
       39 5C 5A DF D0 AC D4 2F 0E D9 EA E3 48 73 6C DF>)
(   7,<2015-07-17 19:51:33.838 -0700>,<Administrator>,<X>,<proc1d>,<TOPSPIN 2.1>,
      <abs ABSG = 4 
       data hash MD5: 128K
       31 B9 0A 73 0C A5 6A 09 87 97 50 A4 D8 9D 82 B2>)
(   8,<2015-07-17 19:51:33.916 -0700>,<Administrator>,<X>,<proc1d>,<TOPSPIN 2.1>,
      <abs ABSG = 5 
       data hash MD5: 128K
       EC BA 99 36 20 86 5E 86 4B C8 33 D1 1A CA 18 C5>)
$$ ##END=
$$ 
$$ $$ hash MD5
$$ $$ 1A 26 AE A7 39 1E 86 63 32 F1 55 86 5F D5 01 89
##$RELAX= 
##$RELAX= 
##$RELAX= 
##$RELAX= 
##$RELAX= 
##$RELAX= 
##$RELAX= 
##$RELAX= 
$$ Bruker specific parameters
$$ --------------------------
##$DU= <E:\>
##$EXPNO= 12
$$ [...]
##$TP07= 0
##$TPNAME0= <>
##$TPNAME1= <>
##$TPNAME2= <>
##$TPNAME3= <>
##$TPNAME4= <>
##$TPNAME5= <>
##$TPNAME6= <>
##$TPNAME7= <>
##$TPOAL= (0..7)
0.5 0.5 0.5 0.5 0.5 0.5 0.5 0.5
##$TPOFFS= (0..7)
0 0 0 0 0 0 0 0
##$TUNHIN= 0
##$TUNHOUT= 0
##$TUNXOUT= 0
##$USERA1= <user>
##$USERA2= <user>
##$USERA3= <user>
##$USERA4= <user>
##$USERA5= <user>
##$V9= 5
##$VALIST= <valist>
##$VCLIST= <CCCCCCCCCCCCCCC>
##$VD= 0
##$VDLIST= <DDDDDDDDDDDDDDD>
##$VPLIST= <PPPPPPPPPPPPPPP>
##$VTLIST= <TTTTTTTTTTTTTTT>
##$WBST= 2048
##$WBSW= 25
##$XGAIN= (0..3)
0 0 0 0
##$XL= 0
##$YL= 0
##$YMAX_a= 6107601
##$YMIN_a= -11025389
##$ZGOPTNS= <>
##$ZL1= 120
##$ZL2= 120
##$ZL3= 120
##$ZL4= 120
##$ABSF1= 14.96104
##$ABSF2= -5.597142
##$ABSG= 5
##$ABSL= 3
##$ALPHA= 0
##$AQORDER= 0
##$ASSFAC= 0
##$ASSFACI= 0
##$ASSFACX= 0
##$ASSWID= 0
##$AUNMP= <proc_prof1d_extract.lims>
##$AXLEFT= 0
##$AXNAME= <>
##$AXNUC= <1H>
##$AXRIGHT= 0
##$AXTYPE= 0
##$AXUNIT= <>
##$AZFE= 0.1
##$AZFW= 0.1
##$BCFW= 0
##$BC_mod= 0
##$BYTORDP= 0
##$COROFFS= 0
##$CY= 15
##$DATMOD= 1
##$DC= 0
##$DFILT= <>
##$DTYPP= 0
##$F1P= 0
##$F2P= 0
##$FCOR= 0.5
##$FTSIZE= 131072
##$FT_mod= 6
##$GAMMA= 0
##$GB= 0
##$INTBC= 1
##$INTSCL= 1
##$ISEN= 128
##$LB= 0.3
##$LEV0= 0
##$LPBIN= 0
##$MAXI= 10000
##$MC2= 0
##$MEAN= 0
##$ME_mod= 0
##$MI= 0
##$NCOEF= 0
##$NC_proc= -2
##$NLEV= 6
##$NOISF1= 0
##$NOISF2= 0
##$NSP= 0
##$NTH_PI= 0
##$NZP= 0
##$OFFSET= 14.96104
##$PC= 1
##$PHC0= 268.2697
##$PHC1= 0
##$PH_mod= 1
##$PKNL= yes
##$PPARMOD= 0
##$PPDIAG= 0
##$PPIPTYP= 0
##$PPMPNUM= 2147483647
##$PPRESOL= 1
##$PSCAL= 4
##$PSIGN= 0
##$PYNMP= <proc.py>
##$REVERSE= no
##$SF= 400.020009621539
##$SI= 131072
##$SIGF1= 0
##$SIGF2= 0
##$SINO= 400
##$SIOLD= 131072
##$SPECTYP= <>
##$SREGLST= <1H.CDCl3>
##$SSB= 0
##$STSI= 131072
##$STSR= 0
##$SW_p= 8223.68421052631
##$SYMM= 0
##$S_DEV= 0
##$TDeff= 65536
##$TDoff= 0
##$TI= <>
##$TILT= no
##$TM1= 0
##$TM2= 0
##$TOPLEV= 0
##$USERP1= <user>
##$USERP2= <user>
##$USERP3= <user>
##$USERP4= <user>
##$USERP5= <user>
##$WDW= 1
##$XDIM= 131072
##$YMAX_p= 375617277
##$YMIN_p= -10685
##$CURPLOT= <Network HP LaserJet P1505>
##$CURPRIN= <$Network HP LaserJet P1505>
##$DFORMAT= <normdp>
##$LAYOUT= <+/1D_H.xwp>
##$LFORMAT= <normlp>
##$PFORMAT= <normpl>
##$SURQMSG= 1
$$ End of Bruker specific parameters
$$ ---------------------------------
##NTUPLES= NMR SPECTRUM
##VAR_NAME=  FREQUENCY,     SPECTRUM/REAL,   SPECTRUM/IMAG
##SYMBOL=    X,             R,               I
##VAR_TYPE=  INDEPENDENT,   DEPENDENT,       DEPENDENT
##VAR_FORM=  AFFN,          ASDF,            ASDF
##VAR_DIM=   131072,        131072,          131072
##UNITS=     HZ,            ARBITRARY UNITS, ARBITRARY UNITS
##FACTOR=    0.0627417313425164, 1,          1
##FIRST=     8223.62146879497, 2607,         -53225
##LAST=      0,             4183,            -53449
##MIN=       0,             -10685,          0
##MAX=       8223.62146879497, 375617277,    0
$$ Real data points
##PAGE= N=1
##DATA TABLE= (X++(R..R)), XYDATA
$$ [...]
61706D49226l422l374k860k260j521j013j381k487l363l376k846k448k576l290
$$ 449226 445804 442430 439570 437310 435789 434776 433395 430908 427545 424169 421323 418875 416299 413009
61692D13009m298m907m628l864l428l401l096k309j708j796k208k437k556k716
$$ 413009 408711 403804 399176 395312 391884 388483 385387 383078 381370 379574 377366 374929 372373 369657
61678C69657k569j864j125j028j402j510j189j043j454j975j881j017J12R20J256
$$ 369657 367088 365224 364099 363071 361669 360159 358970 357927 356473 354498 352617 351600 351712 352632 353888
61663C53888J361J379J153O03J43K48O81O98J46j94L33J325J919J885J653J510
$$ 353888 355249 356628 357781 358384 358527 358775 359456 360154 360300 360106 360439 361764 363683 365568 367221 368731
61647C68731J283Q28L67L17R42K032K874K785J953J277J184J061K79q20j606k276
$$ 368731 370014 370842 371209 371526 372468 374500 377374 380159 382112 383389 384573 385634 385913 385093 383487 381211
61631C81211l310m179l773k193r91j164j928k040j535j251j319j094n13l45r79
$$ 381211 377901 373722 369949 367756 366765 365601 363673 361633 360098 358847 357528 356434 355921 355576 354597
61616C54597j694j666j129r84j486j984j940j658j700j993k038j770j742k317
$$ 354597 352903 351237 350108 349124 347638 345654 343714 342056 340356 338363 336325 334555 332813 330496
61602C30496l156l714l829l605l034k210j658j900k712l223k891k055j425j325
$$ 330496 327340 323626 319797 316192 313158 310948 309290 307390 304678 301455 298564 296509 295084 293759
61588B93759j506j555j326j067j086j259r98k6J044J325P86K53J79P8n85j397
$$ 293759 292253 290698 289372 288305 287219 285960 284962 284936 285980 287305 288091 288344 288523 288601 288016 286619
61572B86619j504q19j12ml89q77j222j220o82J22M20j16o93k71R89J812J497P98
$$ 286619 285115 284296 284184 284180 283791 282914 281692 280472 279790 279912 280332 280216 279523 279252 280241 282053 283550 284348
61554B84348P11J093J136P73O89J102J452J454J512J801J782J157N60O66J142
$$ 284348 285059 286152 287288 288061 288750 289852 291304 292758 294270 296071 297853 299010 299570 300236 301378
61539C01378J250J011R40R91P11K93M75J314J869J462M75k97n57l98N6N03M27
$$ 301378 302628 303639 304579 305570 306281 306574 307049 308363 310232 311694 312169 311872 311315 310917 310973 311476 311903
61522C11903l39j240j550j156n92m45q73j468j511o63N15J055O74k4m86p56r41
$$ 311903 311564 310324 308774 307618 307026 306581 305708 304240 302729 302066 302581 303636 304310 304286 303800 303044 302103
61505C02103p51m8O30O80K36j68m43q48j266j229o96k35k84n80n72q7N56R93J161
$$ 302103 301352 301304 301934 302614 302850 302682 302239 301391 300125 298896 298200 297965 297681 297101 296529 296442 296998 297991 299152
61486B99152J290J549J804J787J454J055P43M59J71J6M3J17K31N31Q57O52k80
$$ 299152 300442 301991 303795 305582 307036 308091 308834 309293 309464 309480 309523 309640 309871 310402 311259 311911 311631
61469C11631j274j475p75K78J153J524J122R9p02n52J86N37L14K49O69R94Q62
$$ 311631 310357 308882 308107 308385 309538 311062 312184 312283 311581 311029 311215 311752 312066 312315 312984 313978 314840
61452C14840Q56J443J973J532M34r2M51J261J430J008O40O77R98J368J578J449
$$ 314840 315696 317139 319112 320644 321078 320986 321437 322698 324128 325136 325776 326453 327451 328819 330397 331846
61436C31846J025P04R11J582K191K282J861J253P52M63L58L19J48k91q77j242
$$ 331846 332871 333575 334486 336068 338259 340541 342402 343655 344407 344870 345228 345547 345695 345404 344527 343285
61420C43285j069l55O07J381J550R11k53j171j154k87N98P47J93m05n53m35n89
$$ 343285 342216 341861 342468 343849 345399 346310 346057 344886 343732 343445 344043 344790 344983 344578 344025 343590 343001
61403C43001j203j800j778j227r37j461k320k536j811p47J17R11J805K346J977
$$ 343001 341798 339998 338220 336993 336056 334595 332275 329739 327928 327181 327298 328209 330014 332360 334337
61388C34337R76J91m3j57m23m49J62J079J604J477J004O23O39J172J953K358J991
$$ 334337 335313 335504 335461 335304 334881 334432 334594 335673 337277 338754 339758 340381 341020 342192 344145 346503 348494
61371C48494J276J083J768K781L265K834J820R77R06J525K155K322K322K707L419
$$ 348494 349770 350853 352621 355402 358667 361501 363321 364298 365204 366729 368884 371206 373528 376235 379654
61356C79654L916M057M260M689M925M692M426M630N114N258M834M172L658L399
$$ 379654 383570 387627 391887 396576 401501 406193 410619 415249 420363 425621 430455 434627 438285 441684
61342D41684L228K837K118J518J676K479K947K455J573J135R66L12q02j565j688
$$ 441684 444912 447749 449867 451385 453061 455540 458487 460942 462515 463650 464616 464928 464126 462561 460873
61327D60873j771k229k707k793k632k437k064j453q89m06N10K134L819M730M873
$$ 460873 459102 456873 454166 451373 448741 446304 444240 442787 441898 441492 442002 444136 447955 452685 457558
61312D57558M961N443O213P013P697Q195Q698R638J1055J2139J1918J0374Q401
$$ 457558 462519 467962 474175 481188 488885 497080 505778 515416 526471 538610 550528 560902 569303
61299E69303O725N325L904K440J076j26j166k060k978m176n625o890p544p582
$$ 569303 576028 581353 585257 587697 588773 588647 587481 585421 582443 578267 572642 565752 558208 550626
61285E50626p371p225p131o810o029m870l706k851k359k061j724j086k7J142J744
$$ 550626 543255 536030 528899 522089 516060 511190 507484 504633 502274 500213 498489 497403 497376 498518 500262
61270E00262J409N88K26Q97K340L731M328M079L701L963M806N434N367M961M624
$$ 500262 501671 502259 502485 503382 505722 509453 513781 517860 521561 525524 530330 535764 541131 546092 550716
61255E50716M046K718Q94n77j177j004l74K14M3j120k395k724k342k398l041l048
$$ 550716 554762 557480 558374 557797 556620 555616 555242 555456 555499 554379 551984 549260 546918 544520 541479 538431
61239E38431j754k59M8o82j316j414j310j003r2J209K095K318K512L147L924M442
$$ 538431 536677 536418 536466 535784 534468 533054 531744 530741 530649 531858 533953 536271 538783 541930 545854 550296
61223E50296M840N404O049O525O703O463N770N118N322O414P241O760N344M245
$$ 550296 555136 560540 566589 573114 579817 586280 592050 597168 602490 608904 616145 622905 628249 632494
61209F32494L981L977L716L458L669M278M917N472O058O730P567Q845J0679J2560
$$ 632494 636475 640452 644168 647626 651295 655573 660490 665962 672020 678750 686317 695162 705841 718401
61195G18401J3592J3393J2527J1866J1619J1205J0036Q204O209M315K462Q07k00
$$ 718401 731993 745386 757913 769779 781398 792603 802639 810843 817052 821367 823829 824636 824436
61182H24436m89p16j604l099m619n946p349q839r933j0329j0394j0675j1281j1908
$$ 824436 823947 823231 821627 818528 813909 807963 800614 791775 781842 771513 761119 750444 739163 727255
61168G27255j2214j1974j1265j0700j1019j2113j2867j2446j1308j0444j0003
$$ 727255 715041 703067 691802 681102 670083 657970 645103 632657 621349 610905 600902
61157F00902r369q345p387o714n964m947l947l093k069q73j38l11r65j514k127
$$ 600902 591533 583188 575801 569087 563123 558176 554229 551136 549067 548194 548056 547745 546780 545266 543139
61142E43139l309m873n944n955n089l783k262o50Q76K176L287M369N572O900Q123
$$ 543139 539830 534957 529013 523058 517969 514186 511924 511274 512150 514326 517613 521982 527554 534454 542577
61127E42577R004R700J0699J2153J3590J4540J5208J6145J7423J8675J9765K0939
$$ 542577 551581 561281 571980 584133 597723 612263 627471 643616 661039 679714 699479 720418
61115G20418K2197K3042K3017K2228K1153K0187J9460J8878J8116J6726J4435
$$ 720418 742615 765657 788674 810902 832055 852242 871702 890580 908696 925422 939857
61104I39857J1356P873M441J408j131l361n548p776r997j2210j4447j6555j8260
$$ 939857 951213 959086 963527 964935 963804 960443 954895 947119 937122 924912 910465 893910 875650
61091H75650j9428k0222k0914k1652k2259k2266k1309j9575j7715j6084j4444
$$ 875650 856222 836000 815086 793434 771175 748909 727600 708025 690310 674226 659782
61080F59782j2592j0999j0228j0020r538q464p175n865m263k482j316j113j004
$$ 659782 647190 636191 625963 615943 606405 597941 590766 584901 580638 578156 576840 575727 574723
61067E74723M3J757K998L380L684M559N671O395O724P056P580Q273R210J0408
$$ 574723 574766 576523 579521 582901 586585 591144 596815 603210 609934 616990 624570 632843 642053 652461
61053F52461J1605J2604J3697J5266J7082J8511J9344K0037K1007K2228K3567
$$ 652461 664066 676670 690367 705633 722715 741226 760570 780607 801614 823842 847409
61042H47409K5031K6452K7441K7966K8533K9444L0285L0628L0842L1620L3026
$$ 847409 872440 898892 926333 954299 982832 1012276 1042561 1073189 1104031 1135651 1168677
61031A168677L4681L6510L8607M0455M1282M1233M1432M2724M5117M8598N3587
$$ 1168677 1203358 1239868 1278475 1318930 1360212 1401445 1442877 1485601 1530718 1579316 1632903
61020A632903O0227O8045P6824Q7139R9680J14709J32529J53721J78563K07128
$$ 1632903 1693130 1761175 1837999 1925138 2024818 2139527 2272056 2425777 2604340 2811468
61010B811468K40415K80242L27598L82679M47477N26625O24488P43564Q86648
$$ 2811468 3051883 3332125 3659723 4042402 4489879 5016504 5640992 6384556 7271204
61001G271204J054478J233345J386801J471220J466509J385614J247196J047188
$$ 7271204 8325682 9559027 10945828 12417048 13883557 15269171 16516367 17563555
60993A7563555P74018M54747J68309n891n3985l4030j8561m3116j13592k43810
$$ 17563555 18337573 18792320 18960629 18954738 18900753 18866723 18848162 18805046 18691454 18447644
60983A8447644m59784p60568j089578j359428j507327j525715j447552j313944
$$ 18447644 17987860 17227292 16137714 14778286 13270959 11745244 10297692 8983748
60975H983748j156295r95878q46610p14965o01296n03897m21685l53612k97803
$$ 8983748 7827453 6831575 5984965 5270000 4668704 4164807 3743122 3389510 3091707
60966C091707k52247k15526j86435j63446j44965j29623j16258j04059r2901q3159
$$ 3091707 2839460 2623934 2437499 2274053 2129088 1999465 1883207 1779148 1686247 1603088
60956A603088p4896o7498o0291n3310m7248m2678l9509l7198l5388l4094l3286
$$ 1603088 1528192 1460694 1400403 1347093 1299845 1257167 1217658 1180460 1145072 1110978 1077692
60945A077692l2577l1629l0623k9895k9250k8080k6223k4246k2761k1848k1213
$$ 1077692 1045115 1013486 982863 952968 923718 895638 869415 845169 822408 800560 779347
60934G79347k0520j9514j8234j7118j6438j5663j4119j2284j1481j1942j2173
$$ 779347 758827 739313 721079 703961 687523 671860 657741 645457 633976 622034 609861
60923F09861j0935q967p845p731p367o039m414l416l143l084k767j928o67M52
$$ 609861 598926 589959 582114 574383 567016 560977 556563 553147 550004 546920 544153 542225 541558 542010
60909E42010Q41O03L83M62M68J55j4N94J883K915K685J028j143k574k845k706
$$ 542010 542851 543454 543837 544299 544767 544922 544908 545502 547385 550300 552985 554013 552870 550296 547451 544745
60893E44745l084l915m408m226l914m007m239m001l331l038l761n128o081o082
$$ 544745 541661 537746 533338 529112 525198 521191 516952 512951 509620 506582 502821 497693 491612 485530
60879D85530n755n992o690o851o019m913m345m135l593k709k079j949k004k001
$$ 485530 479775 473783 467093 460242 454223 449310 444965 440830 437237 434528 432449 430500 428496 426495
60865D26495j943j698j066k12M68R86J598K101J889R72K45M38J285K074K496K620
$$ 426495 424552 422854 421788 421576 422044 423030 424628 426729 428618 429590 429835 430273 431558 433632 436128 438748
60849D38748K429J902J299R61R04Q50N69qq36j650k080k071k094k589l356l759
$$ 438748 441177 443079 444378 445339 446243 447093 447662 447654 446818 445168 443088 441017 438923 436334 432978 429219
60833D29219l539l057k688k311j644q61n01o94q56m34K74M69q1p33q65o63p31
$$ 429219 425680 422623 419935 417624 415980 415119 414618 413924 413068 412634 412908 413377 413296 412563 411698 411035 410304
60816D10304j274j977k432k428k079j856k276l196l776l509k962k986l493l681
$$ 410304 409030 407053 404621 402193 400114 398258 395982 392786 389010 385501 382539 379553 376060 372379
60802C72379l282k870k860k919k549j775j055q42j323k197k642k054q87k76o65
$$ 372379 369097 366227 363367 360448 357899 356124 355069 354227 352904 350707 348065 346011 345124 344848 344183
60787C44183j284j194m34K54L85J35l4J21L77K73k81o29r7J058J857J880J702
$$ 344183 342899 341705 341271 341525 341910 342045 342011 342132 342509 342782 342501 341872 341775 342833 344690 346570 348272
60770C48272J831J963J633J130J074J459J728J695J786K304K866K810J966Q88
$$ 348272 350103 352066 353699 354829 355903 357362 359090 360785 362571 364875 367741 370551 372517 373405
60756C73405K53J50R2k44n85n81m26m48m25R3Q68J135O98Q2n07j487k883l880
$$ 373405 373658 373808 373900 373656 373071 372490 372064 371616 371191 371284 372152 373287 373985 374067 373560 372073 369190 365310
60738C65310l982l777l964m266m115l724l672l834l668l283l261l549l432k646
$$ 365310 361328 357551 353587 349321 345206 341482 337810 333976 330308 327025 323764 320215 316783 314137
60724C14137j680r60m35j05j88n40o27l37k15n55q09l46O04J211J045M68J60M82
$$ 314137 312457 311497 311062 310957 310769 310229 309602 309265 309050 308495 307686 307340 307944 309155 310200 310668 310828 311310
60706C11310J176J612J424R74R96J710K559K907K724K398K138J858J463J067Q50
$$ 311310 312486 314098 315522 316496 317492 319202 321761 324668 327392 329790 331928 333786 335249 336316 337166
60691C37166Q97J196J751K583L519M086L828K844J798J242J158J262J417J419
$$ 337166 338063 339259 341010 343593 347112 351198 355026 357870 359668 360910 362068 363330 364747 366166
60677C66166Q63k39r54k81J498K939L051K191J200K98p96k068l073l408l019k200
$$ 366166 367029 366790 365836 365555 367053 369992 373043 375234 376434 376732 375936 373868 370795 367387 364368 362168
60661C62168j520j506k129k706k526j505q9J205J998K093J616J044Q05R09J117
$$ 362168 360648 359142 357013 354307 351781 350276 350187 351392 353390 355483 357099 358143 358948 359857 360974
60646C60974J272J244Q07j43j267k053k325k318k270k257k341k592k847k718k040
$$ 360974 362246 363490 364297 364154 362887 360834 358509 356191 353921 351664 349323 346731 343884 341166 339126
60631C39126j122m18m0K35N27O39L90m2k63j34J27K92L94M72L73j9m48n57m20
$$ 339126 338004 337586 337546 337781 338308 338947 339337 339295 339032 338898 339025 339317 339711 340183 340556 340537 340089 339532 339112
60612C39112m51p14p56l13K48M88O33J215K108K457J746N76K9M36J063R99J43
$$ 339112 338661 337947 337191 336878 337126 337614 338247 339462 341570 344027 345773 346349 346378 346814 347877 348876 349019
60595C49019p71r99m74K75P81J020J241J518J646J382P23j00p41q46k05R88K121
$$ 349019 348248 347249 346775 347050 347831 348851 350092 351610 353256 354638 355361 355261 354520 353674 353469 354457 356578
60578C56578K602K425K146K237K619K956L235L782M751N891O889P681Q272Q521
$$ 356578 359180 361605 363751 365988 368607 371563 374798 378580 383331 389222 396111 403792 412064 420585
60564D20585Q306P741P067O363N524M440L072J441l22j949l185l883l956l420
$$ 420585 428891 436632 443699 450062 455586 460026 463098 464539 464217 462268 459083 455200 451244 447824
60550D47824k584j861j270l30J235K913L956M301M558N143N907O594P285Q180
$$ 447824 445240 443379 442109 441779 443014 445927 449883 454184 458742 463885 469792 476386 483671 491851
60536D91851R276J0365J1130J1224J0475R111P549N921M075K040J41j381k588
$$ 491851 501127 511492 522622 533846 544321 553432 560981 566902 570977 573017 573158 571777 569189
60523E69189l598m447n196n857o156n773m883m014l267k208o80Q54J947K628K875
$$ 569189 565591 561144 555948 550091 543935 538162 533279 529265 525998 523790 523110 523964 525911 528539 531414
60508E31414K399J451J262K823N660Q561J1160J3944J6934J9472K1414K3522K6235
$$ 531414 533813 535264 536526 539349 545009 553570 564730 578674 595608 615080 636494 660016 686251
60495F86251K8841L0409L0968L1167L1145L0294K8012K4262J9515J4430R488M590
$$ 686251 715092 745501 776469 807636 838781 869075 897087 921349 940864 955294 964782 969372
60483I69372q47p151j3843k0044k5263k9551l2944l5157l5852l5059l3270l1199
$$ 969372 968525 961374 947531 927487 902224 872673 839729 804572 768720 733661 700391 669192
60471F69192k9358k7703k5745k3180k0333j7844j5956j4317j2531j0700r319q659
$$ 669192 639834 612131 586386 563206 542873 525029 509073 494756 482225 471525 462206 453547
60459D53547q344p673o387n013m239m001l610k775k121k301k964l134k471j602
$$ 453547 445203 437530 431143 426130 421891 417890 414280 411505 409384 407083 404119 400985 398514 396912
60445C96912j131r30o55m70p45j332j717j757j799k014k093j809j388j094p51
$$ 396912 395781 394851 394196 393726 392981 391649 389932 388175 386376 384362 382269 380460 379072 377978 377227
60430C77227j05O25R49P67L55j17o06q00l11N76R80N59K2J36O92J012J104J544
$$ 377227 377122 377747 378696 379463 379818 379701 379095 378295 377984 378560 379540 380099 380121 380257 380949 381961 383065 384609
60412C84609K451L231L460L330L192L070K833K407J750R57M11M20P43R34J093
$$ 384609 387060 390291 393751 397081 400273 403343 406176 408583 410333 411290 411701 412121 412864 413798 414891
60397D14891J656K425K660K292K097K371K367J657J131J669K629K790K281K248
$$ 414891 416547 418972 421632 423924 426021 428392 430759 432416 433547 435216 437845 440635 442916 445164
60383D45164K863L049K308J493J383J637J743J960K514K736K004R66Q42J694K393
$$ 445164 448027 451076 453384 454877 456260 457897 459640 461600 464114 466850 468854 469820 470662 472356 474749
60368D74749K244J831K006K767L460L696L594L365L051K697K566K987M008N332
$$ 474749 476993 478824 480830 483597 487057 490753 494347 497712 500763 503460 506026 509013 513021 518353
60354E18353O620P813R010J0147J0966J1213J0690R203O820M139J876M3k040m755
$$ 518353 524973 532786 541796 551943 562909 574122 584812 594015 600835 604974 606850 606893 604853 600098
60340F00098p547r549j0422j0339r498q099o584n458m885m737m872n147n341n311
$$ 600098 592551 583002 572580 562241 552743 544644 538060 532602 527717 522980 518108 512961 507620 502309
60326E02309n088m635l781k743k256k673l192k654j006O93J737K515L689N240
$$ 502309 497221 492586 488805 486062 483806 481133 477941 475287 474281 474974 476711 479226 482915 488155
60312D88155O762Q202R788J1479J2937J3981J4730J5203J5125J4171J2422J0354
$$ 488155 494917 503119 512907 524386 537323 551304 566034 581237 596362 610533 622955 633309
60300F33309Q294N935K671j456n465q411j0441j2369j4386j5728j5786j4894j3743
$$ 633309 641603 647538 650209 648753 643288 634877 624436 612067 597681 581953 566167 551273 537530
60287E37530j2446j0667q409o207m581l614l105k858k769k842l159l812m711n519
$$ 537530 525084 514417 506008 499801 495220 491606 488501 485643 482874 480032 476873 473061 468350 462831
60273D62831n848n538m733l653k374j012L7L13j05n68o52o72j070j614j720j349
$$ 462831 456983 451445 446712 443059 440685 439673 439710 440023 439918 439350 438698 438026 436956 435342 433622 432273
60257D32273j019r59q53m90p5K79Q00J523K014J961J646J499J493J387J199J076
$$ 432273 431254 430295 429442 428952 428877 429156 429956 431479 433493 435454 437100 438599 440092 441479 442678 443754
60241D43754R23N54Q5k27l99o71j058j278j041l25N84J250J499J759K601L765
$$ 443754 444677 445231 445316 445089 444690 444019 442961 441683 440642 440317 440901 442151 443650 445409 448010 451775
60225D51775M132L076J512R81J891L263M104M393M625N033N549O116O673P038
$$ 451775 455907 458983 460495 461476 463367 466630 470734 475127 479752 484785 490334 496450 503123 510161
60211E10161P097O946O745O566O465O504O551O304N646M880M392M196M020L739
$$ 510161 517258 524204 530949 537515 543980 550484 557035 563339 568985 573865 578257 582453 586473 590212
60197E90212L471L255K853K027R45P1l63o57j276k301l412m323n043n589n741
$$ 590212 593683 596938 599791 601818 602763 602834 602471 601814 600538 598237 594825 590502 585459 579870 574129
60182E74129n291m466l849l808m053l961l318k676k765l545m122l735k621j564
$$ 574129 568838 564372 560523 556715 552662 548701 545383 542707 539942 536397 532275 528540 525919 524355
60168E24355r58o81p26j226j830j804j056m15n01q11n43K04P19Q91J277K041K523
$$ 524355 523397 522716 521990 520764 518934 517130 516074 515659 515158 514347 513804 514008 514727 515618 516895 518936 521459
60151E21459K155J229M91L33N78Q34Q62P84J054K017L436M598M946M510L738L135
$$ 521459 523614 524843 525334 525667 526245 527079 527941 528725 529779 531796 535232 539830 544776 549286 553024 556159
60135E56159K989L226L468L434L291L374L627L634L199K607K138J718J178O30
$$ 556159 559148 562374 565842 569276 572567 575941 579568 583202 586401 589008 591146 592864 594042 594672
60121E94672L46M32Q23J471K291K964L028K261R67k59j034j419j728k135k602
$$ 594672 595018 595450 596273 597744 600035 602999 606027 608288 609255 608996 607962 606543 604815 602680 600078
60106F00078l074l500l731l591l161k774k640k666k713k776k774k453j763j024
$$ 600078 597004 593504 589773 586182 583021 580247 577607 574941 572228 569452 566678 564225 562462 561438
60092E61438m94L1Q54J861K618K828K438J569O22J41K13K44l24j251j963k393
$$ 561438 560944 560975 561829 563690 566308 569136 571574 573143 573765 573906 574119 574363 574039 572788 570825 568432
60076E68432k838l291l550l842m592n592o150o076n858n735n388m710m187m138
$$ 568432 565594 562303 558753 554911 550319 544727 538577 532501 526643 520908 515520 510810 506623 502485
60062E02485m197l915l393k934k545k182j981j913j601q49QO29J131J695K157
$$ 502485 498288 494373 490980 488046 485501 483319 481338 479425 477824 476975 476983 477612 478743 480438 482595
60047D82595K438K943L953M994N382N180M982M928M576L749K860K236J623O45
$$ 482595 485033 487976 491929 496923 502305 507485 512467 517395 521971 525720 528580 530816 532439 533084
60033E33084n62j487j870k029k525l584m863n859o378o556o520o311o108o121
$$ 533084 532522 531035 529165 527136 524611 521027 516164 510305 503927 497371 490851 484540 478432 472311
60019D72311o177n820m983m227m015m141m166m032l914l707l210k591k209k069
$$ 472311 466134 460314 455331 451104 447089 442948 438782 434750 430836 427129 423919 421328 419119 417050
60005D17050j824j303p20l65l83o81q49l57Q07J883K103J592J101J017J174J447
$$ 417050 415226 413923 413203 412838 412455 411774 410925 410568 411375 413258 415361 416953 418054 419071 420245 421692
59989D21692J935K478K620K298K024K063J895R18o59k019k702k893k862k613k143
$$ 421692 423627 426105 428725 431023 433047 435110 437005 437923 437264 435245 432543 429650 426788 424175 422032
59974D22032j703j496j368j038n48k29k20l17l64m60o33o29k75K09O38J252K126
$$ 422032 420329 418833 417465 416427 415879 415650 415430 415113 414749 414289 413656 413027 412752 412961 413599 414851 416977
59957D16977K464J339p22j806p86J300K523K180J060J01l71l98k09k50p23j139
$$ 416977 419441 420780 420058 418252 417466 418766 421289 423469 424529 424630 424259 423861 423652 423402 422679 421540
59941D21540r94o49q35j340j222m01Ko48j418j161j46N06N30O90J430K337L020
$$ 421540 420546 419897 419062 417722 416500 416099 416101 415453 414035 412874 412728 413234 413764 414454 415884 418221 421241
59924D21241L684M541N249N357M911M264L564K816K242K134K354K379J895J123
$$ 421241 424925 429466 434715 440072 444983 449247 452811 455627 457869 460003 462357 464736 466631 467754
59910D67754M73R2n3J32P92J727K415K531K287K089K073K094K092K173K387K677
$$ 467754 468227 468319 468266 468398 469190 470917 473332 475863 478150 480239 482312 484406 486498 488671 491058 493735
59894D93735L036L532M102M491M600M621M730M766M459L917L592L719L928L677
$$ 493735 496771 500303 504405 508896 513496 518117 522847 527613 532072 535989 539581 543300 547228 550905
59880E50905K928K224K017K090J814R43j39r69j586k280k925k994k386j844k182
$$ 550905 553833 556057 558074 560164 561978 562921 562782 561813 560227 557947 555022 552028 549642 547798 545616
59865E45616l210l844l366k240j432j250j156n97M46J647K715L418L686L866M544
$$ 545616 542406 538562 535196 532956 531524 530274 529118 528521 528967 530614 533329 536747 540433 544299 548843
59850E48843N837P105P640P404O772N889M699L400K298J333K83o18q93o80p03
$$ 548843 554680 561785 569425 576829 583601 589490 594189 597589 599887 601220 601503 600885 599992 599312 598609
59835E98609j265j924k453l285m606n639n662n185n296o031o363n743m844m482
$$ 598609 597344 595420 592967 589682 585076 579437 573775 568590 563294 557263 550900 545157 540313 535831
59821E35831m598m647m417l945l082j796p23p13j695k576k506j881j689k149k501
$$ 535831 531233 526586 522169 518224 515142 513346 512623 511910 510215 507639 505133 503252 501563 499414 496913
59806D96913k137j348p71n68m83m41n65q39j138j476j797j675p92L34P81M14j1
$$ 496913 494776 493428 492657 492089 491606 491165 490600 489761 488623 487147 485350 483675 482883 483217 483998 484412 484401
59789D84401q7l37j213k174k364j693p35Q7O17O13m7r29j396j310r95o11l7P47
$$ 484401 484314 483977 482764 480590 478226 476533 475798 475885 476502 477115 477068 476139 474743 473433 472438 471827 471790 472537
59771D72537J498J955J934J431Q73R70J891K900L253L164L323L795M150M383M877
$$ 472537 474035 475990 477924 479355 480228 481198 483089 485989 489242 492406 495729 499524 503674 508057 512934
59756E12934N474N451M579L594L368M104N349O353O422N548M674M626M881M215
$$ 512934 518408 523859 528438 532032 535400 539504 544853 551206 557628 563176 567850 572476 577357 581572
59742E81572K596J421J579K307K530K347K386K475K006J135O22O33O21L01p3m15
$$ 581572 584168 585589 587168 589475 592005 594352 596738 599213 601219 602354 602976 603609 604230 604531 604458 604043
59726F04043r74j613j690j023l27l17p52r02o31m90q02j245j401j327j298j278
$$ 604043 603069 601456 599766 598743 598416 598099 597347 596445 595814 595324 594522 593277 591876 590549 589251 587973
59710E87973j054p28o43p42n14K05P90O65K95O96J964K918K509J084j50o44r12
$$ 587973 586919 586191 585548 584806 584292 584497 585287 585952 586247 586943 588907 591825 594334 595418 595268 594624 593712
59693E93712j474j985j792j063q49j809l253l829l000j473k56J69k76j497k956
$$ 593712 592238 590253 588461 587398 586549 584740 581487 577658 574658 573185 572929 573098 572822 571325 568369
59678E68369l798l749l568l994m670m720m121l721l997m565m890m813m262l207
$$ 568369 564571 560822 557254 553260 548590 543870 539749 536028 532031 527466 522576 517763 513501 510294
59664E10294j994j175p86m53j48k08m21M3J414K798L297L076K851K850K791K450
$$ 510294 508300 507125 506339 505886 505738 505530 505109 505152 506566 509364 512661 515737 518588 521438 524229 526679
59648E26679J782Q46ql22k24m89j545k877l848m481m969m989m246l237k664k440
$$ 526679 528461 529307 529299 528977 528753 528264 526719 523842 519994 515513 510544 505555 501309 498072 495408 492968
59632D92968j997j332r33r00r05r88j570k634l625m211m503m454l762k640j914
$$ 492968 490971 489639 488706 487806 486901 485913 484343 481709 478084 473873 469370 464916 461154 458514 456600
59617D56600k025k378k100j101k5N21M69K12L57J237K461L105K664J658J033J058
$$ 456600 454575 452197 450097 448996 448971 449492 449961 450173 450530 451767 454228 457333 459997 461655 462688 463746
59601D63746J139O89j13o26n67k71j00K4L47P22P36L44n1j78k00k83k67p6n7n26
$$ 463746 464885 465574 465461 464835 464268 463997 463897 463921 464268 464990 465726 466070 466019 465841 465641 465358 465091 465015 464958 464432
59581D64432j162j344r81o03o19q75j022j021j123j440j683j399n98J3k92j298
$$ 464432 463270 461926 460945 460342 459723 458848 457826 456805 455682 454242 452559 451160 450562 450575 450283 448985
59565D48985j931j435j19J205K084K418K123J349O93N50N15mo86n44O80K052K613
$$ 448985 447054 445619 445500 446705 448789 451207 453330 454679 455372 455922 456437 456433 455747 455203 455883 457935 460548
59548D60548K457K345K698L358M120N081O478Q380J0574J2661J4190J4759J4127
$$ 460548 463005 465350 468048 471406 475526 480607 487085 495465 506039 518700 532890 547649 561776
59535E61776J2337R718O535K742j577n547p807p798o338m564k825j021M69R63
$$ 561776 574113 583831 590366 593108 591531 585984 578177 570379 564041 559477 556652 555631 556100 557063
59521E57063M19m97j246j761k115k481l317m875o456o965o352n743n851o029n366
$$ 557063 557482 556985 555739 553978 551863 549382 546065 541190 534734 527769 521417 515674 509823 503794 498428
59506D98428m141l408l605m194m568m621m410l807k770j672j011q37o84j63M41
$$ 498428 494287 490879 487274 483080 478512 473891 469481 465674 462904 461232 460221 459384 458700 458537 458978
59491D58978M78j77q34q30l64r9j50J0O64J476K124K732L401L809L735L628M128
$$ 458978 459456 459279 458445 457615 457251 457152 457002 457012 457676 459152 461276 464008 467409 471218 474953 478581 482709
59474D82709N065N463M667L192K241K443L237L577L127K474K184K083J803J637
$$ 482709 487774 493237 497904 501096 503337 505780 509017 512594 515721 518195 520379 522462 524265 525902
59460E25902K233L518M558M700M289M008M021M100M212M480M787M854M627M205
$$ 525902 528135 531653 536211 540911 545200 549208 553229 557329 561541 566021 570808 575662 580289 584494
59446E84494L432K035J78j469k429k951l635m613n417n596n243m723m091l107
$$ 584494 587926 589961 590139 588670 586241 583290 579655 575042 569625 564029 558786 554063 549972 546865
59432E46865j825p22j03L22R93J903K799L745N037O629Q164R529J0952J2459J3724
$$ 546865 545040 544318 544215 544537 545530 547433 550232 553977 559014 565643 573807 583336 594288 606747 620471
59417F20471J4689J5820J7438J9042J9674J8859J6887J4151J0502N444r26p288
$$ 620471 635160 650980 668418 687460 707134 725993 742880 757031 767533 772977 772051 764763
59405G64763j1656j2770j0924p415l511r8K148K911K419Q88k046o714j2159j6308
$$ 764763 753107 740337 729413 721998 718487 718389 720537 723448 725867 726755 724709 717995 705836 689528
59391F89528j7757j6910j5103j3151j1161r121p069m875k456j52J466K159K174
$$ 689528 671771 654861 639758 626607 615446 606325 599256 594381 591925 591773 593239 595398 597572
59378E97572J973J954K212K409K101J369Q71J029J471J593J355J163J226J464
$$ 597572 599545 601499 603711 606120 608221 609590 610461 611490 612961 614554 615909 617072 618298 619762
59364F19762J850K361K738K800K904L633M949O168O881P430Q245R140R637R732
$$ 619762 621612 623973 626711 629511 632415 636048 640997 647165 654046 661476 669721 678861 688498 698230
59350F98230R941J0596J1422J1928J1967J1747J1398J0777R804Q707P680O464
$$ 698230 708171 718767 730189 742117 754084 765831 777229 788006 797810 806517 814197 820661
59338H20661M571J985p38l107n191p214q973j0048j0492j0916j1698j2412j2310
$$ 820661 825232 827217 826479 823372 818181 810967 801994 791946 781454 770538 758840 746428 734118
59325G34118j1311j0174r607r448r079q419q062q294q558q248p551o966o382n329
$$ 734118 722807 712633 703026 693578 684499 676080 668018 659724 651166 642918 635367 628401 622019 616690
59311F16690m052l394l520l425k110K90K890N010O393O957O824O332N605M317
$$ 616690 612638 609244 605724 602299 600189 600479 603369 608379 614772 621729 628553 634885 640490 644807
59297F44807K140q27m308q078j1553j3660j3703j2179j0228q467o755m939l157
$$ 644807 646947 646120 641812 633734 622181 608521 594818 582639 572411 563944 557189 552250 549093
59284E49093j576k40P81J467K070K856L758M613N609P030Q669R933J0502J0524
$$ 549093 547517 547277 548058 549525 551595 554451 558209 562822 568431 575461 584130 594063 604565 615089
59270F15089J0254R945R959J0351J0463R462P396N185L465K013M08j264k681l718
$$ 615089 625343 635288 645247 655598 666061 675523 682919 688104 691569 693582 693990 692726 690045 686327
59256F86327m353m551m516m634m908m848m234l551l272l078k363j168r8N84J281
$$ 686327 681974 677423 672907 668273 663365 658517 654283 650732 647460 644382 642019 640851 640753 641337 642618
59241F42618K407L832N053N686N724N468N235N046M652L894K878J712L62j098
$$ 642618 645025 648857 653910 659596 665320 670788 676023 681069 685721 689615 692493 694205 694567 693469
59227F93469k407l570m996o740q020q072p302o889p297p920q234q429q651q457
$$ 693469 691062 687492 682496 675756 667736 659664 652362 645473 638176 630256 622022 613593 604942 596485
59213E96485p560o499n876n413m533l463k925k910k637j830j140j048j123p52
$$ 596485 588925 582426 576550 571137 566604 563141 560216 557306 554669 552839 551699 550651 549528 548776
59199E48776m9M87P38R39J191J444J756K104K225K018J940K535L650M572M873
$$ 548776 548727 549214 549952 550891 552082 553526 555282 557386 559611 561629 563569 566104 569754 574326 579199
59184E79199M800M748M756M643M357M104M083M201M087L590L187L456M181M476
$$ 579199 583999 588747 593503 598146 602503 606607 610690 614891 618978 622568 625755 629211 633392 637868
59170F37868M028L550L607L701L182K429K172K086J218l41j524k050k893m583
$$ 637868 641896 645446 649053 652754 655936 658365 660537 662623 663841 663500 661976 659926 657033 652450
59156F52450o283p158p620q311q796q322p254o637o616o394n651n027n093n664
$$ 652450 646167 639009 631389 623078 614282 605960 598706 592069 585453 579059 573408 568381 563288 557624
59142E57624o269o635o539n810m753m076m114m467m571m309l822l141k204j051
$$ 557624 551355 544720 538181 532371 527618 523542 519428 514961 510390 506081 502259 499118 496914 495863
59128D95863J89J366K216K546K578K917L894N147O071O521O853P372Q030Q692
$$ 495863 496052 497418 499634 502180 504758 507675 511569 516716 522787 529308 536161 543533 551563 560255
59114E60255R367R981J0149R488Q240P233P079P541P837P470O518N289M030K910
$$ 560255 569622 579603 589752 599240 607480 614713 621792 629333 637170 644640 651158 656447 660477 663387
59100F63387J990J087m0j367k592l451l773l418k594k032k331l050l063j991o48
$$ 663387 665377 666464 666424 665057 662465 659014 655241 651823 649229 647197 644866 641816 638753 636762 636114
59085F36114K8j52j030k520m154m995m773m516n242o526p154o808o126n437m497
$$ 636114 636142 635990 634960 632440 628286 623291 618518 614002 608760 602234 595080 588272 582146 576709 572212
59070E72212l427k834k891l156l393l735l847l040j540p19j389k669l193k766
$$ 572212 568785 565951 563060 559904 556511 552776 548929 545889 544349 543630 542241 539572 536379 533613
59056E33613k026j185r7P81O23n11j538j680j220p30k76K50O35O62N73O67P42
$$ 533613 531587 530402 530305 531086 531709 531198 529660 527980 526760 526030 525754 526004 526639 527301 527874 528541 529283
59039E29283M68O6L8L16L34PK3Q32J933K563K697K893L439M185N033O029P015
$$ 529283 529751 529817 529855 530171 530505 530512 530535 531367 533300 535863 538560 541453 544892 549077 554110 560139 567154
59022E67154P741Q315R032R744R805Q834P083N127L477K463J940J168l91k147
$$ 567154 574895 583210 592242 601986 611791 620625 627708 632835 636312 638775 640715 641883 641492 639345
59008F39345k961k658k144j851j130L94J900K546K689L059L487L446L217L394
$$ 639345 636384 633726 631582 629731 628601 628995 630895 633441 636130 639189 642676 646122 649339 652733
58994F52733L682L372K721K583K867K574J460M22m2n68j675k774l000k318j303
$$ 652733 656415 659787 662508 665091 667958 670532 671992 672414 672372 671804 670129 667355 664355 662037 660734
58979F60734l44M38J101K018L607N570P048P829Q763J0414J2043J2558J1987J1292
$$ 660734 660390 660828 661929 663947 667554 673124 680172 688001 696764 707178 719221 731779 743766 755058
58965G55058J1013J0792J0150R141Q166P488P029O434N344L582J062k301o209
$$ 755058 766071 776863 787013 796154 804320 811808 818837 825271 830615 834197 835259 832958 826749
58952H26749r648j1610j2269j2813j3924j4997j5212j4612j3629j2260j0455q807
$$ 826749 817101 805491 793222 780409 766485 751488 736276 721664 708035 695775 685320 676513
58940F76513p971p666p079o094n364n158m932m205l261k615k312k026j575j044
$$ 676513 668542 660876 653797 647703 642339 637181 632249 628044 624783 622168 619856 617830 616255 615211
58926F15211n70k11J06N03R50J086N84l90j193j310q18j57L19N76Q31J339K163
$$ 615211 614641 614430 614536 615039 615989 617075 617659 617269 616076 614766 613948 613791 614110 614686 615517 616856 619019
58909F19019L169M253N494O899Q130Q743Q711Q532Q741R466J0473J1398J1932
$$ 619019 622188 626441 631935 638834 646964 655707 664418 672950 681691 691157 701630 713028 724960
58896G24960J1976J1774J1778J2223J2938J3657J4440J5540J6886J7933J8156
$$ 724960 736936 748710 760488 772711 785649 799306 813746 829286 846172 864105 882261
58885H82261J7581J6618J5393J3505J0614P099L857J411o14k967n918r037j1760
$$ 882261 899842 916460 931853 945358 955972 963071 966928 968339 967725 964758 958840 949803 938043
58872I38043j3783j4893j4753j3293j1244r754r298r283q958q383q076q099q048
$$ 938043 924260 909367 894614 881321 870077 860323 851025 841742 832784 824401 816325 808226 800178
58859H00178p865p950q400q802q965r253r880j0442j0501j0159r688r067q343
$$ 800178 792313 784363 775963 767161 758196 748943 739063 728621 718120 707961 698273 689206 680863
58846F80863p952q123q396q242p820p530p315p014o932p260p363o540n205m336
$$ 680863 672911 664788 656392 648150 640330 632800 625485 618471 611539 604279 596916 590376 585171 580835
58832E80835l986l427k591k164k143j589j92J121J638J862K421L009L185L354
$$ 580835 576849 573422 570831 568667 566524 564935 564743 565864 567502 569364 571785 574794 577979 581333
58818E81333M050M868N135N081N350N680N134L596K024J088M01n79j542j769j269
$$ 581333 585383 590251 595386 600467 605817 611497 616631 620227 622251 623339 623740 623161 621619 619850 618581
58803F18581r08j427k631l729m303m604m876m921m624m506n075n822n646m322
$$ 618581 617673 616246 613615 609886 605583 600979 596103 591182 586558 582052 576977 571155 565509 561187
58789E61187k820j975j561r80j58P41J819L078L991M069L569L127K941K795K562
$$ 561187 558367 556392 554831 553851 553693 554434 556253 559331 563322 567391 570960 574087 577028 579823 582385
58774E82385K216J539L04j324k941m332n480o319o729o714o361n852n516n527
$$ 582385 584601 586140 586444 585120 582179 577847 572367 566048 559319 552605 546244 540392 534876 529349
58760E29349n509m879l739k773k136j156M26J731J930J502J523K177K795K996
$$ 529349 523840 518961 515222 512449 510313 509157 509583 511314 513244 514746 516269 518446 521241 524237
58746E24237K919K663K337K481L530M952N680N422M799M308L956L897M478N450
$$ 524237 527156 529819 532156 534637 538167 543119 548799 554221 559020 563328 567284 571181 575659 581109
58732E81109N929N490M690M233M274M705N497O311O445N670M719M369M415M137
$$ 581109 587038 592528 597218 601451 605725 610430 615927 622238 628683 634353 639072 643441 647856 651993
58718F51993L517L308L919M856N490N874O324O551N748L638J000j187k762m278
$$ 651993 655510 658818 662737 667593 673083 678957 685281 691832 697580 701218 702218 701031 698269 693991
58704F93991o042p800r329j0800j2299j3492j4049j4118j4040j3837j3343j2619
$$ 693991 687949 680149 670820 660020 647721 634229 620180 606062 592022 578185 564842 552223
58692E52223j1886j1158j0244r051p698o335n105m172l638l445l398l288l001
$$ 552223 540337 529179 518935 509884 502186 495851 490746 486574 482936 479491 476093 472805 469804
58679D69804k658k484k385j802m75R28J543J553J929K919L832M511N796P938R679
$$ 469804 467146 464662 462277 460475 460000 460928 462471 464024 465953 468872 472704 477215 483011 490949 500628
58664E00628R952R526R703J0068Q981O051K641j49k577n006o862p581p661p873
$$ 500628 510580 520106 529809 539877 548858 554909 557550 557401 554824 549818 542956 535375 527714 519841
58650E19841q007p299n790m451l947l888l537k825k259k022j593m55J148K438
$$ 519841 511834 504535 498745 494294 490347 486459 482922 480097 477838 475816 474223 473768 474916 477354
58636D77354K991L035K904K635K186J610R32J98l02k93j30m89j288j507m94J146
$$ 477354 480345 483380 486284 488919 491105 492715 493647 493845 493543 493250 493120 492631 491343 489836 489342 490488
58620D90488K400K996L235L273L205L357L845M219M146M002M186M287L634K367
$$ 490488 492888 495884 499119 502392 505597 508954 512799 517018 521164 525166 529352 533639 537273 539640
58606E39640J230N66J74j15l69p65j282j461j091p47r96j458j359o28K68J134
$$ 539640 540870 541436 541610 541495 541126 540361 539079 537618 536527 535780 534784 533326 531967 531339 531607 532741
58590E32741J953K454K626L185M551N931O470O745P775R010Q931P502O408O616
$$ 532741 534694 537148 539774 542959 547510 553441 559911 566656 574431 583441 592372 599874 606282 612898
58576F12898P316P666Q052Q986R998J0530J0956J1898J3235J4476J5577J6806
$$ 612898 620214 627880 635932 644918 654916 665446 676402 688300 701535 716011 731588 748394
58564G48394J8298K0076K2014K3519K3865K3021K1539J9478J6267J1939P561M032
$$ 748394 766692 786768 808782 832301 856166 879187 900726 920204 936471 948410 955971 960003
58552I60003J198j414l706n305o146o372o153n940o345p486r057j1046j3659j6390
$$ 960003 961201 959787 956081 950776 944630 938258 932105 926165 919820 912334 903277 892231 878572 862182
58538H62182j8207j8947j9562k0469k0696j9336j6943j4693j2860j0973q951p199
$$ 862182 843975 825028 805466 784997 764301 744965 728022 713329 700469 689496 680545 673346
58526F73346n918m956m162l444k705k069j791j763j555j164j092j453j725j664
$$ 673346 667428 662472 658310 654866 652161 650092 648301 646538 644983 643819 642727 641274 639549 637885
58512F37885j758k262k614k346j797j408j038o22p46j684k584k467j591q89n36
$$ 637885 636127 633865 631251 628905 627108 625700 624662 624040 623294 621610 619026 616559 614968 614079 613543
58497F13543p7L94K87l13m98K68J575K822L921M997N956O639P114P611Q293R215
$$ 613543 613466 613860 614147 613834 613336 613604 615179 618001 621922 626919 632875 639514 646628 654239 662532 671747
58481F71747J0337J1517J2496J3045J3144J3037J2900J2374J0721P785M465J711
$$ 671747 682084 693601 706097 719142 732286 745323 758223 770597 781318 789103 793568 795279
58469G95279o55l387o284q063p950o532m892l490k187o70J371L906O192P444P942
$$ 795279 794624 791237 784953 776890 768940 762408 757516 754026 751839 751169 752540 756446 762638 770082 778024
58454G78024Q737J0055J0848J0245Q494O123L122m27l736o165q018r799j1204
$$ 778024 786761 796816 807664 817909 826403 832526 835648 835221 831485 825320 817302 807503 796299
58441G96299j1536j0652q969o931m973l568k723j858n34J020K404L471M079M097
$$ 796299 784763 774111 765142 758211 753238 749670 746947 745089 744555 745575 747979 751450 755529 759626
58427G59626M056M902O628P911P730O622N599M618K994P88j231k679l861n084
$$ 759626 763682 768584 775212 783123 790853 797475 803074 807692 810686 811474 810243 807564 803703 798619
58413G98619o312p293p715p450o983p085p790q184p650o683o025n580m733l296
$$ 798619 792307 785014 777299 769849 762866 755781 747991 739807 732157 725474 719449 713869 709136 705840
58399G05840j537K10J497J788J163N48P22J382J642J179M24p0j05J38M59J130
$$ 705840 704303 704513 706010 707798 708961 709509 710231 711613 713255 714434 714858 714788 714683 714821 715280 716410
58383G16410K856N771Q799J0723J1641J2429J3117J2980J2057J1180J0417R114
$$ 716410 719266 725037 733836 744559 756200 768629 781746 794726 806783 817963 828380 837494
58371H37494P588P126P932Q757R089R857J1320J2097J1365J0313J0198J0582J0686
$$ 837494 845082 852208 860140 868897 877986 887843 899163 911260 922625 932938 943136 953718 964404
58358I64404J0925J1621J1696J0192P932O208M949L541K309J732J289N68L98J502
$$ 964404 975329 986950 998646 1008838 1016770 1022978 1027927 1031468 1033777 1035509 1036798 1037366 1037764 1039266
58344A039266L080M185N323P171Q953R718J0116J1211J2582J3360J3972J5052
$$ 1039266 1042346 1046531 1051854 1059025 1067978 1077696 1087812 1099023 1111605 1124965 1138937 1153989
58332A153989J5747J5097J4033J3927J4103J2983J0872R256Q066O058L526K153
$$ 1153989 1169736 1184833 1198866 1212793 1226896 1239879 1250751 1260007 1268073 1274131 1277657 1279810
58320A279810K320K721K705K920L677M502N412O919Q745J0134J1244J2704J4073
$$ 1279810 1282130 1284851 1287556 1290476 1294153 1298655 1304067 1310986 1319731 1329865 1341109 1353813 1367886
58307A367886J4361J3851J3749J4375J5105J5781J6539J6867J6413J6162J7093
$$ 1367886 1382247 1396098 1409847 1424222 1439327 1455108 1471647 1488514 1504927 1521089 1538182
58296A538182J8400J8800J8836J9763K0978K0902J9877J9790K1105K2602K3811
$$ 1538182 1556582 1575382 1594218 1613981 1634959 1655861 1675738 1695528 1716633 1739235 1763046
58285A763046K5370K7064K7795K7637K7883K9031L0569L2489L5212L8233M0732
$$ 1763046 1788416 1815480 1843275 1870912 1898795 1927826 1958395 1990884 2026096 2064329 2105061
58274B105061M3140M6238M9289N1082N2142N3756N5588N6565N7312N9159O1568
$$ 2105061 2148201 2194439 2243728 2294810 2346952 2400708 2456296 2512861 2570173 2629332 2690900
58263B690900O3072O4034O5756O7670O8359O8578P0140P2462P3412P3130P3770
$$ 2690900 2753972 2818006 2883762 2951432 3019791 3088369 3158509 3230971 3304383 3377513 3451283
58252C451283P5972P8657Q1778Q5973R0150R2879R5596J00917J08402J15570J22209
$$ 3451283 3527255 3605912 3687690 3773663 3863813 3956692 4052288 4153205 4261607 4377177 4499386
58241D499386J29826J37779J44321J50710J59724J70709J80795J90399K02476
$$ 4499386 4629212 4766991 4911312 5062022 5221746 5392455 5573250 5763649 5966125
58232E966125K16828K30580K43966K60210K79630K99504L19750L43028L69283
$$ 5966125 6182953 6413533 6657499 6917709 7197339 7496843 7816593 8159621 8528904
58223H528904L96153M24765M58855M98289N40024N85343O39066P01703P70124
$$ 8528904 8925057 9349822 9808677 10306966 10846990 11432333 12071399 12773102 13543226
58214A3543226Q46061R35807J041457J161432J300003J466829J666790J900929
$$ 13543226 14389287 15325094 16366551 17527983 18827986 20294815 21961605 23862534
58206B3862534K178309K515353K921700L398217L950312M590730N328511O169918
$$ 23862534 26040843 28556196 31477896 34876113 38826425 43417155 48745666 54915584
58198E4915584P132694Q246330R541441J1059344J2870686J5059610J7685003
$$ 54915584 62048278 70294608 79836049 90895393 103766079 118825689 136510692
58191A36510692K0761616K4214792K7730850L0620396L1970292L1100486K7894678
$$ 136510692 157272308 181487100 209217950 239838346 271808638 302909124 330803802
58184C30803802K2624431J5514806O674238l463278j3765999k2671396k8919798
$$ 330803802 353428233 368943039 375617277 372153999 358388000 335716604 306796806
58177C06796806l2085438l2534679l1027893k8354655k5154122k1865411j8745166
$$ 306796806 274711368 242176689 211148796 182794141 157640019 135774608 117029442
58170A17029442j5922961j3454185j1344480r564486q073737o836965n819253
$$ 117029442 101106481 87652296 76307816 66743330 58669593 51832628 46013375
58163D6013375m980029m282142l700340l215237k806664k458536k162916j913307
$$ 46013375 41033346 36751204 33050864 29835627 27028963 24570427 22407511 20494204
58155B0494204j699499j513104j351752j213319j091577r81564q83676p98433
$$ 20494204 18794705 17281601 15929849 14716530 13624953 12643389 11759713 10961280
58147A0961280p22177o51723n88525n34444m87543m45430m08701l77857l50561
$$ 10961280 10239103 9587380 8998855 8464411 7976868 7531438 7122737 6744880 6394319
58138F394319l25011l02537k84082k67399k50355k33799k18872k04577j90272
$$ 6394319 6069308 5766771 5482689 5215290 4964935 4731136 4512264 4307687 4117415
58129D117415j77431j66706j56373j45599j36189j29091j22361j14600j07292
$$ 4117415 3939984 3773278 3616905 3471306 3335117 3206026 3083665 2969065 2861773
58120B861773j01607r6004q9356q3352p9403p5941p1308o6724o3743o1219n7531
$$ 2861773 2760166 2664162 2574806 2491454 2412051 2336110 2264802 2198078 2134335 2073116 2015585
58109B015585n3701n1590n0666m9118m6756m4490m2212l9360l6523l4543l3018
$$ 2015585 1961884 1910294 1859628 1810510 1763754 1719264 1677052 1637692 1601169 1566626 1533608
58098A533608l1256k9752k9244k9311k9162k8781k8209k6951k5098k3754k3450
$$ 1533608 1502352 1472600 1443356 1414045 1384883 1356102 1327893 1300942 1275844 1252090 1228640
58087A228640k3348k2840k2413k2248k1637k0657k0556k1550k2115k1555k1179
$$ 1228640 1205292 1182452 1160039 1137791 1116154 1095497 1074941 1053391 1031276 1009721 988542
58076I88542k1737k1791k0254j8523j8235j8598j7929j6369j5156j4388j3376
$$ 988542 966805 945014 924760 906237 888002 869404 851475 835106 819950 805562 792186
58065G92186j2176j1099r720p973p097p906r067q823p539o912p487q527r654j0923
$$ 792186 780010 768911 759191 751218 744121 736215 727148 718325 710786 703874 696387 687860 678206 667283
58051F67283j1810j1662j0783r865q864p528o368n935n745n186m749n176n979
$$ 667283 655473 643811 633028 623163 614299 606771 600403 594468 588723 583537 578788 573612 567633
58038E67633o125n616n206n043m803m727n261o082o552o843p500q317q649q526
$$ 567633 561508 555892 550686 545643 540840 536113 530852 524770 518218 511375 503875 495558 486909 478383
58024D78383q473q522q300p803p289o720o017n434n071m512l644l130l358l615
$$ 478383 469910 461388 453088 445285 437996 431276 425259 419825 414754 410242 406598 403468 400110 396495
58010C96495l159k382k016j905j597j393j690j931j387n39l97q28q17j05N59P35
$$ 396495 393336 390954 388938 387033 385436 384043 382353 380422 379035 378496 378099 377271 376454 376349 376908 377643
57994C77643P52Q58R07R15J163J659K142K523K771K490J303n00k168l226l669
$$ 377643 378395 379253 380160 381075 382238 383897 386039 388562 391333 393823 395126 394626 392458 389232 385563
57979C85563l724l801m228m696m447l461k725k791k913k304j454j255j480j288
$$ 385563 381839 378038 373810 369114 364667 361206 358481 355690 352777 350473 349019 347764 346284 344996
57965C44996p17n46j002j654k385l387m275m212l064j697j021j242j962k504k340
$$ 344996 344279 343733 342731 341077 338692 335305 331030 326818 323754 322057 321036 319794 317832 315328 312988
57950C12988j639j147j166j090m65J26n2o38o47K08J473K785L974M641M615M535
$$ 312988 311349 310202 309036 307946 307481 307607 307555 306917 306270 306478 307951 310736 314710 319351 323966 328501
57934C28501N168O251O754O124M678K986J542O77Q5j179l475n746o685o424o128
$$ 328501 333669 339920 346674 352798 357476 360462 362004 362681 362766 361587 358112 352366 345681 339257 333129
57919C33129o320o542o498o467o568o425n630m017j671P34K065J955J561K157
$$ 333129 326809 320267 313769 307302 300734 294309 288679 284662 282991 283725 285790 287745 289306 291463
57905B91463L395L940L486K986K952K870K382J932J851J798J434R29M79K8l09
$$ 291463 294858 298798 302284 305270 308222 311092 313474 315406 317257 319055 320489 321418 321897 321925 321616
57890C21616k57l4l49j365k316k462j958j459j277j290j353j544j995k602k996
$$ 321616 321359 321325 320976 319611 317295 314833 312875 311416 310139 308849 307496 305952 303957 301355 298359
57875B98359k905k589k535k688k432j571p25l68j60L35Q67J107J300J623J635
$$ 298359 295454 292865 290330 287642 285210 283639 282914 282546 282386 282721 283588 284695 285995 287618 289253
57860B89253J175J187K487M303N150M790M187L886L673L601L977M398M034K907
$$ 289253 290428 291615 294102 298405 303555 308345 312532 316418 320091 323692 327669 332067 336101 339008
57846C39008J863J175L47p40j605k152k751l300l325l121l557m545m923m203l241
$$ 339008 340871 342046 342393 341653 340048 337896 335145 331845 328520 325399 321842 317297 312374 308171 304930
57831C04930k853k814k697k567k406j771o00M75J051J327J345Q01k6k42L31P43
$$ 304930 302077 299263 296566 293999 291593 289822 289222 289697 290748 292075 293420 294221 294195 293953 294284 295027
57815B95027L42l89r14j586k782m102n057n781o382o449n886n409n420n169l909
$$ 295027 295369 294980 294066 292480 289698 285596 280539 274758 268376 261927 256041 250632 245212 240043 236134
57800B36134k172j007m99qO07Q62N58N0k37p1N19J087J082P42J036K313L535L579
$$ 236134 233962 232955 232456 232448 233055 233917 234475 234525 234288 234217 234736 235823 236905 237647 238683 240996 244531 248110
57782B48110K684K024K259L197M421N570O257O383O315O246N770M559L008J676
$$ 248110 250794 252818 255077 258274 262695 268265 274522 280905 287220 293466 299236 303795 306803 308479
57768C08479N29o48j584j953k118k708l727m680n255n388m932l931k880k230j889
$$ 308479 309008 308360 306776 304823 302705 299997 296270 291590 286335 280947 276015 272084 269204 266974 265085
57753B65085j703j813k070j704l84R97J431J195J159J237P61np4N92R36N10J33
$$ 265085 263382 261569 259499 257795 257411 258408 259839 261034 262193 263430 264191 264186 264112 264704 265640 266150 266283
57736B66283M11Q13P43N93J005J780K260K288K171K032J827J776K182K888L310
$$ 266283 266694 267507 268250 268843 269848 271628 273888 276176 278347 280379 282206 283982 286164 289052 292362
57721B92362L075K372J689J283Q74l8j509k861l338l017k682k831l215l361l180
$$ 292362 295437 297809 299498 300781 301655 301617 300108 297247 293909 290892 288210 285379 282164 278803 275623
57706B75623k792k231j648j449j823k273k047j035Q7O58O70M76J25o42j835k965
$$ 275623 272831 270600 268952 267503 265680 263407 261360 260325 260412 261070 261740 262216 262341 261699 259864 256899
57690B56899l539l601l542l501l182k295r68L68J351J963K571L701N576P854R974
$$ 256899 253360 249759 246217 242716 239534 237239 236271 236639 237990 239953 242524 246225 251801 259655 269629
57675B69629J1754J3462J5456J8067K1787K6994L3261L9219M3321M4649M2944
$$ 269629 281383 294845 310301 328368 350155 377149 410410 449629 492950 537599 580543
57664E80543L8226L0511J9732N981r749k5082l7119m4146m6360m4968m1159l6052
$$ 580543 618769 649280 669012 674993 665244 640162 603043 558897 512537 467569 426410 390358
57652C90358l0819k6195k2086j8141j4426j1240q615o464m952m294m276m296l845
$$ 390358 359539 333344 311258 293117 278691 267451 258836 252372 247420 243126 238850 234554 230709
57639B30709k779j340n9O16P27O07L50j43n90n02n0k5o21j055p94l62l63n37m73
$$ 230709 227930 226590 226531 227147 227874 228481 228831 228688 228098 227596 227546 227521 226900 225845 225051 224689 224326 223789 223316
57620B23316n26j102j705j714j553k011k734k643j619o61l71l94m35p11j240j599
$$ 223316 222790 221688 219983 218269 216716 214705 211971 209328 207709 207048 206677 206283 205848 205137 203897 202298
57604B02298j648j656j513p77K43M47n31j624j760j239j090j568k054k062j713
$$ 202298 200650 198994 197481 196704 196947 197394 196863 195239 193479 192240 191150 189582 187528 185466 183753
57589A83753j385j343j640k029k108j768j320j006o62r7N04P81O69L35j57q42
$$ 183753 182368 181025 179385 177356 175248 173480 172160 171154 170492 170395 170899 171680 172349 172684 172527 171685
57573A71685j610k166k309k104j841j750j824j843j622j120l51N53J184J127N51
$$ 171685 170075 167909 165600 163496 161655 159905 158081 156238 154616 153496 153145 153698 154882 156009 156560
57558A56560J30J33J06k26l05L61J299J804K175L097M115L941K374P35Q2J5k66
$$ 156560 156690 156823 156929 156703 156398 156759 158058 159862 162037 165134 169249 173190 175564 176299 176381 176396 176130
57541A76130p31r83j194j670k061j743p31L46J028J255J079O09J08j42l8M76J393
$$ 176130 175399 174416 173222 171552 169491 167748 167017 167363 168391 169646 170725 171334 171442 171300 171262 171738 173131
57524A73131K299K487J779R31P22J031J190J052J053J362J628J649J768K223K543
$$ 173131 175430 177917 179696 180627 181349 182380 183570 184622 185675 187037 188665 190314 192082 194305 196848
57509A96848K100J143P52J406K106J478m40k152k619k336k172j909q92M92J056
$$ 196848 198948 200091 200843 202249 204355 205833 205393 203241 200622 198286 196114 194205 193313 193805 194861
57494A94861L92p09j424j620j365o78L6J97p1q1J89p1j056j670r46O00J663J653
$$ 194861 195253 194544 193120 191500 190135 189457 189493 189690 189619 189538 189727 189656 188600 186930 185984 186584 188247 189900
57476A89900R26Q4l05R8R16J116K31r13j182m58N80J491K188K459K093J387Q68
$$ 189900 190826 190910 190605 190703 191619 192735 192966 192053 190871 190413 190993 192484 194672 197131 199224 200611 201479
57459B01479O49N28N13P74J254J761K215K438K064J166N40P80J404J511J014N68
$$ 201479 202128 202656 203169 203943 205197 206958 209173 211611 213675 214841 215381 216161 217565 219076 220090 220658
57443B20658N19O14O68P94J027J243J384J358R13R7m23j07O25R64Q99J120J856
$$ 220658 221177 221791 222459 223253 224280 225523 226907 228265 229178 229275 228852 228745 229370 230334 231233 232353 234209
57426B34209K540K651K212J488P83N62J095J947K381K271K006J613P73k19m08
$$ 234209 236749 239400 241612 243100 243883 244445 245540 247487 249868 252139 254145 255758 256531 256312 255904
57411B55904N50J785K305K195K301L084M205M951M828L854K562J577J175J310
$$ 255904 256454 258239 260544 262739 265040 268124 272329 277280 282108 285962 288524 290101 291276 292586
57397B92586J858K563K926K670K204K153K515K777K783K897L304L831M463N371
$$ 292586 294444 297007 299933 302603 304807 306960 309475 312252 315035 317932 321236 325067 329530 334901
57383C34901O249O394N680M895M703M843M632L891K992K375K257K489K538K056
$$ 334901 341150 347544 353224 358119 362822 367665 372297 376188 379180 381555 383812 386301 388839 390895
57369C90895J490J623K320K484J599O44R33K542M408N549N696N150M618M865N925
$$ 390895 392385 394008 396328 398812 400411 401055 401988 404530 408938 414487 420183 425333 429951 434816 440741
57354D40741O927P137O888O934P221P064O392O001O405P085P176O528N777N582
$$ 440741 447668 454805 461693 468627 475848 482912 489304 495305 501710 508795 515971 522499 528276 533858
57340E33858N978O446O517O319O358O741O877O221N109M464M735N476N992O095
$$ 533858 539836 546282 552799 559118 565476 572217 579094 585315 590424 594888 599623 605099 611091 617186
57326F17186O124O427O946P305P284P121P235P600P717P263O573O253O542P254
$$ 617186 623310 629737 636683 643988 651272 658393 665628 673228 680945 688208 694781 701034 707576 714830
57312G14830Q073Q672Q830Q720Q855R407R802R489Q880R017J0281J1900J2800
$$ 714830 722903 731575 740405 749125 757980 767387 777189 786678 795558 804575 814856 826756 839556
57299H39556J2555J1524J0477J0202J0986J2231J2924J2719J2252J2235J2547
$$ 839556 852111 863635 874112 884314 895300 907531 920455 933174 945426 957661 970208
57288I70208J2602J2293J2077J2263J2678J3104J3612J4221J4579J4323J3718
$$ 970208 982810 995103 1007180 1019443 1032121 1045225 1058837 1073058 1087637 1101960 1115678
57277A115678J3530J4283J5773J7357J8518J9094J9236J9290J9573K0023K0293
$$ 1115678 1129208 1143491 1159264 1176621 1195139 1214233 1233469 1252759 1272332 1292355 1312648
57266A312648K0328K0581K1350K2103K2002K1043K0153K0045K0514K1059K1615
$$ 1312648 1332976 1353557 1374907 1397010 1419012 1440055 1460208 1480253 1500767 1521826 1543441
57255A543441K2304K2888K3048K2931K2963K3215K3420K3479K3544K3640K3570
$$ 1543441 1565745 1588633 1611681 1634612 1657575 1680790 1704210 1727689 1751233 1774873 1798443
57244A798443K3235K2738K2252K2085K2696K4187K5840K6755K6882K6870K6874
$$ 1798443 1821678 1844416 1866668 1888753 1911449 1935636 1961476 1988231 2015113 2041983 2068857
57233B068857K6215K4617K3087K2908K4086K5361K5733K5433K5380K6017K6891
$$ 2068857 2095072 2119689 2142776 2165684 2189770 2215131 2240864 2266297 2291677 2317694 2344585
57222B344585K7163K6505K5440K4739K4533K4265K3725K3574K4509K6184K7630
$$ 2344585 2371748 2398253 2423693 2448432 2472965 2497230 2520955 2544529 2569038 2595222 2622852
57211B622852K8544K9488L0732L1681L1805L1504L1428L1342L0360K8267K5879
$$ 2622852 2651396 2680884 2711616 2743297 2775102 2806606 2838034 2869376 2899736 2928003 2953882
57200B953882K4021K2621K1173J9625J8387J7617J6929J5910J4681J3777J3574
$$ 2953882 2977903 3000524 3021697 3041322 3059709 3077326 3094255 3110165 3124846 3138623 3152197
57189C152197J3884J4181J4119J3847J3746J3982J4368J4685J4937J5260J5635
$$ 3152197 3166081 3180262 3194381 3208228 3221974 3235956 3250324 3265009 3279946 3295206 3310841
57178C310841J5839J5643J5053J4347J3898J3853J3927J3609J2629J1186R742
$$ 3310841 3326680 3342323 3357376 3371723 3385621 3399474 3413401 3427010 3439639 3450825 3460567
57167C460567Q566P550O372M840L107J605O82K89J54J61L82P22Q43O01L81P31
$$ 3460567 3469133 3476683 3483055 3487895 3491002 3492607 3493289 3493578 3493732 3493893 3494275 3494997 3495840 3496441 3496822 3497553
57151C497553J803L350N084O794Q190R008R297R363R403R378R261R084Q682P669
$$ 3497553 3499356 3502706 3507790 3514584 3522774 3531782 3541079 3550442 3559845 3569223 3578484 3587568 3596250 3603919
57137C603919N897L739J708o5j790l530m965n629n217l717j326J648M942Q389
$$ 3603919 3609816 3613555 3615263 3615198 3613408 3609878 3604913 3599284 3594067 3590350 3589024 3590672 3595614 3604003
57123C604003J1903J5417J8870K2181K5141K7377K8660K9351L0553L3647L9564
$$ 3604003 3615906 3631323 3650193 3672374 3697515 3724892 3753552 3782903 3813456 3847103 3886667
57112C886667M8418N9853P3625Q9757J08249J29043J52600J80319K14034K55212
$$ 3886667 3935085 3994938 4068563 4158320 4266569 4395612 4548212 4728531 4942565 5197777
57102E197777L05016L65109M37606N23869O23864P37386Q65614J011026J176149
$$ 5197777 5502793 5867902 6305508 6829377 7453241 8190627 9056241 10067267 11243416
57093A1243416J363009J572745J803311K046318K286686K505014K678208K778781
$$ 11243416 12606425 14179170 15982481 18028799 20315485 22820499 25498707 28277488
57085B8277488K781620K681403K504626K295061K077331J833518J520123J110334
$$ 28277488 31059108 33740511 36245137 38540198 40617529 42451047 43971170 45081504
57077D5081504O19633R3955m20139q92880j309358j662309j949818k174956k342653
$$ 45081504 45701137 45795092 45374953 44482073 43172715 41510406 39560588 37385632 35042979
57068C5042979k455860k514793k518943k469597k371710k234463k069720j889423
$$ 35042979 32587119 30072326 27553383 25083786 22712076 20477613 18407893 16518470
57060A6518470j704134j522948j352939j198022j059115r35960q28245p34935
$$ 16518470 14814336 13291388 11938449 10740427 9681312 8745352 7917107 7182172
57052G182172o53707n81893n17746m60470m09703l65373l27420k94988k66338
$$ 7182172 6528465 5946572 5428826 4968356 4558653 4193280 3865860 3570872 3304534
57043C304534k40065k16043j94729j76001j59221j43966j29947j16519j03032
$$ 3304534 3064469 2848426 2653697 2477696 2318475 2174509 2044562 1928043 1825011
57034A825011q9511p6241o2657m7669l1472j6444n557k62m78o325j8516l6382
$$ 1825011 1735500 1659259 1596602 1548933 1517461 1501017 1495460 1495198 1494720 1488395 1469879 1433497
57022A433497n6131p2378q1754q4507q2678p7694p0305o1756n3679m6855m1017
$$ 1433497 1377366 1304988 1223234 1138727 1056049 978355 908050 846294 792615 745760 704743
57011G04743l5827l1377k7687k4539k1869j9719j7756j5526j3279j1746j1023
$$ 704743 668916 637539 609852 585313 563444 543725 525969 510443 497164 485418 474395
57000D74395j0456r748r285r153q722p640o380n334m220k839j562l85J509M456
$$ 474395 463939 454191 444906 435753 427031 419391 413011 407677 403457 400618 399056 398671 400180 404636
56986D04636P333Q861R199R216Q813P159M286J076k204o158j0743j4637j6556
$$ 404636 411969 420830 430029 439245 448058 455217 459503 460579 458375 452217 441474 426837 410281
56973D10281j6463j5156j3321j1358r546p882o066l933j649O79L204O042R073
$$ 410281 393818 378662 365341 353983 344437 336555 330489 326556 324907 325586 328790 334832 343905
56960C43905J2136J5062J7353J8280J7504J5368J2284Q140K601m038j0554j5450
$$ 343905 356041 371103 388456 406736 424240 439608 451892 460032 462633 458595 448041 432591
56948D32591j7983j8567j8158j7268j5713j3309j0385p438m572j644J333M275
$$ 432591 414608 396041 377883 360615 344902 331593 321208 313770 309198 307554 308887 313162
56936C13162P361J0835J4510J7792K0149K1324K1179J9597J6437J1485M626l600
$$ 313162 320523 331358 345868 363660 383809 405133 426312 445909 462346 473831 478457 474857
56924D74857j1822j8586k3164k5546k6013k5083k3570k2112k0719j9068j7062
$$ 474857 463035 444449 421285 395739 369726 344643 321073 298961 278242 259174 242112
56913B42112j4751j2082r270p061o053n852n485m511l186j811n91L4k90j083j324
$$ 242112 227361 215279 206009 198948 192895 187043 181558 177047 173861 172050 171459 171493 171203 170120 168796
56898A68796n89O31J786K803L732M545N441O842Q890J1360J4026J6583J8290J8362
$$ 168796 168207 168838 170624 173427 177159 181704 187145 193987 202877 214237 228263 244846 263136 281498
56884B81498J6869J4542J1637P803L177j198m481o775q394r091q547o972m768
$$ 281498 298367 312909 324546 332349 335526 334328 329847 323072 314678 305587 297040 290068 285300
56871B85300k108O65K900M498O404R507J3506J7578K1663K6226L0920L4383L5458
$$ 285300 283192 283857 286757 291255 297659 307166 320672 338250 359913 386139 417059 451442 486900
56858D86900L3881K9808K3376J5027N681l715j2474j9846k4857k6813k5826k2622
$$ 486900 520781 550589 573965 588992 594673 590958 578484 558638 533781 506968 481142 458520
56846D58520j8055j2859p677k904J580O418J2378J9766K8070L6262M3569M9801
$$ 458520 440465 427606 419929 417025 418605 425023 437401 457167 485237 521499 565068 614869
56834F14869N4763N7465N6411N0793M1043K8036J2245n698k3795l8927m8797n3260
$$ 614869 669632 727097 783508 834301 875344 903380 915625 909927 886132 847205 798408 745148
56822G45148n3511n0510m4862l7714l0634k4263j7862j0620k833M621J1472J8173
$$ 745148 691637 641127 596265 558551 527917 503654 485792 475172 472339 476960 488432 506605
56810E06605K5098L2112L8532M3027M3950M0424L2974K2620R814n042k0273l3214
$$ 506605 531703 563815 602347 645374 689324 729748 762722 785342 795156 790114 769841 736627
56798G36627m1965m6372m7246m5434m1793l7303l2628k7825k2677j7115j1283
$$ 736627 694662 648290 601044 555610 513817 476514 443886 416061 393384 376269 364986
56787C64986n524l08M215Q499J2983J7230K0168K1046J9593J5485Q623M6q349
$$ 364986 359462 359154 363369 371868 384851 402081 422249 443295 462888 478373 486996 487042 478693
56774D78693j5337k0902k5104k7429k7722k6866k5773k4336k2079j9292j6702
$$ 478693 463356 442454 417350 389921 362199 335333 309560 285224 263145 243853 227151
56763B27151j4449j2149r782p770o350n445n078n262n543n250m312l355k893k712
$$ 227151 212702 200553 190771 183001 176651 171206 166128 160866 155323 150073 145761 142406 139513 136801
56749A36801k226j241j81K84j03r36j495j365o64J59N52J27q81j548j154j23M37
$$ 136801 134575 133334 133153 133437 133334 132398 130903 129538 128874 129033 129585 129712 128831 127283 126129 126006 126443
56732A26443K02o3J84M74K58o9K67J212J960K023J690J466J487J526J340J000
$$ 126443 126645 126582 126766 127240 127498 127429 127696 128908 130868 132891 134581 136047 137534 139060 140400 141400
56716A41400Q79J165J429J057J53n07n09k27NM17J140J666J555J160J096J315
$$ 141400 142279 143444 144873 145930 146083 145576 145067 144840 144845 145262 146402 148068 149623 150783 151879 153194
56700A53194J299Q19kj017j900k045j304n33p65j928k934k960k118j005j32K90
$$ 153194 154493 155312 155310 154293 152393 150348 149044 148511 147746 145818 142884 139924 137806 136801 136669 136959
56684A36959M37O89J060J023K81n74p04o7O57R77R35O93M20M78J149K084K499
$$ 136959 137396 138085 139145 140168 140449 139875 139171 139104 139761 140738 141673 142366 142786 143264 144413 146497 148996
56667A48996K010R92J53l1M06R64J088Q67J006J826K602K374J162l5l32L59J441
$$ 148996 151006 151998 152151 152120 152526 153490 154578 155445 156451 158277 160879 163253 164415 164380 164048 164407 165848
56650A65848K060J662O15j6K34O02K51l91l10M84R45N13k72p32q14p66p64r53
$$ 165848 167908 169570 170185 170169 170403 171005 171256 170865 170555 171039 171984 172497 172225 171493 170679 169913 169149 168196
56632A68196j303j342p14Q3K09k32k98K39M23m37j700k382k466k529k597k141
$$ 168196 166893 165551 164837 164920 165129 164897 164599 164838 165261 164824 163124 160742 158276 155747 153150 151009
56616A51009j042J27P82P99L58l03q86j111q87l77J15L17J13l93r39j275j222
$$ 151009 149967 150094 150876 151675 152033 151730 150844 149733 148846 148469 148584 148901 149014 148621 147682 146407 145185
56599A45185p22R0R15J542J981K205K004J291M46kL3K34L36K79K0l64m53J43J142
$$ 145185 144463 144553 145468 147010 148991 151196 153200 154491 154937 154935 154968 155202 155538 155817 155837 155473 155020 155163 156305
56580A56305J766J620J098Q01R08J220J506J641J658J775K194K779L188L344L581
$$ 156305 158071 159691 160789 161590 162498 163718 165224 166865 168523 170298 172492 175271 178459 181803 185384
56565A85384M172N050O002P000Q091R169R985J0376J0331R849Q790P038M789K558
$$ 185384 189556 194606 200608 207608 215699 224868 234853 245229 255560 265409 274199 281237 286026 288584
56551B88584P34o69j705k101j637q00m99r87j634j930k131k654l377l902m079
$$ 288584 289318 288649 286944 284843 283206 282406 281907 280920 279286 277356 275225 272571 269194 265292 261213
56536B61213l921l421k863k725k968k912k269j682j733k097k336k763l707m478
$$ 261213 257292 253871 251008 248283 245315 242403 240134 238452 236719 234622 232286 229523 225816 221338
56522B21338m182l178k590k666k656k149j512r90m72k20p68j875k501k076j162
$$ 221338 217156 213978 211388 208722 206066 203917 202405 201415 200943 200723 199955 198080 195579 193503 192341
56507A92341n65m88p46j141j405j339j155j188j280j043o43n76p09l80M81J144
$$ 192341 191776 191288 190542 189401 187996 186657 185502 184314 183034 181991 181348 180772 180063 179683 180164 181308
56491A81308J206J052J037R66O64M04M26O46R72J371J538J169O67P52J285J364
$$ 181308 182514 183566 184603 185569 186233 186637 187063 187709 188681 190052 191590 192759 193426 194178 195463 196827
56475A96827P25J90L91R06J084R26P60P23R30J467J885J504N39J21P27J483J516
$$ 196827 197552 197742 198133 199039 200123 201049 201809 202532 203462 204929 206814 208318 208857 208978 209705 211188 212704
56458B12704J149J100J247J080P57Q38J236J249N83k66n58mR08J191L57p67q29
$$ 212704 213853 214953 216200 217280 218037 218875 220111 221360 221943 221677 221119 221115 222023 223214 223571 222804 221975
56441B21975L32J392J279L75l98q87j434j968k113j818j294o67k01l35r66j232
$$ 221975 222307 223699 224978 225353 224955 224068 222634 220666 218553 216735 215441 214774 214573 214238 213272 212040
56425B12040n99K92M82J7k83l0M58Q01Q48N42Q5l8L00M67q3q42q42j7P44Q30N63
$$ 212040 211441 211733 212215 212232 211949 211919 212377 213178 214026 214568 214653 214615 214915 215382 215299 214457 213615 213598 214342 215172 215735
56404B15735M64N49N15L39K78M91P63P10K51j96j14N38J370K055K423K259J479
$$ 215735 216199 216748 217263 217602 217880 218371 219134 219844 220095 219899 219785 220323 221693 223748 226171 228430 229909
56387B29909N74K14L61L67N6qM35P82N33O3j9K83P09J320K082K392J790P83L04
$$ 229909 230483 230697 231058 231425 231481 231473 231908 232690 233223 233286 233267 233550 234259 235579 237661 240053 241843 242626 242930
56368B42930N52R78J169J110P88K07k36mQ65J658J747J205O53O65J310K111K504
$$ 242930 243482 244460 245629 246739 247527 247734 247498 247494 248359 250017 251764 252969 253622 254287 255597 257708 260212
56351B60212K318J786J189P13M92M39K00l56p18m37K3j51p29n73O95K086K631
$$ 260212 262530 264316 265505 266218 266710 267149 267349 266993 266275 265838 265861 265710 264981 264408 265103 267189 269820
56334B69820K566K676L166L735M148M303M193M096M329M612M331L564L054K907
$$ 269820 272386 275062 278228 281963 286111 290414 294607 298703 303032 307644 311975 315539 318593 321500
56320C21500K309R18l95q12o98p86r89p97k80O9R9J43O42J874L519M517M122L118
$$ 321500 323809 324727 324332 323520 322822 322036 321047 320250 319970 320039 320138 320281 320923 322797 326316 330833 334955 338073
56302C38073K935L562L641K928K893M186N298M848L709L415L860M133M441N389
$$ 338073 341008 344570 348211 351139 354032 358218 363516 368364 372073 375488 379348 383481 387922 393311
56288C93311O286O072N290N353O257O816O829P211Q092Q559Q448Q748R954J1334
$$ 393311 399597 405669 410959 416312 422569 429385 436214 443425 451517 460076 468524 477272 487226 498560
56274D98560J2173J2550J2714J2794J3328J4963J7352J9366K0592K1697K3214
$$ 498560 510733 523283 535997 548791 562119 577082 594434 613800 634392 656089 679303
56263F79303K5043K7265L0387L4387L8499M2364M6621N2010N8532O5833P3694
$$ 679303 704346 731611 761998 796385 834884 877248 923869 975879 1034411 1100244 1173938
56252A173938Q1945R0356R8918J07714J16440J24528J31755J38225J43686J47370
$$ 1173938 1255883 1346239 1445157 1552871 1669311 1793839 1925594 2063819 2207505 2354875
56242B354875J48566J46952J42401J34874J24381J10719R3499P2920N0176K6606
$$ 2354875 2503441 2650393 2792794 2927668 3052049 3162768 3256267 3329187 3379363 3405969
56232C405969K759k1129m4194o5219q3574r9227j12082j21992j29063j33333j34534
$$ 3405969 3408728 3387599 3343405 3278186 3194612 3095385 2983303 2861311 2732248 2598915 2464381
56221B464381j32850j29440j25386j20563j14408j07363j00435r3821q7046q0245
$$ 2464381 2331531 2202091 2076705 1956142 1841734 1734371 1633936 1540115 1453069 1372824
56211A372824p4131o8781o3605n8531n4114n0345m6396m1831l7278l3635l1052
$$ 1372824 1298693 1229912 1166307 1107776 1053662 1003317 956921 915090 877812 844177 813125
56200H13125k8932k6475k3366k0195j7977j6862j5845j4168j2336j1065j0028
$$ 813125 784193 757718 734352 714157 696180 679318 663473 649305 636969 625904 615876
56189F15876q631p282o691o451n543l992k747k137j659j147r54r93p09o1L85M22
$$ 615876 607245 599963 593272 586821 581278 577286 574539 572402 570743 569596 568642 567649 566940 566879 567264 567686
56173E67686M81R31J788K922L956M304M000L976M815N780O008N982O745Q197R329
$$ 567686 568167 569098 570886 573808 577764 582068 586068 590044 594859 600639 606647 612629 619374 627571 636900
56158F36900R699R620R342R076R311J0144J0885J1319J2433J4790J7274J8906
$$ 636900 646599 656219 665561 674637 683948 694092 704977 716296 728729 743519 760793 779699
56146G79699K0871K4940L0815L6973M3322N0778N8754O5425P0203P3756P5671
$$ 779699 800570 825510 856325 893298 936620 987398 1046152 1111577 1181780 1255536 1331207
56135A331207P4458P0052O4187N8002N1261M4245L8348L4144L0576K6536K1865
$$ 1331207 1405665 1475717 1539904 1597906 1649167 1693412 1731760 1765904 1796480 1823016 1844881
56124A844881J6502J0192L396k968q876j4955k0963k6032l0425l5428m1426m7641
$$ 1844881 1861383 1871575 1874971 1872003 1863127 1848172 1827209 1801177 1770752 1735324 1693898 1646257
56112A646257n3654n9469o4108o6022o5021o2198n7939n1807m4365l7211l1097
$$ 1646257 1592603 1533134 1469026 1403004 1337983 1275785 1217846 1166039 1121674 1084463 1053366
56101A053366k5676k1018j7541j4586j1077p451m965l317j206J010J723J140J314
$$ 1053366 1027690 1006672 989131 974545 963468 956017 951052 947735 946529 947539 949262 950402 951716
56088I51716K876M294M733N134N995O599O950Q004R521J0088R726J0027J1210
$$ 951716 954592 958886 963619 968753 974748 981347 988297 996301 1005822 1015910 1025636 1035663 1046873
56075A046873J1703J1173J1241J2487J3506J3688J4256J5585J6213J5564J5078
$$ 1046873 1058576 1069749 1080990 1093477 1106983 1120671 1134927 1150512 1166725 1182289 1197367
56064A197367J5659J6422J6867J7745J8902J8895J7662J6951J7199J6774J5197
$$ 1197367 1213026 1229448 1246315 1264060 1282962 1301857 1319519 1336470 1353669 1370443 1385640
56053A385640J4271J4878J5569J5477J5759J6967J7875J8152J9250K1404K2754
$$ 1385640 1399911 1414789 1430358 1445835 1461594 1478561 1496436 1514588 1533838 1555242 1577996
56042A577996K2741K3239K5052K6450K6696K7752L0788L4233L6961M0189M4419
$$ 1577996 1600737 1623976 1649028 1675478 1702174 1729926 1760714 1794947 1831908 1872097 1916516
56031A916516M7769M9295N0728N3054N4560N4287N4101N5257N6224N6009N6385
$$ 1916516 1964285 2013580 2064308 2117362 2171922 2226209 2280310 2335567 2391791 2447800 2504185
56020B504185N8533O0789O1970O3692O7135P0753P3385P6303Q0116Q3155Q5030
$$ 2504185 2562718 2623507 2685477 2749169 2816304 2887057 2960442 3036745 3116861 3200016 3285046
56009C285046Q8129R3298R7916J00499J03264J07787J12302J15880J20953J28882
$$ 3285046 3373175 3466473 3564389 3664888 3768152 3875939 3988241 4104121 4225074 4353956
55999D353956J37370J44933J53474J63683J72843J80197J89465K02753K17078
$$ 4353956 4491326 4636259 4789733 4953416 5126259 5306456 5495921 5698674 5915752
55990E915752K30275K44896K62722K81107K98679L18966L44195L71323L98380
$$ 5915752 6146027 6390923 6653645 6934752 7233431 7552397 7896592 8267915 8666295
55981H666295M28727M64766N03929N45333N93507O50779P13378P80210Q57871
$$ 8666295 9095022 9559788 10063717 10609050 11202557 11853336 12566714 13346924 14204795
55972A4204795R51783J060646J185271J333936J513418J724854J974930K280082
$$ 14204795 15156578 16217224 17402495 18736431 20249849 21974703 23949633 26229715
55964B6229715K652195L091605L601251M194459M881273N663310O552214P577477
$$ 26229715 28881910 31973515 35574766 39769225 44650498 50313808 56866022 64443499
55956F4443499Q769382J0157804J1798672J3773687J6148263J8948691K2148314
$$ 64443499 73212881 83370685 95169357 108943044 125091307 144039998 166188312
55949A66188312K5547156K8580631L0358398L0094827K7556299K2993278J6649589
$$ 166188312 191735468 220316099 250674497 280769324 308325623 331318901 347968490
55942C47968490Q554894j038460j1129320k0121431k6619368l0092616l0873388
$$ 347968490 356523384 355484924 344355604 324234173 297614805 267522189 236648801
55935B36648801k9705730k7347171k4410255k1330789j8371315j5664265j3272371
$$ 236648801 206943071 179595900 155185645 133854856 115483541 99819276 86546905
55928H6546905j1216094r476372q013284o792136n784017m952766m260283l680950
$$ 86546905 75330811 65854439 57841155 51049019 45265002 40312236 36051953 32371003
55920C2371003l198043k791668k442480k141956j887283j670240j480706j315948
$$ 32371003 29172960 26381292 23938812 21796856 19909573 18239333 16758627 15442679
55912A5442679j176508j057016r49880q54082p71944p00898o36175n78043n28900
$$ 15442679 14266171 13209155 12259275 11405193 10633249 9932351 9296176 8718133 8189233
55903H189233m86397m46258m08903l76872l48683l21299k95736k74327k55268
$$ 8189233 7702836 7256578 6847675 6470803 6122120 5800821 5505085 5230758 4975490
55894D975490k35473k16174k00335j86982j73235j59579j48194j38451j28634
$$ 4975490 4740017 4523843 4323508 4136526 3963291 3803712 3655518 3517067 3388433
55885C388433j19868j13843j08955j03114r8036r6324r6479r5034r1672q8156
$$ 3388433 3268565 3154722 3045767 2942653 2844617 2748293 2651814 2556780 2465108 2376952
55875B376952q4216p8714p3068o9480o7314o4682o1947o0176n8043n3898m9138
$$ 2376952 2292736 2214022 2140954 2071474 2004160 1939478 1877531 1817355 1759312 1705414 1656276
55864A656276m6024m3851m0757l7516l5988l5321l3334l0337k8263k7224k6078
$$ 1656276 1610252 1566401 1525644 1488128 1452140 1416819 1383485 1353148 1324885 1297661 1271583
55853A271583k5090k5064k5097k4150k3438k4376k5688k5461k4486k4476k4644
$$ 1271583 1246493 1221429 1196332 1172182 1148744 1124368 1098680 1073219 1048733 1024257 999613
55842I99613k3326k1489k1144k1557k0528j8425j7462j7707j7217j5595j4252
$$ 999613 976287 954798 933654 912097 891569 873144 855682 837975 820758 805163 790911
55831G90911j3491j2381j1185j1023j1338j0487q649p633p959q494q749r262r940
$$ 790911 777420 765039 753854 742831 731493 721006 712357 704724 696765 688271 679522 670260 660320
55818F60320j0194j0378j1107j1578j0638q908p833p205n831l941k753k152j120
$$ 660320 650126 639748 628641 617063 606425 597517 589684 582479 576648 572707 569954 567802 566682
55805E66682J25O26Q07J785L059L251K684K871L696L465J724l17k050m051o261
$$ 566682 566807 567433 568240 570025 573084 576335 579019 581890 585586 589051 590775 590458 588408 584357 578096
55790E78096p721q308q859r463r386q742q588r281j0283j1504j3250j4922j5383
$$ 578096 570375 562067 553208 543745 534359 525617 517029 507748 497465 485961 472711 457789 442406
55777D42406j4573j3325j1820r717p449n879m848l656k625k559k996k724j782
$$ 442406 427833 414508 402688 392971 385522 379643 374795 371139 368514 365955 362959 360235 358453
55764C58453j288j560j989k486l301l772l070j986k064l123l534k870k267k123
$$ 358453 357165 355605 353616 351130 347829 344057 340987 339001 336937 333814 330280 327410 325143 323020
55750C23020j465q4O70k11k107l893n010n170m335l374l470m538n311n138m569
$$ 323020 321555 321471 322141 321930 319823 315930 310920 305750 301415 298041 294571 290033 284722 279584 275015
55735B75015m105l662l354l562l970l699k609j544j156j461k377l687m552m242
$$ 275015 270910 267248 263894 260332 256362 252663 250054 248510 247354 245893 243516 239829 235277 231035
55721B31035l248k688k708k627k346k340k438j955r58k08J07M17P14O41M73P21
$$ 231035 227787 225099 222391 219764 217418 215078 212640 210685 209727 209519 209626 210043 210757 211398 211871 212592
55705B12592R55L49p30j059m14J58p4q92j959l050l590l176k426k198k233j799
$$ 212592 213547 213896 213166 212107 211693 211851 211777 210885 208926 205876 202286 199110 196684 194486 192253 190454
55689A90454j188j131j239o43J97J46m13NJ481K553K610K473K454J871P97L39
$$ 190454 189266 188135 186896 186253 186450 186596 186183 186188 187669 190222 192832 195305 197759 199630 200427 200766
55673B00766O52N85j96n80k7N54O36R27J725K125J743J528J939K050J474J461
$$ 200766 201418 202003 201807 201227 201200 201754 202390 203317 205042 207167 208910 210438 212377 214427 215901 217362
55657B17362K790M124L869K521J710J813J896J286P7j391k610l067l080l805n575
$$ 217362 220152 224276 228145 230666 232376 234189 236085 237371 237448 236057 233447 230380 227300 223495 217920
55642B17920p058o942n678m682m435m351m034l686l530l532l572l456k965k174
$$ 217920 210862 203920 198242 193560 189125 184774 180740 177054 173524 169992 166420 162964 159999 157825
55628A57825j353n17L77Q74M79k71k20O77J147M51n99j032j001j063j214j361
$$ 157825 156472 155955 156332 157206 157685 157414 157194 157871 159018 159469 158870 157838 156837 155774 154560 153199
55612A53199j848k691l065k377j243o77q88j419j862j932j465q66q88j483j632
$$ 153199 151351 148660 145595 143218 141975 141298 140410 138991 137129 135197 133732 132866 131978 130495 128863
55597A28863p64M08R27O97Q4o92j237r94j84J71k58n47r5L76K01M6O96J568J699
$$ 128863 128099 128507 129434 130131 130215 129523 128286 127292 127108 127279 127021 126474 126379 126755 126956 127002 127698 129266 130965
55578A30965J451J922L175M315M907N171N122M651M198M272M514M233L579L144
$$ 130965 132416 134338 137513 141828 146735 151906 157028 161679 165877 170149 174663 178896 182475 185619
55564A85619K655J311o72k059k310k284k861l776m217l989l607l601l989m275
$$ 185619 188274 189585 188913 186854 184544 182260 179399 175623 171406 167417 163810 160209 156220 151945
55550A51945l924l065k522k753l040k343q30J91o3r16j194o00K67Q31J032J027
$$ 151945 148021 144956 142434 139681 136641 134298 133468 133659 133596 132680 131486 130886 131153 131984 133016 134043
55534A34043Q79O19M73O76J017Q26k80j705k383j972j226j029j476k090k551k837
$$ 134043 134922 135541 136014 136690 137707 138533 138253 136548 134165 132193 130967 129938 128462 126372 123821 120984
55518A20984k948k844k570k225j843j483j210j028r27j051j551k156k271j593
$$ 120984 118036 115192 112622 110397 108554 107071 105861 104833 103906 102855 101304 99148 96877 95284
55504I5284m69M53P35L60k62n38k62J46K27J48L09N07J99n03r13q40q06r96q68
$$ 95284 94815 95268 96003 96363 96101 95563 95301 95447 95674 95822 96131 96638 96837 96334 95421 94581 93775 92779 91911
55485I1911j75M65M88K32K53L83Q5n26p18n1J048J658J199K6q71r33o50p38j038
$$ 91911 91736 92201 92689 92921 93174 93557 93642 93116 92398 92347 93395 95053 96252 96278 95407 94474 93824 93086 92048
55466I2048r70p23j032j786k000j315m79l5L01N92K75n32n86O91J987J759L29
$$ 92048 91078 90355 89323 87537 85537 84222 83743 83708 84009 84601 84876 84344 83758 84449 86436 88195 88524
55449H8524p79r19n61q2M68P34L79j23o4L10K24k11j38M68N91k08r59o58L88J129
$$ 88524 87745 86826 86265 86183 86651 87385 87764 87641 87577 87887 88111 87900 87762 88230 88821 88613 87654 86996 87384 88513
55429H8513J148Q58O71N31L07J48K59M55K51n02j150q75K68J307J512J165R17
$$ 88513 89661 90519 91190 91721 92028 92176 92435 92890 93141 92639 91489 90614 90882 92189 93701 94866 95783
55412I5783Q51O03Q7l98o48p03o39n47o13r17j217j159o20K54J181J772J677R47
$$ 95783 96634 97237 97324 96926 96278 95575 94936 94389 93776 92859 91642 90483 89863 90117 91298 93070 94747 95694
55394I5694N2n68q16p92o53o65r77j243r01M5R65J420J524J335O16m69j106q25
$$ 95694 95746 95178 94362 93570 92917 92252 91275 90032 89131 89176 90141 91561 93085 94420 95036 94567 93461 92636
55376I2636k07r7n00p81o56m00l31n21q72j196j326j341j397j277o71J07L27j5
$$ 92636 92429 92332 91832 91051 90395 89995 89664 89143 88271 87075 85749 84408 83011 81734 81063 81170 81497 81482
55358H1482o1N44R76M69n17j017q45m02J97R72J451J084O9q29j148r24l23L71
$$ 81482 81421 81965 82941 83410 82893 81876 81031 80629 80826 81798 83249 84333 84402 83573 82425 81501 81178 81549
55340H1549O91M60J05J28N06Q83J003O36l35j379j563p96j34k43m04K47J251J581
$$ 81549 82240 82700 82805 82933 83439 84322 85325 85961 85626 84247 82684 81888 81754 81511 81107 81354 82605 84186
55322H4186J207Q65P40M32n7l27m06o66j100j435j675j849j577p08J04L18M67
$$ 84186 85393 86258 86998 87430 87373 87046 86640 85974 84874 83439 81764 79915 78338 77630 77734 78052 78519
55305G8519J153J650Q91n31q55L35J532J463N21l06p29q87p55l73k4K40O47J144
$$ 78519 79672 81322 82213 81682 80827 81162 82694 84157 84678 84372 83643 82756 82001 81628 81604 81844 82491 83635
55287H3635J354J228J024O69q2p77n61M45J035O05J1K81J171J603J030j82j304
$$ 83635 84989 86217 87241 87910 87828 87051 86490 86935 87970 88575 88586 88867 90038 91641 92671 92489 91185
55270I1185j802j589j061o39k62L02P75N90k04q87j029q64o71l95q6M7J40O11
$$ 91185 89383 87794 86733 86094 85832 86134 86909 87499 87295 86408 85379 84515 83844 83449 83363 83410 83550 84161
55252H4161J325J469O20o33j413j376p20R8M78J36l91k47N35R96O26L1r6O0m0
$$ 84161 85486 86955 87575 86942 85529 84153 83433 83531 84009 84145 83754 83507 84042 85038 85664 85695 85599 85659 85619
55233H5619l81n23k77J91O50Q70P34M15J86n4n43r23m39R17K101K182J363M58
$$ 85619 85238 84715 84438 84629 85279 86149 86883 87298 87484 87430 86887 85964 85525 86442 88543 90725 92088 92546
55215I2546o7k16j81k67o92j145r76j30O22O82L27R0j4k05l51k36j2P7J53M64
$$ 92546 92479 92263 92082 91815 91123 89978 89002 88872 89494 90176 90503 90593 90579 90374 90023 89787 89775 89852 90005 90469
55195I0469R03J187J208R95M61l83j227j686j581q98K15J287J728J407P40J19
$$ 90469 91372 92559 93767 94762 95223 94840 93613 91927 90346 89448 89663 90950 92678 94085 94825 94944
55179I4944l58n21j24O22J077R97Q24Q36O66M7o00q08p72q07o72q5N42O01K48
$$ 94944 94586 94065 93941 94563 95640 96637 97461 98297 98963 99010 98410 97602 96830 96023 95351 95266 95808 96409 96657
55160I6657Q9J25k17r96j534j347p44k09J95N50O27J66n12o95j60M21K46o03j265
$$ 96657 96746 96871 96654 95658 94124 92777 92033 91824 92019 92569 93196 93362 92850 92155 91995 92416 92662 92059 90794
55141I0794j267j045j083j020k61Q97J543J439J237J317J249O89J3k99l14k11
$$ 90794 89527 88482 87399 86379 86118 87015 88558 89997 91234 92551 93800 94489 94502 94203 93889 93678
55125I3678J41O69P92K34l96m30j20q1j74J86Q70J039L90m33p81p97r29j136r59
$$ 93678 93819 94488 95280 95514 95118 94688 94568 94487 94313 94499 95369 96408 96798 96365 95584 94787 93858 92722 91763
55106I1763k34N62P58K15m18l86K98Q17O09P0MO19J382J666J241K80p22j136o91
$$ 91763 91529 92091 92849 93064 92646 92260 92558 93375 93984 94054 94058 94677 96059 97725 98966 99246 98524 97388 96697
55087I6697J54O42N37K91L81P64J050J047R10P97O03J68l38m94j42M01P94J010
$$ 96697 96851 97493 98030 98321 98702 99466 100516 101563 102473 103270 103873 104041 103703 103209 103067 103468 104262 105272
55069A05272J048P42J97NL84N30l75j669j832n98N79N80J9QM40M30j76p54r71
$$ 105272 106320 107062 107259 107264 107648 108178 107803 106134 104302 103704 104283 104863 104882 104890 105330 105760 105584 104830 103859
55050A03859j006r08n68k33l05n68l94K57O55L22l07m87j8P08J249J408J207P71
$$ 103859 102853 101945 101377 101144 100839 100271 99877 100134 100789 101111 100804 100317 100299 101007 102256 103664 104871 105642
55032A05642K21l53q24j032r92r42j073j265j240r02l98J0N8l81j058j375q69
$$ 105642 105863 105510 104686 103654 102662 101720 100647 99382 98142 97240 96842 96852 96910 96529 95471 94096 93227
55015I3227L37J574K104J641O14j01m5L58M18K16M04J076J526J362J091J234J472
$$ 93227 93564 95138 97242 98883 99497 99396 99351 99709 100127 100343 100747 101823 103349 104711 105802 107036 108508
54998A08508J271Q11O46P69O64P5p73j550j967j822j294r98j157j113k16J051
$$ 108508 109779 110590 111236 112005 112669 112744 111971 110421 108454 106632 105338 104340 103183 102070 101854 102905
54982A02905J514Q03k56p30m16L93J354K067K178J738J196Q64O66M45K36P8j27
$$ 102905 104419 105222 104966 104236 103820 104213 105567 107634 109812 111550 112746 113610 114276 114721 114957 115035 114908
54965A14908m54q20r94p50k3Q46J218P75o3o22p62q17r47r00m77J58O94R21P79
$$ 114908 114454 113634 112640 111890 111867 112713 113931 114706 114643 114021 113259 112442 111495 110595 110118 110276 110970 111891 112670
54946A12670L96R3O6R2j91p61j238j434j478j424j060k41Q30J798K486K919L135
$$ 112670 113066 113159 113225 113317 113126 112365 111127 109693 108215 106791 105731 105490 106320 108118 110604 113523 116658
54929A16658L126K892K593K506K817L375L819M004M126M335M466M270L723K948
$$ 116658 119784 122676 125269 127775 130592 133967 137786 141790 145916 150251 154717 158987 162710 165658
54915A65658K027J054J22r20k396m204n610n936n304m373l536k795k198j942k029
$$ 165658 167685 168739 168861 167941 165545 161341 155731 149795 144491 140118 136582 133787 131589 129647 127618
54900A27618k189k150j806j200m95L4K35K10J02mJ10P43J762K434K258J659J501
$$ 127618 125429 123279 121473 120273 119778 119812 120047 120257 120359 120355 120465 121208 122970 125404 127662 129321 130822
54883A30822K047K812L274L373L405L705M357M943M841L988K985K190J198l31
$$ 130822 132869 135681 138955 142328 145733 149438 153795 158738 163579 167567 170552 172742 173940 173609
54869A73609j838k586k758l074l637m007m198m566m804m175k881k169k614l268
$$ 173609 171771 169185 166427 163353 159716 155709 151511 146945 142141 137966 135085 132916 130302 127034
54855A27034l017j982j017n33n32j118k065k431j522j12L18m99j246q59J30M54
$$ 127034 124017 122035 121018 120485 119953 118835 116770 114339 112817 112705 113023 112524 111278 110419 110549 111003
54839A11003k29j142j533j354q91k69L69O71L54l12o62l03M96J112J135O73J83
$$ 111003 110774 109632 108099 106745 105854 105585 105954 106625 106979 106667 106005 105702 106198 107310 108445 109118 109301
54822A09301M0J58J09l23q25r52o94l29J23Q69J711K049J686J127Q07N09n3m93
$$ 109301 109341 109499 109608 109285 108460 107508 106814 106485 106608 107477 109188 111237 112923 114050 114857 115366 115313 114820
54804A14820k33N41R96P37K16J8J56K49Q6k04l54k33jPl44p20n78K52J313J893
$$ 114820 114587 115128 116124 116861 117077 117095 117251 117500 117586 117382 117028 116795 116794 116801 116457 115737 115159 115411 116724 118617
54784A18617J673J036O42O92P51M24j8j0N21J192J829K533L145L323L181L297
$$ 118617 120290 121326 121968 122660 123411 123835 123817 123807 124328 125520 127349 129882 133027 136350 139531 142828
54768A42828L870M538N109N772O330O073M821L396K527J916Q83o80k524m447o019
$$ 142828 146698 151236 156345 162117 168447 174520 179341 182737 185264 187180 188063 187383 184859 180412 174393
54753A74393o589o255o003o221n943m445k718k158k512k429j555p34m09j68J99
$$ 174393 167804 161549 155546 149325 143382 138937 136219 134061 131549 129120 127565 126831 126422 126254 126453
54738A26453M05M63O15N79j3n25J12J766L146L546L355K886K074J453J997L513
$$ 126453 126858 127321 127936 128515 128502 127977 128089 129855 133001 136547 139902 142788 144862 146315 148312 151825
54722A51825M543M376L906L887L573J989m54k501l510l622l190k723k782l300
$$ 151825 156368 160744 164650 168537 172110 174099 173645 171144 167634 164012 160822 158099 155317 152017
54708A52017l559l275l029l157l046k269j514j591k120k148j595j205j361j707
$$ 152017 148458 145183 142154 138997 135951 133682 132168 130577 128457 126309 124714 123509 122148 120441
54694A20441j778j413o55K16P68Q17O21M03J08j94j89R1J39k28n14m53o06j426
$$ 120441 118663 117250 116595 116811 117579 118396 119017 119420 119528 119334 119145 119236 119375 119147 118633 118180 117574 116148
54676A16148k266k027n21J352K485K322J089k81q58o97o93j236j628j167j42P41
$$ 116148 113882 111855 111334 112686 115171 117493 118582 118301 117443 116746 116053 114817 113189 112022 111880 112621
54660A12621J231J241N40n98j064k06J132J626J132N08K15R2J13M33P82P00K89
$$ 112621 113852 115093 115633 115035 113971 113765 114897 116523 117655 118163 118378 118470 118583 119016 119798 120498 120787
54643A20787M3O9J80M73J030J280N36q66j738j429m30M30O94K73o24j457j744
$$ 120787 120830 120899 121079 121552 122582 123862 124398 123532 121794 120365 119935 120365 121059 121332 120708 119251 117507
54626A17507j523j121o33p9J96n3l98k37K87N37L17m8m13p39n53N76K044K619
$$ 117507 115984 114863 114230 114151 114347 114294 113896 113659 113946 114483 114800 114752 114339 113600 113047 113623 115667 118286
54608A18286J994J065N44J61m57r70r75p53p84r54q08l32O1J80K49M85P65Q27
$$ 118286 120280 121345 121889 122050 121593 120623 119648 118895 118111 117157 116349 116017 116078 116258 116507 116992 117757 118584
54590A18584O39M44M35N14N53O87J031J152M52p78j380q01R2K74o4j25N6j56p12
$$ 118584 119223 119667 120102 120616 121169 121856 122887 124039 124491 123713 122333 121532 121624 121898 121834 121709 121765 121609 120897
54571A20897r31p66r01j469j704j176m47j00J05O00J174J311R76O01N76R28J335
$$ 120897 119966 119200 118299 116830 115126 113950 113503 113403 113508 114108 115282 116593 117569 118170 118746 119674 121009
54554A21009J285N70k48l21M71J327J469Q91J18m22n73l76K3N53J228J828J811
$$ 121009 122294 122864 122616 122295 122766 124093 125562 126453 126571 126149 125576 125200 125223 125776 127004 128832 130643
54537A30643R69r8o45o86o59n13K7N48L10n23r95q06n81n38j04Q35J346Q22j16
$$ 130643 131612 131514 130869 130183 129524 129011 129038 129586 129896 129373 128378 127572 126991 126453 126349 127184 128530 129352 129236
54518A29236o45q53j050r06j33O56P56M42L04Q8p68j815j983j192m78m50n46r3
$$ 129236 128591 127738 126688 125782 125649 126305 127061 127503 127807 127895 127127 125312 123329 122137 121659 121209 120663 120570
54500A20570P17J247J241R04N33L25L05K80M2k90l67o6L24M17Q6m18n79q6P26
$$ 120570 121287 122534 123775 124679 125212 125537 125842 126122 126164 125874 125507 125441 125765 126182 126268 125850 125271 125185 125911
54481A25911J151R89Q01R60J024N08j44j44L33L37l61q19k60Q96J720J945J874
$$ 125911 127062 128051 128852 129812 130836 131344 131200 131056 131389 131726 131365 130546 130286 131182 132902 134847 136721
54464A36721J571Q18k33r38q56k60K61M70N83P40O83J03q42j583j743j473j096
$$ 136721 138292 139110 138877 137939 137083 136823 137084 137554 138137 138877 139560 139663 138821 137238 135495 134022 132926
54447A32926p29l26J13N52R50J110P72R7k35K01R32J146P24K21k0j74l36k71O2
$$ 132926 132197 131871 131984 132536 133486 134596 135368 135465 135230 135431 136363 137509 138233 138454 138434 138260 137924 137653 137715
54428A37715K76J89J78N29Q57N96j26n94l27M97J283J368M03j186k252j962p57
$$ 137715 137991 138180 138358 138887 139744 140340 140214 139620 139293 139790 141073 142441 142844 141658 139406 137444 136687
54411A36687J74L29K57M87P42N99K33R0J88L14N51J035J373J051L27O0N05R34
$$ 136687 136861 137190 137447 137934 138676 139275 139508 139598 139786 140100 140651 141686 143059 144110 144437 144497 145002 145936
54393A45936O91O6k46r6J16J20k7j76k27q5J41J16l41q88r87m51M74J357J748
$$ 145936 146627 146693 146447 146351 146467 146587 146560 146384 146157 146072 146213 146329 145988 145100 144113 143662 144136 145493 147241
54374A47241J362M74j64j29J84K84L79R57J729J870J289R27J525K667L434L511
$$ 147241 148603 149077 148913 148784 148968 149252 149631 150588 152317 154187 155476 156403 157928 160595 164029 167540
54358A67540L268L017K630J864P85j61n58n33p17j473k313k497k081j794j930
$$ 167540 170808 173825 176455 178319 179104 178943 178385 177852 177135 175662 173349 170852 168771 166977 165047
54343A65047j979j574j110j068j259j230j015r76j157j300j297j233j094q27n47
$$ 165047 163068 161494 160384 159316 158057 156827 155812 154836 153679 152379 151082 149849 148755 147928 147381
54328A47381l26L9O69J208J170O03j8m52p70q68n24N4K32k50r41j317j381j324
$$ 147381 147055 147094 147763 148971 150141 150744 150726 150274 149504 148636 148112 148166 148398 148148 147207 145890 144509 143185
54310A43185j031l43L96N97J87k76l48j54j0R0L12N11L23k65p96q38m62k9K63
$$ 143185 142154 141811 142207 142804 142991 142715 142367 142213 142203 142293 142605 143116 143439 143174 142378 141540 141078 141049 141312
54291A41312M55N62N46M91N70P69Q57P06M94M21L93J48l19o75o32k33K78P04Q83
$$ 141312 141767 142329 142875 143366 143936 144705 145562 146268 146762 147183 147576 147724 147405 146730 146098 145865 146143 146847 147730
54272A47730N95j30o85l16Q71J785J591P61L76O27P65M35J78L97P10P55Q66J319
$$ 147730 148325 148195 147510 147194 148065 149850 151441 152202 152578 153205 153970 154405 154583 154980 155690 156445 157311 158630
54254A58630J573J084L36J79N05N01m2n97r39j356j829j922j626j421j375j024
$$ 158630 160203 161287 161623 161802 162307 162808 162766 162169 161230 159874 158045 156123 154497 153076 151701 150677
54238A50677l24K12N25J195K163K380J361J99J64R35J158L07q58j423j174m34
$$ 150677 150353 150565 151090 152285 154448 156828 158189 158388 158552 159487 160645 160952 160094 158671 157497 157063
54222A57063K53L82p7n87p34p20q06o94o2O40O23j44r14j145r49o66n24o56r38
$$ 157063 157316 157698 157621 157034 156300 155580 154774 154080 154018 154658 155281 155137 154223 153078 152129 151463 150939 150283 149345
54203A49345q96k13O50Q92L01o03j290j623j576j100l44L43O15L02m55j020o81
$$ 149345 148449 148236 148886 149778 150079 149476 148186 146563 144987 143887 143543 143886 144501 144803 144348 143328 142647
54186A42647M23J208J031O14R33J665J755J153P67Q20M75n97j479j349o12j07
$$ 142647 143070 144278 145309 145923 146856 148521 150276 151429 152196 153016 153491 152894 151415 150066 149454 149347
54170A49347L8J26J13j63n03o52p25p98n27K50R79J063P15M93L90J02j06L10J153
$$ 149347 149385 149511 149624 149461 148958 148306 147581 146783 146256 146506 147485 148548 149263 149756 150146 150248 150142 150452 151605
54151A51605J547J172N90J81m63j565k297j625K23J854K348K087J861J705J150
$$ 151605 153152 154324 154914 155095 154632 153067 150770 149145 149368 151222 153570 155657 157518 159223 160373
54136A60373K73k43j21J18K0j28Km9q99k072k271j084M18J047Q58O64Q34J091
$$ 160373 160646 160403 160282 160400 160420 160292 160294 160245 159346 157274 155003 153919 154337 155384 156242 156906 157740 158831
54118A58831J199J195J152J150J341J643J582Q94N3k52o1M4j05j09J25Q0n38j166
$$ 158831 160030 161225 162377 163527 164868 166511 168093 168987 169040 168788 168727 168771 168666 168557 168682 168762 168224 167058
54100A67058j018p1R48J447J477J484J681J809J516R47P70J403K361K775K483
$$ 167058 166040 165969 166917 168364 169841 171325 173006 174815 176331 177278 178048 179451 181812 184587 187070
54085A87070K127K099J996J380N27l9m14j104k131k893k937k395j657r61m74k86
$$ 187070 189197 191296 193292 194672 195199 195160 194746 193642 191511 188618 185681 183286 181629 180668 180194 179908
54069A79908k15O6N49Q19O71M53N33O82M10k50o66l53N45J506K170K443K390K177
$$ 179908 179693 179759 180308 181127 181798 182251 182784 183466 183876 183626 182960 182607 183152 184658 186828 189271 191661 193838
54051A93838K120K551L524M688N500N728N676N823O199O309N794M960M454M535
$$ 193838 195958 198509 202033 206721 212221 217949 223625 229448 235647 241956 247750 252710 257164 261699
54037B61699M892N127N080M728M064L209K432J877J439R42L62k28p03q71o65l71
$$ 261699 266591 271718 276798 281526 285590 288799 291231 293108 294547 295489 295851 295623 294920 294049 293384 293013
54021B93013m47r37j376j517j787k659l757m189l724l157l309m091m798n007m797
$$ 293013 292566 291629 290253 288736 286949 284290 280533 276344 272620 269463 266154 262063 257265 252258 247461
54006B47461m317l567k652j876j468j409j565j829k087k210k225k261k254j929
$$ 247461 243144 239577 236925 235049 233581 232172 230607 228778 226691 224481 222256 219995 217741 215812
53992B15812j278p77q48j313j687j888k122k249j807q49o3J62K67O69R38M43n86
$$ 215812 214534 213757 212909 211596 209909 208021 205899 203650 201843 200994 200931 201093 201360 202029 202967 203410 202824
53975B02824j290j265p33J01J173K011J940J006M2l49k75R1Q79J911K528K475
$$ 202824 201534 200269 199536 199637 200810 202821 204761 205767 205809 205460 205185 205276 206155 208066 210594 213069
53959B13069K383K815L527M269N570P908J0526J2208J3004J4074J5781J6993J6599
$$ 213069 215452 218267 221794 226063 231633 239541 250067 262275 275279 289353 305134 322127 338726
53946C38726J4820J2393R290N013j81n094q609j0404j0723r955q522o881n299
$$ 338726 353546 365939 375229 380242 380061 374967 366358 355954 345231 335276 326754 319873 314574
53933C14574l771k244q60J37O63Q94J017J030Q61O68Q02J430K323L118L684M143
$$ 314574 310803 308559 307699 307836 308499 309393 310410 311440 312301 312969 313771 315201 317524 320642 324326 328469
53917C28469M657N304O005O476O351N581M588L844L383K853J993Q78k08r93j379
$$ 328469 333126 338430 344435 350911 357262 362843 367431 371275 374658 377511 379504 380382 380174 379181 377802
53902C77802j523j701j980k150k101k075k382l101m192n580o808p057o082m843
$$ 377802 376279 374578 372598 370448 368347 366272 363890 360789 356597 351017 344209 337152 331070 326227
53888C26227m514n035n343n040m884n374n745n088l798l094l369l832l747l301
$$ 326227 321713 316678 311335 306295 301411 296037 290292 285204 281406 278312 274943 271111 267364 264063
53874B64063l086l287l676l957l902l452k949k952l507l866l323k179j430j539
$$ 264063 260977 257690 254014 250057 246155 242703 239754 236802 233295 229429 226106 223927 222497 220958
53860B20958k018k268k281k232j935j210n02m05p15n99J51P02K79p97j557j466
$$ 220958 218940 216672 214391 212159 210224 209014 208512 208107 207392 206793 206944 207646 207925 207128 205571 204105
53844B04105o72L34R17M53r97k329k334j011M44J022P50J96k68m64k28M12J125
$$ 204105 203433 203767 204684 205137 204140 201811 199477 198466 198910 199932 200682 200878 200610 200146 199918 200330 201455
53827B01455J638J997K206J941R50l59j195j204p03r4N81J332J840J762J298J105
$$ 201455 203093 205090 207296 209237 210187 209828 208633 207429 206726 206632 207213 208545 210385 212147 213445 214550
53811B14550J557K315K839L010L109L314L529L664L770L908M091M393M811N062
$$ 214550 216107 218422 221261 224271 227380 230694 234223 237887 241657 245565 249656 254049 258860 263922
53797B63922M844M310L946L855L555K632J327K60j21K94J193J779J252k36j528
$$ 263922 268766 273076 277022 280877 284432 287064 288391 288651 288530 288824 290017 291796 293048 292812 291284
53782B91284j760j369j379k097l051l848m368m370l686k818k606l201l917m206
$$ 291284 289524 288155 286776 284679 281628 277780 273412 269042 265356 262538 259932 256731 252814 248608
53768B48608m271m413m388l765k648j651j255j352j462j310j152j367j807j902
$$ 248608 244337 239924 235536 231771 229123 227472 226217 224865 223403 222093 220941 219574 217767 215865
53754B15865j594j587k273k861k296p78M36O03J89o5J3K71O42R63R09L94k42o31
$$ 215865 214271 212684 210411 207550 205254 204476 204912 205515 205704 205639 205652 205923 206565 207528 208437 208831 208589 207958
53736B07958o80m77j80K5K14P72J734K248J513P0o41r5Q61J409J652J771J411
$$ 207958 207278 206801 206621 206646 206860 207632 209366 211614 213127 213197 212556 212461 213322 214731 216383 218154 219565
53719B19565N39J5N23J493J859J421Q00M71O07J453K944M213M243L095J867J440
$$ 219565 220104 220119 220642 222135 223994 225415 226215 226686 227293 228746 231690 235903 240146 243241 245108 246548
53703B46548J691J999K017J901K043K622L307L535L196K783K687K707K542K324
$$ 246548 248239 250238 252255 254156 256199 258821 262128 265663 268859 271642 274329 277036 279578 281902
53689B81902K264K081J300m5j377k094j930j074k42k32j014j651j438p19j89O6
$$ 281902 284166 286247 287547 287502 286125 284031 282101 281027 280785 280553 279539 277888 276450 275731 275542 275608
53673B75608K46J27m64r22n75J19J42m42m83L94J125Q04j1k97r1j60o54r78q66
$$ 275608 275854 275981 275517 274595 274020 274139 274281 273839 273356 273750 274875 275679 275668 275371 275280 275120 274466 273488 272622
53654B72622p41q59p72J6J181J784J285J52n89l45N29J136R69L86K10Q02J668
$$ 272622 271881 271022 270250 270266 271447 273231 274516 274668 274079 273734 274263 275399 276368 276754 276964 277766 279434
53637B79434K062J857J634J840K250K409K332K319K315J981J444J331J921K674
$$ 279434 281496 283353 284987 286827 289077 291486 293818 296137 298452 300433 301877 303208 305129 307803
53623C07803K953K799K757L176L966M765N151M920M351L931L725L324K600K014
$$ 307803 310756 313555 316312 319488 323454 328219 333370 338290 342641 346572 350297 353621 356221 358235
53609C58235J992K334K628K807K965L001K832K649K561K326J786J265J109J162
$$ 358235 360227 362561 365189 367996 370961 373962 376794 379443 382004 384330 386116 387381 388490 389652
53595C89652J137J159J467J792J576O88m53j360j703j371o79k83n30j053j331
$$ 389652 390789 391948 393415 395207 396783 397471 397018 395658 393955 392584 391905 391622 391092 390039 388708
53580C88708j333j279j210j150j326j717j822j362p83n08k70K09M66K1o36p36
$$ 388708 387375 386096 384886 383736 382410 380693 378871 377509 376726 376218 375948 376157 376623 376644 376008 375272
53564C75272m95o53j157j292r87p68n72J65J215J559Q65p0n74o80l25Q13K280
$$ 375272 374777 374124 372967 371675 370688 369920 369348 369513 370728 372287 373152 373082 372508 371828 371503 372316 374596
53547C74596K837K095J196J199J741J939J764J698J812J993K532L612M743N355
$$ 374596 377433 379528 380724 381923 383664 385603 387367 389065 390877 392870 395402 399014 403757 409112
53533D09112N611N912O114N928N729O121O991P728Q167Q642R272R850J0414J1240
$$ 409112 414723 420635 426749 432677 438406 444527 451518 459246 467413 476055 485327 495177 505591 516831
53519E16831J2273J3071J3489J3945J4832J6001J6948J7391J7591J8107J9135
$$ 516831 529104 542175 555664 569609 584441 600442 617390 634781 652372 670479 689614
53508F89614K0198K0671K0603K0655K1155K1692K1740K1281K0561J9740J8992
$$ 689614 709812 730483 751086 771741 792896 814588 836328 857609 878170 897910 916902
53497I16902J8526J8209J7681J7098J7201J8195J9107J8913J7879J7087J6988
$$ 916902 935428 953637 971318 988416 1005617 1023812 1042919 1061832 1079711 1096798 1113786
53486A113786J7101J7000J6876J7011J7327J7573J7689J7742J7755J7574J6891
$$ 1113786 1130887 1147887 1164763 1181774 1199101 1216674 1234363 1252105 1269860 1287434 1304325
53475A304325J5478J3474J1319R343P602O090M613K592m29l851o311p240p504
$$ 1304325 1319803 1333277 1344596 1353939 1361541 1367631 1372244 1374836 1374407 1370556 1364245 1357005 1349501
53462A349501q117r054r875j0712j1830j2775j3008j2944j3435j4497j5482j6280
$$ 1349501 1341384 1332330 1322455 1311743 1299913 1287138 1274130 1261186 1247751 1233254 1217772 1201492
53450A201492j7260j8192j8331j7730j7335j7541j7547j6588j4965j3425j2220
$$ 1201492 1184232 1166040 1147709 1129979 1112644 1095103 1077556 1060968 1046003 1032578 1020358
53439A020358j1231j0409r576q319o612n117m332l831k846j328J35J199J996K635
$$ 1020358 1009127 998718 989142 980823 974211 969094 964762 960931 958085 956757 956892 958091 960087 962722
53425I62722L005L182L595M604O194Q130J0250J2381J4181J5278J5674J5847J6378
$$ 962722 965727 968909 972504 977108 983302 991432 1001682 1014063 1028244 1043522 1059196 1075043 1091421
53412A091421J7498J9092K0970K2939K4705K6055K7162K8414K9849L1131L2218
$$ 1091421 1108919 1128011 1148981 1171920 1196625 1222680 1249842 1278256 1308105 1339236 1371454
53401A371454L3559L5390L7301L8948M0670M2847M5046M6510M7206M7694M8128
$$ 1371454 1405013 1440403 1477704 1516652 1557322 1600169 1645215 1691725 1738931 1786625 1834753
53390A834753M8248M8244M8661M9368M9489M8678M7574M6633M5321M3071M0357
$$ 1834753 1883001 1931245 1979906 2029274 2078763 2127441 2175015 2221648 2266969 2310040 2350397
53379B350397L8100L6406L4569L2056K8825K4880K0268J5452J1106P375L734k93
$$ 2350397 2388497 2424903 2459472 2491528 2520353 2545233 2565501 2580953 2592059 2599434 2603168 2602875
53367B602875m710r420j4631k0511k6524l1546l4839l6824l8567m0489m1942m2274
$$ 2602875 2598165 2588745 2574114 2553603 2527079 2495533 2460694 2423870 2385303 2344814 2302872 2260598
53355B260598m1949m1970m2411m2232m0746l8584l6827l5752l4938l4171l3661
$$ 2260598 2218649 2176679 2134268 2092036 2051290 2012706 1975879 1940127 1905189 1871018 1837357
53344A837357l3538l3683l4014l4488l4874l4815l4120l2752l0748k8398k6283
$$ 1837357 1803819 1770136 1736122 1701634 1666760 1631945 1597825 1565073 1534325 1505927 1479644
53333A479644k4674k3111k1079j8961j7694j7451j7340j6583j5519j5011j5304
$$ 1479644 1454970 1431859 1410780 1391819 1374125 1356674 1339334 1322751 1307232 1292221 1276917
53322A276917j5863j6134j5998j5608j5088j4463j3685j2715j1660j0722r874
$$ 1276917 1261054 1244920 1228922 1213314 1198226 1183763 1170078 1157363 1145703 1134981 1125107
53311A125107q743p045n082l486k497j722o95N88J903L282N007P059Q999J0481
$$ 1125107 1116364 1109319 1104237 1100751 1098254 1096532 1095837 1096425 1098328 1101610 1106617 1113676 1122675 1133156
53297A133156J1738J3260J5055J6566J7427J8102J9399K1399K3084K3347K2205
$$ 1133156 1144894 1158154 1173209 1189775 1207202 1225304 1244703 1266102 1289186 1312533 1334738
53286A334738K0771K0023J9775J9107J7582J5733J4285J3255J2003J0018P374
$$ 1334738 1355509 1375532 1395307 1414414 1431996 1447729 1462014 1475269 1487272 1497290 1504664
53275A504664M510J794o60k922n122p276r277j1107j2960j4965j6872j8261j9115
$$ 1504664 1509174 1510968 1510308 1507386 1502264 1494988 1485711 1474604 1461644 1446679 1429807 1411546 1392431
53262A392431j9858k0786k1675k2176k2274k2241k2254k2338k2531k2826k3056
$$ 1392431 1372573 1351787 1330112 1307936 1285662 1263421 1241167 1218829 1196298 1173472 1150416
53251A150416k2988k2552k1868k1134k0597k0411k0421k0241j9753j9365j9474
$$ 1150416 1127428 1104876 1083008 1061874 1041277 1020866 1000445 980204 960451 941086 921612
53240I21612j9912k0246k0413k0585k0546j9805j8416j7095j6265j5468j4150
$$ 921612 901700 881454 861041 840456 819910 800105 781689 764594 748329 732861 718711
53229G18711j2564j1446j1004j0722j0090r151q360q164q756r983j1453j2842
$$ 718711 706147 694701 683697 672975 662885 653734 645374 637210 628454 618471 607018 594176
53217E94176j3998j4792j5091j5026j4947j4836j4152j2663j1074j0237r991r461
$$ 594176 580178 565386 550295 535269 520322 505486 491334 478671 467597 457360 447369 437908
53205D37908q411p547p408p636p624p273o846o573o684p325q155q449p925p063
$$ 437908 429497 421950 414542 406906 399282 392009 385163 378590 371906 364581 356426 347977 340052 332989
53191C32989o299n478m464l731l796m441n070n428n464m913l674k342j604j362
$$ 332989 326690 321212 316748 313017 309221 304780 299710 294282 288818 283905 280231 277889 276285 274923
53177B74923j079p97r75j488j613j139o66p03j068j393j577j599j447j351j580
$$ 274923 273844 273047 272072 270584 268971 267832 267166 266463 265395 264002 262425 260826 259379 258028 256448
53162B56448j882j747j224q56p23l76J27J5r44j818j687p97qL23K91r9p47j192
$$ 256448 254566 252819 251595 250739 250016 249640 249767 249782 248838 247020 245333 244536 244528 244851 245142 245043 244296 243104
53144B43104j170j061j175j057j95R74J547J372J083J047J046Q72O15L66K07L85
$$ 243104 241934 240873 239698 238641 238446 239420 240967 242339 243422 244469 245515 246387 247002 247368 247575 247960
53128B47960R51J382J150N75M99J094J670J661J256R04P92Q93J125J309J293J136
$$ 247960 248911 250293 251443 252018 252517 253611 255281 256942 258198 259102 259894 260787 261912 263221 264514 265650
53112B65650Q88L39o17j485j648j211q57r17j123j275j472j690j754j778k050
$$ 265650 266538 266877 266260 264775 263127 261916 261059 260142 259019 257744 256272 254582 252828 251050 249000
53097B49000k335j994r10K37Q65J013Q11J54p81j325j077m13R2L43M64L84O5k19
$$ 249000 246665 244671 243761 243998 244863 245876 246687 246841 246060 244735 243658 243245 243337 243680 244144 244528 244593 244374
53079B44374k53k49m56p02p28o33o90q53q19l90L13Q76P73q9r75j030m38k24p66
$$ 244374 244121 243872 243416 242714 241986 241353 240663 239810 238991 238601 238914 239790 240563 240474 239499 238469 238031 237807 237041
53060B37041j290j186r14r75q44O8J133J239M70r4m5L9p7J75R98J614J349N58
$$ 237041 235751 234565 233651 232676 231832 231900 233033 234272 234742 234648 234603 234642 234565 234740 235738 237352 238701 239259
53042B39259m4l61o75r29q33m47j44j27k70l57k57o4j17o45j256j186k27R24J513
$$ 239259 239215 238854 238179 237250 236417 235970 235826 235699 235429 235072 234815 234751 234634 233989 232733 231547 231320 232244 233757
53023B33757J523J338J053N84J79J72L81K92j21l26n7K72K38M5J82O70J047R93
$$ 233757 235280 236618 237671 238255 238434 238606 238987 239279 239158 238832 238775 239047 239285 239330 239512 240182 241229 242222
53005B42222O79M85O08R16J052O79j70r72j149o78j34n1l27m52j65L15P05J030
$$ 242222 242901 243386 243994 244910 245962 246641 246471 245499 244350 243672 243538 243487 243160 242708 242543 242858 243563 244593
52987B44593J465J947K220K231K261K502K654K238J304N56N57J052J296J015O83
$$ 244593 246058 248005 250225 252456 254717 257219 259873 262111 263415 263971 264528 265580 266876 267891 268574
52972B68574Q43J480K122K327J894Q88k72r91j062q95r32j068r95r01j229j886
$$ 268574 269417 270897 273019 275346 277240 278128 277856 276865 275803 274908 273976 272908 271913 271012 269783 267897
52956B67897k233k011j667j570j427r71o40r72j630j706j001k86j78l44j56L30
$$ 267897 265664 263653 261986 260416 258989 258018 257378 256406 254776 253070 252069 251783 251605 251261 251105 251435
52940B51435N34K29j72k19O2L35L28k7o43j247j498j269p86l79j64r3j61l82o82
$$ 251435 251969 252198 252026 251807 251869 252204 252532 252505 251862 250615 249117 247848 247062 246683 246519 246426 246265 245883 245201
52921B45201r73j282j519j303l68Q01J258O89k07o19n23l32j12L33Q44R80O64
$$ 245201 244228 242946 241427 240124 239756 240557 241815 242504 242297 241678 241155 240823 240711 241044 241888 242868 243532
52904B43532J33n63j462k076j656l23P14N17m52j004o45J27P00Q91P51L27k10
$$ 243532 243665 243102 241640 239564 237908 237585 238299 238816 238364 237360 236715 236842 237542 238433 239184 239511 239301
52887B39301n37m62o5M77J048J547J784J600J036M08J38M07J004J577J984K237
$$ 239301 238764 238302 238237 238714 239762 241309 243093 244693 245729 246137 246275 246682 247686 249263 251247 253484
52871B53484K188J660R27O72J195J888J835Q14n17j364j431r35l19pj96o91j040
$$ 253484 255672 257332 258259 258931 260126 262014 263849 264663 264146 262782 261351 260416 260097 260090 259894 259203 258163
52854B58163r70p15p84j402k201k646k695k820l227l433k880j753p52k69j87l92
$$ 258163 257193 256478 255694 254292 252091 249445 246750 243930 240703 237270 234390 232637 231885 231616 231429 231037
52838B31037q10j035o06J15J14q45j679j397m96k02p39j193r04j96L48O39Q96
$$ 231037 230227 229192 228586 228701 228815 227970 226291 224894 224398 224196 223457 222264 221360 221164 221512 222151 223047
52821B23047J208J432J345P78o3n08n4Q95J393J077N14L01L33J82j92m43l69j40
$$ 223047 224255 225687 227032 227810 227747 227239 227185 228080 229473 230550 231064 231365 231698 231880 231688 231245 230876 230736
52803B30736j23n45j227j631j395q30n90q52j177j236j096p22K17J569K297J604
$$ 230736 230613 230068 228841 227210 225815 224985 224395 223543 222366 221130 220034 219312 219529 221098 223395 224999
52787B24999J56n69j39M14J34o26r29n70o7K77N87Q76R49R33J207J669J610O60
$$ 224999 225155 224586 224447 224861 224995 224369 223440 222870 222803 223080 223667 224543 225492 226425 227632 229301 230911 231571
52769B31571n89j344j539j587j550j193o78m68n53m01K21Q59J070R21O74M32M14
$$ 231571 230982 229638 228099 226512 224962 223769 223091 222623 222070 221669 221890 222749 223819 224740 225414 225846 226260
52752B26260R73K027K838K820K176J419O88P7J29J226K715L414L035K379K102
$$ 226260 227233 229260 232098 234918 237094 238513 239201 239278 239407 240633 243348 246762 249797 252176 254278
52737B54278J973J584J112R06Q09M31j73n58n63m89n86o95n56k77k76p73j492
$$ 254278 256251 257835 258947 259853 260662 261093 260920 260362 259799 259310 258724 258029 257473 257196 256920 256147 254655
52720B54655j916j801j400j182j404j845j982j451m89K10K30o9l4M28Q32Q85Q05
$$ 254655 252739 250938 249538 248356 246952 245107 243125 241674 241185 241395 241625 241556 241522 241950 242782 243667 244472
52703B44472P90O76L34j1j79l28n43n25j01L99O71R68J529J867J354K65m88n91
$$ 244472 245262 245938 246272 246261 246082 245754 245211 244686 244585 244984 245655 246623 248152 250019 251373 251638 251150 250559
52685B50559n60p54q77o78m39n27q85j248j478j480j181o88j73M07J077J405R16
$$ 250559 249999 249245 248368 247690 247251 246724 245839 244591 243113 241633 240452 239764 239591 239998 241075 242480 243396
52668B43396j7m14m9J72l91j035o69O19J682J795J361J199J601K169K303J842
$$ 243396 243379 242965 242916 243088 242697 241662 240993 241612 243294 245089 246450 247649 249250 251419 253722 255564
52652B55564J291J260J586J390K34j139j636j107l72j70n78j286j891j975j401
$$ 255564 256855 258115 259701 261091 261325 260186 258550 257443 257071 256901 256323 255037 253146 251171 249770
52637B49770o12k39l27l29R1O88J146J502J812J852J430P59J16o04j542k269k028
$$ 249770 249158 248919 248592 248263 248354 249042 250188 251690 253502 255354 256784 257543 257659 257055 255513 253244 251216
52620B51216p53O19J111O89L7m09p34j018j023n75L1L19J27k83n15l08K62P52
$$ 251216 250463 251082 252193 252882 252919 252510 251776 250758 249735 249160 249191 249510 249637 249354 248839 248531 248793 249545
52602B49545P27L01J05M90J049J189Q78N02K62J19K02O81J311J611J462J177R56
$$ 249545 250272 250573 250678 251168 252217 253406 254284 254786 255048 255167 255369 256050 257361 258972 260434 261611 262567
52585B62567P99Q44J220J522J099P9n69k75L94O28M25K70K65J73M3J22L15K71
$$ 262567 263366 264210 265430 266952 268051 268130 267561 267286 267680 268308 268733 269003 269268 269441 269484 269606 269921 270192
52567B70192q5n10q55j101j151r86q68r45q06n5Q51R68J96m57k17L98L34o14j638
$$ 270192 270107 269597 268742 267641 266490 265504 264636 263691 262885 262830 263681 264649 264845 264388 264171 264569 264903 264289 262651
52548B62651j944j488p94m24o22j165j401p78N68J842K340K053J401O17l24j178
$$ 262651 260707 259219 258425 258001 257379 256214 254813 254035 254603 256445 258785 260838 262239 262856 262532 261354
52532B61354j286k62J350K415K278J332M58J51J94O7m82j182j496j116k33P17
$$ 261354 260068 259806 261156 263571 265849 267181 267639 267790 267984 268051 267569 266387 264891 263775 263542 264259
52516B64259J457J937K191K312K505K752K634J837Q57O58J449K243J956N64j150
$$ 264259 265716 267653 269844 272156 274661 277413 280047 281884 282741 283399 284848 287091 289047 289611 288461
52501B88461k603l660m177l953l154k352j934j800j670j436j123p18k13K94O18
$$ 288461 285858 282198 278021 274068 270914 268562 266628 264828 263158 261722 260599 259881 259668 259962 260580
52486B60580N71N5p20j195q67J63J232J759J690J317Q62M39K27M46J082J783K114
$$ 260580 261151 261206 260486 259291 258424 258587 259819 261578 263268 264585 265447 265886 266113 266559 267641 269424 271538
52469B71538J939J534J360J619K080K355K310K098J826J383P85M41O92J108P22
$$ 271538 273477 275011 276371 277990 280070 282425 284735 286833 288659 290042 290827 291268 291960 293068 293790
52454B93790p68k398l068k961l175l992m368l477k019j266j383j435q58m9M23
$$ 293790 293022 290624 287556 284595 281420 277428 273060 269583 267564 266298 264915 263480 262622 262573 262996
52439B62996M64K02k57o24n68k17j2O3M60J136J303N65l31l82L79J032Q99J87
$$ 262996 263460 263662 263405 262781 262213 261996 261984 262047 262507 263643 264946 265511 265180 264798 265177 266209 267108 267295
52421B67295l52l4J174K520L112K902K698L017L540L929M546N825P436Q727R533
$$ 267295 266943 266909 268083 270603 273715 276617 279315 282332 285872 289801 294347 300172 307608 316335 325868
52406C25868R940R679Q481O720M923K939L35k527m722n940o623o935o521n463
$$ 325868 335808 345487 353968 360688 365611 368550 368885 366358 361636 355696 349073 342138 335617 330154
52392C30154m555m325m373m077l306k224j008r2n9q04j337q63L26J396J986K197
$$ 330154 325599 321274 316901 312824 309518 307294 306286 306194 306135 305331 303994 303131 303457 304853 306839 309036
52376C09036K106J866J987K810L860M325M091L744L599L362K891K625K853L061
$$ 309036 311142 313008 314995 317805 321665 325990 330081 333825 337424 340786 343677 346302 349155 352216
52362C52216K486J172o6o54q17r50r35l78O57J595J992J928J707J486J336J375
$$ 352216 354702 355874 355808 355154 354337 353387 352452 352074 352731 354326 356318 358246 359953 361439 362775 364150
52346C64150J661K110K652L243L665L642L352L450M296N457O352P037P901Q815
$$ 364150 365811 367921 370573 373816 377481 381123 384475 387925 392221 397678 404030 411067 418968 427783
52332D27783R265R277R572J0652J2246J3807J5167J6438J7652J8720J9563K0079
$$ 427783 437048 446325 455897 466549 478795 492602 507769 524207 541859 560579 580142 600221
52320F00221K0225K0158K0125K0149K0053J9833J9728J9835K0019K0212K0487
$$ 600221 620446 640604 660729 680878 700931 720764 740492 760327 780346 800558 821045
52309H21045K0666K0300J9177J7600J6033J4792J4139J4228J4666J4613J3614
$$ 821045 841711 862011 881188 898788 914821 929613 943752 957980 972646 987259 1000873
52298A000873J2111J0751R490P851N724L477J349p69k936m954o640p951q762q809
$$ 1000873 1012984 1023735 1033225 1041076 1046800 1050277 1051626 1050857 1047921 1042967 1036327 1028376 1019614 1010805
52284A010805q057o932n975n383m952m357l319j667N48K907M825O018O760P588
$$ 1010805 1002748 995816 989841 984458 979506 975149 971830 970163 970711 973618 978443 984461 991221 998809
52270I98809Q773J0202J1573J2589J3003J2882J2792J3406J4704J5915J6436J6493
$$ 998809 1007582 1017784 1029357 1041946 1054949 1067831 1080623 1094029 1108733 1124648 1141084 1157577
52258A157577J6532J6386J5609J4409J3583J3424J3272J2354J0639Q631O661M697
$$ 1157577 1174109 1190495 1206104 1220513 1234096 1247520 1260792 1273146 1283785 1292416 1299077 1303774
52246A303774K606L85j824l812n485o873p901q294q057p915q669j0080j0881j0202
$$ 1303774 1306380 1306765 1304941 1301129 1295644 1288771 1280870 1272576 1264519 1256604 1247935 1237855 1226974 1216772
52232A216772q616p405p110p151o705n617m387l521k998k391j467m14O12J852
$$ 1216772 1208156 1200751 1193641 1186490 1179785 1174168 1169781 1166260 1163262 1160871 1159404 1158990 1159602 1161454
52218A161454L445M820N120M333L421L262L854M732N576O136O115N579N158N406
$$ 1161454 1164899 1169719 1174839 1179172 1182593 1185855 1189709 1194441 1200017 1206153 1212268 1217847 1223005 1228411
52204A228411O124O621O524O073N835O218P126P952Q162P924P829P965P800P024
$$ 1228411 1234535 1241156 1247680 1253753 1259588 1265806 1272932 1280884 1289046 1296970 1304799 1312764 1320564 1327588
52190A327588N971M850L283J100r74k151k727l708n483p484r024r850r984r586
$$ 1327588 1333559 1338409 1341692 1342792 1341818 1339667 1336940 1333232 1327749 1320265 1311241 1301391 1291407 1281821
52176A281821r020q584q149p404o437n643n123m588l835k916j902q66p2K67M31
$$ 1281821 1272801 1264217 1256068 1248664 1242227 1236584 1231461 1226873 1223038 1220122 1218220 1217354 1217282 1217549 1217980
52161A217980R30J732K149J663N58l91o62l66n7k39q08j139q40k65k9k36n39p35
$$ 1217980 1218910 1220642 1222791 1224454 1225012 1224621 1223959 1223593 1223536 1223297 1222489 1221350 1220510 1220245 1220216 1219980 1219441 1218706
52143A218706q46p18j94L57K63n77j507j870j524n46R74K699M175N429P030R279
$$ 1218706 1217860 1217142 1216948 1217305 1217568 1216991 1215484 1213614 1212090 1211544 1212518 1215217 1219392 1224821 1231851 1241130
52127A241130J1824J4292J6799J9403K1624K3039K4042K5375K7056K8327K8670
$$ 1241130 1252954 1267246 1284045 1303448 1325072 1348111 1372153 1397528 1424584 1452911 1481581
52116A481581K8316K7765K7198K6506K5566K4243K2430K0245J8095J6374J5165
$$ 1481581 1509897 1537662 1564860 1591366 1616932 1641175 1663605 1683850 1701945 1718319 1733484
52105A733484J4297J3529J2601J1242R359P162M934K650ql175o448r196j1192
$$ 1733484 1747781 1761310 1773911 1785153 1794512 1801674 1806608 1809258 1809250 1806075 1799627 1790431 1779239
52092A779239j2812j4494j6199j7460j7907j7609j6942j6166j5103j3346j0823
$$ 1779239 1766427 1751933 1735734 1718274 1700367 1682758 1665816 1649650 1634547 1621201 1610378
52081A610378q115n959m411k867j030O17J621K491M166O731R227J0883J1971J3169
$$ 1610378 1602263 1596304 1591893 1589026 1587996 1588613 1590234 1592725 1596891 1603622 1612849 1623732 1635703 1648872
52067A648872J4574J5709J6308J6593J6784J6764J6358J5702J5065J4328J3033
$$ 1648872 1663446 1679155 1695463 1712056 1728840 1745604 1761962 1777664 1792729 1807057 1820090
52056A820090J1061Q990P394N867L388k86m076o833q665j0530j2910j5467j7821
$$ 1820090 1831151 1840141 1847535 1853402 1856790 1856504 1852428 1845595 1836930 1826400 1813490 1798023 1780202
52043A780202j9911k1616k2678k3132k3267k3041k2083k0465j8879j7832j7166
$$ 1780202 1760291 1738675 1715997 1692865 1669598 1646557 1624474 1604009 1585130 1567298 1550132
52032A550132j6615j6343j6484j6635j6285j5475j4587j3738j2839j2025j1610
$$ 1550132 1533517 1517174 1500690 1484055 1467770 1452295 1437708 1423970 1411131 1399106 1387496
52021A387496j1656j1943j2249j2404j2229j1738j1270j1125j1190j1238j1418
$$ 1387496 1375840 1363897 1351648 1339244 1327015 1315277 1304007 1292882 1281692 1270454 1259036
52010A259036j2091j3285j4686j6050j7331j8459j9391k0281k1207k1802k1657
$$ 1259036 1246945 1233660 1218974 1202924 1185593 1167134 1147743 1127462 1106255 1084453 1062796
51999A062796k0980k0401k0067j9528j8585j7686j7205j6923j6609j6658j7480
$$ 1062796 1041816 1021415 1001348 981820 963235 945549 928344 911421 894812 878154 860674
51988H60674j8623j9152j8861j8496j8625j8883j8622j7858j7132j6648j6027
$$ 860674 842051 822899 804038 785542 766917 748034 729412 711554 694422 677774 661747
51977F61747j4877j3219j1313r395p696o414n418m232k604q84M80J653L089M604
$$ 661747 646870 633651 622338 612943 605247 598833 593415 589183 586579 585695 586175 587828 590917 595521
51963E95521N341M870L774K746J646pj989l531m422n164n995o416o004n058m062
$$ 595521 600862 605732 609506 612252 613898 613891 611902 608371 603949 598785 592790 586374 580370 575312 571250
51948E71250k977j556M7J503K909M582O406P960R216J0543J1952J2882J2909J2222
$$ 571250 568273 566717 566764 568267 571176 575758 582164 590124 599340 609883 621835 634717 647626 659848
51934F59848J1208R968Q453O666M550K052l85j904k254k400l485n449p250q301
$$ 659848 671056 681024 689477 696143 700693 702745 702360 700456 698202 695802 692317 686868 679618 671317
51920F71317r025r954j0997j1832j2511j3243j3958j4357j4191j3273j1509r177
$$ 671317 662292 652338 641341 629509 616998 603755 589797 575440 561249 547976 536467 527290
51908E27290o893n059l478j809j52J012J319O83p39k471l850m622n262o383p889
$$ 527290 520397 515338 511860 510051 509899 510911 512230 512913 512174 509703 505853 501231 495969 489586 481697
51893D81697r106r581r445q986q308p366o081m393k468p42M97J504K731M134N277
$$ 481697 472591 463010 453565 444579 436271 428905 422824 418431 415963 415221 415718 417222 419953 424087 429364
51878D29364O005O559P038P215O993O564O006N119L848K421R35p49k458l607l902
$$ 429364 435369 441928 448966 456181 463174 469738 475744 480863 484711 487132 488067 487318 484860 481253 477351
51863D77351l739l517l058k077q53J19Q09J367J566J082K23l46o07j237k595m201
$$ 477351 473612 470095 467037 464960 464107 464226 465035 466402 467968 469050 469273 468927 468320 467083 464488 460287
51847D60287n371n919o003n751n298m837m472m162l900l619k919j409N62J994
$$ 460287 454916 448997 442994 437243 431945 427108 422636 418474 414574 410955 408036 406627 407189 409183
51833D09183K355K098J822J459P53K8k02q9k19o47r08r29j156j664j879j439p40
$$ 409183 411538 413636 415458 416917 417670 417698 417496 417407 417188 416541 415633 414704 413548 411884 410005 408566 407826
51816D07826k37J99P17Q96K86p87j623k022k145j773o08P65J128J98q80j029n89
$$ 407826 407589 407788 408505 409401 409687 408900 407277 405255 403110 401337 400729 401494 402622 402820 401940 400911 400322
51799D00322o05j277j839j710j148p35p66j185j669j735j099m7P47Q93N80K35
$$ 400322 399717 398440 396601 394891 393743 393008 392242 391057 389388 387653 386554 386507 387254 388147 388727 388962
51783C88962P6M0l5j48J6Q35K192L359L722L506L433L882M740N865P167Q220Q461
$$ 388962 389038 389078 389043 388895 388911 389746 391938 395297 399019 402525 405958 409840 414580 420445 427612 435832 444293
51766D44293P887P033O129M786K702K02k208m364o184p409p937q064q005p617
$$ 444293 452180 459213 465342 470128 472830 473032 470824 466460 460276 452867 444930 436866 428861 421244
51752D21244o910o403o415o423n729m465l280k277r89O65K168L214M029M802N359
$$ 421244 414334 407931 401516 395093 389364 384899 381619 379342 378353 379018 381186 384400 388429 393231 398590
51737C98590N554N471N056M132K943K129J937J911J626J203Q55M58J4m2M80R42
$$ 398590 404144 409615 414671 418803 421746 423875 425812 427723 429349 430552 431407 431865 431879 431837 432317 433259
51721D33259N27p82k371l765m728m868l883k152m71P66J601J896J355K37o17p03
$$ 433259 433786 433004 430633 426868 422140 417272 413389 411237 410766 411532 413133 415029 416384 416621 416004 415301
51705D15301k98J90P45J371J736J615J299J216J406J643J776J692J269O64K42
$$ 415301 415003 415193 415938 417309 419045 420660 421959 423175 424581 426224 428000 429692 430961 431625 431867
51690D31867n3q83k583m469n621o008o201o182n318l485j483j12N80Q82R11P89
$$ 431867 431814 430931 428348 423879 418258 412250 406049 399867 394549 391064 389581 389469 390049 390931 391842 392631
51674C92631Q25J156J497J648J881K499L304L964M554N330O103O325N748M691
$$ 392631 393456 394612 396109 397757 399638 402137 405441 409405 413959 419289 425392 431717 437465 442156
51660D42156L553K420J170j79j279j539n38J466L608N125N819N667M416J930j272
$$ 442156 445709 448129 449299 449120 447841 446302 445764 447230 450838 455963 461782 467449 471865 473795 472523
51645D72523m364o936q957j0142j0143r304q560q205p471n748l708k536k374k246
$$ 472523 468159 461223 452266 442124 431981 422677 414117 405912 398441 392693 388985 386449 384075 381829
51631C81829j387K7J419K419K727K130R83J86J83L59n1q63j373j627k313l416
$$ 381829 380442 380469 381888 384307 387034 389164 390147 390333 390516 390875 390824 389961 388588 386961 384648 381232
51615C81232l943l358k473k300k674k702k159j525r72k00Q11J712K454L281M007
$$ 381232 377289 373931 371458 369158 366484 363782 361623 360098 359126 358926 359737 361449 363903 367184 371191
51600C71191M167M022M514N861P047P150O366N228L667J584l97j639k435l356
$$ 371191 375358 379380 383894 389755 396802 403952 410318 415546 419213 420797 420400 418761 416326 412970
51586D12970m090l905k855j574j49J783L957N605O684P904R463J0737J1423J1973
$$ 412970 408880 404975 402120 400546 400397 402180 406137 411742 418426 426330 435793 446530 457953 469926
51572D69926J2568J2658J2085J1722J2261J3090J3125J2342J1807J2497J4679
$$ 469926 482494 495152 507237 518959 531220 544310 557435 569777 581584 594081 608760
51561F08760J8087K2152K6013K8861L0272L0149K8589K5842K2189J7630J2098
$$ 608760 626847 648999 675012 703873 734145 764294 792883 818725 840914 858544 870642
51550H70642O038K46n039j0322j5853k0979k4946k7740k9692l0689l0465k9276
$$ 870642 876680 876926 871887 861565 845712 824733 799787 772047 742355 711666 681201 651925
51538F51925k7656k5719k3264k0447j7763j5489j3561j1856j0235q463o517m816
$$ 651925 624269 598550 575286 554839 537076 521587 508026 496170 485935 477472 470955 466139
51526D66139l688k832j707m04L45rj333l010m364m984m964m715m392l819l124
$$ 466139 462451 459619 457912 457508 457853 457844 456511 453501 449137 444153 439189 434474 430082 426263 423139
51511D23139k935l467l972l719l145l254m090m680m389l584k866k366j988j716
$$ 423139 420204 416737 412765 409046 405901 402647 398557 393877 389488 385904 383038 380672 378684 376968
51497C76968j487j170q60p71q15p26n44n61p28o57k54K27P26J389J890J457r0
$$ 376968 375481 374311 373451 372680 371865 371139 370595 370034 369306 368649 368395 368622 369348 370737 372627 374084 373994
51480C73994j858k834k877k491k040j611j296j141j045r95j232j810k218j865
$$ 373994 372136 369302 366425 363934 361894 360283 358987 357846 356801 355806 354574 352764 350546 348681
51466C48681r20l00o57j601k135j798j145r43j113q90J6R18J122R02J058J824
$$ 348681 347761 347461 346804 345203 343068 341270 340125 339182 338069 337179 337195 338113 339235 340137 341195 343019
51450C43019K786L660M591N737P069Q491R717J0274J0032R550R228Q427O282L284
$$ 343019 345805 349465 354056 359793 366862 375353 385070 395344 405376 414926 424154 432581 438863 442147
51436D42147R58o4o39j536k444l011l818n420p178p944p469o340m947l289j595
$$ 442147 443105 443041 442402 440866 438422 435411 431593 426173 418995 411051 403582 397242 392295 389006 387411
51421C87411l21L56M98P4q23j618j728j333j082j137j056o24j63L2J11L18O02
$$ 387411 387090 387446 387944 388018 387195 385577 383849 382516 381434 380297 379241 378617 378454 378486 378597 378915 379517
51404C79517P61P77R07J433K275K808K387J242N23J135K747M379N629O861Q326
$$ 379517 380278 381055 381962 383395 385670 388478 390865 392107 392630 393765 396512 400891 406520 413381 421707
51389D21707R774J0939J2001J3356J5245J7649K0385K3288K6489L0344L4827L9159
$$ 421707 431481 442420 454421 467777 483022 500671 521056 544344 570833 601177 636004 675163
51377F75163M2316M3812M3738M2302L9660L5925L0878K3962J5127N507l450j1399
$$ 675163 717479 761291 805029 847331 886991 922916 953794 977756 992883 998390 994940 983541
51365I83541j8939k6091l1855l5607l7989l9921m1307m1447m0243l8251l5787
$$ 983541 964602 938511 906656 871049 833060 793139 751832 710385 670142 631891 596104
51354E96104l2670k8893k4989k1532j8661j6187j3965j2003j0375r120q154p311
$$ 596104 563434 534541 509552 488020 469359 453172 439207 427204 416829 407709 399555 392244
51342C92244o571o075n786n292m275l127k606k810k887k126r57m04o85r63n68
$$ 392244 385673 379598 373812 368520 364245 361118 358512 355702 352815 350689 349732 349328 348643 347680 347112
51327C47112J16L02m3l03j69Q5L06P69J521J951J552P60N72J259J979J760N80
$$ 347112 347228 347530 347487 347184 347015 347100 347406 348175 349696 351647 353199 353959 354531 355790 357769 359529 360109
51310C60109p56j625k116k581k901k607j691q45o69r57j153j242j591k082k144
$$ 360109 359353 357728 355612 353031 350130 347523 345832 344987 344318 343361 342208 340966 339375 337293 335149
51295C35149j711j419j529j485q99l07j94l0R92K595L769M193M379M572M460M046
$$ 335149 333438 332019 330490 329005 328106 327799 327605 327575 328567 331162 334931 339124 343503 348075 352535 356581
51279C56581L832L926L795L203K552K015J063n16j873j984r03M90J529K047J982
$$ 356581 360413 364339 368134 371337 373889 375904 376967 376451 374578 372594 371691 372181 373710 375757 377739
51264C77739J404P45L99J53m70j390k000j976j615j328j239j342j678k215k825
$$ 377739 379143 379888 380287 380440 379970 378580 376580 374604 372989 371661 370422 369080 367402 365187 362362
51249C62362l417l894l960l326k139j006m49m75o84o53l21o4l21r92j429j266
$$ 362362 358945 355051 351091 347765 345626 344620 344171 343696 343012 342359 342038 341974 341653 340661 339232 337966
51233C37966r38r48r65k82Q62J321O12k64j56O84J055M94j90m6R65K153K879K917
$$ 337966 337028 336080 335115 334833 335695 337016 337628 337364 337208 337892 338947 339441 339251 339205 340170 342323 345202 348119
51215C48119K456J924J676J657J537J209R45J000J249J367J225J006J003J371
$$ 348119 350575 352499 354175 355832 357369 358578 359523 360523 361772 363139 364364 365370 366373 367744
51201C67744J910K101J525L55p23j184j084p58m26k22l82r79j568j497n93O06
$$ 367744 369654 371755 373280 373635 372912 371728 370644 369886 369460 369238 368856 367877 366309 364812 364219 364825
51185C64825J383J431R41K83k73o30p39m85J20O91O95J09m50n15l48l68l32K71
$$ 364825 366208 367639 368580 368863 368590 367960 367221 366736 366856 367547 368242 368351 367901 367386 367038 366670 366338 366609
51167C66609J189J571J242J010J478K207K542K579K715K777K272J259K40o01j439
$$ 366609 367798 369369 370611 371621 373099 375306 377848 380427 383142 385919 388191 389450 389690 389089 387650
51152C87650k201k665k993l504l912l574k605j918j956k090j732j271j307j505
$$ 387650 385449 382784 379791 376287 372375 368801 366196 364278 362322 360232 358500 357229 355922 354417
51138C54417j080o8P10Q32P12P62Q49P82Q30J343K218L009L375L222K653K008
$$ 354417 353337 353269 353979 354811 355523 356285 357134 357916 358746 360089 362307 365316 368691 371913 374566 376574
51122C76574J723J868K004J750J339J324J782K211K183J821J536J478J480J361
$$ 376574 378297 380165 382169 383919 385258 386582 388364 390575 392758 394579 396115 397593 399073 400434
51108D00434J225J387J977K605K593J752P41L50M86L53l88j145j306j028p05k06
$$ 400434 401659 403046 405023 407628 410221 411973 412714 413064 413550 413903 413515 412370 411064 410036 409331 409125
51092D09125O60J311Q79m61j446j258l56L83P31R00Q79O00L52M47P14P92P92J087
$$ 409125 409785 411096 411975 411514 410068 408810 408454 408837 409568 410468 411347 411947 412299 412746 413460 414252 415044 416131
51074D16131J652K100K361K731L300L784M083M483N193O095P157Q616J0499J2286
$$ 416131 417783 419883 422244 424975 428275 432059 436142 440625 445818 451913 459070 467686 478185 490471
51060D90471J3425J3980J4397J4741J4534J3412J1747J0428J0034J0313J0576
$$ 490471 503896 517876 532273 547014 561548 574960 586707 597135 607169 617482 628058
51049F28058J0573J0712J1178J1042Q860M345q83m659o251o707p396q641r818
$$ 628058 638631 649343 660521 671563 680423 684768 683885 679226 672975 666268 658872 650231 640413
51036F40413j0289r869q700p245o372o869q589j0386j1195j0942j0102q813o992
$$ 640413 630124 620255 611555 604310 597938 591069 582480 572094 560899 549957 539855 531042 524050
51023E24050n013l444k157m76J605L200L843M215N044O059O718P313Q397R636
$$ 524050 519037 515593 513436 512960 514565 517765 521608 525823 530867 536926 543644 550957 559354 568990
51009E68990J0245J0317J0652J1447J2177J2787J3828J5219J6015J5865J5700
$$ 568990 579235 589552 600204 611651 623828 636615 650443 665662 681677 697542 713242
50998G13242J6349J7317J7606J7008J5791J3774J0638O837L313M90j840l713m797
$$ 713242 729591 746908 764514 781522 797313 811087 821725 828562 831875 832365 830525 826812 822015
50985H22015m903m125k519j24K694N402P795R971J1920J3555J5086J6928J9323
$$ 822015 817112 812987 810468 810344 813038 818440 826235 836206 848126 861681 876767 893695 913018
50972I13018K2366K6164L0501L4656L8150M1582M5936N1114N5941N9686O2732
$$ 913018 935384 961548 992049 1026705 1064855 1106437 1152373 1203487 1259428 1319114 1381846
50961A381846O5503O7543O8248O7780O6593O4579O1346N7075N2346M7348M1983
$$ 1381846 1447349 1514892 1583140 1650920 1717513 1782092 1843438 1900513 1952859 2000207 2042190
50950B042190L6643L2163K8854K6247K3940K2072K0663J9160J7221J5498J4887
$$ 2042190 2078833 2110996 2139850 2166097 2190037 2212109 2232772 2251932 2269153 2284651 2299538
50939B299538J5000J4122J0958O064J201k568n842j0036j5834k2643k9379l5601
$$ 2299538 2314538 2328660 2339618 2345682 2346883 2344315 2338473 2328437 2312603 2289960 2260581 2224980
50927B224980m1694m8053n4370n9904o4288o7771p0701p2958p4019p3349p0765
$$ 2224980 2183286 2135233 2080863 2020959 1956671 1888900 1818199 1745241 1671222 1597873 1527108
50916A527108o6686o2015n7534n3331m9018m4528m0262l6421l2722k9117k6207
$$ 1527108 1460422 1398407 1340873 1287542 1238524 1193996 1153734 1117313 1084591 1055474 1029267
50905A029267k4380k2981k1042j8617j6679j5662j4870j3456j1412r351p787o812
$$ 1029267 1004887 981906 960864 942247 925568 909906 895036 881580 870168 860817 853030 846218
50893H46218o107n114l585k019j138q99n35L68J422K275L142M191N092N582N983
$$ 846218 840111 834997 831412 829393 828255 827356 826821 827189 828611 830886 834028 838219 843311 848893 854876
50878H54876O689P629Q668R958J1418J2449J2831J3392J5018J7363J9368K0718
$$ 854876 861565 869194 877862 887820 899238 911687 924518 937910 952928 970291 989659 1010377
50866A010377K2000K3667K5717K8252L1491L5207L8943M2834M7468N2970N8982
$$ 1010377 1032377 1056044 1081761 1110013 1141504 1176711 1215654 1258488 1305956 1358926 1417908
50855A417908O5539P3000Q1034Q8648R5608J02868J11087J19553J27141J33645
$$ 1417908 1483447 1556447 1637481 1726129 1821737 1924605 2035692 2155245 2282386 2416031
50845B416031J39439J44367J47861J49707J49936J48081J43347J35494J24962
$$ 2416031 2555470 2699837 2847698 2997405 3147341 3295422 3438769 3574263 3699225
50836C699225J12168R7331Q1172O5133N0536L7761K6561J7029R919N972N145O694
$$ 3699225 3811393 3908724 3989896 4055029 4105565 4143326 4169887 4186916 4196835 4202807 4207952 4214646
50824D214646R833J4097J8965K3558K6859K8038K6284K0663J0650l335k0285l9338
$$ 4214646 4224479 4238576 4257541 4281099 4307958 4335996 4362280 4382943 4393593 4390258 4369973 4330635
50812D330635n9705q0229r9797j18178j35584j51302j63673j71712j75850j76714
$$ 4330635 4270930 4190701 4090904 3972726 3837142 3685840 3522167 3350455 3174605 2997891
50802B997891j74103j67894j59010j48684j37251j24659j11591r9086q7363p6016
$$ 2997891 2823788 2655894 2496884 2348200 2210949 2086290 1974699 1875613 1788250 1712234
50792A712234o5182n5554m7266l9793l2943k7091k2303j8184j4769j2638j1789
$$ 1712234 1647052 1591498 1544232 1504439 1471496 1444405 1422102 1403918 1389149 1376511 1364722
50781A364722j1192j0000q600p945q341r285j0204j0927j1673j2759j4047j4757
$$ 1364722 1353530 1343530 1334930 1326985 1318644 1309359 1299155 1288228 1276555 1263796 1249749 1234992
50769A234992j4385j3726j4171j5798j7090j6990j6236j5967j5949j5183j3632
$$ 1234992 1220607 1206881 1192710 1176912 1159822 1142832 1126596 1110629 1094680 1079497 1065865
50758A065865j2068j0600q558n895l501j880m03J715M475P422J0317J3053J5545
$$ 1065865 1053797 1043197 1034639 1028744 1025243 1023363 1022960 1024675 1029150 1036572 1046889 1059942 1075487
50745A075487J8051K1185K5189K9590L3880L8200M2863M7717N2390N6907O1452
$$ 1075487 1093538 1114723 1139912 1169502 1203382 1241582 1284445 1332162 1384552 1441459 1502911
50734A502911O5683O8868P0819P2256P3973P5838P6868P6358P4714P2933P1206
$$ 1502911 1568594 1637462 1708281 1780537 1854510 1930348 2007216 2083574 2158288 2231221 2302427
50723B302427O8458O3640N7150N0328M3577L5828K6130J5127M473m649j1857j6881
$$ 2302427 2370885 2434525 2491675 2542003 2585580 2621408 2647538 2662665 2667138 2662489 2650632 2633751
50711B633751j9390j9388j7209j3165p616j255N139J1088J6059J9004J8926J5854
$$ 2633751 2614361 2594973 2577764 2564599 2556983 2555728 2560867 2571955 2588014 2607018 2625944 2641798
50699B641798J0546L282o291j8119l1395m5419n9886p3894q5533r3285r7303r8650
$$ 2641798 2652344 2655626 2649335 2631216 2599821 2554402 2494516 2420622 2335089 2241804 2144501 2045851
50687B045851r7742r4368q8862q2238p5109o7284n8623m9649m1013l2865k5066
$$ 2045851 1948109 1853741 1764879 1682641 1607532 1540248 1481625 1431976 1390963 1358098 1333032
50676A333032j7724j1193n641q69L445P373J0597J2750J3956J4801J5599J5873
$$ 1333032 1315308 1304115 1298474 1297605 1301050 1308423 1319020 1331770 1345726 1360527 1376126 1391999
50664A391999J5003J3183J1344J0163R630R552R904J0508J0916J0996J1287J2311
$$ 1391999 1407002 1420185 1431529 1441692 1451322 1460874 1470778 1481286 1492202 1503198 1514485 1526796
50652A526796J3797J4999J5719J6613J8453K1320K4612K7720L0525L3323L6314
$$ 1526796 1540593 1555592 1571311 1587924 1606377 1627697 1652309 1680029 1710554 1743877 1780191
50641A780191L9263M1728M3524M4825M5757M6203M6026M5341M4383M3245M2024
$$ 1780191 1819454 1861182 1904706 1949531 1995288 2041491 2087517 2132858 2177241 2220486 2262510
50630B262510M0970M0164L8914L5943L0415K2723J3847M000p574k0983l4187m3810
$$ 2262510 2303480 2343644 2382558 2418501 2448916 2471639 2485486 2489486 2481912 2460929 2426742 2382932
50618B382932m7786m6805m3020l7834l1527k4510j7928j2745q893n730l002j076
$$ 2382932 2335146 2288341 2245321 2207487 2175960 2151450 2133522 2120777 2111884 2106154 2103152 2102076
50606B102076n91k149o092j2132j9400k7039l4641m1979m8608n4124n8517o1854
$$ 2102076 2101485 2099336 2093244 2081112 2061712 2034673 2000032 1958053 1909445 1855321 1796804 1734950
50594A734950o3758o3666o1643n8451n4830n0985m6989m3193m0064l7676l5660
$$ 1734950 1671192 1607526 1545883 1487432 1432602 1381617 1334628 1291435 1251371 1213695 1178035
50583A178035l3514l0873k7643k4053k0539j7375j4417j1346q113n000k174O25
$$ 1178035 1144521 1113648 1086005 1061952 1041413 1024038 1009621 998275 990162 985162 982988 983613
50571I83613L719O895R402J0723J1195J1647J2574J3897J5411J7097J8851K0288
$$ 983613 987332 994227 1003629 1014352 1025547 1037194 1049768 1063665 1079076 1096173 1115024 1135312
50559A135312K1203K1998K3256K4893K6037K5965K4910K3794K3218K2944K2444
$$ 1135312 1156515 1178513 1201769 1226662 1252699 1278664 1303574 1327368 1350586 1373530 1395974
50548A395974K1734K1422K1846K2530K2767K2671K3250K5380K9061L3748L9017
$$ 1395974 1417708 1439130 1460976 1483506 1506273 1528944 1552194 1577574 1606635 1640383 1679400
50537A679400M4569M9916N4592N8705O2863O7528P2732P8425Q4657R1191R7243
$$ 1679400 1723969 1773885 1828477 1887182 1950045 2017573 2090305 2168730 2253387 2344578 2441821
50526B441821J01978J05242J07544J09195J09650J07842J03186R6086Q7391P7455
$$ 2441821 2543799 2649041 2756585 2865780 2975430 3083272 3186458 3282544 3369935 3447390
50516C447390O5931N2381L6883K0015K540j4776l1298m6690o0804p3186q2937
$$ 3447390 3513321 3565702 3602585 3622600 3625140 3610364 3579066 3532376 3471572 3398386 3315449
50505C315449q9336r2427r2651r0077q4362p5481o4166n1495l8287k4933j1540
$$ 3315449 3226113 3133686 3041035 2950958 2866596 2791115 2726949 2675454 2637167 2612234 2600694
50494B600694J777J4542K5738L4120L8713L9009L4858K6468J4392p55j8474l7860
$$ 2600694 2602471 2617013 2642751 2676871 2715584 2754593 2789451 2815919 2830311 2829556 2811082 2773222
50482B773222n7147p4376q8682j00315j09233j14390j14904j11473j05900r9433
$$ 2773222 2716075 2641699 2553017 2452702 2343469 2229079 2114175 2002702 1896802 1797369
50472A797369r2144q3887p5159o6829n9413n2882m7019m1746l7112l3086k9368
$$ 1797369 1705225 1621338 1546179 1479350 1419937 1367055 1320036 1278290 1241178 1208092 1178724
50461A178724k5568k1682j8222j5630j3625j1351q207m367m98K814N345P245Q894
$$ 1178724 1153156 1131474 1113252 1097622 1083997 1072646 1064439 1060072 1059574 1062388 1067733 1074978 1083872
50448A083872J0678J2714J4729J6244J6952J6995J6855J6854J6771J6101J4674
$$ 1083872 1094550 1107264 1121993 1138237 1155189 1172184 1189039 1205893 1222664 1238765 1253439
50437A253439J2759J0662Q521O616N402M892M438L498K379J787J910K417L149
$$ 1253439 1266198 1276860 1285381 1291997 1297399 1302291 1306729 1310227 1312606 1314393 1316303 1318720 1321869
50424A321869M209N547P040Q937J1550J4607J7607K0826K5051L0164L4930L8612
$$ 1321869 1326078 1331625 1338665 1347602 1359152 1373759 1391366 1412192 1437243 1467407 1502337 1540949
50412A540949M1943M5781M9657N2512N4263N5545N6265N5531N3025M9458M5462
$$ 1540949 1582892 1628673 1678330 1730842 1785105 1840650 1896915 1952446 2005471 2054929 2100391
50401B100391M0833L5097K8176K0182J1189J457q539j8618k8876l8989m7989n5096
$$ 2100391 2141224 2176321 2204497 2224679 2235868 2237325 2228786 2210168 2181292 2142303 2094314 2039218
50389B039218o0283o3703o5045o3925o0608n5801m9931m3045l5243k6876j8321
$$ 2039218 1978935 1915232 1850187 1786262 1725654 1669853 1619922 1576877 1541634 1514758 1496437
50378A496437r872j819N427J1260J4986J6381J6090J4928J2637Q003N47q531j7550
$$ 1496437 1486565 1484746 1490173 1501433 1516419 1532800 1548890 1563818 1576455 1584458 1585005 1576474 1558924
50365A558924k5853l3454l9892m4449m7178m8669m8875m7254m4080m0626l7690
$$ 1558924 1533071 1499617 1459725 1415276 1368098 1319429 1270554 1223300 1179220 1138594 1100904
50354A100904l4890l1644k8106k4613k1021j7115j3120r382o015l268j620j068
$$ 1100904 1066014 1034370 1006264 981651 960630 943515 930395 921013 914998 911730 910110 909042
50342I09042r81j122k127m260o459p530p687p825p759o501m121j907m50J077L315
$$ 909042 908061 906939 904812 900552 894093 886563 878876 871051 863292 856791 852670 850763 850313 851390 854705
50327H54705N504O672P105P724Q654R357R755J0223J0631J0329R179P877P007
$$ 854705 860209 866881 873986 881710 890364 899721 909476 919699 930330 940659 949838 957715 964722
50314I64722O360N424M125K802J777J241J338K051L076M005M622M988N262N585
$$ 964722 971082 976506 980631 983433 985210 986451 987789 989840 992916 996921 1001543 1006531 1011793 1017378
50300A017378O083O949Q385J0435J2803J4927J6410J7392J8579K0791K4280K8224
$$ 1017378 1023461 1030410 1038795 1049230 1062033 1076960 1093370 1110762 1129341 1150132 1174412 1202636
50288A202636L0943L1057K8647K4903K0452J4366N450n634j6133k3218k5875k4914
$$ 1202636 1233579 1264636 1293283 1318186 1338638 1353004 1358454 1352820 1336687 1313469 1287594 1262680
50276A262680k1845j8120j4867j2509j0607q466o039l923k568j870j597j800k470
$$ 1262680 1240835 1222715 1207848 1195339 1184732 1176266 1170227 1166304 1163736 1161866 1160269 1158469 1155999
50263A155999l126l104k194p09J062L134N546Q088J0456J2497J4127J5230J5912
$$ 1155999 1152873 1149769 1147575 1146866 1147928 1151062 1156608 1164696 1175152 1187649 1201776 1217006 1232918
50250A232918J6658J7816J8980J9365J8896J8522J9115K0398K1312K1195K0125
$$ 1232918 1249576 1267392 1286372 1305737 1324633 1343155 1362270 1382668 1403980 1425175 1445300
50239A445300J8292J5595J1924P351J953m142j0313j5530j9219k1712k3577k4710
$$ 1445300 1463592 1479187 1491111 1498462 1500415 1496273 1485960 1470430 1451211 1429499 1405922 1381212
50227A381212k4571k3143k1323k0311k0762k2417k4374k5878k7062k8681l0920
$$ 1381212 1356641 1333498 1312175 1291864 1271102 1248685 1224311 1198433 1171371 1142690 1111770
50216A111770l2779l3067l1622k9182k6281k3071k0049j8002j6936j5802j3804
$$ 1111770 1078991 1045924 1014302 985120 958839 935768 915719 897717 880781 864979 851175
50205H51175j1387r516q403p587o858o438o329o134n626n059m758m713m656m351
$$ 851175 839788 830272 821869 814282 807424 800986 794657 788523 782897 777838 773080 768367 763711 759360
50191G59360l846l527l862m822n683n728n024m248l881l933m338n046n730n862
$$ 759360 755514 751987 748125 743303 737620 731892 726868 722620 718739 714806 710468 705422 699692 693830
50177F93830n372m820m690m761m390l258j717m99r0j92J18J330K693L030K383
$$ 693830 688458 683638 678948 674187 669797 666539 664822 664323 664233 664041 664159 665489 668182 671212 673595
50162F73595K090K987M237M643M462M953O373P503P385O676O748P964R434J0218
$$ 673595 675685 678672 682909 687552 692014 696967 703340 710843 718228 724904 731652 739616 749050 759268
50148G59268J0234R993R903J0090J0648J1848J3910J6682J9750K2889K6285L0123
$$ 759268 769502 779495 789398 799488 810136 821984 835894 852576 872326 895215 921500 951623
50136I51623L4158L7847M0881M3211M4709M5147M4595M3469M2136M0756L9607
$$ 951623 985781 1023628 1064509 1107720 1152429 1197576 1242171 1285640 1327776 1368532 1408139
50125A408139L9016L8654L7350L4062K8826K2320J4811O146l356j2723k1224k8771
$$ 1408139 1447155 1485809 1523159 1557221 1586047 1608367 1623178 1629324 1625968 1613245 1592021 1563250
50113A563250l5190l9762m2025m2630m2711m2562m1566l9367l6464l3547l0816
$$ 1563250 1528060 1488298 1446273 1403643 1360932 1318370 1276804 1237437 1200973 1167426 1136610
50102A136610k8218k5911k4045k2417k0801j9421j8670j8270j7203j4681j0995
$$ 1136610 1108392 1082481 1058436 1036019 1015218 995797 977127 958857 941654 926973 915978
50091I15978p305m519k569p19J527L901N763O848P477Q100Q824R449R753R626
$$ 915978 908673 904154 901585 900866 902393 906294 912057 918905 926382 934482 943306 952755 962508 972134
50077I72134R132Q576Q308Q259P884O799N345M205L502K661J194o38k107k804
$$ 972134 981266 989842 998150 1006409 1014293 1021092 1026437 1030642 1034144 1036805 1037999 1037361 1035254 1032450
50063A032450l041l497m538n856o825p235p493p987q432q139o829m901l020j656
$$ 1032450 1029409 1025912 1021374 1015518 1008693 1001458 993965 985978 977546 969407 962578 957677 954657 953001
50049I53001r43n76J15J637L799N915P557Q824R937J0987J2090J3369J4670J5620
$$ 953001 952058 951482 951597 953234 957033 962948 970505 979329 989266 1000253 1012343 1025712 1040382 1056002
50035A056002J6115J6369J6400J5930J4900J3602J2097J0074P647N740N128N419
$$ 1056002 1072117 1088486 1104886 1120816 1135716 1149318 1161415 1171489 1179136 1184876 1190004 1195423
50023A195423N572N146M576M425M881N862P100Q134Q650Q804Q835Q590P894P232
$$ 1195423 1200995 1206141 1210717 1215142 1220023 1225885 1232985 1241119 1249769 1258573 1267408 1275998 1283892 1291124
50009A291124P387Q359R283R530R372R319R327Q899P601N142J305l816r701j5784
$$ 1291124 1298511 1306870 1316153 1325683 1335055 1344374 1353701 1362600 1370201 1375343 1376648 1372832 1363131 1347347
49995A347347k1803k7521l2325l5444l6603l6321l5476l4661l3859l2716l1104
$$ 1347347 1325544 1298023 1265698 1230254 1193651 1157330 1121854 1087193 1053334 1020618 989514
49984I89514k9295k7569k5806k3794k1701j9872j8223j6377j4402j2842j1888
$$ 989514 960219 932650 906844 883050 861349 841477 823254 806877 792475 779633 767745
49973G67745j1033r852q627p708o822n610m515m311m825m932l970k549j585j080
$$ 767745 756712 746860 738233 730525 723703 718093 713578 709267 704442 699510 695540 692991 691406 690326
49959F90326l53R09K414L918N542P230Q376Q383P424O338N726N343M521L084J567
$$ 690326 689973 690882 693296 697214 702756 709986 718362 726745 734169 740507 746233 751576 756097 759181 760748
49944G60748N86Q3o11k009l922n730o985p746q425r456j1038j2871j4128j4040
$$ 760748 761334 761417 760806 758797 754875 749145 742160 734414 725989 716533 705495 692624 678496 664456
49930F64456j2709j1154j0276r892r102p495n567m015k948k024r83J96J423K458
$$ 664456 651747 640593 630317 620425 611323 603828 598261 594246 591298 589274 588291 588487 589910 592368
49916E92368K922K674K105J881K411L652N304O905P998Q437Q619R122J0128J1237
$$ 592368 595290 597964 600069 601950 604361 608013 613317 620222 628220 636657 645276 654398 664526 675763
49902F75763J1788J1300R796P882O343N381M458L020J155p78k756m867o799q183
$$ 675763 687551 698851 708647 716529 722872 728253 732711 735731 736886 736108 733352 728485 721686 713503
49888G13503r293j0672j2052j2469j1674j0572r922r362q362p432p432q063q064
$$ 713503 704210 693538 681486 669017 657343 646771 636849 627487 619125 611693 604261 596198 588134
49875E88134o936n537m708m122l035j583n75k44R0J006K306L553M800O344Q050
$$ 588134 581198 575661 570953 566831 563796 562213 561638 561394 561484 562490 564796 568349 573149 579493 587543
49860E87543R483J0559J1539J2367J2565J1964J1014J0081Q878P101N143L647
$$ 587543 597026 607585 619124 631491 644056 656020 667034 677115 685993 693094 698237 701884
$$ [...]
##END NTUPLES=NMR SPECTRUM
##END=
