##TITLE=AC1753_VAR00025_9319603_B6uBSjifrn
##JCAMPDX= 6.0         $$ Bruker NMR JCAMP-DX V2.0
##DATA TYPE= NMR SPECTRUM
##DATA CLASS= NTUPLES
##ORIGIN= BRUKER
##OWNER= Administrator
$$ 1.72 TOPSPIN		Version 2.1
$$ 2015-08-11 22:18:29.835 -0700  Administrator@X
$$ Compression mode = diff/dup
##.OBSERVE FREQUENCY= 400.02188249412
##.OBSERVE NUCLEUS= ^1H
##.ACQUISITION MODE= SIMULTANEOUS (DQD)
##.ACQUISITION SCHEME= undefined
##.AVERAGES= 8
##.DIGITISER RES= 22
##SPECTROMETER/DATA SYSTEM= spect
##.PULSE SEQUENCE= zg30
##.SOLVENT NAME= COFFEE_meoh
##.SHIFT REFERENCE= INTERNAL, COFFEE_meoh, 1, 14.98509
##AUDIT TRAIL= $$ (NUMBER, WHEN, WHO, WHERE, PROCESS, VERSION, WHAT)
$$ ##TITLE= Audit trail, TOPSPIN		Version 2.1
$$ ##JCAMPDX= 5.01
$$ ##ORIGIN= Bruker BioSpin GmbH
$$ ##OWNER= Administrator
$$ $$ E:\/data/COFFEE/nmr/AC1753_VAR00025_9319603_B6uBSjifrn/10/pdata/1/auditp.txt
$$ ##AUDIT TRAIL=  $$ (NUMBER, WHEN, WHO, WHERE, PROCESS, VERSION, WHAT)
(   1,<2015-08-11 22:18:22.539 -0700>,<Administrator>,<X>,<go>,<TOPSPIN 2.1>,
      <created by zg
	started at 2015-08-11 22:17:16.742 -0700,
	POWCHK enabled, PULCHK disabled,
       configuration hash MD5:
       21 0F 79 D6 B3 7B B4 F6 88 20 88 DB 03 48 BD 9F
       data hash MD5: 64K
       0F 5F B4 B1 C4 F1 37 2A 64 9A 94 66 35 EF A9 4D>)
(   2,<2015-08-11 22:18:25.695 -0700>,<Administrator>,<X>,<proc1d>,<TOPSPIN 2.1>,
      <Start of raw data processing
       efp LB = 0 FT_mod = 6 PKNL = 1 PHC0 = 0 PHC1 = 0 SI = 32K 
       data hash MD5: 32K
       AA 4A 5F CC B4 B2 93 75 23 B2 F4 68 AC 5C DB 92>)
(   3,<2015-08-11 22:18:25.992 -0700>,<Administrator>,<X>,<proc1d>,<TOPSPIN 2.1>,
      <pk PHC0 = 87.03369 PHC1 = 0 
       data hash MD5: 32K
       CB A1 71 35 B9 71 93 47 D3 BC 1F C4 F6 F5 49 5D>)
(   4,<2015-08-11 22:18:26.101 -0700>,<Administrator>,<X>,<proc1d>,<TOPSPIN 2.1>,
      <abs ABSG = 1 
       data hash MD5: 32K
       2C 1E CA 6E 5F 34 BE 88 E1 C9 64 6A 11 0D 61 1D>)
(   5,<2015-08-11 22:18:26.164 -0700>,<Administrator>,<X>,<proc1d>,<TOPSPIN 2.1>,
      <abs ABSG = 2 
       data hash MD5: 32K
       76 70 84 E1 2E 09 21 B0 C8 D6 7D 15 F8 AA 5D 4A>)
(   6,<2015-08-11 22:18:26.226 -0700>,<Administrator>,<X>,<proc1d>,<TOPSPIN 2.1>,
      <abs ABSG = 3 
       data hash MD5: 32K
       5D 51 4F BC 71 7C B8 9C B3 06 EB 6E 53 88 21 DD>)
(   7,<2015-08-11 22:18:26.289 -0700>,<Administrator>,<X>,<proc1d>,<TOPSPIN 2.1>,
      <abs ABSG = 4 
       data hash MD5: 32K
       7D 15 B5 09 26 37 68 36 B2 9C 8A C6 88 D1 87 A2>)
(   8,<2015-08-11 22:18:26.351 -0700>,<Administrator>,<X>,<proc1d>,<TOPSPIN 2.1>,
      <abs ABSG = 5 
       data hash MD5: 32K
       2E 3F 37 06 5A 29 9F 99 8A 57 D1 67 7E A4 3D 0B>)
$$ ##END=
$$ 
$$ $$ hash MD5
$$ $$ DC 23 46 06 5F 69 AD 7E 39 83 8E 63 2E 21 3D 3E
##$RELAX= 
##$RELAX= 
##$RELAX= 
##$RELAX= 
##$RELAX= 
##$RELAX= 
##$RELAX= 
$$ Bruker specific parameters
$$ --------------------------
##$DU= <E:\>
##$EXPNO= 10
##$NAME= <AC1753_VAR00025_9319603_B6uBSjifrn>
$$ [...]
##$TP= (0..7)
150 150 150 150 150 150 150 150
##$TP07= 0
##$TPNAME0= <>
##$TPNAME1= <>
##$TPNAME2= <>
##$TPNAME3= <>
##$TPNAME4= <>
##$TPNAME5= <>
##$TPNAME6= <>
##$TPNAME7= <>
##$TPOAL= (0..7)
0.5 0.5 0.5 0.5 0.5 0.5 0.5 0.5
##$TPOFFS= (0..7)
0 0 0 0 0 0 0 0
##$TUNHIN= 0
##$TUNHOUT= 0
##$TUNXOUT= 0
##$USERA1= <user>
##$USERA2= <user>
##$USERA3= <user>
##$USERA4= <user>
##$USERA5= <user>
##$V9= 5
##$VALIST= <valist>
##$VCLIST= <CCCCCCCCCCCCCCC>
##$VD= 0
##$VDLIST= <DDDDDDDDDDDDDDD>
##$VPLIST= <PPPPPPPPPPPPPPP>
##$VTLIST= <TTTTTTTTTTTTTTT>
##$WBST= 2048
##$WBSW= 25
##$XGAIN= (0..3)
0 0 0 0
##$XL= 0
##$YL= 0
##$YMAX_a= 587837
##$YMIN_a= -517953
##$ZGOPTNS= <>
##$ZL1= 120
##$ZL2= 120
##$ZL3= 120
##$ZL4= 120
##$ABSF1= 14.98509
##$ABSF2= -5.573092
##$ABSG= 5
##$ABSL= 3
##$ALPHA= 0
##$AQORDER= 0
##$ASSFAC= 0
##$ASSFACI= 0
##$ASSFACX= 0
##$ASSWID= 0
##$AUNMP= <proc_prof1d_extract_pilot.lims>
##$AXLEFT= 0
##$AXNAME= <>
##$AXNUC= <1H>
##$AXRIGHT= 0
##$AXTYPE= 0
##$AXUNIT= <>
##$AZFE= 0.1
##$AZFW= 0.1
##$BCFW= 0
##$BC_mod= 0
##$BYTORDP= 0
##$COROFFS= 0
##$CY= 15
##$DATMOD= 1
##$DC= 0
##$DFILT= <>
##$DTYPP= 0
##$F1P= 0
##$F2P= 0
##$FCOR= 0.5
##$FTSIZE= 32768
##$FT_mod= 6
##$GAMMA= 0
##$GB= 0
##$INTBC= 1
##$INTSCL= 1
##$ISEN= 128
##$LB= 0
##$LEV0= 0
##$LPBIN= 0
##$MAXI= 10000
##$MC2= 0
##$MEAN= 0
##$ME_mod= 0
##$MI= 0
##$NCOEF= 0
##$NC_proc= -8
##$NLEV= 6
##$NOISF1= 0
##$NOISF2= 0
##$NSP= 0
##$NTH_PI= 0
##$NZP= 0
##$OFFSET= 14.98509
##$PC= 1
##$PHC0= 87.03369
##$PHC1= 0
##$PH_mod= 1
##$PKNL= yes
##$PPARMOD= 0
##$PPDIAG= 0
##$PPIPTYP= 0
##$PPMPNUM= 2147483647
##$PPRESOL= 1
##$PSCAL= 4
##$PSIGN= 0
##$PYNMP= <proc.py>
##$REVERSE= no
##$SF= 400.02
##$SI= 32768
##$SIGF1= 0
##$SIGF2= 0
##$SINO= 400
##$SIOLD= 32768
##$SPECTYP= <>
##$SREGLST= <1H.CDCl3>
##$SSB= 0
##$STSI= 32768
##$STSR= 0
##$SW_p= 8223.68421052631
##$SYMM= 0
##$S_DEV= 0
##$TDeff= 65536
##$TDoff= 0
##$TI= <>
##$TILT= no
##$TM1= 0
##$TM2= 0
##$TOPLEV= 0
##$USERP1= <user>
##$USERP2= <user>
##$USERP3= <user>
##$USERP4= <user>
##$USERP5= <user>
##$WDW= 1
##$XDIM= 32768
##$YMAX_p= 446351134
##$YMIN_p= -718517
##$CURPLOT= <Network HP LaserJet P1505>
##$CURPRIN= <$Network HP LaserJet P1505>
##$DFORMAT= <normdp>
##$LAYOUT= <+/1D_H.xwp>
##$LFORMAT= <normlp>
##$PFORMAT= <normpl>
##$SURQMSG= 1
$$ End of Bruker specific parameters
$$ ---------------------------------
##NTUPLES= NMR SPECTRUM
##VAR_NAME=  FREQUENCY,     SPECTRUM/REAL,   SPECTRUM/IMAG
##SYMBOL=    X,             R,               I
##VAR_TYPE=  INDEPENDENT,   DEPENDENT,       DEPENDENT
##VAR_FORM=  AFFN,          ASDF,            ASDF
##VAR_DIM=   32768,         32768,           32768
##UNITS=     HZ,            ARBITRARY UNITS, ARBITRARY UNITS
##FACTOR=    0.250966925370066, 1,           1
##FIRST=     8223.43324360094, -72598,       117466
##LAST=      0,             121812,          -2017
##MIN=       0,             -718517,         0
##MAX=       8223.43324360094, 446351134,    0
$$ Real data points
##PAGE= N=1
##DATA TABLE= (X++(R..R)), XYDATA
$$ [...]
19575B68609b9060A01824h540A75575h1911I7027C2413c08997D1069b62472Q9746
$$ 268609 -29060 101824 -8540 175575 -81911 97027 32413 -308997 41069 -262472 -172726
19564a72726k42947a71311A62825b08138O1512q315J0639e9916I3281a63818n9417
$$ -172726 -415673 -171311 162825 -208138 -146626 -154941 -144302 -59916 93281 -163818 -223235
19553b23235R7324J2762J9484r7533A1522a2008A55c8773B6214d6598A98559H1230
$$ -223235 -125911 -113149 -93665 -191198 11522 -12008 155 -38773 26214 -46598 198559 81230
19540c44587d186j90326H0812a20398A39095b75481n534m9923J54422L2770A36764
$$ -344587 -4186 -194512 80812 -120398 139095 -275481 -281015 -330938 -176516 -143746 136764
19528a00783a3240G793J1877M3901f9086A40963m6359g3730c3469F0361h6274
$$ -100783 -13240 7793 19670 63571 -69086 140963 94604 -73730 -33469 60361 -86274
19516a5065j94011B27277a36967D634d0249p9584e1904J9854l79260A21106c95458
$$ -15065 -209076 227277 -136967 4634 -40249 -119833 -51904 -32050 -411310 121106 -395458
19504g4135r1008B04828a88114l31150g186B44204a11470A46349g9649B36875
$$ -74135 -165143 204828 -188114 -519264 -7186 244204 -111470 146349 -79649 236875
19493i1091I0281l5048a6649l16898A36526m5409e065B90898A1409c52092a11173
$$ -91091 90281 55233 -16649 -333547 136526 91117 -5065 290898 11409 -352092 -111173
19481b19735Q6464c8238o1516D7486c01457E6850c7421k86742G8068J17832k1405
$$ -219735 -133271 -38238 -99754 47486 -301457 56850 -37421 -324163 78068 195900 174495
19470A74495a9061j6044B68970d0094q4727b8174o7962B3007b23020d4864j79460
$$ 174495 -19061 -35105 268970 -40094 -124821 -28174 -96136 23007 -223020 -44864 -224324
19459b24324A47879f4468D7992b29879O6508B7182K03116a84282h1868A04202
$$ -224324 147879 -64468 47992 -229879 -163371 27182 230298 -184282 -81868 104202
19448i3043k25031B8639a68359I7726a45775l2138r2361K719A68110b03355K4295
$$ -93043 -318074 28639 -168359 97726 -145775 -177913 -270274 -267555 168110 -203355 -179060
19437a79060p1723K5014b7954C1582p352N39a05540j19889A47418J36042I8911
$$ -179060 -250783 -225769 -27954 31582 24230 24769 -105540 -225429 147418 283460 98911
19425C58209o4487b12812A3640a96316A75397P082b12163j71493L1707B58940
$$ 358209 293722 -212812 13640 -196316 175397 182479 -212163 -383656 -351949 258940
19414E6957f6923J8514C22235A23117d8192C6544i6791p381l4934C21901c2531
$$ 56957 -66923 -48409 322235 123117 -48192 36544 -96791 -104172 -139106 321901 -32531
19402a06298B04151b88214J40586o7556A32755o2896i8278k0058c7099B21456
$$ -106298 204151 -288214 -147628 -215184 132755 69859 -98278 -118336 -37099 221456
19391a40165j59079a08264B54929a53160k81507a87016e5675G3380E550J03396
$$ -140165 -299244 -108264 254929 -153160 -434667 -187016 -55675 73380 5550 108946
19381A08946a9949j42371k31494l3039A42542a28546j17671g0280j58233J0695
$$ 108946 -19949 -162320 -393814 -426853 142542 -128546 -246217 -70280 -228513 -217818
19371b17818A45446e1178j0164k8784B32920p6116b89665A94056c32506f3886
$$ -217818 145446 -51178 -61342 -90126 232920 156804 -289665 194056 -332506 -63886
19360a01164j73700A12573J31216a56216j0603A18012a17330r011l51193b35443
$$ -101164 -274864 112573 243789 -156216 -166819 118012 -117330 -126341 -477534 -235443
19349F8144b16147k2714h059p0485F9614A1808J62956b72012J08867m1377D2766
$$ 68144 -216147 -238861 -8059 -78544 69614 11808 174764 -272012 -163145 -204522 42766
19337A91160c5694l6972o2829G7986b79967j50336H0722a38178b8771E8137P8558
$$ 191160 -35694 -72666 -135495 77986 -279967 -430303 80722 -138178 -28771 58137 136695
19326A36695A0440K5343b15232C38374a09527k3563d785B7310e2425l51635a83241
$$ 136695 10440 35783 -215232 338374 -109527 -133090 -4785 27310 -52425 -404060 -183241
19314f8755K5585o1744K2491m5196K4685a7157k191l57294K6201F2744j6153c89606
$$ -68755 -43170 -104914 -82423 -127619 -102934 -17157 -19348 -376642 -350441 62744 46591 -389606
19301A86885I1349J47883n0412f264l39514o2110H4986i3768M0735D471R2470
$$ 186885 91349 239232 188820 -6264 -345778 -407888 84986 -93768 -53033 4471 96941
19290I6941i7610k8815q0694h8576L5524A40730a22143C3975a27790j5783l49052
$$ 96941 -97610 -126425 -207119 -88576 -53052 140730 -122143 33975 -127790 -143573 -492625
19279d92625d6650m5998m3343l61082A21745a9676j51962C09035c7947k74912
$$ -492625 -46650 -92648 -135991 -497073 121745 -19676 -171638 309035 -37947 -312859
19269c12859d9866C7419R2351h4856K3235j54379n6466a02262R579A51443c0312
$$ -312859 -49866 37419 129770 -84856 -61621 -216000 -272466 -102262 -92683 151443 -30312
19257a18892n5924A17257a38861J1900A15515b27541i7527F9202k9328C040R2630
$$ -118892 -174816 117257 -138861 -126961 115515 -227541 -97527 69202 39874 3040 95670
19246I5670K8196b55245N6523I547J99473i3512A01330a2558j03196j69191h6394
$$ 95670 123866 -255245 -198722 9547 209020 -93512 101330 -12558 -115754 -284945 -86394
19234d92442B22226K83940G6505b04372R4528B74416d07413a16777e1552j54380
$$ -492442 222226 506166 76505 -204372 -109844 274416 -407413 -116777 -51552 -205932
19224b05932F6932b96796d9909a0397A10392b11618C59942a61981N6680H1346
$$ -205932 66932 -296796 -49909 -10397 110392 -211618 359942 -161981 -105301 81346
19213B31491a41140A97535G6127b579j82667J9067j30055H0287b27663e9817L475
$$ 231491 -141140 197535 76127 -2579 -185246 -166179 -296234 80287 -227663 -59817 -56342
19202e6342k8796j2803k47789p1367d4381A97244h7483F7266b22983d0306p9050
$$ -56342 -85138 -97941 -345730 -417097 -44381 197244 -87483 67266 -222983 -40306 -119356
19191a19356j62750E3979J26361a69698l4029D7363a20859r4424b6604k2531E1823
$$ -119356 -282106 53979 180340 -169698 -203727 47363 -120859 -215283 -26604 -49135 51823
19179c45777J39815n2965c0236l54300I6021a05504d9266A95526A3249f192k02617
$$ -345777 -205962 -258927 -30236 -384536 96021 -105504 -49266 195526 13249 -6192 -208809
19168b08809o0884P2577A7693i8660j45875f2022j06770A78941o6289r713A3236
$$ -208809 -269693 -197116 17693 -98660 -244535 -62022 -168792 178941 112652 102939 13236
19156a03233p1283P6661r6841R1768b9046A53209L963b76147j99254d4095k25963
$$ -103233 -174516 -97855 -194696 -102928 -29046 153209 157172 -276147 -475401 -44095 -270058
19145b70058D7446G085g5171A01208P0766J5582c19104B50950H2907d1263H7202
$$ -270058 47446 7085 -75171 101208 171974 187556 -319104 250950 82907 -41263 87202
19133a47906M5558n5955c989n530k49818Q0246o4896B3723a44839d0604j88729
$$ -147906 -102348 -158303 -3989 -9519 -259337 -179091 -243987 23723 -144839 -40604 -229333
19122b29333A46832a3020j51367k90135H4248b05020D1841b58462a19360b4568
$$ -229333 146832 -13020 -164387 -454522 84248 -205020 41841 -258462 -119360 -24568
19111G1935J37122f3267H6754e5860B14780i183B1361J71858a17529I5355J5054
$$ 71935 209057 -63267 86754 -55860 214780 -9183 21361 193219 -117529 95355 110409
19100A10409a6927N391A18071B90a61142o0545c1128E6376c822A59628c65002
$$ 110409 -16927 -11536 118071 290 -161142 -221687 -31128 56376 -3822 159628 -365002
19088b5931l32009d8355A00822b07203f0369J9462B1439a46761A03255g4322n555
$$ -25931 -357940 -48355 100822 -207203 -60369 -40907 21439 -146761 103255 -74322 -79877
19077g9877K0161F0112J24337l5658a58507B800g4542A65119b82343A47464P960
$$ -79877 -59716 60112 184449 148791 -158507 2800 -74542 165119 -282343 147464 155424
19066A55424a43771N2458L1352k7901k17821f0199C8714b4790j1423A12126b70368
$$ 155424 -143771 -91313 -59961 -87862 -305683 -60199 38714 -24790 -36213 112126 -270368
19054E7J97286r2465c095j55996H297J27825q962f5357K7707A5445a34747A42954
$$ 57 197343 104878 -3095 -159091 8297 136122 127160 -65357 -37650 15445 -134747 142954
19041i1372j14834L21P7381d983A61563P0719p4251C6724F210d1998A80604b58700
$$ -91372 -206206 -205885 -128504 -4983 161563 232282 158031 36724 6210 -41998 180604 -258700
19028d2918a2004H2168J42127a87551k03062a37658R602k8228N7214j50350A15285
$$ -42918 -12004 82168 224295 -187551 -390613 -137658 -128056 -156284 -99070 -249420 115285
19016a18980M2356k0066K1117c4848j24468E37186B59384h1199l2845l5244A48589
$$ -118980 -76624 -96690 -75573 -34848 -159316 537186 259384 -81199 -114044 -149288 148589
19004a90803m314A58062a11946G957a21185c3819A39838c99362J69776n6829A42937
$$ -190803 -195117 158062 -111946 7957 -121185 -33819 139838 -399362 -229586 -286415 142937
18992a24650b2377m6797A8273J04436b6851k32429Q1531j4678h2948N837D5870
$$ -124650 -22377 -69174 18273 122709 -26851 -259280 -177749 -192427 -82948 -77111 45870
18980b8962A01538J37557b22537O5907d4910l21515f8073A43092a64779H3709
$$ -28962 101538 239095 -222537 -156630 -44910 -366425 -68073 143092 -164779 83709
18969i2705A68965n4348a0091l15037H2627e62776a05573D1331N3393b50702B76175
$$ -92705 168965 114617 -10091 -325128 82627 -562776 -105573 41331 94724 -250702 276175
18957a66677d0007l04041M3766N2488A71737a76857d9174j78921f3978C76507
$$ -166677 -40007 -344048 -300282 -247794 171737 -176857 -49174 -228095 -63978 376507
18946A36269c07649i7684C8306J9422a85350E0362P7447b59j94201c6139H0923
$$ 136269 -307649 -97684 38306 57728 -185350 50362 127809 -259 -194460 -36139 80923
18934E4476B0604M6537A9789b12471r8417I1891C9808a03635A92480b43112a10499
$$ 54476 20604 67141 19789 -212471 -310888 91891 39808 -103635 192480 -243112 -110499
18922A34544F4806B9386a11402p1510k1236B38066g3905I1406a42144F9671a32931
$$ 134544 64806 29386 -111402 -182912 -204148 238066 -73905 91406 -142144 69671 -132931
18910B01865H8414a50014k0274N2372b0640j1893k1201B32941M0688H9749b76445
$$ 201865 88414 -150014 -170288 -117916 -20640 -32533 -53734 232941 273629 89749 -276445
18898d8017A93706b45644A48390o1594m91R3857F8010a84842F5337b51657A97066
$$ -48017 193706 -245644 148390 86796 86305 180162 68010 -184842 65337 -251657 197066
18886H2470c27476C548K2112L517f0700K5736G769b45869Q4358A13439b04879
$$ 82470 -327476 3548 25660 29177 -60700 -34964 7769 -245869 -161511 113439 -204879
18874h4998o5702C54704j42092o6189a19814j26265B3462J8227a8297B9864h6758
$$ -84998 -150700 354704 212612 146423 -119814 -246079 23462 41689 -18297 29864 -86758
18862C3466b78571J35967M8228F2621c94664e2813l8065A59617a32652j00839
$$ 33466 -278571 -142604 -94376 62621 -394664 -52813 -90878 159617 -132652 -233491
18852b33491h6972C48846e2771R325A66737C1103b46746A963a00542B4368b33329
$$ -233491 -86972 348846 -52771 -43446 166737 31103 -246746 1963 -100542 24368 -233329
18840A04082b62643H9513B7263O8828J7736e8861B66953k9933i2638c14k25623
$$ 104082 -262643 89513 27263 96091 113827 -58861 266953 237020 -92638 -314 -225937
18829b25937I7176B1718K94207c4489j05238B01287b24805H2981a05193B35890
$$ -225937 97176 21718 315925 -34489 -139727 201287 -224805 82981 -105193 235890
18818C89127A91881o9347d4969B39736b32569B37260F6504J52538J4503j01406
$$ 389127 191881 122534 -44969 239736 -232569 237260 66504 219042 233545 132139
18808A32139a3475A14754J1950E6916O2685g0382A9533b99368c9812A6711e9805
$$ 132139 -13475 114754 126704 56916 119601 -70382 19533 -299368 -39812 16711 -59805
18796g0540k29469a41268C21873b47634A14192J21875c5628n7785j62371K5507
$$ -70540 -300009 -141268 321873 -247634 114192 236067 -35628 -93413 -255784 -230277
18786b30277N883A78739c20722a737j49005C07998a94774Q3669j19862h8067c1674
$$ -230277 -224394 178739 -320722 -1737 -150742 307998 -194774 -111105 -230967 -88067 -31674
18774g3956j06569P7439B1767f5600H5897d7274n3957k92296R6083J07704E0240
$$ -73956 -180525 -103086 21767 -65600 85897 -47274 -101231 -393527 -297444 -189740 50240
18762b62695C55624h2754r5609f3752O219k5165L810j58480B15041a9505A96460
$$ -262695 355624 -82754 -178363 -63752 -57533 -82698 -78888 -237368 215041 -19505 196460
18750C83248c1776j42323H2903j0628b74394O152e2688J7504q3091K9530A5616
$$ 383248 -31776 -174099 82903 72275 -274394 -268242 -52688 -35184 -118275 -88745 15616
18738B5424h8979A34834b46472A41596a8940b598m63052A10406b20155P4244j29674
$$ 25424 -88979 134834 -246472 141596 -18940 -2598 -465650 110406 -220155 -145911 -275585
18727b75585E0798j3713a33981j10776N6379O2485g828m81368c9022G8107O79
$$ -275585 50798 37085 -133981 -244757 -188378 -125893 -7828 -489196 -39022 78107 78786
18716G8786b59017R2586D0054b60668p0597C04620a82283n5072G3177j0625J0173
$$ 78786 -259017 -166431 40054 -260668 -331265 304620 -182283 -237355 73177 62552 72725
18705G2725J47333q5563M3949a35131L2404l1028C6364a59658r4876O0425A02265
$$ 72725 220058 134495 178444 -135131 -102727 -133755 36364 -159658 -254534 -194109 102265
18693f9265A92321b11900L8735j22400C03527a06401k43595a47761B08813k2261
$$ -69265 192321 -211900 -173165 -295565 303527 -106401 -349996 -147761 208813 186552
18683A86552J8946b28228c4261A37902E6109B0539J04185c17272l4865H8320a08529
$$ 186552 205498 -228228 -34261 137902 56109 20539 124724 -317272 -352137 88320 -108529
18671H6863a94078q4182A32449e5586K5069A13646J9177c20580g8449k32097h5730
$$ 86863 -194078 -278260 132449 -55586 -30517 113646 132823 -320580 -78449 -310546 -85730
18659a09857H5860l5348P4599a74837P2828j29385A1444c014j02250C6907a1149
$$ -109857 85860 50512 125111 -174837 -102009 -231394 11444 -3014 -105264 36907 -11149
18647A01401h0648B58476a06880B61014a86124j3205b3542A90810E883c33124
$$ 101401 -80648 258476 -106880 261014 -186124 -199329 -23542 190810 5883 -333124
18636A83193E3702g9668B21401j02840b49287c3845E0357b0489k5068l5595K0528
$$ 183193 53702 -79668 221401 118561 -249287 -33845 50357 -20489 -45557 -81152 -60624
18625f0624l24041a40843A64408k4119D177K8840d2845A3364i2168j73722D475
$$ -60624 -384665 -140843 164408 140289 4177 33017 -42845 13364 -92168 -265890 4475
18613B09670F1586A874a13233I1200m1908i9828J9336q2313N6132G2833K32190
$$ 209670 61586 1874 -113233 91200 49292 -99828 -80492 -162805 -106673 72833 305023
18602C05023c5561A86490F6299a84609G6363R5468a23617j4719p5185A64593a74747
$$ 305023 -35561 186490 66299 -184609 76363 171831 -123617 -138336 -213521 164593 -174747
18590b21475G1020a86669i0502j06097b2536g141A75310a94427G9058d9668j99292
$$ -221475 71020 -186669 -90502 -196599 -22536 -7141 175310 -194427 79058 -49668 -248960
18579b48960b0936D5364J4532b915D4795i4350j20242N2898E755b4680C05114
$$ -248960 -20936 45364 59896 -2915 44795 -94350 -214592 -161694 5755 -24680 305114
18567a78058j05059B16993C5050J80026f6989j34054A46327b89525q5764B2986
$$ -178058 -283117 216993 35050 215076 -66989 -201043 146327 -289525 -375289 22986
18556a77536C154N3348b96434a84k1751C6239M5313K48998a95815M4922B0948
$$ -177536 3154 56502 -296434 -184 -21935 36239 81552 330550 -195815 -150893 20948
18544F7015c18020a27893j18024b7403j62699A2092L3725L3341L42113b1857D33473
$$ 67015 -318020 -127893 -245917 -27403 -190102 12092 45817 79158 421271 -21857 433473
18532A57494E9775a32346A5582B44P884e8295K3215j66911A07197c99417b8831
$$ 157494 59775 -132346 15582 244 8128 -58295 -35080 -201991 107197 -399417 -28831
18520A32280b83843A21617a77858n1959c7816D19048g0297j27610A16800C7979
$$ 132280 -283843 121617 -177858 -229817 -37816 419048 -70297 -197907 116800 37979
18509b74059A96363k5857b93505i0290A0381a45055d0228G6680b11559k6547a15936
$$ -274059 196363 170506 -293505 -90290 10381 -145055 -40228 76680 -211559 -238106 -115936
18497A81814a8457E892h7897B73335a8914n2610c1815l05661L8630C17433I1863
$$ 181814 -18457 5892 -87897 273335 -18914 -71524 -31815 -337476 -298846 317433 91863
18485A08537a51840j1076C13190B9108p503J2660j6706b9197M443I371C084O7473
$$ 108537 -151840 -162916 313190 29108 21605 34265 17559 -29197 -24754 9371 3084 70557
18473G0557j9212J97649d7538m3206A00765a77213c0563m2463A07972b09052O2645
$$ 70557 51345 248994 -47538 -90744 100765 -177213 -30563 -73026 107972 -209052 -146407
18462a46407B5042M2605h6524m8424B85322B2915a90475A6288d2702l33995A14337
$$ -146407 25042 67647 -86524 -134948 285322 22915 -190475 16288 -42702 -376697 114337
18450a01877l5152B88763a54144D73648D3194b91250J03148C6935a20875r1168
$$ -101877 -137029 288763 -154144 473648 43194 -291250 -188102 36935 -120875 -212043
18440b12043i4591n3772k03648e0654l10462f1244B12280C6263G872b0845C2328
$$ -212043 -94591 -148363 -352011 -50654 -361116 -61244 212280 36263 7872 -20845 32328
18428G8530J69928d43251g2443k81595J73915c5467k29036B9467K5059J90668
$$ 78530 248458 -443251 -72443 -354038 -180123 -35467 -264503 29467 54526 245194
18418B45194c17470h2621j38940P7084B42699f391o3067A5660f7384C5288J56339
$$ 245194 -317470 -82621 -221561 -144477 242699 -6391 -69458 15660 -67384 35288 191627
18407A91627k3227a73867b0345Q150G3604a28094F8563J26505a58986L3441j07881
$$ 191627 168400 -173867 -20345 -12195 73604 -128094 68563 195068 -158986 -125545 -233426
18396b33426a5369j16740j29499B12567E9359J83254a32598H3374a73096j92663
$$ -233426 -15369 -132109 -261608 212567 59359 242613 -132598 83374 -173096 -365759
18386c65759A78109a26395k04814d3688H416a80118C4815a7115E018J18878E1541
$$ -365759 178109 -126395 -331209 -43688 8416 -180118 34815 -17115 5018 123896 51541
18374D1434d1178j62954R9004b1981k30982G150M9157k6040d45312I3714a42302
$$ 41434 -41178 -204132 -105128 -21981 -252963 7150 56307 30267 -445312 93714 -142302
18362A40356a70202c8520l1452A10725C5351J20591b33446I5594A3150a80183
$$ 140356 -170202 -38520 -69972 110725 35351 155942 -233446 95594 13150 -180183
18351b24738j14166h1139n1544j04601F356b96406C08229b78709A20520c0876
$$ -224738 -338904 -81139 -132683 -237284 6356 -296406 308229 -278709 120520 -30876
18340a62848j1631e9983I3471A3340L4750J27562e1172k9584C4738b74886O9650
$$ -162848 -174479 -59983 93471 13340 48090 175652 -51172 -80756 34738 -274886 -205236
18329b05236R0739E8009e3456j88505b5922A64868b6908j00818C2720J09287K788
$$ -205236 -114497 58009 -53456 -241961 -25922 164868 -26908 -127726 32720 142007 144795
18318A44795c93485J88656B6315K23583D7611E919Q3410a21866C04613e8264j01029
$$ 144795 -393485 -204829 26315 249898 47611 5919 89329 -121866 304613 -58264 -159293
18307a59293A13304j8912O7678f6223A1902a25189K8339G8280b60252A61967c65908
$$ -159293 113304 94392 162070 -66223 11902 -125189 -96850 78280 -260252 161967 -365908
18295C9766M67141c61303A5370f0637j05542B86668b32381h2811j86536A41185
$$ 39766 506907 -361303 15370 -60637 -166179 286668 -232381 -82811 -269347 141185
18284f1886k01371A4722g4764j92265h5837k4878c8650q1363A39295h8804g01
$$ -61886 -263257 14722 -74764 -267029 -85837 -110715 -38650 -120013 139295 -88804 -701
18272G6556b99552c7294o0128L470B4106b37568L4229C63144b61905k2898D8728
$$ 76556 -299552 -37294 -97422 -93952 24106 -237568 -203339 363144 -261905 -284803 48728
18260c12629L0785o0280B5558d024m79527a00214A11005n0804a95388L3447a9421
$$ -312629 -281844 -342124 25558 -4024 -483551 -100214 111005 60201 -195388 -161941 -19421
18248h7062J7121E2564J74053I670M33078b99341k9324I9956c99275A12661B0083
$$ -87062 -69941 52564 226617 9670 442748 -299341 -328665 99956 -399275 112661 20083
18236b47383n7820D596O1737J12672i7574B22146N182E3244J10215d4718j75496
$$ -247383 -305203 4596 66333 179005 -97574 222146 227328 53244 163459 -44718 -220214
18225b20214H4640a0418j79436P4909A26084m6152e3511A87L861g1396J8966F410
$$ -220214 84640 -10418 -189854 -114945 126084 79932 -53511 187 4048 -71396 -52430 6410
18212G8951a76074e8878l0817j35657d9192J9718D4107b43269f2089j29084e8516
$$ 78951 -176074 -58878 -89695 -225352 -49192 -29474 44107 -243269 -62089 -191173 -58516
18200D33116i4751j56539F81a66618F4381d7848p3147e9181D1497i761q0628e893
$$ 433116 -94751 -251290 681 -166618 64381 -47848 -120995 -59181 41497 -9761 -90389 -5893
18187b32359H612P6831K66778F6560j7757o633K32644a75156H7565a08865B66168
$$ -232359 8612 85443 352221 66560 48803 42170 274814 -175156 87565 -108865 266168
18175a14442a9770A15481d47360g6304l8236j70355i5849c0652A47567O7796g4037
$$ -114442 -19770 115481 -447360 -76304 -114540 -284895 -95849 -30652 147567 215363 -74037
18163c9834A98595A5040b12813B1239a13669j5049j41606G1118i3687c5159q1121
$$ -39834 198595 15040 -212813 21239 -113669 -128718 -270324 71118 -93687 -35159 -116280
18152a16280F1211J0401Q7128o590b78106a5740j38112B8796J33577a73357g2856
$$ -116280 61211 71612 158740 152150 -278106 -15740 -153852 28796 162373 -173357 -72856
18140d40434E7799K10329b46745D1108I385b99499e7056j11252P6396A7204c91048
$$ -440434 57799 268128 -246745 41108 9385 -299499 -57056 -168308 -91912 17204 -391048
18128b18833A42947k6895K6448h9280A58441b0381j39097B00285i2999A44851
$$ -218833 142947 116052 142500 -89280 158441 -20381 -159478 200285 -92999 144851
18117c20617p9858e3534B538b09290r4529G4307K1766a19724l1111k34486D0480
$$ -320617 -400475 -53534 2538 -209290 -303819 74307 96073 -119724 -150835 -385321 40480
18105A79412a01391L266J7181A04522P1513a04946j7477J3020N4244J2568N56
$$ 179412 -101391 -98125 -80944 104522 176035 -104946 -122423 -109403 -55159 -42591 -42035
18094d2035j54097m3482A76236a51305A77490J94646c48512a45199I7509c54734
$$ -42035 -196132 -239614 176236 -151305 177490 372136 -348512 -145199 97509 -354734
18083b6251F8185a42522j47829B22330c9483G3458i6412L6178A84599h1997j08689
$$ -26251 68185 -142522 -290351 222330 -39483 73458 -96412 -60234 184599 -81997 -190686
18072a90686e644j26613p6310L7026A17416G251b2048j3043A11548J89727E5650
$$ -190686 -5644 -132257 -208567 -171541 117416 7251 -22048 -35091 111548 301275 55650
18060b3670C7671J7844J4688a18247p3723h6097A03492c37538a05367m3362K1098
$$ -23670 37671 55515 70203 -118247 -191970 -86097 103492 -337538 -105367 -148729 -127631
18049a27631M9610k25274c5834A92838b29311e0395l1090k18617a26736d3210
$$ -127631 -78021 -303295 -35834 192838 -229311 -50395 -81485 -300102 -126736 -43210
18038I0732L6891d14446A83751p4033a39765d0169j86403B28550F0930a54184
$$ 90732 127623 -414446 183751 109718 -139765 -40169 -226572 228550 60930 -154184
18027a94418g725D75770A79279K01113a63689d3686I5075c9509A43253c86342
$$ -194418 -7725 475770 179279 380392 -163689 -43686 95075 -39509 143253 -386342
18016a81124a5964A82227B1490a15957M4250H6419J14192c57788f2451A00160
$$ -181124 -15964 182227 21490 -115957 -71707 86419 200611 -357788 -62451 100160
18005A36061h2847B2450K2743a63791k40360J54486C6830b55655A17849C5554
$$ 136061 -82847 22450 45193 -163791 -404151 -249665 36830 -255655 117849 35554
17994A55704b54236e7508j24360D14449b54101a0835A74214K861a97795f9036
$$ 155704 -254236 -57508 -181868 414449 -254101 -10835 174214 177075 -197795 -69036
17983a60956E8182J46640D8274L30623B4507b1982C9966a69804g9032o4480j24202
$$ -160956 58182 204822 48274 378897 24507 -21982 39966 -169804 -79032 -143512 -267714
17972b67714g5526o2371F0549h8985B74868f2464b9282a3748j6989r1475A01364
$$ -267714 -75526 -137897 60549 -88985 274868 -62464 -29282 -13748 -30737 -122212 101364
17960A41679d45710a69941A5874a0528B5039b80375h7036A16869M3844n1840g5608
$$ 141679 -445710 -169941 15874 -10528 25039 -280375 -87036 116869 160713 108873 -75608
17948c80630a50544o24B70075I7317J18072A5201e0694A2770K337R1818d61479
$$ -380630 -150544 -151168 270075 97317 215389 15201 -50694 12770 15107 106925 -461479
17936A13781d61066c7178A41187n7879b4371A61052c224D53846j45817b5972k98011
$$ 113781 -461066 -37178 141187 83308 -24371 161052 -3224 453846 308029 -25972 -323983
17925c23983C1919R1809a9279n4181j20716D2290b69894a7057k65725a26351d4999
$$ -323983 31919 123728 -19279 -73460 -194176 42290 -269894 -17057 -282782 -126351 -44999
17913a6520j62442h8429g326j63717H6348b09214d6974A12270a09372A99815b77574
$$ -16520 -178962 -88429 -7326 -171043 86348 -209214 -46974 112270 -109372 199815 -277574
17901e0439A2710J42156b38243I0829c4740j49580c7457A71307L7824a49382A28427
$$ -50439 12710 154866 -238243 90829 -34740 -184320 -37457 171307 209131 -149382 128427
17889a44097j9915D6789P7883i5230H0288g7408C1827J61244E7126J07315Q622
$$ -144097 -164012 46789 124672 -95230 80288 -77408 31827 193071 57126 164441 173063
17878A73063a69729A96590b21174i1910j52174i9215m841l2056d3064A51466F1664
$$ 173063 -169729 196590 -221174 -91910 -244084 -99215 -104056 -136112 -43064 151466 61664
17866A00323R274J64430A35369d6872I973c6274j47146k4137h7827C8621J15680
$$ 100323 109597 274027 135369 -46872 9973 -36274 -183420 -207557 -87827 38621 154301
17855A54301f6923A41209h3630A73977J3534b57742C24935i3873B2519a43934
$$ 154301 -66923 141209 -83630 173977 187511 -257742 324935 -93873 22519 -143934
17844C11473n9139b47864B43633a69411d6104B43745a2806A61290l1713K04100
$$ 311473 252334 -247864 243633 -169411 -46104 243745 -12806 161290 129577 333677
17834C33677c3971l30291a8018j25281C6427O1793C7354K51138a39149q1272J059
$$ 333677 -33971 -364262 -18018 -143299 36427 98220 37354 288492 -139149 -220421 -219362
17823b19362C70373a18348j23399H3051b47643R8699H9015b3759A7440P7489f5081
$$ -219362 370373 -118348 -241747 83051 -247643 -148944 89015 -23759 17440 94929 -65081
17811I7059e233D6120j8171N376J42183A072J0197K96472l1140A6307E993h7289
$$ 97059 -5233 46120 27949 33325 175508 1072 11269 307741 276601 16307 5993 -87289
17798c11476A06749b9244A00223I874a37635k77651B25511k7567E1573K3244i5171
$$ -311476 106749 -29244 100223 9874 -137635 -415286 225511 197944 51573 74817 -95171
17786b53873R1297B29371i9714A25521f4320o6594n076B14936a10680l2908A28897
$$ -253873 -162576 229371 -99714 125521 -64320 -130914 -135990 214936 -110680 -143588 128897
17774a51091F765K08421e8501G9947D805h9571A50564D4588J50355e852j2641
$$ -151091 6765 215186 -58501 79947 4805 -89571 150564 44588 194943 -5852 -18493
17763a8493A25967l2637N1986c33994H3859a4894k01307A29053b22602b3551l6427
$$ -18493 125967 93330 145316 -333994 83859 -14894 -216201 129053 -222602 -23551 -59978
17752e9978E1128a46256k19395B57697a64879M0756B61254a23437B87040J3700
$$ -59978 51128 -146256 -365651 257697 -164879 -124123 261254 -123437 287040 300740
17742C00740b18482C85332e5671A09086b0843o244l06844A70743a15107L9228
$$ 300740 -218482 385332 -55671 109086 -20843 -27087 -333931 170743 -115107 -75879
17732g5879A78874K630D0287a37808j57140a35183A25377B416a50764C3027b92193
$$ -75879 178874 181504 40287 -137808 -294948 -135183 125377 2416 -150764 33027 -292193
17720g3743A98185b96241b9347m6584K2666I5791a45216A0332a98001D45656B03743
$$ -73743 198185 -296241 -29347 -75931 -53265 95791 -145216 10332 -198001 445656 203743
17708H7668a3465O267A6894M6810K19936b21292B8401J9932J5836e2031k6164
$$ 87668 -13465 -7198 16894 63704 283640 -221292 28401 48333 64169 -52031 -78195
17697g8195l8494h141q6175A09750a16896j05102R7388B68676a19115A66751a42154
$$ -78195 -116689 -8141 -94316 109750 -116896 -221998 -124610 268676 -119115 166751 -142154
17685C3952K2001j4096h0765m2274H6271J64401d0625F8983M9677R9994a34361
$$ 33952 55953 41857 -80765 -123039 86271 250672 -40625 68983 118660 218654 -134361
17673A7206K60496q7335e671B02709a19531j9575o4351b6216B76950b38230A770
$$ 17206 277702 190367 -5671 202709 -119531 -139106 -203457 -26216 276950 -238230 1770
17661A52023n0193b19545A17376a54274B2594K80577A22972B382b8581l7689I7303
$$ 152023 101830 -219545 117376 -154274 22594 303171 122972 2382 -28581 -66270 97303
17649G5778P8113D2029J61576d1584g58j30730B31564b76810A60159e3590B06996
$$ 75778 153891 42029 203605 -41584 -758 -131488 231564 -276810 160159 -53590 206996
17637C942R191L44515G3562a34014c7188B15832a27731B11160a65141E2918J22987
$$ 3942 13133 357648 73562 -134014 -37188 215832 -127731 211160 -165141 52918 175905
17626A75905J2328L3366K21624c9639k2644C53681a27633A74363j1999c9805n5953
$$ 175905 188233 221599 443223 -39639 -62283 353681 -127633 174363 162364 -39805 -95758
17615i5758P058d1796A15139n0100J01948i3735n1895l3954l27392D8970c43624
$$ -95758 -88700 -41796 115139 65039 166987 -93735 -145630 -179584 -506976 48970 -343624
17603a28808m3671F7489A3961a06602A36681g0658B646a36515C2222e6182l980
$$ -128808 -172479 67489 13961 -106602 136681 -70658 2646 -136515 32222 -56182 -60162
17592f0162B40142b59385H2565P8823a1438A33200g3682b3164D6021i2405n4347
$$ -60162 240142 -259385 82565 161388 -11438 133200 -73682 -23164 46021 -92405 -146752
17581a46752K6440l7120I5996j0060P9436i4536M4475k38269g8201F9084f6023
$$ -146752 -120312 -157432 95996 85936 165372 -94536 -50061 -288330 -78201 69084 -66023
17569C0311g242r2718F7438c25036c9025C5803J707O5774Q655J6198f0356C31835
$$ 30311 -7242 -99960 67438 -325036 -39025 35803 37510 103284 111939 128137 -60356 331835
17556H232f7836j6591A8552f5416I6884f3307A90843a08995g8A49516A1398J1948
$$ 8232 -67836 -84427 18552 -65416 96884 -63307 190843 -108995 -78 149516 11398 23346
17544B3346J759a4246k14826I1717a79739e4970H4415h9733n9322e3896m25297
$$ 23346 25105 -14246 -229072 91717 -179739 -54970 84415 -89733 -149055 -53896 -479193
17533d79193K26258R5694E60348c6379A6547Q3126M0936L7720A7953K2174a00924
$$ -479193 -252935 -157241 560348 -36379 16547 99673 140609 178329 17953 40127 -100924
17521i7289D37360E511J74519D8226a66638A63295P4408M0820j19994g9006c1253
$$ -97289 437360 5511 180030 48226 -166638 163295 237703 278523 158529 -79006 -31253
17509b76952R2436Q343O9750e2307K4970D3055I07g002C58729B8049N4513K87096
$$ -276952 -184516 -176173 -106423 -52307 -27337 43055 907 -7002 358729 28049 82562 369658
17497C69658A13747a08532A51254L4812E8444K19927G2059J11532b02004A42113
$$ 369658 113747 -108532 151254 186066 58444 278371 72059 183591 -202004 142113
17486a57248A63714g3647j57829J06563A36664Q9690e268A25307K20790C5036
$$ -157248 163714 -73647 -231476 -124913 136664 226354 -5268 125307 346097 35036
17475E8240a07217A97161J3206N7972K6775o445J76729A96566J27663G4719L52643
$$ 58240 -107217 197161 210367 268339 295114 288669 465398 196566 324229 74719 427362
17464D27362D2783J38833N4315K6251e7919B17438I8678J03917M6924J34382H9662
$$ 427362 42783 181616 235931 262182 -57919 217438 98678 202595 249519 383901 89662
17452h8675E10697r9574K1940q6709E8277R3181n2546j8423M50507B5092M30818
$$ -88675 510697 411123 433063 346354 58277 151458 98912 80489 530996 25092 455910
17441D55910A98510p2352J26752A8572L94575c1050q3960A05414L78532k29760
$$ 455910 198510 126158 252910 18572 413147 -31050 -115010 105414 483946 254186
17431B54186J14486F9365J92774D1408L08402A58041L87042A66837a71862A58178
$$ 254186 368672 69365 262139 41408 349810 158041 545083 166837 -171862 158178
17420H8818J0142k1391K26187o5436Q9470j13374F7523K19937A24194J99770j43591
$$ 88818 98960 77569 303756 238320 327790 214416 67523 287460 124194 323964 180373
17409A80373K11637b51287f586E4181A9952a30666D49682A91743I09K06707q1643
$$ 180373 392010 -251287 -6586 54181 19952 -130666 449682 191743 909 207616 125973
17398A25973J07112O6834q1641b0137C00817j10173a21496A98330a87511B41126
$$ 125973 233085 299919 218278 -20137 300817 190644 -121496 198330 -187511 241126
17387a44186C35811N8687a5675C19947p3572E3645Q0997k9208i4192A67244n9422
$$ -144186 335811 394498 -15675 319947 246375 53645 134642 105434 -94192 167244 107822
17376A07822J30525l3094J30973m6782j24282F96K63929P6939j50518P1692n6665
$$ 107822 238347 205253 336226 289444 165162 696 264625 341564 191046 262738 206073
17365B06073I2895b11995A60331J1448J67220a61611M6810A55413j884a76791
$$ 206073 92895 -211995 160331 171779 338999 -161611 -114801 155413 153529 -176791
17354A09607L0732g13F4610c29133C5275P4493b85228A37112B2410O5818J0599
$$ 109607 140339 -713 64610 -329133 35275 109768 -285228 137112 22410 88228 98827
17343I8827J91337j38010l1037R4380I698Q2065Q0992o4008g7884A49114K6319
$$ 98827 290164 152154 121117 215497 9698 91763 172755 108747 -77884 149114 175433
17332A75433k0651a08693l4938O3311p2134E08504H3013K45281j32985l1792J29439
$$ 175433 154782 -108693 -143631 -80320 -152454 508504 83013 328294 195309 163517 292956
17321B92956a32139B18141A9148K2696J39177J83514a54735A79733D2721L1374
$$ 292956 -132139 218141 19148 41844 181021 364535 -154735 179733 42721 74095
17311G4095J07200J355N023L4135E1494J39282K30441j04016b60066g5308A8924
$$ 74095 181295 182650 187673 221808 51494 190776 421217 317201 -260066 -75308 18924
17299d8524B17021l03G3550M30875A15099P0479p8006L81031l7351A81175n4822
$$ -48524 217021 216718 73550 504425 115099 185578 107572 488603 451252 181175 126353
17288A26353A0362g8414E1696L21231l303d038A46853R8126p1301c5048C62559
$$ 126353 10362 -78414 51696 372927 369624 -4038 146853 244979 173678 -35048 362559
17276A81684Q5620A08407E2146b7037j66399G7507L06697G2567C3155R4407K25834
$$ 181684 267304 108407 52146 -27037 -193436 77507 384204 72567 33155 127562 353396
17265C53396j00148r794a73868A89644n5498M76311A08008L09995A33978J71054
$$ 353396 253248 243454 -173868 189644 134146 610457 108008 418003 133978 305032
17255C05032J30371b3672A76250n3066J25607M1307A19478J20981m9707J72426
$$ 305032 435403 -23672 176250 123184 248791 290098 119478 240459 190752 363178
17245C63178A68820K8128l7371c504C18787o6148C3172b6888I4958K55258k6981
$$ 363178 168820 196948 159577 -3504 318787 252639 33172 -26888 94958 350216 323235
17234C23235a335A46705J15856M76386a97650C15640c4359A08872K9370f699C15731
$$ 323235 -1335 146705 262561 738947 -197650 315640 -34359 108872 138242 -6699 315731
17222B12687J81497b45C70951m5444P3590B9361K77518A01953M382L02699a85447
$$ 212687 394184 -245 370951 325507 399097 29361 306879 101953 106335 409034 -185447
17210B65589J52778j89858b65874A05835d48438A22804M38312M7612I8567J27360
$$ 265589 418367 228509 -265874 105835 -448438 122804 561116 608728 98567 225927
17200B25927k9069H4627K69926j74878K4982L58037g230D59019J48093B96790
$$ 225927 196858 84627 354553 179675 204657 562694 -7230 459019 607112 296790
17189A03543a29395D52060h9001A40067M79J94099A40858Q9620I6923L86927b8166
$$ 103543 -129395 452060 -89001 140067 140546 334645 140858 230478 96923 483850 -28166
17177C47455j73209J64052N6081r0115o9029J52576j61741A09207K26504j52625
$$ 347455 174246 338298 394379 304264 235235 387811 226070 109207 335711 183086
17167A83086j3799J75619K0989D2130M56739A23265l3206C8975i2212B70884J48082
$$ 183086 169287 344906 365895 42130 498869 123265 90059 38975 -92212 270884 418966
17156D18966N7955n3234J84660B69853P988j060K9236A22052J15038J8624A18947
$$ 418966 476921 423687 608347 269853 277841 276781 306017 122052 237090 255714 118947
17144C41427L5248A01557l0022M57430A89227J37832A16631J13468B8338J63677
$$ 341427 376675 101557 71535 528965 189227 327059 116631 230099 28338 192015
17134A92015K19803F6430J14313J09815r6850J76101j06804A10300D715L64625
$$ 192015 411818 66430 180743 290558 193708 369809 263005 110300 4715 369340
17124C69340f2485K5965C30534N6699A66836J68365j00348l0768R684J16974m7924
$$ 369340 -62485 -36520 330534 387233 166836 335201 234853 204085 213769 330743 282819
17113B82819J35763j49631Q5484K8286J9772p5004K61571j24802j63109A24012
$$ 282819 418582 268951 354435 382721 402493 327489 589060 464258 301149 124012
17102D59698L5271K2303N9776B13468K34736j31152J02303r8617J61864A84943
$$ 459698 494969 517272 577048 213468 448204 317052 419355 320738 482602 184943
17091E59304K7982j05535A79094J38430K48848B08061H9632J5873L63917k06120
$$ 559304 587286 481751 179094 317524 566372 208061 89632 105505 469422 263302
17081B63302j22049K13302r2757A09325M64178F5413O26073C33959j5921I4036
$$ 263302 141253 354555 261798 109325 573503 65413 691486 333959 318038 94036
17070D73285J36219k40269J66679B63769M0666J89593P555M2951A30255J31856
$$ 473285 609504 369235 535914 263769 304435 494028 501583 544534 130255 262111
17060B62111N01284C71415m408J08506j713j42033K134N2793J71407L38927m09055
$$ 262111 763395 371415 367007 475513 473800 331767 333901 386694 558101 897028 487973
17049D87973K5383K20241k96565J65766j20928o7627K00270B37923O360L46312
$$ 487973 513356 733597 437032 602798 481870 414243 614513 237923 244283 590595
17039E90595K16151k32600k12824M82544m06509K67345J3920C18321M18175K01317
$$ 590595 806746 574146 361322 843866 437357 704702 718622 318321 736496 937813
17029I37813m55305B18653L56488L8659M2672j20771M56547l49500l190l1190
$$ 937813 482508 218653 575141 613800 656472 535701 992248 642748 639558 608368
17019F08368J78044k51809K81325l77553J41572j40257M42123K7463j14658k40998
$$ 608368 786412 534603 815928 438375 579947 439690 881813 909276 794618 553620
17009E53620Q1356Q0017J25451L30m08600N43936k11134j3326j6925K48096j59170
$$ 553620 634976 714993 840444 840774 432174 976110 764976 751650 734725 982821 823651
16998H23651J96900j97227J0112l8767m0643B57012M64543k08438O78111m28071
$$ 823651 1020551 823324 833436 794669 754026 257012 721555 513117 1191228 763157
16988G63157k2305J30809j63545j85476P36450j22156j70292m19503L62173j68826
$$ 763157 740852 871661 708116 522640 1259090 1136934 966642 547139 909312 740486
16978G40486K57679l54661N45716D91626L52496L43697l16162j16278N0178K58500
$$ 740486 998165 643504 1189220 491626 844122 1187819 871657 755379 805557 1064057
16968A064057l17666M30722E79055L54597J90061j54818r3512k41765K45651J54573
$$ 1064057 746391 1177113 579055 933652 1123713 968895 875383 633618 879269 1033842
16958A033842K6362j06911J22752p8236l10801L45911J0663p5262J14809q9467
$$ 1033842 1060204 953293 1076045 997809 687008 1032919 1043582 968320 1083129 993662
16948I93662K99039k74680L7519k3199n3986j86339L70836k69668K76895k45495
$$ 993662 1292701 1018021 1055540 1032341 978355 792016 1162852 893184 1170079 924584
16938I24584J77662K70652r7102J07104Q4883m55777K73477l11483L39135k44414
$$ 924584 1102246 1372898 1275796 1382900 1467783 1012006 1285483 974000 1313135 1068721
16928A068721K64465Q6957o8260j76385M12718k76815k05189K92768l1095j55618
$$ 1068721 1333186 1420143 1351883 1175498 1588216 1311401 1106212 1398980 1367885 1212267
16918A212267P7258P7259n6440J37365J81021k10526m7346j68746P3038j2813
$$ 1212267 1289525 1366784 1310344 1447709 1628730 1418204 1370858 1202112 1275150 1262337
16908A262337L94648k39946J98802J61304K30335n10423J88120l38612J54668
$$ 1262337 1656985 1417039 1615841 1777145 2007480 1497057 1685177 1346565 1501233
16899A501233L55252j23163j99170M55745N0923o3249k15505k33828J12261J69504
$$ 1501233 1856485 1733322 1534152 1989897 2040820 1977571 1762066 1528238 1640499 1810003
16889A810003Q0306K13225o6266J4090n2302n0998k6742M69796k9756l25351N7965
$$ 1810003 1890309 2103534 2037268 2051358 1999056 1948058 1921316 2391112 2361356 2036005 2093970
16878B093970Q4860K1364J74065j11141J4856k8042L37567K5123J34972J11285
$$ 2093970 2178830 2200194 2374259 2263118 2277974 2249932 2587499 2612622 2747594 2858879
16868B858879k15505j64854q1418L90472k14900p2915J06087j23799L23920j87648
$$ 2858879 2643374 2478520 2397102 2787574 2572674 2499759 2605846 2482047 2805967 2618319
16858B618319K46885o785K4243K8101J74392O2815r840Q7960L86514l83970K08532
$$ 2618319 2865204 2858419 2882662 2910763 3085155 3147970 3138130 3226090 3612604 3228634 3437166
16847C437166l61191K68632N0954j02550L73643m7784L81650m82676M02004J51741
$$ 3437166 3075975 3344607 3395561 3293011 3666654 3618870 4000520 3517844 3919848 4071589
16837D071589k50179J99765o816J57284K91165l5224J18598k51073M33748k02845
$$ 4071589 3821410 4021175 4014359 4171643 4462808 4427584 4546182 4295109 4728857 4526012
16827D526012J71617L3118j46942J11218M21053J68164J30919J01303k23270K03201
$$ 4526012 4697629 4730747 4583805 4695023 5116076 5284240 5415159 5516462 5293192 5496393
16817E496393P8411M00649L45819J30777l30722L11498j47417O26386J41211k26284
$$ 5496393 5574804 5975453 6321272 6452049 6121327 6432825 6285408 6911794 7053005 6826721
16807F826721J68067K88043j78363K84859N33031k8928j01721N29825K25535J88048
$$ 6826721 6994788 7282831 7104468 7389327 7922358 7893430 7791709 8321534 8547069 8735117
16797H735117K25835Q6267O05263k99092O70831K31137K22O06865K3034O04950
$$ 8735117 8960952 9047219 9652482 9353390 10024221 10255358 10255580 10862445 10885479 11490429
16787A1490429J12445L08758L98434L28567L82018N48799K56465O77735O70364
$$ 11490429 11602874 11911632 12310066 12638633 13020651 13569450 13825915 14503650 15174014
16778A5174014L41967K24128O25314P54731M02098M99459N90385M98161J028539
$$ 15174014 15515981 15740109 16365423 17120154 17522252 18021711 18612096 19110257 20138796
16769B0138796P59442M13144R86975J076676L87657J834346P86620P04679J150568
$$ 20138796 20898238 21311382 22298357 23375033 23762690 25597036 26383656 27088335 28238903
16760B8238903J416623J187591J363944J079525J873044J711733J660978J598223
$$ 28238903 29655526 30843117 32207061 33286586 35159630 36871363 38532341 40130564
16752D0130564K227065J896603K966503J903450L191202K434232L093865L291808
$$ 40130564 42357629 44254232 47220735 49124185 52315387 54749619 57843484 61135292
16744F1135292L153669L916773M020559M124661M568728M800856N052125N637984
$$ 61135292 64288961 68205734 72226293 76350954 80919682 85720538 90772663 96410647
16736I6410647N857166N974752O574789O476611O756463P396990O980243P220777
$$ 96410647 102267813 108242565 114817354 121293965 128050428 135447418 142427661 149648438
16728A49648438O653745O730229N939994N169510M634059L386233K260425J158328
$$ 149648438 156302183 163032412 168972406 174141916 178775975 182162208 184422633 185580961
16720A85580961k03995j249558k476751l775090m823653n772923o121026o797242
$$ 185580961 185376966 184127408 181650657 177875567 173051914 167278991 161157965 154360723
16712A54360723p209049p435382p304197p599025o595267p328179o386618o305807
$$ 154360723 147151674 139716292 132412095 124813070 118217803 110889624 104503006 98197199
16704I8197199n912886n347963n183682m866334m634318m240400m156277l258197
$$ 98197199 92284313 86936350 81752668 76886334 72252016 68011616 63855339 60597142
16696F0597142l878352k807608l339701k464926k625670k143403k659039k121746
$$ 60597142 56718790 53911182 50571481 48106555 45480885 43337482 40678443 38556697
16688C8556697j541980k028262j590700j508470j609912j162722j344627j335851
$$ 38556697 37014717 34986455 33395755 31887285 30277373 29114651 27770024 26434173
16680B6434173j258847p93609j208876p51177r96028q21873r52397n62793r09612
$$ 26434173 25175326 24381717 23172841 22421664 21425636 20603763 19651366 19088573 18178961
16671A8178961o93104o69589m97463o87826m54059k37553r47498l31275m71401
$$ 18178961 17485857 16816268 16318805 15630979 15176920 14939367 13991869 13660594 13189193
16662A3189193n15061J1174o27834l15369k95303m60632j92849k65417n07196
$$ 13189193 12674132 12685306 12057472 11742103 11446800 10986168 10793319 10527902 10020706
16653A0020706j57395l97636l39594j02503l37947l21170N1821n24856n237o9472
$$ 10020706 9863311 9465675 9126081 9023578 8685631 8364461 8416282 7891426 7886189 7816717
16643G816717k77008q3794l44502l63523j85264R6985l19984m04727J87963n1559
$$ 7816717 7539709 7455915 7111413 6747890 6562626 6659611 6339627 5934900 6122863 6071304
16633F071304m97507L244m5442k66110j08251P1072l64142L27920l32290j09442
$$ 6071304 5573797 5577041 5531599 5265489 5157238 5228310 4864168 5192088 4859798 4750356
16623D750356l48127J05280K7543j61153k62205J7040p9935l1075j03894j17398
$$ 4750356 4402229 4507509 4535052 4373899 4111694 4128734 4048799 4017724 3913830 3796432
16613C796432L13235l36206k23796J2992j03778j65904M24240l39306L5472j69670
$$ 3796432 4109667 3773461 3549665 3562657 3458879 3292975 3717215 3377909 3413381 3243711
16603C243711k61690K49133M8319l40223n5568r0179J00551L6102k47545Q2848
$$ 3243711 2982021 3231154 3279473 2939250 2883682 2793503 2894054 2930156 2682611 2765459
16593B765459k4751N3964j97457j33036K37689l09059k30783K3250J03658j93922
$$ 2765459 2740708 2794672 2597215 2464179 2701868 2392809 2162026 2185276 2288934 2095012
16583B095012L58425N276l63771Q246k4691J9968j86744J01426M6867r5719Q8202
$$ 2095012 2453437 2458713 2094942 2103188 2078497 2098465 1911721 2013147 2060014 1964295 2052497
16572B052497l17672L11459N5574k70999L9161k1352l78904J62890l2737K40078
$$ 2052497 1734825 2046284 2101858 1830859 1870020 1848668 1469764 1632654 1599917 1839995
16562A839995k91563K0158R8396j80778j2794j04832J34339m6675J60276j04759
$$ 1839995 1548432 1568590 1666986 1486208 1473414 1368582 1502921 1456246 1616522 1511763
16552A511763l00370L74166k94698k06186P497J14476J39641j25626M7965M4799
$$ 1511763 1211393 1585559 1290861 1084675 1092172 1206648 1346289 1220663 1268628 1313427
16542A313427K64295n33030L81572l01830O0082J44355q3876k48826J42772J42993
$$ 1313427 1577722 1044692 1426264 1124434 1184516 1328871 1244995 996169 1138941 1281934
16532A281934m53380K41104n8133J79120q8217j18502l9020K31014j17622K42545
$$ 1281934 828554 1069658 1011525 1190645 1102428 983926 944906 1175920 1058298 1300843
16522A300843j79454p2568m0545J76937r2928j57850O5791j06054k0757R3534
$$ 1300843 1121389 1048821 1008276 1185213 1092285 934435 1000226 894172 873415 966949
16512I66949J38222j48822j66441l3078J04339k67798J4934J20733J32612o1937
$$ 966949 1105171 956349 789908 756830 861169 593371 608305 729038 861650 799713
16502G99713J3680L9090l65419N67766D96381K35825J75615o7475n2483K90500
$$ 799713 813393 852483 487064 1054830 496381 732206 907821 840346 787863 1078363
16492A078363j60635q1269k18373N5763J36749k69011R9766j95781J97675q6652
$$ 1078363 917728 836459 618086 673849 810598 541587 641353 445572 643247 556595
16482E56595r2655J29079Q4015J54594P3691k31527m288J16723j08588p3758k02668
$$ 556595 463940 593019 677034 831628 905319 673792 669504 786227 677639 603881 401213
16471D01213l5139k9549R0533K01145Q6130k47257j60776K08340L53930k68719
$$ 401213 366074 336525 427058 628203 714333 467076 306300 514640 868570 599851
16461E99851j20351k1488L270M74663B51730J97684N6335n489j0759K01572N6891
$$ 599851 479500 458012 461282 935945 251730 449414 505749 500260 489501 691073 747964
16450G47964j67363j9411o743K80209l14798N0113k00979L6172p5499J24179K19959
$$ 747964 580601 561190 554447 834656 519858 569971 368992 405164 329665 453844 673803
16439F73803k2568k13441R7121J91019j37895j63962J61485K906B87934p3150
$$ 673803 651235 437794 534915 725934 588039 424077 585562 588468 287934 214784
16429B14784J68447L23164k53881k9597j62710J02049J16033Q7394j49132r0472
$$ 214784 383231 706395 452514 422917 260207 362256 478289 565683 416551 326079
16419C26079N5613j60677J09496m0026j04770L16784j62297n2026J10152r6695
$$ 326079 381692 221015 330511 290485 185715 502499 340202 288176 398328 301633
16409C01633J52383j47449o9980M5956K858A24843m9169J52954A00661J29257
$$ 301633 454016 306567 236587 282543 285401 124843 75674 228628 100661 229918
16399B29918k0059R1730p8295K44413A73113J39028G1518O5395J30304J13983
$$ 229918 209859 301589 223294 467707 173113 312141 71518 136913 267217 381200
16389C81200A08122J12337N062L22278j37375C4340K87481J09330A52497L55690
$$ 381200 108122 220459 225521 547799 410424 34340 321821 431151 152497 508187
16379E08187A30849D7851K42411a34499B64123J01498q8332J31696p0722q6767
$$ 508187 130849 47851 290262 -134499 264123 365621 277289 408985 338263 251496
16369B51496j20558R7738D8987M71795A76796F4806L69670n1006j03092n4564
$$ 251496 130938 228676 48987 520782 176796 64806 434476 383470 280378 225814
16359B25814E1499J9883O43834l14854e984m1396C95972p8643E5739J28343J25242
$$ 225814 51499 71382 715216 400362 -5984 -47380 395972 317329 55739 184082 309324
16348C09324A2648J28600J52495a4277B92689J00268j42523J23416H1347L50618
$$ 309324 12648 141248 293743 -14277 292689 392957 250434 373850 81347 431965
16338D31965j97959J43735j34681A5863c2134d337A26371g9022A48433k3278P1850
$$ 431965 234006 377741 243060 15863 -32134 -4337 126371 -79022 148433 125155 197005
16327A97005A0416K86350J39119a01648b6189A47150J32609d2627A63753c7388
$$ 197005 10416 296766 435885 -101648 -26189 147150 279759 -42627 163753 -37388
16316C73020j13813J31406b09j5831A25968B7298N7083a6481D8187A3759a30975
$$ 373020 259207 390613 -209 -16040 125968 27298 84381 -16481 48187 13759 -130975
16304H4765g1472C30527D6111a63091C8710b03898b6816I6711J3909C9637J32191
$$ 84765 -71472 330527 46111 -163091 38710 -203898 -26816 96711 110620 39637 171828
16293A71828k5859R8660a61752B59346Q1734c9978A36870f5175A74683J7349A0493
$$ 171828 145969 244629 -161752 259346 341080 -39978 136870 -65175 174683 192032 10493
16281C12626A27781L7009J5752f94C6408J56204R8751H2538f0145j72194H2146
$$ 312626 127781 164790 180542 -694 36408 192612 291363 82538 -60145 -232339 82146
16269A4875b8215j79517A07626L1889l4811h2788B77153g1196o8398D2083c12857
$$ 14875 -28215 -207732 107626 139515 104704 -82788 277153 -71196 -139594 42083 -312857
16257A98300J8337r7877J16532P9975f6817F0502M9476J00418g6315D39198A17758
$$ 198300 216637 118760 235292 315267 -66817 60502 109978 210396 -76315 439198 117758
16245D6347h1520A89271j3660G532b45015e9808A01272K8351o1030J18518J5561
$$ 46347 -81520 189271 175611 7532 -245015 -59808 101272 129623 68593 187111 202672
16234B02672a6802A16533a8184p5123o6263N4288B63342b73045B50987N1263j20636
$$ 202672 -16802 116533 -18184 -93307 -159570 -105282 263342 -273045 250987 302250 181614
16223A81614E2534c0506i888B37389a15870l4068q677E171e0281A72819f1657
$$ 181614 52534 -30506 -9888 237389 -115870 -149938 -158615 5171 -50281 172819 -61657
16211B35127D6979J95142e8421B16833g4083a2752H1117J93029G3457d9783Q54
$$ 235127 46979 242121 -58421 216833 -74083 -12752 81117 274146 73457 -49783 -48929
16200d8929C17632b24947l2698a08239j20198A12097g8667A56331a41365C82174
$$ -48929 317632 -224947 -257645 -108239 -228437 112097 -78667 156331 -141365 382174
16189g8789B10526J1833N332a67355A12391e6917j54840c008j38826A19170A9762
$$ -78789 210526 222359 227691 -167355 112391 -56917 -211757 -3008 -141834 119170 19762
16177A91181a52092B7018Q4654M4182a1912B25166h2916A74912f1421C5249N5889
$$ 191181 -152092 27018 111672 155854 -11912 225166 -82916 174912 -61421 35249 91138
16166I1138j9078b33225C30399b53A33852b98243D4676b9338p6672F3442k033
$$ 91138 72060 -233225 330399 -253 133852 -298243 44676 -29338 -106010 63442 61409
16155F1409k2228P2505B6072J42904n0351n3410i2013A72043b33608J9921e0989
$$ 61409 39181 111686 26072 168976 118625 65215 -92013 172043 -233608 -213687 -50989
16143A1603Q8286a70249I9242b30579c8585D25476b4984A18786e7850A46038R0101
$$ 11603 99889 -170249 99242 -230579 -38585 425476 -24984 118786 -57850 146038 236139
16132B36139b42053C4746b20325i8328b525A59797m6945b49509D3763h9027c2611
$$ 236139 -242053 34746 -220325 -98328 -2525 159797 112852 -249509 43763 -89027 -32611
16120i3280l3182d9969B9980b25920c2376j11409L4837n7163j58923a44709A92292
$$ -93280 -126462 -49969 29980 -225920 -32376 -143785 -108948 -166111 -325034 -144709 192292
16108C1754K47374h6318p367A45570k401N5200p5264J60206o9919N7455l916C1729
$$ 31754 279128 -86318 -93685 145570 143169 198369 123105 283311 213392 270847 266931 31729
16095H9572m1896L938J11734O4652a26095A33489c8267A8698J69932b11467B4419
$$ 89572 47676 51614 163348 228000 -126095 133489 -38267 18698 188630 -211467 24419
16083E6928J32518K9797a96602H6577b57258G5626i3328b1095D5904a00208j2445
$$ 56928 189446 219243 -196602 86577 -257258 75626 -93328 -21095 45904 -100208 -112653
16072a12653B0340R2579E0507d360k72413E9717j4146L7487R4377G4173R500a32622
$$ -112653 20340 112919 50507 -4360 -276773 59717 45571 83058 177435 74173 83673 -132622
16059A15823J07688a87760A38750h4780D37030b50361G9477b73874N2288A56015
$$ 115823 223511 -187760 138750 -84780 437030 -250361 79477 -273874 -221586 156015
16048B4169K8005a4130B90946a90554o4828e2964A58263J89728A19191f6495E4843
$$ 24169 52174 -14130 290946 -190554 -255382 -52964 158263 347991 119191 -66495 54843
16036d06531J61319O5326j36645E2383I327K09955d26566a50539k7404C3871i2565
$$ -406531 -245212 -179886 -316531 52383 9327 219282 -426566 -150539 -177943 33871 -92565
16024C6857g7278J7180j87398A25614d3145A10962a4572E0044g8367j21743A7926
$$ 36857 -77278 -60098 -247496 125614 -43145 110962 -14572 50044 -78367 -200110 17926
16012B14715E2175Q2262b26075Q2348f7145k01953j26497a03249r9747b1242B5780
$$ 214715 52175 134437 -226075 -143727 -67145 -269098 -395595 -103249 -202996 -21242 25780
16000b69402f4014K8878I8312e3944n7954p6950D8570A9177J3011f0565C0287
$$ -269402 -64014 -35136 98312 -53944 -111898 -188848 48570 19177 32188 -60565 30287
15988H0609c30912h7715H7381J85277m9672n5932K46589M45197D01458p8194j40491
$$ 80609 -330912 -87715 87381 272658 222986 167054 413643 858840 401458 323264 182773
15977A82773c72048d7364a863k23139H0223a89190i3435C16945j04522a66283
$$ 182773 -372048 -47364 -1863 -225002 80223 -189190 -93435 316945 212423 -166283
15966d9529j17278C08762A33915P1695a99379I6885G497a80894K5068O3923q0193
$$ -49529 -166807 308762 133915 205610 -199379 96885 7497 -180894 -155826 -91903 -172096
15955a72096n1181G5308b24277a5935B8457d4914B2134f987A54916J29850B5656
$$ -172096 -223277 75308 -224277 -15935 28457 -44914 22134 -6987 154916 284766 25656
15943D5163b32868A39195a56183F9678d321j51968A22809J81213F5857a07822
$$ 45163 -232868 139195 -156183 69678 -4321 -156289 122809 304022 65857 -107822
15932A30345e4737B50850g6349C2669c90901g075l07340d410p3428H2092J30590
$$ 130345 -54737 250850 -76349 32669 -390901 -7075 -314415 -4410 -77838 82092 212682
15921B12682a2095k37799a23535A12440J19620a26917C14623H2435C9865f5452
$$ 212682 -12095 -249894 -123535 112440 232060 -126917 314623 82435 39865 -65452
15910f7547j90203B9824b89666d4808j48819o9402A38135c93085F9550a84213
$$ -67547 -257750 29824 -289666 -44808 -193627 -263029 138135 -393085 69550 -184213
15899H0774a09322k15446a52459A6717c07371i746C76265C004K09876e3795A29329
$$ 80774 -109322 -324768 -152459 16717 -307371 -9746 376265 3004 212880 -53795 129329
15887E5576a83720l289O1764D5851J9075M327L6756d7747j2228N832r350b4612
$$ 55576 -183720 -187009 -125245 45851 64926 69253 106009 -47747 -59975 -54143 -63493 -24612
15874d22553A14411b45078A85614b03841B12214h885k08170e252E7781a01083
$$ -422553 114411 -245078 185614 -203841 212214 -8885 -217055 -5252 57781 -101083
15863g6741b4198A85821b2418G7491k8065b50576A29573e1767j20848L7203k0128
$$ -76741 -24198 185821 -22418 77491 49426 -250576 129573 -51767 -172615 -135412 -155540
15852a55540j84710a15548A53382K336a85882h3972k81544a22200m0981D6643
$$ -155540 -340250 -115548 153382 155718 -185882 -83972 -365516 -122200 -163181 46643
15841E6143J8539l0805c33954D937J8855J87288j02918A0067R8122L79604B08035
$$ 56143 74682 43877 -333954 4937 23792 211080 108162 10067 108189 487793 208035
15829i9206a7614D7783b09293N1749B8334Q6982a19589m1954A22556a15045j40129
$$ -99206 -17614 47783 -209293 -157544 28334 115316 -119589 -161543 122556 -115045 -255174
15818b55174J04910H57L2217d28908a72997P2369j24375A03661b84380h6497M0724
$$ -255174 -150264 857 33074 -428908 -172997 -100628 -225003 103661 -284380 -86497 -45773
15807d5773j64098E07330C3681b7824A73838a71824A9571f7188j32392a6535j75892
$$ -45773 -209871 507330 33681 -27824 173838 -171824 19571 -67188 -199580 -16535 -192427
15796a92427M9548n3671C14659E8562d47280A54654J09072c7293a4054j46849
$$ -192427 -142879 -196550 314659 58562 -447280 154654 263726 -37293 -14054 -160903
15786a60903O8428B08285d2489m0065A1763a99962R1753A66840b89859O7989A48783
$$ -160903 -92475 208285 -42489 -82554 11763 -199962 -108209 166840 -289859 -221870 148783
15774B8663J67995D105K3269Q3080d90084D6060L28187c18361e7677B08625a08740
$$ 28663 196658 4105 27374 110454 -490084 46060 374247 -318361 -57677 208625 -108740
15762a33936O5797B06020f2136j39094E4362a67434c1203A97552d2827j90305
$$ -133936 -68139 206020 -62136 -201230 54362 -167434 -31203 197552 -42827 -233132
15752b33132A50637L3261H8422L5428E8458J14372p1007J52283A09893K09672
$$ -233132 150637 183898 88422 123850 58458 172830 101823 254106 109893 319565
15742C19565j45060a6457k6781J6974r4629J704N6613A38498i1639i596D5634
$$ 319565 174505 -16457 -43238 -26264 -120893 -119189 -62576 138498 -91639 -9596 45634
15730a05736c3506k44866A06520B0010d3249k49276a41245m5260A9926h1618B00905
$$ -105736 -33506 -278372 106520 20010 -43249 -292525 -141245 -186505 19926 -81618 200905
15718B5118a44956A57877a34325D1353J52979a33810A29353a15724j53687A14865
$$ 25118 -144956 157877 -134325 41353 194332 -133810 129353 -115724 -269411 114865
15707F9834a03404l05529f6100N625k17421a4974A03888f1168C13757b87043A12506
$$ 69834 -103404 -408933 -66100 -60475 -277896 -14974 103888 -61168 313757 -287043 112506
15695a86895A93561p8922P4289d9553C88006b8207q852A49875b09180d3572A19014
$$ -186895 193561 114639 188928 -49553 388006 -28207 -37059 149875 -209180 -43572 119014
15683c44061Q6934o6254B06896J347a31388L2513A8009i4481p0453d6642A87407
$$ -344061 -257127 -323381 206896 208243 -131388 -98875 18009 -94481 -164934 -46642 187407
15671A9333i6057H5519b39485F9905a85755b7669k02411h2397k22305J9836Q2677
$$ 19333 -96057 85519 -239485 69905 -185755 -27669 -230080 -82397 -304702 -284866 -202189
15660b02189P3941j00646g9836B57911c9326A78864Q5847b37507a03157l48437
$$ -202189 -128248 -228894 -79836 257911 -39326 178864 264711 -237507 -103157 -451594
15650d51594a68989a9420j38392n404c1319A6062b7403H6211d0432j0217e67j47215
$$ -451594 -168989 -19420 -157812 -163216 -31319 16062 -27403 86211 -40432 -50649 -567 -147782
15638a47782k15575J60358c0078k08495E7653c122j4152A8387a0013F5928a97605
$$ -147782 -363357 -202999 -30078 -238573 57653 -3122 -17274 18387 -10013 65928 -197605
15626D4097p617c39850e2068A80745j9167a26672C9382b73964J04864E4373M9668
$$ 44097 36480 -339850 -52068 180745 161578 -126672 39382 -273964 -169100 54373 104041
15615A04041a57698H816L7938c00860A35433A1668c76259e0569p7084j02918F380
$$ 104041 -157698 8816 46754 -300860 135433 11668 -376259 -50569 -127653 -230571 6380
15603A8404f7677A58458e3857B43O8675h4419A49719b01939M749j47168J42588
$$ 18404 -67677 158458 -53857 243 68918 -84419 149719 -201939 -197190 -344358 -201770
15592b01770H8440C2085a76243A81843n2720a63865e8317A54217a20063A20269
$$ -201770 88440 32085 -176243 181843 129123 -163865 -58317 154217 -120063 120269
15581a62587j20237e5968k16320J28072e2616k5707A85866e350B90491c57733
$$ -162587 -282824 -55968 -272288 -144216 -52616 -78323 185866 -5350 290491 -357733
15570F7632a53771j03042o6283b6027P670r9984B3905L83895g842B52597a48577
$$ 67632 -153771 -256813 -323096 -26027 -18357 -118341 23905 407800 -7842 252597 -148577
15558h865j02770d2562A39147L8394a36944k34080a09639D19897A11960a113j62236
$$ -8865 -111635 -42562 139147 177541 -136944 -371024 -109639 419897 111960 -1113 -163349
15547a63349B49594a0823B5731a83239j37704c6420B06783q6867a27294A3518
$$ -163349 249594 -10823 25731 -183239 -320943 -36420 206783 119916 -127294 13518
15536A08276B5793J65824e3327A16843o031a9535f029F5891L4782p69a2759j69550
$$ 108276 25793 191617 -53327 116843 110812 -19535 -6029 65891 100673 99904 -12759 -182309
15524a82309P0963A13214c7525m2942A42458a94073Q8496E699a10387l5925A03281
$$ -182309 -111346 113214 -37525 -80467 142458 -194073 -105577 5699 -110387 -146312 103281
15512b7957H4024a76398A05153h2752n725A1461J97447h3498K3633m0366I3214
$$ -27957 84024 -176398 105153 -82752 -88477 11461 208908 -83498 -59865 -100231 93214
15500a75694c6400B8687a5294k59591d2543H4010k6624K72914h6170K9032A55137
$$ -175694 -36400 28687 -15294 -274885 -42543 84010 57386 330300 -86170 -57138 155137
15488A0433J62954d3497J0139m2461j81903g986l3668k43451H2713b58988A97780
$$ 10433 173387 -43497 -33358 -75819 -257722 -7986 -41654 -285105 82713 -258988 197780
15476D5791a94952G1305a57653d603A08103b05127d0175k84932P3004A95108r5837
$$ 45791 -194952 71305 -157653 -4603 108103 -205127 -40175 -325107 -252103 195108 99271
15465I9271c1494A38020m7265f6431j15419F841J3205N8134C8466J22732b88285
$$ 99271 -31494 138020 90755 -66431 -181850 6841 20046 78180 38466 161198 -288285
15453F2814P2130c3746k5188j06609A95773J12559a9450l4470a8340A431b184
$$ 62814 134944 -33746 -58934 -165543 195773 308332 -19450 -53920 -18340 1431 -2184
15441f5466k23499a8959B7935a10340j1070A93010o9906O6629a85956A26214n8807
$$ -65466 -288965 -18959 27935 -110340 -121410 193010 123104 189733 -185956 126214 67407
15430F7407a09714B44044l6057c801B87331E8238a03357d3958D4980c58247a11216
$$ 67407 -109714 244044 207987 -3801 287331 58238 -103357 -43958 44980 -358247 -111216
15418B25751r3532a14856A63235C1663e5495G8510l4850g3586C33706r1003c98312
$$ 225751 132219 -114856 163235 31663 -55495 78510 43660 -73586 333706 242703 -398312
15406E0973J2082R2785B2924b68466E4513e035p3784B2905b0440G2150a35765
$$ 50973 63055 155840 22924 -268466 54513 -5035 -78819 22905 -20440 72150 -135765
15394b94520P0313A45165A7470b1025A14734A5635c67740C8000R8361a17979l7315
$$ -294520 -224207 145165 17470 -21025 114734 15635 -367740 38000 136361 -117979 -155294
15383a55294C58007E2330d6805j29623B41986a5707A83376J88508d007k32524
$$ -155294 358007 52330 -46805 -176428 241986 -15707 183376 371884 -4007 -236531
15373b36531H5799j4316a09983d2377a8216L74F8574a02132L5112B71948d32084
$$ -236531 85799 71483 -109983 -42377 -18216 -17842 68574 -102132 -67020 271948 -432084
15361I8622c02010a3018k99811a09999N4468A03586h0576R49A61031a38212I2167
$$ 98622 -302010 -13018 -312829 -109999 -55531 103586 -80576 -79627 161031 -138212 92167
15349B6260J93821B9974a97974A33140m9159O6862A0596h776B46971A20304a85195
$$ 26260 220081 29974 -197974 133140 83981 150843 10596 -8776 246971 120304 -185195
15337B33658A7455c12501a44312B98565e1097k4949j59500D0131d422I5499n564
$$ 233658 17455 -312501 -144312 298565 -51097 -76046 -235546 40131 -4422 95499 89935
15326H9935b63626C98295F3563b38484D3228a53037B19535A02914J2019E937h3466
$$ 89935 -263626 398295 63563 -238484 43228 -153037 219535 102914 114933 5937 -83466
15314A13838c51529B31800j2278k382c82055A39214b12510C11291A30302c4945
$$ 113838 -351529 231800 219522 217140 -382055 139214 -212510 311291 130302 -34945
15303G2844J19366C0446M6955K3660a31167g75l7731B2590J97608b64564D3712
$$ 72844 192210 30446 77401 101061 -131167 -775 -38506 22590 220198 -264564 43712
15291B51867L1989I6613a20469b8026B0482J70101f2016F4302Q5078d1721j96276
$$ 251867 283856 96613 -120469 -28026 20482 190583 -62016 64302 149380 -41721 -237997
15280b37997A27170g5307f136B7223a54897A30846R9031p6482D6673J05654o9828
$$ -237997 127170 -75307 -6136 27223 -154897 130846 229877 153395 46673 152327 82499
15269H2499d6651B29020m5321M619K8118D6843J23830p158b8226A15969E7303
$$ 82499 -46651 229020 183699 188318 216436 46843 170673 163515 -28226 115969 57303
15257B81073j7007b50588A92351m6249a90102a3095C40776j49988K83970O72102
$$ 281073 264066 -250588 192351 146102 -190102 -13095 340776 190788 474758 1146860
15247A146860N50437o80521L75625j61289C33447a82857A81528N9324b96962B57851
$$ 1146860 1697297 1016776 1392401 1231112 333447 -182857 181528 240852 -296962 257851
15236a32474e0693A96967L0345E8603C688a22537j43336A7945M0142e9509C7087
$$ -132474 -50693 196967 227312 58603 3688 -122537 -265873 17945 58087 -59509 37087
15224B33339o7356J8917C0194M46835A113a30257E7640O0757b15305R8041k23897
$$ 233339 165983 184900 30194 477029 1113 -130257 57640 118397 -215305 -117264 -341161
15213c41161A52451h3640a4064n867H5692a67060A48098q229b9321C67430a51930
$$ -341161 152451 -83640 -14064 -19931 85692 -167060 148098 139869 -29321 367430 -151930
15201I2563C808R7295J01886h9894B38702I7411b63077Q5329B07843d5215B20848
$$ 92563 3808 101103 202989 -89894 238702 97411 -263077 -177748 207843 -45215 220848
15189B316J78652k3929J84221a6675I3713a37688C4246L41027D409L03028D4217
$$ 2316 180968 157039 341260 -16675 93713 -137688 34246 375273 4409 307437 44217
15177d1858B61250I4046a75958A07032a23648A0790L18050p2297a19859i845C9990
$$ -41858 261250 94046 -175958 107032 -123648 10790 328840 256543 -119859 -9845 39990
15165B55925r9919O2423p3292a50124j01400M7486A08079K39518I0875J18879
$$ 255925 156006 218429 145137 -150124 -251524 -204038 108079 347597 90875 209754
15155B09754b9549H1065r747j7502O0698M1480J06489C6138J88301M0502A29376
$$ 209754 -29549 81065 71318 53816 114514 155994 262483 36138 224439 264941 129376
15143g4449l8323A0397K57613H8864l8686d6890b1068G2606r281K05822r3864
$$ -74449 -112772 10397 268010 88864 50178 -46890 -21068 72606 63325 269147 175283
15132A75283H0666J12734j3142c6030A66675R5174K1426K14983A19026L8755L5641
$$ 175283 80666 193400 180258 -36030 166675 261849 283275 498258 119026 157781 193422
15121A93422F3880a16088B62797A25935K0864Q478k816c02342g4305F5758a13759
$$ 193422 63880 -116088 262797 125935 146799 155277 152461 -302342 -74305 65758 -113759
15109A66472A5337J28687J10353H2301J20237h3222A97519H3539L10597A71843
$$ 166472 15337 144024 254377 82301 202538 -83222 197519 83539 394136 171843
15098A66681m3608K12756J45165D6864c9737A00272C4054L38173D3247a02475
$$ 166681 123073 335829 480994 46864 -39737 100272 34054 372227 43247 -102475
15087A50802L55903r5583A027J34115c94D04954g7455K4916D39915A37366C9113
$$ 150802 506705 411122 1027 135142 -394 404954 -77455 -52539 439915 137366 39113
15075B41739r8171a22986m3090A06081L2297a68919B21290A6136J02967K92062
$$ 241739 143568 -122986 -166076 106081 138378 -168919 221290 16136 119103 411165
15065D11165j84917B6517K70642C3286K95010d7830j6715B85362F9570a2820A12248
$$ 411165 226248 26517 297159 33286 328296 -47830 -64545 285362 69570 -12820 112248
15053A06708J77179J48366A9057J44701R5974A15018e0362B9980J01609b35592
$$ 106708 283887 432253 19057 163758 259732 115018 -50362 29980 131589 -235592
15042C5764L35085J47077A90078J15443j45386M4827K00742r5256J00202a25920
$$ 35764 370849 517926 190078 305521 160135 204962 405704 310448 410650 -125920
15031C15333q4127b5499q7027B72137J1709l9030E3603J47241e913D79534B39334
$$ 315333 231206 -25499 -112526 272137 283846 244816 53603 200844 -5913 479534 239334
15019E488a71988i05l4878j38000A65530b98788B56263J93676d1368B14271K97042
$$ 5488 -171988 -905 -35783 -173783 165530 -298788 256263 449939 -41368 214271 511313
15008E11313I0027M005J49776A15577r3P3827J23502l7330J8632j41550K09357
$$ 511313 90027 94032 243808 115577 115484 189311 312813 275483 294115 152565 361922
14997C61922a42057A55401n48m8613E915P7906J21387M08215a09768k2733H3090
$$ 361922 -142057 155401 154853 106240 5915 83821 205208 613423 -109768 -132501 83090
14985G2130N532J38615E2190i2718B84781n6230B0123K7875J98688e8465B90303
$$ 72130 77662 216277 52190 -92718 284781 228551 20123 47998 246686 -58465 290303
14973a32950D26529r2242A03340C4657L67634A51248K44196A36443a2698D48595
$$ -132950 426529 334287 103340 34657 402291 151248 395444 136443 -12698 448595
14962C72657p8589A20009D7581J27289f7762B12216J78455A68107n1947J55334
$$ 372657 294068 120009 47581 174870 -67762 212216 390671 168107 116160 271494
14952B71494a25555B21460a73256C93637J56357A40288P7639D9550K03875K7804
$$ 271494 -125555 221460 -173256 393637 549994 140288 217927 49550 253425 281229
14942B81229r2514K6572J45345P838j61301R3875h3550E64717A54545L676l8153
$$ 281229 188715 215287 360632 368470 207169 301044 -83550 564717 154545 158221 120068
14931A20068O18733C01427j5454q0725n0486L06181Q4157G1654J63817n6096L94366
$$ 120068 738801 301427 285973 205248 154762 460943 545100 71654 235471 179375 573741
14920E73741B14708K31918j28228r2974h7866C38959J43808A53154J4837J93612
$$ 573741 214708 446626 318398 225424 -87866 338959 482767 153154 167991 361603
14910C61603c387C43244C8375L03929J55896k45580L93413j99410H6678K15890
$$ 361603 -3387 343244 38375 342304 498200 252620 646033 446623 86678 302568
14900C02568K11899L04187B22397L35623j02805p8274A07441K37395k5818E0471
$$ 302568 514467 818654 222397 558020 455215 376941 107441 344836 319018 50471
14889C45337K35698B66564M29055l09786A77770Q6481K4475j04660K71192J51556
$$ 345337 581035 266564 695619 385833 177770 264251 288726 184066 455258 606814
14879F06814B29302N1742L9313M66250j81001P308j27568k16530l0683J94981
$$ 606814 229302 281044 320357 786607 605606 612914 485346 268816 238133 433114
14869D33114j07981K686a08602A14658M82997B87881L21070j11598j42264K51094
$$ 433114 325133 327819 -108602 114658 597655 287881 608951 497353 355089 606183
14859F06183D1842L25972K22807j57848M8367k8321A66639M51072k62370j9333
$$ 606183 41842 367814 590621 432773 481140 452819 166639 617711 355341 336008
14849C36008J44560B23042J55387M3616R584P8735k21824n0611I6145K17618J60532
$$ 336008 480568 223042 378429 422045 431629 510364 288540 237929 96145 313763 474295
14838D74295n6107j8581K05009k79149K18794k02307J98418L08703k1877D08547
$$ 474295 418188 399607 604616 325467 544261 341954 540372 849075 827198 408547
14827D73603j03082q2675k3528K87977o6893j05124j6111J05146J09870A55668
$$ 473603 370521 287846 264318 552295 485402 380278 364167 469313 579183 155668
14816D85196J83849l18426P9039A69243L77233L1456k20610L3883K40836O807
$$ 485196 669045 350619 429658 169243 546476 577932 357322 391205 632041 638848
14806F38848j57609j09181L25873l98k24454R6043B43773L87262k71246L56478
$$ 638848 481239 372058 697931 697533 473079 569122 243773 631035 359789 716267
14796G16267k62167J46172O6043B37747J45230P8212q025J7086m1105L54244k18128
$$ 716267 454100 600272 666315 237747 382977 461189 453164 470250 429145 783389 565261
14785E65261k6334m4484K15717k01505J76470l3837P6021k86822o8972J88477
$$ 565261 538927 494443 710160 508655 685125 651288 727309 440487 371515 559992
14775E59992K30297j95616k37835K10548K33311B87202J08046j40110K90477O2282
$$ 559992 790289 594673 356838 567386 800697 287202 395248 255138 545615 607897
14765F07897J22802j06889p0265p2434j51420J97188j07019J63113J09228B86666
$$ 607897 730699 623810 553545 481111 329691 526879 419860 582973 692201 286666
14754F36979k05041j5267Q1885L14849j28989l0609Q7649j87817j16266R0393
$$ 636979 431938 416671 498556 813405 684416 653807 741456 553639 437373 527766
14744E27766K00114q1231J70910j93945p7311J33317N3530K9730l46416K23516
$$ 527766 727880 646649 817559 623614 546303 679620 733150 762880 416464 639980
14734F39980o4297n2927L31355J5862C39447K31811N8859P6347J52393N1053l05792
$$ 639980 575683 522756 854111 869973 339447 571258 630117 706464 858857 909910 604118
14723F04118C00370M51084j95584q016M14325Q2151k43220j13718K09558m5287
$$ 604118 300370 751454 555870 547854 962179 1044330 801110 687392 896950 851663
14713H51663k87759J82451Q2578k65210K20077j39488J38553j89081K28126p7507
$$ 851663 563904 746355 828933 563723 783800 644312 782865 593784 821910 744403
14703G44403j93487L54621j46405o382J30007j07006j85789M44934j5715n0896
$$ 744403 550916 905537 759132 752750 882757 775751 589962 1034896 1019181 968285
14693I68285j03949j7551l07031L10259l8023r4073P6525o1705j11915k15562
$$ 968285 864336 846785 539754 850013 811990 717917 794442 732737 620822 405260
14683D05260L78287j20922M36530j10268M7571l87643l4039M66112k94286L69876
$$ 405260 783547 662625 1099155 988887 1036458 648815 614776 1080888 786602 1156478
14673A156478k89772k7541r8741j5710l9249L45057n516k54405L85427j28547
$$ 1156478 866706 839165 740424 724714 685465 1030522 1025006 770601 1156028 1027481
14663A027481q0103k53766K87509M4780o7082j59609Q436N6302K45516j68113
$$ 1027481 947378 693612 981121 1025901 958819 799210 807646 863948 1109464 941351
14653I41351J05163j75104J83867j29380K21891k99914R2494L50131k26137R6766
$$ 941351 1046514 871410 1055277 925897 1147788 847874 940368 1290499 1064362 1161128
14643A161128k72114M69188k75159O5715j06092K42968l26925L19447k05446k9016
$$ 1161128 889014 1358202 1083043 1148758 1042666 1285634 958709 1278156 1072710 1043694
14633A043694L93854J14617l24041L0735K42308l19115M0300J7298j37451N5195
$$ 1043694 1437548 1552165 1228124 1258859 1501167 1182052 1222352 1239650 1102199 1157394
14623A157394K15100j30948J66387l11892J54892m9109K40197n32011N69851k8403
$$ 1157394 1372494 1241546 1407933 1096041 1250933 1201824 1442021 910010 1479861 1451458
14613A451458j60934j04002J34990m4416r7647Q7865J15743p8847K93376m416
$$ 1451458 1290524 1186522 1321512 1277096 1179449 1267314 1383057 1304210 1597586 1593170
14603A593170n62716J92799J83928L65427l00371K16636j57460j88423j5715R0759
$$ 1593170 1030454 1223253 1407181 1772608 1472237 1688873 1531413 1342990 1327275 1418034
14593A418034L34115k7232q8068j0338M0495k4306O2709K81526l72015p28K00114
$$ 1418034 1752149 1724917 1636849 1626511 1667006 1642700 1705409 1986935 1614920 1614192 1814306
14582A814306j41232J22987R8929J36595j26516j39066M8929j27137K76589k23798
$$ 1814306 1673074 1796061 1894990 2031585 1905069 1766003 1814932 1687795 1964384 1740586
14572A740586K28813K74899m03644O71886k48825j05967j08058L23466M6864j35528
$$ 1740586 1969399 2244298 1840654 2512540 2263715 2157748 2049690 2373156 2420020 2284492
14562B284492O0235l7280M34803J20308j77245Q3607K08146L57040k73652N87542
$$ 2284492 2344727 2307447 2742250 2862558 2685313 2768920 2977066 3334106 3060454 3647996
14552C647996n5778J160635P67720K188165M189507Q602250K0083488Q30753A7870878
$$ 3647996 3592218 4752853 5520573 7708738 11898245 20500495 40583983 41414736 17870878
14542H714886C748163j290687o24063J87452m39467K30050q2725K50493J00619
$$ 8714886 3748163 2457476 1833413 2020865 1581398 1811448 1728723 1979216 2079835
14533B079835R0914m64285n0697J87948L47163k08132k45206L91199J17412j84988
$$ 2079835 2170749 1706464 1655767 1843715 2190878 1982746 1737540 2128739 2246151 2061163
14523B061163J73351l61942L30625J74017m5919Q5519O8773m0356J14041j0413
$$ 2061163 2234514 1872572 2203197 2377214 2331295 2416814 2485587 2445231 2559272 2548859
14513B548859l80255L43557L01140k53741j93854K31165r5563K30297J42782J31803
$$ 2548859 2168604 2512161 2813301 2559560 2365706 2596871 2501308 2731605 2874387 3006190
14503C006190j17243m25788L46167j178K25594l96784J93422Q2245K1554J49260
$$ 3006190 2888947 2463159 2809326 2808148 3033742 2636958 2830380 2912625 2934179 3083439
14493C083439Q7247K16837k31976J4827l84396K90894J02195K41842K3979j88537
$$ 3083439 3170686 3387523 3155547 3170374 2785978 3076872 3179067 3420909 3444888 3256351
14483C256351L53004j02784Q4980j25471M83046l37494l6953J57667J30363J3084
$$ 3256351 3609355 3506571 3591551 3466080 3949126 3611632 3574679 3732346 3862709 3875793
14473C875793L13758k94619k2845j27312L52525j00756j4864K57752O3422K44774
$$ 3875793 4189551 3894932 3872087 3744775 4097300 3996544 3981680 4239432 4302854 4547628
14463D547628j48420j72721Q9437K42040N6006j59906K50317Q6700J94206J79587
$$ 4547628 4399208 4226487 4315924 4557964 4613970 4454064 4704381 4791081 4985287 5164874
14453E164874l73881j9327K95139k75526K51330K15377k76630N98650l72286M7383
$$ 5164874 4790993 4771666 5066805 4791279 5042609 5257986 4981356 5580006 5207720 5255103
14443E255103L64661j29012J09364K50170j44914J07990J20426L21046k36891
$$ 5255103 5619764 5490752 5600116 5850286 5705372 5813362 5933788 6254834 6017943
14434F017943k4048M53351o6554J48750J09599j62614J22255J88627K3819P0419
$$ 6017943 5993895 6447246 6380692 6529442 6639041 6476427 6598682 6787309 6811128 6881547
14424F881547L06041r9730P6444L51430K599N0731K02797k09486M69194k15327
$$ 6881547 7187588 7087858 7164302 7515732 7518331 7569062 7771859 7562373 8031567 7816240
14414G816240J31161L4496N65014k49431L32070N10653m22534K66153M0188L25015
$$ 7816240 7947401 7981897 8546911 8297480 8629550 9140203 8717669 8983822 9024010 9349025
14404I349025L63097l58254K97853M73811p5504J95767N3857K31946M5778L74650
$$ 9349025 9712122 9353868 9651721 10125532 10050028 10245795 10299652 10531598 10577376 10952026
14394A0952026K82871N3758j08607O4438O99017J78355P5521o2267M90489J88318
$$ 10952026 11234897 11288655 11180048 11244486 11943503 12121858 12197379 12135112 12625601 12813919
14384A2813919N1256N49563K37107K05633J25683R7277L05217N86415L1606L86400
$$ 12813919 12865175 13414738 13651845 13857478 13983161 14080438 14385655 14972070 15003676 15390076
14374A5390076L67840n7648O72385K71415P05250k45554P67216M21354K08520
$$ 15390076 15757916 15700268 16372653 16644068 17349318 17103764 17870980 18292334 18500854
14365A8500854J62121O91723Q5321O81130L52511K33653O07925Q69808L06048
$$ 18500854 18662975 19354698 19440019 20121149 20473660 20707313 21315238 22185046 22491094
14356B2491094N99032O06718L04585N17677P56357N80071N35878O73167R02835
$$ 22491094 23090126 23696844 24001429 24519106 25275463 25855534 26391412 27064579 27967414
14347B7967414P52529M01263J047349R42878N15683J224128Q27229Q71053J030735
$$ 27967414 28719943 29121206 30168555 31111433 31627116 32851244 33678473 34549526 35580261
14338C5580261R36025J012254R35947J001106J281349J235800J237496J164826
$$ 35580261 36516286 37528540 38464487 39465593 40746942 41982742 43220238 44385064
14330D4385064J637104J546467J451116J695415J605175J633711K288584J538568
$$ 44385064 46022168 47568635 49019751 50715166 52320341 53954052 56242636 57781204
14322E7781204K230202K080548K118952K579703K465491K381030K941981K922629
$$ 57781204 60011406 62091954 64210906 66790609 69256100 71637130 74579111 77501740
14314G7501740L021353K877324L399435L697192L443559M291298M121327M527342
$$ 77501740 80523093 83400417 86799852 90497044 93940603 98231901 102353228 106880570
14306A06880570M636730M912051N367668N700197N906683N972222O787993P354519
$$ 106880570 111517300 116429351 121797019 127497216 133403899 139376121 146164114 153518633
14298A53518633P197171Q197584Q389614Q689314R519817R995660J0515757J0995484
$$ 153518633 160715804 168913388 177303002 185992316 195512133 205507793 216023550 227019034
14290B27019034J1638378J2019119J2752069J3195020J3507927J4160303J4661476
$$ 227019034 238657412 250676531 263428600 276623620 290131547 304291850 318953326
14283C18953326J4461697J4611186J4573519J4272356J3732874J3082887J2245936
$$ 318953326 333415023 348026209 362599728 376872084 390604958 403687845 415933781
14276D15933781J0988364Q805706P283652L339631j212335o97885r03319j284996
$$ 415933781 426922145 435727851 443011503 446351134 445138799 444440914 443537595 442252599
14268D42252599n771979n941171q433110j0486058j2626721j3929015j4368606
$$ 442252599 436480620 430539449 422106339 411620281 398993560 385064545 370695939
14261C70695939j4888165j5591382j5193368j5532441j4981716j4556204j4286321
$$ 370695939 355807774 340216392 325023024 309490583 294508867 279952663 265666342
14254B65666342j2434375j3008033j1975791j1892630j1262959j0068132j0153291
$$ 265666342 253231967 240223934 228248143 216355513 205092554 195024422 184871131
14247A84871131q882289q839957q074014p405521p491966o719724o541273n919192
$$ 184871131 175988842 167148885 159074871 151669350 144177384 137457660 130916387 124997195
14239A24997195n790791n019886n090978m733155m318047m664123l787380l465926
$$ 124997195 119206404 114186518 109095540 104362385 100044338 95380215 91592835 88126909
14231H8126909l340089l154985l391874l023659l087446k515306k620526k624104
$$ 88126909 84786820 81631835 78239961 75216302 72128856 69613550 66993024 64368920
14223F4368920j976966k021410k232210j960863j670503j785546j897672j433274
$$ 64368920 62391954 60370544 58138334 56177471 54506968 52721422 50823750 49390476
14215D9390476j672547j137695j709674j088494j635435j536222j221375o42000
$$ 49390476 47717929 46580234 44870560 43782066 42146631 40610409 39389034 38747034
14207C8747034p10129p82484j335448j476625o19742q24884r83585m56044q76067
$$ 38747034 38036905 37254421 35918973 34442348 33822606 32997722 32014137 31558093 30682026
14198C0682026j095321m83785r11832p96329m30422p40359m91229j029761l58645
$$ 30682026 29586705 29102920 28191088 27394759 26964337 26223978 25732749 24702988 24344343
14189B4344343m55882r40293k01599q73785k22449n79949m26048n94862j09966
$$ 24344343 23888461 22948168 22746569 21872784 21650335 21070386 20644338 20049476 19939510
14180A9939510m30884p05232l22250j18434l53245n76050J80066p23238n17185
$$ 19939510 19508626 18803394 18481144 18362710 18009465 17433415 17613481 16890243 16373058
14171A6373058j13785l8768n45357m70556l11490l03194j99406l361n73747k86269
$$ 16373058 16259273 16220505 15675148 15204592 14893102 14589908 14390502 14387141 13813394 13527125
14161A3527125R2146m90905J49951m37159p64759L43331j25600m51324j82098
$$ 13527125 13619271 13128366 13278317 12841158 12076399 12419730 12294130 11842806 11660708
14152A1660708J27450p25259M7798N2694l41365j00526l53755j5951p0345j36568
$$ 11660708 11788158 11062899 11110697 11163391 10822026 10721500 10367745 10351794 10281449 10144881
14142A0144881k10907j97522p6970N980k62853n3467m39109J50475m26408k90314
$$ 10144881 9933974 9736452 9659482 9665462 9402609 9349142 8910033 9060508 8634100 8343786
14132H343786J52619l1031K53315l66233k79991l03842J05014k28410k8390l1398
$$ 8343786 8496405 8465374 8718689 8352456 8072465 7768623 7873637 7645227 7616837 7585439
14122G585439L9522l77714l11652J67672j19946N7890j65655k10384k2042m0998
$$ 7585439 7624961 7247247 6935595 7103267 6983321 7041211 6875556 6665172 6643130 6602132
14112F602132j43152K20528q844l78862l39845P2798J55343o7637k54075j28295
$$ 6602132 6458980 6679508 6670664 6291802 5951957 6024755 6180098 6112461 5858386 5730091
14102E730091O8239j2242k96449P0046r9330j36723K17451j92589l46192K97891
$$ 5730091 5798330 5786088 5489639 5559685 5460355 5323632 5541083 5348494 5002302 5300193
14092E300193K02957l38489q49l30759K18614j28923j61232L4718q7535l9078
$$ 5300193 5503150 5164661 5163812 4833053 5051667 4922744 4761512 4796230 4708695 4669617
14082D669617Q0888j56594P6612l0382R0572l97838o631l03380J78694K464p0325
$$ 4669617 4750505 4593911 4670523 4640141 4730713 4332875 4326244 4022864 4201558 4204022 4133697
14071D133697J18804j78868n2473O9863l4392j60441m6721L34J36801j38561K55793
$$ 4133697 4252501 4073633 4021160 4091023 4056631 3896190 3849469 3849803 3986604 3848043 4103836
14060D103836m13940O9315r1797q0393Q3629J70548m49203j39880K21151j57270
$$ 4103836 3689896 3759211 3667414 3587021 3670650 3841198 3391995 3252115 3473266 3315996
14050C315996P5386J17897r5389j95572k14784L89825k81893r7084k8248K96257
$$ 3315996 3391382 3509279 3413890 3218318 3003534 3393359 3111466 3014382 2986134 3282391
14040C282391j8286j69095P9073k60530j59995Q151O0456l6376J51669M5941K2613
$$ 3282391 3264105 3095010 3174083 2913553 2753558 2761709 2822165 2785789 2937458 2983399 3006012
14029C006012m15206J34001J8463N1399m6564k5667l53081K05321j48049q5388
$$ 3006012 2590806 2724807 2743270 2794669 2748105 2722438 2369357 2574678 2426629 2341241
14019B341241k8182K45442j25841m7165K35680j55448k15792L91223l83034j53563
$$ 2341241 2313059 2558501 2432660 2385495 2621175 2465727 2249935 2641158 2258124 2104561
14009B104561O2225M84794m01653L2020n63347N71838R7911J29662p31096j12768
$$ 2104561 2166786 2651580 2249927 2281947 1718600 2290438 2388349 2518011 1786915 1674147
13999A674147K68299J24605K09397l69948J14154Q1758J35295j61181J06151O30704
$$ 1674147 1942446 2067051 2276448 1906500 2020654 2102412 2237707 2076526 2182677 2813381
13989B813381R57527L171324O896627J9243578J1269677k2087809A0951680l909303
$$ 2813381 3770908 6942232 13838859 33082437 44352114 22264305 10951680 7042377
13981G042377k027588o51117r10208j86326m40262J84915k28254j81426M8525
$$ 7042377 5014789 4363672 3453464 3267138 2826876 3011791 2783537 2602111 2650636
13972B650636j72790J02692R4052k29653m21569P4886J04940N1682j46516m7182
$$ 2650636 2477846 2580538 2674590 2444937 2023368 2098254 2203194 2254876 2108360 2061178
13962B061178r6046J22295q1398Q5744l39332j68990M16124J77456n26479M53836
$$ 2061178 1965132 2087427 2006029 2091773 1752441 1583451 1999575 2177031 1650552 2104388
13952B104388j79612o7292n4424j04752J82493l39270M95734k60822m3161o6295
$$ 2104388 1924776 1857484 1803060 1698308 1880801 1541531 2037265 1776443 1733282 1666987
13942A666987J30771J97593k97705K83919l36339j7337M5700k30667L84966m00771
$$ 1666987 1797758 1995351 1697646 1981565 1645226 1627889 1673589 1442922 1827888 1427117
13932A427117j25573O24407n97722K99930L96710n53132o1139J20298k48041L27227
$$ 1427117 1301544 1925951 1328229 1628159 2024869 1471737 1410598 1530896 1282855 1610082
13922A610082j11040k50181N9721K60060j64779R3319K30263l35258L33760o6943
$$ 1610082 1499042 1248861 1308582 1568642 1403863 1497182 1727445 1392187 1725947 1659004
13912A659004k82606j33655J95079K88107k34032J37127j43336J7563r8059p5238
$$ 1659004 1376398 1242743 1437822 1725929 1491897 1629024 1485688 1503251 1405192 1329954
13902A329954k40136K48328J04130k02126K17714l66976L86001j70775k05597
$$ 1329954 1089818 1338146 1442276 1240150 1457864 1090888 1476889 1306114 1100517
13893A100517N1877L80690j13845l32872K12895j47018K98616k06240P5195k90668
$$ 1100517 1152394 1533084 1419239 1086367 1299262 1152244 1450860 1244620 1319815 1029147
13883A029147P9525k1662K74243j80591J1250q1208K62569j94630J79830l09474
$$ 1029147 1108672 1087010 1361253 1180662 1191912 1110704 1373273 1178643 1358473 1048999
13873A048999k47920M14945k01840J45745j05160q6906L37476M870l87343O72192
$$ 1048999 801079 1216024 1014184 1159929 1054769 967863 1305339 1310209 922866 1595058
13863A595058o34917R770Q7568j36368K78310j1673l68124K1938j96802N74688
$$ 1595058 960141 969911 1057479 921111 1199421 1187748 819624 841562 644760 1219448
13853A219448R7873n94565J64006p1328J18613J99925j35656J2301p4180O7683
$$ 1219448 1317321 722756 886762 815434 934047 1133972 998316 1010617 936437 1004120
13843A004120m69152O96511n35447M48266J711l05644L37584m49713L40599R0770
$$ 1004120 534968 1231479 696032 1144298 1146009 840365 1177949 728236 1068835 1159605
13833A159605k46468J40901j46765R8034p7244l18114J76130P3992K35003l8575
$$ 1159605 913137 1054038 907273 1005307 928063 609949 786079 860071 1095074 1056499
13823A056499j2577j90861K31760C62529L69661M66084n40883R0125N6148K2631
$$ 1056499 1043922 853061 1084821 362529 732190 1198274 657391 747516 803664 826295
13813H26295k18781J0953K50196D02808J2738M22702C67061M49462j41805N7130
$$ 826295 607514 618467 868663 402808 415546 838248 367061 816523 674718 731848
13803G31848O7729l27889M49515J29678k99972J73230m08895O2494B75592N88527
$$ 731848 799577 471688 921203 1050881 750909 924139 515244 577738 275592 864119
13793H64119r5513p8852J66025D21289J19744K34871j33450p0241L22211k39345
$$ 864119 768606 689754 855779 421289 541033 775904 642454 572213 894424 655079
13783F55079J98932q194l79414L86884D14308J03589K45211j28009K10374J2827
$$ 655079 854011 845817 466403 853287 414308 517897 763108 635099 845473 858300
13773H58300j59432J44576j48822Q9628j90010Q2937K7649j91181J91459k52015
$$ 858300 698868 843444 694622 784250 594240 677177 704826 513645 705104 453089
13763D53089L07690Q1139l54487R4198J58107k28106K49190j9048k16456L84514
$$ 453089 760779 841918 487431 581629 739736 511630 760820 741772 525316 909830
13753I09830D47443j08916J24738J16189J35650l03934M21320l40144j55297N4787
$$ 909830 447443 338527 463265 579454 715104 411170 832490 492346 337049 391836
13743C91836Q9411J07824L3825k54882K26569J03478j82416M0014k06294J45060
$$ 391836 481247 589071 622896 368014 594583 698061 515645 555659 349365 494425
13733D94425K24638j10663K6486k01044R227p5987L83099k83236L1911J77906
$$ 494425 719063 608400 634886 433842 443069 367082 750181 466945 498856 676762
13723F76762j69030J71303j37997P634J0531r1598k10474K86159k2505o317R2312
$$ 676762 507732 679035 541038 548672 559203 467605 257131 543290 520785 514468 606780
13712F06780k2276K68151k89088K3429p4979j35222L52580k97553K49801J24683
$$ 606780 584504 852655 563567 586996 512017 376795 729375 431822 681623 806306
13702H06306C35628k2626K67826p3597j78195K02597j06297J2387P0008J5802
$$ 806306 335628 313002 580828 507231 329036 531633 425336 437723 507731 523533
13692E23533J98872C41143J65537k2597Q8643K33027j88257A83887M10638K7909
$$ 523533 722405 341143 506680 484083 572726 805753 617496 183887 594525 622434
13682F22434l1930M3115B18433J64253J64318m6229M2233j51041j60015M59826
$$ 622434 590504 633619 218433 382686 547004 500775 543008 391967 231952 691778
13672F91778j00024A73277J93318r5536M5849J42001A08095M87600k28034k0263
$$ 691778 591754 173277 366595 271059 316908 458909 108095 595695 367661 347398
13662C47398O9746J65499j44639j05350L31820O469k21416R8541j83584P0849
$$ 347398 417144 582643 438004 332654 664474 670943 449527 548068 364484 435333
13652D35333N9180J39202L1551k51376K17664B48650M80026j73433j71505o7979
$$ 435333 494513 633715 665266 413890 631554 248650 728676 555243 383738 315759
13642C15759j14794L5004L05574j57718K78898l25464m0749P461J96762N881j70061
$$ 315759 200965 235969 541543 383825 662723 337259 296510 303971 500733 506614 336553
13631C36553J8888j52706k8694K86629J70673B90461O7091K47413B25890j3666
$$ 336553 355441 202735 174041 460670 631343 290461 357552 604965 225890 212224
13621B12224O0114N8350q2992J24519R1440j28532p7888M2497A06085L47420P7330
$$ 212224 272338 330688 247696 372215 463655 335123 257235 299732 106085 453505 530835
13610E30835B24519k8705K90786k29117J2973a1464F49418B68859M15068k57770
$$ 530835 224519 195814 486600 257483 270456 -11464 649418 268859 683927 426157
13600D26157J47907B67506J10410j13019J71409j64819J19686l5341K5036J79609
$$ 426157 574064 267506 377916 264897 436306 271487 391173 355832 380868 560477
13590E60477j715i0865F60088A38071L87430j62161j9795m2306j45208A3941N74575
$$ 560477 558762 -90865 660088 138071 525501 363340 343545 301239 156031 13941 588516
13579E88516k59462j40826I1739M24377j54380l046K9717L57619e0626D33289
$$ 588516 329054 188228 91739 516116 361736 358690 388407 746026 -50626 433289
13568B22354J88359A84090J50041L3374j41891J6838p2926P3868Q6108K98364
$$ 222354 410713 184090 334131 367505 225614 242452 169526 243394 329502 627866
13558F27866j54839r5736r7506C5911K27573P3879l9j35446K12886B07249K5087
$$ 627866 473027 377291 279785 35911 263484 337363 337324 201878 414764 207249 232336
13547B32336E3703K48151j26806J57481q878J90202M3023k43968l1782J03208
$$ 232336 53703 301854 175048 332529 323651 513853 556876 312908 281126 384334
13537C84334j21527J53004j02696j54525K59657A70893K00246R7631j20118A56254
$$ 384334 262807 415811 313115 158590 418247 170893 371139 468770 348652 156254
13526A29123M12755k46882j2870m279j4139l6104J14613L4458A16321g967I9200
$$ 129123 541878 294996 282126 277847 263708 227604 342217 376675 116321 -7967 99200
13514C04334l8371o0131K52399f5154A25721K55894D40M32273k8534p9110H3072
$$ 304334 265963 205832 458231 -65154 125721 381615 440 432713 404179 325069 83072
13502B10920H5188k7843K29068Q2219j49511J81570I1248J64727o56K61672k36115
$$ 210920 85188 57345 286413 368632 219121 400691 91248 255975 255319 516991 280876
13491B80876i363A99221K65227B05743m3739R5461R6180A36063P4222I3021K6906
$$ 280876 -9363 199221 464448 205743 162004 257465 353645 136063 210285 93021 119927
13480A19927A2084J03053J079L67538B18844a24430C75573m597A22764N6261L41455
$$ 119927 12084 115137 116216 483754 218844 -124430 375573 370976 122764 179025 520480
13469E20480A62744a05096D84574B20840B5852R0167H934K69770j30965K57756
$$ 520480 162744 -105096 484574 220840 25852 116019 8934 278704 147739 405495
13459D05495A16803k020K2825l3561J19302M9812A7201L14354C6437d0799F8333
$$ 405495 116803 114783 137608 104047 223349 273161 17201 331555 36437 -40799 68333
13447B97759j09567L64524f2677B97477Q0307A39835D9680L92216j53416O0864
$$ 297759 188192 552716 -62677 297477 377784 139835 49680 441896 288480 349344
13437C49344A52731L5010q5262K13683j56389J21359k2805J4473J21613c4699
$$ 349344 152731 187741 102479 316162 159773 281132 258327 272800 394413 -34699
13426D24531j56819K21357k24711K54728A88392c7032A83863r977P6057Q2668
$$ 424531 267712 489069 264358 519086 188392 -37032 183863 173886 249943 332611
13416C32611J4759A63132I781K37248j17475K36038j20994E4609J17882R4984
$$ 332611 347370 163132 9781 247029 129554 365592 244598 54609 172491 267475
13406B67475b1220E63115B08055K97982A70342J16958A38544c77897C8053J52606
$$ 267475 -21220 563115 208055 506037 170342 287300 138544 -377897 38053 190659
13396A90659K01068I8625K59347H494K97539A1625K1348J14726J38800J25189
$$ 190659 391727 98625 357972 8494 306033 11625 32973 147699 286499 411688
13386D11688M9914A30680L24200n9693j08391A41255J38978d1286B60577M6578
$$ 411688 461602 130680 454880 395187 286796 141255 280233 -41286 260577 307155
13376C07155j29230J15064e1494A71904f258F5320L56505k01954R975Q6749l807
$$ 307155 177925 292989 -51494 171904 -6258 65320 421825 219871 229846 316595 312788
13365C12788K6313j13611O9804l7491r0557a08124A83787R9364N827P0055F8160
$$ 312788 339101 225490 295294 257803 167246 -108124 183787 283151 288978 359033 68160
13353D55319B00406K10613c2896j55130D48827A69647J65721j00873k51R0879
$$ 455319 200406 411019 -32896 -188026 448827 169647 335368 234495 234244 325123
13343C25123J37558j55602A34659D1667C719L67843A57058M4798F6780K13407
$$ 325123 462681 307079 134659 41667 3719 371562 157058 201856 66780 280187
13333B80187A13804C3918a58664d5648C66813k0099a70576A68786L8243m7441
$$ 280187 113804 33918 -158664 -45648 366813 346714 -170576 168786 207029 159588
13323A59588n8354m2213J23352i595C83634j68253J33851A38460a466B58941j3099
$$ 159588 101234 59021 182373 -9595 383634 215381 349232 138460 -1466 258941 245842
13312B45842R7656B047N84494j61599o357e6522D0011J12129N9541E7052R4609
$$ 245842 343498 2047 586541 424942 418585 -56522 40011 152140 211681 57052 151661
13301A51661N2072r4528L6509E5461Q0569N4648c93381D09773j80561o5257j5116
$$ 151661 203733 109205 145714 55461 136030 190678 -393381 409773 229212 163955 148839
13290A48839a31659E65137B38670j03880g276l1345B9957a60565B67266e3333
$$ 148839 -131659 565137 238670 134790 -7276 -38621 29957 -160565 267266 -53333
13279B88121Q4424I4464g0215A49100a59114B62422c3739B84794Q988D8597A4437
$$ 288121 372545 94464 -70215 149100 -159114 262422 -33739 284794 293782 48597 14437
13267C29997G6064j64K20310L2834c19650B23229f2848K1824G5996J69223G8144
$$ 329997 76064 75900 296210 329044 -319650 223229 -62848 -41024 75996 245219 78144
13255b2852j38347A65065m3232R1726r2817N9370K32605D6483b3089A34279a17883
$$ -22852 -161199 165065 121833 213559 120742 180112 412717 46483 -23089 134279 -117883
13243G3852a23941A49685K98661K28646B63626j3296n3124J07065A13277M1973
$$ 73852 -123941 149685 448346 676992 263626 250330 197206 304271 113277 155250
13233A55250P0728l8170c7286n9752k8771A9908P0098d35956J52171A04749b3800
$$ 155250 225978 187808 -37286 -97038 -125809 19908 90006 -435956 -283785 104749 -23800
13221A1569m132b4318C06767d7038l9075B18480J79696J60756D8757J44190q1328
$$ 11569 7437 -24318 306767 -47038 -86113 218480 398176 558932 48757 192947 111619
13210A11619K22824E325K6412N32377A31287R1240D1945J71039H1845L7904J843
$$ 111619 334443 5325 31737 564114 131287 222527 41945 212984 81845 119749 121592
13199A21592K32685j5477H5493J08995D8102e2746A28992n1939K80756a59461
$$ 121592 354277 338800 85493 194488 48102 -52746 128992 77053 357809 -159461
13188A56098J29369f0342J8368l0462B30641l9311R0754C875c14956A01581J36869
$$ 156098 285467 -60342 -41974 -72436 230641 191330 282084 3875 -314956 101581 238450
13177B38450M7180e5777A78188a05896A77791K0666H3064b125j02918j30668b6518
$$ 238450 285630 -55777 178188 -105896 177791 198457 83064 -2125 -105043 -235711 -26518
13165I1208d8298A71110l659a10641C06366E7735c18652B8259j1021K96400B0586
$$ 91208 -48298 171110 167451 -110641 306366 57735 -318652 28259 17238 313638 20586
13153C24865a26665c0251G7472R4909m072c1443j10165o7005f3240E6241K28057
$$ 324865 -126665 -30251 77472 172381 168309 -31443 -141608 -208613 -63240 56241 284298
13142B84298b34952b6161B03051a24516b8582A61196j8256k6173a9628k25160
$$ 284298 -234952 -26161 203051 -124516 -28582 161196 142940 116767 -19628 -244788
13132b44788j23312A2767O9334a34431C7731K5136J45351a05116B45980h9036
$$ -244788 -368100 12767 82101 -134431 37731 62867 208218 -105116 245980 -89036
13121d3524D6670e9086B24455k6333F0838N840K75880f558m0448j86827b3901
$$ -43524 46670 -59086 224455 198122 60838 66678 342558 -6558 -47006 -233833 -23901
13109a67984J921B08532p3786b4244D42177i4118B47915A8907J33090f0084p4880
$$ -167984 -166063 208532 134746 -24244 442177 -94118 247915 18907 151997 -60084 -134964
13098a34964D08607B9528b39075A16594N2301J611L5484J14818a02531A45954
$$ -134964 408607 29528 -239075 116594 168895 170506 205990 320808 -102531 145954
13087C00733n1095a12154A69079i2856n0392C0432c5951D25285A71905a83143
$$ 300733 249638 -112154 169079 -92856 -143248 30432 -35951 425285 171905 -183143
13076A90196g194A20548c12312J16485C01616F2302J4899L8852J59883q6155r018
$$ 190196 -7194 120548 -312312 -195827 301616 62302 77201 116053 275936 189781 180763
13065A80763o1195H178M7968J86422A0293M23459k04603d1515A91168a47106E5591
$$ 180763 119568 8178 56146 242568 10293 433752 229149 -41515 191168 -147106 55591
13053A79155k4075a10505A52316f1002A97847f5249C9190f1498C09353o442a62486
$$ 179155 155080 -110505 152316 -61002 197847 -65249 39190 -61498 309353 302911 -162486
13041B05691J87379E0616J21379J65076g4454C64755j11766o9919O5532H7733
$$ 205691 393070 50616 171995 337071 -74454 364755 252989 183070 248602 87733
13030B5248j872J72089I7706K5587j5334e0552B94595a4333j7146C30020G6922
$$ 25248 23376 195465 97706 123293 107959 -50552 294595 -14333 -31479 330020 76922
13018B19178P4161b31883I8363K82760H1552M4067k1710O8184C6352J82447P863
$$ 219178 293339 -231883 98363 381123 81552 125619 103909 172093 36352 218799 226662
13007B26662d3581j6082j57034i5454j23272E9263H020P7959a32290f608l7883
$$ 226662 -43581 -59663 -216697 -95454 -218726 59263 8020 85979 -132290 -6608 -44491
12996d4491Q39J7281H4271K9454i2447q7877A97200g2248H0717J2054f679B5430
$$ -44491 -43652 -26371 84271 113725 -92447 -180324 197200 -72248 80717 92771 -6679 25430
12983A80516c01517a36042f5400j02479g7093L4424B50246P5808A59119O3917
$$ 180516 -301517 -136042 -65400 -167879 -77093 -42669 250246 326054 159119 223036
12973B23036A01893R7433r6690e367k1685I3310A5276a32320A377a72836M0719
$$ 223036 101893 199326 102636 -5367 -27052 93310 15276 -132320 1377 -172836 -132117
12962a32117G5088e8247J9410n152A74116p4162L1371Q5115H6261a32885r1426
$$ -132117 75088 -58247 -38837 -43989 174116 99954 131325 216440 86261 -132885 -224311
12951b24311E5201h4437A25311l4484J98663G9492b9726B69200A22011D9759a24863
$$ -224311 55201 -84437 125311 90827 289490 79492 -29726 269200 122011 49759 -124863
12939f8488D7540i5420C4654b23481A31702a77921A66382o5822c26552P9760B65778
$$ -68488 47540 -95420 34654 -223481 131702 -177921 166382 100560 -326552 -246792 265778
12927g9006j5263A07524P2110F9517N6386A7535A795f6800j01291D72160b18685
$$ -79006 -94269 107524 179634 69517 125903 17535 1795 -66800 -168091 472160 -218685
12915a38128A41314f7626A45007L1682a29166j38341A5186J65644D2463L2048
$$ -138128 141314 -67626 145007 176689 -129166 -267507 15186 180830 42463 74511
12905G4511K59644A45050J0447b68751J23269A71645n3397L667M5135E5255c143
$$ 74511 334155 145050 155497 -268751 -145482 171645 118248 121915 167050 55255 -3143
12893c26752B4081b5207A74589a8898C78611H0433J67502m9315j9476M2666C7895
$$ -326752 24081 -25207 174589 -18898 378611 80433 247935 198620 179144 221810 37895
12881a96701A10302a91780I2902b82232A36610g3772R569J6848A960L85357A50517
$$ -196701 110302 -191780 92902 -282232 136610 -73772 -64203 -47355 1960 387317 150517
12869a10680B99086A09898B6387L77796b64909A36455d2046j75265d2091A71383
$$ -110680 299086 109898 26387 404183 -264909 136455 -42046 -217311 -42091 171383
12858C3365b22256H8891d8095q4224B85834c14517A00307P1248C6978K67916a4322
$$ 33365 -222256 88891 -48095 -132319 285834 -314517 100307 171555 36978 304894 -14322
12846g8627A17013m56A9344B962J06330K09684J31254a05372B14880M7655A03403
$$ -78627 117013 116557 19344 2962 109292 318976 450230 -105372 214880 262535 103403
12834D3934e3672a0445q5531E5129p077J77578c06169I6871K30695j25423E7092
$$ 43934 -53672 -10445 -95976 55129 48052 225630 -306169 96871 327566 202143 57092
12822A75578J1018e4884k0936A75351c61362A03807b13426C93277I7437b24816
$$ 175578 186596 -54884 -75820 175351 -361362 103807 -213426 393277 97437 -224816
12811A69565L0230a59520p2358C18361A54741K73161b50813A95430a95160A84720
$$ 169565 199795 -159520 -231878 318361 154741 427902 -250813 195430 -195160 184720
12800A55033h4149k7423j28176D4384a55981C4056b15289i7667B95677j19582
$$ 155033 -84149 -111572 -239748 44384 -155981 34056 -215289 -97667 295677 176095
12790A76095J36697j45294k5761O0534r2546g1747c3727o5296k00248A06095J98250
$$ 176095 312792 167498 141737 202271 109725 -71747 -33727 -99023 -299271 106095 304345
12779C04345E5995J17359m8203O8208a66754B760a22940A22180f0514j06024B9519
$$ 304345 55995 173354 125151 193359 -166754 2760 -122940 122180 -60514 -166538 29519
12767H5840D0685O2276K68779k7836g8898l0024C78181a45645e3760B5301a14828
$$ 85840 40685 102961 371740 343904 -78898 -108922 378181 -145645 -53760 25301 -114828
12755A82865a42976j8912E1633a502n8890A0346K3822b7574B30135b02768A11627
$$ 182865 -142976 -161888 51633 -1502 -60392 10346 34168 -27574 230135 -202768 111627
12743F9148K32656D2098a00695H6807b6687B16394n9231a16420n0852c6454C07575
$$ 69148 301804 42098 -100695 86807 -26687 216394 157163 -116420 -167272 -36454 307575
12731F2141d8965m65490J63552B11623B9108a05595F4024K18758i5750G0166J13942
$$ 62141 -48965 -514455 -350903 211623 29108 -105595 64024 282782 -95750 70166 184108
12720A84108G3066a0727B32260a35235A0463L46189a42546A33788l8222L29595
$$ 184108 73066 -10727 232260 -135235 10463 356652 -142546 133788 95566 425161
12710D25161K02955B87367l3689K4671I8099Q0073J47603j56557C7392a1457j11595
$$ 425161 628116 287367 253678 278349 98099 178172 325775 169218 37392 -11457 -123052
12699a23052N3250A66406n1052C1281J05296N545J06056H6598f0224j50627H1264
$$ -123052 -69802 166406 115354 31281 136577 142122 248178 86598 -60224 -210851 81264
12687e4137C5137i9188B646K52096H450a02126b5483j83829C67079q0478Q9796
$$ -54137 35137 -99188 2646 254742 8450 -102126 -25483 -209312 367079 286601 376397
12676C76397g9580B36397J11872A45609A9176K1385J79663J8574b38109P6847
$$ 376397 -79580 236397 348269 145609 19176 40561 220224 238798 -238109 -161262
12666a61262N8832A83866l2052H297O7894J068b40481A61669J15670e4303F5783
$$ -161262 -102430 183866 151814 8297 76191 77259 -240481 161669 277339 -54303 65783
12654E5169a25252Q776B55668G226N3131J88507g101D80441A34028Q4669I2887
$$ 55169 -125252 -116476 255668 7226 60357 248864 -7101 480441 134028 218697 92887
12642a19928B44239b24711d9038B83421g1292b0804p3504A2681K7302o055M7699
$$ -119928 244239 -224711 -49038 283421 -71292 -20804 -94308 12681 39983 33928 81627
12631H1627l7780K02174K14465A57309n2306J35214J6846k0097M3951F8547J38405
$$ 81627 43847 246021 460486 157309 105003 240217 257063 236966 280917 68547 206952
12620B06952M899J32370f4764A6485K8131L548J39166c5754H3433a07022b4948
$$ 206952 211851 344221 -64764 16485 44616 48164 187330 -35754 83433 -107022 -24948
12608a0931A95221H9758f4098r0199B43585a73737H9156L0381i5264B92708j42359
$$ -10931 195221 89758 -64098 -154297 243585 -173737 89156 119537 -95264 292708 150349
12597A50349J68178F1114K939R2505R133K9493h9027k7076H7923a62336A16722
$$ 150349 318527 61114 64053 156558 165691 195184 -89027 -116103 87923 -162336 116722
12585D5778d7471f569A15260e2576A79100J21999j37998d1223p1238F4246J2193
$$ 45778 -47471 -6569 115260 -52576 179100 301099 163101 -41223 -112461 64246 76439
12574G6439P1571b0623B54641j09667C6084R5489a9881q562m5966j36643k32758
$$ 76439 148010 -20623 254641 144974 36084 131573 -19881 -28443 -74409 -211052 -443810
12563d43810B43432l6529J694C0862M7119A2239J13296B1319K92397j24240F1167
$$ -443810 243432 206903 208597 30862 77981 12239 125535 21319 313716 189476 61167
12551i8494L1573l9948H2833D659e2344K607C3912N8611a14975N1897C05199e7304
$$ -98494 -66921 -106869 82833 4659 -52344 -49737 33912 92523 -114975 -63078 305199 -57304
12538d50227I5897J21966i7218E4477J37751J89214c2782C7711a17542A00195
$$ -450227 95897 217863 -97218 54477 192228 381442 -32782 37711 -117542 100195
12527G6691a28997a0604n6842C92535A52069a32553l3892A10768e1359A83519
$$ 76691 -128997 -10604 -67446 392535 152069 -132553 -166445 110768 -51359 183519
12516c7178C8341J2921d42402B48907a55304f0355j5681O417A85071c1587C67495
$$ -37178 38341 51262 -442402 248907 -155304 -60355 -76036 -69619 185071 -31587 367495
12504F7324H97b13112C12106a36493A0284b74117A9775L54379b91618M96d2946
$$ 67324 897 -213112 312106 -136493 10284 -274117 19775 374154 -291618 -291122 -42946
12492B20135a79396A40366f3186j4693q3574O7277B86393n6733h5529j39613g3444
$$ 220135 -179396 140366 -63186 -77879 -161453 -94176 286393 229660 -85529 -225142 -73444
12480H5324h0987A16230j0775K96009g2277m3597N0221k435A8791J29390l6274
$$ 85324 -80987 116230 105455 401464 -72277 -115874 -65653 -68088 18791 148181 111907
12469A11907b27446O3728o2078B95673c3999E1731J12215a76889B21908I3232
$$ 111907 -227446 -163718 -225796 295673 -33999 51731 163946 -176889 221908 93232
12458a63682O5596J93J0419B44172c53663A1254f8953l7795j34652A48752a08301
$$ -163682 -98086 -97893 -87474 244172 -353663 11254 -68953 -106748 -241400 148752 -108301
12446a88462A96988b12578I798c4643o438D6812A0358e7398C40469e0311l0679
$$ -188462 196988 -212578 9798 -34643 -41081 46812 10358 -57398 340469 -50311 -80990
12435h0990g704B19960a07301E3187k3588b44639A08068J29590f8145H7791K88857
$$ -80990 -7704 219960 -107301 53187 29599 -244639 108068 237658 -68145 87791 376648
12424C76648j57809a50106d2385k94470d4173H3214i1673A3640N82J58998a6544
$$ 376648 218839 -150106 -42385 -336855 -44173 83214 -91673 13640 14222 173220 -16544
12412C0873I999J29298a13412B64211F6219J2613d8961j99829q2043a4001A15711
$$ 30873 9999 139297 -113412 264211 66219 78832 -48961 -248790 -330833 -14001 115711
12400A21820b81280B77015f6873r8873c8276q991q8344c3993j54666q617A58472
$$ 121820 -281280 277015 -66873 -165746 -38276 -47267 -135611 -33993 -188659 -197276 158472
12388B33850a01262A8280b6742A49073P3666f9849p1182F9287a40296e1445B58945
$$ 233850 -101262 18280 -26742 149073 222739 -69849 -141031 69287 -140296 -51445 258945
12376c7785p3263j6648h896j77242f1728K4592B2133a45527e6069l4392d4732
$$ -37785 -111048 -127696 -8896 -186138 -61728 -37136 22133 -145527 -56069 -90461 -44732
12364a2010C19600a67811A15048C6614h6314j61421B35817E8987N2981n5944a49811
$$ -12010 319600 -167811 115048 36614 -86314 -247735 235817 58987 111968 56024 -149811
12352c2730j53806a2889q9350B5264K97211f7697B82427B9680K80361A34503h505
$$ -32730 -186536 -12889 -102239 25264 322475 -67697 282427 29680 310041 134503 -8505
12340b76656A23629J7469J02179C0664K56832c11833B8808J11308l6682h4589
$$ -276656 123629 141098 243277 30664 287496 -311833 28808 140116 103434 -84589
12329A28857b89988B08084k1893O6630a21684H517c0873j41395q6361J29250l7787
$$ 128857 -289988 208084 186191 252821 -121684 8517 -30873 -172268 -258629 -129379 -167166
12318a67166O2371d7398j73370e4340q4930H3187b936B71969a39469k5831A51036
$$ -167166 -104795 -47398 -220768 -54340 -139270 83187 -2936 271969 -139469 -165300 151036
12306C15933c03884E0012L6998a97696I9563P6184d20555A53944a43010B46015
$$ 315933 -303884 50012 87010 -197696 99563 175747 -420555 153944 -143010 246015
12295B61035b88235B88998A40385k5279j5211J29527g2j85205A70337p9031a08568
$$ 261035 -288235 288998 140385 115106 99895 229422 -72 -185277 170337 91306 -108568
12283d3114N522F8181a84536A56066h630j46570B81821d3481A74048R8839d0768
$$ -43114 -37592 68181 -184536 156066 -8630 -155200 281821 -43481 174048 272887 -40768
12271D42941C7778G333K14670M8424p1633K718i1186A93736a05268K9545D7133
$$ 442941 37778 7333 222003 270427 198794 201512 -91186 193736 -105268 -75723 47133
12259B82211e2577j34795N3381j4731C77899j79103K9452c2028B12984l1410a61660
$$ 282211 -52577 -187372 -133991 -148722 377899 198796 228248 -32028 212984 181574 -161660
12247A69782o7550c1835C3444c45484d1241l2966A72646B7465K193M8076K82137
$$ 169782 102232 -31835 33444 -345484 -41241 -74207 172646 27465 29658 77734 359871
12236C59871a98088I6499O3948a11976F3001J30421O3183p4382J50177J636J73091
$$ 359871 -198088 96499 160447 -111976 63001 193422 256605 182223 332400 334036 507127
12225E07127j82786j57185R5029H1514K72812o8361A4621L04824J2221c63312
$$ 507127 324341 167156 262185 81514 354326 285965 14621 319445 331666 -363312
12214H1386a17231A02564J8559J07637q5314J79307j14102c29999H64J87479l7576
$$ 81386 -117231 102564 121123 228760 143446 322753 208651 -329999 864 188343 150767
12203A50767Q3708i29D1510L50146K23073B29640K09979m6306D2202K60600c8965
$$ 150767 234475 -929 41510 391656 614729 229640 439619 393313 42202 302802 -38965
12191D15883B6489L80002A63859K45322a73587I8122J16584e7955n6739j18343
$$ 415883 26489 406491 163859 409181 -173587 98122 214706 -57955 -114694 -233037
12181b33037i4583A21065b4038A30573J98870D5293K0330B3789M9655J36263J03336
$$ -233037 -94583 121065 -24038 130573 329443 45293 65623 23789 73444 209707 313043
12170C13043j37185K51647g3241a3927A86476D6938Q5696f4290n0056A21490K83505
$$ 313043 175858 427505 -73241 -13927 186476 46938 132634 -64290 -114346 121490 404995
12159D04995h2977D23602F3900L6204J12585R8767r1250l0122g2959B21544G7242
$$ 404995 -82977 423602 63900 100104 212689 311456 220206 190084 -72959 221544 77242
12147A08009Q0336l3149m1746a77806M6961n784B7169J19194E5076c223A28611
$$ 108009 188345 155196 113450 -177806 -130845 -136629 27169 146363 55076 -3223 128611
12135a01188p0741C39820r9096G031c0645B13662b62059A540f5761D5883f0268
$$ -101188 -171929 339820 240724 7031 -30645 213662 -262059 1540 -65761 45883 -60268
12123c0125B0655N7785g6008J5299C20731J08495F976b27355A97676R9883J3292
$$ -30125 20655 78440 -76008 -60709 320731 429226 6976 -227355 197676 297559 310851
12112C10851F2706a37895A8975a50154j30348A07792k8829j0070b59171A76339
$$ 310851 62706 -137895 18975 -150154 -280502 107792 78963 68893 -259171 176339
12101a14968j15470C2103b08695A9836c9188k00812H1173j7884g2717n7504e1660
$$ -114968 -230438 32103 -208695 19836 -39188 -240000 81173 63289 -72717 -130221 -51660
12089A84313A9195a07068C77512d3909B8599J99566A00362a39005F5939R8923
$$ 184313 19195 -107068 377512 -43909 28599 228165 100362 -139005 65939 164862
12079A64862e8371C17600J05375J914874q40448E11751k38479c4842A22508N7312
$$ 164862 -58371 317600 422975 2337849 1497401 511751 273272 -34842 122508 179820
12069A79820G6407P9572N4105K03454j96680C943J53765J46453A01876B6500a0655
$$ 179820 76407 155979 210084 413538 216858 3943 157708 304161 101876 26500 -10655
12057d08087c3787I3229P2086b51709A12323k4265a61670A19578j4804i7046B21042
$$ -408087 -33787 93229 165315 -251709 112323 88058 -161670 119578 104774 -97046 221042
12045C6374a71280B52185a66781D15446j18064J6791b07765j88032G2460a67856
$$ 36374 -171280 252185 -166781 415446 297382 314173 -207765 -395797 72460 -167856
12034e3356H013a58473b7530n3177H2099j5602Q3440J50359a4292l71553A72069
$$ -53356 8013 -158473 -27530 -80707 82099 66497 149937 300296 -14292 -385845 172069
12022E3057f8226j61085l28498I4452B897L45048a28168A49194b61732a26717
$$ 53057 -68226 -229311 -557809 94452 2897 347945 -128168 149194 -261732 -126717
12011C31261H9212a29561N8354B03444i0770j10070C6268B426c0109N760A57322
$$ 331261 89212 -129561 -71207 203444 -90770 -200840 36268 2426 -30109 -24349 157322
11999c61965Q7556G1501a58553D0023c27157B3239b94262e0217a1284n6093C45373
$$ -361965 -274409 71501 -158553 40023 -327157 23239 -294262 -50217 -11284 -67377 345373
11987D9486k2589a2996l0960a9142o7539m423C1501E560K25241a5231G2839c79972
$$ 49486 26897 -12996 -43956 -19142 -86681 -91104 31501 5560 230801 -15231 72839 -379972
11974H4760J33127D5070J36924b18929O2905j04282B3041a31901i364D131a15036
$$ 84760 217887 45070 181994 -218929 -156024 -260306 23041 -131901 -9364 4131 -115036
11962d3471o3556a8140m6736H6719b33247b3405l05072a55969B45874C4809J3821
$$ -43471 -107027 -18140 -64876 86719 -233247 -23405 -328477 -155969 245874 34809 48630
11951D8630K5360a26416B65191d07737C645P3339J75644D2830h5254A21667c00492
$$ 48630 73990 -126416 265191 -407737 3645 76984 252628 42830 -85254 121667 -300492
11939C73120A02696d4354b0155r3873j06835a1949p9571B9538K879O0210k4872
$$ 373120 102696 -44354 -20155 -114028 -220863 -11949 -91520 29538 32417 92627 67755
11928F7755b82959J40592A2675e8620A09090a12333j02167f4669H0087J62360
$$ 67755 -282959 -142367 12675 -58620 109090 -112333 -214500 -64669 80087 242447
11918B42447j00075m1626c8802r490J033j85313A1308b49182G9245m839i6096
$$ 242447 142372 100746 -38802 -48292 -47259 -232572 11308 -249182 79245 74406 -96096
11906h9025A38989f2346B1205K25221A18560J3646A522g6579I9583m3632e5694
$$ -89025 138989 -62346 21205 246426 118560 132206 1522 -76579 99583 55951 -55694
11894i471A51728a01847j9373D55587A73542d9523q0724d6519l4416A82389e10356
$$ -9471 151728 -101847 -121220 455587 173542 -49523 -130247 -46519 -80935 182389 -510356
11882i4650j245n3327K4537r0995E7122g1746A29132I638R1678N798J72383b22588
$$ -94650 -95895 -149222 -124685 -215680 57122 -71746 129132 9638 101316 107114 279497 -222588
11869b8472B15447b4754j84184A25272B3413a23902A92337a2583j63862A07959
$$ -28472 215447 -24754 -208938 125272 23413 -123902 192337 -12583 -176445 107959
11858B15233a89200A36122a56532m122B31371a75492C02073A30094b73793I2769
$$ 215233 -189200 136122 -156532 -160654 231371 -175492 302073 130094 -273793 92769
11847b90424f5664A44784k72a9610B42483M3639a14033q0789c6917H3454G716
$$ -290424 -65664 144784 144512 -19610 242483 286122 -114033 -194822 -36917 83454 7716
11835E4607a12531O906C282e190l12894E9253a05636B74068b0321B08197D3672
$$ 54607 -112531 -105625 3282 -5190 -318084 59253 -105636 274068 -20321 208197 43672
11823A62521d4098k47639D41464f8826I3434J18802p2485P8493a48313A94999
$$ 162521 -44098 -291737 441464 -68826 93434 212236 139751 218244 -148313 194999
11812d1791B01011g422A30851a18488j04463E62351A62864i1473C9002b50436
$$ -41791 201011 -7422 130851 -118488 -222951 562351 162864 -91473 39002 -250436
11801I6490K7287a40645d0719m6218d2843j88420N2375k9232r6052e3203A92800
$$ 96490 123777 -140645 -40719 -86937 -42843 -231263 -178888 -208120 -304172 -53203 192800
11789a04123c5019B66543j25512E9905J36533e9368m5380G3510J37670Ca4844
$$ -104123 -35019 266543 141031 59905 196438 -59368 -104748 73510 211180 3 -14844
11777B78811A23048b08095d3876A69503J9500j1471H2211O7223b64015C06628
$$ 278811 123048 -208095 -43876 169503 189003 177532 82211 149434 -264015 306628
11766i2035A85567G217M0525b50460C9358Q7716a65418c8419j37911a6485n6081
$$ -92035 185567 7217 47742 -250460 39358 127074 -165418 -38419 -176330 -16485 -72566
11755g2566m0330J7794m5700D9301R6964e1822n9809a0636c42q301j89254d5184
$$ -72566 -112896 -95102 -140802 49301 146265 -51822 -111631 -10636 -342 -8643 -197897 -45184
11742a86278A04749A7355J98947a4484C33376G2159a65093B11758a78537k191
$$ -186278 104749 17355 216302 -14484 333376 72159 -165093 211758 -178537 -180728
11732a80728M7121d7523I5291c2490A57989J52580b8656k31351a02251j51567
$$ -180728 -133607 -47523 95291 -32490 157989 310569 -28656 -260007 -102251 -253818
11722b53818G5718d2779A65836b99138h9941J0745p9784C1440J67825B3375a82863
$$ -253818 75718 -42779 165836 -299138 -89941 -79196 -158980 31440 199265 23375 -182863
11710a08768A79367a19759r9107C49728j01966c6671j81m2450p6338C2541j3616
$$ -108768 179367 -119759 -218866 349728 247762 -36671 -36852 -79302 -155640 32541 18925
11699A8925a55551f4921A51096J23262b81360A90760B0000K3803c23724A69594
$$ 18925 -155551 -64921 151096 274358 -281360 190760 20000 43803 -323724 169594
11688f4217B54776a75837A92404h0592B6353h1732B73613E9853J07963e3627B01486
$$ -64217 254776 -175837 192404 -80592 26353 -81732 273613 59853 167816 -53627 201486
11676I5081J9481L20610A99404F6233c9387j14837g3416p8003B48533b38347G5169
$$ 95081 114562 435172 199404 66233 -39387 -154224 -73416 -151419 248533 -238347 75169
11664a40177O5287E2786O4238c8537o8303A57782a04909A32007k4347a07157k09239
$$ -140177 -74890 52786 117024 -38537 -106840 157782 -104909 132007 107660 -107157 -316396
11653c16396d7907I6150N4194o6987J7227P7516a84657c1645n95A95142G6975
$$ -316396 -47907 96150 150344 83357 100584 178100 -184657 -31645 -32240 195142 76975
11641a63399M7452N4622A12263n5938K23826F3459J76738F6548B9735L9278a1412
$$ -163399 -115947 -61325 112263 56325 280151 63459 240197 66548 29735 69013 -11412
11629c77838A82046F4496b26278F0464i0668R191D1772a97883k9752B00471l0755
$$ -377838 182046 64496 -226278 60464 -90668 -81477 41772 -197883 -227635 200471 169716
11618A69716k8278l1754J17994O855B4402P3350d6786A25641n3556f2853j67552
$$ 169716 141438 109684 227678 234533 24402 97752 -46786 125641 72085 -62853 -230405
11607b30405c1203j9361k5651D91620b56864B2289a87023B1052a85629e8710F6940
$$ -230405 -31203 -50564 -76215 491620 -256864 22289 -187023 21052 -185629 -58710 66940
11595A88603A3717M3247B5948J11687C6678a2707B21799b82885f5934B29653a58880
$$ 188603 13717 56964 25948 137635 36678 -12707 221799 -282885 -65934 229653 -158880
11583E02491j82993P9902j82423e3904A65622C4474g9997A71404q1983a46606
$$ 502491 319498 399400 216977 -53904 165622 34474 -79997 171404 89421 -146606
11572g9995B26192r7791K4103k9121R1671a21848A33258b00371b623B42748b1166
$$ -79995 226192 128401 152504 123383 215054 -121848 133258 -200371 -2623 242748 -21166
11560G2425J08969r750C3973a04331H9841J7183B5226d0813l1936j464A13119
$$ 72425 181394 171644 33973 -104331 89841 107024 25226 -40813 -72749 -74213 113119
11548B64993L36083B72443c1723B19189e4532B27200F2229b35221B9862a325B05522
$$ 264993 601076 272443 -31723 219189 -54532 227200 62229 -235221 29862 -1325 205522
11536B0468i3683o866q237O01C8473J88214a5345j43832A72130b23826b7742D32399
$$ 20468 -93683 -100549 -108786 -108185 38473 226687 -15345 -159177 172130 -223826 -27742 432399
11523H6799C7160J55400H2862J75367J14272O0109C7238b80919C32980D2645H238
$$ 86799 37160 192560 82862 258229 372501 432610 37238 -280919 332980 42645 8238
11511D7681i368A02184J50559K0109N7432r6124a23676A31565o3467J77650a01528
$$ 47681 -9368 102184 252743 272852 330284 234160 -123676 131565 68098 245748 -101528
11499E5266k5488O0520J88145C7501c2107B6602P1654B923K17741o9168k1493
$$ 55266 29778 90298 278443 37501 -32107 26602 98256 2923 220664 151496 130003
11488A30003n5318i5223G4890K41983j53809c0258F0406J37877J86474l2339b367
$$ 130003 74685 -95223 74890 316873 163064 -30258 60406 198283 384757 352418 -2367
11476C64392j33089D8200a3960A59347A2082K22501G6520P5520E1003c6851A23976
$$ 364392 231303 48200 -13960 159347 12082 234583 76520 152040 51003 -36851 123976
11464H0317a3288n2070C30708d2904B39148b74018B30525j14497D9774J45554
$$ 80317 -13288 -65358 330708 -42904 239148 -274018 230525 116028 49774 195328
11454A95328D8234f0686B28060J8407F2099L99230A19200b4184B37151a13360
$$ 195328 48234 -60686 228060 246467 62099 461329 119200 -24184 237151 -113360
11443g3714B22088L8204h1834B98372D6162J03856a25923G3522C2757J40963k8788
$$ -73714 222088 260292 -81834 298372 46162 150018 -125923 73522 32757 173720 144932
11432A44932b49929f9236A05222C4046f6466a653A93181H027i6343B85043E7336
$$ 144932 -249929 -69236 105222 34046 -66466 -1653 193181 8027 -96343 285043 57336
11420F630b26549C45295G6522k3924J51642p9338a84773O5693A26506c18119C01846
$$ 6630 -226549 345295 76522 52598 204240 124902 -184773 -119080 126506 -318119 301846
11408A12754J61935a92360N3320H3631L48983a35552F8827M8432b20119A04199
$$ 112754 274689 -192360 -139040 83631 432614 -135552 68827 117259 -220119 104199
11397b4420m8013B11612a58852P5137F9469b14330A58297J50515B2160a36437
$$ -24420 -72433 211612 -158852 -83715 69469 -214330 158297 308812 22160 -136437
11386A24850d5171k16733f8012G761R105e6018A81396p4897p792a47911k0470
$$ 124850 -45171 -261904 -68012 7761 16866 -56018 181396 106499 98707 -147911 -168381
11375a68381j12226A17919f9583B45666q8802b47988G0407b57612B16243d3666
$$ -168381 -280607 117919 -69583 245666 156864 -247988 70407 -257612 216243 -43666
11364f9984B9423R6358F107J05597b33253b0502j36201j51361G6732a18275j24945
$$ -69984 29423 125781 6107 111704 -233253 -20502 -156703 -308064 76732 -118275 -243220
11353b43220b4314q1426l5316E9273b07184g210C7124b96801b880B851K57242
$$ -243220 -24314 -105740 -141056 59273 -207184 -7210 37124 -296801 -2880 2851 260093
11342B60093a6056n2547k25839c9949k18350K2456j18008A9551b819k28929g9375
$$ 260093 -16056 -68603 -294442 -39949 -258299 -235843 -353851 19551 -2819 -231748 -79375
11330C87198A4491K42055a73868K9469A13815K26002b0936B75405M0157F6205
$$ 387198 14491 256546 -173868 -144399 113815 339817 -20936 275405 315562 66205
11319a04961I5686J64178b60548m750A21509J52565A09341b58087Q5562L4378
$$ -104961 95686 259864 -260548 -265298 121509 274074 109341 -258087 -172525 -138147
11309a38147J820D314b51217A81034b5718j9983q1684A87004G1616d6927E1642
$$ -138147 -136327 4314 -251217 181034 -25718 -45701 -127385 187004 71616 -46927 51642
11297a0528A09994a1130j25975k9926P0901o3856B95370b47510p5400A18604a36793
$$ -10528 109994 -11130 -137105 -167031 -96130 -159986 295370 -247510 -322910 118604 -136793
11285C2142g3563j12677A47291o4554a20805J9858j61920a00495A6597g3681k37935
$$ 32142 -73563 -186240 147291 82737 -120805 -100947 -262867 -100495 16597 -73681 -311616
11274c11616I7686c30905c9610k62974J41214j57271a0818C22454a9085k23186
$$ -311616 97686 -330905 -39610 -302584 -161370 -318641 -10818 322454 -19085 -242271
11264b42271G1862Q1915a11498c6990K116k67516A26793a32492k66240f207C378
$$ -242271 71862 153777 -111498 -36990 -34874 -302390 126793 -132492 -398732 -6207 3378
11252b12333N7793A36512a11724e1957A95870a01651j22144A669b20694C9337
$$ -212333 -154540 136512 -111724 -51957 195870 -101651 -223795 1669 -220694 39337
11241D6730a3796p2036B42558n9878a30314H8313K9234a48799e3421j5434j26544
$$ 46730 -13796 -85832 242558 182680 -130314 88313 117547 -148799 -53421 -68855 -195399
11230a95399B11993a39961j0830a208C33001D051b19163R6156q7858Q2989E786
$$ -195399 211993 -139961 -150791 -1208 333001 4051 -219163 -123007 -210865 -127876 5786
11218a09721j91528J45184N5104C1345C367a46036l2753d7729A04677h5723j92057
$$ -109721 -301249 -156065 -100961 31345 3367 -146036 -178789 -47729 104677 -85723 -277780
11207b77780a33057A40666J37405a82313A01834j6592k2501e4999j08383D0432
$$ -277780 -133057 140666 278071 -182313 101834 85242 62741 -54999 -163382 40432
11196D6811J06907g5774G9438i7442m0694G9523c0516C0066N178c5780j68062
$$ 46811 153718 -75774 79438 -97442 -138136 79523 -30516 30066 35244 -35780 -203842
11185b03842C04098b09983B28303P9090j44971K7806r1045B4591c322j18900I3362
$$ -203842 304098 -209983 228303 307393 162422 190228 99183 24591 -3322 -122222 93362
11173A13526n1157c3309J131g625D22a7684A71714b98797b8001k71838a08636
$$ 113526 62369 -33309 -32178 -7625 422 -17684 171714 -298797 -28001 -299839 -108636
11161f9449B04568A6871R3946c41537A06070m3547K21943a56173b727k73373B24105
$$ -69449 204568 16871 110817 -341537 106070 62523 284466 -156173 -2727 -276100 224105
11149a40381C8563e279j19183c9749C06262j35179B6894L1523N0452b36424A11498
$$ -140381 38563 -5279 -124462 -39749 306262 171083 26894 58417 108869 -236424 111498
11137d17109b1926r3997j44119A09413O4583C3678K46888E6859O3061a42119M2393
$$ -417109 -21926 -115923 -260042 109413 173996 33678 280566 56859 119920 -142119 -99726
11126i9726j09804L6501B02524p7669d5230j19915m9804i653I3951b99563i2209
$$ -99726 -209530 -173029 202524 124855 -45230 -165145 -214949 -9653 93951 -299563 -92209
11114B30036c23649c4231k31632E6272J54550d4846B94455n9164K19064n7430
$$ 230036 -323649 -34231 -265863 56272 210822 -44846 294455 235291 454355 396925
11104C96925A93288l9601R0882d5760A06495K47489j46094c5486B84181G8355
$$ 396925 193288 153687 244569 -45760 106495 353984 207890 -35486 284181 78355
11093C54486A64909N9318B5596J00622b5864B96947q9565K1682L0216L676Q5894
$$ 354486 164909 224227 25596 126218 -25864 296947 207382 229064 259280 262956 348850
11082C48850o6353j32863r689l6210K52965m3033j40571O0989K0129K63480p1618
$$ 348850 282497 149634 139945 103735 356700 313667 173096 234085 254214 517694 446076
11071D46076A9479L23501R5456B18352E4871J55821L84540B67779J2542J80462
$$ 446076 19479 342980 438436 218352 54871 210692 595232 267779 280321 460783
11061D60783J540j42710N1835J78356m1083j01895K78527k12947j10848N0348
$$ 460783 462323 319613 371448 549804 508721 406826 685353 472406 361558 411906
11051D11906K27564J02664j80019N5006J95117p187k5593l4768j72855R1722m5752
$$ 411906 639470 742134 562115 617121 812238 805051 779458 744690 571835 663557 617805
11040F17805n4726q4902M09875D38870N37278m00204K85721l04984K62173k29173
$$ 617805 563079 478177 888052 438870 976148 575944 861665 556681 818854 589681
11030E89681B10129K21693J20737L4150B84339K74115j23511K99972k45198K84331
$$ 589681 210129 431822 552559 586709 284339 558454 434943 734915 489717 774048
11020G74048l32376p8997J38987N0960J49142K81103k46110r2172B72347O9643
$$ 774048 441672 362675 501662 552622 701764 982867 736757 644585 272347 341990
11010C41990P6416l4224K53669r691L624K4149J11580j1753P7278j56548j78986
$$ 341990 418406 384182 637851 628160 631784 655933 767513 755760 833038 676490 497504
10999D97504J41221J58032k33418K12632k45775L32369j05000r4923l6297K90863
$$ 497504 638725 796757 563339 775971 530196 862565 757565 662642 626345 917208
10989I17208j05028j24506K79408P1627l92102P3479K89317N4668P8013j31338
$$ 917208 812180 687674 967082 1038709 646607 720086 1009403 1064071 1142084 1010746
10979A010746M39186J49768m7112L06366L38540L961M44346K50339l70434P4348
$$ 1010746 1449932 1599700 1552588 1858954 2197494 2201455 2645801 2896140 2525706 2600054
10969B600054k58849k5474J31394l67790l32954j5155J60380m26421J66963j8151
$$ 2600054 2341205 2315731 2447125 2079335 1746381 1731226 1891606 1465185 1632148 1613997
10959A613997J56826M3121j95316L14266K0463m20386r9781r8106m17154n8618
$$ 1613997 1770823 1813944 1618628 1932894 1953357 1532971 1433190 1335084 917930 859312
10949H59312J3140k28898k81073R0475A74037k2904J66945Q1974G4763M3804L1915
$$ 859312 872452 643554 362481 452956 174037 151133 318078 400052 74763 118567 150482
10938A50482J49519A49617N11335B88297o4268E2386K17385j27180o3809L5743
$$ 150482 300001 149617 660952 288297 224029 52386 269771 142591 78782 114525
10928A14525E2304R6787R0898a6784H2707i3318b0260C39414A7770h8193C6574
$$ 114525 52304 149091 239989 -16784 82707 -93318 -20260 339414 17770 -88193 36574
10916C25290A46017b95826H7429a11482A3906c1280D24075B8507p695c2434J838
$$ 325290 146017 -295826 87429 -111482 13906 -31280 424075 28507 20812 -32434 -30596
10905c0596A10601F494d2233I1997e3768p4262C3339d0923B81648c59207a38346
$$ -30596 110601 6494 -42233 91997 -53768 -128030 33339 -40923 281648 -359207 -138346
10893b34042A08991b3356B59194i086l9908A75974n9746L20357b3759H9127H135
$$ -234042 108991 -23356 259194 -9086 -48994 175974 116228 436585 -23759 89127 8135
10881B2724b11621K9017m3364B29279b18127A55238a30226j6474d1538n1511a7990
$$ 22724 -211621 -182604 -225968 229279 -218127 155238 -130226 -146700 -41538 -93049 -17990
10869b3525l47943B71000j05972d2579p0639r2741E7985g3076k00068A31281a09620
$$ -23525 -371468 271000 165028 -42579 -113218 -205959 57985 -73076 -273144 131281 -109620
10857b9591A84238O2863b60979C87368i2508G1300M28852a64193g6930A25294
$$ -29591 184238 247101 -260979 387368 -92508 71300 500152 -164193 -76930 125294
10846A24624h9698a8550j42081A67852o927J39669h3942j62094L4782r919B67667
$$ 124624 -89698 -18550 -160631 167852 160925 300594 -83942 -246036 -211254 -221173 267667
10834g191l44777G07b12407A8219K73177a62765A92690a67570I3408B9801e3774
$$ -7191 -351968 707 -212407 18219 291396 -162765 192690 -167570 93408 29801 -53774
10822b69518G3372a63726k46192J02171G6049c80513a15973B11409c2390B39049
$$ -269518 73372 -163726 -409918 -307747 76049 -380513 -115973 211409 -32390 239049
10811e16434E2683c25455B0589K49634A25566a02489G8682l4332J21674i1356
$$ -516434 52683 -325455 20589 270223 125566 -102489 78682 44350 166024 -91356
10800A01176a17150A25157R8455a23555m0294q3091A56770a739B7023O7466a78992
$$ 101176 -117150 125157 223612 -123555 -163849 -246940 156770 -1739 27023 94489 -178992
10788a88767a0839A03226a39765C7621L4775b3353A46533c3593D9444J73009r8123
$$ -188767 -10839 103226 -139765 37621 72396 -23353 146533 -33593 49444 222453 124330
10777A24330d7659C8731a02178n5113j29794Q2460A4064M23332A37359A1616a4687
$$ 124330 -47659 38731 -102178 -157291 -287085 -204625 14064 437396 137359 11616 -14687
10765A43736E7444d6204A11639c53806B5257c9653G9902f9032m8197n5163B6178
$$ 143736 57444 -46204 111639 -353806 25257 -39653 79902 -69032 -117229 -172392 26178
10753b41484A4118a25686a3466j90394p1658A59635g1563A73618L52691a84516
$$ -241484 14118 -125686 -13466 -203860 -275518 159635 -71563 173618 526309 -184516
10742a72347A41193a2448m0258B0582J7622L39900A47805b05784f9878B92261
$$ -172347 141193 -12448 -52706 20582 38204 378104 147805 -205784 -69878 292261
10731B83102A39226d6728p7399C03150b92595D1078M03660c47401e9887l33433
$$ 283102 139226 -46728 -124127 303150 -292595 41078 444738 -347401 -59887 -393320
10721c93320a69913J8496B40034A6678b8908l6504A0385Q6949A1505K9030J5777
$$ -393320 -169913 -151417 240034 16678 -28908 -65412 10385 97334 11505 40535 56312
10710E6312e25923h0760A87709i7378A12005d7597J0793B04185n6721b15974B40420
$$ 56312 -525923 -80760 187709 -97378 112005 -47597 -36804 204185 147464 -215974 240420
10698c3388G0344d3515A03180h1741C5726a69603E5417J9295a50016P0466j1440
$$ -33388 70344 -43515 103180 -81741 35726 -169603 55417 74712 -150016 -79550 -90990
10687i0990A12142n5644f7096G3317f0527j10054O1922A21968C0b49798B04074
$$ -90990 112142 56498 -67096 73317 -60527 -170581 -108659 121968 30 -249798 204074
10675a78470P3301G0964M8481f3834l6905c8211k96395a60479G8764Q7165a47863
$$ -178470 -105169 70964 119445 -63834 -100739 -38211 -334606 -160479 78764 165929 -147863
10663d65626A07498k7671K2097O9800a7054j67067j85037A26607n3939c21823
$$ -465626 107498 79827 101924 171724 -17054 -184121 -369158 126607 72668 -321823
10652e3600o8123j41790A65581b4441n6399j73372i1258F9855b6900F8209a86557
$$ -53600 -121723 -263513 165581 -24441 -80840 -254212 -91258 69855 -26900 68209 -186557
10640a86101Q7236B4616J30259N3440K9046R2404a06194I9601i4649j09968P1126
$$ -186101 -98865 24616 154875 208315 237361 329765 -106194 99601 -94649 -204617 -133491
10629a33491n2117C17444b18613F3433J12670a17996A13237b87276h4987A77940
$$ -133491 -185608 317444 -218613 63433 176103 -117996 113237 -287276 -84987 177940
10618E2824f3910k04322a21702N366j0300j90797C0669b46564F4216d37721A1935
$$ 52824 -63910 -268232 -121702 -116336 -126636 -317433 30669 -246564 64216 -437721 11935
10606c96772A69725a76974B95388K6804e6456k2473j58418l2866K4208A12019
$$ -396772 169725 -176974 295388 322192 -56456 -78929 -237347 -270213 -246005 112019
10595a71629j86676h8238A81964a72600A32310a19942H454O3984a91760B82364
$$ -171629 -358305 -88238 181964 -172600 132310 -119942 8454 72438 -191760 282364
10584A1887g7311p3977a3248q3685A39452a41657N2375k802M710C6246a07842
$$ 11887 -77311 -151288 -13248 -96933 139452 -141657 -89282 -92084 -87374 36246 -107842
10572B35552a51647a957B06761b342o9564j234B64665A4332b44708C66453j20179
$$ 235552 -151647 -1957 206761 -2342 -71906 -73140 264665 14332 -244708 366453 246274
10561B46274o1867D6848b12607j36403a1637j21331n3338A53038m5665C0023i4975
$$ 246274 184407 46848 -212607 -349010 -11637 -132968 -186306 153038 107373 30023 -94975
10549I4863K35010a21034p2604Q9957A12777K7908a09799N020o0187C4996c3467
$$ 94863 329873 -121034 -193638 -103681 112777 140685 -109799 -104779 -164966 34996 -33467
10537a46916I1511A6105h5878C9601R8826k4693b8390I5716f4492I9208J9045
$$ -146916 91511 16105 -85878 39601 138427 113734 -28390 95716 -64492 99208 118253
10526A18253E2263g4935F6335e9907r3804A66868B0654J14794d22851c9657C0997
$$ 118253 52263 -74935 66335 -59907 -153711 166868 20654 135448 -422851 -39657 30997
10514a22204p0999A94840i7465A13301a09683C45205c43452J27089A29417B0603
$$ -122204 -193203 194840 -97465 113301 -109683 345205 -343452 -216363 129417 20603
10503d37116a50245A67164a49283P3366P908B27920d9267A25919J14873a10935
$$ -437116 -150245 167164 -149283 -75917 -68009 227920 -49267 125919 240792 -110935
10492a28982o0484K6449A13339J1347J2512h1617J9525p7139A27999b72261A278
$$ -128982 -189466 -163017 113339 124686 137198 -81617 -62092 -139231 127999 -272261 1278
10480D37978R9152L2465B43987L12366H0136a29784A57335B625K68082b32876
$$ 437978 537130 569595 243987 556353 80136 -129784 157335 2625 270707 -232876
10469H2342J26506a34706A25191A7124b21618a8398q9923H7146a11823A12679
$$ 82342 208848 -134706 125191 17124 -221618 -18398 -108321 87146 -111823 112679
10458b30348a0288G3607a34651d1002E2036K08170I078M72884i7578j1111j00396
$$ -230348 -10288 73607 -134651 -41002 52036 260206 9078 481962 -97578 -108689 -209085
10447b09085m7080R9991f068j42217k9876b4874a1781o0167l38341J41225g9249
$$ -209085 -256165 -156174 -6068 -148285 -178161 -24874 -11781 -71948 -410289 -269064 -79249
10435h9345m7841F9717a32045f4178C3050K7412b37416B6891b55519g1932a2315
$$ -89345 -137186 69717 -132045 -64178 33050 60462 -237416 26891 -255519 -71932 -12315
10423A58110m9029L3507J3292a06840B9246a16395j508k7301O8574B95980h0620
$$ 158110 109081 142588 155880 -106840 29246 -116395 -117903 -145204 -76630 295980 -80620
10411a89957e5003l0195K5119k11719h7683j11129P1840k0774n3665i6092A30065
$$ -189957 -55003 -85198 -60079 -271798 -87683 -198812 -126972 -147746 -201411 -96092 130065
10399B42176a41874B77863D1269a77405D62142k01416J91592f0373B5022K16433
$$ 242176 -141874 277863 41269 -177405 462142 260726 452318 -60373 25022 241455
10389B41455a25366B3006b35038c4679B93231b41796A17021C6373L84172j1857
$$ 241455 -125366 23006 -235038 -34679 293231 -241796 117021 36373 420545 408688
10379D08688o1792o9336r8983J17852b6984E6145J62527k1248J98505K88426B48005
$$ 408688 346896 277560 178577 296429 -26984 56145 218672 197424 395929 684355 248005
10367C53604L95525A56693K35082c0331k2207o7130A12839E3431P3068j076L23982
$$ 353604 749129 156693 391775 -30331 -52538 -119668 112839 53431 126499 125423 449405
10356D49405D3793d6657F203N03413j79610j31041J31313J32424I8705K55786
$$ 449405 43793 -46657 6203 509616 330006 198965 330278 462702 98705 354491
10346C54491r6672q9170L74317j89650J28157a94441A82711E4382J26824K70881
$$ 354491 257819 168649 542966 353316 481473 -194441 182711 54382 181206 452087
10336D52087J33632I1278M07760d0068C87605e4818G7739L35264j87996a26141
$$ 452087 585719 91278 499038 -40068 387605 -54818 77739 413003 225007 -126141
10325a24842A82940k8808c4743C05427A26933L3335e0518A78882a25018B68775
$$ -124842 182940 154132 -34743 305427 126933 160268 -50518 178882 -125018 268775
10314A34512D4071c2835j8699E2847P6620k5386a36023N2847j6361n5602r0276
$$ 134512 44071 -32835 -51534 52847 129467 104081 -136023 -83176 -99537 -155139 -245415
10303b45415Q4725J2976C58408E7130a7830o1079j30091C14010c10803a31814
$$ -245415 -160690 -147714 358408 57130 -17830 -78909 -209000 314010 -310803 -131814
10292a68268C49478c3207b348A32131e5311p2142N7906j03379O6799j0979P255
$$ -168268 349478 -33207 -2348 132131 -55311 -127453 -69547 -172926 -106127 -117106 -109851
10281a09851A46174a37418H0319j5504a47926o770n6922H6791j8960h0432A95143
$$ -109851 146174 -137418 80319 64815 -147926 -154696 -211618 86791 67831 -80432 195143
10269a7875B95169b8653j09831q1878a2866B20050b07902B18999J89921J5243
$$ -17875 295169 -28653 -138484 -220362 -12866 220050 -207902 218999 408920 424163
10259D24163j20345j01078O8594p6111J30231A04771L42057a38814A3097O8979
$$ 424163 303818 202740 271334 195223 325454 104771 446828 -138814 13097 82076
10249H2076b12481h9815F6029J23473d1853m8704H8169P0327G6583N7829f8356
$$ 82076 -212481 -89815 66029 189502 -41853 -90557 88169 158496 76583 134412 -68356
10237F0113c51713A3951b57038A40689h1962j60702A6639b08598b9862n3269B3796
$$ 60113 -351713 13951 -257038 140689 -81962 -242664 16639 -208598 -29862 -83131 23796
10225B17936E8818i5005k4445H8681k1908b2166A34663c925o9953B61909E308
$$ 217936 58818 -95005 -119450 88681 66773 -22166 134663 -3925 -73878 261909 5308
10213A72217J36050e10123E406J01639i0584F6196f1988A08039O4389h7052j90726
$$ 172217 308267 -510123 5406 107045 -90584 66196 -61988 108039 172428 -87052 -277778
10202b77778j56952f5137B2985a27871j25675A02285a17825B24094H1522J9502
$$ -277778 -434730 -65137 22985 -127871 -253546 102285 -117825 224094 81522 101024
10192A01024a3922j85439j10380O3507a11365F4226N7573g1073j26949M9280o0670
$$ 101024 -13922 -199361 -309741 -246234 -111365 64226 121799 -71073 -198022 -148742 -209412
10181b09412f7531q5326D1488n121e2073i198A51667f8399A08321f7235A59406
$$ -209412 -67531 -152857 41488 36367 -52073 -9198 151667 -68399 108321 -67235 159406
10169b38020j47309k7563d1355J2417l9803k44215B9505a62412r4498d4373o9220
$$ -238020 -385329 -412892 -41355 -28938 -68741 -312956 29505 -162412 -256910 -44373 -113593
10158a13593K2723C229b14482E9314a93969c1190k01440g5710g439p4400A03590
$$ -113593 -90870 3229 -214482 59314 -193969 -31190 -232630 -75710 -7439 -81839 103590
10146A4109b49986A50926c74649J72610N6158K7589J8663F1440b88845K8930E4311
$$ 14109 -249986 150926 -374649 -202039 -145881 -118292 -99629 61440 -288845 -259915 54311
10134b78496A20696c154A54689n1564b77372R6331C280J25555g2044l9215B01412
$$ -278496 120696 -3154 154689 103125 -277372 -181041 3280 128835 -72044 -111259 201412
10122A53613a27518d6044J9412B97612r5785F4788c7096j54906B02378p5128b08387
$$ 153613 -127518 -46044 -26632 297612 201827 64788 -37096 -192002 202378 127250 -208387
10110A71532D6912d5178J5495A9299c18930A36888c0099A26640B0007a12579e2456
$$ 171532 46912 -45178 -29683 19299 -318930 136888 -30099 126640 20007 -112579 -52456
10098A33129Q6946a23456e1234H536a40588j77657A40875c17025c0040j25413
$$ 133129 220075 -123456 -51234 8536 -140588 -318245 140875 -317025 -30040 -155453
10088a55453m7008j69741n1899J37250J03985h3427k12710B34884a35303d4665
$$ -155453 -202461 -372202 -424101 -286851 -182866 -83427 -296137 234884 -135303 -44665
10077a51384D065b95249a1505A8213f9459C4330f0461A39273Q1223h7279J0206
$$ -151384 4065 -295249 -11505 18213 -69459 34330 -60461 139273 220496 -87279 -77073
10066g7073b7999l28397b7306A11690k4472b8646G0209L7684i9517B28850f8057
$$ -77073 -27999 -356396 -27306 111690 87218 -28646 70209 107893 -99517 228850 -68057
10054b06422B53827a94497A3065c34671d1798k74993j9123A69447b01924P6338
$$ -206422 253827 -194497 13065 -334671 -41798 -316791 -335914 169447 -201924 -125586
10044a25586e1731m04724b1362j4884B959N114a59896F8098K00597a01517P197
$$ -125586 -51731 -456455 -21362 -36246 2959 8073 -159896 68098 268695 -101517 -94320
10033i4320j61613B21554G1998N9189c9271j336k05055r9246B54945A6680k884
$$ -94320 -255933 221554 71998 131187 -39271 -40607 -245662 -344908 254945 16680 13796
10022A3796J22780A6991i4685n9781B9850i8836C12177j32774a1821j54857e5334
$$ 13796 136576 16991 -94685 -154466 29850 -98836 312177 179403 -11821 -166678 -55334
10010b49045I4257k2110b29372H1208d01379c2958k35763F6576b83626F4961j6263
$$ -249045 94257 72147 -229372 81208 -401379 -32958 -268721 66576 -283626 64961 48698
9999D8698M15421F4555P2038a19693c9090j34299h0526F4510b73205K2716k5736
$$ 48698 464119 64555 136593 -119693 -39090 -173389 -80526 64510 -273205 -250489 -276225
9988b76225P0896M560e6186o4255G9922c61696L9479J49584G2308A3547a6256
$$ -276225 -205329 -200769 -56186 -120441 79922 -361696 -322217 -172633 72308 13547 -16256
9976B7697a23031E3120i2262G5194A9448b309j22115d2861j64906k43051g7616
$$ 27697 -123031 53120 -92262 75194 19448 -2309 -124424 -42861 -207767 -450818 -77616
9964b0085m0513k43702B53385b27544O180F0205R8950A3461L5646a84481O7668
$$ -20085 -60598 -304300 253385 -227544 -221364 60205 159155 13461 49107 -184481 -116813
9953a16813A10997a14551G9942b51418j86379a91935O8056A79610i9829j19226
$$ -116813 110997 -114551 79942 -251418 -437797 -191935 -123879 179610 -99829 -219055
9943b19055A131g969j42078a7286H4765c00548j33002K05254b7907j60411j45808
$$ -219055 1131 -7969 -150047 -17286 84765 -300548 -433550 -228296 -27907 -188318 -334126
9932c34126a63304k08755a62996E2743a96827L8757j65612J22188Q4320q1040
$$ -334126 -163304 -372059 -162996 52743 -196827 -158070 -323682 -201494 -117174 -198214
9922a98214h3223q5744B53625a31607A53370d02163c9562i279E2636j943L69382
$$ -198214 -83223 -168967 253625 -131607 153370 -402163 -39562 -9279 52636 50693 420075
9911D20075h3814B41140C9600a40346N7856A02978c52674a5837j68401A20325
$$ 420075 -83814 241140 39600 -140346 -82490 102978 -352674 -15837 -184238 120325
9900a10169l95991A57675o2355b18945b8495r269D24996b26525M8510n8762B4674
$$ -110169 -506160 157675 95320 -218945 -28495 -37764 424996 -226525 -178015 -236777 24674
9888c11314a827A97388a13508k1112q8773B07478a09261K6819A00938a49808f6324
$$ -311314 -1827 197388 -113508 -134620 -223393 207478 -109261 -82442 100938 -149808 -66324
9876D5998O4663d9810A52745c12551A22599a24534j89596j32074I0945f7179H0663
$$ 45998 110661 -49810 152745 -312551 122599 -124534 -314130 -446204 90945 -67179 80663
9864C9972Q0360c57546Q1025j6040a24916a4010j92477B23607j5852b9457j55344
$$ 39972 120332 -357546 -276521 -292561 -124916 -14010 -206487 223607 207755 -29457 -184801
9853a84801Q1714j95327a09712a157A2032K80748j39007P5110f4720A93147N2088
$$ -184801 -103087 -298414 -109712 -1157 12032 292780 153773 228883 -64720 193147 245235
9842B45235b15168j30521A26497f6455j50858d9199n3094A11701c39416j44741
$$ 245235 -215168 -345689 126497 -66455 -217313 -49199 -102293 111701 -339416 -484157
9832d84157d9368J389n6821j13774A27175f3838j1728n1668r4817j5652i9919
$$ -484157 -49368 -47979 -104800 -218574 127175 -63838 -75566 -127234 -222051 -237703 -99919
9820B2946a17910j87237j0965e0668C1624d6226a0336k03958B49207b03318g0438
$$ 22946 -117910 -305147 -316112 -50668 31624 -46226 -10336 -214294 249207 -203318 -70438
9808A2357M198b19474h35B52527a30943P506L5057k2516b8244B88566a05550j82145
$$ 12357 16555 -219474 -835 252527 -130943 -123437 -88380 -110896 -28244 288566 -105550 -287695
9796b87695a4934e469A8425O9106B4260a4915F661O9299J44736J63463o0653A16493
$$ -287695 -14934 -5469 18425 87531 24260 -14915 6661 75960 220696 384159 323506 116493
9783E6471a39892C0954c0120H5017c09657f4211I5672h7761A30680f3203b6552
$$ 56471 -139892 30954 -30120 85017 -309657 -64211 95672 -87761 130680 -63203 -26552
9771b20076a2599C8586a03898B06757G7668j6467a70461c371l05244a21972l38888
$$ -220076 -12599 38586 -103898 206757 77668 61201 -170461 -3371 -308615 -121972 -460860
9760d60860I2955b01949i6784l4886j89663a29872A85066l4809a7060D0900a5606
$$ -460860 92955 -201949 -96784 -131670 -321333 -129872 185066 150257 -17060 40900 -15606
9748A9003d9r1807B5799J07401c51865B9466K0894j6838i1070o3131I4889a81520
$$ 19003 -49 -91856 25799 133200 -351865 29466 50360 33522 -91070 -154201 94889 -181520
9735G6128J31479a94320Q3080q3840e6098a8566k7839A5503a77451d7894D171
$$ 76128 207607 -194320 -111240 -195080 -56098 -18566 -46405 15503 -177451 -47894 4171
9723B7306M8450d46101a05695J9289l15319b3163A7519M9757G140a08592A04712
$$ 27306 75756 -446101 -105695 -86406 -401725 -23163 17519 67276 7140 -108592 104712
9711i3156q9289k1924e8253R269j38983b8233k4453b5158j75286j2367g4777o9308
$$ -93156 -182445 -204369 -58253 -48984 -187967 -28233 -52686 -25158 -200444 -212811 -74777 -144085
9699a44085B3074b39887q7277l9140e8777j48897J3738A39849b94872A17245b69355
$$ -144085 23074 -239887 -327164 -366304 -58777 -207674 -193936 139849 -294872 117245 -269355
9687a07085r3120A9774b8616m4906D9154f4662F494K1385f0322B2200h290j50419
$$ -107085 -200205 19774 -28616 -73522 49154 -64662 6494 27879 -60322 22200 -8290 -158709
9675a58709H5612a92842c94A02255m1818h2766o4320B39713a28971o13p8016E0403
$$ -158709 85612 -192842 -394 102255 60437 -82766 -147086 239713 -128971 -129584 -207600 50403
9662B7883a66974O7706j54807o2018a35797k02106A66166a07455G2958J64939
$$ 27883 -166974 -99268 -254075 -316093 -135797 -337903 166166 -107455 72958 237897
9652B37897A13492l4326a54140G1889a58657p0253G2189I862b88625j6972D1542
$$ 237897 113492 79166 -154140 71889 -158657 -228910 72189 9862 -288625 -305597 41542
9640i3878j90712j4318I0007c7211a7808j17857K1175C232c45583H5532J37185
$$ -93878 -284590 -298908 90007 -37211 -17808 -135665 -114490 3232 -345583 85532 222717
9629B22717a61528M9308n9075j85448A93800b04324j51990D2040M1559C6988c0223
$$ 222717 -161528 -112220 -171295 -356743 193800 -204324 -356314 42040 83599 36988 -30223
9617a36044j37877K9471a1960j95477K4622D6229a22452k60779A39263a12215
$$ -136044 -273921 -244450 -11960 -207437 -182815 46229 -122452 -383231 139263 -112215
9606c18722J34883a9401l4894k09801a25295o5097l33820a06182k9086E9341Q4669
$$ -318722 -183839 -19401 -54295 -264096 -125295 -190392 -524212 -106182 -135268 59341 144010
9595A44010b89563g5483k69733H8066p066b9611C66795b2003D3251b13124N9589
$$ 144010 -289563 -75483 -345216 88066 81000 -29611 366795 -22003 43251 -213124 -153535
9584a53535p8952J14840A00675J20266n7425P6394c8570O306j21730k3130j81783
$$ -153535 -232487 -117647 100675 220941 163516 239910 -38570 -32264 -153994 -177124 -358907
9573c58907g6791a5677A52634a62188C7428a49315A86722l8765i2304c0996k01999
$$ -358907 -76791 -15677 152634 -162188 37428 -149315 186722 147957 -92304 -30996 -232995
9562b32995r393G3592b40952F4930a10321j08010A20315J48947E7809a17763C979
$$ -232995 -242388 73592 -240952 64930 -110321 -218331 120315 269262 57809 -117763 3979
9550A18683a09240a1039p9445E2513J1554J00349b8245j30252k82050A11635i0873
$$ 118683 -109240 -11039 -90484 52513 64067 164416 -28245 -158497 -440547 111635 -90873
9538A03175d5136C2869h7902o6175A76758c73983B2548P0020b3656j53480J6251
$$ 103175 -45136 32869 -87902 -154077 176758 -373983 22548 92568 -23656 -177136 -160885
9527a60885l7090B14320a39031j25194J5418B96764a52367l16r2019J9998F8932
$$ -160885 -197975 214320 -139031 -264225 -248807 296764 -152367 -152683 -244702 -224704 68932
9515a0980k34626j7061e4832A43140b5677H7415b49030a08980a0707o5427c1734
$$ -10980 -245606 -262667 -54832 143140 -25677 87415 -249030 -108980 -10707 -76134 -31734
9503A82442b40182F7210c39282C0260J6914d6996C15685f5121m0604c7284m6068
$$ 182442 -240182 67210 -339282 30260 47174 -46996 315685 -65121 -105725 -37284 -83352
9492h3352k75931G9049n773d885A0883d3794k8140H043K85862A2468a5934j63124
$$ -83352 -359283 79049 73276 -4885 10883 -43794 -71934 8043 293905 12468 -15934 -179058
9480a79058J6751F3893N4231c29144R4787O4691c8388p7778H9085c79107I0583
$$ -179058 -162307 63893 118124 -329144 -234357 -169666 -38388 -116166 89085 -379107 90583
9468a94917e3249q0812e5714j44919f6714A80965b37432p052M9909f3075A50413
$$ -194917 -53249 -134061 -55714 -200633 -66714 180965 -237432 -244484 -194575 -63075 150413
9456e592p6398j15507C2314a24665d3216l8584j21400B68794e3652o8717A46557
$$ -5592 -81990 -197497 32314 -124665 -43216 -81800 -203200 268794 -53652 -122369 146557
9444a20747b9956J4137m9715p4481k33163a27814D28098a77631F7284a81597F7361
$$ -120747 -29956 -15819 -65534 -140015 -373178 -127814 428098 -177631 67284 -181597 67361
9432a38915q4287I1479C8183f6866q8597P899A51784b12021c5179j35867p7598
$$ -138915 -223202 91479 38183 -66866 -155463 -147564 151784 -212021 -35179 -171046 -248644
9421b48644b7040A23757n3989a99880b9448H5438O8193a00595j01453B0936i1828
$$ -248644 -27040 123757 69768 -199880 -29448 85438 153631 -100595 -202048 20936 -91828
9409a12445A43311a67228l2935B94749D8766b49966C33150D7887i6767a9409l66245
$$ -112445 143311 -167228 -200163 294749 48766 -249966 333150 47887 -96767 -19409 -385654
9398c85654I4026D2707a08373e3151q4427l369H598g0455A81693i4622A28857
$$ -385654 94026 42707 -108373 -53151 -137578 -140947 8598 -70455 181693 -94622 128857
9386b91210g1858A34083b28871c8425H476J32599A8150J37717j3465h3202j00046
$$ -291210 -71858 134083 -228871 -38425 8476 141075 18150 155867 142402 -83202 -183248
9375a83248e5842j06516M1658D0056h7255A59351a96232K8055B83446h1965l6657
$$ -183248 -55842 -162358 -120700 40056 -87255 159351 -196232 -168177 283446 -81965 -118622
9364a18622B7775b23617P5973I7812c3441F4143b39682a15015A70046J130m8379
$$ -118622 27775 -223617 -147644 97812 -33441 64143 -239682 -115015 170046 171176 122797
9353A22797K1088c0766j72804A28334e2292m29223B49278g4195m35700F7768b65968
$$ 122797 143885 -30766 -203570 128334 -52292 -481515 249278 -74195 -509895 67768 -265968
9341i1427j80039A13189n4641k978h9455E9643a28724b4927o0513c3084j90077
$$ -91427 -271466 113189 58548 55570 -89455 59643 -128724 -24927 -85440 -33084 -223161
9330b23161J11477J5352a5212n0723K1508p3220B31986R451a14910H2926L4986
$$ -223161 -111684 -96332 -15212 -65935 -44427 -117647 231986 241437 -114910 82926 117912
9319A17912a1801F1109c61966b8803o1396m4444M1805K9655A01552i1763b8994
$$ 117912 -11801 61109 -361966 -28803 -90199 -134643 -92838 -63183 101552 -91763 -28994
9307a56106j6918l2107j7399J01976A51399C22d28087C03693c4065k86086B3306
$$ -156106 -173024 -205131 -222530 -120554 151399 322 -428087 303693 -34065 -320151 23306
9295a6319l02955a56453E788Q1220a83574B20716a29360O2949l42142A36462a88025
$$ -16319 -319274 -156453 5788 87008 -183574 220716 -129360 -66411 -408553 136462 -188025
9283b45804l3012C2470b7172j44162k2463A13656A4574K37682h2948B77044h6230
$$ -245804 -278816 32470 -27172 -171334 -193797 113656 14574 252256 -82948 277044 -86230
9271D7650b18195g3051k25274J16944h658n8563p5652b4505B659J5958P9244L2574
$$ 47650 -218195 -73051 -298325 -181381 -8658 -67221 -142873 -24505 2659 18617 97861 130435
9259A30435A36e1328k08013J12395A41532a6137A41477E2270a69169P6616d4109
$$ 130435 136 -51328 -259341 -146946 141532 -16137 141477 52270 -169169 -92553 -44109
9247B80181G5488G894a28609C54426a75925B8093a04940D1013a09155b3127I0513
$$ 280181 75488 7894 -128609 354426 -175925 28093 -104940 41013 -109155 -23127 90513
9235b38577l3283B32257a4813I6019J48649d3555D4378J03585a8610H9448c3693
$$ -238577 -271860 232257 -14813 96019 244668 -43555 44378 147963 -18610 89448 -33693
9223a09630r580E2854J59338a889j55329L0787O1843j39512i4037j96497c3302
$$ -109630 -119210 52854 212192 -1889 -157218 -126431 -64588 -204100 -94037 -290534 -33302
9211a78532A63041c78184f4002E0492a79924A15419L4189f6412j45836A50789
$$ -178532 163041 -378184 -64002 50492 -179924 115419 149608 -66412 -212248 150789
9200C60165F3697J07831P1835D415d19162a50680a4803k18693r927K8295P9175
$$ 360165 63697 171528 243363 4415 -419162 -150680 -14803 -233496 -243423 -215128 -135953
9189a35953E6712b03914A2725J55401l0089a97898j6638o3751e6089A0674J8433
$$ -135953 56712 -203914 12725 168126 138037 -197898 -214536 -278287 -56089 10674 29107
9178B9107J4792a51330K6711N2258p5997A7862b16956i4155o194M3564j70819
$$ 29107 43899 -151330 -124619 -72361 -148358 17862 -216956 -94155 -100349 -56785 -227604
9167b27604j35472b9134A25639b35152k147J08638C402J73070G2176c64135a26179
$$ -227604 -363076 -29134 125639 -235152 -237299 -128661 3402 176472 72176 -364135 -126179
9155A07251h6597m1045d695B6572K00956A02471c42224A52751b27923P253a03476
$$ 107251 -86597 -127642 -4695 26572 227528 102471 -342224 152751 -227923 -220670 -103476
9143D102c78888h8915k7300a7185L041k94227B13327d3133a9243m34241B31613
$$ 4102 -378888 -88915 -116215 -17185 -14144 -308371 213327 -43133 -19243 -453484 231613
9131c83089D452a28965o5940B91843A18181a88813j68898a04246b5177A89004
$$ -383089 4452 -128965 -194905 291843 118181 -188813 -357711 -104246 -25177 189004
9120a67131B50372C5626e0377q6662r4953a5485k47196E8786a95919f9364D8688
$$ -167131 250372 35626 -50377 -137039 -231992 -15485 -262681 58786 -195919 -69364 48688
9108c9269B32649a8411I6072K1644c59297a53213F1790b42513B55806q3540b66791
$$ -39269 232649 -18411 96072 117716 -359297 -153213 61790 -242513 255806 172266 -266791
9096a17599j5742j19932H1514a81501R0241K1474B1579c7370a0913k32134e487
$$ -117599 -133341 -253273 81514 -181501 -91260 -69786 21579 -37370 -10913 -243047 -5487
9084a37918L8844B83275i8842F5987b79039d9220k89873A2946K05478A9596b12507
$$ -137918 -99074 283275 -98842 65987 -279039 -49220 -339093 12946 218424 19596 -212507
9072E179P1314a51448K8335r6601F6770b17913C0256a92467m8500f6199c1978
$$ 5179 76493 -151448 -123113 -219714 66770 -217913 30256 -192467 -240967 -66199 -31978
9060a14032C5596F992b87455j0030B48342H0356a77927P7016p2122A47260b36473
$$ -114032 35596 6992 -287455 -297485 248342 80356 -177927 -100911 -173033 147260 -236473
9048f5196D65706a9335F4719i5163k47131J11278b1629g948j18240d5425j03550
$$ -65196 465706 -19335 64719 -95163 -342294 -231016 -21629 -7948 -126188 -45425 -148975
9037a48975A16806b76013I2394a49720L3428N696k8479j23644C66874o1107a13906
$$ -148975 116806 -276013 92394 -149720 -116292 -110596 -139075 -262719 366874 305767 -113906
9025a67087A24048g660k92836g04D397O3911d24103A24255k066a47169j23791
$$ -167087 124048 -7660 -300496 -704 4397 68308 -424103 124255 122189 -147169 -270960
9014b70960H8921l0292L2590A8891c9839F1491g3891n8691r9118B25620g8684
$$ -270960 88921 58629 91219 18891 -39839 61491 -73891 -132582 -231700 225620 -78684
9002b45687A52421a79047F3666a02292C10643j8881D343a00006M5274L367p7546
$$ -245687 152421 -179047 63666 -102292 310643 291762 4343 -100006 -54732 -51365 -128911
8991a28911B94123d7066j08823A41192b03305H8643a60443h02B0354c8334A66741
$$ -128911 294123 -47066 -155889 141192 -203305 88643 -160443 -802 20354 -38334 166741
8979H8170M2274a04385L7858a6603E0396Q3852c02126h8646B105c82718a88678
$$ 88170 130444 -104385 -66527 -16603 50396 134248 -302126 -88646 2105 -382718 -188678
8967a5863o8574q3813j70553l0454a80599b5632D7686b30985P1852j24952M0524
$$ -15863 -84437 -168250 -338803 -369257 -180599 -25632 47686 -230985 -159133 -284085 -243561
8956b43561n2406A23831h8608p2615J7451e3898b3257I4491M6245C719b01583
$$ -243561 -295967 123831 -88608 -161223 -143772 -53898 -23257 94491 140736 3719 -201583
8944b75003A97981f5549r2407J298J3945A1114h6600r4704C36343j12750M9834
$$ -275003 197981 -65549 -157956 -156658 -142713 11114 -86600 -181304 336343 223593 273427
8933B73427r1556F2932J09159B1779a61805O4052k0138A64705L18356N1111M95547
$$ 273427 181871 62932 172091 21779 -161805 -97753 -117891 164705 483061 534172 1029719
8922A029719K724902A797787C31770D9743L1614a04443D3397L5036f89A9372a24047
$$ 1029719 3754621 1797787 331770 49743 81357 -104443 43397 78433 -689 19372 -124047
8910A09145n2492j3661e0095l8020A94765a8398l86529a4433k25105a0934l2578
$$ 109145 56653 42992 -50095 -88115 194765 -18398 -404927 -14433 -239538 -10934 -43512
8899d3512A0162d381j61501A32042a63933b3259B893d37034A18664e0199B62289
$$ -43512 10162 -4381 -165882 132042 -163933 -23259 2893 -437034 118664 -50199 262289
8887a561j01j22519b538B12761b44070g2954b4507m17126D567Q6235A904a06341
$$ -1561 -1662 -124181 -2538 212761 -244070 -72954 -24507 -441633 4567 90802 1904 -106341
8874b35489o2413B02916h0186k51408j8961a26922e93A0642b71259a0922D6556
$$ -235489 -297902 202916 -80186 -331594 -350555 -126922 -593 10642 -271259 -10922 46556
8862A4022a49858A62163e10210A8297a47593K1682j6317c5795A69651p036o9493
$$ 14022 -149858 162163 -510210 18297 -147593 -125911 -142228 -35795 169651 162615 93122
$$ [...]
##END NTUPLES=NMR SPECTRUM
##END=
