##TITLE=AC1753_VAR00025_9319603_B6uBSjifrn
##JCAMPDX= 6.0         $$ Bruker NMR JCAMP-DX V2.0
##DATA TYPE= NMR SPECTRUM
##DATA CLASS= NTUPLES
##ORIGIN= BRUKER
##OWNER= Administrator
$$ 1.72 TOPSPIN		Version 2.1
$$ 2015-08-11 22:31:34.023 -0700  Administrator@X
$$ Compression mode = diff/dup
##.OBSERVE FREQUENCY= 400.02188249412
##.OBSERVE NUCLEUS= ^1H
##.ACQUISITION MODE= SIMULTANEOUS (DQD)
##.ACQUISITION SCHEME= undefined
##.AVERAGES= 64
##.DIGITISER RES= 22
##SPECTROMETER/DATA SYSTEM= spect
##.PULSE SEQUENCE= noesygpps1d.comp
##.SOLVENT NAME= COFFEE_meoh
##.SHIFT REFERENCE= INTERNAL, COFFEE_meoh, 1, 14.96075
##AUDIT TRAIL= $$ (NUMBER, WHEN, WHO, WHERE, PROCESS, VERSION, WHAT)
$$ ##TITLE= Audit trail, TOPSPIN		Version 2.1
$$ ##JCAMPDX= 5.01
$$ ##ORIGIN= Bruker BioSpin GmbH
$$ ##OWNER= Administrator
$$ $$ E:\/data/COFFEE/nmr/AC1753_VAR00025_9319603_B6uBSjifrn/12/pdata/1/auditp.txt
$$ ##AUDIT TRAIL=  $$ (NUMBER, WHEN, WHO, WHERE, PROCESS, VERSION, WHAT)
(   1,<2015-08-11 22:31:28.742 -0700>,<Administrator>,<X>,<go>,<TOPSPIN 2.1>,
      <created by zg
	started at 2015-08-11 22:19:59.039 -0700,
	POWCHK enabled, PULCHK disabled,
       configuration hash MD5:
       21 0F 79 D6 B3 7B B4 F6 88 20 88 DB 03 48 BD 9F
       data hash MD5: 64K
       9D FD 1D 8F 32 67 69 3E 05 EF 9D 69 71 23 8A DA>)
(   2,<2015-08-11 22:31:31.945 -0700>,<Administrator>,<X>,<proc1d>,<TOPSPIN 2.1>,
      <Start of raw data processing
       efp LB = 0.3 FT_mod = 6 PKNL = 1 PHC0 = 0 PHC1 = 0 SI = 128K 
       data hash MD5: 128K
       8E CD 21 E6 29 BC 24 40 FC 06 35 E0 F0 E6 8B 63>)
(   3,<2015-08-11 22:31:32.820 -0700>,<Administrator>,<X>,<proc1d>,<TOPSPIN 2.1>,
      <pk PHC0 = 269.6759 PHC1 = 0 
       data hash MD5: 128K
       F4 B5 75 8A B3 DD 6D 2F 0E 88 64 F3 B2 6A A1 16>)
(   4,<2015-08-11 22:31:33.210 -0700>,<Administrator>,<X>,<proc1d>,<TOPSPIN 2.1>,
      <abs ABSG = 1 
       data hash MD5: 128K
       A2 01 B4 AD 4F 1B 8F 57 11 5E CF 29 2D 9C 2D 07>)
(   5,<2015-08-11 22:31:33.320 -0700>,<Administrator>,<X>,<proc1d>,<TOPSPIN 2.1>,
      <abs ABSG = 2 
       data hash MD5: 128K
       05 A3 A1 A6 75 3B 87 E5 DE 99 00 40 52 9C 03 12>)
(   6,<2015-08-11 22:31:33.398 -0700>,<Administrator>,<X>,<proc1d>,<TOPSPIN 2.1>,
      <abs ABSG = 3 
       data hash MD5: 128K
       04 02 8A C8 A9 E1 D1 CD F7 30 DF 84 96 36 4E 09>)
(   7,<2015-08-11 22:31:33.476 -0700>,<Administrator>,<X>,<proc1d>,<TOPSPIN 2.1>,
      <abs ABSG = 4 
       data hash MD5: 128K
       7A 1B 03 8A F5 AA 27 89 91 3C E8 CE BF F9 B5 E0>)
(   8,<2015-08-11 22:31:33.617 -0700>,<Administrator>,<X>,<proc1d>,<TOPSPIN 2.1>,
      <abs ABSG = 5 
       data hash MD5: 128K
       47 FF 07 F5 DA 6E 44 F8 AF 4D CE 79 DE B6 F9 29>)
$$ ##END=
$$ 
$$ $$ hash MD5
$$ $$ B7 3F 3A 43 A5 12 5A 58 C3 A7 B6 11 DA F9 D1 86
##$RELAX= 
##$RELAX= 
##$RELAX= 
##$RELAX= 
##$RELAX= 
##$RELAX= 
##$RELAX= 
##$RELAX= 
$$ Bruker specific parameters
$$ --------------------------
##$DU= <E:\>
##$EXPNO= 12
$$ [...]
##$TP07= 0
##$TPNAME0= <>
##$TPNAME1= <>
##$TPNAME2= <>
##$TPNAME3= <>
##$TPNAME4= <>
##$TPNAME5= <>
##$TPNAME6= <>
##$TPNAME7= <>
##$TPOAL= (0..7)
0.5 0.5 0.5 0.5 0.5 0.5 0.5 0.5
##$TPOFFS= (0..7)
0 0 0 0 0 0 0 0
##$TUNHIN= 0
##$TUNHOUT= 0
##$TUNXOUT= 0
##$USERA1= <user>
##$USERA2= <user>
##$USERA3= <user>
##$USERA4= <user>
##$USERA5= <user>
##$V9= 5
##$VALIST= <valist>
##$VCLIST= <CCCCCCCCCCCCCCC>
##$VD= 0
##$VDLIST= <DDDDDDDDDDDDDDD>
##$VPLIST= <PPPPPPPPPPPPPPP>
##$VTLIST= <TTTTTTTTTTTTTTT>
##$WBST= 2048
##$WBSW= 25
##$XGAIN= (0..3)
0 0 0 0
##$XL= 0
##$YL= 0
##$YMAX_a= 6222567
##$YMIN_a= -11895203
##$ZGOPTNS= <>
##$ZL1= 120
##$ZL2= 120
##$ZL3= 120
##$ZL4= 120
##$ABSF1= 14.96075
##$ABSF2= -5.597432
##$ABSG= 5
##$ABSL= 3
##$ALPHA= 0
##$AQORDER= 0
##$ASSFAC= 0
##$ASSFACI= 0
##$ASSFACX= 0
##$ASSWID= 0
##$AUNMP= <proc_prof1d_extract.lims>
##$AXLEFT= 0
##$AXNAME= <>
##$AXNUC= <1H>
##$AXRIGHT= 0
##$AXTYPE= 0
##$AXUNIT= <>
##$AZFE= 0.1
##$AZFW= 0.1
##$BCFW= 0
##$BC_mod= 0
##$BYTORDP= 0
##$COROFFS= 0
##$CY= 15
##$DATMOD= 1
##$DC= 0
##$DFILT= <>
##$DTYPP= 0
##$F1P= 0
##$F2P= 0
##$FCOR= 0.5
##$FTSIZE= 131072
##$FT_mod= 6
##$GAMMA= 0
##$GB= 0
##$INTBC= 1
##$INTSCL= 1
##$ISEN= 128
##$LB= 0.3
##$LEV0= 0
##$LPBIN= 0
##$MAXI= 10000
##$MC2= 0
##$MEAN= 0
##$ME_mod= 0
##$MI= 0
##$NCOEF= 0
##$NC_proc= -2
##$NLEV= 6
##$NOISF1= 0
##$NOISF2= 0
##$NSP= 0
##$NTH_PI= 0
##$NZP= 0
##$OFFSET= 14.96075
##$PC= 1
##$PHC0= 269.6759
##$PHC1= 0
##$PH_mod= 1
##$PKNL= yes
##$PPARMOD= 0
##$PPDIAG= 0
##$PPIPTYP= 0
##$PPMPNUM= 2147483647
##$PPRESOL= 1
##$PSCAL= 4
##$PSIGN= 0
##$PYNMP= <proc.py>
##$REVERSE= no
##$SF= 400.020009737709
##$SI= 131072
##$SIGF1= 0
##$SIGF2= 0
##$SINO= 400
##$SIOLD= 131072
##$SPECTYP= <>
##$SREGLST= <1H.CDCl3>
##$SSB= 0
##$STSI= 131072
##$STSR= 0
##$SW_p= 8223.68421052631
##$SYMM= 0
##$S_DEV= 0
##$TDeff= 65536
##$TDoff= 0
##$TI= <>
##$TILT= no
##$TM1= 0
##$TM2= 0
##$TOPLEV= 0
##$USERP1= <user>
##$USERP2= <user>
##$USERP3= <user>
##$USERP4= <user>
##$USERP5= <user>
##$WDW= 1
##$XDIM= 131072
##$YMAX_p= 428492483
##$YMIN_p= -10389
##$CURPLOT= <Network HP LaserJet P1505>
##$CURPRIN= <$Network HP LaserJet P1505>
##$DFORMAT= <normdp>
##$LAYOUT= <+/1D_H.xwp>
##$LFORMAT= <normlp>
##$PFORMAT= <normpl>
##$SURQMSG= 1
$$ End of Bruker specific parameters
$$ ---------------------------------
##NTUPLES= NMR SPECTRUM
##VAR_NAME=  FREQUENCY,     SPECTRUM/REAL,   SPECTRUM/IMAG
##SYMBOL=    X,             R,               I
##VAR_TYPE=  INDEPENDENT,   DEPENDENT,       DEPENDENT
##VAR_FORM=  AFFN,          ASDF,            ASDF
##VAR_DIM=   131072,        131072,          131072
##UNITS=     HZ,            ARBITRARY UNITS, ARBITRARY UNITS
##FACTOR=    0.0627417313425164, 1,          1
##FIRST=     8223.62146879497, -887,         -55219
##LAST=      0,             1697,            -55527
##MIN=       0,             -10389,          0
##MAX=       8223.62146879497, 428492483,    0
$$ Real data points
##PAGE= N=1
##DATA TABLE= (X++(R..R)), XYDATA
$$ [...]
65094 216352 211891 207837 204728 202506 200591 198549 196609 195319 194821 194768 194829 194908 194945 194926 195053 195447 195640 194858
65076 194858 192966 190718 188917 187798 187390 187893 189239 190689 191407 191284 190825 190396 189993 189601 189302 188979 188379
65059 188379 187561 186961 186878 187140 187453 187782 188189 188478 188359 187953 187768 188063 188472 188481 188146 188073 188666 189611 190113 189458
65039 189458 187356 184021 180160 176717 174340 173039 172323 171585 170355 168462 166160 163976 162261 160953 159792
65024 159792 158602 157334 156161 155627 156274 157823 159178 159685 160005 161162 163045 164583 165264 165662 166405 167422
65008 167422 168522 169991 172125 174689 177303 180047 183212 186663 189850 192263 193655 194101 194158 194706 196220
64993 196220 198304 200210 201607 202595 203253 203684 204388 206059 208894 212387 215876 219026 221783 224132 226003
64978 226003 227234 227554 226789 225080 222759 220012 216828 213257 209512 205830 202419 199554 197403 195618 193376
64963 193376 190145 186355 183093 181090 180154 179579 178809 177564 175654 173116 170546 168850 168364 168469 168310 167695
64947 167695 166992 166330 165407 164110 162913 162427 162795 163636 164421 164824 164931 165183 165938 167074 168185 169159 170194
64930 170194 171266 171958 172008 171657 171261 170895 170555 170379 170364 170209 169787 169514 169779 170286 170468 170466 171161 173149 176038
64911 176038 178849 180847 181955 182673 183724 185593 188262 191438 194941 198839 203370 208933 215859 223861
64897 223861 231892 239074 245768 253183 261775 270457 277607 282474 285375 286947 287696 288072 288443 288825 288912 288439
64881 288439 287316 285329 281989 276910 270353 263219 256511 250845 246419 243194 240942 239243 237721 236329
64867 236329 235229 234408 233616 232732 231908 231147 229974 227856 224878 221743 219074 216884 214696 211971 208393
64852 208393 203981 199095 194321 190239 187202 185208 183936 183083 182727 183192 184446 185854 186749 187066 187141 187121
64836 187121 186921 186589 186222 185589 184409 183118 182746 183748 185365 186545 187155 187892 189284 191277 193743 196849
64820 196849 200814 205608 210996 216723 222627 228808 235680 243631 252536 261855 271306 281182 291836 302962
64806 302962 313603 322755 329811 334443 336344 335231 331104 324394 315838 306180 295964 285601 275540
64793 275540 266299 258277 251567 245960 241081 236593 232433 228911 226377 224711 223307 221800 220671 220787
64779 220787 222332 224522 226531 228383 230733 234036 238317 243579 249933 257254 265103 273241 281941 291549
64765 291549 301899 312347 322244 331169 338899 345485 351273 356497 360781 363416 364305 364381 364829 366023 367429
64750 367429 368365 368425 367150 363850 358220 350963 343311 335778 327728 318341 307755 296963 286764 277266
64736 277266 268460 260819 254920 250585 246857 243010 239407 237094 236554 237128 237773 238159 238756 239974 241618
64721 241618 243281 244895 246668 248744 251265 254572 258917 263972 268974 273422 277342 280792 283435 284715
64707 284715 284254 281982 278096 273015 267199 260928 254437 248233 242905 238504 234538 230840 228026 226618
64693 226618 225994 224812 222488 219757 217662 216503 216055 216378 217873 220619 224134 227954 232120 236896 242257
64678 242257 248040 254506 262289 271619 282014 293039 304977 318180 331856 344120 353342 358993 361054
64665 361054 359286 353604 344827 334442 323626 312814 302139 291955 282855 275341 269505 264949 261206
64652 261206 258378 257133 257818 259821 262131 264400 267044 270414 274374 278786 284009 290656 299034 308942
64638 308942 319940 331797 344778 359447 375852 392873 408576 421369 430788 437280 441489 443768
64626 443768 444043 441942 437135 429700 420199 409421 398077 386556 374844 362886 351248 341198 333710
64613 333710 328471 324349 320855 318560 317895 318160 318186 317642 317118 317083 317319 317387 317127 316413 314809 311850 307647
64596 307647 302908 298277 293810 289209 284419 279744 275437 271471 267862 264982 263262 262719 263109 264519 267355
64581 267355 271571 276255 280389 283872 287415 291387 295118 297566 298479 298574 298536 298138 296564 293455 289327 284877
64565 284877 280137 274568 267884 260572 253537 247369 242034 237176 232575 228263 224340 220915 218237 216571
64551 216571 215736 215040 214064 213357 213805 215335 216822 217445 217503 217644 218007 218660 220184 222918 225975 227952 228538
64534 228538 228544 228383 227480 225428 222796 220385 218402 216885 216284 216946 218447 220022 221381 222595 223587 224355
64518 224355 225448 227510 230372 233183 235450 237426 239540 241958 244816 248314 252362 256587 260956 266077
64504 266077 272626 280732 290128 300613 312023 323894 335457 345973 354888 361747 366177 367955 367026
64491 367026 363480 357640 350156 341821 333255 324780 316541 308690 301482 295321 290656 287651 285930 284765
64477 284765 283541 281919 279621 276379 272290 267933 263852 260071 256426 253252 251287 250864 251588 252916 254719
64462 254719 257096 259995 263235 266587 269615 271790 273032 273814 274392 274348 273381 272145 271644 272036 272779 273780
64446 273780 275473 277729 279660 280937 282504 285409 289552 294194 299215 305186 312458 320889 330341 340910
64432 340910 352765 366226 381851 399902 419851 441013 463734 489441 519485 554543 595321
64421 595321 643191 699633 765432 840928 926739 1023398 1129753 1241924 1354261 1461718 1561545
64410 1561545 1652933 1735310 1807177 1866383 1910969 1939478 1950868 1944898 1922837 1887363 1841261
64399 1841261 1785990 1721367 1646439 1560683 1464788 1360846 1252119 1142578 1036353 937027
64389 937027 846960 767070 697275 637106 585896 542622 506033 475133 449408 428461 411561
64378 411561 397674 385816 375248 365454 356201 347626 340076 333711 328262 323167 317836 311813 304935
64365 304935 297572 290630 284974 280658 276871 272785 268424 264579 261992 260828 260941 262379 265374 269898
64351 269898 275501 281787 288960 297597 307691 318095 327270 334566 340425 345213 348339 348853 346622 342493
64337 342493 337500 332387 327780 324156 321485 319315 317427 316087 315558 315735 316498 318031 320529 323844 327644
64322 327644 331595 335073 337008 336525 333778 329864 325912 322422 319397 316778 314543 312447 309839 305959
64308 305959 300599 294410 288332 282780 277588 272604 267908 263445 259035 254926 251785 249758 248006 245606
64294 245606 242621 239866 237935 236950 237051 238504 241338 245255 249935 255159 260761 266791 273537 281006 288571
64279 288571 295612 302438 310031 318830 328253 337479 346213 354508 362231 368982 374283 377677 378879 378048
64265 378048 375838 373043 370218 367629 365383 363605 362565 362543 363461 364732 365604 365506 363915 360220 354059 345681
64249 345681 335692 324675 313334 302703 293615 286070 279566 273941 269363 265696 262577 260098 258710
64236 258710 258337 258286 258187 258402 259208 260263 261180 262071 263083 263944 264422 264779 265305 265785 265936 265982 266238 266409 265841
64217 265841 264283 261954 259093 255997 253316 251685 251005 250502 249552 248092 246334 244573 243386 243529 245259
64202 245259 247856 250018 250858 250640 250572 251739 254166 257149 260448 264731 270627 277879 285951 295099 306159
64187 306159 319433 334356 350255 366750 383284 398799 412107 422266 428456 429963 426560 418712
64175 418712 407260 393117 377346 361161 345614 331410 319012 308617 299954 292433 285666 279609
64163 279609 274245 269574 265970 263926 263149 262499 261296 260222 260329 261520 262751 263571 264610 266473 268849
64148 268849 271071 273014 275020 277363 280206 283798 288150 292519 295714 297105 297130 296651 295952 294550 291992
64133 291992 288645 285575 283616 282723 282313 282127 282454 283553 285163 286784 288285 290048 292619 296364 301328
64118 301328 307216 313552 320093 327118 335224 344852 356075 368657 382054 395406 407847 418874 428274
64105 428274 435750 440985 444206 446349 448387 450676 453185 456207 460543 466934 475497 485670 496448 506572
64091 506572 514712 519811 521521 520349 517195 512541 506087 497352 486602 474998 463778 453508 444055
64078 444055 434952 425613 415618 405184 395182 386320 378411 370813 363471 357085 352223 348691 345949 343784
64064 343784 342308 341506 341077 340690 340236 339853 339791 340268 341371 343053 345228 347832 350853 354284 358070 362125
64048 362125 366564 371870 378594 386794 396013 405972 416968 429323 442748 456703 471139 486257 501592
64035 501592 515943 528392 538811 547222 553234 556525 557417 556409 553419 548142 541136 534053 528504 524861
64021 524861 522228 519432 515961 511996 507652 502374 495358 486544 476859 467263 457832 448083 437967 428167
64007 428167 419467 412169 406123 400980 396334 391948 388023 385057 383332 382655 382680 383275 384439 386094 388177
63992 388177 390844 394278 398287 402339 406108 409845 414083 419144 425053 431801 439371 447465 455532 463271
63978 463271 470989 479269 488402 498325 509005 520545 532886 545713 558879 572860 588565 606668
63966 606668 627143 649472 673274 698661 725976 755403 787024 821253 858892 900695 947098
63955 947098 998528 1055767 1119893 1192168 1274255 1368252 1476173 1599611 1740198 1899969 2080617
63944 2080617 2282435 2504503 2745761 3005139 3280535 3568432 3864824 4165883 4467145
63935 4467145 4762389 5043822 5303375 5533875 5729587 5886326 6001239 6072367 6098429 6078705
63925 6078705 6012725 5900226 5742298 5543014 5309378 5049302 4769904 4477780 4179713 3882004
63915 3882004 3589356 3305251 3033231 2777106 2539916 2323290 2127712 1952795 1797344
63906 1797344 1659831 1539063 1434133 1343825 1266534 1200658 1144576 1096400 1054444 1017911 986469
63895 986469 959131 934272 910912 889181 869093 849560 829191 807702 785983 764957 744841
63884 744841 725438 706775 689427 674272 661824 651783 643529 637129 633475 633233 636049 641117 648180
63871 648180 657535 669243 682895 698151 715103 733964 754542 776121 797796 818936 839427 859417
63859 859417 878795 896952 913132 926958 938548 948128 955525 960014 960844 958113 952972 946560 938716
63846 938716 928133 913854 896209 876136 854143 830316 804896 778298 750709 722200 693135
63835 693135 664060 635316 607217 580482 555859 533213 511581 490446 470467 452559 436654
63824 436654 421902 407918 395195 384193 374567 365629 357265 349957 343939 338759 333815 329101 325122
63811 325122 322119 319611 316824 313496 310150 307537 305843 304546 303075 301503 300375 299900 299551 298600 296800
63796 296800 294337 291279 287497 283123 278741 274953 271928 269468 267325 265321 263321 261317 259499 258109
63782 258109 257224 256669 256073 255014 253253 250951 248648 246997 246449 247001 248077 248777 248589 247851 247285 247112 246934
63765 246934 246450 245848 245366 244950 244605 244660 245268 245987 246309 246385 246690 247095 246867 245638 243912 242460 241634 241428
63747 241428 241806 242644 243615 244466 245358 246750 248895 251564 254226 256540 258753 261504 265056 268745 271526
63732 271526 273100 274178 275545 277211 278715 279981 281474 283698 286851 290890 295608 300604 305402 309725
63718 309725 313545 316909 319820 322238 324106 325472 326583 327602 328097 327207 324749 321881 320061 319437 318895
63703 318895 317754 316657 316527 317339 318479 319817 321669 323977 326307 328632 331461 334997 338754 342211 345435
63688 345435 348721 352013 354993 357490 359430 360534 360474 359332 357630 355832 354026 352165 350458 349262 348627
63673 348627 348159 347487 346825 346830 347828 349346 350544 350908 350426 349301 347841 346429 345218 343805 341558 338306
63657 338306 334469 330514 326599 322757 319039 315395 311766 308404 305722 303755 302145 300788 300050 300190 301017
63642 301017 302396 304527 307369 310326 313034 316055 320081 324774 329092 332713 336456 341255 347271 354092
63628 354092 361322 368825 376747 385385 394768 404451 414095 424110 435205 447440 460334 473958 489213
63615 489213 506772 526395 547646 570734 596167 624004 653945 685909 719955 755708 792194
63604 792194 828142 862027 891865 915490 931468 939812 941757 938832 932127 922340 910297 897113
63592 897113 883766 870766 858318 846340 833880 818936 799734 776349 750591 724260 698026
63581 698026 672014 646605 622293 599424 578603 560823 546578 535202 525705 518039 512945 510773
63569 510773 511045 513184 517017 522436 528978 536043 543370 551155 559738 569179 579101 589100 599302 610270
63555 610270 622349 635565 650400 668124 689773 715063 742909 772935 805976 843132 884742
63544 884742 929973 976547 1020586 1057379 1083073 1095962 1096585 1087155 1070964 1051616 1032034 1013920
63532 1013920 998010 984587 973518 963889 953829 940976 923560 901337 875343 846530 814880
63521 814880 780166 743352 706571 671657 639182 609006 581170 555908 533251 513049 495164
63510 495164 479336 465076 452017 440234 429948 421047 413182 406272 400560 396117 392465 388867 385004
63497 385004 381350 378687 377191 376112 374649 372975 371982 372022 372402 372330 371836 371427 371272 371191 371225 371606 372340 373290
63479 373290 374699 377100 380605 384617 388280 390942 392193 392013 391058 390362 390393 390634 390352 389463 388330 387019
63463 387019 385265 383089 380999 379512 378825 378994 380016 381625 383345 385009 386933 389370 392109 394980 398496
63448 398496 403459 409970 417320 424986 433276 442761 453472 464979 477050 489823 503511 518297 534611
63435 534611 553226 575040 600765 630458 662852 695160 724172 747985 766661 781298 792919
63424 792919 802492 811517 821952 835499 853165 875400 902239 933340 968228 1006540 1047648 1089882
63412 1089882 1130429 1166264 1195101 1215489 1226541 1228152 1221423 1208506 1191856 1173632 1155469 1138282
63400 1138282 1122075 1106122 1089407 1070844 1049217 1023416 993017 958540 921115 882064 842763
63389 842763 804502 768136 734046 702560 674236 649541 628414 610328 594620 580765 568697
63378 568697 559103 552976 550514 550771 552882 557223 564745 575365 587803 600982 614828 629644 645510
63365 645510 662583 681247 701479 722722 744889 768978 796108 826410 859493 895532 934959
63354 934959 977125 1019986 1061187 1098827 1131163 1156310 1172761 1179994 1178464 1169382 1154740 1137148
63342 1137148 1119090 1102061 1086292 1071152 1055758 1039372 1021357 1000870 976897 948844 917064
63331 917064 882687 847050 811411 776958 744693 715314 689383 667423 649570 635397 624556
63320 624556 617384 614172 613742 613324 610111 602625 590614 574462 555221 534675 514610 495954 478932
63307 478932 463863 451298 441375 433441 426574 420415 415417 412158 410382 408875 406536 403515 400854 398941
63293 398941 396791 393096 387604 381061 374198 367308 360624 354550 349433 345457 342747 341164 340009 338375
63279 338375 336005 333553 331828 331014 330747 330722 330964 331653 332857 334374 335737 336478 336549 336474 336940 338242 340116
63262 340116 342016 343533 344665 345880 347841 350878 354636 358344 361571 364663 368338 372827 377551 381763
63248 381763 385403 389165 393774 399379 405714 412640 420352 429096 438809 449099 459599 470449 482361
63235 482361 496023 511380 527759 544806 562990 582862 604022 625285 645885 666159 686954
63224 686954 708702 731230 754129 776982 799399 821206 842623 864073 885780 907688 929737
63213 929737 951977 974271 995876 1015379 1031084 1041673 1046700 1046505 1041564 1031967 1017622 998916
63201 998916 977009 953405 929344 905541 882323 859896 838639 819230 802427 788612 777673
63190 777673 769412 763980 761760 762928 767337 774836 785521 799542 816698 836297 857466 879667 902882
63177 902882 927197 952248 977298 1001948 1026464 1051188 1075799 1099513 1121868 1142903 1162593
63166 1162593 1180497 1196036 1208655 1217489 1221270 1218972 1210420 1195998 1175944 1150272 1119320 1084043
63154 1084043 1045715 1005486 964243 922716 881700 842242 805514 772291 742555 715769 691530
63143 691530 669855 650937 634860 621509 610507 601168 592769 585040 578301 572993 569122 566271 564128
63130 564128 562848 562824 564161 566572 569842 574162 579742 586203 592750 599040 605473 612407 619359 625331 629715
63115 629715 632578 634248 635092 635636 636404 637418 638189 638383 638287 638389 638657 638488 637414 635694 634066 632926 631881
63098 631881 630247 627910 625420 623251 621310 619371 617688 616821 617012 617985 619248 620340 621024 621600 622819
63083 622819 625045 627592 629408 630402 631576 633814 637110 641123 645893 651554 657762 663904 669715 675396
63069 675396 681273 687689 695083 703805 713854 725021 737255 750681 765320 781122 798349 817707
63057 817707 839873 864944 892469 922034 953699 987791 1024451 1063614 1105364 1149935 1197239
63046 1197239 1246650 1297434 1349083 1401090 1452835 1504126 1555503 1607412 1659331 1710335 1760394
63035 1760394 1810299 1860319 1909721 1957856 2004846 2050654 2094047 2133004 2165711 2190641 2206105
63024 2206105 2210444 2202659 2182576 2150688 2108299 2057528 2000627 1939349 1875322 1810700 1747828 1688327
63012 1688327 1633061 1582992 1539423 1503249 1474471 1452720 1437963 1430463 1430350 1437483 1451580 1472198
63000 1472198 1498565 1529568 1563975 1600698 1639025 1678692 1719781 1762495 1806901 1852705 1899293
62989 1899293 1946070 1992678 2038629 2082775 2123609 2160289 2192930 2221506 2244684 2260086 2265557
62978 2265557 2259876 2242558 2213624 2173674 2123735 2064843 1998042 1924917 1847851 1769421 1691555
62967 1691555 1615317 1541431 1470888 1404909 1344318 1289003 1238175 1191100 1147456 1107052 1069562
62956 1069562 1034614 1001828 970711 940892 912635 886641 863069 841148 820070 799787 780524
62945 780524 762034 744028 726924 711310 696860 682704 668834 656284 645706 636597 628223 620576
62933 620576 613932 608156 603015 598763 595761 593772 592142 590589 589316 588425 587644 586677 585484 584111 582482
62918 582482 580467 578073 575455 572749 569885 566644 562969 559158 555589 552288 548977 545546 542231 539305
62904 539305 536798 534553 532318 529785 526820 523798 521437 520160 519779 519779 519670 519054 517825 516493 515917 516395
62888 516395 517249 517540 516933 515680 514156 512796 512171 512587 513668 514791 515850 517201 518829 520041 520154 519272
62872 519272 518190 517682 517910 518383 518409 517614 516082 514023 511509 508676 506009 504085 503104 502906 503435 504822
62856 504822 506961 509294 511223 512619 513811 515170 516739 518171 519036 519273 519284 519383 519265 518392 516962 516020
62840 516020 516241 516943 516785 515320 513414 512090 511468 511069 510714 510634 510846 510915 510566 510211 510601 511964 513709 515060
62822 515060 515916 516999 519115 522285 525753 528903 532020 535869 540545 545093 548518 550978 553618 557239
62808 557239 561510 565650 569540 573807 578844 584156 588853 592680 596360 600944 606982 614280 622305 630696
62794 630696 639460 648847 659157 670753 684203 700229 719307 741360 766086 793668 824924 860630
62782 860630 900988 946006 996068 1051648 1112534 1177853 1246935 1319685 1395963 1474986 1555522
62771 1555522 1636198 1715300 1790589 1859711 1920600 1971286 2009746 2034451 2044884 2041105 2023111
62760 2023111 1991173 1946627 1891671 1828332 1758203 1683160 1605535 1527199 1448999 1371510 1295937
62749 1295937 1223835 1156223 1093468 1035749 983064 934803 889950 848093 809958 776620 748217
62738 748217 723696 701773 681889 664160 648716 635430 624132 614643 606528 599247 592737 587503
62726 587503 583895 581665 580548 580823 582759 585800 588978 592043 595575 600092 605713 612763 621916 633464
62712 633464 647060 662486 680074 700080 722205 746232 772635 802176 835364 872809 915531
62701 915531 964131 1017954 1075804 1137379 1203358 1274199 1349564 1428967 1512229 1599009 1688322
62690 1688322 1778679 1868216 1954423 2034146 2104210 2161940 2205088 2231794 2241003 2232792 2207999 2167639
62678 2167639 2112795 2044932 1966117 1879042 1786854 1692705 1599097 1507574 1419024 1334170 1253779
62667 1253779 1178598 1109216 1045877 988312 935918 888230 845137 806565 772165 741465 714223
62656 714223 690351 669505 650948 633893 617921 603039 589342 576629 564292 551750 539062
62645 539062 527064 516704 508168 500827 494092 488136 483610 480759 479140 478291 478310 479433 481245 482783
62631 482783 483535 483854 484137 483981 482641 480144 477428 475303 473669 471906 469744 467553 466036 465847 467293
62616 467293 470197 474060 478462 483217 488210 493369 498921 505308 512582 520104 527186 533843 540640 548011
62602 548011 556149 565458 576571 589840 605240 622863 643118 666271 692233 721041 753100 788554
62590 788554 826707 866425 906833 947153 986102 1022079 1053912 1080923 1102232 1116633 1123412 1122814
62578 1122814 1115430 1101516 1081311 1055680 1025952 993199 958104 921515 884720 848952 814818
62567 814818 782332 751448 722398 695504 670795 647951 626745 607425 590534 576391 564906
62556 564906 555789 548588 542539 536779 530998 525620 521142 517515 514380 511662 509571 508132 507101 506324
62542 506324 505916 506065 506845 508203 509976 511911 513812 515598 517178 518429 519459 520752 522877 526150 530703
62527 530703 536594 543639 551388 559716 569268 580988 595322 612223 631815 654534 680631 709950
62515 709950 742299 777667 816099 857730 903012 952469 1006038 1062863 1121748 1181472 1240598
62504 1240598 1297415 1350352 1398226 1439933 1474148 1499587 1515575 1522425 1521489 1514807 1504484 1492378
62492 1492378 1480496 1471388 1467565 1470444 1480244 1496876 1520537 1551388 1589240 1633851 1685155 1742887
62480 1742887 1806021 1872324 1937895 1997262 2045021 2078301 2097639 2105201 2102098 2087174 2057685 2011045
62468 2011045 1946814 1867798 1779051 1685331 1589483 1493047 1397566 1304742 1215940 1132329 1055258
62457 1055258 985875 924491 870764 824337 784901 751912 724769 703085 686319 673404 663254
62446 663254 655433 649800 645775 642653 640528 640122 641639 644536 648556 654273 662146 671494 680861 689162
62432 689162 696150 701906 706160 708141 707035 702628 695443 686187 675195 662640 649019 635079 621362
62419 621362 608219 596158 585661 576549 568014 559442 550911 542729 534907 527327 520115 513511 507575
62406 507575 502265 497663 493901 490922 488574 486849 485813 485258 484656 483710 482878 483083 484738 487257 489769
62391 489769 492174 495003 498304 501315 503580 505788 508894 512801 516634 520196 524364 529886 536441 543241
62377 543241 550074 557356 565412 574120 583193 592511 602158 612300 623133 634908 647946 662487 678559
62364 678559 696186 715861 738568 765122 795641 829911 868039 910470 957532 1009417 1066405
62353 1066405 1128488 1194543 1262210 1328655 1391247 1447584 1495500 1533435 1560616 1576786 1582123
62342 1582123 1577554 1564749 1545302 1519984 1489006 1452878 1412753 1369919 1325241 1279237 1232629
62331 1232629 1186676 1142886 1102425 1065873 1033413 1004933 979849 957163 936068 916368 898042
62320 898042 880507 862587 843215 821970 799071 775184 751193 727822 705364 683905 663727
62309 663727 645331 629124 615303 603879 594564 586814 580333 575384 572215 570325 568866 567734 567722 569493
62295 569493 572842 577156 582126 587783 594193 601411 609459 618085 626732 634985 642913 650820 658734 666268
62281 666268 672912 678434 683099 687474 691945 696444 700725 704735 708619 712571 716936 722151 728202 734381
62267 734381 740143 746084 753553 763394 775636 790380 808364 830480 857281 889086 926042 967949
62255 967949 1014518 1065995 1122967 1185275 1251461 1319383 1386756 1450881 1508597 1557256 1595572
62244 1595572 1623212 1639997 1646003 1642122 1629784 1609946 1582546 1546962 1502873 1450858 1392467 1329825
62232 1329825 1265170 1200657 1138226 1079165 1023896 972601 926025 885108 849813 818941 791348
62221 791348 766850 745701 727790 712705 700122 689653 680649 672506 664946 657837 651122 645169 640651
62208 640651 637656 635302 632657 629763 627421 626341 626800 628675 631380 634146 636889 640472 645643 652007
62194 652007 658505 664574 670319 675858 681154 686391 691911 697782 703906 710487 717997 726673 736353 746719
62180 746719 757413 768063 778507 788879 799194 809045 818041 826394 834812 844095 855113 868885
62168 868885 886152 907091 931828 961015 995439 1035162 1079415 1127096 1176953 1227393 1276472
62157 1276472 1321964 1361294 1392001 1412909 1424704 1428955 1426837 1419130 1406714 1390069 1368525 1341025
62145 1341025 1307722 1270219 1230286 1189112 1147763 1107501 1069350 1034000 1002266 974979 952181
62134 952181 933056 916943 903832 893586 885286 877748 870330 862875 855269 847413 839406 831443 823678
62121 823678 816299 809558 803679 799011 796302 796365 799268 804072 809463 814325 817734 818893 817466 813721 808217
62106 808217 801560 794548 788150 782962 778764 774711 769969 764171 757484 750308 742934 735647 729151 724405
62092 724405 721686 720229 719323 719389 721303 724999 729633 734962 741523 749354 757635 765969 775094 785804 797994
62077 797994 811402 826561 844220 864232 885678 907796 930259 952974 976147 1000249 1025297
62066 1025297 1050523 1075383 1100685 1128071 1158506 1191710 1226714 1262134 1295980 1326048 1350905
62055 1350905 1370103 1383385 1390218 1390352 1384427 1373617 1358778 1340055 1317158 1289771 1257705 1220835
62043 1220835 1179208 1133582 1085799 1038161 992028 947291 903530 861379 822252 786861 754615
62032 754615 724584 696614 671253 648951 629619 612844 598295 585918 575772 567670 561025 555178
62020 555178 549740 544488 539040 533004 526454 520025 514362 509669 505766 502388 499328 496539 494258 492859
62006 492859 492407 492456 492436 492160 491837 491727 491990 492791 494255 496230 498294 500198 502152 504500 507167 509703 511854
61989 511854 513805 515689 517072 517149 515337 511531 505906 498793 490716 482320 474105 466341 459140 452465 446162
61974 446162 440231 435073 431118 428177 425474 422435 419209 416232 413596 411111 408792 406915 405586 404563
61960 404563 403567 402579 401695 400820 399708 398370 397275 396961 397453 398247 398912 399530 400421 401740 403596 406387 410594
61943 410594 416224 422732 429546 436529 443973 452366 462066 472916 484172 495106 505625 516026 526231
61930 526231 535711 544153 551742 558647 564709 569791 574022 577415 579614 580307 579611 577821 575055 571382 567024
61915 567024 562203 557073 552051 547964 545598 545313 547246 551541 558033 566002 574594 583317 591868 599763
61901 599763 606560 612246 617021 620868 623631 625319 625942 625269 623194 620261 617339 614780 612262 609476 606618
61886 606618 604160 602394 601234 600268 599008 597213 594821 591491 586549 579669 571267 561886 551616 540700
61872 540700 530268 521613 514788 508759 503020 498201 494891 492774 491395 491007 491945 493699 495446 497270
61858 497270 500116 504570 510340 517011 524759 534093 545227 557880 571491 585515 599754 614537 630340
61845 630340 647059 663751 679246 692882 704560 714215 721520 726111 727952 727371 724819 720658 715147
61832 715147 708614 701656 695167 690090 687034 686125 687206 690036 694255 699391 705215 711941 719676 727643
61818 727643 734333 738648 740587 740625 738757 734532 727825 719203 709678 700412 692411 685965 680417 674918 669344
61803 669344 663978 658446 651755 643588 634833 626397 618137 609536 600846 592741 585160 577483 569910 563764
61789 563764 560026 558141 556697 554853 552674 550471 548357 546399 544688 543245 542088 541375 541208 541333 541285
61774 541285 540895 540406 540096 540048 540339 541201 542822 545123 547871 550886 554157 557876 562382 567872 574065 580422
61758 580422 586849 593943 602264 611445 620287 627639 633000 636292 637386 636052 632327 626776 620210 613049
61744 613049 605049 595876 585875 575968 566779 558277 550460 543800 538585 534241 530004 526052 523227 521676
61730 521676 520542 519214 518209 518405 519909 522111 524451 526631 528351 529390 529920 530389 531083 531969 532807 533213
61714 533213 532775 531454 529832 528714 528471 528887 529457 529648 529015 527359 524789 521521 517721 513624 509558 505609
61698 505609 501537 497303 493397 490237 487418 484105 480086 475890 471846 467633 463018 458546 455068 452831
61684 452831 451359 450038 448471 446390 443689 440650 437868 435733 434091 432511 430804 429061 427250 425150
61670 425150 422895 421312 421215 422331 423391 423521 423151 423259 424092 425128 426086 427313 429176 431613 434478 437833
61654 437833 441622 445422 448849 451961 454914 457427 458947 459289 458839 458138 457534 457243 457529 458627 460506 462689
61638 462689 464356 464875 464375 463694 463574 464046 464794 465884 467629 469741 471201 471241 470079 468333 466078 462980
61622 462980 459130 455043 450799 445866 440039 434044 428774 424345 420336 416652 413488 410628 407496 404014
61608 404014 400825 398387 396318 393933 391066 388018 384953 381818 378731 376087 374234 373198 372737 372473 372022
61593 372022 371107 369545 367214 364215 361123 358697 357124 355775 353997 351923 350180 348961 347865 346593
61579 346593 345336 344390 343760 343372 343344 343777 344451 344974 345200 345320 345575 346054 346752 347656 348719 349785 350672 351347
61561 351347 351996 352881 354155 355837 357912 360326 362883 365263 367226 368785 370097 371220 372052 372528 372815
61546 372815 373227 373880 374440 374388 373642 372792 372509 372809 373140 373171 373179 373576 374366 375254 376104 377031 378133 379284 380153
61527 380153 380366 379794 378760 377875 377478 377325 376851 375714 374053 372366 371130 370439 369970 369440 368957 368757 368711
61510 368711 368517 368339 368766 369976 371401 372429 373088 373783 374727 375889 377101 377929 377849 377019 376496 377233 379148
61493 379148 381612 384473 387928 391640 394799 397084 398918 400649 402086 403033 403796 404858 406418 408441 410838
61478 410838 413407 415901 418351 421090 424256 427485 430221 432150 433205 433464 433199 432789 432286 431228 429166
61463 429166 426300 423330 420675 418064 415018 411595 408462 406230 404891 404011 403297 402790 402607 402771 403325 404303
61447 404303 405548 406781 407895 408928 409780 410330 410853 411794 412973 413588 413298 412744 412591 412644 412487 412362 412677
61430 412677 413033 412704 411915 411726 412617 413988 415169 416176 417271 418466 419711 421033 422218 422907 423179 423603
61414 423603 424499 425610 426583 427267 427370 426468 424731 423084 422305 422300 422521 422651 422558 422091 421343 420781 420729 420958 421083
61395 421083 421032 420838 420377 419716 419408 419949 421178 422559 423861 425143 426321 427271 428222 429561 431288 433032
61379 433032 434660 436461 438709 441389 444431 447888 451674 455387 458695 461788 465196 469022 472587 475080
61365 475080 476529 477794 479510 481363 482685 483442 484240 485488 486992 488386 489610 491011 493237 496836 501575
61350 501575 506308 510076 513199 516705 520776 524529 527339 529469 531159 531958 531546 530476 529488 528571 527361
61335 527361 526076 525415 525677 526454 526959 526401 524369 521309 518276 515875 513792 511692 510009 509275 509224 509373
61319 509373 510087 512200 515723 519878 524364 529824 536893 545492 555199 565693 576693 588042 600097
61306 600097 613481 628232 643731 659661 676351 693729 710429 724612 735463 743404 748930 751795
61294 751795 751440 747866 741891 734647 726926 718868 710104 700224 689259 677864 666956 657004 647639 638182
61280 638182 628588 619616 611940 605413 599542 594460 590977 589619 589977 591093 592245 593279 594392 595755
61266 595755 597245 598506 599338 600045 601288 603543 606750 610507 614513 618826 623706 629131 634433 638557 640823
61251 640823 641440 641206 640800 640448 640079 639598 639012 638433 637927 637312 636216 634431 632152 629785 627682 626095 625189
61234 625189 624945 625240 626147 627903 630412 633095 635564 638276 642209 648005 655735 665228 676085 687441
61220 687441 698236 707984 717002 725837 734830 744271 754452 765157 775378 784024 790936 796907 802633
61207 802633 807936 812170 815184 817581 820038 822750 825782 829677 835271 842844 851829 861545 871990 883733
61193 883733 897230 912429 928810 945483 961231 974714 984800 990880 993063 992120 989020 984400 978557
61180 978557 971872 964877 957762 950185 941775 932566 922715 912086 900470 888019 875177 862297 849565
61167 849565 837060 824572 811558 797628 783002 768176 753330 738439 723834 710213 698056
61156 698056 687342 677839 669337 661651 654786 649225 645705 644556 645430 647700 650855 654389 657563 659554
61142 659554 659847 658403 655511 651551 646948 642350 638681 636717 636487 637311 638583 640353 643082 647110 652635
61127 652635 659880 668907 679368 690939 703937 719131 736872 756753 778171 800873 824879 850147
61115 850147 876508 903737 931501 959381 987074 1014452 1041370 1067535 1092667 1116659 1139422
61104 1139422 1160577 1179454 1195473 1208453 1218445 1225289 1228459 1227467 1222292 1213339 1201076 1185918 1168310
61091 1168310 1148652 1127210 1104388 1081039 1058143 1036145 1014935 994558 975555 958439 943204
61080 943204 929599 917603 907419 899209 893071 889105 887354 887734 889979 893499 897510 901799 907303 915336
61066 915336 926126 938690 952230 966924 983107 1000447 1018449 1037160 1056828 1077422 1099040
61055 1099040 1122308 1147741 1175092 1203895 1234210 1266178 1299313 1333006 1367447 1403259 1440390
61044 1440390 1478080 1515802 1553479 1590776 1626876 1661171 1693787 1725349 1756442 1787204 1817174
61033 1817174 1845681 1872618 1898502 1923629 1947719 1970790 1993823 2017932 2043249 2069154 2095103
61022 2095103 2120700 2145627 2170425 2196964 2227416 2263162 2305419 2356335 2418353 2492740 2579524
61011 2579524 2678593 2790337 2916370 3061182 3232905 3441614 3697645 4012400 4399034 4870281
61001 4870281 5437396 6114857 6926065 7902428 9080009 10501929 12214639 14231359 16466571
60992 16466571 18699530 20627459 21994188 22703208 22836888 22592696 22207229 21907661 21866381
60983 21866381 22133417 22583002 22941642 22908021 22289611 21066469 19361278 17364535 15269629
60974 15269629 13235418 11369376 9726191 8319655 7139487 6163289 5362554 4707433
60966 4707433 4171157 3731567 3370067 3070882 2821016 2609591 2427279 2267099 2125105
60957 2125105 1999031 1886407 1784745 1692884 1610857 1538602 1475647 1421627 1375837 1336305 1300243
60946 1300243 1265499 1231099 1196765 1162703 1129485 1097321 1065668 1034287 1004105 976061 949508
60935 949508 922989 896399 871173 848347 827617 808415 790733 774538 759363 745020 731992
60924 731992 720648 710619 701344 692785 685258 678850 673307 668249 663423 658880 654912 651583 648512 645442
60910 645442 642775 641079 640310 640078 640464 641825 643830 645399 645726 644859 643221 641134 638957 637115 635675
60895 635675 634189 632030 628738 624182 618779 613371 608389 603235 596997 589665 582064 574682 567228 559343
60881 559343 551078 542576 534017 526078 519702 515008 510911 506301 501213 496542 492958 490494 488853 487693
60867 487693 486709 485844 485432 485904 487320 489350 491686 494396 497793 501976 506622 511274 515709 519812 523211
60852 523211 525553 527262 529538 533219 537934 542667 546868 550651 554195 557354 559682 560541 559452 556671
60838 556671 553087 549199 544547 538609 531824 525152 518958 512998 507205 501774 496650 491731 487457 484446
60824 484446 482483 480599 478250 475808 473805 472187 470416 467836 464010 459188 454350 450227 446395 441938
60810 441938 436805 431770 427232 423027 419375 416900 415424 413776 411297 408624 406469 404458 401875 398905
60796 398905 396357 394601 393483 393005 393369 394457 395832 397236 398696 400223 401677 402913 403905 404854 406257
60781 406257 408571 411633 414620 416768 417929 418385 418496 418672 419307 420439 421750 423030 424272 425247 425555 425414
60765 425414 425872 427674 430184 431943 432157 431202 429830 428380 426865 425427 424420 424023 423891 423379 422231 420919
60749 420919 420048 419523 418715 417438 416339 416144 416890 417997 418748 418510 416886 413957 410169 405899 401362 396960
60733 396960 393248 390372 387981 385922 384530 383931 383522 382614 381239 379893 378830 378067 377795 378202 378976 379545
60717 379545 379804 380219 381188 382652 384333 386026 387610 389099 390730 392787 395260 397868 400363 402611 404412
60702 404412 405606 406452 407589 409398 411507 413208 414374 415688 417786 420304 422101 422525 422143 421941 422055
60687 422055 421747 420600 419180 418299 418028 417823 417356 416808 416467 416401 416587 417059 417853 419032 420806 423391 426514
60670 426514 429270 430776 430982 430499 429580 427733 424632 420997 417934 415539 412874 409462 406084 403781 402679
60655 402679 402303 402451 403120 404003 404785 405722 407184 408847 410119 411257 413248 416464 420103 423052 424625 424370
60639 424370 422073 418329 414467 411404 408965 406576 404100 401663 399237 396882 395029 393996 393463 392829 391895
60624 391895 390951 390413 390679 392064 394491 397364 399982 401934 403007 403051 402193 401011 400150 399878 400106 400636 401259
60607 401259 401830 402426 403250 404299 405346 406291 407227 408093 408612 408721 408726 408938 409494 410593 412462 414957 417656
60590 417656 420499 423806 427453 430600 432653 434026 435490 437123 438368 438844 438688 438306 438172 438736 440240
60575 440240 442639 445755 449223 452429 455118 458259 463605 471957 482381 493563 505307 518123 531899
60562 531899 545779 558980 570938 580867 587955 591981 593167 591523 586958 579995 571788 563410 555577
60549 555577 548998 544334 541701 540727 541234 543464 547581 553409 560758 569624 579898 591300 603866 618279
60535 618279 635449 655752 678604 702629 726272 748379 768165 784678 796686 803368 804822 801568
60523 801568 793914 782364 768385 753984 740359 727472 715039 703404 693213 684724 677781 672169
60511 672169 667672 664004 661062 659211 659090 661128 665404 671950 680970 692644 706901 723675 743555
60498 743555 767887 797838 833279 872878 915329 960111 1006950 1054973 1102783 1149043 1192595
60487 1192595 1232264 1267009 1296153 1319041 1334565 1341523 1339459 1328660 1309206 1280488 1241998 1194488
60475 1194488 1140183 1082046 1022912 964991 909722 857954 810397 767929 731270 700172 673118
60464 673118 648297 625096 604382 587112 573020 561005 550423 541298 533449 526314 519767 514280
60452 514280 509819 505337 499950 494091 488823 484471 480651 477348 475067 473918 473253 472350 470999 469361 467671
60437 467671 466117 464620 462779 460412 458098 456700 456354 456468 456693 457248 458102 458481 457639 455758 453659 451908
60421 451908 450620 449912 450051 451123 452931 455256 457916 460535 462618 464076 465391 466921 468256 468750 468664
60406 468664 469226 471290 474378 477396 479902 482169 484352 486273 487947 489659 491485 493328 495446 498320
60392 498320 501873 505459 508759 512026 515257 517943 520025 522342 525534 529114 532199 534639 536795 538723
60378 538723 540375 542211 544813 547999 551001 553434 555545 557653 559848 562071 564066 565412 566175 567247
60364 567247 569487 572734 576218 579674 583373 587280 591026 594674 598780 603649 609251 615947 624528 635231
60350 635231 647265 659553 671474 682646 692463 700244 705656 708773 709787 708677 705067 698625 689868
60337 689868 680310 671360 663199 655157 647000 639246 632338 626204 620739 616079 612151 608385 604136 599141
60323 599141 593491 587527 581879 577324 574425 573428 574343 576842 580234 583980 588235 593588 600440 608953 619392
60308 619392 631942 646231 661551 677477 693838 710233 726120 741267 755421 767566 776182 780427
60296 780427 780482 776676 768857 756804 740774 721568 700576 679833 661310 645799 632846 621924
60284 621924 613153 606766 602440 599534 597578 596219 594917 592930 589539 584403 577955 571296 565236 559629
60270 559629 554073 548910 544712 541022 536687 531638 527276 524696 523368 522109 520590 519277 518521 518339 518656
60255 518656 519115 519043 518164 517116 516795 517443 518740 520479 522742 525551 528680 531623 533636 534213 533748 533274
60239 533274 533310 533391 532980 532268 531644 531035 530408 530407 531650 533667 535375 536590 538299 541319 545344 549570 553799
60222 553799 558509 564063 570231 576513 582768 589330 596519 604162 611835 619556 627988 637780 648841 660384
60208 660384 671649 682503 693339 704387 715179 724896 733299 740971 748465 755602 761981 767760 773314
60195 773314 778368 782195 784537 785593 785192 782885 778975 774584 770369 765892 760547 754353 747495 739810
60181 739810 731279 722406 713627 704946 696641 689663 684607 680763 676930 672880 669360 666903 665277 663953
60167 663953 662564 660969 659318 657952 656891 655588 653476 650575 647286 643922 640833 638566 637413 637031
60153 637031 636953 637222 638015 639006 639733 640417 641747 643898 646408 649039 652154 656027 660329 664600 668943 673926
60137 673926 679922 686840 694527 703261 713591 725593 738456 750977 762366 772311 780497 786650 791079
60124 791079 794586 797626 800058 801872 803553 805412 807161 808625 810380 813157 816948 821170 825371 829298
60110 829298 832626 835164 837071 838374 838584 837289 834793 831589 827466 821875 815062 808158 802039 796655
60096 796655 791516 786430 781635 777571 774586 772644 771352 770448 770052 770190 770323 769838 768801 767783 767060 766487
60080 766487 766027 765841 765794 765375 764211 762252 759296 754736 748016 739210 729016 718263 707445 696574
60066 696574 685490 674374 663853 654535 646577 639799 633948 628638 623329 617779 612422 608057 605165
60053 605165 603655 603118 603111 603420 604258 606119 609191 613091 617270 621512 625945 630879 636821 644228 652912 661936
60037 661936 670331 677690 683865 688571 691573 692912 692612 690582 687183 683402 679980 676677 672811 668070
60023 668070 662335 655286 646925 638031 629283 620255 610221 599697 590204 582426 575582 568814 562378 557093
60009 557093 553292 550711 548900 547396 545850 544313 543173 542615 542355 542003 541403 540500 539225 537673 536232
59994 536232 535414 535650 537166 539818 543091 546553 550306 554782 560144 566103 572243 578253 583898 588939 592992
59979 592992 595371 595405 593239 590040 586978 584188 581153 577814 574734 572300 570369 568736 567505 566921 567238
59964 567238 568692 571250 574473 578017 582202 587579 594013 600646 606728 611973 616104 618618 619229 618174
59950 618174 615917 612786 609000 604857 600826 597521 595373 594169 593181 592039 591121 590736 590327 589063 586897
59935 586897 584406 581949 579697 578274 578439 580147 582735 586094 590797 596970 603845 610710 617494 624135
59921 624135 630074 634826 638489 641292 643188 644330 645444 647199 649518 652022 654904 658958 664740 671927
59907 671927 679402 685902 690809 694441 697423 699812 701123 701188 700463 699348 697626 694929 691416 687746 684564
59892 684564 682282 681179 681448 683149 686242 690639 696237 702944 710542 718475 726041 733087 740322 748601
59878 748601 758036 768109 778350 788352 797354 804551 809891 813928 816801 817986 817249 815237 812771 810006
59864 810006 806607 802431 797673 792612 787483 782443 777455 772288 766747 760869 754935 749424 744805 741132
59850 741132 737962 734966 732528 731464 732300 735110 739732 745626 751673 756684 760112 761888 761874 760154 757761
59835 757761 756363 757098 760110 765000 770943 776413 779729 780180 778096 773891 767864 761023 754980 750461 746587
59820 746587 742152 737022 731854 726987 722177 717107 711685 706122 700963 696715 693221 689818 686252 682943
59806 682943 680121 677278 673762 669441 664514 659238 654176 650121 647265 644903 642375 639811 637517 635174
59792 635174 632315 629246 626804 625351 624532 623915 623369 622866 622355 621893 621607 621453 621172 620551 619725 619218 619562
59775 619562 620746 622260 623922 626325 629971 634253 638057 641222 644529 648240 651700 654701 658200 663056
59761 663056 668833 674554 679982 685500 691266 697336 704199 712457 722159 733044 745134 758461 772403
59748 772403 785930 798426 809848 820314 829979 839108 847721 855345 861563 866587 870817 874056 875721
59735 875721 875645 874114 871281 867233 862621 858513 855338 852440 849027 845243 842044 840140 839348 838911 838247
59720 838247 837186 835585 833071 829462 825243 821179 817444 813542 809143 804566 800315 796570 793401 791051
59706 791051 789705 789272 789634 790834 792828 795375 798481 802620 808207 815043 822556 830456 838977 848567 859263
59691 859263 870079 879104 884763 887167 887783 887725 886939 885124 882607 879841 876693 872759 867924 862113 855050
59676 855050 846791 838083 829617 821313 812872 804563 796852 789664 782799 776775 772444 769852 768207 767026
59662 767026 766633 767445 769361 772105 775692 780273 785806 792088 798953 806268 813850 821466 828902 835946 842307
59647 842307 847472 850764 851702 850265 846637 840789 832610 822372 810673 797981 784725 771799 760313
59634 760313 750659 742333 734838 728184 722277 716593 710864 705499 700770 696133 690905 685203 679520 673643
59620 673643 666658 658018 648253 638669 630494 624049 618548 613009 607535 603296 601061 600311 600156 600540 601931
59605 601931 604163 606288 607510 607928 608342 609500 611316 612804 613109 612617 612590 613633 615201 616679 618111 619468
59589 619468 620110 619631 618563 617603 616684 615444 614054 612873 611733 610228 608359 606335 604120 601715 599427
59574 599427 597326 594934 592051 589352 587499 586194 584825 583584 583131 583537 584328 585213 586000 586175 585342 583877
59558 583877 582412 580945 579185 577451 576496 576589 577400 578621 580099 581700 583589 586327 590108 594269 598113
59543 598113 601761 605697 610156 615715 623778 635573 651157 670079 692019 715454 736514 750925
59531 750925 757151 756547 750927 741550 730251 719638 711482 706018 703138 703110 705681 709526 713203 716008
59517 716008 717701 718145 717544 716265 714126 710434 704851 697752 689709 681306 673324 666326 659998 653606 647025
59502 647025 640643 634496 628453 623057 619113 616505 614547 613474 614259 616738 619231 620502 621054 622008 623725
59487 623725 626111 629332 633502 638246 643133 648064 653016 658055 663766 670875 679143 687383 694900 702081
59473 702081 709238 715667 720351 722931 723615 722839 721348 719905 718500 716546 714160 712403 711888 712043 712339
59458 712339 713355 715883 719731 724272 729624 736392 744578 753554 762938 772745 782681 791889 799551 805404
59444 805404 809592 812126 812519 809989 804161 795567 785344 774618 764364 755527 748649 743387 738854 734401
59430 734401 729814 725050 720363 716420 713687 711965 711202 712335 716458 723461 732467 743378 756937 773431
59416 773431 792453 813804 837483 863086 890646 921674 957148 993904 1024931 1044297 1050688 1045960
59404 1045960 1032516 1013459 993331 976474 965235 960972 965513 979388 998861 1016615 1025957 1023929
59392 1023929 1011193 990605 966050 941100 917739 896384 877010 859876 845430 834077 825887
59381 825887 820088 815209 810324 805890 802792 800927 799397 797813 796613 796174 796282 796431 796166 795159 793418
59366 793418 791446 789963 789536 790482 792705 795461 797857 799950 802811 807129 812425 818158 824852 833318 843422
59351 843422 854621 867308 882481 900150 919069 938186 957528 977472 997845 1018109 1037933
59340 1037933 1057216 1075699 1092759 1107491 1119016 1126809 1130733 1130776 1126988 1119766 1109814 1097550 1082865
59327 1082865 1065700 1046595 1026381 1005652 984806 964300 944454 925253 906750 889487 874171
59316 874171 860994 849498 838986 828939 819225 810065 801619 793554 785330 776933 768991 762114 756562
59303 756562 752638 750864 751475 754237 759023 766196 776193 788942 803667 818659 831149 838190 838212 831520
59289 831520 819349 803099 784605 766190 749757 736103 725357 717534 712405 709478 708539 709770 713156
59276 713156 718361 725407 734719 746204 759049 772824 787980 804774 822448 839997 857063 873484
59264 873484 888609 901699 912438 920588 925734 927863 927540 925032 919989 912516 903816 895137 886824 879008
59250 879008 872404 867588 864135 861256 858711 856487 854309 852309 851469 852525 854966 857872 861117 864894
59236 864894 868771 872140 875057 877703 879521 879752 878309 875307 870455 863814 856444 849199 841479 832360
59222 832360 822301 812419 802577 791686 779681 767773 756758 746331 736225 726897 718934 712594
59210 712594 707983 704869 702417 699918 697621 696127 695332 694924 695400 697275 699572 700618 700420 700852 703215
59195 703215 706835 710467 713853 717384 721224 725501 730602 736668 743289 750125 757337 765033 772746 779815
59181 779815 785941 791118 795298 798321 800062 800662 800755 801139 801847 801905 800554 798412 796811 796161 795682 794564
59165 794564 792746 790709 789111 788524 788913 789523 789774 789944 790305 790047 787962 783876 778469 771922 763867 754647
59149 754647 745453 736965 728737 720191 711459 703001 695082 687832 681237 674845 667975 660410 652512 644801
59135 644801 637890 632628 629545 628104 627062 625645 623986 622669 622399 623865 627238 631854 636976 642599
59121 642599 649006 655963 663157 671006 680061 689850 699359 708520 718245 729000 740322 751666 762768
59108 762768 773119 782126 789963 797428 804779 811387 816550 819914 821163 820184 817560 814144 810109 805207
59094 805207 799802 794729 790135 785436 780488 775970 772538 770388 769551 769699 769778 768824 767130 765643 764297
59079 764297 762057 758591 754638 750610 746031 740700 735225 730064 725064 720274 716160 712586 708612 703809
59065 703809 698939 694884 691747 689351 687742 686737 685735 684413 682939 681288 679173 676856 675147 674286
59051 674286 673656 672871 672226 671773 670990 669848 669243 669746 670671 670977 670470 669647 668946 668587 668620 668799 668902 669342 670814
59032 670814 673292 676210 679759 685038 692578 701628 711340 721897 734006 747978 763627 780387 797268
59019 797268 813385 828758 843815 857973 869547 877200 880581 879562 874126 865446 855749 846441 837312
59006 837312 828062 819537 812777 807892 804636 803185 803620 805496 808661 813588 820095 826572 831423 834630
58992 834630 837090 839091 840425 841466 843049 845422 847950 849687 849807 847985 844999 842562 841914 842782 844188
58977 844188 845955 848985 854389 862784 874110 887654 902379 917535 932862 948241 963478 978459
58965 978459 992993 1006553 1018713 1029834 1040585 1050698 1058981 1064699 1068183 1069865 1069433 1066199 1059673
58952 1059673 1049669 1036546 1021446 1005479 988673 970587 951941 934493 919167 905419 892709
58941 892709 881424 871977 864151 857847 853387 850549 848361 846358 845104 845009 845747 847333 850529 855443 860806
58926 860806 865392 869189 872447 874695 875618 875956 876490 876813 875994 873933 871404 869316 868463 869395 872036 875978
58910 875978 881345 888464 896637 904516 912110 921003 932005 944044 956191 969139 983481 997925 1010755
58897 1010755 1022069 1033077 1043942 1053745 1062115 1069685 1077318 1085866 1096210 1108577 1122270 1136861
58885 1136861 1153052 1171464 1191220 1210601 1228534 1244584 1258103 1268389 1275293 1278949 1279365 1276839
58873 1276839 1272188 1265971 1258182 1249220 1240268 1232051 1224070 1215658 1206804 1197373 1186763 1175187 1163965
58860 1163965 1153517 1142283 1128832 1113864 1098875 1084024 1068757 1053440 1038741 1024324 1009802
58849 1009802 996252 985076 975897 967147 958229 949524 940717 930745 919183 906296 891978 876087
58837 876087 859603 844090 830120 817324 805697 795593 786707 778378 770778 764668 760225 757176 755814
58824 755814 756611 759001 761739 764445 767834 772533 778556 785631 793098 799803 805074 809520 813986 818185
58810 818185 821255 823078 823935 823423 821013 817268 813247 808989 803819 797805 791689 785606 779120 772342 765839
58795 765839 759593 753166 746730 740874 735552 730238 724885 719806 714934 710313 707019 706441 708752 712984
58781 712984 718389 724856 732347 740885 750671 761327 771437 779791 786531 792115 795774 796205 793227 787681
58767 787681 780262 771640 763035 755305 747925 740087 732193 725041 718318 711462 705360 701505 699878 699253
58753 699253 699188 700065 701540 702612 703010 702969 701996 699575 696791 695431 695581 695798 695646 696336 698847 703052 708746
58736 708746 715887 723679 730969 737731 744771 751972 758304 763620 768927 774711 780433 785811 791249 796811
58722 796811 802057 806997 812053 817118 821807 826474 831822 837822 844242 851661 860366 868819 875012 878987
58708 878987 882134 884342 883974 880483 874827 867177 856463 842556 826783 809832 791121 770793 750339
58695 750339 730604 710968 691223 672584 656105 641648 629069 618893 611073 604498 598370 592820
58683 592820 587710 582318 576700 571943 568443 565317 562060 559447 558173 557814 557707 557771 558055 558613 560121 563516
58667 563516 568772 575121 582538 591729 602713 614682 627114 639425 649722 655730 657149 655447 651454
58654 651454 645023 637017 629307 622418 615266 607629 600712 594813 588699 582090 576517 572796 569729 566448
58640 566448 564034 563539 564118 564464 564669 565501 567093 569397 572719 576818 580612 583439 585578 587132 587769 587862
58624 587862 588222 588361 586831 583802 581370 580710 580928 581436 583248 586853 590927 594478 598453 603869 610052
58609 610052 616001 621841 627590 632154 634956 637152 639889 642711 644897 646863 648883 649790 648492 645690
58595 645690 642820 640295 637902 635857 634423 633473 633356 635083 638959 644249 650841 659763 671254 683921
58581 683921 696712 710136 724600 739152 752940 766286 779205 790595 800121 809276 819268 829395
58569 829395 838903 848946 861222 875989 892845 912290 935193 961722 991789 1025241 1060727 1095830
58557 1095830 1129312 1161636 1192249 1218138 1236401 1246674 1249909 1246654 1238061 1226784 1215030 1203065
58545 1203065 1190997 1180384 1172417 1165969 1159023 1150586 1139695 1124289 1103110 1077529 1049765 1020503
58533 1020503 989854 959215 930247 903134 877634 854774 835790 820331 807295 796489 788047
58522 788047 781253 775357 770466 766456 762292 757661 753737 750937 747651 742849 738275 736109 735903 735770 735298
58507 735298 735281 735687 735853 735760 735399 733940 731144 728491 727326 727122 727010 727501 728927 729831 728983 727636 727725 729133
58489 729133 730906 733840 739437 747218 755473 764060 774347 786911 801190 816954 834479 853702 874519
58476 874519 897121 920883 943966 965176 984825 1002409 1015141 1020625 1019672 1014778 1007232 997468 986725
58463 986725 976317 966465 957553 951149 948059 947029 947249 950433 958334 969908 983133 997903 1014637
58450 1014637 1031637 1046398 1058244 1067186 1071566 1069479 1061426 1049174 1033215 1013751 992871 973103
58438 973103 954828 937521 922300 910691 902049 894777 889052 885881 884611 883942 884359 887122 891896 897783
58424 897783 905443 915708 927277 938261 948676 958905 967124 971047 970932 968228 962713 953832 943365
58411 943365 933643 924365 914158 903938 895566 888409 880545 872320 865486 859891 854296 849495 847335 847500
58397 847500 848414 850369 854545 859936 864548 868822 874654 881853 888713 895163 902257 909631 916635 924754
58383 924754 935558 947396 957509 966121 974950 983153 988710 992530 997120 1002236 1005943 1008945 1013599
58370 1013599 1019538 1024590 1029276 1035988 1044373 1051991 1059120 1068464 1080390 1092836 1105646 1120626 1137421
58357 1137421 1153609 1168821 1184511 1199763 1211515 1219020 1224053 1226960 1226617 1224102 1222248 1221587 1220738
58344 1220738 1220322 1222314 1225991 1228964 1231909 1237840 1247098 1257593 1269454 1284695 1302627 1320545 1338711
58331 1338711 1359694 1382926 1404966 1425010 1445033 1464497 1480187 1491477 1500673 1508124 1512182 1513984
58319 1513984 1516843 1520738 1522820 1523508 1526478 1532391 1538381 1544048 1552143 1562855 1573267 1583107 1595204
58306 1595204 1609637 1623331 1636041 1650810 1667925 1684550 1700923 1720511 1743159 1764520 1783332
58295 1783332 1802845 1824093 1844372 1863612 1885552 1911076 1936830 1961796 1988796 2018251 2047103
58284 2047103 2075202 2105965 2139476 2171845 2202676 2236003 2272587 2308825 2344783 2385483 2432418
58273 2432418 2481466 2531016 2584154 2640821 2696128 2748880 2803713 2862357 2920946 2978449 3039354
58262 3039354 3105339 3172698 3240661 3313625 3392315 3471436 3548976 3628977 3712222 3793488 3871195
58251 3871195 3950528 4033859 4117621 4201797 4292544 4391957 4495222 4601259 4715781 4840457
58241 4840457 4970000 5103535 5247500 5403546 5565456 5732021 5910635 6103971 6306085
58232 6306085 6516234 6742967 6989638 7249906 7522797 7817395 8137093 8474790 8829847
58223 8829847 9213589 9631502 10077210 10551272 11067788 11634430 12244968 12900451 13617965
58214 13617965 14409147 15271308 16210482 17251268 18412863 19699386 21126577 22733262
58206 22733262 24553971 26609123 28938921 31619056 34728919 38340487 42561552 47558572
58198 47558572 53520088 60639677 69156351 79363442 91557523 106051133 123284764
58191 123284764 143867272 168475383 197795140 232488826 272698787 316857166 360674318
58184 360674318 397677548 421507978 428492483 418761613 395540091 363518021 327307519
58177 327307519 290448474 255082367 222228705 192321946 165571801 142029780 121581940
58170 121581940 104020716 89111161 76577477 66093613 57338908 50042751 43963013
58163 43963013 38865021 34551687 30886292 27762777 25077511 22746366 20720560 18962062
58155 18962062 17421478 16055071 14841788 13765668 12798799 11916442 11111806 10381249 9710301
58146 9710301 9087279 8515295 7997523 7524218 7086044 6686382 6328580 6003906 5703527
58137 5703527 5429944 5185052 4958386 4738619 4526506 4326187 4133927 3945729 3766557
58128 3766557 3601770 3447731 3299913 3161819 3037093 2921043 2808584 2702748 2607131 2517652
58118 2517652 2429849 2346888 2272452 2202825 2133753 2068248 2010029 1955811 1901350 1848801 1801098
58107 1801098 1755296 1708287 1662968 1622046 1581785 1538481 1495213 1455785 1417960 1379176 1342951
58096 1342951 1312760 1285104 1255478 1226115 1201191 1179177 1156477 1134196 1115061 1097812 1080426
58085 1080426 1064636 1051756 1038354 1021458 1003637 987756 971401 951887 931961 914781 897805
58074 897805 877486 855721 835906 816839 796361 776895 761402 747696 732635 718250 707806
58063 707806 699402 689481 679382 672439 667548 661405 654246 647745 640099 628999 616919 607795 600762
58050 600762 592483 583304 575681 568825 560405 551668 545625 541837 537848 533844 531109 527864 521617 513901
58036 513901 507943 503382 497912 492249 488598 485903 481468 475838 471300 466943 459931 450567 441596 433562
58022 433562 425124 416895 410765 406350 402048 398392 396550 394883 391092 386456 383878 382969 381180 378582
58008 378582 377273 377105 376175 374837 375145 376967 378440 379604 381918 384872 386637 387280 387933 387740 385165 381285
57992 381285 378147 374877 369212 361995 356318 352929 350255 348202 348016 348918 348770 347829 348192 349793 350490 349914
57976 349914 349684 349930 349018 346757 344783 343765 343118 343207 344927 347397 348964 350041 352103 354524 355502 355539
57960 355539 356770 359167 360648 360631 360386 360095 358646 356128 353631 350841 346770 342380 339446 337304 333946
57945 333946 329933 327849 328045 328351 328042 328738 331168 334255 337766 342864 349631 356867 364547 373630 383242
57930 383242 390975 396295 400832 404958 406956 406033 403419 399899 394892 388525 382188 376377 370175 363247
57916 363247 356281 349309 341762 334309 328446 324207 320431 317036 314744 312973 310707 309215 310979 315899
57902 315899 321391 326316 331784 337863 342671 345431 347531 349768 351206 351538 352056 353469 355155 357291 361265
57887 361265 367132 372943 377384 380990 384162 386297 387513 388918 390407 390408 388586 386652 385691 384747 382824
57872 382824 380315 377723 374939 372445 371276 371089 370164 367877 365301 362991 360327 357544 356088 356222 356453
57857 356453 356177 356831 359536 363583 368048 372966 378047 382184 385132 387962 391100 393701 395562 397684 400197
57842 400197 401796 402090 402479 403700 404434 403509 401736 400416 399603 398923 398608 398700 398655 398613 399696 402165 404646
57825 404646 405947 406355 406488 406255 405527 404462 402660 399455 395460 392178 389719 386708 382904 379866 378226
57810 378226 376299 372398 366792 360353 353077 345048 337304 330553 324338 318430 313682 310609 308470 306654
57796 306654 305656 305807 306367 306660 306893 307139 306817 305866 305167 305287 306104 307992 311690 316492 320410 322871 325539
57779 325539 329735 334797 339780 344910 350310 355074 358723 361979 365012 366573 365998 364496 363243 361738
57765 361738 359323 356859 355488 354955 354415 353869 353685 353776 354177 355348 357022 358069 358361 359394 362105 365451
57749 365451 368154 370465 373093 375817 378323 381089 384226 386650 387621 387971 388729 389732 390583 391670 393066
57734 393066 393739 393078 392088 391844 391926 391540 390977 390730 390334 389419 388849 389508 390874 391997 393003 394472 396223
57717 396223 397828 399513 401565 403689 405767 408188 410681 412059 412015 411832 412347 412669 412015 411269 411382 411730
57701 411730 411637 412127 414376 417547 420008 421872 424591 428620 432952 436349 437716 436009 431271 425141 419098
57686 419098 412825 405465 397618 390754 385426 381473 379254 379234 380946 383764 388294 395766 406622 420872
57672 420872 439345 463366 493674 530755 575746 629889 693070 762951 834174 897663 942492
57661 942492 960775 951125 917367 865416 802241 735603 671921 614287 563599 520714 486156 458862
57649 458862 437142 420346 408059 398510 389681 381591 375715 372409 370489 369108 368432 368556 369117 369916
57635 369916 370779 371036 370310 369482 369663 370557 371007 370773 370532 370435 369918 368712 366986 364816 362489 360884 360404
57618 360404 360086 358841 357093 356048 355864 355726 355200 354358 353080 351479 350469 350704 351467 351782 351964 352810 354024
57601 354024 354849 355569 356822 357983 357863 356500 354724 352492 349383 346267 344631 344366 343972 342836 341652
57586 341652 340742 339716 338850 339089 340377 341457 341598 341245 340881 340515 340412 341002 341873 341978 341012 339594 338180
57569 338180 336841 335919 335698 335558 334639 333202 332182 331632 330917 330171 330134 330710 331151 331590 332973 335456 338293
57552 338293 341281 344888 348946 352699 356259 360535 365484 369792 372562 374129 375101 375892 377313 380255 384461
57537 384461 388693 392264 395328 397765 399153 399874 400817 401850 401952 401132 400784 401819 403690 405636 407633
57522 407633 409761 411799 413860 416397 419336 422161 424960 428369 432378 436335 440184 444504 449244 453656
57508 453656 457581 461547 465531 468924 471828 474994 478319 480831 482395 483966 485840 487143 487490 487717 488411
57493 488411 489071 489315 489721 490805 492243 493658 495235 497121 499161 501492 504380 507318 509461 511102 513484
57478 513484 516937 520581 524053 527939 532110 535345 537340 539510 542895 546616 549415 551571 554243 557824
57464 557824 561879 565954 569748 573162 576737 581333 586991 592926 598819 605022 611284 616621 620946 625487
57450 625487 630927 636407 641090 645456 650217 655097 659622 664087 668878 673777 678724 684333 690849 697500
57436 697500 703741 710219 717664 725633 733138 739799 745665 750765 755579 761143 767899 775109 782027 788861
57422 788861 795937 802816 809079 815281 822317 830415 839288 848616 857903 866603 874901 883594 892805 901675
57408 901675 909774 917793 926329 935026 943460 951767 959770 966644 972241 977662 983731 989986 995986 1002504
57394 1002504 1010395 1019332 1028693 1038749 1049933 1061755 1073490 1085149 1096843 1108096 1118825 1130144
57382 1130144 1143002 1156674 1169659 1181480 1192648 1203518 1214248 1225254 1236647 1247676 1257628
57371 1257628 1266760 1275559 1283805 1291293 1298820 1307476 1317460 1328485 1340710 1354381 1369118 1384470 1400566
57358 1400566 1417495 1434743 1452067 1470117 1489276 1508744 1527752 1546823 1566678 1586789 1606309
57347 1606309 1625644 1645690 1666075 1685618 1704054 1721918 1739122 1755143 1770436 1786261 1803074
57336 1803074 1820267 1837424 1854708 1872033 1888932 1905409 1922147 1939889 1959182 1980396 2003193
57325 2003193 2026324 2048829 2071109 2094010 2117313 2140124 2162353 2184687 2207280 2229537 2251116
57314 2251116 2272264 2293346 2314832 2337456 2361467 2385921 2409586 2432361 2455087 2478348 2502308
57303 2502308 2527274 2553366 2579872 2605927 2631662 2657803 2684558 2711779 2739824 2769133 2799271
57292 2799271 2829507 2860039 2891508 2923553 2955109 2986020 3017123 3048750 3080421 3112143 3144864
57281 3144864 3179292 3215099 3251463 3287662 3323094 3357512 3391311 3425035 3458725 3492368 3526547
57270 3526547 3561772 3597551 3633162 3669027 3706075 3743993 3781473 3818186 3855164 3892973 3930785
57259 3930785 3967646 4003574 4039075 4074547 4110616 4148104 4187060 4226481 4265443 4304050 4342980
57248 4342980 4382610 4422836 4463308 4503643 4543756 4583930 4624220 4664020 4702724 4740548 4778050
57237 4778050 4815152 4851431 4887067 4922574 4957746 4991884 5025096 5058417 5092529 5127208 5162166
57226 5162166 5197592 5233648 5270106 5306723 5343510 5380603 5418291 5456919 5496185 5534825 5571742
57215 5571742 5607166 5641835 5675331 5706201 5733664 5758230 5780702 5801489 5820859 5838971 5855639
57204 5855639 5870917 5885846 5901779 5919046 5937205 5956348 5977089 5999347 6022318 6045733 6070076
57193 6070076 6095484 6121469 6147820 6174666 6201561 6227572 6252475 6276820 6300638 6323163 6344029
57182 6344029 6363646 6382120 6398872 6413588 6426501 6437378 6445270 6449702 6451139 6449922 6445658 6438036
57170 6438036 6427290 6413381 6395659 6373818 6348429 6320132 6289083 6255584 6220457 6184421 6147818
57159 6147818 6111231 6075561 6041198 6007984 5976312 5947363 5921843 5899314 5879198 5861689 5847279
57148 5847279 5836093 5828050 5822961 5820212 5819016 5819111 5820352 5821544 5820805 5817432 5812370 5806536 5799892 5792635
57134 5792635 5785867 5779917 5772835 5761636 5744814 5723182 5698904 5674323 5651135 5629850 5609994 5590912
57122 5590912 5572063 5552729 5532396 5511638 5491925 5474525 5460489 5451742 5450908 5459703 5478544 5508127
57110 5508127 5550194 5606338 5677409 5765048 5872981 6006437 6171543 6376149 6630358 6945690
57100 6945690 7335029 7814474 8404546 9128894 10012492 11080788 12357730 13861771 15603613
57091 15603613 17588312 19818216 22291875 24999596 27919314 31014101 34231681 37507774
57083 37507774 40772009 43949032 46950021 49661618 51944654 53646196 54619203 54746088
57075 54746088 53966519 52302708 49865722 46832475 43403628 39765665 36072547 32444617
57067 32444617 28973209 25723675 22737198 20034173 17619176 15485469 13618070 11996176
57059 11996176 10595532 9390427 8355148 7465396 6699517 6038800 5467038 4970444 4537877
57050 4537877 4160283 3829451 3537726 3278979 3049009 2844516 2662144 2498769 2351950
57041 2351950 2219571 2099582 1990510 1891609 1801960 1719958 1644285 1574933 1512699 1457993 1410625
57030 1410625 1370408 1337500 1312352 1295686 1288353 1291192 1305126 1330613 1365248 1401268 1426860 1431648
57018 1431648 1411530 1368779 1308869 1237961 1162015 1086247 1014552 949381 891780 841396 797163
57007 797163 758465 725170 696474 670683 646694 624731 605090 587171 570496 555549 542612
56996 542612 530621 518322 505822 493952 482841 472320 463072 456040 451075 447470 445571 446685 451499
56983 451499 459516 469666 480224 488326 490949 486825 476819 462577 445648 427721 410609 395596
56971 395596 383209 373534 366299 360949 357280 355720 356427 358641 361773 366676 374889 386926 402281 420666
56957 420666 441961 464809 486254 502932 512165 512307 503136 486103 463617 438165 412396 389185
56945 389185 370278 355174 342444 331944 324644 320670 319108 319842 324121 332824 345439 361409 381551
56932 381551 407336 439019 474531 509498 538200 555573 559217 549784 529829 502778 472382 441711
56920 441711 412118 383721 356950 332951 312471 295304 281076 269695 260707 253048 245947 239572
56908 239572 234392 230376 227164 224569 222556 221022 219916 219382 219689 221118 223808 227490 231582 235930 241180
56893 241180 248037 256436 265946 276664 289080 303469 320131 339742 362278 385520 405544 418966
56881 418966 424251 421310 411062 395642 377986 360524 344538 330699 319548 311326 306069 304044
56869 304044 305635 310780 319208 331249 347788 369392 396137 428319 466571 511001 560385 611726
56857 611726 659716 697099 717295 717759 700767 671130 633806 593332 553812 518320 488529 465268
56845 465268 449054 439952 437544 441422 451520 468055 491596 523158 563700 613685 673612 744343
56833 744343 825303 911500 992796 1056767 1092928 1095981 1067327 1014343 947090 874337 801931 733773
56821 733773 672786 620602 577432 542988 517177 499717 489819 486703 490106 500151 517279 542464
56809 542464 576977 621507 675250 734912 793618 841416 868841 871270 850015 809770 756062 694833
56797 694833 632388 574092 522992 479911 444440 415770 393274 376816 366357 361387 361104 365019
56785 365019 372931 384721 400953 423129 452024 485505 518735 546442 564361 569304 559921 538003
56773 538003 507827 473491 437443 401417 367364 336870 310623 288843 271437 257505 245757
56762 245757 235722 227667 221240 215336 209533 204415 200133 195923 191489 187575 184577 181789 178710 175957
56748 175957 174153 172920 171664 170424 169281 167873 166185 164886 164223 163466 162071 160502 159298 158278 157238
56733 157238 156497 156189 155992 156091 157291 159522 161408 162065 162217 162790 163617 164430 165847 168215 170545 171831 172536
56716 172536 173650 175125 176374 177468 178649 179458 179524 179510 180083 180687 180517 180074 180499 181915 183663 185548 187617
56699 187617 189205 189564 189163 189144 189708 190198 190492 191165 192375 193592 194384 194691 194527 194181 194408 195663 197443
56682 197443 199096 200806 203039 205535 207705 209543 211276 212625 213328 213812 214413 214512 213544 212280 211889 212124
56666 212124 211698 210208 208527 207461 207128 207416 207939 207737 206187 204129 203046 203137 203254 202657 201791 201298 201203
56649 201203 201201 200972 200177 198837 197580 196935 196673 196512 196924 198299 199817 200363 200249 200743 202040 203063 203331
56632 203331 203632 204475 205094 204567 203095 201563 200467 199759 199354 199298 199543 199700 199068 197215 194673 192583 191365
56615 191365 190301 188837 187547 187116 187139 186897 186717 187415 188768 189662 189592 188968 188092 186819 185242 183843 182966
56598 182966 182704 183096 183826 184127 183748 183556 184327 185498 186077 186317 187291 189226 191410 193459 195428 196901 197278
56581 197278 196906 196735 196920 196877 196619 196840 197703 198704 199754 201306 203421 205801 208652 212306 216071 218809
56565 218809 220780 223627 228370 234698 242467 252435 264894 278706 292299 304739 315316 322983 326833
56552 326833 326658 322740 315712 306810 297591 289110 281746 275702 270965 266931 262894 258921 255510 252601
56538 252601 249829 247474 246087 245257 243928 241931 240062 238616 237039 235172 233606 232567 231557 230394
56524 230394 229536 229107 228618 227943 227520 227342 226823 225958 225518 225709 225712 224973 223938 223029 221841 219908 217522 215312
56506 215312 213669 212872 213029 213644 213997 214144 214707 215522 215502 214235 212813 212579 213652 215078 215899 215905 215821 216726
56488 216726 218728 220436 220554 219654 219337 219886 220161 219700 219411 219890 220488 220588 220553 220839 221217 221420 221663 222048
56470 222048 222377 222893 224257 226415 228370 229413 229722 229568 228951 228306 228465 229506 230532 230875 230656 230036 229041
56453 229041 228342 229010 231135 233711 236099 238472 240610 241703 241813 242284 244054 246602 248941 250564 251069
56438 251069 250093 248157 246448 245276 243829 241788 239941 238813 237981 237217 236960 237136 236874 235953 235214 234980
56422 234980 234489 233579 233435 234829 236906 238592 239919 241150 241923 242213 242822 243911 244255 243049 241366 240759
56406 240759 241354 242344 243372 244402 245070 245141 244948 244757 244506 244638 246014 248373 250126 250446 250362 251019 252198
56389 252198 253402 255037 257428 259828 261513 262767 263838 264160 263633 263473 264600 266267 267360 267895 268126
56374 268126 267523 265954 264805 265439 267397 269327 270780 271901 272411 272283 272541 273995 275911 277164 277953 279175
56358 279175 280840 282319 283464 284380 284832 284901 285488 287160 289254 290979 292447 293820 294597 294755 295326 296756
56342 296756 297973 298328 299153 301977 306368 310970 315463 320074 324383 328228 332603 338009 343054 346415 349030
56327 349030 352512 356524 359758 362465 365786 369336 371712 372883 373895 374591 373853 371988 370802 371118 371958
56312 371958 372316 372276 372313 372871 374630 377936 382076 386166 390405 395395 400776 405889 411193 417621 424941 432171
56296 432171 439093 445977 452270 457091 460668 463952 467205 470316 473940 478923 485128 492201 500743 511204
56282 511204 522345 532578 542318 553214 565519 578022 590210 602643 615414 628089 641144 655816
56270 655816 672511 690779 710721 732973 757440 783485 811251 841534 874589 910406 949868
56259 949868 994309 1044214 1099610 1161351 1230768 1308520 1395084 1491837 1600314 1720969 1853832
56248 1853832 1999594 2158497 2328972 2508936 2697556 2893996 3095177 3296510 3494025
56239 3494025 3683833 3860326 4017179 4149863 4255413 4330440 4371525 4377320 4348509 4286394
56229 4286394 4193494 4074816 3936230 3781814 3614571 3438872 3259746 3080228 2901794 2726990
56219 2726990 2559124 2399623 2248186 2105474 1973254 1851840 1739713 1635844 1540354 1452932
56209 1452932 1372692 1299535 1233645 1173849 1118556 1067997 1023287 983652 946999 912931 882569
56198 882569 855576 830056 805560 783555 764645 747773 732418 719141 707645 696674 686193
56187 686193 677490 670832 665160 660112 656113 652478 647857 642681 638743 636220 633539 630312 627866 626727
56173 626727 626094 625984 627294 629537 631099 632039 634067 637564 641238 644946 650015 656454 662652 668308 674956
56158 674956 683125 691716 700591 711037 723195 735893 749441 765771 785269 806376 828870 854630
56146 854630 884628 918214 956035 1000436 1052070 1109097 1170661 1238140 1311981 1390137 1470430
56135 1470430 1551309 1629329 1699224 1758196 1807719 1850234 1886917 1919534 1951084 1982733 2012373
56124 2012373 2037363 2056370 2067989 2070654 2065128 2054348 2039679 2019676 1992997 1959416 1917332 1863758
56112 1863758 1798157 1723582 1643340 1559648 1476150 1397972 1327864 1265326 1210364 1164611 1127851
56101 1127851 1097318 1071791 1052730 1040091 1030813 1022974 1017799 1015990 1015702 1015669 1016749 1018943 1020642 1022214
56087 1022214 1026403 1033631 1040911 1046954 1054111 1063580 1073114 1081453 1090635 1101712 1112537 1122068 1132551
56074 1132551 1145128 1157622 1169070 1181964 1197475 1213026 1227283 1242904 1261434 1280142 1297127
56063 1297127 1314993 1336042 1358183 1379017 1399729 1421435 1441941 1459750 1477230 1496307 1514981
56052 1514981 1531508 1547905 1565930 1583812 1600341 1617849 1637761 1657698 1676554 1697741 1723577
56041 1723577 1751093 1777247 1803596 1831957 1860420 1887914 1917871 1952962 1990885 2029545 2071420
56030 2071420 2118418 2167566 2216377 2267287 2321994 2376765 2428278 2478886 2531206 2583161 2633586
56019 2633586 2686888 2746516 2809461 2872777 2939578 3012684 3088558 3163960 3242518 3328037 3417385
56008 3417385 3506890 3599731 3699871 3804766 3911270 4022662 4142491 4267794 4395895 4531325
55998 4531325 4678219 4832662 4990615 5156364 5334896 5523340 5718667 5926100 6150678
55989 6150678 6388523 6636114 6899884 7186480 7492344 7813668 8157564 8532020 8934432
55980 8934432 9362207 9824694 10331723 10880910 11470256 12112389 12821669 13598886 14444702
55971 14444702 15376141 16413171 17562562 18834033 20258837 21873058 23698822 25765322
55963 25765322 28133647 30879180 34071462 37803028 42222419 47511911 53856669 61467851
55955 61467851 70606182 81546428 94565891 110034453 128487589 150560410 176907107
55948 176907107 208187122 244745284 285598295 327276223 363877406 388969933 398215654
55941 398215654 390853345 369306695 337731885 300641527 262028103 224884874 191058186
55934 191058186 161415787 136156001 115051761 97616211 83268494 71469921 61759222
55927 61759222 53730286 47039770 41430127 36708538 32706390 29279179 26326879 23780222
55919 23780222 21570489 19632799 17927037 16429578 15109446 13932163 12879245 11943067
55911 11943067 11107385 10350773 9663718 9044935 8485165 7970245 7495551 7062461 6664805
55902 6664805 6292750 5945792 5628440 5336981 5063138 4806704 4572162 4356640 4153108
55893 4153108 3961720 3786460 3624267 3468813 3321528 3187730 3065182 2947462 2835573
55884 2835573 2735264 2645564 2560705 2481133 2411917 2351761 2293473 2234090 2175383 2115904 2051809
55873 2051809 1984625 1919607 1857211 1794012 1730681 1671154 1615187 1559514 1505162 1456083 1411733
55862 1411733 1368384 1326497 1289570 1256910 1224833 1193758 1166954 1143433 1119313 1095133 1074543
55851 1074543 1056624 1036751 1014429 993141 972845 949780 923728 898711 876242 854187 832374
55840 832374 813085 795778 777350 757931 740732 726002 710834 695039 681453 670179 658218
55829 658218 645298 634590 627026 620089 612808 606843 601951 595326 586257 576951 568120 558111 546870
55816 546870 536438 527149 517552 508322 501942 498255 494541 490262 487543 486833 486391 486336 488837 493898 499065
55801 499065 503719 509658 517099 524120 530274 536777 542874 546005 545806 543961 540124 532308 521576 511860
55787 511860 504500 497207 489034 481997 476843 471383 464171 455979 446639 434297 419063 403891 390613
55774 390613 378412 367079 358280 352521 348181 344631 343160 343837 344576 344269 343858 343522 341870 338686 335404
55759 335404 332148 327359 320991 314954 309676 303435 295760 288227 281195 273192 264418 257489 253622 251248
55745 251248 249378 248976 249919 249964 248184 246337 245495 244317 242002 239909 238747 237040 233920 230748 228483
55730 228483 226100 223055 220723 219857 219093 217429 215782 214734 213204 210694 208483 207182 205494 202737 200238
55715 200238 198879 197621 195860 194832 195227 195717 195437 195632 197228 198980 199755 200604 202726 205184 206373 206181
55699 206181 205143 202942 199280 194947 190792 186822 183184 180593 179028 177576 176243 176161 177316 178001 177379
55684 177379 176708 177207 178660 180852 184293 188596 192245 194858 197618 200665 202317 201863 200764 200006 198660
55669 198660 196287 194286 193418 192380 190495 189592 191420 195209 199490 204399 210391 216498 221676 226291 230664
55654 230664 233816 235249 236363 238468 240932 242713 244029 245011 244442 241507 237272 232918 228098 222489 217169
55639 217169 212820 208273 202545 196657 191720 186970 181609 176875 174188 172701 170773 168565 167128 166140
55625 166140 164682 163257 162962 163531 164015 164510 165433 166009 165285 163778 162444 160863 158136 154702 151582 148708
55609 148708 145633 142960 141352 140018 137933 135719 134563 134052 132905 131170 129890 129156 128252 127187 126433
55594 126433 125640 124279 123116 123398 124904 126298 127059 127634 128147 128387 128794 129963 131447 132312 132676 133506 135215
55577 135215 137506 140248 143472 146979 150898 156096 163083 171176 179649 188779 198666 208036 215583 221540
55563 221540 226473 229419 228970 225490 220500 214390 206540 197381 188455 180487 172969 165722 159393 154264
55549 154264 149813 145630 141748 138093 134609 131869 130627 130760 131435 132119 132724 133124 133403 134164 135705 137264
55533 137264 137936 137906 137852 137650 136704 135153 133748 132800 132080 131389 130420 128565 125651 122402 119411 116342 112949
55516 112949 110040 108406 107562 106684 106058 106399 107347 107943 108072 108194 108113 107199 105446 103336 101158 99428 99146
55499 99146 100464 101851 101913 101277 101271 101597 101062 99955 99711 100453 100830 100352 100076 100690 101462 101566 101156 100711 100319
55480 100319 99995 99892 99999 100236 100800 101804 102851 103668 104720 106359 107880 108428 108285 108127 107578 105788 103035
55463 103035 100344 97923 95376 93136 92086 91873 91213 89908 89112 89453 90339 91307 92624 94241 95429 95886
55447 95886 96059 96114 95667 94818 94300 94263 93983 93210 92777 93376 94623 95819 96867 97942 98885 99404 99497 99430 99606
55428 99606 100460 102018 103617 104578 105025 105538 106203 106612 106568 106178 105468 104649 104427 105293 106740 107906 108653 109270
55410 109270 109529 109007 107963 106904 105644 103878 102301 101897 102309 102261 101495 100961 101009 100791 99780 98729 98637
55393 98637 99659 101349 103142 104342 104440 103770 103228 103144 102980 102177 100723 98949 97403 96774 97245 98126 98826
55376 98826 99783 101481 102977 102679 100482 97925 96184 95108 94307 93903 93877 93827 93782 94295 95298 95765 94993 93485
55358 93485 92211 91607 91635 92207 93163 94236 95203 95842 95860 95294 94798 95008 95830 96835 97904 98852 98974 97902
55340 97902 96526 95999 96176 96074 95559 95420 95973 96794 97631 98357 98267 96813 94992 94476 95238 95519 94453 93299
55322 93299 93526 94965 96512 97576 98146 98281 98220 98387 98858 99335 99791 100466 101120 101076 100187 98995 97820 96478
55304 96478 95072 94213 94223 94846 95817 97042 98186 98883 99309 99777 99914 99154 97883 97083 97006 97290 98096 99761
55286 99761 101430 101642 100499 99744 100303 101179 101285 100928 100814 100829 100633 100468 100601 100821 101046 101630 102536 103075 102926
55267 102926 102599 102403 101849 100555 98931 97518 96393 95626 95470 95778 96039 96316 97254 98887 100372 101258 101984
55250 101984 102779 103077 102587 101913 101634 101629 101723 102062 102406 102019 100796 99594 99000 98627 98051 97449 96901 96053 95016
55231 95016 94618 95207 96086 96608 96903 97116 96968 96537 96376 96375 95662 94187 93201 93418 93950 93910 93913 94972 96815 98387
55211 98387 99267 99689 99822 99855 100160 100669 100736 100183 99650 99360 98530 96772 95136 94882 96034 97882 100001 101892
55193 101892 102567 101540 99623 97895 96605 95789 95992 97320 98644 98905 98646 99160 100639 102185 103136 103458
55177 103458 103277 102924 103016 103637 103864 102872 101109 99702 99273 99964 101894 104701 107204 108420 108532 108229 107703
55160 107703 106962 106392 106176 105798 104946 104256 104383 105079 105986 107466 109653 111494 111949 111475 111200 111182 110686 109631
55142 109631 108546 107491 106210 104993 104283 103786 103067 102620 103170 104292 104927 105047 105490 106258 106263 104903 102854
55125 102854 101154 100328 100469 101346 102318 102809 102869 102779 102386 101510 100688 100704 101515 102416 103073 103733 104653 106004 108023
55106 108023 110545 112683 113716 113940 113962 113638 112662 111766 112152 113858 115658 116545 116487 115902 115297 115314 116234 117405
55088 117405 117915 117769 117736 118214 118999 119987 121300 122757 123929 124684 125109 125105 124673 124309 124515 125209 126181 127592
55070 127592 129279 130177 129426 127623 126026 124913 123762 122599 121954 121713 121240 120496 119916 119317 118089 116467
55054 116467 115406 115106 114758 113851 112721 111722 110921 110705 111646 113432 114898 115396 115392 115496 115736 115973 116273 116547
55036 116547 116473 115921 115054 114012 113094 112999 114085 115549 116169 115802 115300 115121 114980 114779 114788 114840 114423 113769 113789 114632
55016 114632 115271 114909 114038 113714 114425 115910 117463 118218 117772 116735 116158 116426 117193 118177 119239 119944 120040 120316
54998 120316 121875 124491 126702 127697 127997 128111 127777 127008 126737 127642 129108 130026 129993 129186 127689 125592 123388
54981 123388 121728 120956 121059 121756 122541 123056 123491 124164 124783 124767 124216 123815 123727 123433 122806 122435 122607 122772 122473
54962 122473 122096 122330 123365 124926 126544 127568 127565 126981 126843 127477 128030 127512 125846 123777 122240 121930 122802
54945 122802 123863 124055 123556 123555 124579 125798 126242 125974 125652 125571 125623 125754 125982 126209 126320 126348 126482 127085 128557
54926 128557 130869 133453 135989 139047 143365 148813 154721 160928 167629 174475 180808 186626 192210 196883
54912 196883 199282 198954 196582 192582 186722 179405 172050 165730 160415 155927 152549 150206 148156 146078
54898 146078 144539 143811 143168 141989 140712 140065 140110 140629 141621 142810 143491 143530 143824 145099 146901 148382 149430
54881 149430 150412 151507 153031 155811 160486 166754 173760 180764 187057 191972 195521 198389 200777 201795
54867 201795 200472 196800 191382 184858 178215 172778 169043 166089 162839 159344 156230 153567 151088 148942
54853 148942 147369 146032 144402 142509 140693 138957 137166 135439 133768 131728 129212 127045 126131 126242 126273
54838 126273 125456 123902 122241 121222 121355 122431 123632 124384 124744 124789 124236 123035 121697 120626 119719 119005
54822 119005 118937 119575 120193 120283 120239 120534 120989 121483 122506 124195 125666 126238 126574 127597 128948 129612 129548 129553 129927
54803 129927 130382 130924 131705 132240 131872 130938 130433 130642 130991 131157 131328 131399 130908 129924 129196 129276 130052 131141 132131
54784 132131 132591 132513 132614 133463 134481 134537 133511 132472 132340 133146 134598 136604 139131 142206 146120 151053
54768 151053 156483 161629 166507 171927 178411 185709 193372 201115 208476 214700 219156 221507 221511 219160 214900
54753 214900 209260 202409 194621 186906 180333 174814 169409 163865 158978 155295 152371 149681 147465 146133
54739 146133 145436 144793 144065 143537 143362 143421 143499 143361 142861 142270 142314 143595 146046 149060 152086 155027 158249 162339
54721 162339 167722 174324 181493 188248 193694 197449 199746 200976 201046 199449 195992 191121 185370 178958 172255
54706 172255 166229 161812 159010 157044 155240 153367 151302 148969 146629 144839 143916 143641 143484 142987 141980
54691 141980 140594 139015 137245 135275 133430 132108 131109 129794 128094 126783 126390 126504 126620 127017 128141
54676 128141 129642 130852 131798 132857 133672 133432 132181 130974 130541 130540 130337 129849 129299 128692 127958 127305 127059 127277
54658 127277 127757 128415 129449 130999 132624 133371 132698 131271 130441 130923 132373 134161 135795 136509 135423 132732
54642 132732 130057 128906 129230 129967 130471 130727 130764 130667 130851 131534 132232 132422 132417 132878 133711 134187 133920 133110 132056
54623 132056 131106 130805 131383 132277 132755 132764 132595 132164 131353 130654 130651 131139 131605 132228 133491 135076 136094 136313 136278
54604 136278 136382 136664 137292 138235 138639 137606 135593 134107 133964 134684 135516 136071 136066 135485 135002 135241 135632 135089
54586 135089 133748 132824 132715 132604 132124 131967 132328 132151 130704 128802 127682 127573 128093 129128 130447 131243 131010
54569 131010 130313 129926 129717 129151 128419 128203 128611 129116 129449 129928 130906 132308 133693 134532 134562 134026 133426 132995
54551 132995 132710 132741 133370 134403 135251 135794 136603 138035 139601 140531 140604 140210 140012 140665 142424 144769 146774
54534 146774 147948 148384 148232 147595 146862 146389 145854 144730 143407 142890 143181 143020 141630 139792 138607 138069 137521
54517 137521 136808 136242 136023 136347 137566 139546 141288 141882 141534 141124 141080 141171 141086 140721 140144 139679 139737 140268 140679
54498 140679 140582 140248 140078 140074 140077 140032 139741 138939 137930 137506 137871 138241 137998 137601 137865 138928 140462 142305 144210
54479 144210 145493 145666 145158 144832 145088 145841 146969 148287 149462 150445 151627 153162 154628 155731 156787 158047
54463 158047 159212 160152 161357 162971 164157 164324 164277 165016 165903 165314 162954 160343 158914 158619 158542 157970 156629
54446 156629 154648 152659 151385 150940 150872 150883 151023 151222 151196 150903 150619 150529 150633 150953 151376 151420 150690 149551 148806
54427 148806 148752 149042 149456 150229 151580 153401 155452 157414 158765 159113 158698 158181 157894 157715 157561 157473 157260 156619
54409 156619 155711 155100 155000 155082 155094 155207 155558 155904 155997 155963 156114 156649 157637 159020 160490 161593 162111 162262 162608
54390 162608 163812 166241 169370 171764 172163 170630 168295 166115 164309 162923 162187 162134 162454 163048 164269 166229
54374 166229 168314 169823 170882 172286 174562 177588 181060 184892 189037 193231 197184 200861 204300 207182
54360 207182 208925 209390 209231 209187 209129 208249 206213 203696 201533 199794 197993 195850 193384 190436 186676 182200
54344 182200 177760 174250 172011 170648 169386 167671 165614 163800 162661 162137 161983 162104 162408 162621 162553 162382
54328 162382 162361 162382 162141 161651 161302 161410 161890 162358 162451 162157 161883 161994 162199 161775 160612 159644 159784 160757 161453
54309 161453 161285 160678 160306 160314 160405 160309 160036 159817 159814 159809 159294 158069 156576 155369 154499 153769 153349 153646 154605 155668
54289 155668 156539 157512 158871 160298 161178 161354 161341 161859 163235 165234 167277 168765 169286 168795 167833 167339 167849
54272 167849 168849 169262 168665 167667 167018 166853 167030 167664 168836 170157 171191 172116 173453 175177 176530 176776
54256 176776 175844 174310 172981 172484 172966 174107 175400 176326 176399 175463 174101 173316 173490 173948 173759 172674 171076
54239 171076 169445 168171 167500 167307 167244 167351 168050 169266 170233 170591 171047 172310 174010 175434 176707 178304
54223 178304 179877 180685 180861 181131 181405 180861 179489 178359 178083 178031 177493 176664 175991 175410 174770 174285 173991 173379
54205 173379 172203 171117 170874 171311 171746 171994 172335 172754 172922 172872 173058 173641 174206 174359 174281 174512 175370 176732
54187 176732 178262 179675 180794 181560 182153 183022 184486 186137 186927 186209 184507 182918 181847 180823 179573
54172 179573 178672 178777 179581 180046 179631 178856 178509 178533 178035 176450 174365 172906 172385 171989 170896 169278 167954
54155 167954 167405 167480 167803 168085 168148 168023 167983 168194 168489 168662 168801 168984 168893 168169 167069 166378 166665 167864 169467
54136 169467 170863 171641 171892 172090 172440 172634 172548 172787 173954 175620 176681 176657 176114 175852 176199 177059 178089 178821
54118 178821 179090 179364 180227 181641 183158 184705 186542 188508 190043 191030 192031 193537 195485 197541 199398
54103 199398 200795 201866 203477 206514 210689 214628 217255 218529 218755 218010 216494 214721 212967 211086 209220
54088 209220 208036 207876 208227 208511 208862 209594 210415 210818 210891 211109 211496 211641 211474 211408 211665 211928 211954 212133 213042
54069 213042 214486 215383 214876 213388 212167 211828 211838 211578 211284 211397 211560 211077 210135 209699 210216 211174 212014 212771
54051 212771 213655 214697 216037 217983 220550 223431 226537 230002 233624 236987 240319 244528 250102 256620
54037 256620 263584 271036 278967 286844 294219 301284 308379 315398 322066 328314 333987 338744 342601 346017
54023 346017 349018 350913 351491 351875 353360 355721 357446 357455 355956 353752 351383 348926 346086 342374 337524
54008 337524 331820 325837 319945 314192 308479 302659 296661 290699 285160 280215 275810 272076 269277 267190
53994 267190 265033 262193 258658 254684 250693 247613 246387 246665 246806 245788 244374 243705 243529 242848 241685
53979 241685 241009 241074 241042 240321 239364 238896 239056 239518 240005 240565 241742 244406 248962 254809 261096 267862 275868
53962 275868 285391 295894 306738 317371 326625 332679 334280 331706 326270 319263 311532 303626 295952
53949 295952 288931 283154 279170 277058 276458 277137 279194 282633 287024 291726 296221 300201 303690 307208 311429
53934 311429 316381 321225 325106 328036 330673 333374 335870 337942 340061 343068 347266 352126 356998 361922
53920 361922 367522 374185 381650 389388 397116 404905 413065 422025 431969 442432 452540 461809 470434 478644
53906 478644 486132 492371 497096 500124 501067 499751 496799 493317 489989 486800 483521 480072 476342 472005
53892 472005 466739 460568 453931 447368 440932 433846 424995 414047 401974 390320 380050 371224 363506
53879 363506 356694 350826 345939 341700 337325 332142 326312 320621 315442 310344 304945 299650 295126 291431
53865 291431 288095 284709 281018 276793 272232 268225 265554 263882 262092 259631 257010 254934 253444 252075
53851 252075 250522 248986 247971 247753 247968 247876 247199 246394 245838 245121 243664 241776 240477 240308 240817 241235 241144
53834 241144 240474 239373 238282 237761 237975 238544 239016 239370 239978 241159 242748 244056 244407 243873 243277 243314 243893
53817 243893 244542 245116 245770 246517 247291 248264 249719 251706 254180 257259 260967 264944 268892 273128 278151 283853
53801 283853 289755 295935 303039 311253 319855 327952 335247 341891 348000 353545 358458 362660 366183 369324
53787 369324 372453 375614 378406 380224 380517 379068 376254 372826 369138 364842 359623 353845 348040 342135
53773 342135 335829 329399 323336 317361 310680 303346 296544 291312 287586 284684 282075 279420 276445 273228
53759 273228 270181 267493 264883 262089 259220 256452 253791 251287 249078 247051 244913 242792 241287 240673
53745 240673 240494 240255 240049 240133 240296 240127 239690 239478 239795 240486 241225 241857 242490 243340 244462 245618 246579 247420
53727 247420 248248 248786 248685 248294 248512 249700 251275 252718 254469 257293 261040 264564 266751 267294 266607 265463
53711 265463 264742 265106 266681 269131 272024 275068 278067 280874 283407 285581 287255 288494 289968 292828 297799
53696 297799 304284 310630 315526 319002 321833 324216 325614 325894 325876 326358 327066 327120 326187 324688 323077 321474
53680 321474 319868 318183 316248 314144 312464 311779 311976 312566 313417 314574 315546 315588 314736 313848 313369 312740 311229
53663 311229 308841 306107 303541 301622 300861 301464 303074 305038 306746 307742 307979 308004 308473 309293 309683 309215 308330
53646 308330 307735 307769 308588 310324 312714 314979 316575 317781 319218 321029 322917 324726 326671 329054 331996
53631 331996 335366 338873 342297 345660 349008 352186 355132 358287 362188 366636 370818 374362 377761 381571
53617 381571 385706 389749 393464 396747 399535 402134 405232 409205 413662 417928 421636 424604 426593 427625
53603 427625 428285 429292 430832 432551 434046 435210 436242 437436 438790 439812 439953 439230 438091 436765 435214
53588 435214 433671 432598 431959 431149 429807 428113 426086 423324 419790 416222 413285 410849 408535 406402 404598
53573 404598 402863 400972 399255 398094 397252 396276 395200 394319 393567 392699 391887 391523 391580 391621 391374 390903 390411 390253
53555 390253 390892 392435 394307 395745 396464 396702 396920 397688 399443 401935 404342 406296 408378 411156 414262
53540 414262 417037 419664 422894 426961 431555 436716 442950 450439 458750 467368 476048 484682 493394 502777
53526 502777 513466 525375 537756 550046 562357 575171 588908 603743 619492 635693 652079
53515 652079 668892 686479 704880 724181 744940 767697 792252 817940 844448 871775 899494
53504 899494 926724 952875 977944 1002058 1025163 1047139 1067814 1086918 1104477 1121161 1137754
53493 1137754 1154383 1170782 1187180 1204262 1222268 1240759 1259313 1277833 1296089 1313627 1330365
53482 1330365 1346784 1363330 1380073 1397009 1414068 1430593 1445396 1457698 1467612 1475402 1480756 1483225
53470 1483225 1483028 1480913 1477289 1471814 1463818 1452952 1439481 1424097 1407480 1390095 1372421 1355080
53458 1355080 1338424 1322123 1305538 1288459 1271114 1253489 1235158 1215839 1195769 1175395 1155041
53447 1155041 1134911 1115118 1095622 1076575 1058726 1043101 1030158 1019587 1010970 1004194 999141 995453
53435 995453 992809 991033 989819 988809 988139 988468 990209 993145 997077 1002316 1009106 1016961 1025149 1033671 1043310
53420 1043310 1054873 1068787 1085359 1104852 1127070 1151124 1175907 1200873 1226365 1253235 1282069
53409 1282069 1312778 1344925 1378322 1413104 1449327 1486819 1525529 1565667 1607356 1650427 1694852
53398 1694852 1741164 1790073 1841651 1895113 1949385 2003732 2057889 2111889 2165923 2220251 2274989
53387 2274989 2329782 2383723 2435810 2485660 2533695 2580479 2625885 2668972 2708528 2743597 2773643
53376 2773643 2798592 2818779 2834552 2845779 2851853 2852275 2847088 2836681 2821222 2800349 2773416 2740133
53364 2740133 2701049 2657349 2610083 2559767 2506881 2452504 2398030 2344262 2291050 2237941 2184983
53353 2184983 2132874 2082570 2034866 1990172 1948515 1909560 1872484 1835901 1798405 1759551 1720096
53342 1720096 1681031 1642662 1605058 1568999 1535671 1505371 1477211 1450371 1425081 1402038 1381341
53331 1381341 1362490 1345159 1329414 1315140 1301601 1287813 1273319 1258508 1244087 1230262 1216624
53320 1216624 1202904 1189529 1177147 1165902 1155606 1146469 1139055 1133500 1129317 1126124 1124135 1123774 1125302
53307 1125302 1128974 1135039 1143151 1152192 1161163 1170120 1179935 1191334 1204499 1219464 1236436 1255671 1277210
53294 1277210 1300746 1325674 1351402 1377804 1405213 1433816 1463053 1491753 1518761 1543351 1565230
53283 1565230 1584398 1601041 1615371 1627484 1637264 1644349 1648213 1648573 1645813 1640802 1634090 1625382 1613973
53270 1613973 1599553 1582402 1562944 1541436 1518205 1493866 1469002 1443655 1417410 1390133 1362451
53259 1362451 1335220 1308601 1281943 1254628 1226672 1198394 1169903 1141301 1113139 1086185 1060716
53248 1060716 1036332 1012404 988491 964420 940326 916603 893543 871048 849001 827808 808141
53237 808141 790066 772837 755766 739014 723329 709154 696153 683588 671132 659359 649250
53226 649250 641094 634040 626919 619211 610899 601733 591283 579662 567538 555307 542692 529255 514941
53213 514941 500161 485827 473227 463173 455100 447629 440140 433122 426807 420398 413239 405985 399765
53200 399765 394614 389569 384077 378416 372797 366874 360459 354108 348572 343931 339588 334955 329950 324906
53186 324906 320138 315657 311255 306876 302803 299387 296699 294545 292787 291473 290567 289707 288437 286739 285187
53171 285187 284346 284028 283424 282037 280207 278515 276993 275300 273422 271721 270397 269334 268473 267845 267297 266601
53155 266601 265882 265512 265544 265726 266077 266880 268019 268911 269329 269616 269815 269256 267528 265357 263913 263535 263690 263967
53137 263967 264555 265751 267426 269048 270058 270319 270318 270732 271688 272683 273414 274241 275554 277083 278282 279100 279895
53120 279895 280790 281612 282356 283265 284483 285998 287926 290422 293300 296029 298194 299764 300878 301520 301429 300229
53104 300229 297759 294371 290800 287627 285026 283064 281915 281516 281308 280720 279837 279233 279189 279271 278702 277061 274724
53087 274724 272647 271455 270657 269099 266452 263863 262736 263164 264010 264315 264042 263473 262554 261167 259682 258816
53071 258816 258878 259344 259279 258220 256566 255038 253920 253026 252267 251773 251458 250957 250226 249746 249834 250191 250480 250940
53053 250940 251906 253032 253635 253672 253824 254583 255723 256801 257753 258779 259879 260689 260795 260200 259433 259048 259003 258727
53035 258727 257867 256686 255606 254778 254275 254307 254880 255589 256090 256469 256787 256691 256007 255385 255682 256824 257905 258357
53017 258357 258461 258723 259299 260085 260874 261313 261126 260501 259950 259719 259699 259858 260348 261101 261719 261956 262014 262274 262898
52998 262898 263705 264279 264305 263979 263971 264662 265629 266212 266433 266869 267809 269076 270583 272493 274790 277248 279877 282855
52980 282855 285927 288442 290114 291274 292219 292896 293369 293936 294517 294495 293648 292703 292519 293124 294060 295257 296907
52963 296907 298705 299912 300234 300125 300157 300432 300655 300435 299473 297751 295663 293732 292160 290754 289263 287525
52947 287525 285314 282425 279075 275956 273673 272284 271541 271396 271944 272973 273908 274308 274238 274054 274037 274356 275139
52930 275139 276288 277282 277510 276899 276043 275579 275526 275349 274657 273795 273616 274528 275817 276259 275547 274689 274616 274783 273913
52911 273913 271993 270670 271311 273362 275022 275096 273753 271891 270366 269639 269625 269857 269978 269952 269724 269060 268030
52894 268030 267231 267124 267518 268129 269255 271311 273932 276175 277485 277934 277752 277241 276987 277368 277822 277343 275872
52877 275872 274564 274410 275230 276293 277372 278721 280426 282319 284426 287038 290317 294051 297808 301178 303845
52862 303845 305538 306055 305378 303754 301546 298970 296055 292835 289375 285652 281680 277801 274408 271291 267838
52847 267838 264146 261350 260284 260312 260045 258866 257100 255125 253129 251549 250863 250873 250847 250395 249671 248854 248104
52830 248104 247902 248693 250197 251758 253299 255080 256635 256985 256076 254970 254327 253729 252917 252590 253255 254165 254327
52813 254327 253991 254279 255690 257728 259709 261220 261986 261958 261456 260765 259733 258178 256429 255002 253913 252784
52797 252784 251439 249960 248353 246628 245054 243822 242607 241021 239457 238922 239886 241698 243260 243956 243852
52782 243852 243330 242808 242635 243043 244097 245676 247442 248888 249569 249387 248682 248027 247818 247972 248101 248057 248110 248440
52764 248440 248699 248477 248012 247925 248282 248460 248058 247434 247226 247783 249134 250998 252646 253381 253435 253818 254996 256288
52746 256288 257007 257543 258687 260344 261707 262495 263340 264953 267377 270037 272145 273230 273623 274257 275594 276941
52730 276941 277285 276669 276164 276553 277584 278556 279071 278985 278072 276148 273428 270551 268185 266599 265596 264801 264024
52713 264024 263249 262483 261867 261879 262920 264541 265522 265088 263712 262450 261837 261800 262281 263250 264272 264679 264336 263862
52695 263862 263943 264668 265540 265970 265668 264746 263515 262214 261016 260204 260049 260392 260730 260878 261205 261983 262926 263670
52677 263670 264324 265026 265301 264488 262711 260887 259817 259651 260150 261018 261977 262979 264324 266211 268193 269530
52661 269530 270125 270683 271828 273500 275382 277550 280331 283693 287101 290100 292870 295955 299308 301789 301975
52646 301975 299556 295634 291609 288172 285441 283438 281965 280511 278898 277747 277735 278564 279228 279190 278714 278201
52630 278201 277804 277781 278572 280367 282927 285874 288732 290731 291185 290224 288740 287446 286351 285210 284015 282842
52614 282842 281755 281048 281137 281915 282575 282499 282029 281995 282695 283706 284568 285181 285521 285432 284954 284668 285353 287200 289528
52595 289528 291419 292552 293273 293902 294327 294311 293878 293212 292490 292027 292226 293021 293656 293553 293209 293689 295269 297138
52577 297138 298525 299507 300454 301203 301259 300592 299792 299433 299509 299538 299095 298257 297591 297672 298537 299574 300005 299514 298504
52558 298504 297734 297672 298154 298685 298920 298701 297821 296246 294589 293835 294319 295346 296159 296804 297655 298514 298861 298752
52540 298752 298793 299177 299387 298933 297925 296799 295833 295052 294277 293216 291867 290891 291239 293274 296460 299860 302665
52523 302665 304339 304780 304496 304311 304731 305703 306956 308258 309415 310432 311736 313857 316791 320017 323257
52508 323257 326905 331472 336811 341927 345448 346334 344469 340681 336064 331294 326701 322675 319522 316982
52494 316982 314391 311456 308557 306249 304776 304081 303930 303950 303803 303381 302678 301648 300455 299617 299477 299753 300078
52477 300078 300687 301899 303152 303432 302701 302116 302690 304495 307201 310478 313600 315694 316935 318710 321996
52462 321996 326228 330331 334158 338089 341782 344192 344635 343119 339911 335405 330280 325154 320225 315651
52448 315651 311975 309541 307792 305867 303755 302199 301520 301237 300862 300389 299896 299269 298537 297986 297691 297363 296800
52431 296800 296144 295563 295047 294660 294613 294935 295380 295840 296551 297705 299125 300461 301484 302072 302231 302367 303232 305278
52413 305278 308172 311194 314070 317227 321319 326642 333027 340157 347960 356649 366262 376142 384959 391351
52399 391351 394534 394394 391293 385913 379086 371503 363561 355574 348028 341459 336131 332053 329342 328355 329260
52384 329260 331515 333889 335177 335020 334155 333850 334931 337256 340106 343040 346244 350090 354606 359588 364965
52369 364965 370743 376621 382014 386498 389946 392240 393203 393037 392422 391834 390987 389333 387007 384872 383593
52354 383593 383022 382618 382203 382090 382592 383563 384504 385040 385272 385653 386567 388115 390239 392889 396058 399843 404429
52337 404429 409785 415399 420713 425912 431873 439189 447691 457072 467396 478583 489994 501189 512810
52324 512810 526033 541365 558453 576783 595844 614813 632853 649783 665872 681090 695208
52313 695208 708542 721870 735621 749857 765007 781762 799996 818628 836776 854411 871674
52302 871674 888365 904454 920368 936381 952295 967965 983301 997378 1008376 1015103 1017948 1017894
52290 1017894 1015311 1010364 1003811 996476 988424 979577 970701 962848 956081 949625 943163 937181 932205 928535
52276 928535 926638 926871 928674 930888 933217 936747 942667 950900 960217 969373 977950 986413 995639 1006169
52262 1006169 1017805 1030011 1042600 1055811 1069800 1084424 1099545 1115233 1131562 1148395 1165384
52251 1165384 1182007 1197669 1211884 1224315 1234502 1241838 1246034 1247455 1246698 1244008 1239402 1233155 1225786
52238 1225786 1217655 1208970 1200085 1191449 1183269 1175453 1167780 1159898 1151434 1142490 1133870 1126387 1120018 1114114
52224 1114114 1108305 1102839 1098088 1094160 1090993 1088474 1086484 1085040 1084314 1084323 1084852 1085917 1088044 1091660 1096478
52209 1096478 1101915 1107801 1114211 1120849 1127236 1133286 1139097 1144383 1148796 1152635 1156605 1161013 1165917 1171800
52195 1171800 1179090 1187026 1194093 1199858 1205465 1212015 1219320 1226608 1233496 1239689 1244584 1247864 1249802 1250272
52181 1250272 1248107 1242279 1233308 1222676 1211258 1199149 1186754 1175028 1164575 1155329 1147247 1140603
52169 1140603 1135364 1130896 1126637 1122718 1119713 1118088 1118076 1119697 1122601 1126119 1129728 1133395 1137257 1141076
52155 1141076 1144217 1146177 1147012 1147210 1147230 1147178 1146868 1146081 1144769 1143111 1141533 1140581 1140588 1141407 1142587 1143790 1144864
52138 1144864 1145533 1145376 1144293 1142804 1141684 1141413 1142101 1143799 1146663 1150947 1157015 1165304 1176097 1189349
52124 1189349 1204841 1222403 1241887 1263062 1285713 1309770 1335143 1361461 1388126 1414640 1440748
52113 1440748 1466297 1491037 1514531 1536149 1555236 1571454 1584965 1596276 1606014 1614896 1623669 1632734
52101 1632734 1641864 1650596 1658834 1666766 1674100 1679861 1683185 1684061 1682864 1679315 1672348 1661104 1645752 1627299
52087 1627299 1606982 1586017 1565548 1546303 1528404 1511788 1496777 1483904 1473263 1464366 1456715 1450204
52075 1450204 1444972 1441299 1439766 1441012 1444996 1450743 1457227 1464319 1472663 1482823 1494838 1508358 1522765
52062 1522765 1537237 1551138 1564403 1577290 1589818 1601761 1613170 1624513 1636124 1647715 1658504
52051 1658504 1667667 1674615 1679031 1680718 1679383 1674629 1666348 1655003 1641324 1625752 1608356 1589232 1568763
52038 1568763 1547516 1526160 1505409 1485861 1467837 1451525 1437124 1424573 1413286 1402513 1391962
52027 1391962 1381775 1372017 1362572 1353450 1344646 1335744 1326256 1316468 1307310 1299058 1290772 1281510 1271670 1262537
52013 1262537 1254713 1247594 1240301 1232516 1224247 1215193 1204640 1191788 1176107 1157560 1136719 1114542
52001 1114542 1091857 1068990 1045953 1022928 1000465 979147 959190 940528 923239 907618 893686
51990 893686 880852 868312 855748 843329 831072 818476 804908 790165 774531 758382 741839
51979 741839 724775 707152 689391 672269 656336 641497 627419 614248 602639 593136 585898 581103
51967 581103 579173 580311 584093 589869 597339 606352 616230 625772 634086 641084 646893 651018 652463 650610
51953 650610 645656 638203 628943 618970 609877 602884 597947 594339 592091 592269 595744 602332 611444 622959
51939 622959 636940 653097 671165 691440 714199 738784 763954 788995 813685 837065 856871
51928 856871 870428 875739 871821 858761 837860 811342 781483 750029 718334 687619 658857 632599
51916 632599 609001 587929 569162 552772 539149 528343 519646 512308 506477 502859 501615 502319 504926
51903 504926 509858 516919 524922 532715 539977 546672 552391 556587 558862 558596 554865 547250 536395 523456
51889 523456 509455 495439 482641 471935 463528 457551 454366 453850 455017 457088 460507 466135 473766
51876 473766 482161 490434 498681 507325 516402 525443 533567 539748 543416 544765 544218 541809 537537 531973
51862 531973 525996 520159 514862 510864 508929 509023 510514 513048 516641 520959 525230 528871 531537 532554 531088
51847 531088 527154 521766 515763 509018 501142 492461 483870 476068 469350 463752 458941 454174 448863 443276
51833 443276 438472 435600 435233 437073 440001 442610 444067 444524 444579 444471 443993 443016 441777 440574 439491 438499
51817 438499 437596 436637 435220 433133 430883 429477 429450 430399 431644 433055 434816 436676 438063 438901 439670 440429
51801 440429 440490 439500 438313 438189 439361 440958 442140 442708 442693 441967 440423 438142 435240 431839 428283 425130
51785 425130 422835 421611 421522 422446 423898 425204 426032 426618 427434 428716 430329 432050 433941 436452 440058 444866
51769 444866 450873 458503 468358 480152 492387 503561 513347 522073 529430 534385 536284 535334 531972 526397
51755 526397 518893 510067 500452 490244 479550 468581 457509 446606 436601 428459 422536 418316 415257
51742 415257 413533 413613 415406 418270 421803 426308 432459 440709 450984 462672 474698 485628 493988 498885
51728 498885 500627 500704 500982 502802 506645 512182 518319 523454 526204 526028 523081 517711 510486 502562 495445
51713 495445 490122 486546 483897 481129 477432 472615 467145 461666 456608 452454 450004 449754 451204 453332
51699 453332 455616 457892 459336 458669 455737 452108 449582 448703 449104 450503 452568 454318 454634 453311 450979
51684 450979 448081 444587 440622 436728 433335 430527 428540 428070 429748 433451 438302 443281 447835 452139
51670 452139 456883 462720 469923 478726 489857 504282 522070 541552 559835 574196 583054 585844 582472
51657 582472 573247 559285 542604 525542 510053 497510 488848 484519 484318 487420 492525 497806 501052
51644 501052 500528 495965 488494 479497 469859 460282 451698 444852 439743 435932 433294 432125 432563 434178 436099
51629 436099 437342 437180 435603 433415 431582 430387 429331 427757 425342 422076 418196 414187 410541 407259
51615 407259 403857 400021 396091 392679 389956 387588 385284 383143 381408 380209 379656 379999 381434 383793 386617
51600 386617 389567 392666 396246 400875 407400 416696 428934 442950 456490 467250 473874 476121 474398
51587 474398 469318 461731 452936 444573 438048 434013 432388 432804 434970 438728 444016 450849 459260 469271
51573 469271 480917 494168 508616 523466 538185 553057 568688 584956 600902 615714 629399
51562 629399 642512 655994 671529 691211 716148 745763 778883 814740 851998 887506 917469
51551 917469 940028 955741 965401 968454 963916 951793 932984 908518 879657 848208 815910 783665
51539 783665 751871 721290 693163 668663 648633 633501 622782 614770 607357 599357 590801 582023
51527 582023 572913 563081 552377 541094 529877 519448 510174 501767 493613 485432 477490 470159 463478
51514 463478 457237 451360 446020 441438 437672 434593 431976 429539 426943 423943 420684 417733 415648 414510
51500 414510 413995 413791 413738 413696 413666 414111 415731 418628 421977 424736 426583 427891 429024 429974 430618 430968 431049 430707
51482 430707 429701 427949 425672 423270 421047 418995 416857 414433 411804 409258 407027 405060 403034 400628
51468 400628 397792 394656 391214 387330 383202 379495 376717 374581 372326 369605 366748 364268 362432 361309
51454 361309 360843 360851 361242 362290 364426 367746 372017 377088 382904 389219 395836 403209 412285 423578 436710
51439 436710 450816 464807 477204 486536 492434 495921 498304 500159 501580 502679 503211 502214 498705 492619
51425 492619 484675 475693 466495 458068 451092 445431 440562 436349 432874 429792 426512 422992 419787 417353
51411 417353 415813 415288 415821 416944 417931 418552 419069 419496 419561 419517 420236 422096 424435 426522 428584 431237 434393
51394 434393 437441 440340 443820 448498 454453 461840 471262 483140 497084 512413 529155 548152 570323
51381 570323 596259 626445 661277 700622 743874 790854 842180 897964 956045 1011988 1061045
51370 1061045 1100043 1127714 1143971 1149236 1144062 1128887 1104180 1070924 1030777 985563 936781 885666
51358 885666 833547 781919 732352 686324 644874 608252 576134 548306 524822 505379 488950
51347 488950 474413 461319 449760 439750 431096 423756 417933 413755 410992 409043 407187 405090 403150
51334 403150 402094 402110 402689 403399 404344 405626 406804 407313 407045 406144 404609 402550 400480 398749 396918 394290
51318 394290 390909 387598 385152 384013 384422 386125 388031 388958 388921 389086 390263 391945 393005 392843 391651 390062
51302 390062 388780 388158 387801 386844 384850 382242 379772 377921 376919 376825 377267 377455 376936 376181 376036 376728 377837
51285 377837 379223 381470 385146 389958 395063 400114 405554 411691 417910 423166 427012 429673 431369 432253
51271 432253 433008 434630 437202 439513 440501 440630 441303 443248 446074 449074 451720 453445 453629 451885 448065
51256 448065 442177 434859 427695 422308 418939 416422 413510 409782 405383 400649 396154 392448 389478 386752
51242 386752 384217 382416 381548 380935 379808 378206 376736 375797 375356 375254 375472 376204 377805 380424 383658 386798
51226 386798 389416 391339 392171 391483 389636 387770 386619 385813 384712 383435 382584 382348 382416 382596 383071 384151
51210 384151 386151 389327 393512 397878 401430 403839 405653 407755 410747 414677 419052 423126 426362 428693
51196 428693 430311 431283 431513 430980 429909 428676 427553 426535 425485 424491 423905 423890 424093 424027 423594 422901 421787
51179 421787 420019 417929 416260 415348 414957 415027 416021 418195 420952 423270 424527 424779 424512 424317 424478 424716 424581
51162 424581 424208 424342 425529 427566 429788 431442 431846 430850 429314 428446 428323 427690 425588 422516 419565 417057
51146 417057 414687 412445 410611 409174 407975 407165 406888 406797 406580 406734 408008 410272 412663 414774 416871 418928
51130 418928 420359 420929 421233 421878 422778 423602 424431 425524 426779 427857 428637 429252 429825 430473 431442 432969 435062
51113 435062 437515 440079 442531 444708 446614 448429 450323 452296 454248 456146 458078 460178 462478 464776
51099 464776 466741 468203 469287 470198 470982 471634 472319 473202 474083 474404 473732 472210 470559 469711 470231 471845 473483
51082 473483 474014 473106 471447 470165 469985 470757 471721 472278 472531 472970 473807 474962 476728 479873 484735 490606
51066 490606 496505 502360 509005 517216 527318 539773 555515 575357 599086 625151 650961 673656
51054 673656 691155 703061 710721 716451 722606 730856 741574 753517 764408 772304 776675 778155 777323
51041 777323 773787 766579 755495 741987 728626 717650 710049 705616 703195 700678 695481 685847 671836
51028 671836 654920 636868 619214 603242 589740 578751 570062 563897 560631 559937 560921 563278 567706
51015 567706 574800 584091 594592 606016 618897 633525 649085 663930 676562 686371 693563 698568
51003 698568 701706 703460 704689 706066 707290 707289 705350 701771 697383 692838 688547 684872 682002 679841 678277
50988 678277 677498 677870 679746 683533 689655 698193 708879 721707 737149 755257 774828 794072 812088
50975 812088 829135 845590 861495 877410 894933 915668 940024 967588 998461 1033565 1073665
50964 1073665 1118626 1167715 1220169 1275364 1332907 1392827 1455300 1519810 1584774 1648205 1708536
50953 1708536 1764703 1815916 1861838 1902802 1939300 1971269 1998293 2020500 2038886 2054748 2069203
50942 2069203 2083284 2097981 2113701 2129787 2144796 2157311 2166636 2172942 2176752 2178059 2175924 2169173
50930 2169173 2157452 2141255 2120863 2095675 2064730 2027569 1984386 1935657 1881876 1823468 1760865
50919 1760865 1694954 1627577 1561144 1497397 1436764 1379167 1325098 1275548 1231123 1191658 1156531
50908 1156531 1124986 1096254 1069738 1045138 1022258 1000868 981015 963187 947732 934211 921707
50897 921707 909785 898831 889464 881966 876234 871949 868685 866143 864392 863685 863936 864611 865241 865945 867348
50882 867348 869953 873570 877423 880990 884720 889682 896369 904226 912581 921676 932293 944461 957161
50869 957161 969458 981623 994887 1010290 1027977 1047555 1068872 1092235 1117948 1145947 1176183
50858 1176183 1209205 1245992 1287158 1332737 1382822 1438094 1499594 1568349 1645261 1730880 1825033
50847 1825033 1927066 2036649 2153883 2278379 2408847 2544032 2683399 2826186 2970077
50838 2970077 3111366 3246181 3371086 3483066 3579838 3660236 3723847 3770641 3801484 3818624
50828 3818624 3824842 3822416 3813705 3802299 3792396 3786970 3787494 3795332 3812005 3837515 3869347 3903635 3936487
50815 3936487 3963683 3980139 3980869 3962520 3923700 3864244 3784649 3685862 3569061 3435809 3288725
50804 3288725 3131698 2969093 2804917 2642837 2486354 2338314 2200382 2073365 1957880
50795 1957880 1854379 1762728 1682193 1611839 1550906 1498878 1455281 1419243 1389319 1364101 1343074
50784 1343074 1326428 1313926 1304457 1296820 1290351 1284536 1278631 1272239 1265812 1260015 1254786 1249460 1243511
50771 1243511 1236762 1229054 1220250 1210485 1200050 1189068 1177590 1165845 1154132 1142509 1130875 1119240
50759 1119240 1107766 1096680 1086327 1077142 1069421 1063309 1059064 1056930 1056637 1057562 1059812 1064714 1073717 1087053
50745 1087053 1103913 1123708 1146621 1173130 1203517 1237837 1275938 1317522 1362501 1411214 1463939
50734 1463939 1520325 1579652 1641455 1705414 1770718 1836236 1901474 1966853 2032690 2098276 2162322
50723 2162322 2224113 2283750 2341173 2395261 2444120 2486029 2519722 2543747 2556196 2555758 2543071 2520684
50711 2520684 2491787 2459394 2426603 2396706 2372400 2355164 2345664 2344372 2351307 2365451 2384892 2407435
50699 2407435 2430820 2452480 2469430 2478362 2475904 2459252 2427020 2379418 2317599 2243245 2158951 2068292
50687 2068292 1974861 1881410 1790249 1703915 1624676 1553535 1490345 1434803 1386815 1346087 1312130
50676 1312130 1284772 1264128 1249975 1241576 1238190 1239319 1244397 1252656 1263421 1276161 1290179 1304525
50664 1304525 1318351 1331194 1343022 1354301 1365924 1378707 1392923 1408499 1425521 1444221 1464671
50653 1464671 1486934 1511360 1538299 1567563 1598647 1631466 1666501 1704372 1745744 1791473 1842083
50642 1842083 1897014 1954930 2014918 2076861 2140543 2204981 2268941 2331598 2392401 2450634 2505420
50631 2505420 2555912 2601438 2641946 2678603 2713530 2748420 2783026 2814509 2837851 2847457 2839783 2815441
50619 2815441 2778779 2735383 2690165 2647312 2610435 2581602 2560644 2546234 2537551 2534379 2536025 2540973
50607 2540973 2547585 2554328 2559079 2558791 2550285 2531327 2500931 2459047 2406309 2344037 2274217 2199249
50595 2199249 2121460 2042631 1963936 1886321 1810774 1738107 1668643 1602459 1540006 1482249 1429987
50584 1429987 1383045 1340313 1300745 1264343 1232063 1204722 1182162 1163596 1148511 1136875 1128595
50573 1128595 1123264 1120592 1120782 1124221 1130961 1140612 1152554 1166104 1180712 1196224 1212858 1230797 1249930
50560 1249930 1270106 1291406 1313909 1337234 1360535 1383056 1404618 1425631 1446639 1467865 1489111
50549 1489111 1510071 1530587 1550622 1570290 1590202 1611548 1635398 1662002 1691189 1723393 1759770
50538 1759770 1801279 1848275 1901232 1961188 2029039 2104820 2188107 2278636 2375992 2479179 2587359
50527 2587359 2700953 2821310 2949157 3083855 3224108 3368624 3515681 3662508 3805612
50518 3805612 3941656 4067878 4181805 4280775 4361755 4421749 4458687 4471911 4461641 4428098 4371689
50507 4371689 4294174 4199053 4090441 3972017 3847575 3722147 3601641 3491115 3393806 3311870
50497 3311870 3247469 3202672 3178601 3175014 3190518 3222792 3268640 3324082 3384330 3443432 3494215
50486 3494215 3529254 3542420 3529764 3489376 3421157 3327053 3211120 3078829 2936050 2788424
50476 2788424 2641030 2498001 2362292 2235781 2119450 2013347 1916730 1828679 1748618 1676125
50466 1676125 1610476 1550741 1496261 1446843 1402613 1363972 1331501 1305434 1285180 1269730 1258606
50455 1258606 1252075 1250372 1253062 1259263 1268227 1279608 1293406 1309851 1329176 1351468 1376773 1405268
50443 1405268 1437048 1471747 1508557 1546343 1583272 1616463 1642776 1660356 1669264 1670719 1666307 1657902
50431 1657902 1647406 1635931 1623622 1610710 1598287 1587590 1579032 1572560 1568632 1568092 1571245 1577815 1587814
50418 1587814 1601830 1620415 1643805 1672395 1706957 1748125 1795961 1850130 1910122 1975174 2044308
50407 2044308 2116588 2191002 2266001 2339590 2410126 2476782 2539068 2596188 2646967 2690062 2723932
50396 2723932 2746839 2757080 2753134 2733638 2697849 2646481 2581778 2506443 2422898 2333941 2243554
50385 2243554 2156124 2074876 2001598 1937707 1884678 1843183 1812711 1792633 1783159 1784655 1796323 1816137
50373 1816137 1841767 1870820 1900165 1925826 1943981 1951917 1948092 1931869 1903568 1864482 1816449 1761465
50361 1761465 1701846 1640432 1580159 1523331 1471324 1424782 1383802 1348060 1317063 1290327 1267174
50350 1267174 1246419 1226415 1205351 1181545 1153947 1122886 1090218 1058261 1028515 1001691 978705
50339 978705 960838 948599 941009 936541 934492 935003 937959 942443 947416 952545 958165 964598 971809 979714
50325 979714 988493 998321 1008802 1019143 1029067 1039185 1050024 1060972 1070825 1079244 1086875 1093859 1099108
50312 1099108 1101633 1102013 1101821 1101963 1102265 1102514 1103134 1104832 1108132 1113303 1120231 1128410 1137618 1148659 1162848
50297 1162848 1180710 1201846 1226227 1254908 1289194 1329785 1376913 1429947 1485266 1534831 1568548
50286 1568548 1579378 1566617 1534914 1491083 1441718 1392176 1346083 1305328 1270767 1242882 1221577
50275 1221577 1205814 1194149 1185719 1180352 1177668 1176600 1176001 1175444 1175178 1175523 1176503 1177911 1179482 1181056 1182702
50260 1182702 1184660 1187163 1190450 1194997 1201348 1209474 1218465 1227204 1235308 1243163 1251127 1259064 1266708 1274159
50246 1274159 1281768 1289653 1297446 1304438 1309846 1313031 1313587 1311399 1306772 1300564 1294028 1288247 1283736 1280796
50232 1280796 1280119 1282521 1287748 1293701 1297084 1294855 1285198 1267662 1243059 1213355 1181147 1148725 1117386
50219 1117386 1087526 1059234 1032711 1008244 986020 966143 948711 933688 920635 908762 897472
50208 897472 886833 877394 869567 863323 858394 854473 851073 847474 843098 837958 832538 827225 821992 816660
50194 816660 811301 806203 801435 796619 791295 785468 779641 774282 769369 764544 759570 754520 749592 744920
50180 744920 740513 736236 731857 727235 722488 717958 714023 710893 708443 706244 704024 702192 701542 702181 703097
50165 703097 703215 702660 702478 703303 704882 706865 709334 712369 715688 719046 722544 726381 730814 736660 745169
50150 745169 756796 770460 784594 798609 812752 826944 840689 854143 868411 884451 902209
50139 902209 921183 941295 962718 985201 1008177 1031563 1056008 1082123 1109648 1137508 1164533
50128 1164533 1189906 1212852 1232156 1246336 1254402 1256296 1252483 1243301 1228960 1210076 1187892 1163900
50116 1163900 1139447 1115774 1094126 1075448 1059986 1047323 1036858 1028094 1020521 1013523 1006641 999807
50104 999807 992979 985571 976657 966055 954976 945181 937397 930753 923798 915875 907460 899416 892150 885523
50090 885523 879523 874851 872604 873255 876152 880242 885067 890676 896836 902927 908766 915028 922543 931396
50076 931396 940873 950064 958393 965846 972877 979922 986870 993196 998576 1003028 1006392 1008143 1007994 1006365
50062 1006365 1004007 1001427 998847 996303 993477 989728 984650 978419 971429 963940 956367 949461 943787 939304
50048 939304 935846 933691 933212 934325 936825 941061 947601 956368 966681 978123 990744 1004354 1018179
50035 1018179 1031486 1044208 1056844 1070007 1084096 1099077 1114488 1129888 1145245 1160628 1175612
50024 1175612 1189475 1202051 1213968 1225876 1237729 1248994 1259347 1268935 1277970 1286052 1291946 1294353
50012 1294353 1293129 1289549 1285081 1280096 1274035 1266362 1256717 1244385 1228439 1208598 1185452 1159914 1133001
49999 1133001 1106242 1081527 1060216 1042627 1028389 1016766 1006578 996651 986808 977975 970894 965034
49987 965034 958995 951575 942121 930315 916183 900167 882874 864901 847068 830424 815573 802207
49975 802207 789656 777775 767012 757820 750325 744347 739367 734586 729456 724178 719394 715330 711499
49962 711499 707289 702656 698188 694596 692257 691186 691410 693198 696802 702102 708786 716887 726757 738318
49948 738318 750565 762119 772175 780750 788106 794111 798213 799997 799772 798559 797362 796394 795069 792560
49934 792560 788128 781134 771205 758569 743937 728033 711500 695238 680331 667479 656798 648284
49922 648284 642025 637813 635016 633220 632661 633679 636003 638848 641510 643659 645396 647322 650288 654654
49908 654654 659948 665552 671513 678352 686272 694960 704099 713720 724057 735270 747236 759404 770929
49895 770929 781161 789872 796902 801807 804156 803951 801463 796750 789625 780054 768390 755330 741783
49882 741783 728562 715937 703637 691495 679928 669565 660651 653054 646637 641306 636936 633583 631470
49869 631470 630395 629447 627864 626071 625352 626545 629497 633718 639028 645555 653604 663597 675638 688997
49855 688997 702472 715469 728348 741592 754990 767826 779437 789304 796940 802087 804929 805805 804785
49842 804785 801686 796451 789313 780612 770589 759370 747158 734460 722091 710856 701139 692845 685698
49829 685698 679562 674547 670926 668886 668247 668511 669364 671049 674041 678435 683896 690163 697390 705923 715899
49814 715899 727007 738473 749303 758753 766600 772880 777637 781173 784291 787726 791215 793596 793927 792283
49800 792283 789398 785998 782611 779524 776424 772262 765915 757044 746201 734167 721410 708152 694819
49787 694819 682322 671823 664110 659126 656165 654460 653462 652746 652096 651753 652170 653273 654305 654693 654881
49772 654881 656045 659149 664568 672295 681894 692211 701773 709844 716856 723543 729914 735468 740155 744533
49758 744533 748769 751951 752844 751138 747518 742518 735810 726905 716232 705100 694646 685171 676567 669082
49744 669082 663335 659651 657597 656279 655068 653953 653247 653071 653208 653410 653734 654655 656995 661571 668525 676880
49728 676880 685023 691890 697537 702532 707251 712148 718374 727356 739536 753919 769069 784291 799610
49715 799610 814823 828838 839925 846490 847772 844101 836650 826898 816167 805463 795432 786363 778295
49702 778295 771389 766292 763985 764984 768446 772159 773728 771976 767251 760539 752612 744126 736121 729914
49688 729914 726457 725990 728285 732928 739358 746907 755132 764126 774512 787031 802099 819812 840480
49675 840480 864964 893880 925960 957302 982745 998408 1003301 999097 988922 976186 963778 953653
49663 953653 946901 944273 946625 954734 968348 985021 999918 1007477 1004070 989493 966135 937241 906082
49650 906082 875891 849190 826754 807749 791282 777426 766611 758558 752427 747847 745291 745353 747879
49637 747879 751830 755778 758465 759110 757497 753924 749042 743484 737494 730908 723620 715981 708587 701757
49623 701757 695401 689373 683717 678516 673722 669271 665319 662272 660527 660078 660362 660625 660592 660695 661589 663569
49607 663569 666508 670054 673640 676539 678313 679154 679514 679527 679081 678334 677751 677657 678068 678938 680234 681788 683368
49590 683368 684910 686384 687564 688337 689113 690426 692093 693284 693505 693075 692617 692575 693335 695104 697393 699182
49574 699182 700076 700925 702934 706497 711224 716744 723053 730316 738849 749097 761118 774075 786600 797758
49560 797758 807478 816067 823417 828728 831020 830051 826696 822172 816921 810611 803311 796084 790181 786023
49546 786023 783362 782003 781866 782591 783618 784601 785414 785882 785904 785777 786018 786933 788653 791500 795929 802094 809827
49529 809827 819121 830389 844081 860231 878534 898917 921993 948689 979024 1011126 1041726 1067800
49517 1067800 1087678 1100870 1107706 1109566 1108827 1107728 1107416 1108489 1112000 1119020 1129096 1139885 1148563
49504 1148563 1153130 1152295 1144880 1130139 1108616 1082327 1053944 1025841 999733 976827 957924 943093
49492 943093 931350 921096 911219 901730 893312 886531 881634 878616 876954 875596 873827 872164 871808 873211
49478 873211 875640 878190 880626 883081 885511 887757 889738 891258 891957 891826 891510 891752 892764 894467 897092
49463 897092 901047 906155 911457 915935 919284 921925 924398 926809 928731 929552 928939 926986 923952 919995 915305
49448 915305 910388 905989 902559 899895 897425 894842 892420 890800 890580 892102 895350 899880 904997 910269
49434 910269 915874 922313 929889 938758 949389 962492 978397 996956 1018312 1043164 1071907 1104171
49422 1104171 1140171 1181958 1231446 1285975 1336394 1370947 1381991 1369635 1340027 1301248 1260441
49411 1260441 1222926 1192064 1169271 1154481 1146933 1145626 1149402 1157135 1168122 1182091 1198725 1217322
49399 1217322 1236931 1256562 1275250 1292306 1307788 1322344 1336282 1349043 1359925 1368856 1375935 1380522
49387 1380522 1381617 1379132 1373956 1366677 1357055 1345057 1331543 1317335 1302278 1286002 1269251 1253636
49375 1253636 1240218 1228942 1219471 1211969 1206956 1204820 1205510 1208382 1212252 1215917 1218758 1220773 1222070 1222525
49361 1222525 1221808 1219624 1215936 1210980 1204892 1197345 1187972 1177248 1166489 1156737 1148106 1140483 1134241 1129727
49347 1129727 1126656 1124731 1124370 1125919 1128404 1130025 1129869 1128276 1125574 1121357 1115224 1107382 1098214 1088010
49333 1088010 1077534 1068221 1061227 1056531 1053348 1051214 1050529 1052334 1057736 1067320 1080986 1098393 1119207
49320 1119207 1142340 1165107 1183942 1196287 1201439 1199693 1191576 1178194 1161505 1143506 1125360 1107582
49308 1107582 1090671 1075217 1061709 1050525 1041777 1034962 1029189 1024069 1020052 1017789 1017586 1019592 1023806
49295 1023806 1029546 1035552 1041141 1046719 1052645 1058131 1061966 1063965 1064988 1065756 1066236 1065992 1064499 1061266 1056291
49280 1056291 1050416 1044775 1039915 1035902 1033135 1032459 1034362 1038467 1043887 1049719 1055181 1059727 1063267 1066087
49266 1066087 1068459 1070388 1071675 1072024 1071262 1069714 1068279 1067882 1068960 1071835 1077469 1087329 1102258 1121775
49252 1121775 1144713 1170270 1198023 1226696 1253199 1273368 1284093 1284785 1276851 1262141 1242220 1218722
49240 1218722 1193497 1168131 1143763 1121461 1102165 1086081 1072771 1062223 1055267 1052531 1053566 1057455
49228 1057455 1063664 1071611 1079988 1087506 1094193 1101182 1109264 1118220 1127455 1136538 1145096 1152882 1160155 1167564
49214 1167564 1175481 1183679 1191555 1198341 1203301 1206344 1208517 1211514 1216721 1224893 1236362 1250858 1267350
49201 1267350 1284825 1303234 1322991 1343627 1363749 1382475 1400098 1417083 1433167 1447856 1461206
49190 1461206 1473579 1485065 1495539 1504918 1513080 1519938 1525945 1532074 1538945 1546453 1554788 1565330 1579808
49177 1579808 1598756 1621509 1647738 1678339 1714720 1757849 1808205 1865788 1929026 1993476 2052267
49166 2052267 2098596 2128328 2140840 2138294 2124673 2104962 2083972 2065083 2049882 2038841 2031824 2027937
49154 2027937 2025637 2023598 2021316 2018713 2015750 2012901 2011474 2012640 2016294 2021428 2027503 2034857 2043964 2054975
49140 2054975 2067943 2082804 2099027 2115837 2132891 2150326 2168195 2186377 2204978 2224220 2243930
49129 2243930 2263709 2283618 2304106 2325225 2346559 2367992 2389984 2412980 2437156 2462759 2490156
49118 2490156 2519595 2551617 2587645 2629315 2677237 2731335 2792499 2862977 2945227 3041989 3158178
49107 3158178 3301081 3476435 3682925 3909532 4138078 4351295 4543578 4725961 4916338
49098 4916338 5118608 5309455 5448272 5503375 5471283 5373998 5240633 5090408 4927644 4747734
49088 4747734 4546858 4328328 4102434 3881858 3677262 3495539 3339816 3209889 3103172
49079 3103172 3016191 2945648 2888569 2842230 2804235 2772401 2744563 2718955 2694831 2672288 2651443
49068 2651443 2632192 2614632 2599017 2585169 2572527 2560970 2550950 2542585 2535209 2528203 2521784 2516573
49056 2516573 2512745 2510064 2508443 2508043 2508900 2510809 2513548 2517077 2521596 2527493 2535108 2544365 2554601 2564625
49042 2564625 2572906 2578029 2579412 2577583 2573550 2568095 2561997 2556580 2553293 2552725 2554571 2558548 2564625 2572241
49028 2572241 2580077 2586967 2592539 2596639 2598683 2598095 2595102 2590689 2585922 2581502 2577721 2574601 2572278 2571299
49014 2571299 2572249 2575011 2578834 2583204 2588140 2593567 2599038 2604426 2610283 2617057 2624371 2631474 2637911 2643365
49000 2643365 2647413 2650081 2652223 2654639 2657040 2658431 2658233 2656451 2653107 2648318 2642775 2637279 2631681 2624965
48986 2624965 2616638 2607507 2598886 2591397 2584779 2578538 2572551 2567142 2562693 2559152 2556085 2553296 2551055 2549401
48972 2549401 2547552 2544549 2540267 2535252 2529790 2523926 2518314 2514120 2511849 2510996 2511195 2513054 2517374 2524168
48958 2524168 2532949 2543446 2555357 2567843 2580144 2592703 2606980 2624026 2643739 2665601 2689548
48947 2689548 2715710 2743598 2771996 2799748 2826526 2852866 2879508 2906722 2934272 2962091 2990884
48936 2990884 3021947 3056357 3094427 3135895 3180371 3227478 3276742 3327687 3380122 3434226 3490246
48925 3490246 3548211 3608016 3669649 3733074 3797856 3863232 3928783 3994850 4061883 4129400 4195953
48914 4195953 4260291 4322222 4382118 4439872 4494819 4546645 4595867 4643127 4688192 4729972 4767558
48903 4767558 4801103 4831646 4860170 4886913 4911513 4933629 4953237 4970252 4984104 4993921 4999291 5000777
48891 5000777 4999628 4996993 4993279 4988082 4980610 4970325 4957345 4942181 4925066 4905657 4883498 4858653
48879 4858653 4831587 4802518 4771152 4737094 4700186 4660375 4617602 4572064 4524293 4474645 4422886
48868 4422886 4368588 4311827 4253254 4193680 4134010 4075361 4018650 3964007 3911110 3860257 3812552
48857 3812552 3768756 3728427 3690580 3654777 3621102 3589451 3559540 3531569 3506224 3483856 3464147
48846 3464147 3446803 3432203 3421027 3413459 3409058 3407369 3408329 3412016 3418196 3426389 3436426 3448725 3463786
48833 3463786 3481409 3500652 3520622 3541059 3562038 3583352 3604531 3625339 3645959 3666692 3687709
48822 3687709 3709053 3730688 3752498 3774370 3796217 3817823 3838800 3858871 3878083 3896552 3914187
48811 3914187 3930966 3947282 3963630 3980041 3996232 4012271 4028688 4045924 4064096 4083270 4103495
48800 4103495 4124555 4146247 4169009 4193563 4219655 4245714 4270165 4292536 4312878 4330788 4345772
48789 4345772 4358216 4369165 4379219 4388349 4396659 4404478 4411523 4416537 4418013 4414863 4406321 4391816 4371204
48776 4371204 4344769 4312755 4275344 4233279 4188056 4141044 4092580 4042166 3989394 3934569 3878747
48765 3878747 3823365 3769483 3717086 3665342 3613725 3562711 3513228 3465835 3420627 3377579 3336591
48754 3336591 3297515 3260496 3226061 3194583 3165964 3140095 3117120 3096796 3078123 3060376 3044167
48743 3044167 3030727 3020338 3012338 3006523 3003519 3003711 3006685 3011906 3018949 3026773 3033824 3039504 3044725 3050374
48729 3050374 3055995 3060812 3065296 3070677 3077287 3084423 3091612 3098971 3106345 3113068 3118761 3123623 3127736 3130764
48715 3130764 3132538 3133378 3133633 3133442 3133125 3133219 3133910 3134894 3136013 3137471 3139242 3140817 3141889 3142815 3144034 3145468
48699 3145468 3146830 3148155 3149638 3151351 3153498 3156667 3161457 3168079 3176558 3186823 3198201 3209272 3218854
48686 3218854 3226904 3233955 3240009 3244673 3248276 3252060 3257162 3263932 3272317 3282242 3293394 3305193 3317393
48673 3317393 3330331 3344360 3359443 3375753 3394183 3415474 3438663 3460837 3478492 3488739 3489162 3477381
48661 3477381 3451730 3412493 3361847 3302264 3235358 3162558 3086385 3010268 2937044 2868161 2804406
48650 2804406 2746778 2696204 2652718 2615426 2583233 2555340 2531132 2509910 2490885 2473315 2456573
48639 2456573 2440107 2423345 2405701 2386775 2366574 2345493 2324160 2303324 2283608 2264990 2246600
48628 2246600 2227370 2206928 2185631 2163971 2142470 2122009 2103493 2086935 2071459 2056514 2042555
48617 2042555 2030246 2019657 2010747 2004015 1999922 1998000 1997268 1997318 1998377 2000373 2002622 2004428 2005494 2005675
48603 2005675 2004766 2002680 1999614 1996099 1993040 1991475 1991933 1994188 1997868 2002905 2008917 2014528 2017988 2018379 2015686
48588 2015686 2009965 2001192 1989810 1976569 1961696 1944877 1926247 1906725 1887160 1867747 1848561 1830156
48576 1830156 1813303 1798582 1786426 1777100 1770255 1764911 1760321 1756723 1754993 1755755 1759000 1764246 1770681
48563 1770681 1777197 1782532 1785531 1785435 1782031 1775427 1765565 1752221 1735837 1718111 1701175 1686174 1672975
48550 1672975 1661148 1650639 1641423 1633106 1625039 1616432 1606279 1593746 1578999 1563265 1547771 1532821
48538 1532821 1518026 1503144 1488538 1475019 1463403 1454021 1446618 1440896 1437072 1435683 1437020 1441118 1448183
48525 1448183 1458667 1472978 1491275 1512957 1535531 1554330 1564477 1563692 1552977 1534985 1512535 1488480
48513 1488480 1465580 1445711 1429550 1417244 1408873 1404310 1403431 1406585 1414148 1425582 1439870 1456934
48501 1456934 1477521 1501392 1526752 1551699 1574818 1593666 1604298 1603777 1592611 1573837 1550507 1524970
48489 1524970 1499447 1475518 1453237 1431976 1411983 1394031 1377826 1362091 1346316 1331352 1318073
48478 1318073 1306367 1295664 1285682 1276406 1267975 1260781 1255112 1250483 1245878 1240886 1236199 1232857 1231315
48465 1231315 1231333 1232433 1234275 1236806 1240117 1244203 1248982 1254619 1261441 1269302 1277368 1284732 1290913 1295502
48451 1295502 1297874 1297707 1295391 1291455 1286017 1279284 1272173 1265781 1260447 1255742 1251100 1245958 1239705 1232060
48437 1232060 1223349 1213992 1204064 1193718 1183532 1173906 1164574 1155300 1146572 1138943 1132131 1125497 1118983
48424 1118983 1112794 1106538 1099550 1091916 1084420 1077616 1071561 1066251 1061642 1057388 1053149 1048989 1045040 1041077
48410 1041077 1036903 1032738 1028728 1024541 1019949 1015267 1010670 1005786 1000652 996239 993119 990385 986977 983379
48396 983379 980749 978954 976788 973800 970577 967493 964460 961794 960095 959292 958815 958625 959141 960388 962117
48381 962117 964428 967287 969910 971728 973460 975986 978589 979720 979196 978303 978068 978802 981031 985341 991341
48366 991341 998028 1005034 1012514 1020418 1029222 1040670 1056122 1074750 1094994 1116988 1141450 1166703
48354 1166703 1189119 1206292 1217727 1223063 1222377 1218276 1214954 1214627 1216907 1221632 1229853 1241861 1256826
48341 1256826 1274747 1296444 1321499 1348713 1378824 1414152 1455340 1501139 1551608 1608670 1673259
48330 1673259 1744926 1824602 1914824 2017256 2133220 2266541 2422405 2603881 2813940 3060797
48320 3060797 3357093 3714880 4146709 4670179 5304546 6065082 6970939 8058453 9377098
48311 9377098 10977129 12918825 15281028 18096062 21209803 24202033 26500627 27638828
48303 27638828 27454039 26095273 23892838 21221245 18415443 15726151 13302566 11207396
48295 11207396 9449838 8008831 6842701 5900987 5139381 4524104 4025909 3618014 3280580
48286 3280580 3000977 2768310 2571821 2404586 2263723 2145749 2045276 1958495 1884105 1820174
48276 1820174 1763525 1712792 1668896 1631869 1600050 1572785 1550941 1534041 1519621 1506164 1494250
48265 1494250 1484192 1474975 1466334 1459712 1456177 1455103 1455576 1457447 1460407 1463702 1467408 1472599 1479723 1487951
48251 1487951 1496250 1503602 1508010 1506945 1499363 1486186 1468747 1448250 1426773 1406948 1389936 1374951
48239 1374951 1361192 1348975 1338643 1329802 1322254 1316507 1312731 1310092 1307568 1304509 1300203 1293974 1286087
48226 1286087 1277611 1269009 1259742 1249438 1238424 1226836 1214186 1200209 1185171 1169043 1151274 1131763
48214 1131763 1111231 1090252 1068710 1046491 1023944 1001412 979029 957138 936133 915770 895519
48203 895519 875737 857550 841363 826458 812368 799564 788345 777988 767663 757489 748136 739950
48191 739950 732935 727073 722202 717987 714306 711245 708567 705717 702532 699388 696484 693593 690692 688157
48177 688157 686109 684150 682059 680185 678871 677966 677104 676048 674615 672808 671147 670296 670156 669800 668502
48162 668502 666397 664157 662512 662087 663020 664600 665819 666350 666510 666397 665864 665278 665396 666264 667079 667355 667466
48145 667466 667783 668076 668130 668246 668756 669610 670722 672106 673479 674435 675287 676955 679680 682590 684926 686932
48129 686932 689046 690994 692396 693694 695751 698814 702389 705876 708852 711009 712278 712933 713402 714143 715645
48114 715645 718140 721258 724500 728092 732699 738241 743822 749117 754973 762130 770153 778264 786569 795681
48100 795681 805611 815851 826261 837169 848690 860501 872270 883886 895404 907061 919261 932272
48088 932272 945996 960124 974195 987527 999585 1010666 1021752 1033373 1045067 1056193 1066736
48077 1066736 1076926 1086639 1095714 1104389 1112791 1120358 1126462 1131458 1136522 1142437 1149015 1155669 1162207 1169007
48063 1169007 1176658 1185371 1194603 1203324 1210729 1216507 1220430 1222173 1221824 1220231 1218368 1216412 1213607 1208875
48049 1208875 1201499 1191551 1179967 1168050 1156678 1146004 1135720 1125319 1114155 1101800 1088415 1074380
48037 1074380 1059570 1043648 1027072 1011046 996168 981809 967155 952143 936991 921565 905881
48026 905881 890609 876367 862864 849420 836036 823314 811586 800658 790240 780118 770142 760450
48014 760450 751474 743254 735067 726236 717047 708362 700631 693838 688102 683590 679902 676243 672303 668533
48000 668533 665430 662947 660714 658539 656531 654862 653500 652235 651069 650399 650421 650482 649622 647858 646206 645224
47984 645224 644297 642822 641260 640240 639331 637666 635402 633553 632558 631882 630952 629680 628126 626474 625374
47969 625374 625485 626460 627093 626742 626016 625808 626174 626560 626741 627049 627783 628686 629152 628877 628267 628058 628562 629555 630925
47950 630925 633045 636248 640320 644896 649980 655713 661949 668489 675430 682810 690253 697471 704813 712705
47936 712705 720826 728532 735881 743438 751109 757996 763596 768437 773314 778328 782909 786340 788085 787939
47922 787939 786054 782652 777756 771456 764312 757111 750325 744063 738277 732609 726305 718961 711238 704228
47908 704228 698205 692657 687442 683089 679859 677254 674718 672237 670080 668570 668341 670129 673896 678529
47894 678529 682766 686123 688820 691269 693840 696729 699777 702829 706335 711091 717183 723746 730021 736130
47880 736130 742474 749005 755501 762099 768934 775537 781115 785250 787969 789352 789498 788660 786964 784130 779847
47865 779847 774315 768002 761016 753136 744456 735554 726891 718371 709680 700810 692088 683753 675713 667684
47851 667684 659540 651532 644242 638311 634074 631358 629628 628488 628031 628537 629828 631253 632483 633994 636434
47836 636434 639731 643260 646741 650459 654589 658786 662638 666182 669745 673474 677252 680980 684784 688981
47822 688981 693779 699023 704322 709541 714971 720898 727272 734069 741672 750513 760631 772041 785331
47809 785331 801254 819793 840237 862114 885414 909768 934049 957011 977907 996372 1012228
47798 1012228 1025524 1036280 1044030 1048098 1048413 1045511 1039656 1030741 1019246 1006481 993341 979515 964564
47785 964564 949242 935082 923018 912984 904534 897203 890520 884267 878638 873762 869329 865092 861302
47772 861302 858022 854384 849385 843263 837207 831633 825608 818216 809764 801235 793125 785329 777770 770546
47758 770546 763632 756908 750470 744640 739649 735611 732754 731369 731339 731925 732357 732624 733482 735584 738833 742744
47742 742744 747197 752449 758540 765220 772638 781561 792477 804793 817413 830018 843248 857579 872477
47729 872477 886939 900556 913743 926934 939785 951237 960275 966603 970615 972839 973550 972852 970915
47716 970915 967883 963567 957434 949044 938543 926680 914303 901835 889229 876339 863228 850149
47704 850149 837419 825441 814623 805104 796669 789082 782422 776954 772877 770384 769789 771209 774198 778091
47690 778091 782643 788072 794545 802029 810540 820061 830246 840706 851618 863522 876438 889759 903094
47677 903094 916522 929779 941968 952601 962270 971658 980379 987436 992371 995258 996002 994626 992078
47664 992078 989667 987461 984035 978071 969613 959464 948074 935536 922209 908744 895649 883237
47652 883237 871859 861778 852840 844613 836894 829878 823869 818956 815029 812032 810157 809768 810965 813179
47638 813179 815399 817042 818586 821202 825782 832426 840721 850211 860629 872056 885138 900920 920152
47625 920152 942678 967589 993861 1020625 1047031 1072318 1096159 1118576 1139284 1157394 1171939
47614 1171939 1182360 1188167 1188481 1182505 1170404 1153270 1132188 1107682 1080005 1049465 1016364 981087
47602 981087 944521 908113 873307 841038 811731 785370 761505 739593 719612 701972 686705
47591 686705 673147 660700 649460 639715 631193 623332 616030 609601 604089 599206 594935 591705 589695
47578 589695 588326 586718 584598 582593 581648 582165 583638 585056 585583 584871 582915 579938 576427 572985 569928
47563 569928 567208 564759 562657 560804 558760 556150 553051 549704 546081 542107 538175 535061 533210 532258
47549 532258 531328 529633 526927 523582 520349 517965 516811 516772 517304 517782 518008 518353 519129 519934 519956 518940 517447
47532 517447 516142 515261 514913 515284 516233 517153 517646 517984 518520 519090 519499 520227 521968 524585 527131 528901 530013
47515 530013 530926 531833 532607 533055 533069 532722 532199 531547 530689 529838 529604 530362 531730 533018 533991 534788 535326 535341 534949
47496 534949 534617 534576 534731 535184 536367 538440 540855 542680 543223 542518 541524 541727 544045 548000 552272 556062
47480 556062 559564 563173 566845 570428 574095 578049 582030 585524 588410 591178 594455 598373 602429 605926
47466 605926 608590 610678 612571 614434 616289 618094 619520 620017 619511 618800 618804 619530 620211 620432 620659 621624 623547
47449 623547 626099 628962 632387 637322 644752 654662 665891 677342 689148 702278 717370 734468 753536
47436 753536 774391 796195 817917 839447 861527 884350 906948 928175 947578 964903 979466
47425 979466 990646 998584 1003813 1006493 1006495 1003969 999296 992657 984057 973673 961785 948414 933460 917195
47411 917195 900333 883580 867344 851888 837468 824127 811411 798560 785183 771769 759348
47400 759348 748502 738926 730124 722262 715957 711366 707982 705307 703281 701985 701411 701714 703283 706374
47386 706374 710901 716709 723709 731664 740172 749059 758423 768218 778105 787860 797571 807246 816595 825337
47372 825337 833332 840188 845188 847938 848755 848092 845891 841832 835899 828242 818697 806967 793247 778270
47358 778270 762660 746565 730072 713765 698561 684900 672261 659734 647095 634946 623743
47347 623743 613138 602723 592966 584750 578212 572780 568181 564567 561674 558821 556001 554071 553468 553545
47333 553545 553625 553882 554623 555488 556119 557041 559095 562354 566279 570499 574724 578332 580885 582839 584996 587425
47317 587425 589565 591103 592036 592150 591248 589737 588177 586365 583726 580556 577886 575994 573996 571238 568198
47302 568198 565584 563330 561064 559030 557851 557697 558277 559478 561487 564354 567837 571768 576250 581462 587431
47287 587431 594115 601570 609942 619269 629423 640348 652272 665472 679820 694931 710889 728462
47275 728462 748280 770075 792915 815720 836960 854225 865026 868380 865308 857814 847747 836501
47263 836501 825037 813812 802941 792668 783450 775509 768558 762029 755342 748003 739868 731440 723536
47250 723536 716482 709877 703237 696686 690931 686754 684474 683635 683213 682417 681336 680672 680969 682359 684893
47235 684893 688607 693313 698692 704551 710715 716927 723405 731215 741273 752980 764671 775611 786703
47222 786703 799045 812579 826610 840724 854559 867348 878565 888593 897940 906042 911565 913825
47210 913825 913295 910839 906992 901937 895570 887546 877725 866636 855166 843834 832763 822210 812567
47197 812567 803790 795409 787341 780271 774971 771519 769487 768663 769256 771475 775147 779832 785237 791480 798975
47182 798975 808114 819085 831938 846668 863147 881115 900318 920565 941544 962705 983463 1003452
47170 1003452 1022533 1040676 1057925 1074224 1089090 1101646 1111220 1117873 1122177 1124637 1125474 1124693 1122026
47157 1122026 1117010 1109542 1100259 1089916 1078444 1065180 1050202 1034907 1020854 1008294 996243 983871
47145 983871 971411 959758 949598 941110 934194 928643 924178 920593 917985 916663 916714 917819 919691 922606
47131 922606 927223 933759 941473 949091 955723 961385 966680 971938 976563 979257 979061 976164 971542 965882
47117 965882 959136 951105 941986 932161 921736 910641 898998 887157 875468 864155 853222 842334
47105 842334 831087 819593 808504 798151 788033 777621 767370 758249 750341 742615 734238 725540
47093 725540 717408 710256 703998 698638 694407 691434 689649 688999 689513 691142 693676 696805 700200 703674 707343
47078 707343 711537 716445 721914 727648 733392 738770 743205 746265 748111 749406 750795 752508 754370 756006
47064 756006 757071 757461 757315 756743 755663 754079 752478 751685 752180 753690 755605 757727 760431 764064 768428
47049 768428 773037 777770 782941 788685 794581 800164 805527 811119 817066 823087 829033 835102 841497 848289
47035 848289 855648 863703 871960 879382 885482 890944 896751 903053 909439 916003 923303 931288 939036 945869
47021 945869 952146 958525 964826 970101 973658 975588 976327 976095 974851 972594 969531 965957 962031 957764 953229
47006 953229 948667 944246 939844 935269 930685 926514 922979 920042 917819 916674 916759 917785 919470 921896 925155
46991 925155 928907 932613 936107 939681 943785 948779 954722 961118 967123 972450 977906 984678 993183 1002995
46977 1002995 1013692 1025186 1037206 1049045 1060159 1070719 1081349 1092483 1104060 1115547 1126160
46966 1126160 1135306 1143029 1149924 1156543 1162954 1168740 1173214 1175770 1176428 1176060 1175700 1175610 1175383 1174924 1174733 1175097
46950 1175097 1175615 1175864 1176064 1176776 1178370 1181100 1185217 1190496 1196114 1201512 1207088 1213534 1220831 1228510 1236515
46935 1236515 1245041 1253699 1261709 1269017 1276503 1284931 1294266 1304146 1314296 1324207 1333035 1340289 1346208 1351101
46921 1351101 1354673 1356239 1355255 1351332 1344212 1334203 1322381 1309873 1297035 1283545 1269090 1253739
46909 1253739 1238014 1222975 1209872 1199143 1189957 1181303 1173437 1167647 1164639 1163838 1164504 1166902 1171925
46896 1171925 1179977 1190741 1203871 1219355 1237118 1256677 1277382 1298811 1320723 1342802 1364685
46885 1364685 1386204 1407344 1427891 1447293 1465019 1480935 1495188 1507829 1518793 1528149 1536078 1542562
46873 1542562 1547417 1550786 1553382 1556018 1559066 1562573 1566744 1572017 1578727 1586887 1596275 1606581 1617545
46860 1617545 1629194 1641956 1656306 1672277 1689408 1707110 1724825 1741867 1757469 1771185 1783046
46849 1783046 1793185 1801485 1807814 1812361 1815376 1816626 1815541 1812086 1807190 1802003 1796834 1791130 1784454 1777158
46835 1777158 1770005 1763433 1757439 1752018 1747393 1743865 1741661 1740994 1742113 1745284 1750754 1758629 1768639 1780128
46821 1780128 1792526 1805728 1819756 1834185 1848362 1862137 1875764 1888868 1900109 1908376 1913983 1918178
46809 1918178 1921732 1924493 1926073 1926295 1924929 1921697 1916784 1910889 1904483 1897401 1889399 1880788 1872141 1863649
46795 1863649 1855131 1846589 1838417 1831083 1824845 1819764 1815845 1813159 1811876 1812054 1813301 1814866 1816346 1818177
46781 1818177 1821187 1825705 1831311 1837328 1843316 1849154 1854985 1861130 1867779 1874674 1881294 1887389 1893097 1898560
46767 1898560 1903818 1909236 1915681 1923912 1933905 1945040 1956840 1969352 1982886 1997642 2013564 2030421
46755 2030421 2048060 2066659 2086544 2107634 2129255 2150743 2171958 2192802 2212504 2230041 2245343
46744 2245343 2259378 2272798 2285023 2295107 2303049 2309615 2315106 2319029 2321063 2321733 2321814 2321468 2320384 2318619
46730 2318619 2316894 2315983 2316055 2316812 2318186 2320656 2324707 2330135 2336209 2342580 2349655 2357817 2366521 2374555 2381110
46715 2381110 2386189 2389978 2392232 2392467 2390453 2386219 2379766 2371014 2359912 2346411 2330363 2311610 2290167
46702 2290167 2266241 2240166 2212421 2183575 2154076 2124146 2093993 2063991 2034418 2005112 1975669
46691 1975669 1946108 1917196 1890000 1865093 1842159 1820274 1798596 1776929 1755735 1735613 1716819
46680 1716819 1699280 1682882 1667563 1653230 1639820 1627479 1616464 1606765 1598024 1589921 1582519 1576158
46668 1576158 1571178 1567806 1566048 1565479 1565424 1565713 1567098 1570517 1575932 1582354 1589084 1596419 1604895 1614286 1623691
46653 1623691 1632318 1639714 1645503 1649476 1651946 1653501 1654294 1653941 1652197 1649378 1645967 1642156 1638035 1633970
46639 1633970 1630578 1628488 1628233 1630183 1634448 1640994 1649946 1661546 1675800 1692448 1711277 1732031 1753939
46626 1753939 1775871 1797284 1818511 1839633 1859562 1876791 1890748 1901762 1909898 1914579 1915327 1912180
46614 1912180 1905295 1894728 1880843 1864443 1846240 1826583 1805867 1784832 1764167 1744077 1724408
46603 1724408 1704986 1685746 1666838 1648792 1632381 1618120 1605972 1595470 1585915 1576588 1567193 1558124
46591 1558124 1549952 1542708 1536042 1529950 1524648 1519691 1513988 1507007 1499356 1491793 1484291 1476548 1468804 1461530
46577 1461530 1454746 1448285 1442375 1437270 1432573 1427724 1423060 1419691 1418202 1418035 1418240 1418432 1418921 1420305 1422966
46562 1422966 1426587 1430133 1432669 1434260 1435775 1437894 1440680 1444047 1448081 1452789 1457975 1463599 1469918 1477125
46548 1477125 1485109 1493690 1502821 1512481 1522640 1533416 1544969 1557196 1569878 1583159 1597462 1612830
46536 1612830 1628820 1645226 1662467 1681039 1701068 1722654 1746081 1771236 1797343 1823931 1851719
46525 1851719 1881839 1914292 1947924 1981843 2016060 2050600 2084868 2118329 2151180 2183710 2215391
46514 2215391 2245233 2272716 2297752 2319955 2338755 2354302 2367449 2378546 2386870 2391734 2393678 2394015
46502 2394015 2393509 2392070 2389491 2385806 2380922 2374623 2367165 2359363 2351765 2344107 2335849 2326895 2317456 2307427
46488 2307427 2296231 2283180 2267794 2250033 2230431 2209744 2188066 2164486 2138028 2108821 2077892
46477 2077892 2045823 2012169 1976405 1939008 1901221 1863952 1827292 1791121 1755863 1722455 1691717
46466 1691717 1663862 1638626 1615725 1595255 1577797 1564187 1554969 1549883 1548082 1549071 1553265 1561251 1572684
46453 1572684 1586444 1601919 1619419 1639015 1659532 1679285 1697500 1714459 1730540 1745728 1759936
46442 1759936 1773057 1784500 1793272 1798837 1801584 1802189 1800783 1797004 1790743 1782634 1773874 1765559 1757988 1750552
$$ [...]
##END NTUPLES=NMR SPECTRUM
##END=
