##TITLE=AC1754_VAR00026_9319673_kG689NxaN2
##JCAMPDX= 6.0         $$ Bruker NMR JCAMP-DX V2.0
##DATA TYPE= NMR SPECTRUM
##DATA CLASS= NTUPLES
##ORIGIN= BRUKER
##OWNER= Administrator
$$ 1.72 TOPSPIN		Version 2.1
$$ 2015-08-11 18:41:01.695 -0700  Administrator@X
$$ Compression mode = diff/dup
##.OBSERVE FREQUENCY= 400.02188249412
##.OBSERVE NUCLEUS= ^1H
##.ACQUISITION MODE= SIMULTANEOUS (DQD)
##.ACQUISITION SCHEME= undefined
##.AVERAGES= 8
##.DIGITISER RES= 22
##SPECTROMETER/DATA SYSTEM= spect
##.PULSE SEQUENCE= zg30
##.SOLVENT NAME= COFFEE_meoh
##.SHIFT REFERENCE= INTERNAL, COFFEE_meoh, 1, 14.98509
##AUDIT TRAIL= $$ (NUMBER, WHEN, WHO, WHERE, PROCESS, VERSION, WHAT)
$$ ##TITLE= Audit trail, TOPSPIN		Version 2.1
$$ ##JCAMPDX= 5.01
$$ ##ORIGIN= Bruker BioSpin GmbH
$$ ##OWNER= Administrator
$$ $$ E:\/data/COFFEE/nmr/AC1754_VAR00026_9319673_kG689NxaN2/10/pdata/1/auditp.txt
$$ ##AUDIT TRAIL=  $$ (NUMBER, WHEN, WHO, WHERE, PROCESS, VERSION, WHAT)
(   1,<2015-08-11 18:40:54.023 -0700>,<Administrator>,<X>,<go>,<TOPSPIN 2.1>,
      <created by zg
	started at 2015-08-11 18:39:48.257 -0700,
	POWCHK enabled, PULCHK disabled,
       configuration hash MD5:
       21 0F 79 D6 B3 7B B4 F6 88 20 88 DB 03 48 BD 9F
       data hash MD5: 64K
       0F B4 4E 32 0F B6 A8 54 56 E0 40 58 8C 79 80 B5>)
(   2,<2015-08-11 18:40:57.632 -0700>,<Administrator>,<X>,<proc1d>,<TOPSPIN 2.1>,
      <Start of raw data processing
       efp LB = 0 FT_mod = 6 PKNL = 1 PHC0 = 0 PHC1 = 0 SI = 32K 
       data hash MD5: 32K
       42 6A D7 64 08 44 FF E1 CA 9E EC D1 A2 14 45 D9>)
(   3,<2015-08-11 18:40:57.929 -0700>,<Administrator>,<X>,<proc1d>,<TOPSPIN 2.1>,
      <pk PHC0 = 86.20972 PHC1 = 0 
       data hash MD5: 32K
       E5 96 4E 52 CC A6 7D 41 3A 9A D3 0D 93 C9 B0 5F>)
(   4,<2015-08-11 18:40:58.039 -0700>,<Administrator>,<X>,<proc1d>,<TOPSPIN 2.1>,
      <abs ABSG = 1 
       data hash MD5: 32K
       A9 AD 79 FD D1 6E 56 91 1F 52 52 CF 4E E4 D5 07>)
(   5,<2015-08-11 18:40:58.101 -0700>,<Administrator>,<X>,<proc1d>,<TOPSPIN 2.1>,
      <abs ABSG = 2 
       data hash MD5: 32K
       36 70 FE 8E AB 9B 7E BA 33 D9 56 5A 92 6D BE E0>)
(   6,<2015-08-11 18:40:58.148 -0700>,<Administrator>,<X>,<proc1d>,<TOPSPIN 2.1>,
      <abs ABSG = 3 
       data hash MD5: 32K
       7E BA 23 DD 93 E8 0A 78 98 7F D2 2A 07 76 CE 57>)
(   7,<2015-08-11 18:40:58.210 -0700>,<Administrator>,<X>,<proc1d>,<TOPSPIN 2.1>,
      <abs ABSG = 4 
       data hash MD5: 32K
       89 E8 20 59 E7 0E F9 1C 7A D7 19 AA D2 F8 B9 9A>)
(   8,<2015-08-11 18:40:58.273 -0700>,<Administrator>,<X>,<proc1d>,<TOPSPIN 2.1>,
      <abs ABSG = 5 
       data hash MD5: 32K
       DB E7 DB 9A D0 E9 0E E6 E2 C5 BB 9C 1D 1C 8E 8B>)
$$ ##END=
$$ 
$$ $$ hash MD5
$$ $$ 61 C9 63 7B 9B 47 A6 93 18 29 A1 E6 AF E8 D4 57
##$RELAX= 
##$RELAX= 
##$RELAX= 
##$RELAX= 
##$RELAX= 
##$RELAX= 
##$RELAX= 
$$ Bruker specific parameters
$$ --------------------------
##$DU= <E:\>
##$EXPNO= 10
##$NAME= <AC1754_VAR00026_9319673_kG689NxaN2>
$$ [...]
150 150 150 150 150 150 150 150
##$TP07= 0
##$TPNAME0= <>
##$TPNAME1= <>
##$TPNAME2= <>
##$TPNAME3= <>
##$TPNAME4= <>
##$TPNAME5= <>
##$TPNAME6= <>
##$TPNAME7= <>
##$TPOAL= (0..7)
0.5 0.5 0.5 0.5 0.5 0.5 0.5 0.5
##$TPOFFS= (0..7)
0 0 0 0 0 0 0 0
##$TUNHIN= 0
##$TUNHOUT= 0
##$TUNXOUT= 0
##$USERA1= <user>
##$USERA2= <user>
##$USERA3= <user>
##$USERA4= <user>
##$USERA5= <user>
##$V9= 5
##$VALIST= <valist>
##$VCLIST= <CCCCCCCCCCCCCCC>
##$VD= 0
##$VDLIST= <DDDDDDDDDDDDDDD>
##$VPLIST= <PPPPPPPPPPPPPPP>
##$VTLIST= <TTTTTTTTTTTTTTT>
##$WBST= 2048
##$WBSW= 25
##$XGAIN= (0..3)
0 0 0 0
##$XL= 0
##$YL= 0
##$YMAX_a= 592254
##$YMIN_a= -521481
##$ZGOPTNS= <>
##$ZL1= 120
##$ZL2= 120
##$ZL3= 120
##$ZL4= 120
##$ABSF1= 14.98509
##$ABSF2= -5.573092
##$ABSG= 5
##$ABSL= 3
##$ALPHA= 0
##$AQORDER= 0
##$ASSFAC= 0
##$ASSFACI= 0
##$ASSFACX= 0
##$ASSWID= 0
##$AUNMP= <proc_prof1d_extract_pilot.lims>
##$AXLEFT= 0
##$AXNAME= <>
##$AXNUC= <1H>
##$AXRIGHT= 0
##$AXTYPE= 0
##$AXUNIT= <>
##$AZFE= 0.1
##$AZFW= 0.1
##$BCFW= 0
##$BC_mod= 0
##$BYTORDP= 0
##$COROFFS= 0
##$CY= 15
##$DATMOD= 1
##$DC= 0
##$DFILT= <>
##$DTYPP= 0
##$F1P= 0
##$F2P= 0
##$FCOR= 0.5
##$FTSIZE= 32768
##$FT_mod= 6
##$GAMMA= 0
##$GB= 0
##$INTBC= 1
##$INTSCL= 1
##$ISEN= 128
##$LB= 0
##$LEV0= 0
##$LPBIN= 0
##$MAXI= 10000
##$MC2= 0
##$MEAN= 0
##$ME_mod= 0
##$MI= 0
##$NCOEF= 0
##$NC_proc= -8
##$NLEV= 6
##$NOISF1= 0
##$NOISF2= 0
##$NSP= 0
##$NTH_PI= 0
##$NZP= 0
##$OFFSET= 14.98509
##$PC= 1
##$PHC0= 86.20972
##$PHC1= 0
##$PH_mod= 1
##$PKNL= yes
##$PPARMOD= 0
##$PPDIAG= 0
##$PPIPTYP= 0
##$PPMPNUM= 2147483647
##$PPRESOL= 1
##$PSCAL= 4
##$PSIGN= 0
##$PYNMP= <proc.py>
##$REVERSE= no
##$SF= 400.02
##$SI= 32768
##$SIGF1= 0
##$SIGF2= 0
##$SINO= 400
##$SIOLD= 32768
##$SPECTYP= <>
##$SREGLST= <1H.CDCl3>
##$SSB= 0
##$STSI= 32768
##$STSR= 0
##$SW_p= 8223.68421052631
##$SYMM= 0
##$S_DEV= 0
##$TDeff= 65536
##$TDoff= 0
##$TI= <>
##$TILT= no
##$TM1= 0
##$TM2= 0
##$TOPLEV= 0
##$USERP1= <user>
##$USERP2= <user>
##$USERP3= <user>
##$USERP4= <user>
##$USERP5= <user>
##$WDW= 1
##$XDIM= 32768
##$YMAX_p= 448740828
##$YMIN_p= -648340
##$CURPLOT= <Network HP LaserJet P1505>
##$CURPRIN= <$Network HP LaserJet P1505>
##$DFORMAT= <normdp>
##$LAYOUT= <+/1D_H.xwp>
##$LFORMAT= <normlp>
##$PFORMAT= <normpl>
##$SURQMSG= 1
$$ End of Bruker specific parameters
$$ ---------------------------------
##NTUPLES= NMR SPECTRUM
##VAR_NAME=  FREQUENCY,     SPECTRUM/REAL,   SPECTRUM/IMAG
##SYMBOL=    X,             R,               I
##VAR_TYPE=  INDEPENDENT,   DEPENDENT,       DEPENDENT
##VAR_FORM=  AFFN,          ASDF,            ASDF
##VAR_DIM=   32768,         32768,           32768
##UNITS=     HZ,            ARBITRARY UNITS, ARBITRARY UNITS
##FACTOR=    0.250966925370066, 1,           1
##FIRST=     8223.43324360094, -235981,      -55731
##LAST=      0,             17757,           220729
##MIN=       0,             -648340,         0
##MAX=       8223.43324360094, 448740828,    0
$$ Real data points
##PAGE= N=1
##DATA TABLE= (X++(R..R)), XYDATA
$$ [...]
19560A1465a39962B14259c00125C7684a62880F2240b44038H9623b32093N2455
19550a79638B9094b46940R9291B84526d1329A96073i8506d7523I5397a35118K6124
19539a08994l97363c1783a441j40617r7830g6542k87682B19873F8354j3314b66129
19527e8481A53568a7891k67521i4225p101A7623J57179B4838b23516I523J19442
19516A28965N9890g1505G5181k0636A5844J26812j8827g9314o6110J1398k29003
19505c63029a5757o2729k58213B8648a47778J2662A09889g6596B16105c08012
19494I6755e2313J7956A95197p0824a37906M848o1046C1740a98598A09019o340
19483A02679a5918j34618d5930j0539a9877r3416c2239m0368A61984b06098A3885
$$ plain form
19560 11465 -139962 214259 -300125 37684 -162880 62240 -244038 89623 -232093 -179638
19550 -179638 29094 -246940 -147649 284526 -41329 196073 -98506 -47523 95397 -135118 -108994
19539 -108994 -506357 -31783 -1441 -142058 -239888 -76542 -364224 219873 68354 55040 -266129
19527 -58481 153568 -17891 -285412 -94225 -101326 17623 174802 24838 -223516 9523 128965
19516 128965 188855 -71505 75181 54545 15844 142656 123829 -79314 -145424 -134026 -363029
19505 -363029 -15757 -78486 -336699 28648 -147778 -135116 109889 -76596 216105 -308012
19494 96755 -52313 -34357 195197 124373 -137906 -133058 -194104 31740 -198598 109019 102679
19483 102679 -15918 -150536 -45930 -56469 -19877 -113293 -32239 -72607 161984 -206098 13885
19471g5094C8986K3928e2866A28365c2181k38132a13241j29894G5474a57834j39335
19460b97169a34039B7075a8131j24857M8512j72852Q5701H7264a42163L9062B69395
19448A56764a68840j15523A55980b99528h6844j40141D6114L8764a33639c7397
19437A17394b0464A13619a25771K2972A48119b36006c7286j58574Q1287b27k04735
19426b04962F8669J3168A0490a01574l61163a72330N0500L0769m537n4439C9137
19414I9707a86003A64853D3771K85522a89775P5494k02854E211J39233F5600i0594
19402f1317B56925b09958L1755h8309M0937j22840j2780D6251a44360A92978d8801
19390B5665a06966H4722b48439n1454A02655e5681A57399c2311j46069G2549M3984
$$ plain form
19471 -75094 38986 62914 -52866 128365 -32181 -270313 -113241 -243135 75474 -157834 -297169
19460 -297169 -134039 27075 -18131 -142988 -94476 -267328 -181627 87264 -142163 -103101 269395
19448 156764 -168840 -284363 155980 -299528 -86844 -226985 46114 84878 -133639 -37397
19437 117394 -20464 113619 -125771 -102799 148119 -236006 -37286 -195860 -114573 -227 -204962
19426 -204962 68669 81837 10490 -101574 -462737 -172330 -121830 -91061 -95598 -150037 39137
19414 99707 -186003 164853 43771 329293 -189775 -114281 -317135 5211 144444 65600 -90594
19402 -61317 256925 -209958 -178203 -88309 -47372 -170212 -182992 46251 -144360 192978 -48801
19390 25665 -106966 84722 -248439 -299893 102655 -55681 157399 -32311 -178380 72549 116533
19379A16533a6858B09104m0275b29877a09358F4853b11811A06079c8825j44822
19369a83647b2124m2038J6634l03405h9951k60264f7712E73638b33407a5319j60158
19358a75477A78835A4269b92463E810K62955j01292a00775F8686a99749B1205
19347b83601J39722n389q3761d9780a6164B14954e5604A18778j6624a29389F1624
19335A58224p6563a36813j76182A9227b88844c9758j75839I0635Q1586c30850
19324f07j04727p2439K3737k94450A95180b78715p5646A47353o5673J04682d2098
19312c32382B36574F7558b61049D7807b27692m0501A12280K776g9323m4611m5833
19301a69767O9885A05788D8747f6404C0235c4892j25118j2631O0061D4215b48029
$$ plain form
19379 116533 -16858 209104 168829 -229877 -109358 64853 -211811 106079 -38825 -183647
19369 -183647 -22124 -64162 -47528 -350933 -89951 -350215 -67712 573638 -233407 -15319 -175477
19358 -175477 178835 14269 -292463 5810 268765 167473 -100775 68686 -199749 21205
19347 -283601 -143879 -149268 -233029 -49780 -16164 214954 -55604 118778 102154 -129389 61624
19335 158224 81661 -136813 -312995 19227 -288844 -39758 -215597 90635 172221 -330850
19324 -607 -105334 -177773 -154036 -448486 195180 -278715 -354361 147353 81680 186362 -42098
19312 -332382 236574 67558 -261049 47807 -227692 -268193 112280 115056 -79323 -123934 -169767
19301 -169767 -99882 105788 48747 -66404 30235 -34892 -160010 -172641 -112580 44215 -248029
19289b37520C9838b87329b9398A55613i3535o9120F820b15650p292B25564O1341
19278B86905b27698O3839n038P0878B28978p7854L4554l3115a48452j27984e0558
19266b26311m305i6117F1403d1892k05027b6351j89557D7720i4874B38499b4368
19254c02093b3445j26745P0005D5296b25429e0267A25888A7558K33330b68637
19243A3188e9074N865k25056J35520j52722h6331c6203j16536p270B3928a97355
19231A8427h2975B05271g2834J9698A06823C5361i5402A666c8117B0802Q2300
19220A03102b27526M2300O5614a3157q8001k14233J7533P5028A58483F4573a72516
19208e7280B8814K418i9379A03216l1722b35809c7555M462j61153j30112i6005
$$ plain form
19289 -237520 39838 -287329 -29398 155613 -93535 -162655 6820 -215650 -222942 225564 286905
19278 286905 -227698 -163859 -168897 -98019 228978 151124 185678 152563 -148452 -276436 -50558
19266 -226311 -230616 -96117 61403 -41892 -246919 -26351 -215908 47720 -94874 238499 -24368
19254 -302093 -23445 -150190 -80185 45296 -225429 -50267 125888 17558 250888 -268637
19243 13188 -59074 -53209 -278265 -142745 -295467 -86331 -36203 -152739 -160009 23928 -197355
19231 18427 -82975 205271 -72834 -53136 106823 35361 -95402 1666 -38117 20802 103102
19220 103102 -227526 -185226 -119612 -13157 -101158 -315391 -297858 -222830 158483 64573 -172516
19208 -57280 28814 31232 -99379 103216 71494 -235809 -37555 -33093 -194246 -324358 -96005
19196a40750A2332g3286q9410m5766j05101Q7711H6280a64772j19334a37249F9859
19184i5314A24095E0223a57214N4157F6817a22429l1108j53116J13009O8716l4606
19173a59534l9609K8132p2076j6827A18821i2820C9721a3959j949F9480i7023
19161D2981C337L08883B4506a81631P366g179I6662C3998b1286A03091a17809
19149B42276e04531a25020j28670c1702k5164m7415j8386j07377J09369k03029
19139c23704d1774k2205j78299b0251j96362G6594d0481q5180l0770k52410B32237
19127A49325P9173a60466l0401M5979B71022e6802K597k2888j32241d5703k2820
19116f8523k16840g7305A40572B5307g1398J6964p0816l1440p66A77664O1883
$$ plain form
19196 -140750 12332 -73286 -162696 -208462 -313563 -225852 86280 -164772 -284106 -137249 69859
19184 -95314 124095 50223 -157214 -103057 66817 -122429 -153537 -306653 -193644 -124928 -159534
19173 -159534 -199143 -171011 -243087 -259914 118821 -92820 39721 -13959 -15908 69480 -97023
19161 42981 3337 312220 24506 -181631 -174265 -7179 96662 33998 -21286 103091 -117809
19149 242276 -504531 -125020 -253690 -31702 -56866 -104281 -122667 -230044 -120675 -323704
19139 -323704 -41774 -63979 -242278 -20251 -216613 76594 -40481 -125661 -156431 -408841 232237
19127 149325 228498 -160466 -190867 -144888 271022 -56802 -54205 -77093 -209334 -45703 -68523
19116 -68523 -285363 -77305 140572 25307 -71398 -54434 -125250 -156690 -157456 177664 239547
19105B39547d5935l7049k54960a10195D7415a1935j09126l2898D05949D3073K9225
19094G2298d63664K25551d6470C21222b34487A62487K23123F7462c15939O7375
19084b48564d7900k614j22232n364f6583o5023k2581O5331H0617b26348j90446
19073d16794J50586I7112a32245I9992J10101c57952e6286G8062O0852N5503c31684
19061D3795d3148k0305B5986j2916c89777J75030b4772E2214J81071c17981e534
19049A54437F0742M0490R3128I2461a12829j4143A83498P033c11066c5546j8324
19038e3870k40327b2067p5964j163E270J4119J0919b17798B16567D6916a345B4444
19025A4061a21373D1049k0036O598P5467a21094A22700I235a22276C19388E188
$$ plain form
19105 239547 -45935 -82984 -337944 -110195 47415 -11935 -121061 -153959 405949 43073 72298
19094 72298 -463664 -238113 -46470 321222 -234487 162487 385610 67462 -315939 -248564
19084 -248564 -47900 -50514 -172746 -178110 -66583 -131606 -154187 -88856 80617 -226348 -416794
19073 -416794 -266208 97112 -132245 99992 210093 -357952 -56286 78062 138914 194417 -331684
19061 43795 -43148 -63453 25986 13070 -389777 -214747 -24772 52214 233285 -317981 -5534
19049 154437 60742 101232 194360 92461 -112829 -126972 183498 190531 -311066 -35546 -53870
19038 -53870 -294197 -22067 -98031 -99194 5270 19389 30308 -217798 216567 46916 -1345 24444
19025 14061 -121373 41049 21013 27611 103078 -121094 122700 9235 -122276 319388 5188
19013F91f7153A24466O2935C8346M4817h0886n8728N3468A22735c06542d1003
19001i1797j98258E2278a02716J3454A47855D5252c77688H1207L239e28712C31290
18989A05525E1285J55276K2559A07535A7644a51112m6383P8821d7872J514C909
18977H2985J07279a53234A49461F4097a49657m074N8423B2396K63976a70858q8828
18966b59686M3912k1757N780A76663C6735O00514h7139j43783J6667E6006R0799
18955A46805b40723a5583j42046f7705j44296P7050l36720F8195J37921C9758
18944A12498J24195G8510L2349J8314d07060A12292g306j57912A42973a5005k67495
18933b82500a04793c746C00910j9787a42616b7901j66926c9326j09696A16428
$$ plain form
19013 691 -67153 124466 187401 38346 83163 -80886 -139614 -86146 122735 -306542 -41003
19001 -91797 -290055 52278 -102716 -89262 147855 45252 -377688 81207 84446 -528712 331290
18989 105525 51285 206561 229120 107535 17644 -151112 -197495 -118674 -47872 -46358 3909
18977 82985 190264 -153234 149461 64097 -149657 -153731 -95308 22396 286372 -170858 -259686
18966 -259686 -215774 -237531 -231751 176663 36735 637249 -87139 -230922 -214255 56006 146805
18955 146805 -240723 -15583 -157629 -67705 -212001 -134951 -471671 68195 206116 39758
18944 112498 236693 78510 110859 129173 -407060 112292 -7306 -165218 142973 -15005 -282500
18933 -282500 -104793 -3746 300910 281123 -142616 -27901 -194827 -39326 -149022 116428
18922a00915j44458B5903a35846M2163J8223J8129E0651P8895g4173l75872g796
18910a06256C1874A5168h2102j42636G1445g78j62063B4599b59445N903A06581
18898A97100b5905A68162a00111A7780c40277d1797C9190q198J69309g4863j96410
18887b71273a04097D8733b68502A06189b49193N227g5342A70906b06136a898A79464
18875A93224a3921n01694K05142r1492B05049r9430b06821h9112H1879h8824A98919
18863e0580L308A51840b2898A35938a30327D7565a71360I6234d08714a2045F4438
18851A16959B3977a79259B84744D628L7199b09752M1842P4230A67552L2013a77626
18839a44818D0855f7157C3541b14476G6444K06460O663c1121p3876B20207i6499
$$ plain form
18922 -100915 -245373 25903 -135846 -93683 -75460 -57331 50651 129546 -74173 -450045 -7796
18910 -106256 31874 15168 -82102 -224738 71445 -778 -162841 24599 -259445 -253542 106581
18898 197100 -25905 168162 -100111 17780 -340277 -41797 39190 30992 200301 -74863 -271273
18887 -271273 -104097 48733 -268502 106189 -249193 -243966 -75342 170906 -206136 -1898 179464
18875 193224 -13921 -515615 -310473 -401965 205049 105619 -206821 -89112 81879 -88824 198919
18863 -50580 -47272 151840 -22898 135938 -130327 47565 -171360 96234 -408714 -12045 64438
18851 116959 23977 -179259 284744 4628 41827 -209752 -167910 -93680 167552 199565 -177626
18839 -144818 40855 -67157 33541 -214476 76444 282904 289567 -31121 -104997 220207 -96499
18827i4472M6052k47575a5844B4201b04146C6913q126a10132d3164B05756K48944
18816D54700I4887a17651B64888A07251L7729L5562m6138J50411a56072I8468
18805c72661B42426d3195l730A67104c3554F3855b0705q5563B29024m013D4142
18793F630c372o3865B3315e8693K5353A1260b44537O0321B7576h2570n708L6633
18781e1645I7040a38279K5062m9966E6613P083k2338j5689c18980g3136D0518
18769c03920i3771F8571B2987a33187j04541o4347B0357P6391a93946B42414N689
18758B48103a23413E7220j3208a37415A66137n6998J08032G8321c02943m1493
18748c44436R3014D5209d3458B13553a18275I0544a9198B09974a55791q7274Q6478
$$ plain form
18827 -94472 -48420 -295995 -15844 24201 -204146 36913 28787 -110132 -43164 205756 454700
18816 454700 94887 -117651 264888 107251 144980 180542 134404 284815 -156072 98468
18805 -372661 242426 -43195 -46925 167104 -33554 63855 -20705 -106268 229024 225011 44142
18793 6630 -3372 -67237 23315 -58693 -33340 11260 -244537 -184216 27576 -82570 -88278 -51645
18781 -51645 97040 -138279 -113217 -163183 56613 63696 41358 25669 -318980 -73136 40518
18769 -303920 -93771 68571 22987 -133187 -237728 -302075 20357 96748 -193946 242414 248103
18758 248103 -123413 57220 44012 -137415 166137 109139 217171 78321 -302943 -344436
18748 -344436 -251422 45209 -43458 213553 -118275 90544 -19198 209974 -155791 -243065 -156587
18737a56587K406B9295c41690e9858p3851J6792A3518a33964l1428J6571j27897
18726b76718E2067C00N3548B266J02021c06507K5593J02792f0640B0749h8017
18714f1867r0443N4126j79447B2253O3550c13698B9470a621F7621J81850a58306
18702a35215n5258q7963J33094M7595C18483a43851o6428B52998b63504B71478
18691C4376g4938l0240M2292j29070c6220d232E9992b74552A44156c36405A47633
18679d3476B88805e1372C37676e0302q5234f6060K0600o6458A0111d34628A15074
18667b20010D2796J84173p9545E3557J15588p8267N5237o5702l6299b61490A98618
18655b64489L0639f4234C9260f6957q2357C3712K01682G539b0517j93771b1653
$$ plain form
18737 -156587 -154181 29295 -341690 -59858 -133709 -116917 13518 -133964 -165392 -148821 -276718
18726 -276718 52067 300 53848 2266 104287 -306507 -280914 -178122 -60640 20749 -88017
18714 -61867 -152310 -98184 -277631 22253 85803 -313698 29470 -1621 67621 249471 -158306
18702 -135215 -190473 -278436 -145342 -97747 318483 -143851 -210279 252998 -263504 271478
18691 34376 -74938 -105178 -62886 -191956 -36220 -4232 59992 -274552 144156 -336405 147633
18679 -43476 288805 -51372 337676 -50302 -135536 -66060 -45460 -111918 10111 -434628 115074
18667 -220010 42796 226969 147424 53557 169145 90878 146115 80413 44114 -261490 198618
18655 -264489 -233850 -64234 39260 -66957 -149314 33712 235394 7539 -20517 -214288 -21653
18643A01839J35142b57795b1273j126A37294b728B10818D4789b83964J09266p4569
18632b49267O7030b4318l5988k3027j34756A03645j9779a64624J7384n6218k34388
18621d37846b159A15414j933a0494j17815B0251c0110k54507D4522O5626h0015
18609A62062c86859A89089b25367h636j48018M3820B88a58k07288e6920J0567
18598d6353A04620a70364h2852l25165d6693l12005p3326B59817F5046a34075
18587A08480b85602c3004n2823L0261j95217c4780B78384g3049B52150g9779A06596
18575A12303N4679a70182K0081A07433h8610k35078a064k2259j16B0149a02877
18563b46850A22991o538b62985i4364C7652J68088a91705f6846A38866f5989A02665
$$ plain form
18643 101839 236981 -257795 -21273 -22399 137294 -2728 210818 44789 -283964 -174698 -249267
18632 -249267 -182237 -24318 -60306 -83333 -218089 103645 83866 -164624 -147240 -203458 -437846
18621 -437846 -2159 115414 113481 -10494 -128309 20251 -30110 -284617 44522 110148 -80015
18609 162062 -386859 189089 -225367 -8636 -156654 -112834 288 -158 -207446 -56920 -46353
18598 -46353 104620 -170364 -82852 -408017 -46693 -358698 -432024 259817 65046 -134075
18587 108480 -285602 -33004 -85827 -55566 -250783 -34780 278384 -73049 252150 -79779 106596
18575 112303 166982 -170182 -150101 107433 -88610 -323688 -1064 -23323 -23439 20149 -102877
18563 -246850 122991 116453 -262985 -94364 37652 205740 -191705 -66846 138866 -65989 102665
18551a89603h1537A51811a27152b2644A19738a42168J6233G6874b60618A26420
18540B6402b91942B77620j15821D1414a63668k1021h118a583j33815f1349a7169
18528c2034r0850j06451A15423E5198a30559j53159j38554f0149B26907h3041
18517B11140C6667M8841B6706e9682B18711l5128i5609k02365M8348G8550k1308
18506E7242J59609g6396p4243k2371B6286a10964B50273b8475j29806A0507c25343
18494C55891a29356a174m8146k94336J50129E8103k166J68221b26791j01487a39371
18482i4026A79088a66795b6057A75856B5573i6148A22552m4740N2732a22644d7722
18470a35046q3270C64449a55817g3057F0226a26449H7705c31734O5281a19028
$$ plain form
18551 -189603 -81537 151811 -127152 -22644 119738 -142168 -125935 76874 -260618 126420
18540 26402 -291942 277620 161799 41414 -163668 -184689 -8118 -1583 -135398 -61349 -17169
18528 -32034 -122884 -229335 115423 55198 -130559 -283718 -422272 -60149 226907 -83041
18517 211140 36667 85508 26706 -59682 218711 183583 -95609 -297974 -249626 78550 57242
18506 57242 216851 -76396 -150639 -173010 26286 -110964 250273 -28475 -158281 10507 -325343
18494 355891 -129356 -1174 -49320 -343656 -193527 58103 55937 224158 -226791 -328278 -139371
18482 -94026 179088 -166795 -26057 175856 25573 -96148 122552 77812 130544 -122644 -47722
18470 -135046 -218316 364449 -155817 -73057 60226 -126449 87705 -331734 -266453 -119028
18459I9138c9395j50422A2605i5481K2777j66133e1092q4128A35729B0985c40196
18447g6837M645q4282b171m438A38296O3277N4276a35287A52693a15163e4484
18435a94322K6897r1002D6526E410J77642f2492a2575l7562B992a33282C218O0052
18423F3270J37064b22671A20756m7474a71702l1528j25965B02015b4128B17358
18412C6669J24660a13180j16434B38336I4474a41462A09424b41119N1229g1898
18401A17862b82643g4653r2096c0002j63023H4356l8765a02322A01464L1599o143
18390A26920E7149a71524k10358G4140c40466b0071o0618j76946C6659J05654
18380A42313d380k33487N3750l418P5712r195N0423J240C20576e772j00402j45034
$$ plain form
18459 99138 -39395 -189817 12605 -95481 -72704 -238837 -51092 -135220 135729 20985 -340196
18447 -76837 -72192 -156474 -2171 -6609 138296 201573 255849 -135287 152693 -115163 -54484
18435 -194322 -167425 -258427 46526 5410 183052 -62492 -12575 -50137 2992 -133282 3218 63270
18423 63270 200334 -222671 120756 73282 -171702 -203230 -329195 202015 -24128 217358
18412 36669 161329 -113180 -229614 238336 94474 -141462 109424 -241119 -189890 -71898
18401 117862 -282643 -74653 -166749 -30002 -193025 84356 45591 -102322 101464 133063 126920
18390 126920 57149 -171524 -381882 74140 -340466 -20071 -80689 -257635 36659 142313
18380 142313 -4380 -237867 -184117 -187535 -111823 -121018 -70595 -69355 320576 -5772 -106174 -251208
18368b51208f8114a1438o780A75757b91574a31547l6046G2335M3860j5038R0891
18357A92048b94912g9625H3537a26545j32269A99686D4634a61782M3387j66071
18347b84466M9051f9849B61087a79552g4388m8357d9869m8030G401f0926b9360
18335c46470f4115D8970A963f6643D1842K0131O0890b82333A49118G0360k1089
18324D9271b03597K4489b201I380J52094b43528G4011h0656m3633A03828J83996
18313B87824r6023e2645j92805k3683Q9743j66764M5795B24514b44432e0664B8704
18301B04368C0599a13893C12296e13087a33889c7806A17858K58724A33657a08949
18290a67507I1045P2435a6030B143e40032B0976i9855N826j20632b3542l33135
$$ plain form
18368 -251208 -68114 -11438 -18218 175757 -291574 -131547 -167593 72335 116195 101157 192048
18357 192048 -294912 -79625 83537 -126545 -258814 199686 44634 -161782 -118395 -284466
18347 -284466 -235415 -69849 261087 -179552 -74388 -122745 -49869 -97899 7401 -60926 -29360
18335 -346470 -64115 48970 1963 -66643 41842 61973 122863 -282333 149118 70360 49271
18324 49271 -203597 -179108 -2201 9380 161474 -243528 74011 -80656 -124289 103828 287824
18313 287824 191801 -52645 -245450 -269133 -179390 -346154 -300359 224514 -244432 -50664 28704
18301 204368 30599 -113893 312296 -513087 -133889 -37806 117858 376582 133657 -108949
18290 -167507 91045 163480 -16030 2143 -540032 20976 -99855 -94029 -214661 -23542 -356677
18279c56677J64855F2442b63372m2405H5461h5654j05454a3173o5842B65021d7690
18267G666J08994L56703c3815B3762M2711b9977l2646q6297D2355p890J21931
18256A56396b41807E8724e9724A0203a76015P7528A50766C9116a99255A57917
18245a36528f6741r2206C20638c47156a40886c0069k6143j38353M9513J3762O0819
18234g0471k59005j69521b4358I6532D924i5988o6516e9191j18075P7105l5620
18223a35781B29951G2069g2127J1723j50908n7001D8151M30265b6949A05173B8397
18211c33686G7536e1021I143A070e2808A11935K6272a30788j00841D5934b8260
18199a20463h572j45391A04619C6552P2365l061b04443C430R59Q1092a26170G1560
$$ plain form
18279 -356677 -191822 62442 -263372 -305777 85461 -85654 -191108 -13173 -79015 265021 -47690
18267 7666 116660 473363 -33815 23762 66473 -29977 -62623 -148920 42355 34465 156396
18256 156396 -241807 58724 -59724 10203 -176015 -98487 150766 39116 -199255 157917
18245 -136528 -66741 -158947 320638 -347156 -140886 -30069 -56212 -194565 -145052 -131290 -70471
18234 -70471 -329476 -498997 -24358 96532 4924 -95988 -162504 -59191 -177266 -100161 -135781
18223 -135781 229951 72069 -72127 -60404 -211312 -268313 48151 478416 -26949 105173 28397
18211 -333686 77536 -51021 9143 1070 -52808 111935 138207 -130788 -231629 45934 -28260
18199 -120463 -8572 -153963 104619 36552 108917 105856 -204443 3430 4389 85481 -126170 71560
18186I9717B3895C44J6780i3130K1203A6710f3433k05251B33096C3455c20185
18174c38132H8816B8032J31279b63443E8341a15496b2557F4328f7967k27633h6733
18162a48984A52410L0191m067a3414j91569j01813A71145G729e1663l14787h4771
18150B9918P0118b58468F3773b18466O7332c2499j28241b1771j6944J00B73348
18138C4131N0752A3807K7055a82643n9743R7450F7424a52084k25008H0333a27754
18126D7177R1226C0212g4470o5972O2301m9L936r105A99085c37220d6514k51048
18114b97562I7771H899e6368K1776B32177b31320i0268g397A27358a83760R1374
18103i2386L4663k3344j90583Q3889D87037F1095i3185k1029N3812B93a75350
$$ plain form
18186 99717 23895 344 17124 -93130 -71927 16710 -63433 -268684 233096 33455 -320185
18174 -338132 88816 28032 159311 -263443 58341 -115496 -22557 64328 -67967 -295600 -86733
18162 -148984 152410 182601 178534 -13414 -204983 -306796 171145 7729 -51663 -366450 -84771
18150 29918 100036 -258468 63773 -218466 -151134 -32499 -160740 -21771 -38715 -38615 273348
18138 34131 84883 13807 40862 -182643 -242386 -144936 67424 -152084 -377092 80333 -127754
18126 47177 138403 30212 -74470 -140442 -78141 -78190 -74254 -83359 199085 -337220 -46514 -297562
18114 -297562 97771 8899 -56368 -34592 232177 -231320 -90268 -7397 127358 -183760 -92386
18103 -92386 -57723 -81067 -271650 -187761 487037 61095 -93185 -114214 -60402 293 -175350
18091b94374b0232k6252A55454c7650A46003a39643B17043J93142b7979q2366
18081a10345k3955E0992a21890A33567C6147e929B86414b03293B9270b4083j77557
18070b01640A64063a26883B62261M4502b09627k37722J84811J06302B13578c46880
18059c43478J57061N6541K1080E3565N462M1995b1688m3244A28163n0448a11326
18047A16489a81778A1604L00938A19417a15980e6117A85774n3222d6610A19031
18036a43313l149E0386b2612j8125A63873a24945G9709a12580G2313J69605f5299
18024B10870B386a67875A05406m0309b11913g5255A63189d523B5197M269a42207
18012A33138n2523B307J64549a9286j49447h3738o2487B08349c8159j9094A20850
$$ plain form
18091 -294374 -20232 -46484 155454 -37650 146003 -139643 217043 410185 -27979 -110345
18081 -110345 -134300 50992 -121890 133567 36147 -5929 286414 -203293 29270 -24083 -201640
18070 -201640 164063 -126883 262261 306763 -209627 -447349 -262538 -156236 213578 -346880
18059 -343478 -186417 -129876 -108796 53565 59027 101022 -21688 -64932 128163 77715 -111326
18047 116489 -181778 11604 312542 119417 -115980 -56117 185774 132552 -46610 119031
18036 -143313 -146462 50386 -22612 -40737 163873 -124945 79709 -112580 72313 241918 -65299
18024 210870 2386 -167875 105406 65097 -211913 -75255 163189 -4523 25197 29466 -142207
18012 133138 80615 2307 166856 -19286 -168733 -83738 -146225 208349 -38159 -57253 120850
18000e92997f5795B26865e4022B69974I355b13938A74037a04758L0432A04786
17989c20080L2350h1930C8728J04079m0725a34135d3706k0088q9338F0143M136
17978F4279P9398J46431H6566b34070N4497B80784G2175k1001a10092j55474A72742
17966G322L6673R3160j0245e664j83083C58054h1162A01470J12625p1446G1004
17954e170A69705F2254K0803J9019a16425j13407M8432Q3676d3221k60021B23917
17942A19351E097Q0713R438g4058D4531J33185K2521a13924F6272k7223K3714
17931F2763B7042b08007G5428q66J44835q1055J12396a33233K5522K5262C6762
17919H0908b55169H4298a93841l7883J14470B4402a59241M3631D7892L450J74418
$$ plain form
18000 -592997 -65795 226865 -54022 269974 9355 -213938 174037 -104758 -74326 104786
17989 -320080 -287730 -81930 38728 142807 102082 -134135 -43706 -63794 -153132 60143 64279
17978 64279 143677 290108 86566 -234070 -179573 280784 72175 51174 -110092 -265566 172742
17966 7322 43995 137155 126910 -5664 -188747 358054 -81162 101470 214095 142649 71004
17954 -5170 169705 62254 83057 102076 -116425 -229832 -181400 -97724 -43221 -303242 223917
17942 119351 5097 85810 95248 -74058 44531 177716 200237 -113924 66272 39049 62763
17931 62763 27042 -208007 75428 74562 219397 138342 250738 -133233 -107711 -82449 36762
17919 80908 -255169 84298 -193841 -231724 -117254 24402 -159241 -115610 47892 51342 225760
17908B25760j06624C6019a01228B16504b831l8090i758l3865l91467I2239A3995
17896e9345o7678r6730f0351A17853c25109a48584l3936J77O6678D8590h9885
17884G5161b0101j11836I0885k41K2486f8422j5129A10608g0601j80663A33196
17872H3911c5284j08451B08729a94568h9104I547J0266c0305M908j70462P8037
17861a17822d7754A49494a34041B35909B9800L0274a30506k68538G1328J6193
17851H7521i1126A70915Q0747c8609F6621b36033R7002L6931B7968a39403D97273
17839C52064A23810b0169D1692K1919B0335P4314I920e5516a7427H8767a10435
17827C00326h2945q404n3854C83609b10301H9531R6803b27359A10835a53207j81462
$$ plain form
17908 225760 119136 36019 -101228 216504 -2831 -40921 -9758 -43623 -435090 92239 13995
17896 -59345 -127023 -223753 -60351 117853 -325109 -148584 -182520 -182343 -115665 48590 -89885
17884 75161 -20101 -131937 90885 90644 113130 -68422 -83551 110608 -70601 -251264 133196
17872 83911 -35284 -143735 208729 -194568 -89104 9547 19813 -30305 -25397 -195859 -117822
17861 -117822 -47754 149494 -134041 235909 29800 60074 -130506 -399044 71328 87521
17851 87521 -91126 170915 251662 -38609 66621 -236033 -139031 -102100 27968 -139403 497273
17839 352064 123810 -20169 41692 63611 20335 94649 9920 -55516 -17427 88767 -110435
17827 300326 -82945 -91349 -145203 383609 -210301 89531 186334 -227359 110835 -153207 -334669
17816c34669d2402l9329r2813I4104K61908f1144n3221A64109o965K36764a4777
17804b91434Q9351g2763C0195L24108A614O9206a80267f3353j02421B28981E1774
17792H0825a45264B61509b13571C36179c8815A0269J66096h6721j9415B60865
17781D5879K42823j30505a39494B4868c73313a08141l8237A53781e5572p9183
17771a34755k4426E9446m310R2330k8176c14922A37233a96441r1377B59654p2923
17760A86731C2417a16823A14414f8927C5060J29737a88555l2974A24292b72731
17749A99127F8055J42183L0778j07975o4595b87147g4216H5273E35J78080q0294
17738I8321D6324A3628b324I805O8118a84563g0885k19649A3133J67601a19268
$$ plain form
17816 -334669 -42402 -81731 -174544 94104 356012 -61144 -114365 164109 157144 393908 -14777
17804 -291434 -202083 -72763 30195 354303 1614 70820 -180267 -63353 -165774 228981 51774
17792 80825 -145264 261509 -213571 336179 -38815 10269 176365 -86721 -106136 260865
17781 45879 288702 158197 -139494 24868 -373313 -108141 -146378 153781 -55572 -134755
17771 -134755 -159181 59446 55136 147466 119290 -314922 137233 -196441 -287818 259654 186731
17760 186731 32417 -116823 114414 -68927 35060 164797 -188555 -221529 124292 -272731
17749 199127 68055 210238 241016 133041 68446 -287147 -74216 85273 535 178615 98321
17738 98321 46324 13628 -2324 9805 77923 -184563 -70885 -290534 13133 180734 -119268
17726b20867a01560P030D3897e1485d856j5299o3532B34846a36086B20550a77865
17714f9453p3129j09154J23136F5695L83939b00943o8579i2704a9161q4035j70722
17703b73918I8256a29403L7588C11596A35971k6225b8053j9167A8782J40124K39803
17692C98709c4301A893o55K24885H3115a51006f3270J8865D9509J03218b4658
17680A21950r070f816D7851e6152j52070e9116j2438I72J13314a438l5201j9510
17668e6149G6615J0394C6713K31491a0986j56651C23572c30901a5343B63070q6612
17657A76458C0334d6914k4911A19418d5621E0487N9575j8248l7437p742J54800
17646B01435N986P6426E9024L0571c2224p0076d9468B53739d2832A90827E0663
$$ plain form
17726 -220867 -101560 -94530 43897 -51485 -4856 -20155 -83687 234846 -136086 220550 -177865
17714 -69453 -142582 -251736 -128600 65695 449634 -200943 -269522 -92704 -19161 -103196 -273918
17703 -273918 98256 -129403 -91815 311596 135971 109746 -28053 -47220 18782 158906 398709
17692 398709 -34301 1893 1238 226123 83115 -151006 -63270 -44405 49509 152727 -24658
17680 121950 112880 -6816 47851 -56152 -208222 -59116 -71554 972 114286 -1438 -36639 -56149
17668 -56149 76615 87009 36713 268204 -10986 -167637 323572 -330901 -15343 263070 176458
17657 176458 30334 -46914 -71825 119418 -45621 50487 110062 91814 54377 46635 201435
17646 201435 207421 283847 59024 89595 -32224 -102300 -49468 253739 -42832 190827 50663
17634C78753b27764O0948I9413a76417B96779p6583r6246o281k1351g3326H8043
17622B9972a19831L0147B76490j23488j2813a99850e9297D724L03860A4701o331
17611H370c5929C47517a519C4336b18572A91681o5750h4382A03020c9793A58962
17599a40046A25390J06390J1313J7964a55887q479Q0793B41609a82985A60833
17588g5139C06715A11150Q1340K2983K5420c7703A44238C0704c1324E6209b81157
17576a93277A18883a33417A26359L06109j90593f1690C39699K1784I7706b975
17565B23116H2424o465O8586e2684j02229B79029a50541J0007C35371a11477c6001
17553C2132K47630b775A36746a05737B4910c25542A06971c9080H2441J3957B6890
$$ plain form
17634 378753 -227764 -166816 99413 -176417 296779 220196 123950 117669 96318 -73326 88043
17622 29972 -119831 -89684 276490 153002 140189 -199850 -59297 4724 308584 14701 8370
17611 8370 -35929 347517 -1519 34336 -218572 191681 125931 -84382 103020 -39793 158962
17599 -140046 125390 231780 243093 261057 -155887 -164366 -83573 241609 -182985 160833
17588 -75139 306715 111150 192490 215473 240893 -37703 144238 30704 -31324 56209 -281157
17576 -193277 118883 -133417 126359 432468 241875 -61690 339699 361483 97706 -2975
17565 223116 82424 75959 144545 -52684 -154913 279029 -150541 -140534 335371 -111477 -36001
17553 32132 279762 -2775 136746 -105737 24910 -325542 106971 -39080 82441 96398 26890
17541A85953m7172i6410A82076C9010L17519A49839b44442G3151J49525K117q4726
17530A40067a89214a8834r5610C1840K82589n7374a76038C38334c8469G7468j9032
17519E8436M7904J96659D3102b9834n7633b7734o7134A86868B4356Q1219M32596
17508E38171c02887J32948C2912c6393H5127J88120j17844K6671i2341D5491c4466
17496e5859A13323a06322H4011J81109K17105d8021B30794m2813E8969b07500
17485B7873J70208l2042D2993g8485l14184A98417Q1096E0721a25378B06456C7683
17473I8753L0898F2734K53479b22986B22728B39J58426J7978K72038A98861R3684
17462B92545F1901J47504k5092D645K21900A4458K1385a03971G8889Q1011K17526
$$ plain form
17541 185953 138781 -96410 182076 39010 356529 149839 -244442 73151 222676 224793 140067
17530 140067 -189214 -18834 -114444 31840 314429 257055 -176038 338334 -38469 77468 58436
17519 58436 106340 302999 43102 -29834 -87467 -27734 -94868 186868 24356 105575 538171
17508 538171 -302887 -169939 32912 -36393 85127 273247 155403 182074 -92341 45491 -34466
17496 -55859 113323 -106322 84011 265120 482225 -48021 230794 187981 58969 -207500
17485 27873 198081 166039 42993 -78485 -392669 198417 279513 50721 -125378 206456 37683
17473 98753 129651 62734 316213 -222986 222728 239 158665 176643 448681 198861 292545
17462 292545 61901 209405 184313 4645 226545 14458 35843 -103971 78889 159900 377426
17451C77426g4475A66020o4131K80283j18886D0901K80730A12065J98576J14511
17441D25152h0325G9614J52844H3932K11037r5993J16818a22180A51050P352J62482
17430C20884J91940p4466B316L82329J00201A48469K71006J49351B72663A17103
17419A17031J09316j3766e0596B94498I8988J46295m0327m7924Q9367F4449K9293
17408I3742A587K36021J72297j60267R80l0952D5979J7691N7209a45597a6636
17396A93279r3759J04221D0649a40213A61180P063A7443Q4492l6074i759B22315
17384A71398J27393r4557J66504A66910a82842I8790l2737e9215A90007p7817
17374A12190M2276D9038L39594O2216D5628N7021d3754d939A02120J40013A10621
$$ plain form
17451 377426 -74475 166020 101889 382172 263286 40901 321631 112065 310641 425152
17441 425152 -80325 79614 232458 83932 294969 198976 315794 -122180 151050 158402 320884
17430 320884 512824 438358 2316 384645 484846 148469 419475 568826 272663 117103
17419 117031 226347 212581 -50596 294498 98988 245283 204956 157032 246399 64449 93742
17408 93742 1587 237608 409905 249638 250618 219666 45979 63670 120879 -145597 -16636
17396 193279 99520 203741 40649 -140213 161180 168243 17443 101935 65861 -9759 222315
17384 171398 298791 204234 370738 166910 -182842 98790 66053 -59215 190007 112190
17374 112190 154466 49038 388632 450848 45628 102649 -43754 -4939 102120 242133 110621
17362A13189J19618r2138j0944k4034J71230G8587J07491O5333M1500j13865N5728
17351B34774a23692A96147J48085j25852J44642B6644J13751L24791j47097a49131
17340g4399D4569J21691Q185L19277B05718C9324M8404P9219i6165A79405q1120
17329I8285L54695A50477D2280O0377N0382J6075Q0760I5779K0334a3040C19873
17317B11426K7325A08769K72326a00406A42848Q9465h9463b3295B22673b30960
17306A14161l3275L7906M7070j0934a62110A34026O2977M1445N7586A3959R3816
17295A07775Q7278J73427G8931J45590o6114J2944C4674O4100N218K31741O1256
17284C96989A44791C3500M50685B33469O8434M6888a30910B75154J0483O7705
$$ plain form
17362 113189 232807 140669 129725 105691 276921 78587 186078 251411 292911 179046 234774
17351 234774 -123692 196147 344232 218380 363022 26644 140395 465186 318089 -149131
17340 -74399 44569 166260 174445 493722 205718 39324 87728 166947 -96165 179405 98285
17329 98285 452980 150477 42280 102657 153039 169114 249874 95779 116113 -13040 319873
17317 211426 238751 108769 381095 -100406 142848 232313 -89463 -23295 222673 -230960
17306 114161 80886 118792 165862 154928 -162110 134026 197003 238448 296034 13959 107775
17295 107775 195053 368480 78931 224521 158407 171351 34674 98774 103992 335733 396989
17284 396989 144791 33500 484185 233469 301903 348791 -130910 275154 285637 353342
17274C53342D7012R8483a30082A97510K42536a33965L8188A32860K39755I0716
17263A07071d3814A6649K31130M6836m1375n3594M8919N8574b1627B81358p6130
17252B05228J78347j01654J76786A39843K98673A38079o8651L71436j20743q6175
17242B33946j04364l1227K51K84935m6125O2811j36579J60328j34902M2786j8944
17231C12916m3605k9781d246A62122K63018e9172E3416K43482A03552N36440d5233
17219A83475N7220J658e3990C98243j58482m7391O5799K89115r9037B7578L02500
17208C30078e1512D36038o3392j4984n1718o8787j03550K93933j93766l7848J01153
17197B97079H1561L31415I2405f7001D69392j53567H0372J58621M09159A14463
$$ plain form
17274 353342 47012 145495 -130082 197510 440046 -133965 -95777 132860 372615 90716
17263 107071 -43814 16649 247779 294615 253240 199646 248565 307139 -21627 281358 205228
17252 205228 383575 281921 458707 139843 438516 138079 69428 440864 320121 233946
17242 233946 129582 98355 98606 383541 337416 400227 263648 423976 289074 331860 312916
17231 312916 269311 239530 -4246 162122 425140 -59172 53416 296898 103552 639992 -45233
17219 183475 240695 242353 -53990 398243 239761 192370 258169 547284 448247 27578 330078
17208 330078 -51512 436038 372646 357662 305944 237157 133607 427540 233774 195926 297079
17197 297079 81561 412976 92405 -67001 469392 315825 80372 238993 648152 114463
17186B68747J26020D0959L21003j02621J8832j9515K41757a72748C17779A47241
17175A02262M6011J22316L50246r9623i8534D33586F9861L60969A25632K78576
17165D04208k01380L39605n9261p4135j99485K06679J37875k225k01845K32639
17155E82675j69632j73260F3162M28827k02520o7061J02636o2286J10240P1392
17145D44390j11338j04836E5495N24191j96734q9975R0577m3537J64612J1637
17135E16266q1428j92214K69813A44084K72415J46448R8900A77389J65741l8692
17125C04438J01486R7268L1884j22534P6648k23185J73253n3295R8715l5675K04685
17114F53688o9485k56531b7748C36079C256L39173j9194J41444O3080k49014R0722
$$ plain form
17186 268747 394767 40959 361962 259341 278173 258658 500415 -172748 317779 147241
17175 102262 148273 270589 620835 521212 -98534 433586 69861 430830 125632 404208
17165 404208 202828 542433 483172 409037 209552 416231 554106 551881 350036 582675
17155 582675 413043 239783 63162 491989 289469 222408 325044 262758 372998 444390
17145 444390 333052 228216 55495 579686 382952 292977 383554 340017 504629 516266
17135 516266 434838 242624 512437 144084 416499 562947 661847 177389 343130 304438
17125 304438 405924 503192 535076 412542 489190 266005 439258 385963 484678 449003 653688
17114 653688 584203 327672 -27748 336079 3256 342429 323235 464679 527759 278745 369467
17103C69467J31959p4292J62726B91898l259K66988M2117L2331k90284L9065N15875
17092H94731k30453A87692J81645L23052k10778K29054j15993j31105N5900J25439
17082F44906j68608k6847K18691j50671j51895K24968j01152K48685j32698J51815
17072G57194p5412n1084l15279M09142k72298p5135j02479J19608P882J58296
17062E60435k63783M71165l42166J94735m2454j88036j2176L39853j25691j1712
17052E80170J07484j88579K37294K02673k19445j71160M0474B00585O17381k70676
17042E47290J63118k47230L61150j81710j55513K74415O7017k13295n4683l4307
17032E26252J64145j11988K75031j01593C71611K92598j0854k5471o8170K80780
$$ plain form
17103 369467 501426 427134 589860 291898 288639 555627 597744 630075 339791 378856 894731
17092 894731 664278 187692 369337 692389 481611 710665 594672 463567 519467 644906
17082 644906 476298 449451 668142 517471 365576 590544 489392 738077 605379 757194
17072 757194 681782 630698 315419 724561 452263 377128 274649 394257 402139 560435
17062 560435 296652 767817 425651 620386 577932 389896 377720 717573 591882 580170
17052 580170 687654 499075 736369 939042 719597 548437 588911 200585 817966 547290
17042 547290 710408 463178 824328 642618 487105 761520 828537 615242 560559 526252
17032 526252 690397 578409 853440 751847 371611 664209 653355 627884 559714 840494
17022H40494k17925K08550k73860L15772P582O1999k22810O0078q9700J91766
17012H81946k24568J47266k24817J19516J44559j17202J22432j71488L12532C86834
17001F28846L78869o0767N7625Q8020j46925o5614R9207k13782R3454O7934p4882
16990H51985n707l98502P00301n01079M55950m14440L78929N6625o3984J5618
16980A075696J39012p2339k49387L3635r4793J33688K08406K3675n0199K4715
16970A172109j15865K6938j90138j19003R0959N2675K51935l92281N87558j13683
16960A251204j94510n4501k7466k74441L67075R4602j12750K10901Q5490j66818
16950A178786m9615K2904J90306k96966K27803J91407k61286K14368j4396m6341
$$ plain form
17022 840494 622569 831119 557259 873031 880613 942612 719802 779880 690180 881946
17012 881946 657378 804644 579827 699343 843902 726700 849132 677644 990176 386834
17001 628846 1007715 946948 1004573 1092593 945668 880054 979261 765479 858933 926867 851985
16990 851985 846278 447776 1148077 646998 1102948 688508 1067437 1124062 1060078 1075696
16980 1075696 1214708 1142369 892982 926617 831824 965512 1173918 1197593 1147394 1172109
16970 1172109 1056244 1083182 893044 774041 865000 917675 1169610 777329 1364887 1251204
16960 1251204 1056694 1002193 974727 700286 1067361 1161963 1049213 1260114 1345604 1178786
16950 1178786 1129171 1152075 1342381 1045415 1273218 1464625 1203339 1417707 1403311 1356970
16940A356970k59147K72665k57997K59195M46176j32788k43443k80285M90260
16931A651606j12858p6677n0303L41401R0080j89031J7116j55262L72367O4744
16921A953183k36461J65671K2475m38211M60492k95268J61598j73419j26684M41411
16911A934787Q4098J43370j45130j44723J07656k8012j2124M0817K72163l04330
16901A948572K74447p2871q9124M9267L6677L06051j96236j32517L69060k22694
16891B270632N7918k20342M07603r649m0228J88226k65752Q6206N99461m27099
16881B646976p1407J98852K63300m34372r2998J24411K37794j41741p6898M28235
16871C082152l36910J5403R9443M0717J23839N24934k61751j55651L5622j842
$$ plain form
16940 1356970 1097823 1370488 1112491 1371686 1817862 1685074 1441631 1161346 1651606
16931 1651606 1538748 1462071 1411768 1753169 1843249 1654218 1671334 1516072 1888439 1953183
16921 1953183 1716722 1882393 1904868 1466657 1927149 1631881 1793479 1620060 1493376 1934787
16911 1934787 2018885 2162255 2017125 1872402 1980058 1952046 1939922 1980739 2252902 1948572
16901 1948572 2223019 2150148 2061024 2110291 2146968 2453019 2256783 2124266 2493326 2270632
16891 2270632 2328550 2108208 2515811 2506162 2465934 2654160 2388408 2474614 3074075 2646976
16881 2646976 2575569 2774421 3037721 2603349 2510351 2634762 2872556 2730815 2653917 3082152
16871 3082152 2745242 2760645 2860088 2900805 3024644 3549578 3287827 3132176 3167798 3165956
16861C165956N2341L62102l9941l14877M14370J07707k22310J25240K87942k51915
16851C686615K96042j5939K71407n6940l7925k13214J54898J96498L88017j22205
16841D547254j23881L31749J36464J45725p1172J15037m4208M20032k46407k57722
16831D952871M61185J28816P1730M2878N25518q0847L8901j12944M77576k23027
16821F282657M32760K0444K09022P2129J55790K11899j03008N59964k0087Q4632
16811G906202J29614K27790J63150P4959J86178J96429M97911K19054r5032L21990
16801I828245O5413L94339L41051K8022K96510J23765J15302Q38562M01364q6256
16791A2346317M25394K46514K90064R17270Q7001L95592M45978M18367N81073
$$ plain form
16861 3165956 3218297 3580399 3540458 3225581 3639951 3747658 3525348 3650588 3938530 3686615
16851 3686615 3982657 3966718 4238125 4181185 4143260 3930046 4084944 4281442 4669459 4547254
16841 4547254 4423373 4755122 4891586 5037311 4966139 5081176 5036968 5457000 5210593 4952871
16831 4952871 5414056 5542872 5614602 5657480 6182998 6102151 6141052 6028108 6505684 6282657
16821 6282657 6715417 6735861 6944883 7017012 7172802 7384701 7281693 7841657 7821570 7906202
16811 7906202 8035816 8263606 8426756 8501715 8687893 8884322 9382233 9601287 9506255 9828245
16801 9828245 9893658 10287997 10629048 10657070 10953580 11077345 11192647 12031209 12432573 12346317
16791 12346317 12771711 13018225 13308289 14225559 14312560 14708152 15154130 15572497 16153570
16782A6153570N62593M21420P00062J96289O58839N54652R95670N56547K40927
16773B1040569Q79808J060423O80573P33201J063918J209728Q71645R94925P19652
16764B9254442J623891R34675Q65477J488929J853183J499237J293881J434304
16756D0248019J692262K092263K102134K117400K003094K407977K391134K550606
16748E7604889L313593K546314L440326L021135L329341L504853L940635M050048
16740H4751134M175061M140393M834041M496803M860789M860600M745585N002849
16732A21867255M734855M867382M682831M200597L902828L665373K666480L116378
16724A53703979J698580R72102O68858j5430j107475k032135k207743l253876
$$ plain form
16782 16153570 16716163 17137583 17837645 18033934 18692773 19247425 20243095 20799642 21040569
16773 21040569 21920377 22980800 23661373 24394574 25458492 26668220 27539865 28534790 29254442
16764 29254442 30878333 31813008 32678485 34167414 36020597 37519834 38813715 40248019
16756 40248019 41940281 44032544 46134678 48252078 50255172 52663149 55054283 57604889
16748 57604889 60918482 63464796 66905122 69926257 73255598 76760451 80701086 84751134
16740 84751134 88926195 93066588 97900629 102397432 107258221 112118821 116864406 121867255
16732 121867255 126602110 131469492 136152323 140352920 144255748 147921121 150587601 153703979
16724 153703979 155402559 156374661 157043519 157028089 155920614 153888479 151680736 148426860
16716A48426860l516023m022588m033664m631044n038628n141718n115192m964063
16708A11963940n377617m935576m710894m514796m713959l934943m551748l619816
16700G5604591m082301l287763l417709l060450k834641l200908k193959k399531
16692E1127329k547541j863654k370459k292151j512494j808951j774730j590759
16684C5366590j229544j521544j164671j318994j091795j095466r66956j046554
16676B5931066j074895p85898r17167q79975q53287r15212n27883q20922m20038
16667A8735789n62210o94093m69558l68705o94049l76038n76517l41105p66465
16658A3887049m9852k17421o74029l57948k18259k92249n45366l76149k37417
$$ plain form
16716 148426860 144910837 140888249 136854585 132223541 127184913 122043195 116928003 111963940
16708 111963940 106586323 101650747 96939853 92425057 87711098 83776155 79224407 75604591
16700 75604591 71522290 68234527 64816818 61756368 58921727 55720819 53526860 51127329
16692 51127329 48579788 46716134 44345675 42053524 40541030 38732079 36957349 35366590
16684 35366590 34137046 32615502 31450831 30131837 29040042 27944576 26977620 25931066
16676 25931066 24856171 24070273 23153106 22273131 21419844 20504632 19976749 19155827 18735789
16667 18735789 18173579 17479486 17009928 16641223 15947174 15571136 14994619 14653514 13887049
16658 13887049 13837197 13619776 12945747 12587799 12369540 12077291 11531925 11155776 10918359
16649A0918359m51685M7806m62186l51011o5004j66265o02426K40337l07355l32561
16639H468009m1219q1355m97773j38593o9794j33808l09555m1904j82407l38415
16629F633186l37855K37465k74502j91007L5121k58588o555J14740m0338k39235
16619E672432k45615j40153j82516n2060k37519l06432M43297l09430k78868K92209
16609D655345k64706R8515j28328j31658k63175J28558m08056K70993j98006q0362
16599C679120j50463Q0931j119l52423L58830k77633N2282o8753j78912R8204
16589C240064J85378k92333N2526q0893j09127L34158k94715l15847k22302L08174
16579B805083J64924l82129K46680l34819Q0504l6426l9330j38129O7985j40447
$$ plain form
16649 10918359 10466674 10514480 10052294 9701283 9636279 9470014 8867588 9107925 8800570 8468009
16639 8468009 8426790 8345435 7847662 7709069 7639275 7505467 7195912 7154008 6971601 6633186
16629 6633186 6295331 6532796 6258294 6067287 6102408 5843820 5837265 5952005 5911667 5672432
16619 5672432 5426817 5286664 5104148 5052088 4814569 4508137 4951434 4642004 4363136 4655345
16609 4655345 4390639 4489154 4360826 4229168 3965993 4094551 3686495 3957488 3759482 3679120
16599 3679120 3528657 3609588 3608469 3256046 3614876 3337243 3389525 3320772 3141860 3240064
16589 3240064 3425442 3133109 3185635 3104742 2995615 3329773 3035058 2719211 2496909 2805083
16579 2805083 2970007 2587878 2834558 2499739 2580243 2543817 2504487 2366358 2434343 2293896
16569B293896p302K0135r0120J64819J5953k31541j11454J70439k04615m9488
16559A970722J78846k45509J58496j24747K8815J72599j12143l0424m67652l7182
16549A491821M06833j73870j54124K49048j47478J62107j71627J06998j35498
16540A634210K90582n20509K94475L06942m93019J66958l47752N44408m60611
16531A415684j83193K39511j80137R3306J31835o7907m6737k42128P52773r41436
16521I71571K37010R0474n3676R0947k28419O9391N78139o28255N2728j16875
16511A063035J38958J15838k68449J69056j54703J34620j29818l6471N3510L50019
16501A435595O4228m60402j10867K24647o7264K58817l76555J17120k53880K84547
$$ plain form
16569 2293896 2286594 2306729 2216609 2381428 2397381 2165840 2054386 2224825 2020210 1970722
16559 1970722 2149568 1904059 2062555 1937808 1966623 2139222 2027079 1996655 1529003 1491821
16549 1491821 1898654 1724784 1570660 1819708 1672230 1834337 1662710 1769708 1634210
16540 1634210 1924792 1404283 1698758 2005700 1512681 1679639 1331887 1876295 1415684
16531 1415684 1232491 1472002 1291865 1385171 1517006 1449099 1402362 1160234 1913007 971571
16521 971571 1208581 1299055 1245379 1336326 1107907 1177298 1755437 1127182 1179910 1063035
16511 1063035 1201993 1317831 1049382 1218438 1063735 1198355 1068537 1032066 1085576 1435595
16501 1435595 1499823 1039421 928554 1153201 1085937 1344754 968199 1085319 831439 1115986
16491A115986J6731k53274j69934j00558K00613J04234K47888j37782k18767j83284
16481F21853N41857m10649N35476o17122K41788M0659k0924J30260k46048J15001
16471I32151j55287O3328O926k75367p3642L75232m04461K48389j20231R9117
16461F96155Q6857k84273K65836q4686K31890j28375O9341l08753K41962C59276
16450C15417K70763j15192L84997C63966M55360l78778o4945J75017J46647m6760
16440F50507q7168R2403j79797J81123C05887K24169J61331m343j28248J447J52148
16429G12391M9483N8189k34890O9807o7347m8272k35531K98356J28365l7175k02473
16418D90903J51332j41042K04841C07843L3299J6791J43379J26014J69480C30291
$$ plain form
16491 1115986 1132717 879443 709509 608951 809564 913798 1161686 1023904 805137 621853
16481 621853 1163710 753061 1288537 671415 913203 953862 932938 1063198 817150 932151
16471 932151 776864 840192 847118 571751 498109 873341 468880 717269 597038 696155
16461 696155 783012 498739 764575 679889 911779 783404 852745 543992 785954 359276
16450 315417 586180 470988 855985 363966 819326 440548 375603 550620 697267 650507
16440 650507 563339 655742 475945 657068 305887 530056 691387 687044 558796 560243 712391
16429 712391 761874 820063 585173 654980 587633 539361 303830 602186 730551 693376 490903
16418 490903 642235 501193 706034 307843 341142 357933 501312 627326 796806 330291
16407D17426J16793J97917j83183B41674K90168K24794m5723k27311j31583m7145
16397C04874J42003p9879K58258A78792M36786J41991k44217J42545k60078N7742
16387D53561H1141L88600k33986G6166K07405Q6642K0876j31171P4512M24161
16377G58591B56859M16324A96377J62935A65294J44883J26683N768M3836G6039
16366B92973L92713B16043P1386K11128o3424N5998N1767B55940j11158N30663
16356F75445C23834m3938D5538M08581L1421j4191m1235E0142L91522o0637J69280
16345E50307J45776C34815j31369R8331b4250B75906a37554C56485A31357K84103
16335D15460J2919r2475J29728A48291L10540j60389F8083A3309K11858L2071
$$ plain form
16407 417426 534219 732136 548953 241674 531842 756636 710913 483602 352019 304874
16397 304874 446877 366998 625256 178792 615578 757569 513352 655897 395819 453561
16387 453561 81141 469741 235755 76166 283571 370213 391089 259918 334430 758591
16377 758591 256859 673183 196377 359312 165294 310177 436860 442628 486464 76039
16366 292973 685686 216043 287429 498557 435133 491131 542898 255940 144782 675445
16356 675445 323834 279896 45538 454119 485540 471349 430114 50142 441664 381027 550307
16345 550307 696083 334815 203446 301777 -24250 275906 -137554 356485 131357 415460
16335 415460 428379 335904 465632 148291 458831 298442 68083 13309 225167 257238
16325B57238q6769R5068K72390H824K12379K09251B00351M0998K51327k0058k22189
16314B50429O6875F2849L19495p4517J27067f9422B34089D3431K53864G5892O9439
16303A45331R654J29727q5134N3756a16445B88793n6706a66256D03609c9218A52524
16291B06336E4096L18878h67C23584K5866j0014r0784D7132M55066A73835F9284
16279A61433k2577H582P731J15200K60176d663B36990j09179a121j56463C5746
16267b41955D64010G7497L11259j03473K29985b9450F7557g9780A4882P4106J90847
16256B79835e2690A01149j7335B0562Q0934i3179q0270B70656K5756j34478N0822
16245B12756O0708q1038G5106A3410a20197j57629A67144b31240A6235K9633A2835
$$ plain form
16325 257238 170469 265537 537927 8824 221203 430454 200351 241349 492676 472618 250429
16314 250429 317304 62849 382344 307827 434894 -69422 234089 43431 297295 75892 145331
16303 145331 154985 284712 199578 253334 -116445 288793 232087 -166256 403609 -39218 152524
16291 206336 54096 372974 -867 323584 349450 339436 248652 47132 502198 173835 69284
16279 161433 138856 8582 16313 131513 391689 -4663 236990 127811 -1121 -157584 35746
16267 -241955 464010 77497 388756 285283 515268 -29450 67557 -79780 14882 88988 279835
16256 279835 -52690 101149 83814 20562 101496 -93179 -173449 270656 296412 161934 212756
16245 212756 273464 192426 75106 13410 -120197 -277826 167144 -231240 16235 45868 12835
16233B39992A9147K47100j11464j4182a31457e5881B67332O770j27541J55051
16223C01612c9119B9523d8429B90339h7294B95223N3631A35699K95718j92053
16213B39364e1833l13859I8115J80944j31123K21020j11486n9781f0431A8830
16202D34489a85956I4389L48792j57712r1378a7099C06075Q4841D2538M98740
16192E41278I5961J01363m962G4846K2664J56238m237M6134A33661j6673M0604
16181A57592D2222c4325D85205d2770A30338M8592D8668L9299R0515J10254j03906
16170A84830I990L43097c6064B21333g3841f473A84963G7589M8778J74215f0108
16158b4549F4861a48146A57421K04388A6502J38686A2398a15119A20089b25691
$$ plain form
16233 239992 19147 266247 154783 140601 -131457 -55881 267332 274102 146561 301612
16223 301612 -39119 29523 -48429 290339 -87294 295223 348854 135699 431417 239364
16213 239364 -51833 -365692 98115 279059 147936 368956 257470 197689 -60431 18830
16202 434489 -185956 94389 443181 285469 194091 -17099 306075 390916 42538 541278
16192 541278 95961 197324 192362 74846 97510 253748 249511 295645 133661 116988 157592
16181 157592 42222 -34325 485205 -42770 130338 178930 48668 87967 178482 288736 184830
16170 184830 9990 353087 -36064 221333 -73841 -6473 184963 77589 126367 300582 -60108
16158 -24549 64861 -148146 157421 361809 16502 155188 12398 -115119 120089 -225691
16147d3550j15060A40171a0801j902A37547R238J68014F4696h1805L3944F1061
16135a14374m3765A7496a1317A21915B8249K44169a10502e0771k284c549k0185
16124b3734e201j61393G9285M8908C0052b60515A01705K579D9515e9442q8755
16113a48197j51279A90667N8986M2446A08053a32376n7216P335G0622Q4095K21
16102A54938G4789K87970c3260A67931a12402A73625j4358P4168b55011A52003
16091B35141b2582A47332a52477p4078K492A012c9280j5841j20588G7709G415
16079G8597L37688d7025A88953N3291a30178A02751D8393A551e27412a12218B39550
16067a54078d6692j64078D473N3848a64433A51417e38474b28115H8097J8298H663
$$ plain form
16147 -43550 -158610 140171 -10801 -12703 137547 146785 314799 64696 -81805 -47861 61061
16135 -114374 -158139 17496 -11317 121915 28249 272418 -110502 -50771 -53055 -3549 -23734
16124 -23734 -5201 -166594 79285 128193 30052 -260515 101705 104284 49515 -59442 -148197
16113 -148197 -299476 190667 249653 292099 108053 -132376 -189592 -182257 70622 154717 154938
16102 154938 74789 362759 -33260 167931 -112402 173625 159267 233435 -255011 152003
16091 235141 -22582 147332 -152477 -226555 -224063 1012 -39280 -55121 -175709 77709 7415
16079 78597 416285 -47025 188953 242244 -130178 102751 48393 1551 -527412 -112218 239550
16067 -154078 -46692 -210770 4473 58321 -164433 151417 -538474 -228115 88097 106395 8663
16055C5040b46265B91520b75392d0013q7836C02519b6545A5498J80864b03404
16044b14159B72239G0048Q4740k7645P4440F3738b05577p1026B76282P9227a9704
16032c0216j65519B82111f070l96816a85646B07858A3874a13175L3649j20617
16022b00143q1427A92977b2094A36214P4176r5502f402A25868k8220j441M3169
16011A39376a07167j09171B2809m701d5934j58021f2592A55204a1684O88K110
16000h886j88204B59540g9605f04l74686g8175b494F3929l730O1897b1211r2125
15988a13336C8554b03342I3918L6855C3958J73742k5561n6349L424P6642H2141
15976e3512A51456g6106B01826d470k98872B25574a54557d6385A1825L88719b75086
$$ plain form
16055 35040 -246265 291520 -275392 -40013 -127849 302519 -26545 15498 196362 -203404
16044 -214159 272239 70048 154788 127143 201583 63738 -205577 -276603 276282 355509 -19704
16032 -30216 -195735 282111 -6070 -402886 -185646 207858 13874 -113175 -79526 -200143
16022 -200143 -281570 192977 -22094 136214 210390 114888 -6402 125868 97648 96207 139376
16011 139376 -107167 -216338 22809 18108 -45934 -203955 -62592 155204 -11684 -10996 -8886
16000 -8886 -197090 259540 -79605 -604 -375290 -78175 -2494 63929 60199 122096 -21211 -113336
15988 -113336 38554 -203342 93918 130773 33958 207700 182139 125790 129214 205856 82141
15976 -53512 151456 -76106 201826 -4470 -303342 225574 -154557 -46385 11825 400544 -275086
15964E0339M3544B8480f0460a3781H0199e7408I2821Q6555D2033P8333C949a7581
15951a55666A17761b25554h7834q9349M403G4011l837a01231j39819K0419e218
15939e9144j34217j55742a60466D7913a38322A6515K71274E6534J66798b40559
15928B71094a37240M8315F5931h9983A20647b935k20638a6499B46142A00927a7075
15916b29826B16480q4953n984a20998f661D9261b58636f3375C25700h1785l8701
15905a20486I0441a75835C3883P8776m9041a27809L5229C0646d8959q96k13330
15894b63185B2700i2620j61325H0742g9372L5096j21615d2669A14761d4170H7003
15882G7685R7672M6712d15298b406j35013A46204a07744k90365A09164b6465j13651
$$ plain form
15964 50339 93883 28480 -60460 -13781 80199 -57408 92821 179376 42033 120366 3949 -17581
15951 -155666 117761 -225554 -87834 -177183 -172780 74011 70174 -101231 -241050 -220631 -5218
15939 -59144 -193361 -349103 -160466 47913 -138322 16515 287789 56534 223332 -240559
15928 271094 -137240 -88925 65931 -89983 120647 -2935 -223573 -16499 246142 100927 -17075
15916 -229826 216480 131527 125543 -120998 -6661 49261 -258636 -63375 325700 -81785 -120486
15905 -120486 90441 -175835 33883 112659 63618 -127809 -92580 30646 -48959 -49855 -263185
15894 -263185 22700 -92620 -253945 80742 -79372 -44276 -165891 -42669 114761 -44170 87003
15882 77685 175357 222069 -415298 -2406 -137419 146204 -107744 -398109 109164 -26465 -140116
15871a40116B6958O6195a01497D7343f6989j61736a5302j50034M1236J0244E5675
15859B5031A357P7888n312k5298L4060c32711a59037E2490a71282B38674i5689
15847h063j09505M4330B69093j13147M8433g5791F4526l0375O287b05816A01134
15835a71875E8791b49561e4334o3767e7650D01173b7017m6323n19294K70478B77530
15823A786M7726k3461b11483P6375B28808H9687f8245I1724d8141k0095D6836
15811e1271C0373c64633D78752j66551i500j43617g2033k82637B61937B5794b41518
15799c1280o0918A58712G408b57206l6268G227K5909b62744J28033B35942a35049
15787c2080A00518a99285e4302k75435A38056b72533A84087j9910R6326r4520
$$ plain form
15871 -140116 26958 93153 -101497 47343 -66989 -228725 -15302 -165336 -124100 -113856 55675
15859 25031 1357 79245 73933 48635 82695 -332711 -159037 52490 -171282 238674 -95689
15847 -8063 -117568 -73238 269093 155946 204379 -75791 64526 34151 40438 -205816 101134
15835 -171875 58791 -249561 -54334 -118101 -57650 401173 -27017 -73340 -592634 -322156 277530
15823 1786 49512 26051 -211483 -135108 228808 89687 -68245 91724 -48141 -68236 46836
15811 -51271 30373 -364633 478752 312201 -9500 -153117 -72033 -354670 261937 25794 -241518
15799 -31280 -92198 158712 7408 -257206 -293474 7227 33136 -262744 -134711 235942 -135049
15787 -32080 100518 -199285 -54302 -329737 138056 -272533 184087 164177 260503 165983
15777A65983A7736a77645D4370K00227a85493F0976J30111C7166a84803K156d729
15765g4196D21199A45365e6154B6055c45504h2278A52190L02347A82107c5284
15754A50504b15521c5017j8007H770b4293h980E3792g5983j23526D2296b8400
15742C04024b1423F3612N3856C3935L7527d9315n8641K2918F5377g3212e178p9097
15730h4275j35466B27360P43c05490g6489l6548b0639A14676a32965j88803G8740
15718C26752a72112P2253H9912l6964J693A34e6302m6105k40440A69898a27731
15706c9272B05231A00874h4159J8390F6202a53901P1841A60451a43609C4256h0536
15694D7752a53316j78502J30924l1379a11445B12889b54829A40750a11023K4594
$$ plain form
15777 165983 17736 -177645 44370 244597 -185493 60976 191087 37166 -184803 -182647 -4729
15765 -74196 421199 145365 -56154 26055 -345504 -82278 152190 454537 182107 -35284
15754 150504 -215521 -35017 -53024 8770 -24293 -8980 53792 -75983 -199509 42296 -28400
15742 304024 -21423 63612 117468 33935 71462 -49315 -107956 -85038 65377 -73212 -5178 -84275
15730 -84275 -219741 227360 228103 -305490 -76489 -113037 -20639 114676 -132965 -321768 78740
15718 326752 -172112 -99859 89912 52948 54641 134 -56302 -102407 -342847 169898 -127731
15706 -39272 205231 100874 -84159 -65769 66202 -153901 -82060 160451 -143609 34256 -80536
15694 47752 -153316 -331818 -200894 -232273 -111445 212889 -254829 140750 -111023 -86429
15684h6429k0641b0322k44692j9962e9965C4272a22074C7410I673a22497B61146
15672b21120C0332a73170c0185A40083b40204A58617a14281p4663g3521A77686
15661a9972C7563g4788j40512H5871L0518b80586A54679d22783b00748B0326b13719
15649d60319A00405g5032A76566b3486q5340n8990a7878A34272a37370D271J0227
15638A4498a59126g4105K1317A00272f4259k6571B28500k7343a91368B05479e1844
15626f8827j61718B34816H4944J28173c7847B72988B9175j1876E524b83572H1824
15614c91807B30297a03777A20963B4408a19147l8354j14888N6249P3467b7431
15603d3391l60026A68401J21192a6054G1032K839q002a10317k0172L1386A96911
$$ plain form
15684 -86429 -107070 -20322 -265014 -284976 -59965 34272 -122074 37410 9673 -122497 261146
15672 -221120 30332 -173170 -30185 140083 -240204 158617 -114281 -188944 -73521 177686
15661 -19972 37563 -74788 -215300 85871 116389 -280586 154679 -422783 -200748 20326 -213719
15649 -460319 100405 -75032 176566 -23486 -108826 -167816 -17878 134272 -137370 4271 14498
15638 14498 -159126 -74105 -52788 100272 -64259 -90830 228500 201157 -191368 205479 -51844
15626 -68827 -230545 234816 84944 213117 -37847 272988 29175 17299 5524 -283572 81824
15614 -391807 230297 -103777 120963 24408 -119147 -157501 -272389 -216140 -142673 -27431
15603 -43391 -403417 168401 289593 -16054 71032 73871 65869 -110317 -130489 -99103 196911
15591A45875h3164r1136D3649R5155d4699j64333F7038J31519q1865a06950N1000
15580e5950j23356e0996P70b3350M28m48j61811I6616N1076b6668B9835b0278
15567E2553g0025k23206i8890A82325a15517b3004m6961A20333K38601a0492j09918
15556a20410I0094b9619B50695q1979c24613P8630A8079a4210A16815b16364J04454
15545a11910b3013A07480D1111R2775c04743B01847a45255K4510B09958n4920
15535A55038g5054A81047b9716J2804G1283c5857I0597b48620F4031a20200B51061
15523d9266o9222A84284a23452A92246q4033b56840E9048k865a38844A68141G4454
15511E0878J3757J0182I659Q5598d2896A05144K16028b6281B08153b85661J01738
$$ plain form
15591 145875 -83164 -174300 43649 138804 -44699 -209032 67038 198557 116692 -106950 -55950
15580 -55950 -179306 -50996 -50226 -23350 -22922 -23370 -185181 96616 147692 -26668 29835 -20278
15567 52553 -70025 -293231 -98890 182325 -115517 -23004 -69965 120333 358934 -10492 -120410
15556 -120410 90094 -29619 250695 168716 -324613 -245983 18079 -14210 116815 -216364 -111910
15545 -111910 -23013 107480 41111 133886 -304743 201847 -145255 -120745 209958 155038
15535 155038 -75054 181047 -29716 -16912 71283 -35857 90597 -248620 64031 -120200 251061
15523 -49266 -118488 184284 -123452 192246 108213 -256840 59048 56183 -138844 168141 74454
15511 50878 64635 74817 9659 95257 -42896 105144 321172 -26281 208153 -285661 -183923
15500a83923K8410B71836a74183B03036E9357L4445j0807h6349A42377a2318j25487
15489a37805j42356C33406e6751n7907B86257a8114D1271b25860l2908C730N4545
15478E8275K2427b27128C74418B2261d6042j90619E3464e572m48229E890a63170
15466A59654J71610A7911J4921Q4312K93293r9760N1788d6678l4279j2688D5894
15454a77437C74579b53157b5020l65968A07693P0399b11246c7684A59234a51647
15443c05H2046L94178C94M6971n364L21932g6301j23476c942o6275B34074A04854
15430a76305A2537J5381P6523b59782j31057b2131j37399J8940l6688C1901d4567
15418a82135A52433f6815p448F2957J9546g0367A94629E3479a8288A19958b91809
$$ plain form
15500 -183923 -155513 271836 -174183 203036 59357 93802 82995 -86349 142377 -12318 -137805
15489 -137805 -280161 333406 -56751 -114658 286257 -18114 41271 -225860 -258768 3730 58275
15478 58275 80702 -227128 374418 22261 -46042 -236661 53464 -5572 -453801 5890 -163170
15466 159654 331264 17911 32832 117144 410437 310677 362465 -46678 -80957 -93645 45894
15454 -177437 374579 -253157 -25020 -390988 107693 178092 -211246 -37684 159234 -151647
15443 -305 82046 476224 394 47365 42001 363933 -76301 -199777 -3942 -70217 234074 104854
15430 -176305 12537 27918 104441 -259782 -390839 -22131 -159530 -140590 -177278 31901 -44567
15418 -182135 152433 -66815 -74263 62957 82503 -70367 194629 53479 -18288 119958 -291809
15406a71423G095i9530d6197K617j11152a2496k01464A8873L0308g4563A42530
15394i0110L1491K4203E1217e2635D6844M6003J91807b64490a2200j64290P2381
15383a04109l6879I1117J15510n9522j5827n6567a12237j0294A76691H4541e6669
15371A23188p071a59536A33874a32187m656A31311O464c00345B4566a50325c6805
15359a91799c8066j0727B48056j22545b28652I7650c5877A18753a56572B8296
15348I8929I042L4261b18773A44650f7400M679k69746A35796a50246b2947j45827
15337a68774A52320a04550K7885C09584I998a38225n9281A48911g9465A44655
15326A4915d8241B14969F5698b78724k0551c1021B35003g3788C3126h2474B7534
$$ plain form
15406 -171423 7095 -99530 -46197 -43580 -154732 -12496 -213960 18873 49181 -74563 142530
15394 -90110 -58619 -34416 51217 -52635 46844 92847 284654 -264490 -12200 -176490 -104109
15383 -104109 -140988 91117 206627 147105 131278 74711 -112237 -122531 176691 84541 -56669
15371 123188 116117 -159536 133874 -132187 -136843 131311 137775 -300345 24566 -150325 -36805
15359 -191799 -38066 -48793 248056 125511 -228652 97650 -35877 118753 -156572 28296
15348 98929 9042 43303 -218773 144650 -67400 -62721 -332467 135796 -150246 -22947 -168774
15337 -168774 152320 -104550 -76665 309584 9998 -138225 -197506 148911 -79465 144655
15326 14915 -48241 214969 65698 -278724 -299275 -31021 235003 -73788 33126 -82474 27534
15314B2837K83848B2657O1076b07779j14214c8582B38750b2114m5184C71947a63415
15302e6912l0257B62618e4705B3550b71094B01293c02387c856A74045J07423F8792
15290B16350o2769b78163C1161J15744k5020F634K03822c5872A3363a67674j6855
15279a84529Q9480b5388o6735p739b3308A15270Q9476a94083I891a04918G5476
15267B55406O810j20356f468k00589k9124K0979h7205r1416o9936C07543B0268
15255A55002K58986F3496K45724j17396K7848K57392L45238O03722k94596k12410
15245I19018K12298n08231a29095C21965B3096L04024i9112q8285B31585k8405
15235B03180G1268J08980o7427B4048g179B38806K1475r8342a26680j18830C9004
$$ plain form
15314 22837 306685 22657 83733 -207779 -321993 -38582 238750 -22114 -67298 371947 -163415
15302 -56912 -87169 262618 -54705 23550 -271094 201293 -302387 -3856 174045 281468 68792
15290 216350 153581 -278163 31161 146905 121885 6634 210456 -35872 13363 -167674 -184529
15279 -184529 -95049 -25388 -92123 -99862 -23308 115270 204746 -194083 9891 -104918 75476
15267 255406 262216 141860 -6468 -207057 -236181 -215202 -87205 -178621 -248557 307543 20268
15255 155002 413988 63496 309220 191824 219672 477064 822302 1426024 1131428 919018
15245 919018 1131316 623085 -129095 321965 23096 327120 -99112 -187397 231585 203180
15235 203180 71268 180248 112821 24048 -7179 238806 260281 161939 -126680 -245510 39004
15223i594k67275B14591o7060m6179L2745a3951B20878a23332D89223A11155P0766
15212A81921a15448c1801j04390e1484C02199a34382B61617b6558A59667a88470
15201G7778P0017L1508K41817A86856f7698B61578i754A51750o8685l6615J1805
15190E8255a62013L3627A88143a36353D8412J23087M8499E8265J51399o4718Q3385
15179B28331b026j64440A96877K16653A62067N8864j3695h4682B75495h4655F5425
15167B4589M14157A01754b66723B61501A03158J08670P8274j02878G8592K58415
15157C37007C3071R6928e1992A09729b1802r9929M5483B22490a65015k8732i3969
15145G4056N6401h8783B54316I60L29680e0102j07749H6053K6942J67024f9929
$$ plain form
15223 -9594 -276869 214591 147531 101352 134097 -13951 220878 -123332 489223 111155 181921
15212 181921 -115448 -31801 -136191 -51484 302199 -134382 261617 -26558 159667 -188470
15201 77778 147795 179303 421120 186856 -67698 261578 -9754 151750 83065 46450 58255
15190 58255 -162013 -128386 188143 -136353 48412 171499 219998 58265 209664 144946 228331
15179 228331 -2026 -166466 196877 413530 162067 220931 207236 -84682 275495 -84655 65425
15167 24589 438746 101754 -266723 261501 103158 211828 290102 187224 78592 337007
15157 337007 33071 129999 -51992 109729 -21802 -121731 -76248 222490 -165015 -193747 -93969
15145 74056 130457 -88783 254316 960 330640 -50102 -157851 86053 112995 280019 -69929
15133C78861H1192k6043k555J58474a40583A77036b02893B53967c0750l156G7014
15121D4818J46119b8585D29406A68219M1455H8007k1431k8104K29550A14952k0017
15110I4935J97010N3867q9496N338o3113c05957g0703B09278b626A59435a1912
15098C14087D6803M49851A25798f5964G436b91795A75794J52842j33649M2391
15088B37378A2923g6768B36043I1620G112l331K81724H3060b01396f6393A37245
15076I8585A7750M9932J54942e2165b1098F3160K66775A55747J39498j09235A3634
15064a6702C94819j08101j29320a244A84146G8990b20594A83049H3375K44401
15054C27776b01707C32329j65285a77175a9600r1635n8904A71261K4191K23626
$$ plain form
15133 378861 81192 55149 52594 211068 -140583 177036 -202893 253967 -30750 -33906 77014
15121 44818 190937 -28585 429406 168219 209674 88007 66576 38472 268022 114952 94935
15110 94935 291945 345812 256316 261654 198541 -305957 -70703 209278 -2626 159435 -11912
15098 314087 46803 496654 125798 -65964 7436 -291795 175794 328636 194987 237378
15088 237378 12923 -76768 236043 91620 7112 3781 285505 83060 -201396 -66393 137245
15076 98585 17750 67682 222624 -52165 -21098 63160 329935 155747 295245 186010 13634
15064 -16702 394819 286718 157398 -1244 184146 78990 -220594 183049 83375 327776
15054 327776 -201707 332329 167044 -177175 -19600 -111235 -170139 171261 195452 419078
15044D19078j65918L0606b13169C33001E1386K83597A01784B9699h3478F2221
15033C87424a9184C05089c9737B05655a42156B63441A13335K48397f920a160D44006
15021h2211D16418A45279J41153J98250k03588a56128A77756m1058K88696A76700
15010C02130n7261a84921I6412d955C21651n8482k8974q7035F8314L13464G703
14998B82660j41176L86463k47799D404d8009A95705n040p7927a55947A2679K14835
14987B27514K51828C1087K13552K12097B19604E8170K76572b35A43342J99618
14977C42960M0518j32300H1416O51291C63682j01802j687b0909B34854C888J02177
14966A06065J92746K58656B16868L5552j8223r314j1778N6433j25411J291b6054
$$ plain form
15044 419078 253160 283766 -213169 333001 51386 334983 101784 29699 -83478 62221
15033 387424 -19184 305089 -39737 205655 -142156 263441 113335 361732 -6920 -1160 444006
15021 -82211 416418 145279 286432 484682 281094 -156128 177756 136698 425394 176700
15010 302130 244869 -184921 96412 -4955 321651 263169 234195 147160 68314 381778 7703
14998 282660 141484 527947 280148 4404 -48009 195705 190665 112738 -155947 12679 227514
14987 227514 479342 31087 244639 456736 219604 58170 334742 -235 143342 342960
14977 342960 383478 251178 81416 732707 363682 261880 260193 -20909 234854 3888 106065
14966 106065 298811 557467 216868 252420 234197 224883 213105 269538 144127 145418 -26054
14954A01201L0718K57652K82873H9194l0816i1008B57772K19956n4436j59475
14944B63817P5952J59086k07800D1866M15280m272B26063O4856K5315j02674m4898
14933A68662K260J2898L59097k38016H6202K82566j27608J30013q9222j13576
14923A68375J75273J01865L01018B67678l3415K2033p4976J71295k6821P7843
14913D03637A68971G1801O14827k37729j57188J8934Q5445r4599L9107m888L2355
14902C68065m8318l2038r5513r2849J37439J09892j22123k5429k2234L23935A35582
14890B35545N7189A09718J04318P0780j33319M28705k08376j43247O14917B38040
14879A15376L28585m846A95723J04935k1555I768L54456j81715P1424N10758C76772
$$ plain form
14954 101201 131919 389571 672444 89194 58378 -91008 257772 477728 423292 263817
14944 263817 339769 498855 291055 41866 457146 452874 226063 290919 316234 213560 168662
14933 168662 170922 183820 542917 304901 86202 368768 241160 371173 281951 168375
14923 168375 343648 445513 746531 267678 234263 256296 181320 352615 325794 403637
14913 403637 168971 71801 686628 448899 291711 310645 396090 301491 340598 335710 368065
14902 368065 319747 287709 192196 99347 236786 346678 224555 199126 176892 500827 135582
14890 235545 292734 109718 214036 284816 151497 580202 371826 228579 843496 238040
14879 115376 443961 439115 195723 300658 279103 9768 364224 182509 253933 764691 376772
14867A09428L76999j61412j09925K82882q0653j7586L45389k80531J06059M7098
14857F17748Q4589k80386R8138H6841K31181K58422j67237j10876J18885K43577
14847F60793n4552k45253j0070J19653B1595J13276J94723J86510B01356K70606
14837D71962k06567j30087K59074j26880N0842L39125B69319J56997j44444K2532
14827C04404K52148j50234j10061J26408j17213J74456B36275K00924B03118F2024
14816C30612K72743k32927j28784o8690M00678B74756L3311L61805j23478R3680
14806F40074j77460J38601J47003k18561j53997L83350k40144j81967J33032j19657
14796C50274A36211J21715H4370M88266k44346J80017K656K44326j45390J49797
$$ plain form
14867 109428 486427 325015 215090 497972 417319 399733 745122 464591 570650 617748
14857 617748 702337 421951 520089 86841 318022 576444 409207 298331 417216 660793
14847 660793 606241 360988 350918 470571 21595 134871 329594 516104 201356 471962
14837 471962 265395 135308 394382 267502 318344 657469 269319 426316 281872 304404
14827 304404 556552 406318 296257 422665 305452 479908 236275 437199 203118 62024
14816 330612 603355 370428 241644 172954 573632 274756 308067 669872 546394 640074
14806 640074 462614 601215 748218 529657 375660 759010 518866 336899 469931 350274
14796 350274 136211 257926 84370 572636 328290 508307 510963 755289 609899 759696
14786G59696k89524J42036k51072J61851n8748J9577K46999C57662K81737k16495
14776D22904K66174C05375K59291M13911k95771j9924J50553l82432J88368q8605
14766E30766L4134J36881k62700Q9861r1880K61015C09659K76280j9533O8010
14756F34416C03108L76576M1938C52079Q2734J60365j05143n7221J59682j26601
14746D65895K41221o5049R0243r8098j58874L1008o8415Q30735F29521r5867J0313
14735E43967L21989j61567j79936L00077r2022j18871N7102k57129M68888j85755
14725F96743n8512J40327l8507N1523m1203o6567K07275k64417L45958j84250
14715G88370N0383n622k3683j71662m3103J48475o4489j27665N4608K10931K84377
$$ plain form
14786 759696 470172 612208 361136 522987 464239 483816 730815 357662 639399 422904
14776 422904 689078 305375 564666 978577 682806 662882 813435 431003 619371 530766
14766 530766 564900 701781 439081 528942 437062 698077 309659 585939 566406 634416
14756 634416 303108 679684 721622 352079 434813 595178 490035 432814 592496 465895
14746 465895 707116 642067 732310 634212 475338 506346 437931 1268666 629521 533654 543967
14735 543967 865956 704389 524453 824530 732508 613637 670739 413610 882498 696743
14725 696743 638231 778558 740051 791574 750371 683804 891079 626662 972620 788370
14715 788370 838753 833131 809448 637786 594683 743158 678669 551004 605612 816543 1100920
14704A100920l56195K1744j13899J00797j99557M16587l6272Q8472j93325P3705
14694I02977K6644k35527L31073p2561l03828J06819J76860j4076j6766j8520
14684H83095K28634p4983j99457n2472K38206K13653l46334M1917J68167M2323
14674A142749l12429j58028J10676L51473k03489m5069N7638n1134K06597K0137
14664A119121j56334l7850L2178J13707k5018L82508n67667j359J60737l24114
14654F95909J25422L71208l88753J69845K11107J25573j61727k85060L60041j84149
14644A039416N9224P6309q8840K72306j44951j08170J32976l48057N20041n07078
14634I03176M02616M20713n54773P65R8595l8138r8971J69120J27716m18789K42280
$$ plain form
14704 1100920 744725 766469 652570 753367 553810 970397 934125 1022597 829272 902977
14694 902977 929621 694094 1025167 952606 648778 755597 932457 918381 901615 883095
14684 883095 1111729 1036746 837289 784817 1023023 1236676 890342 932259 1100426 1142749
14674 1142749 830320 672292 782968 1134441 930952 885883 943521 892387 1098984 1119121
14664 1119121 962787 924937 957115 1070822 1045804 1428312 860645 859286 1020023 695909
14654 695909 821331 1192539 803786 973631 1184738 1310311 1148584 863524 1223565 1039416
14644 1039416 1098640 1174949 1086109 1358415 1213464 1105294 1238270 890213 1410254 903176
14634 903176 1305792 1726505 1171732 1172497 1271092 1232954 1133983 1303103 1430819 1012030 1254310
14623A254310O9816m3555k35075M18234L8206K04017m90056r1113P0129J67473
14613A362386J90103k36870L8971J37871J57345j36884K20889k70512J16585J7206
14603A597090k67065J22708J66179j54411L55969m42923R912L5917K98345J52225
14593A873946k93975J6982K15539k50032O0960J79306k60842J27036r4125L7982
14583A612777N64947m75449J17998k08404J78329J14066k8820J87230n00876M24408
14573A986206l86579M18147L22395l06502J5984J20222k74117L43923o4510J43233
14563B318402o23J14713K0295j3995J30808M2388J82415K2587K73902L36875R6612
14552C524379N16003O32664R52432K079047M438188R134145J9472601L970027
$$ plain form
14623 1254310 1324126 1280571 1045496 1463730 1501936 1705953 1215897 1124784 1194913 1362386
14613 1362386 1552489 1315619 1354590 1492461 1649806 1512922 1733811 1463299 1579884 1597090
14603 1597090 1330025 1452733 1618912 1464501 1820470 1377547 1387459 1423376 1721721 1873946
14593 1873946 1579971 1596953 1812492 1562460 1623420 1802726 1541884 1668920 1574795 1612777
14583 1612777 2177724 1702275 1820273 1611869 1790198 1904264 1875444 2062674 1561798 1986206
14573 1986206 1599627 2017774 2340169 2033667 2049651 2169873 1895756 2239679 2175169 2318402
14563 2318402 2317779 2432492 2452787 2438792 2569600 2611988 2794403 2816990 3090892 3427767 3524379
14552 3524379 4040382 4673046 5625478 7704525 12142713 21276858 40749459 44719486
14544D4719486A8003953F801153C272456j139176l76242m6196M56443l53947k63935
14535A549403K16260N12311m64960J09268K85303j17119J76038k43378P5174p4024
14525B024276K1405J60778K3190J98662R6623K073j86268k8430K08273j35410
14515B385172l6668P6886j24917K82368J05373j48641J10980K37343j50556K76038
14505C013378m26141M64734n7672j38865J66720n76284M03620K27126N1852j16476
14495C011992j67746N74418k58810L30292o28986N37769l71366N86333l59156
14486C254740p0127O52969q5092j23218j09337L1207K46755l17094R2754J66444
14476C740001R7082n769L4059K88950j4070j69410O2468m3826P1200K70829k51583
$$ plain form
14544 44719486 18003953 6801153 3272456 2133280 1757038 1710842 2167285 1813338 1549403
14535 1549403 1765663 2277974 1813014 1922282 2207585 2090466 2266504 2023126 2098300 2024276
14525 2024276 2045681 2206459 2229649 2428311 2524934 2527007 2340739 2312309 2520582 2385172
14515 2385172 2348504 2425390 2300473 2582841 2688214 2539573 2650553 2887896 2737340 3013378
14505 3013378 2587237 3051971 2994299 2855434 3022154 2445870 2849490 3076616 3128468 3011992
14495 3011992 2844246 3418664 3159854 3490146 2861160 3398929 3027563 3613896 3254740
14486 3254740 3184613 3837582 3752490 3629272 3519935 3551142 3797897 3480803 3573557 3740001
14476 3740001 3837083 3831314 3865373 4154323 4140253 3970843 4033311 3989485 4060685 4331514 4079931
14465D079931N31501n30828L50136k08932N00411k25628L72506j29576k22439
14456D517082J77396K66387K16231m63289M22268k9462k8257l6733J65461j8044
14446E189040k8346J81327r7912P15568j37678l6068p3357J43834l11887N63787
14436F108308J01962J1897p2990L01310j08047K06090K62123k89798p565K15233
14426F728523K26409K36964J19444M6373k15279K52980J17430j11646J37669J59730
14416G698597L229M91212J14932j86179j14181M68451L53940p1658J43343j8283
14406H883403M80157p1091L22572J68659K28590j41269J36907M20451M5428K69262
14396A0743069k25076r75P25507j45108K99222J71982K99077J7793N53313J947
$$ plain form
14465 4079931 4611432 4080604 4430740 4221808 4722219 4496591 4869097 4739521 4517082
14456 4517082 4694478 4960865 5177096 4713807 5136075 5106613 5078356 5041623 5207084 5189040
14446 5189040 5160694 5342021 5244109 5959677 5821999 5785931 5712574 5856408 5544521 6108308
14436 6108308 6210270 6222167 6149177 6450487 6342440 6548530 6810653 6520855 6513290 6728523
14426 6728523 6954932 7191896 7311340 7357713 7142434 7395414 7512844 7401198 7538867 7698597
14416 7698597 7701826 8193038 8307970 8121791 8007610 8476061 8830001 8758343 8901686 8883403
14406 8883403 9363560 9292469 9615041 9783700 10012290 9871021 10007928 10428379 10473807 10743069
14396 10743069 10517993 10517018 11242525 11097417 11396639 11568621 11867698 11885491 12438804 12440751
14386A2440751M11570J84105J2632J95115K93108k834R64908M3708M9015L02167
14376A4894245M34744Q6910K28946L24473O89984K06525J99664K45412L98205
14367A7709108P22961N01607P5601J34867M08242O33576L17442N74230L80197
14358B1457831M79374M32502Q65340L77820O50350M25120Q23752K66396R19537
14349B6698022L77822O34315R93754O47154Q27915P89560N94141P13380J239590
14340C3515653Q73543Q65028P10163J465881J023189R55040J450217J103679J216220
14331D3178613J568583J671133J415121J283522J608883J832642K156108J142464
14323E5857069J970246K163194K241462K385003K617478K694842K565784K860663
$$ plain form
14386 12440751 12852321 13036426 13049058 13244173 13537281 13534447 14499355 14543063 14592078 14894245
14376 14894245 15328989 15415899 15644845 15969318 16659302 16865827 17065491 17310903 17709108
14367 17709108 18432069 18933676 19009277 19144144 19552386 20185962 20503404 21077634 21457831
14358 21457831 21937205 22369707 23235047 23612867 24263217 24688337 25512089 25778485 26698022
14349 26698022 27075844 27710159 28703913 29351067 30178982 30968542 31562683 32276063 33515653
14340 33515653 34389196 35254224 35964387 37430268 38453457 39408497 40858714 41962393 43178613
14331 43178613 44747196 46418329 47833450 49116972 50725855 52558497 54714605 55857069
14323 55857069 57827315 59990509 62231971 64616974 67234452 69929294 72495078 75355741
14315G5355741K658900L119856L328330L682359L429528L952633M008181M567615
14307A04103143M383559N014912N190379N187855N938264N885706O529277P189206
14299A49422301P084625P739262Q289642Q757533Q907701R286840J0592243J0443017
14291B20523164J1446793J1707972J2067892J2933404J2946960J3563019J3816726
14284C09005930J4124951J4362239J4482799J4099479J4139960J3824382J3345979
14277D07385719J1923220J0766855R163098O842284K659652p87461j366520j670350
14269D44916497q55139m334546n658361q566646j1368796j3093413j4517713j5156094
14261C71365789j5868535j5615768j6042133j5277418j5227758j4834528j3493618
$$ plain form
14315 75355741 78014641 81134497 84462827 88145186 91574714 95527347 99535528 104103143
14307 104103143 108486702 113501614 118691993 123879848 129818112 135703818 142233095 149422301
14299 149422301 156506926 164246188 172535830 181293363 190201064 199487904 210080147 220523164
14291 220523164 231969957 243677929 255745821 268679225 281626185 295189204 309005930
14284 309005930 323130881 337493120 351975919 366075398 380215358 394039740 407385719
14277 407385719 419308939 430075794 439238892 446081176 448740828 447953367 446586847 444916497
14269 444916497 444061358 439726812 434068451 425501805 414133009 401039596 386521883 371365789
14261 371365789 355497254 339881486 323839353 308561935 293334177 278499649 265006031
14254B65006031j2924091j3217696j2086437j1890499j0828129j0345139r558588
14247A84155452r132406q749594q073149p645602o848314o915986o489521n796183
14239A24504697n684483m854233m568259n167786m048763m567333l987783l246642
14231H8379415l273400l420538l218916l000352k968426k850341k374407k655368
14223F4617667k190568k004752k138069j803381j912461j813297j957240j343398
14215D9454501j419007j247109j441049j350135j236643j645636j054577j228558
14207C8831787q12681o52594j524309r28487j150226q96623q10580l50291p92008
14198C0913988j179081r34923o14721o27259p29522n67782p97644o86732o36885
$$ plain form
14254 265006031 252081940 238864244 226777807 214887308 204059179 193714040 184155452
14247 184155452 175023046 166273452 158200303 150554701 143706387 136790401 130300880 124504697
14239 124504697 118820214 113965981 109397722 104229936 100181173 95613840 91626057 88379415
14231 88379415 85106015 81685477 78466561 75466209 72497783 69647442 67273035 64617667
14223 64617667 62427099 60422347 58284278 56480897 54568436 52755139 50797899 49454501
14215 49454501 48035494 46788385 45347336 43997201 42760558 41114922 40060345 38831787
14207 38831787 38019106 37366512 35842203 34913716 33763490 32866867 32056287 31705996 30913988
14198 30913988 29734907 28799984 28185263 27558004 26828482 26260700 25463056 24776324 24139439
14189B4139439o45059j84451n44785n83113m59543n29382l25636o82148j82234
14180B0003088m67699p07219l22354n29394j31269p05327q0941j98697l88849
14171A6471339n83679j25902p6042m46477m14917l66520j15609l38157m48196
14162A3555840L1278m6393m54331P1919p34800l73901J98143l75480l88069K0065
14152A1504271j51649j24450k75434L8032l25370J2286m68213L4488k42287k39628
14142I762046p0108p4933j0810k78155n8749j92103l42677K31658k14309j78574
14132H573286M4185n53859K64860k2456m14255n7791K38281n99313l6237K90189
14122G726890k29929q9463l16049k04119O8161k65470K75306j99181J4435J44859
$$ plain form
14189 24139439 23494380 23309929 22765144 22182031 21722488 21193106 20867470 20185322 20003088
14180 20003088 19535389 18828170 18505816 17976422 17845153 17139826 17058885 16860188 16471339
14171 16471339 15887660 15761758 15685716 15239239 14824322 14457802 14342193 14004036 13555840
14162 13555840 13587118 13540725 13086394 13158313 12423513 12049612 12247755 11872275 11484206 11504271
14152 11504271 11352622 11228172 10952738 10990770 10665400 10677686 10209473 10243961 10001674 9762046
14142 9762046 9691938 9617005 9606195 9328040 9269291 9077188 8734511 8966169 8751860 8573286
14132 8573286 8617471 8063612 8328472 8306016 7891761 7833970 8072251 7472938 7436701 7726890
14122 7726890 7496961 7407498 7091449 6887330 6955491 6690021 6965327 6766146 6780581 6925440
14112F925440p48137L43684m42254j2975o8025k0694J485N1321k21174j12336
14102E696335k75471J91069r3220j09676j20304P4927l02577J41065P1811k95268
14092D978691J77502k91533N6282j06156l71690L89005J54741l28962o8605q718
14082D580557j11111L06878n80416J38295j36728M5106k94755M72005J823j1372
14072D410282l24227m5909O1724l5329K55000l74573k91901K17787k89124K35170
14062C818900P2726o0492q7049J69417j31880r145k63325J76897j95567m3143
14052C447339k20084j00007J83274j25319K11654j87199l65103L48629Q2807m77110
14042B798881L70827k33455k86764M49066l53873K39124k27191K45234j78445
$$ plain form
14112 6925440 6177303 6520987 6078733 6065758 5997733 5977039 5978524 6029845 5808671 5696335
14102 5696335 5420864 5611933 5518713 5409037 5288733 5363660 5061083 5202148 5273959 4978691
14092 4978691 5156193 4864660 4920942 4814786 4443096 4832101 4986842 4657880 4589275 4580557
14082 4580557 4469446 4776324 4195908 4334203 4197475 4242581 3947826 4419831 4421654 4410282
14072 4410282 4086055 4040146 4101870 4066541 4321541 3946968 3655067 3872854 3583730 3818900
14062 3818900 3891626 3831134 3744085 3913502 3781622 3772477 3509152 3686049 3490482 3447339
14052 3447339 3227255 3127248 3310522 3185203 3396857 3209658 2844555 3193184 3275991 2798881
14042 2798881 3169708 2936253 2649489 3098555 2744682 2983806 2756615 3001849 2823404
14033B823404l06168L06284K43108j12096k3596j68831r9364l1833p8743r1538
14023B460627K42978l89204P7249J72194O6034m09779N93054k11183m48110K10222
14013B364082k56252L10046K25622n71581L1226J89083k31790O0119J29378j00312
14003B149621L7434J85504k18363q9039K40657K7272l50195O4562m8139K06352
13993B205666q5360K8397J84107L88585J184601L199858O716977J9013415J4060006
13984D6896252B2727489A1050709m511231j836247o87000k25104n69005j28201
13976C093921n11602L26789k60704j49348J95807j88940k89578j21578J38975
13967B233742m0762N6557j82691J0024N6389K42423l70026m32104P79624m69967
$$ plain form
14033 2823404 2517236 2823520 3066628 2954532 2930936 2762105 2662741 2630908 2552165 2460627
14023 2460627 2703605 2314401 2391650 2563844 2629878 2220099 2813153 2601970 2153860 2364082
14013 2364082 2107830 2417876 2643498 2071917 2103143 2292226 2060436 2120555 2249933 2149621
14003 2149621 2187055 2372559 2154196 2065157 2305814 2333086 1982891 2047453 1999314 2205666
13993 2205666 2120306 2148703 2332810 2721395 3905996 7105854 13822831 32836246 46896252
13984 46896252 22727489 11050709 6539478 4703231 4016231 3791127 3222122 3093921
13976 3093921 2582319 2909108 2648404 2499056 2694863 2505923 2216345 2094767 2233742
13967 2233742 2192980 2249537 2066846 2076870 2133259 2375682 2005656 1573552 2353176 1883209
13957A883209o2849M5114o7562L04925k53323J05538K48618o02168L68771l74464
13947A595809L20482j66988o4796l33011M4404N91079o69592J21801M4223L51608
13937A835019M9776k69002k7887J01136l19459K03657Q6045j24540k49896M17245
13927A702094k25242J12392j07040m42143K11195M19768m64675L29423j50053
13918A385719J92710l74290M75821k68453K73713j68855l63100K77107L1468k06196
13908A255644j7540K66724j54714j63948j12310K31521l5949k44107K40524j87296
13898A078549J11335j06998J34812j96364K26563K8295m6467O4192Q1642p7078
13888A298481J60392j36760j69523j20644j09565L54124j01125j77552M2140k09686
$$ plain form
13957 1883209 1820360 1865474 1797912 2102837 1849514 1955052 2203670 1601502 1970273 1595809
13947 1595809 1916291 1749303 1684507 1351496 1395900 1986979 1317387 1439188 1483411 1835019
13937 1835019 1884795 1615793 1587906 1689042 1369583 1573240 1659285 1534745 1284849 1702094
13927 1702094 1476852 1589244 1482204 1040061 1251256 1671024 1206349 1535772 1385719
13918 1385719 1578429 1204139 1679960 1411507 1685220 1516365 1153265 1430372 1461840 1255644
13908 1255644 1238104 1504828 1350114 1186166 1073856 1305377 1269428 1025321 1265845 1078549
13898 1078549 1189884 1082886 1217698 1021334 1247897 1276192 1229725 1293917 1375559 1298481
13888 1298481 1458873 1322113 1152590 1031946 922381 1276505 1175380 997828 1039968 830282
13878H30282P1039K19849n9213j92668j25588N61087l67725L75869l02380o2915
13868I47637p6133O8084r8130J93640j7584o4680J63549m64109J81439J53420
13858I87133n2677J4027j46928J27923Q7189k66731l02169N88521l11232L51302
13848A076358l6302j5830p6925J10921J22097n6742E05192M99209j15983l2155
13838H56263j873J03889r6969N7985l41188K90074q0954K45717j17997K50663
13828A165610j16917j1933j70150r617K51776j04868k64200J23348P4423k48550
13818F88922M06192k1291j17283k55135L37651l11797q0642M61917m74025J43462
13808G77971l56881M08529j5439o3951J251J73364l49455L58783j46920p7255
$$ plain form
13878 830282 901321 1121170 1061957 869289 743701 1304788 937063 1312932 1010552 947637
13868 947637 871504 939588 841458 1035098 1017514 952834 1116383 652274 833713 987133
13858 987133 934456 948483 801555 929478 1016667 749936 447767 1036288 725056 1076358
13848 1076358 1040056 1024226 947301 1058222 1180319 1123577 505192 1004401 888418 856263
13838 856263 854390 958279 861310 919295 578107 868181 787227 1032944 914947 1165610
13828 1165610 1048693 1036760 866610 856993 1108769 1003901 739701 863049 937472 688922
13818 688922 1095114 1073823 956540 701405 1039056 727259 646617 1108534 634509 777971
13808 777971 421090 829619 814180 750229 751480 924844 575389 934172 787252 709997
13798G09997N2340J37438j87605J27171R5421B74750P90504l88018J66606n8293
13788G85549j22219l4534N3683l25808O05447l65291J91854l04488Q878P9793
13778E72864L510J12059K53399k76996l04956Q5037L90863q9071j64440J7435
13768E99704J03191j6561k1967k8269k36481K47394j32586n7016M93641l62289
13758E88761J37056k53150j74156j46651L93219J2200Q9785n868J29088C26844
13747F17835O81k64253L26248K08788k57758L8191j91471n9546L71367j15856
13737F74226J78767m22035l0836O4888L26987k64332L3020m9779M8328O8750A51835
13725H82689l58278j81274K07046m9227N3605p9182L54573C34614O01889D22795
$$ plain form
13798 709997 762337 899775 712170 839341 934762 274750 1065254 677236 843842 785549
13788 785549 663330 628796 682479 356671 962118 596827 788681 484193 493071 572864
13778 572864 576374 688433 941832 664836 359880 444917 835780 746709 582269 599704
13768 599704 702895 686334 664367 636098 399617 647011 514425 457409 951050 588761
13758 588761 725817 472667 298511 151860 545079 557279 647064 641196 770284 326844
13747 617835 618516 354263 680511 889299 631541 669732 478261 418715 790082 674226
13737 674226 852993 430958 400122 465010 791997 527665 560685 510906 559234 627984 151835
13725 882689 524411 343137 550183 500956 554561 475379 829952 334614 936503 422795
13714D30013j1951J21019k50514J61639O9846J00823k43967m2039l4357J13245
13704D13757o4289P8925j01800L94656A75658L38212n2964B28739L85226j51855
13694D62110m3084l9706J69777K50660J1654l26904K07395k86691M68162C08523
13683D72937q4568O9706k9316A16784J78426J90639B28638K7049K38865J61809
13673F56361j25210K68860k69479j61284j12412J09260L16792j92020B26177j08039
13663A18138K90636n5103J71004j27622j78649M12335j13206B16855O3625K01835
13653D82315B0206K18211J91056K23542B52452P1629K43190k27683O8013j04394
13643C03207K25991O2857k21327o7136L754O4408J09736A65928J4053K90924l8946
$$ plain form
13714 430013 418062 539081 288567 450206 520052 620875 376908 334869 300512 413757
13704 413757 349468 428393 326593 721249 175658 513870 460906 228739 613965 462110
13694 462110 419026 379320 549097 799757 811411 484507 691902 405211 873373 308523
13683 472937 388369 458075 428759 116784 295210 485849 228638 255687 494552 656361
13673 656361 531151 800011 530532 369248 256836 366096 682888 490868 226177 118138
13663 118138 408774 353671 524675 397053 218404 630739 517533 216855 280480 482315
13653 482315 20206 238417 429473 653015 252452 324081 567271 339588 407601 303207
13643 303207 529198 592055 370728 303592 307346 371754 481490 165928 179981 470905 431959
13632D31959j1477L9082j86042J82613j60106K62386A86643J60929j57804M4525
13622B34293J08097m9407K06803k1960k15240o382J5752H7183J99500K63491B45621
13610C57475J19141o8186A01498P85432m11357j12042p2695R1589J25682L8340
13600E46447J50830B27218J33870n5510K35853B00759J57091j72955J7800K72024
13590D74719l7479e3489D71399k8263R0337A38547J85491j08882K74400j81640
13580C07916j2005f4813D39120j91140p3334K09756A36197c4199B58164J51527
13570D09691J803J7126j71510J23674J49801A87076m5319J6813J52368l380j9422
13559B88136R7137M9753A64248L3318L6438N8654j08336j9463O80311l44018j91805
$$ plain form
13632 431959 420482 459564 273522 456135 296029 558415 186643 347572 189768 234293
13622 234293 342390 292983 499786 477826 262586 256204 271956 87183 286683 550174 245621
13610 357475 476616 408430 101498 886930 475573 363531 290836 382425 508107 546447
13600 546447 697277 227218 361088 305578 541431 200759 357850 184895 202695 474719
13590 474719 437240 -53489 471399 443136 533473 138547 324038 215156 489556 307916
13580 307916 295911 -64813 439120 247980 174646 384402 136197 -34199 258164 409691
13570 409691 411494 428620 257110 380784 530585 187076 141757 158570 310938 307558 288136
13559 288136 385273 435026 164248 197566 234004 292658 184322 164859 845170 501152 309347
13548C09347B459M98253j05137j1958R7879A65212L10926B03258P8592R6092j9010
13537C58932k1849p8588r7350m4342M5186K97810A04806b4240B26186o4990K68711
13526D29907G6576Q5395J7748L14309k21563P62p9205L54349j97875G8646N0437
13515A29083E3422M58519B52980R4094L2024q3251K26270A88179n7327C1149N14517
13504E45666j02167A80050c7977E1036L00224J6672J11909j19746A76598J47709
13494C24307B3648L00366A04596F463J68496J99191A08000k0504g0252D76614
13483D93212o3632f8172A26433K71791J09925A57219j1920M46437B67714K84212
13473E51926k25837i6386A63714l388J42904d9109I6117M3960J63451j2831b74
$$ plain form
13548 309347 2459 500712 395575 383617 481496 165212 476138 203258 281850 377942 358932
13537 358932 337083 258495 161145 116803 161989 459799 104806 -24240 226186 161196 429907
13526 429907 76576 161971 179719 494028 272465 273227 194022 548371 350496 78646 129083
13515 129083 53422 511941 252980 347074 379098 295847 522117 188179 130852 31149 545666
13504 545666 443499 180050 -37977 51036 351260 367932 479841 360095 176598 324307
13494 324307 23648 324014 104596 6463 174959 374150 108000 87496 -70252 476614
13483 493212 429580 -68172 126433 398224 508149 157219 145299 591736 267714 551926
13473 551926 326089 -96386 163714 160326 303230 -49109 96117 140077 303528 290697 -274
13461B57297l8657G4246K65018R7776M9038H1819R5643c3671A01185J49556J95106
13450D45847j52736A4469P8746c6993B9476E424a04887d9187j57950A76942J32674
13439C09616j22696I1349J10439J31403A10274L80133f401C04435A00141M92471
13429E92612B26312a53503B7001J74997E6393e8014A56666J06805l8710j11461
13419A13300K20794b8686B83841j14875p5246D1326L56336j45131J4770n4666
13409B12635k5519F3518J94785R6144a4599D1448L18058d3849A75468G2225K31347
13398C03572j20793B9233L06114M0048M9A883N2492A6496J62929a3516G6946L67769
13386D44715q8956C7791L48386m1400A35316B6936J09124L8850K74073r4102p5556
$$ plain form
13461 257297 218640 74246 339264 437040 486078 81819 177462 -33671 101185 250741 445847
13450 445847 293111 14469 93215 -36993 29476 5424 -104887 -49187 -207137 176942 309616
13439 309616 186920 91349 201788 333191 110274 490407 -6401 304435 100141 592612
13429 592612 226312 -153503 27001 201998 56393 -58014 156666 263471 224761 113300
13419 113300 334094 -28686 283841 168966 93720 41326 397662 252531 267301 212635
13409 212635 187116 63518 258303 354447 -14599 41448 359506 -43849 175468 72225 303572
13398 303572 182779 29233 335347 375395 375444 1883 54375 16496 179425 -13516 76946 444715
13386 444715 355759 37791 386177 344777 135316 26936 136060 174910 448983 354881 279325
13375B79325H4874J21057H4013J86798A13305M0060J0264B7277J74438J63727
13365C65442G3709K66667E5772J15923h190A11208f1233A68148n5156K23632j4542
13354C22082A8870J00853K15273A20015O056K52092j75901K9064c0181l911A50146
13342C72252j68546K3202O7800P3207Q8782A91957J02070K10853j43493c6740
13331A95851e2730E8785J41981q0900m5280R6343H4518b11186C75967Q0639j62260
13320B94346A02399J11408r0282E8798j1124K33208L26321B83963p0432l0679
13310A82852c0533J3879I8418K39098A31502Q2057C113J97902a96675B43265B6501
13298H2262a67739B52933a4591A63692B5592K01847a72933G1127E022N9713J17769
$$ plain form
13375 279325 84874 205931 84013 270811 113305 153365 163629 27277 201715 365442
13365 365442 73709 340376 55772 171695 -8190 111208 -61233 168148 112992 336624 322082
13354 322082 18870 119723 334996 120015 126071 378163 202262 231326 -30181 -34092 150146
13342 372252 203706 226908 294708 367915 456697 191957 294027 504880 361387 -36740
13331 195851 -52730 58785 200766 119866 74586 170929 84518 -211186 375967 456606 294346
13320 294346 102399 213807 123525 58798 47674 280882 607203 283963 213531 182852
13310 182852 -30533 -16654 98418 337516 131502 213559 3113 201015 -196675 243265 26501
13298 82262 -167739 252933 -14591 163692 25592 227439 -172933 71127 5022 64735 182504
13287A82504b2924A17519e7654j1912A23659R6050m6246n0255J47450a96227B93867
13275B30881Q5927q951A12522J12633f95C11090j16635J98489H7055m059J86221
13264B69217q5241m2952d199F0175K36287A23911b00848h9624A83788h1438D11293
13252A34394K825O1182l8967B1744J99435B9057J53186A665J60731k5137c7166
13240a42235E5476M18757A71267a12602D64066k21077o5551P7632a44598B60027
13229C08226j38308m0146b8291B70466d1197B35653E7118R2039c7799A06022J10494
13218B16516i7359C9563k1P33f8807C23914m4510j9226M6543j48240f539k30589
13206b37128H4619e5215A372J28502l2010C5683m862e2375j24884B94404A18843
$$ plain form
13287 182504 -22924 117519 -57654 -69566 123659 219709 173463 123208 270658 -196227 293867
13275 230881 316808 307857 112522 225155 -695 311090 194455 392944 87055 82996 269217
13264 269217 183976 141024 -4199 60175 296462 123911 -200848 -89624 183788 -81438 411293
13252 134394 137219 198401 159434 21744 221179 29057 182243 1665 162396 137259 -37166
13240 -142235 55476 474233 171267 -112602 464066 242989 177438 255070 -144598 260027
13229 308226 169918 129772 -28291 270466 -41197 235653 57118 149157 -37799 106022 216516
13218 216516 -97359 39563 39542 40275 -68807 323914 279404 260178 306721 158481 -6539 -237128
13206 -237128 84619 -55215 1372 129874 97864 35683 30821 -52375 -177259 294404 118843
13194a52751C6460e1044o0816B30743L8010p7923h8357A7851J92765D1306H366
13182B76476j14796b76282I4233k5424J4327c2487A01771a35768A66792g115H6524
13170a54230d1615A6973K66165a10907H9833K17570A14696c85828c0278q6356
13160a16634D24484E2318M5205L17076I3996L9883M0037E6801H725K98334f8196
13148F8721a83107f875D6807J62823C3998J43226c3491A98664K5008o0463M0422
13137B03631k124m1186k6825P6909b8941A90549N0952h8568C80661a53097j16344
13126b69441K2944A0349c7421m2279o2516N711A82383P989G3078j8844f8387I7515
13113i8234L9365B53273P7587G4587J83454N8883g7595j40164A18243L64583A7804
$$ plain form
13194 -152751 36460 -51044 -111860 230743 268753 190830 -88357 17851 210616 41306 8366
13182 276476 161680 -276282 94233 68809 83136 -32487 101771 -135768 166792 -7115 86524
13170 -154230 -41615 16973 283138 -110907 89833 307403 114696 -385828 -30278 -116634
13160 -116634 424484 52318 97523 414599 93996 133879 173916 56801 8725 307059 -68196
13148 68721 -183107 -6875 46807 209630 33998 177224 -33491 198664 223672 163209 203631
13137 203631 201507 160321 133496 210405 -28941 190549 241501 -88568 380661 -153097 -269441
13126 -269441 -246497 10349 -37421 -79700 -142216 -136505 182383 190372 73078 54234 -68387 97515
13113 -98234 -58869 253273 330860 74587 258041 316924 -77595 -217759 118243 482826 17804
13101a74302j19844B88187A1682a90420H7793l2175i3084A87315N0988E4983Q5026
13090A40009R3692m6684K5609d8247a4617k08512A8084a82399B62021Q7315c731
13078h4044A52570K07063b6867C490K69821A36106b2591F8522K01123A11411g7942
13066a18778B00784i9963A53539F5493g3180A81662E0308Q5338P9120Q88p0373
13055A45281l7696a74961d3978D8042L16423b17121C06635a87126A58897l077
13045A55820o5142J98579j35858f8580J0205k9772C00672d6839J9704j79757A12538
13033B72987A04815a95774D08015b15697A98846p1796e7869D78883I7388K08708
13023C06096J75433j13247j32515o2524f4369A25005M5106f3932A46691a74300
$$ plain form
13101 -174302 -294146 288187 11682 -190420 87793 55618 -93084 187315 238303 54983 140009
13090 140009 233701 187017 212626 -48247 -14617 -223129 18084 -182399 262021 349336 -3731
13078 -84044 152570 359633 -26867 3490 273311 136106 -22591 68522 269645 111411 -77942
13066 -118778 200784 -99963 153539 65493 -73180 181662 50308 135646 214766 215654 145281
13055 145281 107585 -174961 -43978 48042 364465 -217121 306635 -187126 158897 155820
13045 155820 90678 289257 153399 -68580 -58375 -88147 300672 -46839 -27135 -206892 112538
13033 272987 104815 -195774 408015 -215697 198846 127050 -57869 478883 97388 306096
13023 306096 481529 368282 235767 173243 -64369 125005 170111 -63932 146691 -174300
13012A28009o3690a26550B32225D1330a64104A4114R5646n0308a87975F7603A1694
13000i7310F3983J7663C4680P1104j4315d6276B5032K60211c08470A76703o1535
12989A15168J35579a74659c3417j51493B62488a98988A64643P1265Q4271G6200
12978a13896E5337Q7232b16058B04777D8202a04340H8068A9493b64574d6358j0189
12967e6547k17659e0657j72413A99538D1807a325I7521K05458C8980N1623D1811
12955b78673P8566j5986n9777g3833A04718K4951E8740J00416a02560A93814B1989
12943B55553A6337c6737j53442a0305l6299B12136b07591Q8982q5625B31262k3076
12932B08186J0995a24430F5344R383j9557K02399D9139J7520J13398a5477r7332
$$ plain form
13012 128009 64319 -126550 232225 41330 -164104 14114 109760 59452 -187975 67603 11694
13000 -97310 63983 81646 34680 105784 91469 -46276 25032 285243 -308470 176703 115168
12989 115168 250747 -174659 -33417 -184910 262488 -198988 164643 235908 320179 76200
12978 -113896 55337 142569 -216058 204777 48202 -104340 88068 19493 -264574 -46358 -56547
12967 -56547 -274206 -50657 -223070 199538 41807 -1325 97521 302979 38980 90603 41811
12955 -278673 -200107 -216093 -275870 -73833 104718 129669 58740 159156 -102560 193814 21989
12943 255553 16337 -36737 -190179 -10305 -46604 212136 -207591 -118609 -204234 231262 208186
12932 208186 219181 -124430 65344 74727 55170 257569 49139 66659 180057 -15477 -112809
12921a12809A28356d6371H3665R5065a33006A34551c05496J8336I5617Q73h478
12909a05474A44059M0990b79122G1306K30203a20432a0621r6941M6372l952B39262
12897d7958A35339k5961J011b19645C69973F0347Q254L16358a02113a7837A45186
12885H9378Q1177c03595H5701A8930d0594A32331a15164G3401a28984A01666L15601
12874D17267D8674B440a92459j03503C31308d1106J1426j21625N3253E0056a62281
12862B79751a2070A03128R013c7989B10313O016c64152a18317n4297A13957J84238
12851B98195q1152J20794a96555d0017D09258B02094O1049j00165d53047f7371
12840a44921M3884B80885J18162c68061B09196k9205e6230a1529H1291a26383
$$ plain form
12921 -112809 128356 -46371 83665 178730 -133006 134551 -305496 -287160 95617 96490 -8478
12909 -105474 144059 185049 -279122 71306 301509 -120432 -10621 -107562 -61190 -65142 239262
12897 -47958 135339 109378 110389 -219645 369973 60347 68601 384959 -102113 -17837 145186
12885 89378 170555 -303595 85701 18930 -40594 132331 -115164 73401 -128984 101666 417267
12874 417267 48674 2440 -192459 -295962 331308 -41106 -29680 -151305 -98052 50056 -162281
12862 279751 -12070 103128 112141 -37989 210313 216329 -364152 -118317 -172614 113957 298195
12851 298195 217043 337837 -196555 -40017 409258 202094 263143 162978 -453047 -67371
12840 -144921 -101037 280885 399047 -368061 209196 179991 -56230 -11529 81291 -126383
12829c48997o0368a10827r7816A64710g5624r952O474q8301C64708h5327a972
12817A01710a91055A7098E3c45379Q4350B71726b9310A05369H665L7933R5445
12806A42043J10350b24619Q938q3886f0024B8033P069d9421B8020K06523J79673
12795D14216a6570H2176n319L2388m6982a93642A2727Q3364J40389j12701a5125
12783I6038e8855i630B12549m4805c1458A0932P6935A2136a17906c2360A83893
12771G6010b41407B96191M4427a7017m3157k73939F0310a15493J8496A79908D0371
12759A61953g2509p5017k23957j4324B83887A00773Q4500i9056o65I5073b27898
12747I0703b81479H6953c23949a17114D8892M43944b71426A32007E70L7379P0986
$$ plain form
12829 -348997 -409365 -110827 -208643 164710 -75624 -85576 -79102 -167403 364708 -85327 -1972
12817 101710 -191055 17098 53 -345379 -261029 271726 -29310 105369 8665 46598 142043
12806 142043 252393 -224619 -215681 -299567 -60024 28033 35102 -49421 28020 234543 414216
12795 414216 -16570 82176 76857 109245 62263 -193642 12727 96091 236480 123779 -15125
12783 96038 -58855 -9630 212549 167744 -31458 10932 87867 12136 -117906 -32360 183893
12771 76010 -241407 296191 340618 -17017 -60174 -334113 60310 -115493 -96997 179908 40371
12759 161953 -72509 -147526 -371483 -385807 283887 100773 185273 -99056 -99721 95073 -227898
12747 90703 -281479 86953 -323949 -117114 48892 492836 -271426 132007 570 37949 108935
12736A08935L80582a15431B94109a97677B61038m5103a43752C3067K64832o2611
12726B35288K27216j27059D5604h0735E9869K9707R4301b3975j36199D3279A6430
12714A46423P023P3639m7617I381J15672K8060L7329R3574A16215P2835e1559
12702A58578C5062h732C4122J2503J06091n6498L08475P2092A39298N3535J8305
12691B11138L4357I8514f9205J5850A40385c8254n8028a7643j00689B46263K9034
12680B75297L9398j45525J43442A45778J38562G6267a26190A98797d7221B33765
12669E4514H346K47013a3089C00602f3567C48953m1105J7136H6117j7255g5470
12657A93056n4660D9415c34802C50697j55982o2418b70581A8797K30006k8958
$$ plain form
12736 108935 489517 -115431 294109 -197677 261038 215935 -143752 33067 297899 235288
12726 235288 462504 335445 45604 -80735 59869 89576 183877 -23975 -160174 43279 16430
12714 146423 153446 227085 179468 9381 125053 153113 190442 284016 116215 189050 -51559
12702 158578 35062 -8732 34122 46625 152716 96218 404693 476785 139298 192833 211138
12691 211138 245495 98514 -69205 -53355 140385 -38254 -96282 -17643 -118332 246263 275297
12680 275297 314695 169170 312612 145778 284340 76267 -126190 198797 -47221 233765
12669 54514 8346 255359 -13089 300602 -63567 348953 307848 324984 86117 68862 -75470
12657 193056 138396 49415 -334802 350697 194715 132297 -270581 18797 248803 219845
12647B19845J24896G6293d41j97127A28889I288O5758c13271B39255A01335l5055
12636F6280a44452J3308A57993F928J63178J0181L148J12027A08347b7193D70207
12624f8184b8793B80021q7119E518b60525J13616A31715J13863e1224B81877A32391
12612a15648c3655A03166a60896A76265c3036B39670a32803D9196P0022N4075
12602A73293E4660J80698J6791E6793a13235B62735k7495a47383g1652A51041
12591A67829P3193a19723I7931A4642b05964E8806a33284d1764k66578A69809
12580d40128B33237P0281o9564A1507i0843B75353e5460l34970A15605l6070B7955
12568b24044I0182J04723o8316g923A34060b57110h8467A72596J6437p5540J30690
$$ plain form
12647 219845 344741 76293 -441 -197568 128889 9288 75046 -313271 239255 101335 66280
12636 66280 -144452 -131144 157993 6928 170106 180287 183435 295462 108347 -27193 470207
12624 -68184 -28793 280021 192902 5518 -260525 -146909 131715 245578 -51224 281877 132391
12612 -115648 -33655 103166 -160896 176265 -33036 239670 -132803 49196 119218 173293
12602 173293 54660 235358 252149 56793 -113235 262735 235240 -147383 -71652 151041
12591 167829 241022 -119723 97931 14642 -205964 58806 -133284 -41764 -308342 169809
12580 -440128 233237 303518 233954 11507 -90843 275353 -55460 -390430 115605 79535 27955
12568 -224044 90182 194905 126589 -7923 134060 -257110 -88467 172596 189033 113493 244183
12557B44183D5031K9967J37676c1423B7334J00465c0552n8434A67421R1546g6971
12545b84248E8632b23545A85472b02846A36736C167J97458G4480a99202B16132
12534A30067M4914f0300B6063f6033A57612n7661j872J01802K27507A13829L27282
12523D41111a08180B29409l5888e2013k30281l1392b9779B9207d5407A10187a24634
12511a22455A89291F6130O9075h7578D8298b7359B74947e2418j32002j81252h7343
12499A32026E4751Q2143e5811C55043p7725b32510a4432G625a982F9640a0855
12487a5933j07160J4723n6730k2179A30736b90922D01160J77170G1938a43524
12476c14568A0543M9606f1272j21055P9657H1377a1546E0125c1777j20116C11054
$$ plain form
12557 244183 45031 74998 212674 -31423 27334 127799 -30552 -88986 167421 258967 -76971
12545 -284248 58632 -223545 185472 -202846 136736 3167 200625 74480 -199202 216132
12534 130067 174981 -60300 26063 -66033 157612 99951 98079 199881 427388 113829 441111
12523 441111 -108180 229409 193521 -52013 -282294 -313686 -29779 29207 -45407 110187 -124634
12511 -122455 189291 66130 135205 -87578 48298 -27359 274947 -52418 -184420 -365672 -87343
12499 132026 54751 136894 -55811 355043 277318 -232510 -14432 7625 -1982 69640 -10855
12487 -15933 -123093 -108370 -165100 -187279 130736 -290922 401160 578330 71938 -143524
12476 -314568 10543 60149 -61272 -182327 -102670 81377 -11546 50125 -31777 -151893 311054
12464a84768A40673A6657f2735H8432a98920C1344K41959a88567P8032e0209I5949
12452f9537B72360A32115b78524a2148E3061J34209C7235b94354F1830h7366G9036
12440a08701j3683c2077l36600a00041H6879K09441A17218J66785b7091j90480
12430b17571a06356n7994O1189G6925i1847J9738A1868i6211A91834a13331a2698
12418c2503j74835C46000A71904P8730N0220F0912J25363f5577b2572C57336b14347
12406B37275f8761e529A45488C6003Q3744A9220a09924j74259J08726A86353h2693
12394G0851i1111j99116J23794C85795G008J50918a61089A66176e3267k95682
12384c48949g1136j91545B7122a24539D0293f9515C6279a47564D8804c04067a51342
$$ plain form
12464 -184768 140673 16657 -62735 88432 -198920 31344 273303 -188567 -110535 -50209 95949
12452 -69537 272360 132115 -278524 -12148 53061 187270 37235 -294354 61830 -87366 79036
12440 -108701 -122384 -32077 -368677 -100041 86879 296320 117218 284003 -27091 -217571
12430 -217571 -106356 -164350 -103161 76925 -91847 -72109 11868 -96211 191834 -113331 -12698
12418 -32503 -207338 346000 171904 250634 300854 60912 186275 -65577 -22572 357336 -214347
12406 237275 -68761 -5529 145488 36003 119747 19220 -109924 -284183 -175457 186353 -82693
12394 70851 -91111 -290227 -166433 385795 7008 157926 -161089 166176 -53267 -348949
12384 -348949 -71136 -262681 27122 -124539 40293 -69515 36279 -147564 48804 -304067 -151342
12372a49626C3499R5069k9050f1943C8493J59368a11450C5796a97581d9638L285
12361d6353k22587A30483k8380D8208i2822f898A54657g2551C8606h8912J5205
12350g3707A64814a36672A5522J01562N4995E2864a03239A05756M06390a91982
12339A44064c65342A56143n5761c11798B15286D0515L68402G071a75815E8678
12328b4744m37039b8506p4697J8415n9825e9219j2504p2170d5183F7228P8977
12317A46205n8116J22798A0205p86a840j34358B24361A02923b01144b3026F2831
12305a43573G4401g5294C18906j8997J9539a83525j8155A8596h0375j2266A29614
12293h6656A3639a01928A02524a88461P5044m5919a2070l0752j19687K5626j44449
$$ plain form
12372 -149626 33499 128568 99518 -61943 38493 197861 -111450 35796 -197581 -49638 -46353
12361 -46353 -268940 130483 102103 48208 -92822 -6898 154657 -72551 38606 -88912 -73707
12350 -73707 164814 -136672 15522 117084 172079 52864 -103239 105756 512146 -191982
12339 144064 -365342 156143 100382 -311798 215286 40515 408917 7071 -175815 58678
12328 -24744 -461783 -28506 -103203 -84788 -144613 -59219 -71723 -143893 -45183 67228 146205
12317 146205 88089 210887 10205 9419 -1840 -136198 224361 102923 -201144 -23026 62831
12305 -143573 74401 -75294 318906 299909 319448 -183525 -201680 18596 -80375 -92641 129614
12293 -86656 13639 -101928 102524 -188461 -113417 -159336 -12070 -42822 -162509 -136883 -281332
12282b81332J30973A06137R4396h4498r630J1386B15644q3270L0660e9555E593
12270d2989j42434b2122l9825B16464D3884L04297A9828g7165A15796a27537c1578
12258B21284l9464o3337h3394A57642L7695n499B1626J56351F764i1640B2760
12246b84130c2834B44619r271i2571a1809r3157H6349J4136J94173a2376F8221
12234A44284N6849a0153B2494K46904l2320b56320g0107C36215E8603L1918P2840
12223A63361J26363i0954I6324K61111j47436L09381I6435J50992J7535j18327
12213A46635o7393N3080K25899a13662B03578J76240I3886K7436E3382e1938A44238
12201D553O84159A50435A3213L16569n2785L3521A0105J14129K0814i6693C31143
$$ plain form
12282 -281332 -150359 106137 200533 -84498 -94128 -82742 215644 132374 163034 -59555 5593
12270 -42989 -185423 -22122 -61947 216464 43884 348181 19828 -77165 115796 -127537 -31578
12258 221284 181820 118483 -83394 157642 195337 189838 21626 177977 6764 -91640 22760
12246 -284130 -32834 244619 235348 -92571 -11809 -104966 86349 100485 294658 -12376 68221
12234 144284 201133 -10153 22494 269398 237078 -256320 -70107 336215 58603 90521 163361
12223 163361 289724 -90954 96324 357435 209999 519380 96435 247427 264962 146635
12213 146635 79242 132322 358221 -113662 203578 379818 93886 121322 53382 -51938 144238
12201 4553 688712 150435 13213 329782 276997 310518 10105 124234 145048 -96693 331143
12189A12413i8411B24783R5489h5895B86812J0077e1721o3676A753d1889A25436
12177C50550J00807c962B08478c1334A24424Q9883d2058B10936f9038q889C5899
12165D05168E4947b9643k708D8361L9391i3439A81182m5475J98450a22510D6957
12153a33035B38000G1880a31970L5567N544F0051c6830n8641J5703B34909b6911
12141f7423A60174j6911C2825M0710K46032H8344J15721d6928D416b61958C82562
12129E6776i3490A41737b33937B2986J46163B5363J22539N6786F4269K9121r531
12118H3859Q6045l5427b79350f5149q927G9693J58134c48455B30708a2391j04364
12107a16755K6363E5816b73047P832m4332C36873e5084B24712P9241i1579A83967
$$ plain form
12189 112413 -98411 224783 320272 -85895 286812 296889 -51721 -115397 1753 -41889 125436
12177 350550 451357 -3962 208478 -31334 124424 214307 -42058 210936 -69038 -77927 35899
12165 405168 54947 -29643 -32351 48361 87752 -93439 181182 135707 334157 -122510 46957
12153 -133035 238000 71880 -131970 -96403 -90859 60051 -36830 -95471 -79768 234909 -26911
12141 -67423 160174 143263 32825 73535 319567 88344 204065 -46928 4416 -261958 382562
12129 56776 -93490 141737 -233937 22986 169149 25363 147902 204688 64269 93390 83859
12118 83859 169904 134477 -279350 -65149 -74076 79693 237827 -348455 230708 -12391 -116755
12107 -116755 -90392 55816 -273047 -265215 -309547 336873 -55084 224712 303953 -91579 183967
12095B40121i720F8814a8137A90604J12294c58938B10850b47453B44268m3125
12085B01143H9758b28137a13008A65196e9281C40896C9056c08910i2645j04781
12075a97426A75647J36682p1612R08376R96692I08108l89589A50848P245g5427
12064B24550i4000A94614l0685c8765j55427p683D1207j5156e2609D6185g1622
12052A34027h0481B49458r6700D624b9998A48130d2359A43196a66002B35643a1960
12040b12105F4647R6889c55460J28980k54306E8334a20997l0978B11570E6109
12029B9063L725j1878b12386j37885C6344J94681i2977b9425k9264C15413a67097
12017c08728A18199c37608A10012K7563b32960j0867F1059a63160G951L9201R6861
$$ plain form
12095 240121 -9720 68814 -18137 190604 302898 -358938 210850 -247453 244268 201143
12085 201143 89758 -228137 -113008 165196 -59281 340896 39056 -308910 -92645 -197426
12075 -197426 175647 312329 240717 1149093 2145785 908108 518519 150848 158093 -75427
12064 224550 -94000 194614 163929 -38765 -194192 -201875 41207 26051 -52609 46185 -71622
12052 134027 -80481 249458 152758 4624 -29998 148130 -42359 143196 -166002 235643 -11960
12040 -212105 64647 161536 -355460 -226480 -480786 58334 -120997 -151975 211570 56109
12029 29063 32788 20910 -212386 -350271 36344 231025 -92977 -29425 -58689 315413 -167097
12017 -308728 118199 -337608 110012 137575 -232960 -243827 61059 -163160 7951 47152 144013
12006A44013J05069q6240f9109C24574D0877R2727j8830J27178c33181A2900N8580
11995G1480b141j87568b2397B34781g7688k3680b3094H9114c7515J0480k19574
11984b46609R1322k60658B55726A5491b73893h2843A38574A5485m558e7076r2189
11973a49265B47128f5760F4298c4922A2260a90268A50773K02149E8734j0808b48119
11961D9013a6845q5687c6973q4899d6551j11581g5224j38163P6589F2972b37944
11949g5480K9399K217O222A48089a72760m9196B18625G8943e0004G1383J20761
11938A92144d1710A27208f9538j39944h2500A78630L2512a50220L4870l96000
11928e11350C22J11530a9121D73869b00817J3414L0991c4586k4870K2224q290
$$ plain form
12006 144013 249082 162842 -69109 324574 40877 133604 114774 241952 -333181 12900 71480
11995 71480 -2141 -189709 -22397 234781 -77688 -101368 -23094 89114 -37515 -27035 -246609
11984 -246609 -155287 -415945 255726 15491 -273893 -82843 138574 15485 10927 -57076 -149265
11973 -149265 247128 -65760 64298 -34922 12260 -190268 150773 352922 58734 47926 -248119
11961 49013 -16845 -102532 -36973 -121872 -46551 -158132 -75224 -213387 -136798 62972 -237944
11949 -75480 -46081 -43864 -37642 148089 -172760 -221956 218625 78943 -50004 71383 192144
11938 192144 -41710 127208 -69538 -209482 -82500 178630 211142 -150220 -115350 -511350
11928 -511350 322 111852 -19121 473869 -200817 -187403 -156412 -34586 -59456 -37232 -45522
11917d5522I006a96624A50818g0969C3923M1918g4027l1099A18749J4623a53820
11905b16936d0920A30022K82364r5271c01959j0456d0281A9757c0331j75912b872
11893a76303P0399g895B83817f6508I4515J40125b43387J18875B6927J03783a39828
11881A7160M9609R2495b06140I3337b69255A89502e6593k41224A6884b71581O3280
11870b08301b3469r2168q4642d3157q7171A70809f8317G1529d959B96502f0188
11858c7545j71443B64116a4346r7752p2501B94567a03338N960A79467f5417j30819
11847a96236n0517g2189A48281c18180B6882b0828H3337M1743J27524f8399B3138
11835f8661A85734B1958a44194c7593j64181e703j90719i3782A10736N2343a60406
$$ plain form
11917 -45522 9006 -196624 150818 -70969 33923 75841 -74027 -105126 118749 133372 -153820
11905 -216936 -40920 130022 412386 317115 -301959 -312415 -40281 19757 -30331 -206243 -2872
11893 -176303 -105904 -7895 283817 -66508 94515 234640 -243387 -124512 26927 130710 -139828
11881 17160 66769 159264 -206140 93337 -269255 189502 -56593 -297817 16884 -271581 -208301
11870 -208301 -23469 -115637 -200279 -43157 -130328 170809 -68317 71529 -4959 296502 -60188
11858 -37545 -208988 264116 -14346 -112098 -184599 294567 -103338 -97378 179467 -65417 -196236
11847 -196236 -246753 -72189 148281 -318180 26882 -20828 83337 125080 252604 -68399 23138
11835 -68661 185734 21958 -144194 -37593 -201774 -5703 -196422 -93782 110736 163079 -160406
11823h0766k05408a10712K0282B47680f0497C71537a52122k65729d5345A29291
11812C74705a27880F1784J14088q5416a77385A71162G4957B0476M0823a06308
11801C358L18383b384j99764A59585A3678b4296q4405n2135P9378k37468J52564
11790a66362j95493H5826J01442G7455O264b3666J35M324A40265J6232p0236b65532
11777a47977L1287M9151o424B42147d5235q0544A54997F3103M3893b19892O1369
11766a58523P5468l4541j47121A53596b63878a04560L8618A77010F397c6777A57977
11754a75776B49614r1687c527A32477M4378J37908b11992D4549a38474b9863I4433
11742b71449g4780A94173E2521h9405a8447F1853h5944j18545G6899a08619l00169
$$ plain form
11823 -80766 -286174 -110712 -90430 247680 -60497 371537 -152122 -417851 -45345 129291
11812 374705 -127880 61784 175872 90456 -177385 171162 74957 20476 61299 -106308
11801 3358 321741 -2384 -202148 159585 13678 -24296 -108701 -160836 -81458 -318926 -166362
11790 -166362 -361855 85826 187268 77455 83719 -23666 -23531 -19207 140265 156497 86261 -265532
11777 -147977 -116690 -67539 -73963 242147 -45235 -125779 154997 63103 106996 -219892 -158523
11766 -158523 -83055 -117596 -264717 153596 -263878 -104560 -65942 177010 6397 -36777 157977
11754 -175776 249614 157927 -3527 132477 176855 314763 -211992 44549 -138474 -29863 94433
11742 -271449 -74780 194173 52521 -89405 -18447 61853 -85944 -204489 76899 -108619 -408788
11731d08788d4479a017B74287C3189a98010g1654B9445J87627a5278j40789D2133
11719g8027B75743i1146A66573b8998l16301J43181N3295C02385p1647l6464a04096
11707A57741B8326b68524F3263Q8149K8942J89047a33622D59784E738K33356P0229
11696C09323f9357a1347A26048R1867q7910k0489k4972h3680b1136j30585A86247
11684B93612N3798a29628k5954P5505j96361A92397c2565D07022b3659A92619
11673D9517j215O6573k7374B3066b17740O6992j562j21513A7946d6528A69597
11661a31223I2188Q4308l2181d9317j12736O9176A17285g5310G1793a24983d8447
11649d4738k8436A33156r820e9963a570B79826B1215Q5524b35153N230g8467B77499
$$ plain form
11731 -408788 -44479 -1017 274287 33189 -198010 -71654 29445 217072 -15278 -156067 42133
11719 -78027 275743 -91146 166573 -28998 -345299 -202118 -148823 302385 230738 194274 -104096
11707 157741 28326 -268524 63263 151412 180354 369401 -133622 459784 5738 239094 309323
11696 309323 -69357 -11347 126048 217915 130005 109516 84544 -83680 -21136 -151721 186247
11684 293612 347410 -129628 -155582 -80077 -276438 192397 -32565 407022 -23659 192619
11673 49517 48302 114875 87501 23066 -217740 -150748 -152310 -273823 17946 -46528 169597
11661 -131223 92188 176496 144315 -49317 -162053 -92877 117285 -75310 71793 -124983 -48447
11649 -44738 -73174 133156 123336 -59963 -1570 279826 21215 106739 -235153 -229923 -78467 277499
11636A01743a65585F7234B1065b5491A72016e8839B28688a81288A56706a33320
11625A16945a02382A28016O8492G7755L0434e41C15712a83891F5082B1890L631
11614B5521g8027E1688j4822b37633F528h709m1636F1444k448d1865B36427f8593
11601H095f3465B36947a39856J4843A27054b64027a7442o4044j79068A33990m6164
11590H7826f6429A09465C2634K85202A01766K78951a47063A06889h7058l9360
11580a26418G1908J13775e7537j33377B8091K52762G6192A9895d3676k84072B28990
11568A87961j8519C1034a87299A31613l6440f6349B30804B7035O4527J81754a4772
11556a25191L1919A14795a19825C03827A8183L39793A22496n798A4183K14626
$$ plain form
11636 101743 -165585 67234 21065 -25491 172016 -58839 228688 -181288 156706 -133320
11625 116945 -102382 128016 196508 77755 108189 -541 315712 -183891 65082 21890 25521
11614 25521 -78027 51688 36866 -237633 6528 -8709 -50345 61444 58996 -41865 236427 -68593
11601 8095 -63465 236947 -139856 -125013 127054 -264027 -17442 -81486 -260554 133990 87826
11590 87826 -66429 109465 32634 317836 101766 380717 -147063 106889 -87058 -126418
11580 -126418 71908 185683 -57537 -190914 28091 280853 76192 19895 -43676 -327748 228990
11568 187961 169442 31034 -187299 131613 95173 -66349 230804 27035 91562 273316 -14772
11556 -125191 -93272 114795 -119825 303827 18183 357976 122496 116698 14183 228809
11546B28809F838K58697Q1040q8084q7142D0766R878L8629j7256b66528E0326
11534E5784K44465A0649O5289a75985f4794B37893A09813d5654C39700a60094
11523H4725P4539J20423a45742A77887R4161j26610f7771K132A82462b7394A3556
11511c1506B35558A16772b3902J0001B39640l6528K7165c3626G1927A1867b06147
11499A86521m6403J41692j5648J27229A18339b7717M093A33413Q3725H3883a98367
11487h0274A10436K9157l8468k6875K10472a8817A50342R4801b3982B00894K29906
11476D30800f3478a0702C65234d7357G15888l43538j72472K26451j26522J71174
11466D70981j97411h0409b9410G2030r711J01008a06508j3528A06659m2370O0661
$$ plain form
11546 228809 6838 265535 346575 258491 171349 40766 50644 89273 72017 -266528 50326
11534 55784 300249 10649 75938 -175985 -64794 237893 109813 -45654 339700 -160094
11523 84725 159264 279687 -145742 177887 272048 145438 -67771 -65639 182462 -27394 13556
11511 -31506 235558 116772 -23902 -13901 239640 203112 230277 -33626 71927 11867 -206147
11499 186521 140118 281810 266162 393391 118339 -27717 -23624 133413 217138 83883 -198367
11487 -80274 110436 139593 101125 74250 284722 -18817 150342 245143 -23982 200894 430800
11476 430800 -63478 -10702 365234 -47357 715888 372350 199878 426329 299807 470981
11466 470981 273570 -80409 -29410 72030 62319 163327 -106508 -120036 106659 64289 124950
11455A24950b45864B7670M44975A38718B5634L8026a63925A13144J43936k6471
11445B30609c8214q9936A35568a4626r1B3930P7236B5093K38928A15000J58173
11434B73173J64475C3253K17676N6165p991J4887F0340b89186a16075J3753C55081
11422E9709N3917B7326P4318B6744h6429F44a29429A87862a24148B4228a2707
11410C1390a09574A81132D0753J9566a84447c9379o586B8034J16669g9118A84810
11398c02801A347i7029J849j79873b7159C01046A22902n2421M0578M8896g1102
11386G0737e1897B06150P3838j01145B5922c5861I5236P0432G3056J13577A2167
11374a23410B18387F7874a86050C6628b39962A1310L5674c38646C63717c9848
$$ plain form
11455 124950 -245864 27670 472645 138718 25634 63660 -163925 113144 257080 230609
11445 230609 -38214 -128150 135568 -14626 -14717 23930 101166 25093 264021 115000 273173
11434 273173 437648 33253 250929 307094 299103 313990 60340 -289186 -116075 -102322 355081
11422 59709 113626 27326 101644 26744 -86429 644 -129429 187862 -124148 24228 -12707
11410 31390 -109574 181132 40753 60319 -184447 -39379 -45965 28034 144703 -79118 184810
11398 -302801 1347 -97029 -95180 -275053 -27159 301046 122902 70481 111059 159955 -71102
11386 70737 -51897 206150 279988 178843 25922 -35861 95236 165668 73056 186633 12167
11374 -123410 218387 67874 -186050 36628 -239962 11310 46984 -338646 363717 -39848
11363E9496a25923r4718g6282m3742A53965L1429c22269R1385p6688c1488J4693
11352a6795j93757A83488A6888a32820d7001I8421b15518f8490F9244R5453L51508
11341E16205B068M6211l512p197c4442B35716C1463a27289l448j50748A83219
11329c01273d2153q4153D4029a22373B5232i424j64005M3363B2015b53888A42045
11317G7941b17677H5858b6409l41931c9865k95336J39563e502C66938D0434A4405
11305E6788a39264H8248h0647q9660g1980j87134F4753O2867a32347M3848k17199
11294c05698J24050A26241h7975q7287A14693h4886A85253b47027h1004B06301
11283B10962a28252c1141B23675c57250E4815a41427b5602d294l74888a56360
$$ plain form
11363 59496 -125923 -220641 -76282 -120024 153965 185394 -322269 -230884 -307572 -31488 -16795
11352 -16795 -210552 183488 16888 -132820 -47001 98421 -215518 -68490 69244 164697 516205
11341 516205 2068 48279 44767 37570 -34442 235716 31463 -127289 -130737 -281485 183219
11329 -301273 -42153 -126306 44029 -122373 25232 -9424 -173429 -130066 22015 -253888 142045
11317 77941 -217677 85858 -26409 -368340 -39865 -335201 -195638 -5502 366938 40434 14405
11305 56788 -139264 88248 -80647 -170307 -71980 -259114 64753 127620 -132347 -88499 -305698
11294 -305698 -181648 126241 -87975 -175262 114693 -84886 185253 -247027 -81004 206301
11283 210962 -128252 -31141 223675 -357250 54815 -141427 -25602 -4294 -379182 -156360
11272c60425c5438m8028A15175i2376B07615b9020Q310j68447d8221j2823o5097
11261a26141J9814B3095K1665a47913L3028K0691A06207F542a43261A06384c0795
11249a52524A7288b42435p5649k0909N9248A39072b03891o4953G5316Q8814h210
11237c7016l9474q5923B27998d6462k63085J16714Q0316A41878D090b09699j46305
11226c56004g0864A63480b16206d8102B11511c06776F6218B5568a52876J861f0999
11214C72527g8883L346A51817o3896J69405g2490A64180q755C3771M7037N946
11203H6754R546a78793c8962q1302n1396L8486B43928A18435C5544K02720c29007
11191a56259B54521a11375G8929c54091H8432a00192A42788b28291A26278b04091
$$ plain form
11272 -360425 -35438 -83466 115175 -92376 207615 -29020 -20710 -189157 -48221 -61044 -126141
11261 -126141 -106327 23095 44760 -147913 -114885 -94194 106207 6542 -143261 106384 -30795
11249 -152524 17288 -242435 -318084 -338993 -279745 139072 -203891 -268844 75316 164130 -8210
11237 -37016 -76490 -162413 227998 -46462 -309547 -192833 -112517 141878 4090 -209699 -356004
11226 -356004 -70864 163480 -216206 -48102 211511 -306776 66218 25568 -152876 -151015 -60999
11214 372527 -78883 -75537 151817 87921 257326 -72490 164180 155425 33771 80808 86754
11203 86754 96300 -178793 -38962 -120264 -171660 -133174 243928 118435 35544 238264 -329007
11191 -156259 254521 -111375 78929 -354091 88432 -100192 142788 -228291 126278 -204091
11180A67255a74547A17579m8147l1818a81704F3220K18650b30620A02307E0677
11169c04102G040J48393f2819b8171j00113A48272I286L15725c1819m0516C45713
11157a69681K9659n7810j46520E5060a58916A75962a28599D1523c2963j01689
11147a34652k53190J05467a18340M5372j34635h3376c1631C56948B3257d5434
11136B319b2099C97751E2830o347M7340c61627g164r3982L5038a5838r81A11548
11123A44575J67774p944f666E7891J70015K93088F042h3924B24673a31478C29111
11111a51808B2602J88571m8138J51995b83780d8543j79300A49635J33650M167
11101B87452N9007j33580L01045E4969K46189J52242A81807L25567G7639M15388
$$ plain form
11180 167255 -174547 117579 69432 37614 -181704 63220 281870 -230620 102307 50677
11169 -304102 7040 155433 -62819 -28171 -128284 148272 9286 325011 -31819 -72335 345713
11157 -169681 -140022 -197832 -344352 55060 -158916 175962 -128599 41523 -32963 -134652
11147 -134652 -387842 -282375 -118340 -72968 -207603 -83376 -31631 356948 23257 -45434
11136 2319 -22099 397751 52830 46483 93823 -361627 -7164 -101146 -66108 -15838 -16819 111548
11123 144575 312349 304405 -6666 57891 227906 520994 6042 -83924 224673 -131478 329111
11111 -151808 22602 211173 163035 315030 -283780 -48543 -227843 149635 283285 287452
11101 287452 346459 212879 513924 54969 301158 453400 181807 507374 77639 493027
11091D93027A47436J04031J00208A3196L13775J859P4668b55345A31497L08454
11081D39951a2967B34853o8328K8395M612K7358G7059B7082K25107J41502r4443
11070B99248j08011k1222J5076P5652J39426J34624Q2805A21649K06721J59282
11060D87652j16272J90800j80138j37293K80477L71382l24195k323L24495j34194
11050G60391j29877P0208n0899j18729N61415l93517K54294C75706L97229O5689
11040H38624k65660J67919K22720D04997L10946M6793K6837p0223k57181K67764
11030G29933R0393l64718K17093L09344k5704m06020L87376k65143J15934j65577
11020F22911R2475l8734o8438O6416l9217J37677j39698n3655M80945k37700C85848
$$ plain form
11091 493027 147436 251467 351675 13196 326971 328830 403498 -255345 131497 439951
11081 439951 -12967 234853 166525 194920 199532 226890 77059 27082 252189 393691 299248
11070 299248 191237 170015 185091 260743 400169 534793 617598 121649 328370 487652
11060 487652 371380 562180 382042 244749 525226 896608 572413 570090 894585 760391
11050 760391 630514 700722 649823 531094 1092509 698992 953286 375706 772935 838624
11040 838624 572964 740883 963603 404997 715943 762736 789573 719350 462169 729933
11030 729933 820326 455608 672701 982045 956341 550321 937697 672554 788488 622911
11020 622911 715386 676652 608214 674630 635413 773090 633392 579737 1060682 822982 385848
11008C51785l3021N05356k85448K88861n3092j46767j52772J75031M15797m77490
10998E88240J03917M34200m50601J37193K2889l00513J65317M3385P4073m2902
10988G75198M6119N4839j04689O6134J36219M9658K42802j30004N08196n47238
10978A097234L50445L65352l8118R2638L51246J66313M05249J85966L33775m87185
10968B822915K19672l98365K86149o27897m24193J1599o404l06376Q593L64600
10958A950293k58218R0343n4665j24843n63j22246k94657q8439k76469N5073l54251
10947E21358L48101D10558O4874I4484J46846J78974A24449K56498j43713n8238
10937A78996l9915J88776h0287a5043C56688A53339f1197C43536H7217r557b3985
$$ plain form
11008 351785 318764 824120 538672 827533 774441 627674 474902 649933 1065730 588240
10998 588240 692157 1126357 675756 812949 835838 535325 700642 744027 818100 775198
10988 775198 821317 876156 771467 837601 973820 1023478 1266280 1136276 1644472 1097234
10978 1097234 1447679 1813031 1774913 1867551 2218797 2385110 2790359 2976325 3310100 2822915
10968 2822915 3042587 2644222 2930371 2302474 1878281 1889880 1883476 1577100 1585693 1950293
10958 1950293 1692075 1782418 1727753 1602910 1602347 1480101 1185444 1097005 820536 875609 521358
10947 521358 869459 410558 475432 94484 241330 420304 124449 380947 237234 178996
10937 178996 139081 327857 -80287 -15043 356688 153339 -61197 343536 87217 77660 -23985
10925e1595A63977b21967J4582a3025C420e1301o9190A25728D188g4145j98338
10914b72483A02545c6514B75413h6301k1725A02868a24827e7968q5317H5881b34926
10902A45230i0144m8531A49411a48392C5416a8326B48893I9250O2053h8621j12073
10891b00694j15163i6387a4945j91354G4501b78j38282G4217h8430o555B09007
10879A84481a96998f972B7611K52709a10701j25528d242A01832J99463a07950
10868a25347n4352Q8378j86033a09747A57537a53548g5496c856o3225a6610F880
10856A21607a86999l1050j30334J73220B37851E7355J00498f7855A49153i1054
10845f8423j18893c5734l5925C03901c6796F9599a15932C4561K47297g663l16935
$$ plain form
10925 -51595 163977 -221967 -207385 -13025 3420 -51301 -120491 125728 4188 -74145 -272483
10914 -272483 102545 -36514 275413 -86301 -108026 102868 -124827 -57968 -143285 85881 -234926
10902 145230 -90144 -138675 149411 -148392 35416 -18326 248893 99250 161303 -88621 -200694
10891 -200694 -315857 -96387 -14945 -206299 74501 -278 -138560 74217 -88430 -94985 209007
10879 184481 -196998 -6972 27611 280320 -110701 -236229 -4242 101832 301295 -107950
10868 -125347 -179699 -91321 -277354 -109747 157537 -153548 -75496 -3856 -67081 -16610 6880
10856 121607 -186999 -218049 -348383 -175163 237851 57355 157853 -67855 149153 -91054
10845 -68423 -187316 -35734 -71659 303901 -36796 69599 -115932 34561 281858 -7663 -324598
10834c24598h9150B920J24784a28385F7607e7593A79804M2953b18659F1627b88622
10822a55838A36985K11577a78909A6662a93974N2976d9254j06771a1382k82014
10812b93396G4605c89772J78630E7635J44456a12809A528a01771l31018c2373
10801a22555k20574h9492B51072d41365c8999k00563H8944J04694a01257A93354
10790I9162h6244m7206r2153B3127J39007m8341l2165b94739h2540H6489b34696
10778B0002d11922A41032J61899a80266B81884e8255j25832l9079C5556a20632
10767a18680L2433j51783a18681j4730q0636c2993F8852O3149E879J9600O4230
10756H9709J48240c99078D2498M6226K79274A41734N4869h4173B10544g9133k3603
$$ plain form
10834 -324598 -89150 2920 127704 -128385 67607 -57593 179804 222757 -218659 61627 -288622
10822 -155838 136985 348562 -178909 16662 -193974 -140998 -49254 -156025 -11382 -293396
10812 -293396 74605 -389772 -211142 57635 202091 -112809 1528 -101771 -432789 -32373
10801 -122555 -343129 -89492 251072 -441365 -38999 -239562 88944 193638 -101257 193354
10790 99162 -86244 -133450 -225603 23127 162134 113793 81628 -294739 -82540 86489 -234696
10778 20002 -411922 141032 302931 -180266 281884 -58255 -184087 -223166 35556 -120632
10767 -118680 -86247 -238030 -118681 -133411 -214047 -32993 68852 132001 5879 25479 89709
10756 89709 237949 -399078 42498 88724 367998 141734 196603 -84173 210544 -79133 -102736
10745a02736I3531a3927A51097B2620J43028F5405a93960A76740b62597A36612
10734c816B1037i383C2874Q3676g2207n6060j80966C5132L4469K7622a09541n2717
10722a62258j13528R4452k6047f9453k1710F4321K5119Q5876D1838G357J14192
10711A21549a99907A97624i149A6217a70191A8222P9482C9384h9675F5232a49356
10699G6716a71748g2589B55382b15747c7341k97521e0514J8623C7684a56474K6239
10688a30235E2268M9481b29603M4435q7301D3932a52530e4130D9964R1882a96848
10676I6092J76023H4487c9476A22341A741N1294J79996E541b62711c3456A79839
10664g9112m8504B37336b17910A85675E897K20809d97376M4883A55457o1847a51260
$$ plain form
10745 -102736 93531 -13927 151097 22620 165648 65405 -193960 176740 -262597 136612
10734 -3816 21037 -9383 32874 116550 -72207 -128267 -309233 35132 69601 97223 -109541 -162258
10722 -162258 -275786 -181334 -207381 -69453 -91163 64321 89440 175316 41838 7357 121549
10711 121549 -199907 197624 -9149 16217 -170191 18222 97704 39384 -89675 65232 -149356
10699 76716 -171748 -72589 255382 -215747 -37341 -334862 -50514 -31891 37684 -156474 -130235
10688 -130235 52268 101749 -229603 -185168 -272469 43932 -152530 -54130 49964 141846 -196848
10676 96092 272115 84487 -39476 122341 1741 53035 233031 5541 -262711 -33456 179839
10664 -79112 -127616 237336 -217910 185675 5897 226706 -497376 -452493 155457 93610 -151260
10652d7643k68503a15566C17256A15300J07901d3143n9715A91534o5883B9341
10641B3616a70353n5040g3024N336E0097J66437D8520d7679B99063G4667e9041
10629b61121k1227c0237k950j16001A15249e8815M149j20593f5402k26424a32385
10617A04439e19611a20934B5713h9789j58783N9314A03403O3098K4845B6675L2146
10606E8821a72339N8180d6633j57607j8516i2831a3497H7920k6891J35252a01909
10594D2567Q3489q22b17391B63150e6620k06B6794a05511D14675A76767C9612
10582a00398A10626b11649D32968e4058m5025A33240b83381J15169f4497F4091
10571d0208A85059b78354f5688r9574B7614b19677L071A48954a74567A13337a84954
$$ plain form
10652 -47643 -316146 -115566 317256 115300 223201 -43143 -102858 191534 125651 29341
10641 23616 -170353 -225393 -73024 -67688 50097 216534 48520 -47679 299063 74667 -59041
10629 -261121 -282348 -30237 -33187 -149188 115249 -58815 -54666 -175259 -65402 -291826 -132385
10617 104439 -519611 -120934 25713 -89789 -248572 -189258 103403 166501 191346 26675 58821
10606 58821 -172339 -114159 -46633 -204240 -222756 -92831 -13497 87920 61029 196281 -101909
10594 42567 126056 125234 -217391 263150 -56620 -56826 26794 -105511 414675 176767 39612
10582 -100398 110626 -211649 432968 -54058 -99083 133240 -283381 -168212 -64497 64091
10571 -40208 185059 -278354 -65688 -165262 27614 -219677 -216606 148954 -174567 113337 -184954
10559e086C27655F7119b27030p551a664I0020b48948K5518A11962g3008f551k63980
10547b70531K6067g9203n1515n7531P0507A62803a25770E3f8313n7744d0003C24507
10534a42434D827N7198J46204H325b0618m8614A7727a39889n4575e1160l05883
10523c57043H0465a76910D3276a78993P2743b5589B84530A01699B5907a68624
10512f7407n0602B3649a19139e9287q1043A52991g646j9488j77237J3972A65034
10500a41006A09909L6411a62646k34056a34043C4218J9823a48469r7087c0244
10489i0253A89597a63991A07195M2403J0346a29393B64666f2311p0656D11730
10478C65882K07245j81343A10659J5357E4633F047c9858m4607j16788E5431P7587
$$ plain form
10559 -5086 327655 67119 -227030 -234581 -1664 90020 -248948 -223430 111962 -73008 -6551 -270531
10547 -270531 -244464 -79203 -130718 -188249 -117742 162803 -125770 53 -68313 -126057 -40003 324507
10534 -142434 4827 62025 208229 8325 -20618 -69232 17727 -139889 -194464 -51160 -357043
10523 -357043 80465 -176910 43276 -178993 -106250 -25589 284530 101699 25907 -168624
10512 -67407 -118009 23649 -119139 -59287 -140330 152991 -7646 -27134 -204371 -190399 165034
10500 -141006 109909 146320 -162646 -396702 -134043 34218 54041 -148469 -245556 -30244
10489 -90253 189597 -163991 107195 149598 159944 -129393 264666 -62311 -132967 411730
10478 365882 573127 391784 110659 126016 54633 6047 -39858 -84465 -201253 55431 133018
10467A33018c91669J50056o8505f1555j14399A96175C1315R690J57146b24533
10456c32952a46604q6749d799j32017A59343a26035F8764J34290C3674L48597
10446C82271f65p7694m5511B04713G4326a10948A06933a58933H1522J40409c01537
10434A24764Q4117b12630q696L1289G3408b0602A05818J46024a98552A59745K3095
10423A82840a5711B29046o3359b66808b9279n1551H1851h3072p773j63961B365
10411b6875A53735c1124E5449a24374G179K09994A0713i4617l8126p4943J8253
10400a89433I7589a904B69954a1031l86899a14771d875q7408A04584g9500B86364
10388B77610J4672E6527J03792J33505q6171M8678A8420g7220E9570J64900N2575
$$ plain form
10467 133018 -391669 -241613 -310118 -61555 -175954 196175 31315 41005 198151 -224533
10456 -332952 -146604 -233353 -4799 -136816 159343 -126035 68764 203054 33674 382271
10446 382271 -665 -78359 -123870 204713 74326 -110948 106933 -158933 81522 221931 -301537
10434 124764 208881 -212630 -221326 -190037 73408 -20602 105818 251842 -198552 159745 182840
10423 182840 -15711 229046 165687 -266808 -29279 -80830 81851 -83072 -90845 -254806 2365
10411 -26875 153735 -31124 55449 -124374 7179 217173 10713 -94617 -132743 -207686 -189433
10400 -189433 97589 -1904 269954 -11031 -397930 -114771 -4875 -92283 104584 -79500 286364
10388 277610 292282 56527 160319 293824 207653 256331 18420 -77220 59570 224470 277045
10377B77045M5542A20416K12478j20580L23001A45350k9179N7370J7967m059K41069
10366D28518A94290J25177L31437I4821M99152G3473L97372A95114q6077j6202
10356I2835J09621K87303A98289J83138J35133B22535M95110k91090A32719J78801
10346C11520r7487K69354A36721J76190o9072A00123M72964B20960J64177j1813
10336C73324j42970J18476j47893E1385R9478E6038K81608j46462h452A0534c35270
10324B40744j02711a91495C24294j1189a5328k4407B39747b69656F7422K70278
10314C37700@b25844A00218K18105j07960p2099n5583k101d9278A88482f2034
10302B37341j2194b44033d7822G793b25348A58729L2450B6610N84c45443P4304
$$ plain form
10377 277045 322587 120416 332894 212314 535315 145350 116171 173541 191508 187449 428518
10366 428518 194290 319467 650904 94821 593973 73473 470845 195114 109037 92835
10356 92835 202456 489759 198289 381427 516560 222535 717645 426555 132719 311520
10346 311520 214033 483387 136721 312911 243839 100123 573087 220960 385137 373324
10336 373324 230354 348830 200937 51385 150863 56038 337646 191184 -8452 10534 -335270
10324 240744 138033 -191495 324294 313105 -15328 -39735 239747 -269656 67422 337700
10314 337700 0 -225844 100218 318323 210363 138264 82681 80580 -49278 188482 -62034
10302 237341 225147 -244033 -47822 7793 -225348 158729 191179 26610 27194 -345443 -271139
10291b71139J26314D16229b9857k30211D5597a39348c0185B70554a91202h328
10280c44729J27596H5349a19592F9301J29235c51136M4461a50042A48337b6912
10269a42509B00943d831C8278M1322d10669H0997R7983h656A47904K75625K31056
10258F54585B71665R7154A29783J28674o7760F7736J50136k2956l2455c35884
10247i9441B71302i8564A62464a13509A00537P4495i6956c7192k90124A82370
10236B8405g1096F0904I226J43003g6761j20996L0302A03132N2058a1041k78050
10225b89091M9509B22066H6662c36590a45478b4947r4021K7589j89438a17257
10214b45967A37097a58040f7962B26989r662M6724g2828B81863a63159A48491
$$ plain form
10291 -271139 -144825 416229 -29857 -260068 45597 -139348 -30185 270554 -191202 -8328
10280 -344729 -217133 85349 -119592 69301 198536 -351136 -306675 -150042 148337 -26912
10269 -142509 200943 -4831 38278 79600 -410669 80997 178980 -8656 147904 423529 654585
10258 654585 271665 368819 129783 258457 190697 67736 217872 194916 162461 -335884
10247 -99441 271302 -98564 162464 -113509 100537 175032 -96956 -37192 -327316 182370
10236 28405 -71096 60904 9226 152229 -76761 -197757 -167455 103132 155190 -11041 -289091
10225 -289091 -239582 222066 86662 -336590 -145478 -24947 -118968 -91379 -280817 -117257
10214 -245967 137097 -158040 -67962 226989 217327 264051 -72828 281863 -163159 148491
10203H3563a58566j10651A46656c81387g6109j13731r0924b0156l0091A61630
10192a83391j85133a46637A20931c83847I4013a6298I7232H139a4572m25638g1203
10180A85349a51881A03474Q4033E7878a41831k33050A39550b38675B54541F2366
10169A5640P8508J0861b88579h4644j52110J10030L0986j44711a13667h754j01446
10158a10200n1525p7833b8528M482A87093h3548j54264l7057O5941B67732G1522
10146d9590k07196m184D7281L9877h372A24544d16146I3102R3885c83030d5509
10134a56176e383j05300L4419k94259I3526b47899A3289h4787E2407J29712E3930
10122a00233k64189a7264A8381e6063n543B63664a13906l01376H8168d2870a7033
$$ plain form
10203 83563 -158566 -269217 146656 -381387 -76109 -189840 -280764 -20156 -50247 161630
10192 -183391 -368524 -146637 120931 -383847 94013 -16298 97232 8139 -14572 -440210 -71203
10180 185349 -151881 103474 187507 57878 -141831 -374881 139550 -238675 254541 62366
10169 15640 94148 105009 -288579 -84644 -236754 -126724 -95738 -240449 -113667 -8754 -110200
10158 -110200 -161725 -239558 -28528 -24046 187093 -83548 -237812 -274869 -208928 267732 71522
10146 -49590 -256786 -260970 47281 87158 -8372 124544 -416146 93102 186987 -383030 -45509
10134 -156176 -5383 -110683 -76264 -370523 93526 -247899 13289 -84787 52407 182119 53930
10122 -100233 -364422 -17264 18381 -56063 -61606 263664 -113906 -415282 88168 -42870 -17033
10110A19441d9841K2493k40944l3375O8974N4809j38214a42940b6511A24830b61646
10098a08771n9271J4088B7414i5105L361C12139a1598p63j95084P1417L071p7962
10086b10919j51384G8566a30365M8146J9484B5678i0938k3235G730J51803a21821
10074c4740o9761A80897a57988I6324b19257j47174C01483a43329l00567A3189
10063b83451j11922c2274G6084h2205J389H0211a58133G2563f840j75688P3159
10052a09369L808k36269a0327j59108H436R2d5667A4190R4117K54490a96773G926
10039G058b57551A75848h8043B55995E6108e8515B52323B2935c82697i1752A4339
10027b4351i128j70313e8358k07241A58712a73846j27245e8856j66238B26493
$$ plain form
10110 119441 -49841 -27348 -268292 -301667 -232693 -177884 -316098 -142940 -26511 124830 -261646
10098 -108771 -168042 -153954 27414 -95105 -91744 312139 -11598 -12361 -207445 -136028 -132957 -210919
10086 -210919 -362303 78566 -130365 -82219 -62735 25678 -90938 -114173 7730 159533 -121821
10074 -34740 -104501 180897 -157988 96324 -219257 -366431 301483 -143329 -443896 13189
10063 -283451 -395373 -32274 76084 -82205 -80816 80211 -158133 72563 -6840 -182528 -109369
10052 -109369 -105561 -341830 -10327 -169435 8436 8528 -45667 14190 108307 362797 -196773 7926
10039 7058 -257551 175848 -88043 255995 56108 -58515 252323 22935 -382697 -91752 14339
10027 -24351 -9128 -179441 -58358 -265599 158712 -173846 -301091 -58856 -225094 226493
10016H9065b5025k57774d6292l36852G3492C6020c34364a4857L230j4473B3950
10004a67452A84167d5756B87098a14562J5490j3531C4139a19454G4246f0983A91088
9992g9966G7031b05314c2332k08067i2420A87878I2357f611j19543L6419K3443
9981f6292a3168j53526B3584f2010D0873Q0626f2807l7863D15126C5661b03627
9969a86580M4060j84138J27451O9593B71190l0667i4578B6376c78258B04961a26150
9957g0882p3146j8533a3512B59293d5485m2290K3761j54181A03233a12833m9r6641
9945b09523c21D0261J02691d16764A59454f9972F981a89206A4737a08894G3445
9933d18412a43981A83200b17623j49779H4570a66036D05257g3472G1374c06284
$$ plain form
10016 89065 -25025 -282799 -46292 -383144 73492 36020 -334364 -14857 -11627 -26100 23950
10004 -167452 184167 -45756 287098 -114562 -99072 -112603 34139 -119454 74246 -60983 191088
9992 -79966 77031 -205314 -32332 -240399 -92420 187878 92357 -6611 -126154 -89735 -66292
9981 -66292 -13168 -166694 23584 -62010 40873 121499 -62807 -100670 415126 35661 -203627
9969 -186580 -142520 -326658 -199207 -129614 271190 240523 -94578 26376 -378258 204961 -126150
9957 -70882 -144028 -162561 -13512 259293 -45485 -87775 -64014 -218195 103233 -112833 -112882 -209523
9945 -209523 -321 40261 142952 -416764 159454 -69972 6981 -189206 14737 -108894 73445
9933 -418412 -143981 183200 -217623 -367402 84570 -166036 405257 -73472 71374 -306284
9922B53299b50069e467G1847e8505A37587b2539B8790d1065k07454A47036f4447
9910a70922C7317d5276j44131C4558a54419C2506d9431k81176b8108j83478j97779
9899d09365A85681a04028o9645P7025A62318B4783f6486j47766N2301q5419D1481
9887b19822A38471E924J56767M9533g176H5078B7036b07674J4060D5664a02962
9875i7473G4150O1434A5122J89773a86234l5565h3050B7761R0806A8525L4839
9864E3364L49906b8555k4839D7362a3136k6956F0361A268a39560a4275l76869
9853c91144A54023d48909a25551B57934i8800C38844b90526B03873o9139a29301
9842C0153a58963F0565g2636A6564K079g6746A08305c74183K1730B40064a72846
$$ plain form
9922 253299 -250069 -5467 71847 -58505 137587 -22539 28790 -41065 -248519 147036 -64447
9910 -170922 37317 -45276 -189407 34558 -154419 32506 -49431 -330607 -28108 -211586 -409365
9899 -409365 185681 -104028 -173673 -96648 162318 24783 -66486 -214252 -161951 -247370 41481
9887 -219822 138471 5924 162691 212224 -7176 85078 27036 -207674 -193614 45664 -102962
9875 -97473 74150 135584 15122 204895 -186234 -221799 -83050 27761 118567 18525 53364
9864 53364 403270 -28555 -53394 47362 -13136 -40092 60361 1268 -139560 -14275 -391144
9853 -391144 154023 -448909 -125551 257934 -98800 338844 -290526 203873 134734 -129301
9842 30153 -158963 60565 -72636 16564 18643 -76746 108305 -374183 -352453 240064 -172846
9830a01274A83355a42275A12379j5625G978J20828n5688h5318j76405J25935P145
9819a28643E4284O2391a47440m3679L6227M877l03111a54489n6116j17625P4814
9808b53416E6031J97273A7687b45114i3440M5483k04401j1546e5929l59417B3886
9796H221L61145g5086C03446g4918j3689C8703K5778B6279i9883o5894j2698F5472
9783a99949a1552j71521o2948Q9710A4060a28725C44551c8337j44013g7858B67414
9771B26294e9784A71754a47685A99994G9252a34545m3579B2920a49725k48671
9761c98396J85770a2907l37848l7565a09519K8179A70896a69893A1551d0669o3598
9750a04267M5881A74466c671A63907E4287i4115H9008a14530m02611b00165L5739
$$ plain form
9830 -101274 183355 -142275 112379 96754 7978 128806 73118 -85318 -261723 -135788 -128643
9819 -128643 54284 116675 -147440 -191119 -154892 -150015 -453126 -154489 -210605 -328230 -253416
9808 -253416 56031 253304 17687 -245114 -93440 -47957 -252358 -263904 -55929 -415346 23886
9796 8221 369366 -75086 303446 -74918 -88607 38703 64481 26279 -99883 -165777 -178475 65472
9783 -199949 -11552 -183073 -246021 -156311 14060 -128725 344551 -38337 -182350 -77858 267414
9771 226294 -59784 171754 -147685 199994 79252 -134545 -178124 22920 -149725 -398396
9761 -398396 -212626 -12907 -350755 -388320 -109519 -81340 170896 -169893 11551 -40669 -104267
9750 -104267 -58386 174466 -3671 163907 54287 -94115 89008 -114530 -517141 -200165 -164426
9739a64426j61471J13621J04557j7767j5095B2509J66835f9417p096F8802Q1384
9728A50186c20772d5423j10843j4585o7550h9960q0301B01910b8607A95791o3513
9717A32278a42013l8878M7591K1109k76142J78120h6416I433J76398c4501k27296
9706b61797B13102A9176J0040a17297A73187d57183C12243h6549q14M0853F0362
9694d3511n1448p9207c7973l1j53623o450P9956N7451p9353e7708G4595i0838
9681B19879c8475d354A22611b68248A8429J1917b05037B20846c31149A26862c1267
9669f525A91361a35803C4602d0192A44437c44699e9472q4222o742K5032E9380
9657A93549A5927J30494a91981I2767L19566g3826j35963i6113A59773O5185h5822
$$ plain form
9739 -164426 -325897 -212276 -107719 -125486 -140581 22509 189344 -69417 -76513 68802 150186
9728 150186 -320772 -45423 -156266 -170851 -238401 -89960 -170261 201910 -28607 195791 132278
9717 132278 -142013 -180891 -133300 -112191 -388333 -210213 -86416 9433 185831 -34501 -261797
9706 -261797 213102 19176 29216 -117297 173187 -457183 312243 -86549 -87363 -46510 60362
9694 -43511 -94959 -174166 -37973 -38004 -191627 -198077 -118121 -60670 -140023 -57708 74595 -90838
9681 219879 -38475 -4354 122611 -268248 18429 30346 -205037 220846 -331149 126862 -31267
9669 -6525 191361 -135803 34602 -40192 144437 -344699 -59472 -143694 -150436 -125404 59380
9657 193549 15927 146421 -191981 92767 412333 -73826 -209789 -96113 159773 224958 -85822
9645B41232a80102c2737k82862a5136A8137p184N6354J86252h9698E9794c42219
9633b49875e3167r5479A6531d75588h6462j84287A2652a35400l43946b34177e2693
9621C7292A3265f735j59886O9221j58294h1357A35000a5490j90062j53237B158
9609D0806a56306B03565c34152J49730l6372F3227b05224A20582d5900k49828
9599b95728J22130P6720m8647f3561j67122D5021L00030a98677j1635i303j92592
9588b01895j77147g6299A1321K0340M5143J60542f6221j49390E1543j6341Q1799
9577A17001c09977A59685b64759H468a34519r4006L396B02033a16339E9705a02398
9565A38382m0416e5849B46219a68996F4253J2152a81347C4122A4076e5237a2462
$$ plain form
9645 241232 -180102 -32737 -315599 -15136 18137 10953 67307 253559 -89698 59794 -342219
9633 -249875 -53167 -148646 16531 -475588 -86462 -270749 12652 -135400 -479346 -234177 -52693
9621 37292 13265 -6735 -166621 -97400 -255694 -81357 135000 -15490 -205552 -358789 2158
9609 40806 -156306 203565 -334152 -184422 -220794 63227 -205224 120582 -45900 -295728
9599 -295728 -173598 -96878 -145525 -63561 -230683 45021 345051 -198677 -210312 -9303 -201895
9588 -201895 -379042 -76299 11321 31661 76804 237346 -66221 -215611 51543 35202 117001
9577 117001 -309977 159685 -264759 8468 -134519 -228525 -225129 202033 -116339 59705 -102398
9565 138382 97966 -55849 246219 -168996 64253 76405 -181347 34122 14076 -55237 -12462
9553a52121I085a4817C33482a20092j00903R4418q033A69045h8130B26297d37110
9541a52354h134C8745a95987P1288k05024h0729j44194B67884A01762i4180C0251
9529H8714B1845b52362A03363b33060J00870n9980A4740e4031j07879I9571J06843
9518B06414N664f2866k11852Q7772M2000A17327E0600c79176B49091k3691c06700
9506d7677K51J8771o733q1143r0472b5068j31795j44616F9241e5645B59138a50306
9493B00580H5894p358c5689F0915a801F1774O4246K63975a28973k83902a05753
9481a4900j42396b4608B79069c01818B28656C4052a66093l24365B7121a6105j90244
9470b06349j23167I7450O8953m9520Q4334I3779A8113N1289h1462E8219Q3372
$$ plain form
9553 -152121 9085 -14817 333482 -120092 -220995 -126577 -134610 169045 -88130 226297 -437110
9541 -152354 -8134 38745 -195987 -124699 -329723 -80729 -224923 267884 101762 -94180 30251
9529 88714 21845 -252362 103363 -233060 -132190 -192170 14740 -54031 -161910 99571 206414
9518 206414 212078 -62866 -274718 -186946 -144946 117327 50600 -379176 249091 225400 -306700
9506 -47677 -47426 -28655 -35388 -116531 -207003 -25068 -156863 -301479 69241 -55645 259138 -150306
9493 200580 85894 78536 -35689 60915 -1801 61774 126020 389995 -128973 -412875 -105753
9481 -14900 -157296 -24608 279069 -301818 228656 34052 -166093 -490458 27121 -16105 -206349
9470 -206349 -329516 97450 166403 116883 201217 93779 18113 69402 -81462 58219 141591
9459A41591P0689f3421C7891a24393n4740r6749E8118A8123f9660j58520L2375
9448a95805l29169F1540b3469B51552a27862e9830j60895Q3647N7849D5591i7952
9436B9349b39798M3846r9835f3755A71093N152a53011f5357k06987c9899k90j08827
9424a49016H7086M5554Q4480D0377a29663k19910A02340O9054K647a83504K4665
9413a58839C35376C0040a25977M910N1949C94202f9533q8161A69207c34241d2575
9401a7562k57178D9954B1866b59879A39540e6639b1340j62389B07747a64933j48349
9390c13282B8253a58405g563B9136a64802k3749b0840j32253g5804j03261M6168
9379a32897A17624b69583J33436J8429B21046b25592G6260l6507a64210A3694
$$ plain form
9459 141591 212280 -63421 37891 -124393 -179133 -275882 58118 18123 -69660 -228180 -195805
9448 -195805 -524974 61540 -23469 251552 -127862 -59830 -220725 -137078 -79229 45591 -97952
9436 29349 -239798 -195952 -295787 -63755 171093 176245 -153011 -65357 -272344 -39899 -40189 -149016
9424 -149016 87086 132640 217120 40377 -129663 -349573 102340 171394 174041 -183504 -158839
9413 -158839 335376 30040 -125977 -121067 -69118 394202 -69533 -157694 169207 -334241 -42575
9401 -17562 -274740 49954 21866 -259879 139540 -56639 -21340 -183729 207747 -164933 -313282
9390 -313282 28253 -158405 -7563 29136 -164802 -188551 -20840 -153093 -75804 -179065 -132897
9379 -132897 117624 -269583 -136147 -117718 221046 -225592 76260 39753 -164210 13694
9368a52402K6741A46121a14161j08115a279j43758A43082m5022f9331k58194A98437
9356c97142e4991A61465i3712A24606d60268H0639c48087J00453R0820A0151J82265
9345A92416d6650B3245a28085n4215f1228H3387b64999f5494C22774d2722o0928
9334a03650J599M0378j95826Q2320a28l09647J37298r5804P8076J7002j01857
9323b75060P6225P9159r5757j71124b0768q088A59957a06380C01179i5298b1528
9311e6155m0714B65698A32679J07337a48047f1244A95291a31552k57844a53058
9300a35199O0618k33724A82654L3160k1988H0293Q2302c6824a0119B2481K85319
9289C07800A09741b07689M422j05895B53207d5934C5990c29875C9270A6883d6318
$$ plain form
9368 -152402 -125661 146121 -114161 -222276 -1279 -145037 143082 98060 -69331 -327525 198437
9356 -397142 -54991 161465 -93712 124606 -460268 80639 -348087 -247634 -156814 10151 192416
9345 192416 -46650 23245 -128085 -182300 -61228 83387 -264999 -65494 322774 -42722 -103650
9334 -103650 -102051 -61673 -257499 -175179 -128 -309775 -172477 -268281 -190205 -173203 -275060
9323 -275060 -198835 -119676 -215433 -386557 -20768 -28856 159957 -106380 301179 -95298 -21528
9311 -56155 -96869 265698 132679 240016 -148047 -61244 195291 -131552 -389396 -153058
9300 -135199 -74581 -308305 182654 215814 193826 80293 162595 -36824 -10119 22481 307800
9289 307800 109741 -207689 -203267 -309162 253207 -45934 35990 -329875 39270 16883 -46318
9277b07946r5764L5490R5300A19491f6104G3453h8207q4913j38381f0842q9576
9266a50418E0939a14562B13081a16757I7794d770j79023m7156i2757A17394i4248
9254A8238J90109b02507A90005o2904f0353k70026b8879m48564b38535A56470
9243D1984f31108B33581E3342J41932i7358d1874j27705j19013a22039F7679a95499
9231E5218C720a04264B45698D5249a29369l4623j4335p1722i6422a2880j02738
9220a15618A26444a8065A22370i4820k12528g3875b4472B65689b61946A00227
9209G1613P6564a68472j97059n4623a0237j67527k19935a49091k66814i1794J768
9198i0026A03017J33323a32207j3752C00197a58373P6996k2283F3095N7342L04064
$$ plain form
9277 -207946 -303710 -268220 -172920 119491 -66104 73453 -88207 -173120 -311501 -60842 -150418
9266 -150418 50939 -114562 213081 -116757 97794 -4770 -183793 -230949 -92757 117394 -94248
9254 18238 208347 -202507 190005 127101 -60353 -330379 -28879 -477443 -238535 156470
9243 41984 -631108 233581 53342 195274 -97358 -41874 -169579 -288592 -122039 67679 -195499
9231 55218 3720 -104264 245698 45249 -129369 -163992 -178327 -250049 -96422 -12880 -115618
9220 -115618 126444 -18065 122370 -94820 -307348 -73875 -24472 265689 -261946 100227
9209 71613 148177 -168472 -365531 -420154 -10237 -177764 -397699 -149091 -415905 -91794 -90026
9198 -90026 103017 236340 -132207 -145959 300197 -158373 -81377 -103660 63095 120437 424501
9187D24501f9062j24683c5397n6945I3787a97502L5167i429j153j45254q3805
9176b39641c6119n0033Q154j16448B26800G4348a7609A03966D4813a18938I6033
9164h481D9801K99823C6710c03851C66298b021E9996a25748A23344c95539a68628
9152C2168K36614G8807a59402N0455A33637F3926c6788j7635k28245a8624A2540
9140g3909a8777c622D2709a37258d3270m9867A5029a69945D7283J87687F1237
9128A1235a99481m1032A10702b83991m8994G5281a19225n1854n5940J08750B8368
9116a89536J3694a1742j14225p3233G5988b26959J10226m9991F2510J13867a43451
9104a1824q6864k63126B8598a62170m2809A10K60883j19023e9936m7198q1859
$$ plain form
9187 424501 -69062 -193745 -35397 -92342 93787 -197502 -162335 -9429 -10582 -155836 -239641
9176 -239641 -36119 -86152 -77998 -194446 226800 74348 -17609 103966 44813 -118938 96033
9164 -8481 49801 349624 36710 -303851 366298 -2021 59996 -125748 123344 -395539 -168628
9152 32168 268782 78807 -159402 -108947 133637 63926 -36788 -54423 -282668 -18624 12540
9140 -73909 -18777 -3622 42709 -137258 -43270 -93137 15029 -169945 47283 234970 61237
9128 11235 -199481 -240513 110702 -283991 -332985 75281 -119225 -171079 -227019 -118269 28368
9116 -189536 -175842 -11742 -125967 -199200 75988 -226959 -116733 -166724 62510 176377 -143451
9104 -11824 -98688 -361814 28598 -162170 -204979 110 260993 141970 -59936 -107134 -188993
9093a88993f9019D08005b99086N1199j73097B51648b60792g4439k42828B3265
9082a626r8391A60074c15685a22179j88895B9630a07469k85944C0489g137k00752
9071b07889N7944h180j29041A08112J3617K2072g8796B21277j1278d9464j78662
9060b28126b4664k38380c5125A5966K90338a00056j27345A53882e8868D5942a68650
9048A42717D7982J91217a55102M9003G792b29297n3166B45914g6322C0492h3614
9036b27066P2113A98235a64912a9935E9219J67829b19015A2257e1032p1748J561
9025a21219j67353R4022k8022c7562j07793j9601j28353l320R2030E7363i3603
9013e4504A06352A0056h4628B56324h8417a8214A40396b12078f535A73d1446A94232
$$ plain form
9093 -188993 -69019 408005 -299086 -247887 -420984 251648 -260792 -74439 -317267 23265
9082 -1626 -100017 160074 -315685 -122179 -311074 29630 -107469 -393413 30489 -7137 -207889
9071 -207889 -149945 -8180 -137221 108112 121729 143801 -78796 221277 209999 -49464 -228126
9060 -228126 -24664 -263044 -35125 15966 306304 -100056 -227401 153882 -58868 45942 -168650
9048 142717 47982 239199 -155102 -106099 7792 -229297 -282463 245914 -76322 30492 -83614
9036 -227066 -154953 198235 -164912 -19935 59219 227048 -219015 12257 -51032 -122780 -121219
9025 -121219 -288572 -194550 -222572 -37562 -145355 -164956 -293309 -296629 -204599 57363 -93603
9013 -54504 106352 10056 -84628 256324 -88417 -18214 140396 -212078 -6535 173 -41446 194232
9000G9285J14145b68165b7161G3465c6896j21549D4587B846J79976b30411B73166
8988B12124c37285E6903J3202k4490o811d21108A27008C2644d72486f653B31395
8976i8187n5000J2005B01485i6669k63310d6252j2092j81510C9744R4225a11079
8964F058L2305a98980Q7228n3994e2086i616j56493A78227C5390p59b31557O5677
8952a65880O7795C46276a43922b0233o7635A52438b1751j35083O0478J3357D240
8940a64589A89448i9855j83860C96320b34011A54432a42263D175J66172p7507
8930I2840c1934A18349M0760a80472C59990A48849C9435L07738Q78642K095162
8920C320977A163249B77405p9473F3549A0432b8067k63585J42676M0133F0930
$$ plain form
9000 79285 193430 -268165 -27161 73465 -36896 -158445 44587 2846 182822 -230411 273166
8988 212124 -337285 56903 70105 45615 38804 -421108 127008 32644 -472486 -6653 231395
8976 -98187 -153187 -141182 201485 -96669 -359979 -46252 -58344 -239854 39744 133969 -111079
8964 6058 38363 -198980 -111752 -165746 -52086 -9616 -166109 178227 35390 34631 -231557 -165880
8952 -165880 -98085 346276 -143922 -20233 -87868 152438 -21751 -156834 -96356 -82999 4240
8940 -164589 189448 -99855 -283715 396320 -234011 154432 -142263 4175 170347 92840
8930 92840 -31934 118349 159109 -180472 359990 148849 39435 347173 1225815 3320977
8920 3320977 1163249 277405 197932 63549 10432 -28067 -291652 -148976 -108843 60930
8909G9892R7818k1158c91423E009b08693j37284K3618g225j64780o5631A37994
8897H2243a85030e5856j2834n6575k5501d8898A23380c37325A02484b01711A42453
8885f7511j19181A18653a23341d6225A63854c1901k65006j39809a16749B06716
8874A54419g2162o5108H6511a30647b1380o0631I7631f3544j35376L8919N8198
8863a01803F3244g9091k47413h1434j10660Q4729F2731a33852q0288F1377K50869
$$ plain form
8909 79892 177710 156552 -391423 5009 -208693 -345977 -322359 -7225 -172005 -237636 137994
8897 82243 -185030 -55856 -68690 -125265 -150766 -48898 123380 -337325 102484 -201711 142453
8885 -67511 -186692 118653 -123341 -46225 163854 -31901 -296907 -436716 -116749 206716
8874 154419 -72162 -137270 86511 -130647 -21380 -82011 97631 -63544 -198920 -160001 -101803
8863 -101803 63244 -79091 -326504 -81434 -192094 -107365 62731 -133852 -214140 61377 312246
$$ [...]
##END NTUPLES=NMR SPECTRUM
##END=
