##TITLE=AC1755_VAR00027_9319777_qAtLbfTzhX
##JCAMPDX= 6.0         $$ Bruker NMR JCAMP-DX V2.0
##DATA TYPE= NMR SPECTRUM
##DATA CLASS= NTUPLES
##ORIGIN= BRUKER
##OWNER= Administrator
$$ 1.72 TOPSPIN		Version 2.1
$$ 2015-08-11 21:55:18.554 -0700  Administrator@X
$$ Compression mode = diff/dup
##.OBSERVE FREQUENCY= 400.02188249412
##.OBSERVE NUCLEUS= ^1H
##.ACQUISITION MODE= SIMULTANEOUS (DQD)
##.ACQUISITION SCHEME= undefined
##.AVERAGES= 64
##.DIGITISER RES= 22
##SPECTROMETER/DATA SYSTEM= spect
##.PULSE SEQUENCE= noesygpps1d.comp
##.SOLVENT NAME= COFFEE_meoh
##.SHIFT REFERENCE= INTERNAL, COFFEE_meoh, 1, 14.96069
##AUDIT TRAIL= $$ (NUMBER, WHEN, WHO, WHERE, PROCESS, VERSION, WHAT)
$$ ##TITLE= Audit trail, TOPSPIN		Version 2.1
$$ ##JCAMPDX= 5.01
$$ ##ORIGIN= Bruker BioSpin GmbH
$$ ##OWNER= Administrator
$$ $$ E:\/data/COFFEE/nmr/AC1755_VAR00027_9319777_qAtLbfTzhX/12/pdata/1/auditp.txt
$$ ##AUDIT TRAIL=  $$ (NUMBER, WHEN, WHO, WHERE, PROCESS, VERSION, WHAT)
(   1,<2015-08-11 21:55:13.039 -0700>,<Administrator>,<X>,<go>,<TOPSPIN 2.1>,
      <created by zg
	started at 2015-08-11 21:43:43.367 -0700,
	POWCHK enabled, PULCHK disabled,
       configuration hash MD5:
       21 0F 79 D6 B3 7B B4 F6 88 20 88 DB 03 48 BD 9F
       data hash MD5: 64K
       CB 50 AF 57 FD D2 27 BE 11 A7 92 1C B6 62 44 35>)
(   2,<2015-08-11 21:55:16.445 -0700>,<Administrator>,<X>,<proc1d>,<TOPSPIN 2.1>,
      <Start of raw data processing
       efp LB = 0.3 FT_mod = 6 PKNL = 1 PHC0 = 0 PHC1 = 0 SI = 128K 
       data hash MD5: 128K
       81 57 B4 FF 1E 1D 20 36 2B EC 15 84 EC C3 65 36>)
(   3,<2015-08-11 21:55:17.335 -0700>,<Administrator>,<X>,<proc1d>,<TOPSPIN 2.1>,
      <pk PHC0 = 269.9615 PHC1 = 0 
       data hash MD5: 128K
       38 FC 7C ED 7A 03 B9 60 FF E6 9A E8 1F 07 4D F9>)
(   4,<2015-08-11 21:55:17.726 -0700>,<Administrator>,<X>,<proc1d>,<TOPSPIN 2.1>,
      <abs ABSG = 1 
       data hash MD5: 128K
       B2 50 4B 22 C6 3A 83 41 43 53 19 C8 CA 08 94 F5>)
(   5,<2015-08-11 21:55:17.835 -0700>,<Administrator>,<X>,<proc1d>,<TOPSPIN 2.1>,
      <abs ABSG = 2 
       data hash MD5: 128K
       D9 D5 57 12 88 F4 D4 E3 6E 98 00 09 A5 4D 98 5B>)
(   6,<2015-08-11 21:55:17.929 -0700>,<Administrator>,<X>,<proc1d>,<TOPSPIN 2.1>,
      <abs ABSG = 3 
       data hash MD5: 128K
       F1 86 94 93 78 4F 7E EB 6B 8C 94 D9 B4 32 BB 05>)
(   7,<2015-08-11 21:55:18.007 -0700>,<Administrator>,<X>,<proc1d>,<TOPSPIN 2.1>,
      <abs ABSG = 4 
       data hash MD5: 128K
       A5 17 8B 1D A5 89 ED 11 8E 8D 3D 71 9D AA 0D 27>)
(   8,<2015-08-11 21:55:18.101 -0700>,<Administrator>,<X>,<proc1d>,<TOPSPIN 2.1>,
      <abs ABSG = 5 
       data hash MD5: 128K
       BF A0 11 0E 42 6C 4B 0E DE F7 D8 55 59 D7 A1 21>)
$$ ##END=
$$ 
$$ $$ hash MD5
$$ $$ 1A CE E4 A5 FB 7C 71 CD 58 58 4E FC 56 CF C8 5D
##$RELAX= 
##$RELAX= 
##$RELAX= 
##$RELAX= 
##$RELAX= 
##$RELAX= 
##$RELAX= 
##$RELAX= 
$$ Bruker specific parameters
$$ --------------------------
##$DU= <E:\>
##$EXPNO= 12
$$ [...]
##$TP07= 0
##$TPNAME0= <>
##$TPNAME1= <>
##$TPNAME2= <>
##$TPNAME3= <>
##$TPNAME4= <>
##$TPNAME5= <>
##$TPNAME6= <>
##$TPNAME7= <>
##$TPOAL= (0..7)
0.5 0.5 0.5 0.5 0.5 0.5 0.5 0.5
##$TPOFFS= (0..7)
0 0 0 0 0 0 0 0
##$TUNHIN= 0
##$TUNHOUT= 0
##$TUNXOUT= 0
##$USERA1= <user>
##$USERA2= <user>
##$USERA3= <user>
##$USERA4= <user>
##$USERA5= <user>
##$V9= 5
##$VALIST= <valist>
##$VCLIST= <CCCCCCCCCCCCCCC>
##$VD= 0
##$VDLIST= <DDDDDDDDDDDDDDD>
##$VPLIST= <PPPPPPPPPPPPPPP>
##$VTLIST= <TTTTTTTTTTTTTTT>
##$WBST= 2048
##$WBSW= 25
##$XGAIN= (0..3)
0 0 0 0
##$XL= 0
##$YL= 0
##$YMAX_a= 6198996
##$YMIN_a= -11833835
##$ZGOPTNS= <>
##$ZL1= 120
##$ZL2= 120
##$ZL3= 120
##$ZL4= 120
##$ABSF1= 14.96069
##$ABSF2= -5.597492
##$ABSG= 5
##$ABSL= 3
##$ALPHA= 0
##$AQORDER= 0
##$ASSFAC= 0
##$ASSFACI= 0
##$ASSFACX= 0
##$ASSWID= 0
##$AUNMP= <proc_prof1d_extract.lims>
##$AXLEFT= 0
##$AXNAME= <>
##$AXNUC= <1H>
##$AXRIGHT= 0
##$AXTYPE= 0
##$AXUNIT= <>
##$AZFE= 0.1
##$AZFW= 0.1
##$BCFW= 0
##$BC_mod= 0
##$BYTORDP= 0
##$COROFFS= 0
##$CY= 15
##$DATMOD= 1
##$DC= 0
##$DFILT= <>
##$DTYPP= 0
##$F1P= 0
##$F2P= 0
##$FCOR= 0.5
##$FTSIZE= 131072
##$FT_mod= 6
##$GAMMA= 0
##$GB= 0
##$INTBC= 1
##$INTSCL= 1
##$ISEN= 128
##$LB= 0.3
##$LEV0= 0
##$LPBIN= 0
##$MAXI= 10000
##$MC2= 0
##$MEAN= 0
##$ME_mod= 0
##$MI= 0
##$NCOEF= 0
##$NC_proc= -2
##$NLEV= 6
##$NOISF1= 0
##$NOISF2= 0
##$NSP= 0
##$NTH_PI= 0
##$NZP= 0
##$OFFSET= 14.96069
##$PC= 1
##$PHC0= 269.9615
##$PHC1= 0
##$PH_mod= 1
##$PKNL= yes
##$PPARMOD= 0
##$PPDIAG= 0
##$PPIPTYP= 0
##$PPMPNUM= 2147483647
##$PPRESOL= 1
##$PSCAL= 4
##$PSIGN= 0
##$PYNMP= <proc.py>
##$REVERSE= no
##$SF= 400.020009762217
##$SI= 131072
##$SIGF1= 0
##$SIGF2= 0
##$SINO= 400
##$SIOLD= 131072
##$SPECTYP= <>
##$SREGLST= <1H.CDCl3>
##$SSB= 0
##$STSI= 131072
##$STSR= 0
##$SW_p= 8223.68421052631
##$SYMM= 0
##$S_DEV= 0
##$TDeff= 65536
##$TDoff= 0
##$TI= <>
##$TILT= no
##$TM1= 0
##$TM2= 0
##$TOPLEV= 0
##$USERP1= <user>
##$USERP2= <user>
##$USERP3= <user>
##$USERP4= <user>
##$USERP5= <user>
##$WDW= 1
##$XDIM= 131072
##$YMAX_p= 404979213
##$YMIN_p= -11828
##$CURPLOT= <Network HP LaserJet P1505>
##$CURPRIN= <$Network HP LaserJet P1505>
##$DFORMAT= <normdp>
##$LAYOUT= <+/1D_H.xwp>
##$LFORMAT= <normlp>
##$PFORMAT= <normpl>
##$SURQMSG= 1
$$ End of Bruker specific parameters
$$ ---------------------------------
##NTUPLES= NMR SPECTRUM
##VAR_NAME=  FREQUENCY,     SPECTRUM/REAL,   SPECTRUM/IMAG
##SYMBOL=    X,             R,               I
##VAR_TYPE=  INDEPENDENT,   DEPENDENT,       DEPENDENT
##VAR_FORM=  AFFN,          ASDF,            ASDF
##VAR_DIM=   131072,        131072,          131072
##UNITS=     HZ,            ARBITRARY UNITS, ARBITRARY UNITS
##FACTOR=    0.0627417313425164, 1,          1
##FIRST=     8223.62146879497, 1484,         -56368
##LAST=      0,             2703,            -56375
##MIN=       0,             -11828,          0
##MAX=       8223.62146879497, 404979213,    0
$$ Real data points
##PAGE= N=1
##DATA TABLE= (X++(R..R)), XYDATA
$$ [...]
63881F50538j5794j3718j0827p647n052l291j863k50J646L788O257Q949J1391
63868F24127J3222J4576J5705J6580J7263J8293K0013K1718K2284K1615K0640
63857H26036J9799J8455J6146J3473J1132Q828N966K754k26l156o653j0445j3413
63844H88696j5124j6467j8427k0857k2890k4146k5059k6187k7450k8135k7570
63833F36384k5904k4079k2940k2469k2066k1304k0124j8523j6600j4834j3737
63822D13804j3188j2530j1411j0141r109q287p433o459n449m557l976l765l616
63809C13883l102k215j385r55q89j038j322j611j799k035k574l257l525l092k348
63794B82736j938k190k968l800m116l692k970k575k480k062j084j09K38km29q73
$$ y = [650538, 634744, 621026, 610199, 602552, 597500, 594209, 592346, 592096, 593742, 597530, 603787, 612736, 624127, 637349, 651925, 667630, 684210, 701473, 719766, 739779, 761497, 783781, 805396, 826036, 845835, 864290, 880436, 893909, 905041, 913869, 919835, 922589, 922363, 919207, 912554, 902109, 888696, 873572, 857105, 838678, 817821, 794931, 770785, 745726, 719539, 692089, 663954, 636384, 610480, 586401, 563461, 540992, 518926, 497622, 477498, 458975, 442375, 427541, 413804, 400616, 388086, 376675, 366534, 357425, 349138, 341705, 335246, 329797, 325240, 321264, 317499, 313883, 310781, 308566, 307181, 306226, 305337, 304299, 302977, 301366, 299567, 297532, 294958, 291701, 288176, 285084, 282736, 280798, 278608, 275640, 271840, 267724, 264032, 261062, 258487, 256007, 253945, 252861, 252752, 252990, 252988, 252559, 251686]
63778B51686j333j667j679j354q03j66K95L15n8m67p51j002j135q28j89J34j75
63761B40823n70m49J3L07L84M31K46m67j364j730j398p76p3P91J559J664J186
63744B40577J006J714K746L092K500J648J326J816K864L933M458M175L316K391
63730B77562J854J903K454L224L905M342M541M525M282L978L958M394M949M976
63716C30847M152K809J587P89J99n10j385k258l054l814m433m666m359l561k401
63701C09942j100l3M78N76P92J407K124K501K463K280K200K328K666L041L117
63686C34782K655J801J047Q94J390J897J497P1j194r69N38J745J734J295J505
63671C50688K157K377K196K362K888K912K103J168P15L86m08j633k892m085n262
$$ y = [251686, 250353, 248686, 247007, 245653, 244850, 244684, 244979, 245294, 245236, 244769, 244018, 243016, 241881, 241053, 240864, 240998, 240823, 240253, 239804, 239817, 240124, 240508, 240939, 241185, 240718, 239354, 237624, 236226, 235450, 235377, 236168, 237727, 239391, 240577, 241583, 243297, 246043, 249135, 251635, 253283, 254609, 256425, 259289, 263222, 267680, 271855, 275171, 277562, 279416, 281319, 283773, 286997, 290902, 295244, 299785, 304310, 308592, 312570, 316528, 320922, 325871, 330847, 334999, 337808, 339395, 340184, 340383, 339873, 338488, 336230, 333176, 329362, 324929, 320263, 315904, 312343, 309942, 308842, 308809, 309287, 309863, 310655, 312062, 314186, 316687, 319150, 321430, 323630, 325958, 328624, 331665, 334782, 337437, 339238, 340285, 341179, 342569, 344466, 345963, 346034, 344840, 343871, 344409, 346154, 347888, 349183, 350688, 352845, 355222, 357418, 359780, 362668, 365580, 367683, 368851, 369566, 369952, 369544, 367911, 365019, 360934, 355672]
63656C55672o191o569o431n989n288m369l568l258l336l220k451j159K6N16L13
63641C04698M5L01J020J693K129K613L271L782L929L976M209M490M653M931N549
63626C51289O162O367O560P567R402J1105J2063J2841J4232J6037J7432J8265
63614D89322J9268K0966K3024K4945K6810K8951L1181L2869L3618L3542L2799
63603G97295L1165K8207K3715J7983J1818O255J986r54k909m157m923n708p054
63590H92719q974j1007j3000j5389j8438k1594k4024k5532k6483k6965k6561k5039
63578F49713k2918k1014j9560j7987j5647j2676r883p762n887l592j000J136K454
63565E15377L332M176N016N921P089Q284Q913R055R654J1171J2887J4265J6045
$$ y = [355672, 349481, 342912, 336481, 330492, 325204, 320835, 317267, 314009, 310673, 307453, 305002, 303843, 303869, 304385, 304698, 304743, 305044, 306064, 307757, 309886, 312499, 315770, 319552, 323481, 327457, 331666, 336156, 340809, 345740, 351289, 357451, 363818, 370378, 377945, 387347, 398452, 410515, 423356, 437588, 453625, 471057, 489322, 508590, 529556, 552580, 577525, 604335, 633286, 664467, 697336, 730954, 764496, 797295, 828460, 856667, 880382, 898365, 910183, 916438, 918424, 917470, 914561, 910404, 905481, 899773, 892719, 883745, 872738, 859738, 844349, 825911, 804317, 780293, 754761, 728278, 701313, 674752, 649713, 626795, 605781, 586221, 568234, 552587, 539911, 530028, 522266, 516379, 512787, 511787, 512923, 515377, 518709, 522885, 527901, 533822, 540911, 549195, 558108, 567163, 576817, 587988, 600875, 615140, 631185]
63552F31185J9010K2424K5072K7305L0544L4885L8852M1574M3512M4458M2551
63541A001372L6357K6953J6841P627k60o400j0217j1795j1839j0964r660q698
63529A019317q824j0143j2380j5477j9356k3520k7496l1367l5082l7604l7765
63518G60303l5901l3647l2024l0607k8693k6349k3954k1501j8916j6542j4731
63507D77438j3345j2081j0990j0236r539q376o721n265m729n034n211m345k600
63494C78966j165r18j419j524q20J01O54Q98J077J158J154J425K175K982L217
63479C87961K799K242K058K351K836L112K972K532J905Q47q69k727l694l461k905
63464C97959k905l167k887k174j950k476k861k308j153k27K69P30J283J664J888
$$ y = [631185, 650195, 672619, 697691, 724996, 755540, 790425, 829277, 870851, 914363, 958821, 1001372, 1037729, 1064682, 1081523, 1089150, 1088890, 1082490, 1072273, 1060478, 1048639, 1037675, 1028015, 1019317, 1010493, 1000350, 987970, 972493, 953137, 929617, 902121, 870754, 835672, 798068, 760303, 724402, 690755, 658731, 628124, 599431, 573082, 549128, 527627, 508711, 492169, 477438, 464093, 452012, 441022, 430786, 421247, 412871, 406150, 400885, 396156, 391122, 385911, 381566, 378966, 377801, 376883, 375464, 373940, 373120, 373221, 373875, 374773, 375850, 377008, 378162, 379587, 381762, 384744, 387961, 390760, 393002, 395060, 397411, 400247, 403359, 406331, 408863, 410768, 411615, 410746, 408019, 404325, 400864, 397959, 395054, 391887, 389000, 386826, 384876, 382400, 379539, 377231, 376078, 375851, 376120, 376850, 378133, 379797, 381685]
63449C81685K483L755N218O144O520P107Q458J0213J1581J2360J3155J4552J6474
63436D99705J8564K0950K4158K8214L2107L4341L3884L0691K5672K0341J6115
63425G84742J3430J1607R938Q912R856J3255J7938K2328K6063K9860L3936L7236
63413A019101L8357L6760L2819K7117K0134J2509N170r63n428q392j0326j1486
63401A155372j1794j1536j1825j3876j7624k1695k5022k7943l1235l4647l7137
63390I11038l8229l8320l7662l5892l2840k9160k5749k2949k0552j8246j5825
63379E95614j3228j0644q321o133l652q47J717L578M985O510Q364J0414J2528
63366F00885J4569J6313J7777J9381K1398K3475K5192K6868K9233L2368L5520
$$ y = [381685, 384168, 387923, 393141, 399285, 405805, 412912, 421370, 431583, 443164, 455524, 468679, 483231, 499705, 518269, 539219, 563377, 591591, 623698, 658039, 691923, 722614, 748286, 768627, 784742, 798172, 809779, 819717, 828629, 838485, 851740, 869678, 892006, 918069, 947929, 981865, 1019101, 1057458, 1094218, 1127037, 1154154, 1174288, 1186797, 1191967, 1191004, 1185576, 1177184, 1166858, 1155372, 1143578, 1132042, 1120217, 1106341, 1088717, 1067022, 1042000, 1014057, 982822, 948175, 911038, 872809, 834489, 796827, 760935, 728095, 698935, 673186, 650237, 629685, 611439, 595614, 582386, 571742, 563421, 557288, 553636, 552789, 554506, 558084, 563069, 569579, 577943, 588357, 600885, 615454, 631767, 649544, 668925, 690323, 713798, 738990, 765858, 795091, 827459, 862979]
63355H62979L8003L9654M0274L9227L6040L1080K5185J8867J2245N684Mm129o828
63342A138285q766j0381j1572j2284j3123j4993j8008k1247k3843k5999k8529
63331I49540l1520l4041l5161l4750l3199l0747k7529k3868k0115j6255j2106
63320F50249p965m797l507m146n966q312j1144j4490j7635j9377j9267j8126j7062
63307D98455j6324j5500j4387j3061j1406r310p273o012n427m720l680k978k943
63294C85434k963k608k477l132l948l993l507l453l898l992l461k980k926k791
63280C39305k237j714j625j646j426j274j518j762j510j029q79q71k61J063K288
63265C24904K624K087J260P00O51J031J590K201K933L705M093L817L297L290M004
$$ y = [862979, 900982, 940636, 980910, 1020137, 1056177, 1087257, 1112442, 1131309, 1143554, 1149238, 1149242, 1145113, 1138285, 1129519, 1119138, 1107566, 1095282, 1082159, 1067166, 1049158, 1027911, 1004068, 978069, 949540, 918020, 883979, 848818, 814068, 780869, 750122, 722593, 698725, 678610, 662355, 650249, 642284, 637487, 633980, 629834, 623868, 615556, 604412, 589922, 572287, 552910, 533643, 515517, 498455, 482131, 466631, 452244, 439183, 427777, 418467, 411194, 405182, 399755, 395035, 391355, 388377, 385434, 382471, 379863, 377386, 374254, 370306, 366313, 362806, 359353, 355455, 351463, 348002, 345022, 342096, 339305, 337068, 335354, 333729, 332083, 330657, 329383, 327865, 326103, 324593, 323564, 322685, 321814, 321553, 322616, 324904, 327528, 329615, 330875, 331575, 332226, 333257, 334847, 337048, 339981, 343686, 347779, 351596, 354893, 358183, 362187]
63250C62187M877N269N112M859M991N615O350O733O826P236Q341R730J0860J1884
63236D60870J3318J5023J6245J6801J7441J8790K0444K1563K1975K2241K2794
63225F67505K3458K3713K3266K2401K1897K2434K3864K5273K5929K5963K5957
63214I31660K6044K5715K4417K1992J8640J4707J0502O122J385l878r439j4670
63202A053197j9022k2342k4771k6371k6950k6292k4553k2357k0351j8597j6517
63191H05074j3553r806n996k785j67K483N697R291J2548J5035J7017J8927K0806
63178H74571K2551K4357K6359K8006K8485K7852K7078K6812K6717K6241K5391
63167A164420K4336K2749K0048J5955J0495L863l263r818j5347k0529k6092l1585
$$ y = [362187, 367064, 372333, 377445, 382304, 387295, 392910, 399260, 405993, 412819, 420055, 428396, 438126, 448986, 460870, 474188, 489211, 505456, 522257, 539698, 558488, 578932, 600495, 622470, 644711, 667505, 690963, 714676, 737942, 760343, 782240, 804674, 828538, 853811, 879740, 905703, 931660, 957704, 983419, 1007836, 1029828, 1048468, 1063175, 1073677, 1079799, 1081184, 1077306, 1067867, 1053197, 1034175, 1011833, 987062, 960691, 933741, 907449, 882896, 860539, 840188, 821591, 805074, 791521, 781715, 775719, 772934, 772767, 775250, 780947, 790238, 802786, 817821, 834838, 853765, 874571, 897122, 921479, 947838, 975844, 1004329, 1032181, 1059259, 1086071, 1112788, 1139029, 1164420, 1188756, 1211505, 1231553, 1247508, 1258003, 1261866, 1258603, 1248785, 1233438, 1212909, 1186817, 1155232]
63155A155232l5938l8837m0791m2007m2146m1144l9413l7122l4086l0567k7471
63144G45710k5317k3667k1841j9720j7513j5300j3136j1203r507p845o313n358
63132E68990n022m641l616k120o54O28J718K425K766L309M462N756O409O363O151
63117E92924N900N204L992K850K297K224K181J894J354P40L07J50M8k08m80n04
63101F20873m01n13q40j036r41p23n00k72k05m90r08r89p49p00j008j153p18o6
63083F08661J76l0j71J81J022K013K735L046L323L998M832N143M940N136O232
63068F51237P443P854P884Q693J0460J2246J3579J5055J7199J9563K1507K3151
63056H15871K5033K7312K9815L2545L5586L8759M1783M4566M7039M8944N0243
$$ y = [1155232, 1119294, 1080457, 1039666, 997659, 955513, 914369, 874956, 837834, 803748, 773181, 745710, 720393, 696726, 674885, 655165, 637652, 622352, 609216, 598013, 588506, 580661, 574348, 568990, 563968, 559327, 555711, 553591, 552937, 553565, 555283, 557708, 560474, 563783, 568245, 574001, 580410, 586773, 592924, 598824, 604028, 608020, 610870, 613167, 615391, 617572, 619466, 620820, 621560, 621867, 622017, 622065, 621857, 621377, 620873, 620472, 619959, 619119, 618083, 617142, 616419, 615919, 615647, 615442, 614952, 614044, 613055, 612306, 611606, 610598, 609445, 608727, 608661, 608837, 608807, 608636, 608817, 609839, 611852, 614587, 617633, 620956, 624954, 629786, 634929, 639869, 645005, 651237, 658680, 666534, 674418, 683111, 693571, 705817, 719396, 734451, 751650, 771213, 792720, 815871, 840904, 868216, 898031, 930576, 966162, 1004921, 1046704, 1091270, 1138309, 1187253, 1237496]
63045A237496N1383N2716N3911N4477N4711N5393N6598N7480N7377N6593N5899
63034A844034N5737N6066N6411N5820N3227M8382M2015L4738K6200J5805L920
63023B292355q315k0157l1638m2670n2458n9983o4746o6901o7030o5775o3422
63012A749260n9699n4410m8192m2087l6209k9543k1376j2460m135L169R957J6514
63000A470789K2537K7827L2590L6882M0371M2903M4816M6421M7634M8387M8980
62989A910137M9672N0212N0120M9207M7421M4433L9832L3657K6312J7912Q170
62978B327085k999j5023k7086l8729m9841o0153o9010p5710p9970q1969q2101
62967A744494q0736p8243p4957p1025o6425o1359n6532n2606m9411m6066m2128
$$ y = [1237496, 1288879, 1341595, 1395506, 1449983, 1504694, 1560087, 1616685, 1674165, 1731542, 1788135, 1844034, 1899771, 1955837, 2012248, 2068068, 2121295, 2169677, 2211692, 2246430, 2272630, 2288435, 2292355, 2284040, 2263883, 2232245, 2189575, 2137117, 2077134, 2012388, 1945487, 1878457, 1812682, 1749260, 1689561, 1635151, 1586959, 1544872, 1508663, 1479120, 1457744, 1445284, 1441149, 1444318, 1454275, 1470789, 1493326, 1521153, 1553743, 1590625, 1630996, 1673899, 1718715, 1765136, 1812770, 1861157, 1910137, 1959809, 2010021, 2060141, 2109348, 2156769, 2201202, 2241034, 2274691, 2301003, 2318915, 2327085, 2324086, 2309063, 2281977, 2243248, 2193407, 2133254, 2064244, 1988534, 1908564, 1826595, 1744494, 1663758, 1585515, 1510558, 1439533, 1373108, 1311749, 1255217, 1202611, 1153200, 1107134, 1065006]
62956A065006l8229l5306l3412l1711k9600k7385k5796k5064k4652k3811k2271
62945G47769k0462j9000j7980j6937j5536j4048j2935j2150j1238j0018q853q212
62933E80400q194q408q194p083n333l841l229l180l043k770k710k735k417k003
62919E17260k208k850k727j376j8J3r67j762k129k687l387l442k802k466k917
62904D85535l342k953k232k081k377k260j514q37p29q41o01m0K97J00k83k17M65
62887D66090J178J186M58l43p28q89j193j482j266m87K76M74K10P3L66O52K66
62870D64841p38j453j203m33j04l82n56k74n2l03m88R5J200J911J795J241P42
62853D65839M20K57L33O99J313K045K655K823K495K009J618J139L85l37o33p15
$$ y = [1065006, 1026777, 991471, 958059, 926348, 896748, 869363, 843567, 818503, 793851, 770040, 747769, 727307, 708307, 690327, 673390, 657854, 643806, 630871, 618721, 607483, 597465, 588612, 580400, 572206, 563798, 555604, 548521, 543188, 539347, 536118, 532938, 529895, 527125, 524415, 521680, 519263, 517260, 515052, 512202, 509475, 508099, 508081, 508094, 507127, 505365, 503236, 500549, 497162, 493720, 490918, 488452, 485535, 482193, 479240, 477008, 474927, 472550, 470290, 468776, 467939, 467210, 466369, 465768, 465728, 466025, 466125, 465842, 465625, 466090, 467268, 468454, 468912, 468569, 467841, 466952, 465759, 464277, 463011, 462524, 462800, 463274, 463484, 463557, 463923, 464575, 464841, 464103, 462650, 461447, 461014, 460910, 460528, 459972, 459698, 459646, 459343, 458855, 458950, 460150, 462061, 463856, 465097, 465839, 466259, 466516, 466849, 467548, 468861, 470906, 473561, 476384, 478879, 480888, 482506, 483645, 484030, 483693, 483060, 482345]
62837D82345j078j597j577p93J11M36K07oK46R51J643J722J111M92N71J188J709
62820D87681K146L070M331M811L921K558J982K304K709K743K669K835L356M152
62806E31268M802M617L560K790L518N427P058P711Q091Q900R769J0096J0157J0662
62792F28426J1690J2823J4161J6386J9739K3582K7189L0610L4370L8710M3415
62781I01101M8351N3680N9482O5383P0731P5144P8727Q1832Q4593Q6533Q6646
62770A692203Q4051P8801P1795O3623N3760M1426K7031J2111k328j6576l0992
62759B074905m4655n6007o4448p0537p4889p7617p8862p9009p8224p6374p3675
62748A300608p0773o7855o4262n9473n4017m8867m4293l9838l5345l1358k8337
$$ y = [482345, 481267, 479670, 478093, 477300, 477411, 477847, 478054, 478048, 478294, 479245, 480888, 482610, 483721, 484213, 484784, 485972, 487681, 489827, 492897, 497228, 502039, 505960, 508518, 510500, 512804, 515513, 518256, 520925, 523760, 527116, 531268, 536070, 540687, 544247, 547037, 550555, 555982, 563040, 570751, 578842, 587742, 597511, 607607, 617764, 628426, 640116, 652939, 667100, 683486, 703225, 726807, 753996, 784606, 818976, 857686, 901101, 949452, 1003132, 1062614, 1127997, 1198728, 1273872, 1352599, 1434431, 1519024, 1605557, 1692203, 1776254, 1855055, 1926850, 1990473, 2044233, 2085659, 2112690, 2124801, 2122473, 2105897, 2074905, 2030250, 1974243, 1909795, 1839258, 1764369, 1686752, 1607890, 1528881, 1450657, 1374283, 1300608, 1229835, 1161980, 1097718, 1038245, 984228, 935361, 891068, 851230, 815885, 784527, 756190]
62737G56190k5955k3498k0811j8430j6763j5355j3365j0717q362p047o221m742
62725E84924k504n83K68N59J136K069K983L925N145O428P414Q380R951J2151J4497
62710F56743J6973K0077K3743K7108K9773L2514L6221M0654M4987M9128N3777
62699A031698N9293O5242P1091P6772Q2298Q7327R1383R4210R5641R5326R2816
62688A943097Q7870Q0449P0498N7929M2950K6318R117p865k4451m0634n5766o8555
62676B120957p8052q4521q9035r2291r4114r4036r1991q8305q3413p7833p2160
62665A175206o6827o1799n6740n1463m6172m1340l7364l4222l1420k8451k5359
62654F94049k2648k0529j8654j6737j5101j4170j3666j2900j1796j0937j0461
$$ y = [756190, 730235, 706737, 685926, 667496, 650733, 635378, 622013, 611296, 602934, 595887, 589666, 584924, 582420, 581837, 582105, 582664, 583800, 585869, 588852, 592777, 597922, 604350, 611764, 620144, 630095, 642246, 656743, 673716, 693793, 717536, 744644, 774417, 806931, 843152, 883806, 928793, 977921, 1031698, 1090991, 1156233, 1227324, 1304096, 1386394, 1473721, 1565104, 1659314, 1754955, 1850281, 1943097, 2030967, 2111416, 2181914, 2239843, 2282793, 2309111, 2318228, 2310363, 2285912, 2245278, 2189512, 2120957, 2042905, 1958384, 1869349, 1777058, 1682944, 1588908, 1496917, 1408612, 1325199, 1247366, 1175206, 1108379, 1046580, 989840, 938377, 892205, 850865, 813501, 779279, 747859, 719408, 694049, 671401, 650872, 632218, 615481, 600380, 586210, 572544, 559644, 547848, 536911, 526450]
62643E26450r651p984o077m932m601m244l423k547j983j421n35K77L67k69j027
62628D78400j533j907k228k274j949j583j476j450j091l09N92J293J677J843K138
62613D70143K977M325N479N842N787O256P325P955P514O946P674R741J1882J3391
62599E73237J4899J7199K0112K3055K5970K9051L2040L4600L7013L9737M2352
62588H89265M3723M3246M1268L8189L3962K8595K2432J5589P797p00q712j5209
62576A139445k0453k5331k9914l3500l5831l7353l8240l7972l6343l4120l2251
62565G78137l0830k9334k7525k5599k3592k1226j8412j5505j2972j1040r703q826
62553E43573q108p223o160n302m933m750m189l225k504k438k424j503L18J906
$$ y = [526450, 516799, 508815, 502738, 497806, 493205, 488961, 485538, 482991, 481008, 479587, 479052, 479329, 479696, 479427, 478400, 476867, 474960, 472732, 470458, 468509, 466926, 465450, 464000, 462909, 462600, 463192, 464485, 466162, 468005, 470143, 473120, 477445, 482924, 488766, 494553, 500809, 508134, 516089, 523603, 530549, 538223, 547964, 559846, 573237, 588136, 605335, 625447, 648502, 674472, 703523, 735563, 770163, 807176, 846913, 889265, 932988, 976234, 1017502, 1055691, 1089653, 1118248, 1140680, 1156269, 1164066, 1163366, 1154654, 1139445, 1118992, 1093661, 1063747, 1030247, 994416, 957063, 918823, 880851, 844508, 810388, 778137, 747307, 717973, 690448, 664849, 641257, 620031, 601619, 586114, 573142, 562102, 552399, 543573, 535465, 528242, 522082, 516780, 511847, 507097, 502908, 499683, 497179, 494741, 492317, 490814, 491132, 493038]
62539D93038K321J793J132P38O19R44J795K636K805K503K633L589M977O556Q579
62524E36658J0864J2514J3213J4038J6212J9565K3013K6127K9338L2858L6422
62513G70822M0026M4006M8265N2187N5432N8104O0008O0468N9193N6571N2818
62502A357900M7485M0307L1917K3274J4784O586p95o569j0316j1970j1492q979
62490A472132m912J65O081J2805J9950K6994L3800M0575M7302N3563N8670O1608
62478A828733O1071N6252M7732L7252K6455J5914N183o611k0050l4813m9574o2767
62466A904777p3493q1599q7154r0321r1549r1329q9619q6015q0579p4083o7344
62455I91692o0648n3973m7387m1003l4961k9603k5328k2025j8948j5510j1998
$$ y = [493038, 495359, 497152, 498284, 499022, 499641, 500585, 502380, 505016, 507821, 510324, 512957, 516546, 521523, 528079, 536658, 547522, 560036, 573249, 587287, 603499, 623064, 646077, 672204, 701542, 734400, 770822, 810848, 854854, 903119, 955306, 1010738, 1068842, 1128850, 1189318, 1248511, 1305082, 1357900, 1405385, 1445692, 1477609, 1500883, 1515667, 1522253, 1521458, 1514889, 1504573, 1492603, 1481111, 1472132, 1467220, 1467385, 1473466, 1486271, 1506221, 1533215, 1567015, 1607590, 1654892, 1708455, 1767125, 1828733, 1889804, 1946056, 1993788, 2031040, 2057495, 2073409, 2078592, 2071981, 2051931, 2017118, 1967544, 1904777, 1831284, 1749685, 1662531, 1572210, 1480661, 1389332, 1299713, 1213698, 1133119, 1059036, 991692, 931044, 877071, 829684, 788681, 753720, 724117, 698789, 676764, 657816, 642306, 630308]
62444F30308r250p674o822n811m059j744L82J654K082K173K262K306K257K229
62430F10293K100J377k10k274m193n752p025p878q060p745p528p790q256q379
62416E38680p945p216o567o176n954n689n160m264l207k518k631l345l892l771
62402D70345l262k863k512j797p88l8K95P33J607K465K711K450K317K681L334
62387D77678L771L592K794J958J794K387L143L677M293N259O178O543O573O817
62373E36457P301P636P811Q205Q909R763J0957J2906J5469J7996K0274K2749K5693
62360G12126K8848L2141L6039M0788M5938N0965N5793O0152O3025O3539O1985
62349A251339N9209N5251M9432M1695L2990K4153J5163N902l013j0734j7208k3157
$$ y = [630308, 621058, 613384, 606562, 600751, 596692, 594948, 595330, 596984, 599066, 601239, 603501, 605807, 608064, 610293, 612393, 613770, 613560, 611286, 607093, 601341, 594316, 586438, 578378, 570633, 563105, 555315, 547059, 538680, 530735, 523519, 516952, 510776, 504822, 499133, 493973, 489709, 486502, 483984, 481353, 478008, 474116, 470345, 467083, 464220, 461708, 459911, 459123, 459085, 459380, 460113, 461720, 464185, 466896, 469346, 471663, 474344, 477678, 481449, 485041, 487835, 489793, 491587, 493974, 497117, 500794, 505087, 510346, 516524, 523067, 529640, 536457, 543758, 551394, 559205, 567410, 576319, 586082, 597039, 609945, 625414, 643410, 663684, 686433, 712126, 740974, 773115, 809154, 849942, 895880, 946845, 1002638, 1062790, 1125815, 1189354, 1251339, 1310548, 1365799, 1415231, 1456926, 1489916, 1514069, 1529232, 1535134, 1532121, 1521387, 1504179, 1481022]
62337A481022k9120l4894l9846m3473m5634m6533m6562m5921m4373m1541l7646
62326A025479l3678l0627k8592k6930k5213k3760k3046k2871k2466k1477k0450
62315G46369k0158k0550k0688j9775j8046j6393j5233j4030j2113r703p755o821
62303E65104o467n979n253m601l950k803j088M96J252J312J390J952K920M081
62289E48366N300O325O822O801O787P269Q105Q735Q887Q826Q845Q850Q594Q088
62275F56600P537O989O345N700N385N571O017O403O710P145P815Q713J0038J2219
62261G59187J5498J9533K3612K7387L1346L6390M2770M9548N5290N9322O2053
62250A181936O3925O4402O2340N7210M9661M0829L1429K1679J1758K023p182j5713
$$ y = [1481022, 1451902, 1417008, 1377162, 1333689, 1288055, 1241522, 1194960, 1149039, 1104666, 1063125, 1025479, 991801, 961174, 932582, 905652, 880439, 856679, 833633, 810762, 788296, 766819, 746369, 726211, 705661, 684973, 665198, 647152, 630759, 615526, 601496, 589383, 579680, 571925, 565104, 558637, 552658, 547405, 542804, 538854, 536051, 534963, 535459, 536711, 538023, 539413, 541365, 544285, 548366, 553666, 559991, 566813, 573614, 580401, 587670, 595775, 604510, 613397, 622223, 631068, 639918, 648512, 656600, 664137, 671126, 677471, 683171, 688556, 694127, 700144, 706547, 713257, 720402, 728217, 736930, 746968, 759187, 774685, 794218, 817830, 845217, 876563, 912953, 955723, 1005271, 1060561, 1119883, 1181936, 1245861, 1310263, 1372603, 1429813, 1479474, 1520303, 1551732, 1573411, 1585169, 1587192, 1580010, 1564297]
62238A564297k3637l1183l8566m5606n1500n5332n6998n7401n7430n6947n5141
62227A034556n1738m7373m2722l7972l3339k9440k6522k3841k0593j7182j4720
62216F89114j3444j2459j1104r631q283o748m979l766l702m219m327l789k904
62203E99759j677j8J612K708L565M719N796N929N272N035N823O951P660Q068Q501
62188F69703Q750Q585Q424Q825R745J0792J1749J2409J2296J1189R640Q457P820
62175G98384P297O575N844N616O428Q510J1456J4541J7589K1239K6010L1468L6675
62162I97632M1097M4590M6855M7549M6667M4310M0185L4023K6418J8679J1743
62151A399748N609j79o068j2404j9154k5529l0502l3845l6230l8111l9114l8877
$$ y = [1564297, 1540660, 1509477, 1470911, 1425305, 1373805, 1318473, 1261475, 1204074, 1146644, 1089697, 1034556, 982818, 935445, 892723, 854751, 821412, 791972, 765450, 741609, 721016, 703834, 689114, 675670, 663211, 652107, 642476, 634193, 627445, 622466, 618700, 614998, 610779, 606452, 602663, 599759, 598082, 598064, 599676, 602384, 605949, 610668, 616464, 622393, 627665, 632700, 638523, 645474, 653134, 661202, 669703, 678453, 687038, 695462, 704287, 714032, 724824, 736573, 748982, 761278, 772467, 782107, 790564, 798384, 805681, 812256, 818100, 823716, 830144, 838654, 850110, 864651, 882240, 903479, 929489, 960957, 997632, 1038729, 1083319, 1130174, 1177723, 1224390, 1268700, 1308885, 1342908, 1369326, 1388005, 1399748, 1405357, 1405178, 1399110, 1386706, 1367552, 1342023, 1311521, 1277676, 1241446, 1203335, 1164221, 1125344]
62139A125344l7815l6473l4590l1584k7725k4067k1166j8578j5874j3413j1669
62128H52390j0337q774p106o112o010o024n384m136k630q02J492L719N031N246
62114H10563M881M235L013J050j161k903l828m009l711l325l170l262l469l939
62100G90965m890o005o589o442n987n330l985j948j98M89O34J211K193K921L492
62085G60531M700O670Q509R591J0330J1443J3053J4852J6570J8041J9164K0105
62073I13559K1199K2477K3609K4376K4812K4894K4508K3850K3423K3520K4146
62062A174373K5448K7580K9948L1230L0568K8240K4916K0771J5824J0595N744
62051A425237J319l078p571j2061j6742k1983k7635l3008l7618m1491m4653m6760
$$ y = [1125344, 1087529, 1051056, 1016466, 984882, 957157, 933090, 911924, 893346, 877472, 864059, 852390, 842053, 833279, 826173, 820061, 814051, 808027, 802643, 798507, 795877, 795075, 796567, 800286, 805317, 810563, 815444, 819679, 822692, 823742, 822581, 819678, 815850, 811841, 808130, 804805, 801635, 798373, 794904, 790965, 786075, 780070, 773481, 767039, 761052, 755722, 751737, 749789, 749591, 750080, 750714, 751925, 754118, 757039, 760531, 765231, 771901, 780410, 790001, 800331, 811774, 824827, 839679, 856249, 874290, 893454, 913559, 934758, 957235, 980844, 1005220, 1030032, 1054926, 1079434, 1103284, 1126707, 1150227, 1174373, 1199821, 1227401, 1257349, 1288579, 1319147, 1347387, 1372303, 1393074, 1408898, 1419493, 1425237, 1426556, 1423478, 1415907, 1403846, 1387104, 1365121, 1337486, 1304478, 1266860, 1225369, 1180716, 1133956]
62039A133956m7514m7108m6051m4657m2896m0637l7919l4973l2048k9223k6382
62028G04548k3456k0583j7968j5641j3513j1542r782q346p472p400p996q574q464
62015E43811p734p007o589o102n193m135l362k724j724m37L62K08k87n9J179K694
61999E02901L614L789L748M051M780N462N483M698L655K985K670K143J042m93
61985E50528k289m343o396p825q359q460q573q428p671o782o573o927o858n923
61971D55121m809m255m043l525k648k012k085k670l080k695j570n00k15n21n74
61956D19919l0O19R43J105J287J274J084J319K301L369L808M052N077O882Q468
61941D61477R320R998J1098J2435J3583J4554J5445J5965J5731J4828J3737J2905
$$ y = [1133956, 1086442, 1039334, 993283, 948626, 905730, 865093, 827174, 792201, 760153, 730930, 704548, 681092, 660509, 642541, 626900, 613387, 601845, 592063, 583717, 576245, 568845, 560849, 552275, 543811, 536077, 529070, 522481, 516379, 511186, 507051, 503689, 500965, 499241, 498804, 499166, 499374, 499087, 499028, 500207, 502901, 506515, 510304, 514052, 518103, 522883, 528345, 533828, 538526, 542181, 545166, 547836, 549979, 551021, 550528, 548239, 543896, 537500, 529675, 521316, 512856, 504283, 495855, 488184, 481402, 474829, 467902, 461044, 455121, 450312, 446057, 442014, 438489, 435841, 433829, 431744, 429074, 425994, 423299, 421729, 421229, 421014, 420493, 419919, 419889, 420508, 421451, 422556, 423843, 425117, 426201, 427520, 429821, 433190, 436998, 441050, 446127, 453009, 461477, 470797, 480795, 491893, 504328, 517911, 532465, 547910, 563875, 579606, 594434, 608171, 621076]
61929F21076J2608J2802J2898J2024R970P542N602L990J917p90l405n234o253
61916F84747o730o726o264n524m555l020o71K119M675O765Q652J0395J1565J1828
61902G07256J1386J0623R533P880N640L018Q6l088o051q141r200r693r974r774
61888F99501q758p265o080n560n387n190n067n347o084o968p717q388r245j0348
61874F02097j1304j1516j0730r282p785o665n980n542n035m131k660p34J306L034
61860E25073M098M519M852N870P812J0141J2211J4023J6043J8415K0686K2348
61848F66091K3336K3923K4303K4464K4272K3650K2618K1156J8982J5643J1072
61837H99510N947J263k459n259p193q157q263p932p292n893l372j51K880N263
$$ y = [621076, 633684, 646486, 659384, 671408, 681378, 688920, 694522, 698512, 700429, 699639, 696234, 691000, 684747, 678017, 671291, 665027, 659503, 654948, 651928, 651257, 653376, 658051, 664816, 673468, 683863, 695428, 707256, 718642, 729265, 738798, 746678, 752318, 755336, 755422, 752334, 746283, 738142, 728942, 719249, 709275, 699501, 690743, 683478, 677398, 671838, 666451, 661261, 656194, 650847, 644763, 637795, 630078, 621690, 612445, 602097, 590793, 579277, 568547, 559265, 551480, 544815, 538835, 533293, 528258, 524127, 521467, 520733, 522039, 525073, 529171, 533690, 538542, 544412, 552224, 562365, 574576, 588599, 604642, 623057, 643743, 666091, 689427, 713350, 737653, 762117, 786389, 810039, 832657, 853813, 872795, 888438, 899510, 905457, 906720, 904261, 899002, 891809, 883652, 875389, 867457, 860165, 854272, 850900, 850749, 853629, 858892]
61823H58892P164Q728R719R859R164P745N516K339j673o111j0438j4061j6443
61810H70400j7433j7497j7384j7526j7813j7921j7656j6946j5781j4357j3126
61799F86960j2517j2519j2680j2474j1664j0398r112q241p809p350o385n069m088
61786E66654l855m006l889l350k831k703k833k844k621k414k446k566k390j774
61772E26132j023n07j89K68R07J308J161P86Q47J618K765L836M653N182N313M989
61756E58046M485M330M779N401N288L861J477q48k387l251l915m522m905n124
61742E62715n482n965o059n409m347l543l253l221l184l091k858k273j312k85
61728E12433M78R41J223J336J273J221J376J634J650J253O16L5k25P7R65J962
$$ y = [858892, 866056, 874784, 884503, 894362, 903526, 911271, 916787, 919126, 917453, 911342, 900904, 886843, 870400, 852967, 835470, 818086, 800560, 782747, 764826, 747170, 730224, 714443, 700086, 686960, 674443, 661924, 649244, 636770, 625106, 614708, 605596, 597355, 589546, 582196, 575811, 570742, 566654, 562799, 558793, 554904, 551554, 548723, 546020, 543187, 540343, 537722, 535308, 532862, 530296, 527906, 526132, 525109, 524602, 524413, 524681, 525588, 526896, 528057, 528843, 529690, 531308, 534073, 537909, 542562, 547744, 553057, 558046, 562531, 566861, 571640, 577041, 582329, 586190, 587667, 586819, 584432, 581181, 577266, 572744, 567839, 562715, 557233, 551268, 545209, 539800, 535453, 531910, 528657, 525436, 522252, 519161, 516303, 514030, 512718, 512433, 512911, 513852, 515075, 516411, 517684, 518905, 520281, 521915, 523565, 524818, 525434, 525469, 525244, 525321, 526286, 528248]
61712E28248K319J750P29r8n51p90r08j002j402k317l389m018m120m080m038l822
61696E02511l579l818m540m970m549l745l357l434l451l236l127l242l279l064
61682D51120k827k806k950l075k990k452j392k72K13j00o54q85p79n86m11k81
61666D28873l33n85p65o00j65L00P25J144J460J555J567J805K425L310M205M780
61650D49701M688L782K382J101L94K90N34Q08Q90P53N70N97J028J904K967L532
61634D75921K879J064p46j255m33M02N5j317k635l231l360l522l808m043m198
61619D51773m324m296l927l311k781k487k294k143k286k925l752m127l749l008
61605D06363k611k897l584m093m078l636l070k491j838j225j091j726k726l249
$$ y = [528248, 530567, 532317, 533046, 532948, 532397, 531607, 530699, 529697, 528295, 525978, 522589, 518571, 514451, 510371, 506333, 502511, 498932, 495114, 490574, 485604, 481055, 477310, 473953, 470519, 467068, 463832, 460705, 457463, 454184, 451120, 448293, 445487, 442537, 439462, 436472, 434020, 432628, 432356, 432569, 432469, 431815, 430930, 430151, 429565, 429154, 428873, 428540, 427955, 427190, 426590, 426425, 426725, 427450, 428594, 430054, 431609, 433176, 434981, 437406, 440716, 444921, 449701, 454389, 458171, 460553, 461654, 462048, 462338, 462872, 463680, 464570, 465323, 465893, 466490, 467518, 469422, 472389, 475921, 478800, 479864, 479118, 477863, 477430, 477832, 477887, 476570, 473935, 470704, 467344, 463822, 460014, 455971, 451773, 447449, 443153, 439226, 435915, 433134, 430647, 428353, 426210, 423924, 420999, 417247, 413120, 409371, 406363, 403752, 400855, 397271, 393178, 389100, 385464, 382394, 379903, 378065, 376840, 375749, 374023, 371297, 368048]
61591C68048k920k224j849j840j715j293j052j440k154k380j743p05L1L17M90
61576C47571P03O72J84m15n59j83J65L5l78n47l33n9L0J43N29R74J023O56M00
61557C50611O53J223J703K052K421K574K031Q52j60k77L60J025J254J110P89L76
61541C68597k5k13j13J20L50O88J350K262K971L035K561K107J982J812J096J3
61525C88593p44r99j303j970k475k246j593j200j093q34n50q21j542j806j183
61510C68234l74j02j03K36P57Q19L45j52m14o04o68k42O65J434J595J335J126
61493C73887J139J312J653K113K410K249J717J200R83J046J155J098R09R96J778
61478C95645L066L924L548K233J172J237K114K750K486J560O00j06p05j284j599
$$ y = [368048, 365128, 362904, 361055, 359215, 357500, 356207, 355155, 353715, 351561, 349181, 347438, 346733, 346764, 347081, 347571, 348274, 348946, 349130, 348715, 348156, 347973, 348138, 348173, 347795, 347248, 346915, 346856, 346886, 347029, 347558, 348532, 349555, 350211, 350611, 351264, 352487, 354190, 356242, 358663, 361237, 363268, 364120, 363960, 363683, 364043, 365068, 366322, 367432, 368221, 368597, 368572, 368359, 368246, 368366, 368716, 369404, 370754, 373016, 375987, 379022, 381583, 383690, 385672, 387484, 388580, 388593, 387849, 386850, 385547, 383577, 381102, 378856, 377263, 376063, 374970, 374136, 373586, 372765, 371223, 369417, 368234, 367860, 367758, 367655, 367891, 368648, 369467, 369812, 369660, 369246, 368642, 367974, 367732, 368397, 369831, 371426, 372761, 373887, 375026, 376338, 377991, 380104, 382514, 384763, 386480, 387680, 388663, 389709, 390864, 391962, 392871, 393867, 395645, 398711, 402635, 406183, 408416, 409588, 410825, 412939, 415689, 418175, 419735, 420335, 420229, 419524, 418240, 416641]
61463D16641j400r07o50q42j162j243j134j058r37n18R5M25K70RL9J52j56q97
61445D06727j409j139l60J32q2n77o19kQ03J312J544J737J862J764J658J933K410
61428D17694K327J405M34L05P86Q64K21l21O7J180K115K270J780J217J083J412
61412D34839J699J398N84j20k75l9K61M56L07n07j808k746k714k129j840j984
61396D25382j976j475p70k11J90N17P42Q62Q97O99J51l86k94N03J337J614J466
61379D29248J410J650K042K434K742K837K643K317K127K185K400K611K725K796
61365D62167K977L266L328K817K002J650K146K889K888J900P50N56J723L595N071
61350D99725N702O099P061Q290Q544P243N400M443M461M298L220J733P42M85O52
$$ y = [416641, 415241, 414334, 413684, 412842, 411680, 410437, 409303, 408245, 407308, 406790, 406885, 407310, 407580, 407589, 407628, 407780, 407624, 406727, 405318, 404179, 403819, 403951, 403869, 403292, 402673, 402671, 403474, 404786, 406330, 408067, 409929, 411693, 413351, 415284, 417694, 420021, 421426, 421860, 422165, 422951, 423815, 424036, 423715, 423782, 424962, 427077, 429347, 431127, 432344, 433427, 434839, 436538, 437936, 438520, 438400, 438125, 438086, 438347, 438803, 439110, 438603, 436795, 434049, 431335, 429206, 427366, 425382, 423406, 421931, 421161, 420950, 421140, 421657, 422399, 423261, 424158, 424857, 425008, 424622, 424328, 424831, 426168, 427782, 429248, 430658, 432308, 434350, 436784, 439526, 442363, 445006, 447323, 449450, 451635, 454035, 456646, 459371, 462167, 465144, 468410, 471738, 474555, 476557, 478207, 480353, 483242, 486130, 488030, 488780, 489336, 491059, 494654, 499725, 505427, 511526, 518587, 526877, 535421, 542664, 548064, 552507, 556968, 561266, 564486, 566219, 566961, 567446, 568098]
61335E68098R61J215J076L20q45k003k964l735m197m243m102m136m282m084l383
61320E33696k563j943j323m18O40J546K378L407M488N157N346N582O346P592R032
61305E78963J0540J2064J3378J4155J4154J3199J1220Q497N658L207J187n72k061
61292F83589l179l998m760n697o912q257r202r184q286p305o872o793o441n541
61278E91162m201k584r51K43P49Q82J090J388J631K002K713L378L388K808K326
61263F06024K426L077M118N319O203O499O747P633Q759Q964P918O504N330L933
61249F89454J935N7q54j153j862l190m341m678m421m230m478m983n238m982m567
61234F42469m414m210l283j805p96o10k91R25K390L114L263L630M089L896L184
$$ y = [568098, 569059, 570274, 571350, 571670, 570825, 568822, 565858, 562123, 557926, 553683, 549581, 545445, 541163, 537079, 533696, 531133, 529190, 527867, 527449, 528089, 529635, 532013, 535420, 539908, 545065, 550411, 555993, 562339, 569931, 578963, 589503, 601567, 614945, 629100, 643254, 656453, 667673, 676170, 681828, 685035, 686222, 685650, 683589, 680410, 676412, 671652, 665955, 659043, 650786, 641584, 632400, 624114, 616809, 609937, 603144, 596703, 591162, 586961, 584377, 583426, 583669, 584418, 585300, 586390, 587778, 589409, 591411, 594124, 597502, 600890, 603698, 606024, 608450, 611527, 615645, 620964, 627167, 633666, 640413, 648046, 656805, 665769, 673687, 680191, 685521, 689454, 691389, 691446, 690592, 689439, 687577, 684387, 680046, 675368, 670947, 666717, 662239, 657256, 652018, 647036, 642469, 638055, 633845, 630562, 628757, 627961, 627351, 627060, 627985, 630375, 633489, 636752, 640382, 644471, 648367, 651551]
61219F51551L030L887M993N523N483N235M908M580M432M440M340M104L885L475
61205G13866K476J213Q21J964L921N416N993O269P080Q733J0930J3111J4876J6197
61191H12866J7159J7579J7092J5615J3446J0905Q146N354K833Q35m85j054j104
61178I19187j286k116l362m384n074n907p089q240r093r867j0753j1547j2116
61165H28353j2735j3549j4118j3969j3311j2753j2522j2346j1955j1358j0653
61154F89084r840q807p401n610l709j991l62J467L214L952L087J089j092l019
61140F60062m744o103o642o232n329m464l751k979j961p50M27J458K580M160O158
61125F31890Q038R464J0772J2478J4473J6214J7562J8929K0529K1974K2869K3436
$$ y = [651551, 654581, 658468, 663461, 668984, 674467, 679702, 684610, 689190, 693622, 698062, 702402, 706506, 710391, 713866, 716342, 717555, 718376, 720340, 724261, 729677, 735670, 741939, 749019, 757752, 768682, 781793, 796669, 812866, 830025, 847604, 864696, 880311, 893757, 904662, 912808, 918162, 920995, 921830, 921345, 920291, 919187, 917901, 915785, 912423, 908039, 902965, 897058, 889969, 881729, 872636, 862769, 852016, 840469, 828353, 815618, 802069, 787951, 773982, 760671, 747918, 735396, 723050, 711095, 699737, 689084, 679244, 670437, 663036, 657426, 653717, 651726, 651364, 652831, 656045, 659997, 663084, 664173, 663081, 660062, 655318, 649215, 642573, 636341, 631012, 626548, 622797, 619818, 617857, 617107, 617534, 618992, 621572, 625732, 631890, 639928, 649392, 660164, 672642, 687115, 703329, 720891, 739820, 760349, 782323, 805192, 828628]
61113H28628K4227K5320K6109K5940K4813K3348K2149K1249K0238J8895J7469
61102A078385J6260J5034J3096R966N840J365k870o532r470j1713j3567j5511
61090A080283j7743j9904k1360k1827k1567k0958k0074j8903j7649j6518j5256
61079H68524j3426j1183r312q240p401o010m117k427j181J16J843L673N102O182
61065H22143P325Q663R926J0926J1814J2907J4414J6319J8345K0092K1364K2373
61053I96611K3475K4826K6404K8188L0044L1655L2930L4354L6378L8533L9818
61042A343216M0051M0118M0609M1018M0790M0349M0264M0058L8920L7149L5753
61031A778295L4823L3512L1614K9900K8663K7252K5376K3630K2161K0219J7839
$$ y = [828628, 852855, 878175, 904284, 930224, 955037, 978385, 1000534, 1021783, 1042021, 1060916, 1078385, 1094645, 1109679, 1122775, 1132741, 1138581, 1139946, 1137076, 1130544, 1121074, 1109361, 1095794, 1080283, 1062540, 1042636, 1021276, 999449, 977882, 956924, 936850, 917947, 900298, 883780, 868524, 855098, 843915, 834603, 826363, 818962, 812952, 808835, 806408, 805227, 805343, 807186, 810859, 815961, 822143, 829468, 838131, 848057, 858983, 870797, 883704, 898118, 914437, 932782, 952874, 974238, 996611, 1020086, 1044912, 1071316, 1099504, 1129548, 1161203, 1194133, 1228487, 1264865, 1303398, 1343216, 1383267, 1423385, 1463994, 1505012, 1545802, 1586151, 1626415, 1666473, 1705393, 1742542, 1778295, 1813118, 1846630, 1878244, 1908144, 1936807, 1964059, 1989435, 2013065, 2035226, 2055445, 2073284]
61020B073284J6723J8207K1392K4592K7881L2727L9706M8096N7458O8260Q0954
61009B509280R5993J14782J39629J72596K15336K69642L37160M19195N18270O38731
60999E430614P83483R50882J137123J337558J534847J681240J704576J552011
60991A6112334J238653Q49872M89942K26828Q0973M8015J09000K13472K72800
60982A9641889J97559m4002m03558p88641j119375j356531j492658j534261j495674
60973A1604748j398958j268668j124289r78521q40240p15560o06521n11939m30477
60964C729575l61829l05388k59582k22751j93320j69116j47926j29066j13176
60955A827421j00273q9134p8747o9186o0613n2647m5315l9538l5909l3727l1985
$$ y = [2073284, 2090007, 2108214, 2129606, 2154198, 2182079, 2214806, 2254512, 2302608, 2360066, 2428326, 2509280, 2605273, 2720055, 2859684, 3032280, 3247616, 3517258, 3854418, 4273613, 4791883, 5430614, 6214097, 7164979, 8302102, 9639660, 11174507, 12855747, 14560323, 16112334, 17350987, 18200859, 18690801, 18917629, 18998602, 19046617, 19155617, 19369089, 19641889, 19839448, 19795446, 19391888, 18603247, 17483872, 16127341, 14634683, 13100422, 11604748, 10205790, 8937122, 7812833, 6834312, 5994072, 5278512, 4671991, 4160052, 3729575, 3367746, 3062358, 2802776, 2580025, 2386705, 2217589, 2069663, 1940597, 1827421, 1727148, 1638014, 1559267, 1490081, 1429468, 1376821, 1331506, 1291968, 1256059, 1222332, 1190347]
60944A190347l0548k9700k9116k8173k6948k6071k5791k5753k5567k5097k4300
60933H93283k3244k2190k1277k0309j9109j7815j6536j4995j3089j1408j0588
60922G02723j0227r246p343n486m708m953n439n646n511n044m249l336k543j798
60908F27194q82J08Q36J219J499J790J944K028K415L137L494K789J179o17k255
60893F45878l877n330o019n712n037m878n576o878q345r503r937r643r123q835
60879E47185q677q252p511o795o277n725m939m198m057m586n034m478k935j446
60865D72275p91m50N83K174L119K824K132K084K621L047L105K961K651K284K408
60850E03027L417M796N615N607N162M445L244J680L54l29m94m60n60j188k512
$$ y = [1190347, 1159799, 1130099, 1100983, 1072810, 1045862, 1019791, 994000, 968247, 942680, 917583, 893283, 870039, 847849, 826572, 806263, 787154, 769339, 752803, 737808, 724719, 713311, 702723, 692496, 683250, 675907, 670421, 665713, 660760, 655321, 649675, 644164, 639120, 634871, 631535, 628992, 627194, 626312, 626420, 627256, 628475, 629974, 631764, 633708, 635736, 638151, 641288, 644782, 647571, 648750, 648133, 645878, 642001, 636671, 630652, 624940, 619903, 615025, 609449, 602571, 594226, 584723, 574786, 565143, 556020, 547185, 538508, 530256, 522745, 515950, 509673, 503948, 499009, 494811, 490754, 486168, 481134, 476656, 473721, 472275, 471484, 471034, 471617, 473791, 476910, 479734, 481866, 483950, 486571, 489618, 492723, 495684, 498335, 500619, 503027, 506444, 511240, 516855, 522462, 527624, 532069, 535313, 536993, 537347, 537018, 536524, 536064, 535504, 534316, 531804]
60835E31804m105n341o074o466o367n524m271l255k541j835j486k191l533l978
60821D74837k922j723j934l262m166l972l378l145l277l545l995m626n111n117
60807D24664m659m019l474l150k957k642k111j631j565j891k151j927j258n57
60793C90672j93j41n5K48N21M81L44O58J544K426K683K286J685J262J072R66Q08
60776D07267P19J047J870K584K434J528Q40R63J388J358J000R87J400J545R34
60761D27864p5p45p81n39n31q53j182j333j639k388l050k609r21Q42J442R07J37
60744D14546k81l24l0M62N01n97k533m139m641m356l974l719l477l194k814k177
60728C79253j327o99o42r65j271j481j708j798j353k67J076K124K536K296J670
$$ y = [531804, 527699, 522358, 516284, 509818, 503451, 497927, 493656, 490401, 487860, 486025, 484539, 482348, 478815, 474837, 471915, 470192, 468258, 464996, 460830, 456858, 453480, 450335, 447058, 443513, 439518, 434892, 429781, 424664, 420005, 415986, 412512, 409362, 406405, 403763, 401652, 400021, 398456, 396565, 394414, 392487, 391229, 390672, 390479, 390338, 390283, 390531, 391052, 391533, 391877, 392535, 394079, 396505, 399188, 401474, 403159, 404421, 405493, 406459, 407267, 407986, 409033, 410903, 413487, 415921, 417449, 418289, 419252, 420640, 421998, 422998, 423985, 425385, 426930, 427864, 427789, 427044, 426263, 425724, 425193, 424340, 423158, 421825, 420186, 417798, 414748, 412139, 411218, 412060, 413502, 414409, 414546, 414265, 413941, 413911, 414373, 414874, 414277, 411744, 407605, 402964, 398608, 394634, 390915, 387438, 384244, 381430, 379253, 377926, 377227, 376585, 375620, 374349, 372868, 371160, 369362, 368009, 367742, 368818, 370942, 373478, 375774, 377444]
60713C77444J110R54J153J371J379J247J163J212J384J671J997K224K316K423
60699C99048K629K620K013J040N54J008J697J456P8j434k104j983j720j592j389
60684D01921r50m11L8K90K81J50K66P91J330J388J075Q99R34P39K00j91j51j80
60666D08419q64j971k697k637k136j725j638j768j808j458p51j33M4M7M39J301
60650C90664K121K497K542K512K392K079J704J435J165O42j75j080j915k610l006
60635D00967k849k125j280r47j366k056k214j516m75J76K96K54J86j80q38j160
60619C84873o46L51J081J366J595J987K292K228J761R83J13l85j49N94J181J239
60603D00464Q97L36m02j101j383j149o67j06N56J111J220J060J300K102K776K741
$$ y = [377444, 378554, 379508, 380661, 382032, 383411, 384658, 385821, 387033, 388417, 390088, 392085, 394309, 396625, 399048, 401677, 404297, 406310, 407350, 407904, 408912, 410609, 412065, 412143, 410709, 408605, 406622, 404902, 403310, 401921, 400971, 400560, 400598, 400888, 401169, 401319, 401585, 402376, 403706, 405094, 406169, 407068, 408002, 408741, 408941, 408750, 408599, 408419, 407555, 405584, 402887, 400250, 398114, 396389, 394751, 392983, 391175, 389717, 388966, 388833, 388877, 388924, 389363, 390664, 392785, 395282, 397824, 400336, 402728, 404807, 406511, 407946, 409111, 409753, 409578, 408498, 406583, 403973, 400967, 398118, 395993, 394713, 393766, 392400, 390344, 388130, 386614, 386139, 386315, 386611, 386865, 387051, 386871, 386033, 384873, 384227, 384578, 385659, 387025, 388620, 390607, 392899, 395127, 396888, 397871, 397984, 397599, 397450, 398044, 399225, 400464, 401361, 401697, 401295, 400194, 398811, 397662, 396995, 396889, 397445, 398556, 399776, 400836, 402136, 404238, 407014, 409755]
60587D09755K229J716J245Q47R45J606J961J244P9j60Q89K280L078L206L047L032
60571D36999L691N284P259Q741R664J0760J2293J3618J4152J3949J2996J0836
60559E60242P462L870J019j255l571n727o865o707n843m858l762k453j125qR99
60544E31418K185L630N142O509P799R304J1213J3368J5488J7448J9129K0084J9775
60531F82492J8192J5830J2998R527N432J348j978m371o107p446q485r262r676
60518F98494r529q941q394q157p884p142n991m754l503k192r60J77J698M038O853
60503F43813R451J1884J4903J8811K3003K6934L0828L5044L9132M2197M3985M5082
60491I85067M5965M6284M5249M2444L8056L2381K5423J7097P701k059j1530k0530
$$ y = [409755, 411984, 413700, 414945, 415792, 416737, 418343, 420304, 421548, 421627, 421467, 422356, 424636, 427714, 430920, 433967, 436999, 440690, 445974, 453233, 461974, 471638, 482398, 494691, 508309, 522461, 536410, 549406, 560242, 567704, 571574, 572593, 571338, 567767, 562040, 555175, 548468, 542625, 537767, 534005, 531552, 530427, 530419, 531418, 533603, 537233, 542375, 548884, 556683, 565987, 577200, 590568, 606056, 623504, 642633, 662717, 682492, 700684, 716514, 729512, 739039, 744471, 745819, 743841, 739470, 733363, 725917, 717432, 708170, 698494, 688965, 680024, 671630, 663473, 655589, 648447, 642456, 637702, 634199, 632007, 631047, 631224, 632922, 636960, 643813, 653264, 665148, 680051, 698862, 721865, 748799, 779627, 814671, 853803, 896000, 939985, 985067, 1031032, 1077316, 1122565, 1165009, 1203065, 1235446, 1260869, 1277966, 1285667, 1283608, 1272078, 1251548]
60479A251548k9122l7112m3880m8734n1345n1835n0583m8055m4771m1260l7833
60468G67018l4438l0826k6988k3325k0308j8040j6250j4640j3127j1802j0816
60457E46458j0211r756q985p645o045m746l978l536l222l085l182l321l211k748
60443D72787k124j709j713j866j635r15k90k96p03r68j099j483k010k082j590
60428D52304j172j290j668j895j990k040j831j239n65j13K01M98O76Q02J307K261
60412D44246K956K694J726R21P05Q50J078J368J762K240K732L034K900K443K176
60397D73831K362K682K766K721K708K460J730Q80N12P41J314K131L041L476K948
60382E06303J842J075J045J393J719J942K033J975J980K250K542K459K117K062
$$ y = [1251548, 1222426, 1185314, 1141434, 1092700, 1041355, 989520, 938937, 890882, 846111, 804851, 767018, 732580, 701754, 674766, 651441, 631133, 613093, 596843, 582203, 569076, 557274, 546458, 536247, 526491, 517506, 509861, 503816, 499070, 495092, 491556, 488334, 485249, 482067, 478746, 475535, 472787, 470663, 468954, 467241, 465375, 463740, 462825, 462535, 462239, 461536, 460568, 459469, 457986, 455976, 453894, 452304, 451132, 449842, 448174, 446279, 444289, 442249, 440418, 439179, 438614, 438501, 438702, 439200, 439876, 440678, 441985, 444246, 447202, 449896, 451622, 452543, 453248, 454098, 455176, 456544, 458306, 460546, 463278, 466312, 469212, 471655, 473831, 476193, 478875, 481641, 484362, 487070, 489530, 491260, 492140, 492652, 493393, 494707, 496838, 499879, 503355, 506303, 508145, 509220, 510265, 511658, 513377, 515319, 517352, 519327, 521307, 523557, 526099, 528558, 530675, 532737]
60368E32737K514L130L454L203K251Q72j31j50M61R07J085J539K368L062L532
60353E60834M395N895P282P741P350O652N788M609L292K258J620J096L96o23k014
60338F16571l640n065n808n716n045m222l614l276k918k236j427j116j699k830
60324E67959l748l941l450k674k049j796j804j653q52P93K868M535N301N662O643
60309E71794Q561J0574J1757J2245J2888J4099J5487J6499J6877J6442J4946J2231
60297G34400Q398L768j115n654r538j2813j5350j6651j6477j5341j3902j2155
60285F27570r836p304n332m182l509l123l167l564l943m143m249m207l986m015
60271E63010m629n196m716l382k584l037l836l755k720j479n80k74p69j872k750
$$ y = [532737, 535251, 538381, 541835, 545038, 547289, 548161, 548030, 547880, 548341, 549248, 550333, 551872, 554240, 557302, 560834, 565229, 571124, 578406, 586147, 593497, 600149, 605937, 610546, 613838, 616096, 617716, 618812, 619208, 618585, 616571, 612931, 607866, 602058, 596342, 591297, 587075, 583461, 580185, 577267, 575031, 573604, 572488, 570789, 567959, 564211, 560270, 556820, 554146, 552097, 550301, 548497, 546844, 545992, 546785, 549653, 554188, 559489, 565151, 571794, 580355, 590929, 602686, 614931, 627819, 641918, 657405, 673904, 690781, 707223, 722169, 734400, 742798, 746566, 745451, 739797, 730259, 717446, 702096, 685445, 668968, 653627, 639725, 627570, 617734, 610430, 605098, 600916, 597407, 594284, 591117, 587553, 583610, 579467, 575218, 571011, 567025, 563010, 558381, 553185, 548469, 545087, 542503, 539466, 535630, 531875, 529155, 527676, 527096, 526822, 526053, 524181, 521431]
60256E21431k683j827q46j09L35M10J75O5M47J094J472J380R93M77m0l17k13K4
60238E22268nl57o78o30j92L92Q82J218J463J558J358J066J293K335L593M215
60222E39779M187M205M640N270N980O919P866Q234Q039Q092Q897R938J0508J0590
60208F43144J0572J0548J0396J0104R689R141Q619Q251P652O344M792M160M643
60195G48055N035M466L614L321K977J448r78k836l512l846m688n904o962p702
60181G32488q153q232p927p508p253p205p225p121o716o013n177m288l298k326
60167F44046j694j475j385j390j897k961l764l483k322j222o87m86k07L21J072
60152F22466J767J955J546J086J152J678K186K422K391K140J948K405L765N472
$$ y = [521431, 518748, 516921, 516075, 515966, 516301, 516711, 516886, 516951, 517398, 518492, 519964, 521344, 522337, 522814, 522774, 522457, 522244, 522268, 522263, 521906, 521228, 520598, 520406, 520798, 521680, 522898, 524361, 525919, 527277, 528343, 529636, 531971, 535564, 539779, 543966, 548171, 552811, 558081, 564061, 570980, 578846, 587080, 595119, 603211, 612108, 622046, 632554, 643144, 653716, 664264, 674660, 684764, 694453, 703594, 712213, 720464, 728116, 734460, 739252, 743412, 748055, 753090, 757556, 761170, 764491, 767468, 768916, 767938, 765102, 761590, 757744, 753056, 747152, 740190, 732488, 724335, 716103, 708176, 700668, 693415, 686210, 678985, 671864, 665148, 659135, 653958, 649670, 646372, 644046, 642352, 640877, 639492, 638102, 636205, 633244, 629480, 625997, 623675, 622453, 621766, 621280, 621073, 621394, 622466, 624233, 626188, 627734, 628820, 629972, 631650, 633836, 636258, 638649, 640789, 642737, 645142, 648907, 654379]
60138F54379O750P425P817Q176Q739R780J1112J1870J1477J0432R478Q425O658
60125G72518M413K628J683J198R95J317K043K574K651K592K656K754K864K969
60111H05855K656J517pr72j245j596k381k993l009k980l547m384m730m523m356
60096G73305m506m542l940k713j367l56L00Q40J229J101M06k70l81j53j24k57
60080G58572q4M22P36M67m02j864l894o070p823r058j0046j0755j0903j0557j0115
60065F78626r710r278r040r182r183q340o935n899n307m323k815j812j892k183
60051E92727j710p01J56R48K104L402M330M988N795O660P210P522P897Q181Q012
60036F57521P491O907O058M553K648J008k72j610k990l806l872l864m472n606
$$ y = [654379, 661129, 668554, 676371, 684547, 693286, 703066, 714178, 726048, 737525, 747957, 757435, 765860, 772518, 776931, 779559, 781242, 782440, 783435, 784752, 786795, 789369, 792020, 794612, 797268, 800022, 802886, 805855, 808511, 810028, 810021, 809049, 807804, 806208, 803827, 800834, 797825, 794845, 791298, 786914, 782184, 777661, 773305, 768799, 764257, 760317, 757604, 756237, 755881, 756181, 757021, 758250, 759351, 759757, 759487, 759106, 758953, 758829, 758572, 758488, 758910, 759646, 760113, 759711, 757847, 753953, 747883, 740060, 731002, 720956, 710201, 699298, 688741, 678626, 668916, 659638, 650598, 641416, 632233, 623893, 616958, 611059, 605752, 601429, 598614, 596802, 594910, 592727, 591017, 590316, 590472, 591420, 593524, 596926, 601256, 606244, 612039, 618699, 625909, 633431, 641328, 649509, 657521, 665012, 671919, 677977, 682530, 685178, 686186, 685914, 684304, 681314, 677508, 673636, 669772, 665300, 659694]
60022F59694o734p596q296r011r841j0775j1566j1786j1182r825p962n921m240
60009E44959l499l671l879l206j748n23k82p30j104j111r62p18k33L34N62N44
59993E24733J006K273L614M159M060M092M428M551M300M121M212M115L508K787
59979E75959K462K359J843O15r77k314l034l291l526l872l900l194k006r70k80
59964E55874M00J326K450L753N130N966N512L936K390J769J877J991J701Q97l95
59949E94577j762k455k189j587j460j893k358k457k216j916j862k128k392k227
59935E65675j673j137p17m8J034K198L143L948M684N183N489N997O800P318O936
59920F14830N659L956K358J340J065J034N40k68m52L85J574K581L776N393O531
$$ y = [659694, 652960, 645364, 637068, 628057, 618216, 607441, 595875, 584089, 572907, 563082, 555120, 549199, 544959, 541460, 537789, 533910, 530704, 528956, 528433, 528151, 527421, 526317, 525206, 524244, 523526, 523293, 523627, 524189, 524733, 525739, 528012, 531626, 535785, 539845, 543937, 548365, 552916, 557216, 561337, 565549, 569664, 573172, 575959, 578421, 580780, 582623, 583238, 582261, 579947, 576913, 573622, 570096, 566224, 562324, 559130, 557124, 556154, 555874, 556274, 557600, 560050, 563803, 568933, 574899, 580411, 584347, 586737, 588506, 590383, 592374, 594075, 594972, 594577, 592815, 590360, 588171, 586584, 585124, 583231, 580873, 578416, 576200, 574284, 572422, 570294, 567902, 565675, 564002, 562865, 562148, 562100, 563134, 565332, 568475, 572423, 577107, 582290, 587779, 593776, 600576, 607894, 614830, 620489, 624445, 626803, 628143, 629208, 630242, 630782, 630514, 630062, 630447, 632021, 634602, 638378, 643771, 650302]
59905F50302O114M349K451J298J007J304J535Q29q76k324k334j320n55k96K63
59890F61747J385K341K679K875L494M512N719P027Q120Q554Q423Q295Q305Q039
59876G41515P430P019O940O507N259L788K886K366J441n0j458k230k498k713l094
59861G73108l520l770l802l886m368n226n938n906m964l493k117j276q68k80R94
59846G24688K663L791L761K896J977J329O55k93j189j389o34O56J782K334K339
59831G45366K021J583J139O11k43j459k558k961k720k520k828l472m216n206o448
59816G16089p260o817n171l330k322k434l213l949m200m110m085m158l893l096
59802F58051k245j926k176k706l383m072m367l937l026k194j700j484j494j589
$$ y = [650302, 656416, 660765, 663216, 664514, 665521, 666825, 668360, 669189, 668313, 665989, 663655, 662335, 661780, 661484, 661747, 663132, 665473, 668152, 671027, 674521, 679033, 684752, 691779, 699899, 708453, 716876, 725171, 733476, 741515, 748945, 755964, 762904, 769411, 774670, 778458, 781344, 783710, 785151, 785101, 783643, 781413, 778915, 776202, 773108, 769588, 765818, 762016, 758130, 753762, 748536, 742598, 736692, 731728, 728235, 726118, 724842, 723974, 723694, 724688, 727351, 731142, 734903, 737799, 739776, 741105, 741760, 741467, 740278, 738889, 738255, 738911, 740693, 743027, 745366, 747387, 748970, 750109, 750720, 750477, 749018, 746460, 743499, 740779, 738259, 735431, 731959, 727743, 722537, 716089, 708829, 702012, 696841, 693511, 691189, 688755, 685542, 681593, 677393, 673283, 669198, 665040, 661147, 658051, 655806, 653880, 651704, 648998, 645615, 641543, 637176, 633239, 630213, 628019, 626319, 624835, 623341, 621752]
59788F21752j444r99p28r86j372j312r77r78j366j642j623j521j231l36J106K463
59772F08806L363L911M063L571K776K635L546M695N117M843M601M690M747M456
59758F65820M051M077M819O001P073P852Q688R843J0893J1208J0839J0442J0398
59745G72004J0473J0309R719Q644P323O401O201N997M765K681R12j01j072k351
59731H41905l110k777k153k264k850k981k591k326k305k122j869k093k799l386
59717H06279l672m047m514m476l784l214l389l845l679k721j568p30k12K26P52
59702G67406J407K071K551K847L269M064N033N714N946O038O308O597O280M833
59688H30364K460J26j155j250j012j305k051k481k353k431l474n051n961n840
$$ y = [621752, 620308, 619309, 618581, 617595, 616223, 614911, 613934, 612956, 611590, 609948, 608325, 606804, 605573, 605237, 606343, 608806, 612169, 616080, 620143, 623714, 626490, 629125, 632671, 637366, 642483, 647326, 651927, 656617, 661364, 665820, 669871, 673948, 678767, 684768, 691841, 699693, 708381, 718224, 729117, 740325, 751164, 761606, 772004, 782477, 792786, 802505, 811149, 818472, 824873, 831074, 837071, 841836, 844517, 845429, 845328, 844256, 841905, 838795, 836018, 833865, 831601, 828751, 825770, 823179, 820853, 818548, 816426, 814557, 812464, 809665, 806279, 802607, 798560, 794046, 789570, 785786, 782572, 779183, 775338, 771659, 768938, 767370, 766640, 766428, 766654, 767406, 768813, 770884, 773435, 776282, 779551, 783615, 788648, 794362, 800308, 806346, 812654, 819251, 825531, 830364, 832824, 832950, 831795, 830545, 829533, 828228, 826177, 823696, 821343, 818912, 815438, 810387, 804426, 798586]
59674G98586n723o694q411r506r255q238p312o548n519m232l198k627k011p54
59660G18558R99K443L059L229L705M610N314N346N026M886M896M681M276L995
59646G75023L558K065p60l788n555n915o120p250q977j0068r761q403o897n823
59632G01329n167m622l979l271k748k694l197m015m801n430n962o332o321n937
59618F36853n584n634o008o235n878m786l231j845j228j311j434j148o53k49K30
59603E91859R63J531J393P73M48P12J166J460J581J418P34k00n91j53M43M62J9
59586F04018l19l96m95p24r51j182j572k109k551k674k428j931j523j656k387
59571E81120l119l146k468j723j296r04k29L43J07r34j871j931j381j034j095
$$ y = [798586, 792863, 786169, 777758, 768252, 758997, 750759, 743447, 736899, 731380, 727148, 723950, 721323, 719312, 718558, 719557, 722000, 725059, 728288, 731993, 736603, 741917, 747263, 752289, 757175, 762071, 766752, 771028, 775023, 778581, 780646, 779886, 776098, 770543, 764628, 758508, 751258, 742281, 732213, 722452, 714049, 707152, 701329, 696162, 691540, 687561, 684290, 681542, 678848, 675651, 671636, 666835, 661405, 655443, 649111, 642790, 636853, 631269, 625635, 619627, 613392, 607514, 602728, 599497, 597652, 596424, 595113, 593679, 592531, 591878, 591629, 591859, 592822, 594353, 595746, 596519, 596967, 597679, 598845, 600305, 601886, 603304, 604038, 603838, 603247, 603094, 603537, 603999, 604018, 603699, 603303, 602808, 602084, 601133, 599951, 598379, 596270, 593719, 591045, 588617, 586686, 585163, 583507, 581120, 578001, 574855, 572387, 570664, 569368, 568464, 568235, 568578, 568685, 567751, 565880, 563949, 562568, 561534, 560439]
59556E60439j025m91J18L87N46J085K015K903L405L448L106K667K583L101M099
59541E88386N554P739J0595J3409J5608J7340J8568J8191J5128J0109N192J554
59529G27373j215l533m834m667l648k644j710m85R29K153L022L344K636P72j510
59514G15983l226m073m388m652n334o681q196q805q090o899o217o003n716n409
59500F32294n462n642n326m458l537k780k002j215o18p8O53J353J592J574J942
59485F08290K787L554L976M356M751M738M266M019M518N355N834N921O025O173
59471F74563N950N142M003K820J563J08j376k431k694k211j335l44O92J763K801
59456F89014L876N169O617P832Q626R317J0187J0870J0721R655Q098O309M220
$$ y = [560439, 559414, 558923, 559041, 559428, 559974, 561059, 563074, 565977, 569382, 572830, 575936, 578603, 581186, 584287, 588386, 593940, 601679, 612274, 625683, 641291, 658631, 677199, 695390, 710518, 720627, 725819, 727373, 726158, 722625, 717791, 713124, 709476, 706832, 705122, 704637, 705566, 707719, 710741, 714085, 716721, 717493, 715983, 712757, 708684, 704296, 699644, 694310, 687629, 679433, 670628, 662538, 655639, 649422, 643419, 637703, 632294, 626832, 621190, 615864, 611406, 607869, 605089, 603087, 601872, 601254, 601176, 601829, 603182, 604774, 606348, 608290, 611077, 614631, 618607, 622963, 627714, 632452, 636718, 640737, 645255, 650610, 656444, 662365, 668390, 674563, 680513, 685655, 689658, 692478, 694041, 694149, 692773, 690342, 687648, 685437, 684102, 683758, 684450, 686213, 689014, 692890, 698059, 704676, 712508, 721134, 730451, 740638, 751508, 762229, 771884, 779982, 786291, 790511]
59443G90511J933k71k409m771p165q805r248q988q752q615q174p263o081m852
59429G07050l794l230l195l039j976n9J914L577N505Q198J1151J3612J5837J8763
59415G70314K2359K5335K6897K7976K9799L1555L0534K4770J5013M052n236j1081
59403I92287j3073j2042r339n667q31M995J0110J2070R656L704l805j0987j6588
59390I60490k0051k1435k1096j9404j6868j4285j2251j0551q519o091l998k784
59378H03157k081j252l38P7k49q52j130r42o03m76o53r29j025r01p61p18n49M1
59360G89816R45J693K035K283K898L916N067O327P910R683J1106J2113J3583J6283
59346H85658J9453K1230K0725J9150J8436J9068J9732J8922J6449J3251J0129
$$ y = [790511, 792444, 792173, 789764, 784993, 777828, 769023, 759775, 750787, 742035, 733420, 725246, 717983, 711902, 707050, 703256, 700026, 696831, 693792, 691816, 691757, 693671, 697248, 702753, 710951, 722102, 735714, 751551, 770314, 792673, 818008, 844905, 872881, 902680, 934235, 964769, 989539, 1004552, 1008604, 1003368, 992287, 979214, 967172, 957833, 952166, 951335, 956330, 966440, 978510, 988166, 991870, 988065, 977078, 960490, 940439, 919004, 897908, 878504, 861636, 847351, 835100, 824549, 816030, 809939, 805941, 803157, 801076, 799824, 799486, 799563, 799314, 798462, 797332, 796390, 795787, 795311, 794658, 793729, 792704, 791803, 791042, 790324, 789775, 789816, 790761, 792454, 794489, 796772, 799670, 803586, 808653, 814980, 822890, 832573, 843679, 855792, 869375, 885658, 905111, 926341, 947066, 966216, 984652, 1003720, 1023452, 1042374, 1058823, 1072074, 1082203]
59335A082203P026L493m17m000o657q585j0502j2756j4941j6402j6897j6769j6567
59322I68229j6575j6635j6428j5884j5184j4330j3106j1638j0575j0258j0131
59311H17485r486q479p731p157o140m760l832l478k694q30J372K922M055N710
59297G76957P885R320Q711N717J025m086q347j1170j2775j3534j3433j2406j0797
59284G23067r063p306n484l766k290q26R56L081N384P734R853J1335J2174J2872
59270G57721J3714J4427J4893J5483J6109J5687J3423J0152P465N802M331K445
59258H91652M11j395k958m247n189o080p221q144p940o500m675l104j636j49R80
59243H33805J522J880K466L152L743M436N411O332O711O454N698M433K647O58
$$ y = [1082203, 1089229, 1092722, 1092305, 1088305, 1081648, 1073063, 1062561, 1049805, 1034864, 1018462, 1001565, 984796, 968229, 951654, 935019, 918591, 902707, 887523, 873193, 860087, 848449, 837874, 827616, 817485, 807999, 799520, 791789, 784632, 778492, 773732, 769900, 766422, 763728, 762898, 764270, 767192, 771247, 776957, 784842, 794162, 802873, 808590, 809615, 805529, 797182, 786012, 773237, 759703, 746270, 733864, 723067, 714004, 706698, 701214, 697448, 695158, 694332, 695288, 698369, 703753, 711487, 721340, 732675, 744849, 757721, 771435, 785862, 800755, 816238, 832347, 848034, 861457, 871609, 879074, 884876, 889207, 891652, 892063, 890668, 887710, 883463, 878274, 872194, 864973, 856829, 848889, 842389, 837714, 834610, 832974, 832825, 833805, 835327, 837207, 839673, 842825, 846568, 851004, 856415, 862747, 869458, 875912, 881610, 886043, 888690, 889348]
59229H89348j053k326l403m645o246q058r626j0536j0801j0807j0863j0951j0932
59216G89101j0748j0409r929r395q886q326p505o303m881l659l057l088l254l083
59202F96578k675k348j897q28P02J916K599L355M363M878M566M310M817N388N215
59187G30939N019N938P437P936P268O795P059O974N791M323L596L423L052K285
59173H07835J343L81l08l46M5J58j02LP78J553J778J770J836J536N51o08j402
59156H16801k075k974l761m157m783o350q409r813j0156r980r795r599r308q998
59142G16643q709q376p944p332o464n560n050n004m977m627m050l348k356j165
59128F41681k99QK41R87K267L818N456O826P428P330P323P943Q901R824J0864
$$ y = [889348, 888295, 885969, 882566, 877921, 871675, 863617, 853991, 843455, 832654, 821847, 810984, 800033, 789101, 778353, 767944, 758015, 748620, 739734, 731408, 723903, 717600, 712719, 709060, 706003, 702915, 699661, 696578, 693903, 691555, 689658, 688830, 689532, 691448, 694047, 697402, 701765, 706643, 711209, 715519, 720336, 725724, 730939, 735958, 741896, 749333, 757269, 764537, 771332, 778391, 785365, 791156, 795479, 799075, 802498, 805550, 807835, 809178, 809559, 809251, 808905, 808950, 809108, 809006, 809009, 809787, 811340, 813118, 814888, 816724, 818260, 818811, 818203, 816801, 814726, 811752, 807991, 803834, 799051, 792701, 784292, 774479, 764323, 754343, 744548, 734949, 725641, 716643, 707934, 699558, 691614, 684282, 677818, 672258, 667208, 662204, 657227, 652600, 648550, 645202, 642846, 641681, 641382, 641390, 641631, 642618, 644885, 648703, 654159, 660985, 668413, 675743, 683066, 691009, 699910, 709734, 720598]
59113G20598J2071J2941J3172J3234J3449J3253J2174J0867J0230J0088R672Q929
59101H60678Q241P261N292K633L78j106k445l886m732m441l412k360j555j008
59087H59538p79p95q27q69j160j704k236k698l311m125m946n813o940q131q796
59072H06408q749q458q298q008p232o208n547n494n723n717n175m163l105k545
59058G21986k704l183l252k596j774j629k200k541j950r68o39j013j237j001q78
59043F94421j093j019l92K8k62n12J30J297K231L174M679O131O447N990O308P928
59027G35486R751J0933J2029J3800J5950J7685J8677J8905J8264J6926J5415J3801
59015I17622J1368P616L176p90l726n789p251q211q670q486p484n814l921k004
$$ y = [720598, 732669, 745610, 758782, 772016, 785465, 798718, 810892, 821759, 831989, 842077, 851749, 860678, 868919, 876180, 881472, 884105, 884483, 883377, 880932, 877046, 872314, 867873, 864461, 862101, 860546, 859538, 858759, 857964, 857137, 856268, 855108, 853404, 851168, 848470, 845159, 841034, 836088, 830275, 823335, 815204, 806408, 797659, 789201, 780903, 772895, 765663, 759455, 753908, 748414, 742691, 736974, 731799, 727636, 724531, 721986, 719282, 716099, 712847, 710251, 708477, 706848, 704648, 702107, 700157, 699189, 698550, 697537, 696300, 695299, 694421, 693328, 692309, 691917, 691945, 691683, 691171, 691301, 692598, 694829, 698003, 702682, 708813, 715260, 721250, 727558, 735486, 745237, 756170, 768199, 781999, 797949, 815634, 834311, 853216, 871480, 888406, 903821, 917622, 928990, 936606, 939782, 938992, 935266, 929477, 922226, 914015, 905345, 896859, 889375, 883561, 879640, 877636]
59001H77636R5K271L940M797N265N796O153N825M799L437J904K28j365k713m042
58986I14026n559o863p399p331p310p450p129n952m256k522q33Q28K298L637N269
58971H63454P269Q966R826J0339J1284J2356J2492J1561J0676J0492J0206Q954
58959I87875P253O051N000K981J19k173l329m534o866r675j1571j2227j2282j2108
58945I34514j1597j0934j0515j0164r204p474n657m476l991l796l503k875j839
58932H48489n42O49J369J515J400J568K196K727K487J687J179J086N15r19k083
58917H63323j660O3J678K560L287M316N385O349P670R621J1623J2825J2995J2586
58903I52621J2207J2140J2122J1553J0192Q578P465O916O390N564M573L612K868
$$ y = [877636, 877731, 880002, 883942, 888739, 894004, 899800, 905953, 911778, 916577, 920014, 921918, 922146, 920781, 918068, 914026, 908467, 901604, 894205, 886874, 879564, 872114, 864985, 859033, 854777, 852255, 851422, 852250, 854548, 858185, 863454, 870723, 879689, 889515, 899854, 911138, 923494, 935986, 947547, 958223, 968715, 978921, 987875, 995128, 1001179, 1006179, 1009160, 1009279, 1007106, 1003777, 999243, 992377, 982702, 971131, 958904, 946622, 934514, 922917, 911983, 901468, 891304, 882100, 874626, 868969, 864493, 860502, 856706, 853203, 850328, 848489, 847947, 848596, 849965, 851480, 852880, 854448, 856644, 859371, 861858, 863545, 864724, 865810, 866325, 865406, 863323, 861663, 861726, 863404, 865964, 869251, 873567, 878952, 885301, 892971, 902592, 914215, 927040, 940035, 952621, 964828, 976968, 989090, 1000643, 1010835, 1019413, 1026878, 1033794, 1040184, 1045748, 1050321, 1053933, 1056801]
58890A056801K863M105O289Q478J0250J2093J4313J6227J6870J6165J4835J3408
58878A192697J1733R507O849M291K262P70l96j296j897k446l334m496n384n934
58864A202926p039r434j2421j4452j4921j4717j4966j5890j7032j7989j8570j8680
58852A026815j8330j7599j6471j4894j3067j1391j0101r232q887r185r961j0854
58840H76843j1698j2505j3124j3265j2907j2340j1778j1178j0380r233p675o015
58828G44745m896m613m640m260l473k780k274j512l09J002K106L047L925M639
58814G30707M969M699L819K816K436K721K745J868P48K79J4j254l495n306n804
58799G41962n466m902l928k462j292j219k097l286m453n389n581m621k790q39
$$ y = [1056801, 1059664, 1063769, 1070058, 1078536, 1088786, 1100879, 1115192, 1131419, 1148289, 1164454, 1179289, 1192697, 1204430, 1213937, 1220786, 1225077, 1227339, 1228109, 1227713, 1226417, 1224520, 1222074, 1218740, 1214244, 1208860, 1202926, 1195887, 1186453, 1174032, 1159580, 1144659, 1129942, 1114976, 1099086, 1082054, 1064065, 1045495, 1026815, 1008485, 990886, 974415, 959521, 946454, 935063, 924962, 915730, 906843, 897658, 887697, 876843, 865145, 852640, 839516, 826251, 813344, 801004, 789226, 778048, 767668, 758435, 750760, 744745, 739849, 735236, 730596, 726336, 722863, 720083, 717809, 716297, 715988, 716990, 719096, 722143, 726068, 730707, 735676, 740375, 744194, 747010, 749446, 752167, 754912, 756780, 757528, 757807, 757821, 756567, 753072, 747766, 741962, 736496, 731594, 727666, 725204, 723912, 722693, 720596, 717310, 712857, 707468, 701887, 697266, 694476, 693637]
58785F93637O54J482J882K521L959N891P337P850P968Q250Q452Q023O854N186
58771G69946L179R47j255l184m705n687o112o307o569o618o046n248n064n437
58757G11840n335m310l161k647k440j947j362j194j384j541j543j349p41K12R98
58742F84096J470K244L721N339O414P067P627P793P201O341N977O040N976N765
58728G63071N791N949N875N807O300P174P668P639P708Q205Q734R051R551J0514
58714H69037J1472J1647J0758R208P652O397M968K455j320n182p691q826r985
58701I00590j2253j5348j8356k0871k2982k4585k5260k4724k3066k0643j7920
58690F74582j5362j3230j1455r830q307p085o393o212o262o218n948n479m836
$$ y = [693637, 694291, 695773, 697655, 700176, 704135, 710026, 717363, 725213, 733181, 741431, 749883, 757906, 764760, 769946, 773125, 774072, 772817, 769633, 764928, 759241, 753129, 746822, 740253, 733635, 727589, 722341, 717277, 711840, 706505, 702195, 699034, 696387, 693947, 692000, 690638, 689444, 688060, 686519, 684976, 683627, 682886, 683098, 684096, 685566, 687810, 691531, 696870, 703284, 710351, 717978, 725771, 732972, 739313, 745290, 751330, 757306, 763071, 768862, 774811, 780686, 786493, 792793, 799967, 807635, 815274, 822982, 831187, 839921, 848972, 858523, 869037, 880509, 892156, 902914, 912122, 919774, 926171, 931139, 933594, 932274, 927092, 919401, 910575, 900590, 888337, 872989, 854633, 833762, 810780, 786195, 760935, 736211, 713145, 692502, 674582, 659220, 645990, 634535, 624705, 616398, 609313, 602920, 596708, 590446, 584228, 578280, 572801, 567965]
58677E67965m055l309k817k654k687k640k170r46R87L104M875O326P791R235J0285
58662E89290J0807J0956J0516Q865N882K410m67k354l532m452n453o615p550p655
58648F00648o889n988n607n517m990l752k315j447j484j983j989r48N98J596J787
58633E61720J958K685L471L517K843K077J479Q02K7m00k05K01J18n50j007l54
58617E78382J310K882L521L634M142N111N762N671N198M676L995L158K507K070
58603F32019J351K20o67p38l13j04l17p32j196j624j773j472q30MJ093K493M064
58586F31478N624P035Q113Q874R751J1064J2268J2496J1892J1579J2041J2405
58574G54620J1691J0144Q779Q319R020J0880J3481J6096J8460K1052K4313K8030
$$ y = [567965, 563910, 560601, 557784, 555130, 552443, 549803, 547633, 546687, 547674, 550778, 555653, 561979, 569770, 579005, 589290, 600097, 611053, 621569, 630434, 636316, 638726, 638259, 635905, 632373, 627921, 622468, 615853, 608303, 600648, 593759, 587771, 582164, 576647, 571657, 567905, 565590, 564143, 562659, 560676, 558687, 557739, 558337, 559933, 561720, 563678, 566363, 569834, 573351, 576194, 578271, 579750, 580552, 580579, 580179, 579974, 580175, 580293, 579743, 578736, 578382, 579692, 582574, 586095, 589729, 593871, 598982, 604744, 610415, 615613, 620289, 624284, 627442, 629949, 632019, 633370, 633590, 632923, 632185, 631872, 631768, 631451, 630719, 629523, 627899, 626126, 624654, 623824, 623828, 624921, 627414, 631478, 637102, 644137, 652250, 661124, 670875, 681939, 694207, 706703, 718595, 730174, 742215, 754620, 766311, 776455, 785234, 793553, 802573, 813453, 826934, 843030, 861490, 882542, 906855, 934885]
58562I34885L1759L5208L7875L9019L8419L6579L3868L0026K4932J9088J2953
58551A274611O555K18n099q720j0865j1881j1692j0531r454r400j0373j2072j4604
58538A166693j7969k1560k4824k7731l0047l1023l0452k9186k7814k5778k2586
58527H77723j9069j6322j4224j2082j0085q955q561q053p073n860m509l078k130
58514G57722k248l127l795l601k530r85K28K69p09j496j327q20q24j143j178j029
58498G33407j089j215j226j427j915k032j405o46j08J075L550O348Q156R214J0595
58483G61282J2377J3913J5214J6693J8139J9337K1035K3740K6099K6097K3447
58472I77373J9433J4864R687M208r03n582r819j2573j2846j1446j0085q901o692
$$ y = [934885, 966644, 1001852, 1039727, 1078746, 1117165, 1153744, 1187612, 1217638, 1242570, 1261658, 1274611, 1281166, 1281384, 1276285, 1267565, 1256700, 1244819, 1233127, 1222596, 1213142, 1203742, 1193369, 1181297, 1166693, 1148724, 1127164, 1102340, 1074609, 1044562, 1013539, 983087, 953901, 926087, 900309, 877723, 858654, 842332, 828108, 816026, 805941, 796986, 788425, 780372, 773299, 767439, 762930, 759852, 757722, 755474, 752347, 748552, 744951, 742421, 741436, 741664, 741933, 741224, 739728, 738401, 737581, 736757, 735614, 734436, 733407, 732318, 731103, 729877, 728450, 726535, 724503, 723098, 722452, 722344, 723419, 726969, 733317, 741473, 750687, 761282, 773659, 787572, 802786, 819479, 837618, 856955, 877990, 901730, 927829, 953926, 977373, 996806, 1011670, 1021357, 1025565, 1024662, 1019080, 1009261, 996688, 983842, 972396, 962311, 953410, 946718]
58459I46718l332j91J991L849N831P481Q589R556J0272R934Q276N851K959n94
58445A017190m570q296j1631j4788j7317j8401j8148j7349j6112j3935j1003q096
58433H57544n356k545j79R76J475K660M668O487P867R494J1280J2188J1890J0996
58419I29445R543O887L282q3k778n285p365q064p621p597q645r710r910r604r197
58404H63298q424p291o326n438l906j822j51R04K100L511M308M424M797N605N933
58389H61522N575N441N798N747N035M680N210N821N829N491M970M101L452L919
58375I32591M900M689L166K209K796L721L851L724M048M411M553N187O643Q203
58361I94692R543J1266J3249J4265J3977J3598J3649J2902J0509P452M861K575
$$ y = [946718, 943386, 943195, 945186, 949035, 954866, 962347, 970936, 980492, 990764, 1000698, 1008974, 1014825, 1017784, 1017190, 1012620, 1004324, 992693, 977905, 960588, 942187, 924039, 906690, 890578, 876643, 865640, 857544, 852188, 849643, 849464, 850440, 851915, 854575, 859243, 865730, 873597, 883091, 894371, 906559, 918449, 929445, 938988, 945875, 949157, 949074, 946296, 941011, 933646, 925582, 917961, 910364, 901719, 892009, 882099, 872495, 863298, 854874, 847583, 841257, 835819, 831913, 830091, 829940, 830844, 832944, 836455, 840763, 845187, 849984, 855589, 861522, 867097, 872538, 878336, 884083, 889118, 893798, 899008, 904829, 910658, 916149, 921119, 925220, 928672, 932591, 937491, 942180, 945346, 947555, 950351, 954072, 957923, 961647, 965695, 970106, 974659, 979846, 986489, 994692, 1004235, 1015501, 1028750, 1043015, 1056992, 1070590, 1084239, 1097141, 1107650, 1115102, 1119963, 1122538]
58349A122538L83r79j231j338j802j694l65J351K645L961N713P394Q822J0761
58335A156159J3272J5119J5760J6317J7592J8724J8813J8299J7646J6321J4051
58324A338073J1557R160O349L532K255K710K982J939R33J386K643L619M664O328
58310A398130P910Q729R377J0421J1349J1819J2399J3095J2963J2135J2301J4029
58298A534657J5621J5801J5498J5785J6113J5929J5972J6649J7074J6983J7491
58287A713573J8841J9684J9752K0797K3515K6034K7057K7971L0226L3019L5321
58276A995790L7803M0992M3728M5145M6040M6891M6882M6111M6110M6992M6989
58265B489473M6125M7000N0383N3614N5095N6748N9931O2748O3725O4377O5670
$$ y = [1122538, 1122921, 1121942, 1120711, 1119373, 1117571, 1115877, 1115512, 1116863, 1119508, 1123469, 1129182, 1136576, 1145398, 1156159, 1169431, 1184550, 1200310, 1216627, 1234219, 1252943, 1271756, 1290055, 1307701, 1324022, 1338073, 1349630, 1358790, 1365139, 1368671, 1370926, 1373636, 1376618, 1378557, 1379490, 1380876, 1383519, 1387138, 1391802, 1398130, 1406040, 1414769, 1424146, 1434567, 1445916, 1457735, 1470134, 1483229, 1496192, 1508327, 1520628, 1534657, 1550278, 1566079, 1581577, 1597362, 1613475, 1629404, 1645376, 1662025, 1679099, 1696082, 1713573, 1732414, 1752098, 1771850, 1792647, 1816162, 1842196, 1869253, 1897224, 1927450, 1960469, 1995790, 2033593, 2074585, 2118313, 2163458, 2209498, 2256389, 2303271, 2349382, 2395492, 2442484, 2489473, 2535598, 2582598, 2632981, 2686595, 2741690, 2798438, 2858369, 2921117, 2984842, 3049219, 3114889]
58254C114889O5723O3764O2548O3947O5912O6722O8430P2970P8611Q3492Q8857
58243C895865R5644J01824J06422J12125J20545J29109J36020J43734J53929J63941
58233E159158J72070J81396J94111K07283K18828K32144K49917K68871K86056
58224G169834L04758L28550L55250L82612M14088M52590M94551N36862N83665
58215A1022760O39610P02775P71209Q49662R42688J048532J167348J307626J476902
58206A9929112J675330J906720K186069K528212K941731L444396M071951M862625
58198D3546146N849851P080532Q619713J0526770J2854773J5679939J9074954
58191A23232678K3012467K7335163L1823183L6116349L9362661M0028188L6475634
$$ y = [3114889, 3180612, 3244376, 3306924, 3370871, 3436783, 3503505, 3571935, 3644905, 3723516, 3807008, 3895865, 3991509, 4093333, 4199755, 4311880, 4432425, 4561534, 4697554, 4841288, 4995217, 5159158, 5331228, 5512624, 5706735, 5914018, 6132846, 6364990, 6614907, 6883778, 7169834, 7474592, 7803142, 8158392, 8541004, 8955092, 9407682, 9902233, 10439095, 11022760, 11662370, 12365145, 13136354, 13986016, 14928704, 15977236, 17144584, 18452210, 19929112, 21604442, 23511162, 25697231, 28225443, 31167174, 34611570, 38683521, 43546146, 49395997, 56476529, 65096242, 75623012, 88477785, 104157724, 123232678, 146245145, 173580308, 205403491, 241519840, 280882501, 320910689, 357386323]
58184C57386323K8140442J6239400L213048q628651j8047690k4820385k9162882
58177C24319605l1358040l1731047l0691234k8677708k6085415k3240024k0388876
58170A32147261j7689385j5222109j3024165j1106659r455861q044730o849383
58163E0754969n847207n007017m295978l693363l186957k761125k399334k093351
58155B1470637j838776j625252j440898j282151j149531j037422r37267q47313
58147A1312027p70138p03461o41780n84406n33881m88778m45530m05049l70609
58138F368395l41303l14103k89947k71292k55941k39654k22892k08801j96656
58129D027806j83339j69484j58139j48773j38405j27362j18444j11535j04197
$$ y = [357386323, 385526765, 401766165, 404979213, 396350562, 378302872, 353482487, 324319605, 292961565, 261230518, 230539284, 201861576, 175776161, 152536137, 132147261, 114457876, 99235767, 86211602, 75104943, 65649082, 57604352, 50754969, 44907762, 39900745, 35604767, 31911404, 28724447, 25963322, 23563988, 21470637, 19631861, 18006609, 16565711, 15283560, 14134029, 13096607, 12159340, 11312027, 10541889, 9838428, 9196648, 8612242, 8078361, 7589583, 7144053, 6739004, 6368395, 6027092, 5712989, 5423042, 5151750, 4895809, 4656155, 4433263, 4224462, 4027806, 3844467, 3674983, 3516844, 3368071, 3229666, 3102304, 2983860, 2872325, 2768128]
58120B768128r6607r0986q7029q2543p7657p4059p1173o7183o2795n9943n7964
58109A940189n5036n1978n0656n0058m8035m5536m4973m5571m4584m1989l9845
58098A421928l8010l4715l0600k8016k6867k5058k2522k1062k0653j9589j7921
58087A136915j7191j7142j6098j4321j3731j4642j5799j7092j9124k0775k0434
58076I50566j9071j8894j9559j8974j7273j6570j7148j7285j6552j6001j5291
58065G57948j3031r914q238q218p838o505n734o145o719p261q682j0586j1417
58052F47660j1170j1269j1621j0642q393o793o383n722m397l843m573n236n081
58039E52537m990n355n345m791m602m831m579m142m921o717p599p032o718p584
$$ y = [2768128, 2671521, 2580535, 2493506, 2410963, 2333306, 2259247, 2188074, 2120891, 2058096, 1998153, 1940189, 1885153, 1833175, 1782519, 1732461, 1684426, 1638890, 1593917, 1548346, 1503762, 1461773, 1421928, 1383918, 1349203, 1318603, 1290587, 1263720, 1238662, 1216140, 1195078, 1174425, 1154836, 1136915, 1119724, 1102582, 1086484, 1072163, 1058432, 1043790, 1027991, 1010899, 991775, 971000, 950566, 931495, 912601, 893042, 874068, 856795, 840225, 823077, 805792, 789240, 773239, 757948, 744917, 735003, 726765, 718547, 710709, 704204, 698470, 692325, 685606, 678345, 669663, 659077, 647660, 636490, 625221, 613600, 602958, 594565, 587772, 581389, 575667, 571270, 567427, 562854, 557618, 552537, 547547, 542192, 536847, 532056, 527454, 522623, 518044, 513902, 508981, 502264, 494665, 487633, 480915, 473331]
58025D73331q303p726o559n678m810l859l614m197m523m178m130m755m905l864
58011D02230k614k235k385k286j911j439p16J04N00N92J064J861K151J807J503
57996C98226J210J01j724l035l322l360l570l423k868k769l306l479k733j821
57982C64127j444j381j412j780k287k210j516r68p28j90N77P58L63M05J068J317
57966C54699P99M46O73N66l47j030n61M78J106J269J212O39o45k072l002l374
57950C50856l275k736k179k085k043j228R8P94P67J195K538L840M522N390P089
57935C63543Q958J0186J0918J1440J1405J0592R468Q277O582M283K106N24r27
57922D57355k721m708o731q811j0449j0900j0458j0198j0148r194p183n543n039
$$ y = [473331, 465028, 457302, 450743, 445065, 440255, 436396, 432782, 428585, 424062, 419884, 415754, 410999, 406094, 402230, 399616, 397381, 394996, 392710, 390799, 389360, 388644, 388748, 389248, 389840, 390904, 392765, 394916, 396723, 398226, 399436, 399537, 397813, 394778, 391456, 388096, 384526, 381103, 378235, 375466, 372160, 368681, 365948, 364127, 362683, 361302, 359890, 358110, 355823, 353613, 352097, 351129, 350401, 350211, 350788, 351546, 351909, 352314, 353382, 354699, 355498, 355944, 356617, 357183, 356836, 355806, 355245, 355723, 356829, 358098, 359310, 359949, 359304, 357232, 354230, 350856, 347581, 344845, 342666, 340581, 338538, 337310, 337408, 338202, 338969, 340164, 342702, 346542, 351064, 356454, 363543, 372501, 382687, 393605, 405045, 416450, 427042, 436510, 444787, 451369, 455652, 457758, 458282, 457355, 454634, 449926, 443195, 434384, 423935, 413035, 402577, 392379, 382231, 373037, 365854, 360311, 355272]
57909C55272m567l054j179j04K34M76N21kq14j511k263l165l628l207k285j359
57893C29365m02O16J468K388L955N755O424N590M586M442M491L795K652J712P37
57878C77574o04j733k090k125k410k596k316k126k555l036k852k367k261k339
57864C46164k115j857k002k254k150j874j589p86Q06K449L494M473O023P599Q301
57849C64682Q279Q162P846O948N821N014M270L162K022J245L47j093k306k392
57835D12007j832j638j695j338r63j432k281k191j141m84q50j413j446j247j218
57820C90838j189j068j215j772k332k596k700k845l126l785m986o355p308p768
57806C41793p971p786o898n546m347l465k630j800j183p01j65J56j54q91j363
$$ y = [355272, 350705, 347651, 346472, 346368, 346602, 347078, 347599, 347597, 346783, 345272, 343009, 339844, 336216, 333009, 330724, 329365, 328963, 329579, 331047, 333435, 337390, 343145, 349569, 355159, 359745, 364187, 368678, 372473, 375125, 376837, 377574, 376970, 375237, 373147, 371022, 368612, 366016, 363700, 361574, 359019, 355983, 353131, 350764, 348503, 346164, 344049, 342192, 340190, 337936, 335786, 333912, 332323, 331537, 332343, 334792, 338286, 342759, 348782, 356381, 364682, 372961, 381123, 388969, 395917, 401738, 406752, 411022, 414184, 416206, 417451, 417798, 416705, 414399, 412007, 410175, 408537, 406842, 405504, 404541, 403109, 400828, 398637, 397496, 397012, 396162, 394749, 393303, 392056, 390838, 389649, 388581, 387366, 385594, 383262, 380666, 377966, 375121, 371995, 368210, 363224, 356869, 349561, 341793, 333822, 326036, 319138, 313592, 309245, 305780, 303150, 301350, 300167, 299466, 299301, 299457, 299303, 298412, 297049]
57791B97049j221n86L81J407J858J373O36P44J852L141M018M654N352O043O483
57776C33184O418N667M421L313K691K161J398R20J261J772J214n79k492l539l697
57761C54113l358k793k275k006j844j545j278j308j333p90K49J147J649K115K762
57746C43505L338L548L319K649J690R40Q45J207J444J245O29l60j441j933j526
57731C59099q92q35j095q59j41K47J10J46P09J202R90K53l76m95n7O81J246J430
57713C61363J632K241K784K368R67m33j107j307j549j796j653r81p5N95P96Q91
57697C64736J580K970M143M116K864R64j294l720n601o292o292o722p732q365
57683C35355q032p089n864m179k177o49R4R75L166O821J1315J6215K1564K7399
$$ y = [297049, 295828, 295242, 295623, 297030, 298888, 300261, 300897, 301641, 303493, 306634, 310652, 315306, 320658, 326701, 333184, 339602, 345269, 349690, 353003, 355694, 357855, 359253, 360173, 361434, 363206, 364420, 363841, 361349, 357810, 354113, 350755, 347962, 345687, 343681, 341837, 340292, 339014, 337706, 336373, 335583, 335832, 336979, 338628, 340743, 343505, 346843, 350391, 353710, 356359, 358049, 358989, 359834, 361041, 362485, 363730, 364359, 363999, 362558, 360625, 359099, 358207, 357372, 356277, 355418, 355277, 355524, 355634, 355780, 356489, 357691, 358681, 358934, 358558, 358063, 358006, 358687, 359933, 361363, 362995, 365236, 368020, 370388, 371355, 370922, 369815, 368508, 366959, 365163, 363510, 362529, 362454, 363049, 363845, 364736, 366316, 369286, 373429, 377545, 380409, 381373, 380079, 376359, 370758, 364466, 358174, 351452, 343720, 335355, 327323, 320234, 314370, 310191, 308014, 307365, 307459, 308434, 311600, 318421, 329736, 345951, 367515, 394914]
57669C94914L3546L9786M5918N1406N4808N3685M5783L1077J2506n897k1573l3841
57657G02118m2434m6835m7145m4549m0409l5487l0238k5270k1080j7766j5202
57646C35703j3208j1452r600p650n831m218k827j860j366r30l06m8o27j223n27
57631B74030J262K425J985Q01M2l04p97j400j833k318l092l709l620l091k829
57616B57552k865k589j789j088j134j791k297k179j782j777k176k253j635r14
57602B31283p21o51J4R12R58L2q21j012j162j867k775l368l755m089m019l441
57586B05518l035l356l866l706k933k296k106k017j737j356j052r08r53j127j366
57571A73704j852k797l853m222l688k957k665k553k154j671j586j726j484p65
$$ y = [394914, 428460, 468246, 514164, 565570, 620378, 674063, 719846, 750923, 763429, 757532, 735959, 702118, 659684, 612849, 565704, 521155, 480746, 445259, 415021, 389751, 368671, 350905, 335703, 322495, 311043, 301443, 293793, 287962, 283744, 280917, 279057, 277691, 276761, 276455, 276407, 275780, 274557, 274030, 275292, 277717, 279702, 280503, 280545, 280241, 279444, 278044, 276211, 273893, 270801, 267092, 263472, 260381, 257552, 254687, 252098, 250309, 249221, 248087, 246296, 243999, 241820, 240038, 238261, 236085, 233832, 232197, 231283, 230562, 229911, 229925, 230837, 231795, 231827, 231006, 229994, 228832, 226965, 224190, 220822, 217067, 212978, 208959, 205518, 202483, 199127, 195261, 191555, 188622, 186326, 184220, 182203, 180466, 179110, 178058, 177150, 176197, 175070, 173704, 171852, 169055, 165202, 160980, 157292, 154335, 151670, 149117, 146963, 145292, 143706, 141980, 140496, 139731]
57557A39731j03J22J04K68Q31J701K518K922K860K555K117J502Q54M70K95n2n98
57540A58097r06q11o80o88m64J63P00P72P18Q88R51N63J46K54N72L96k37o29m73
57521A59332l6N18J204J777J898J777J935K321K370J949J599J661J799J584J067
57506A82755N47J91J06L55O69N10k75j162j574j560j556j723j834j790j845k147
57490A69667k429k370k161k294k767k886k143r34q2J50J02k0l56r16j450j875
57474A47236k311k642k606k352k340k528k387j894j734k106k114j021N07J136
57460A22844N31m40r03p31k56J90L97L88L77M50M21K12P9J85K98K27J74K91L24
57441A25058J58J81N99Q83N56Q3K25Q22J127J114J423K038K052J090M8o8N63J010
$$ y = [139731, 139628, 139750, 139854, 140122, 140953, 142654, 145172, 148094, 150954, 153509, 155626, 157128, 157982, 158452, 158747, 158695, 158097, 157191, 156380, 155700, 155012, 154548, 154711, 155411, 156183, 156901, 157789, 158740, 159303, 159449, 159703, 160275, 160671, 160434, 159805, 159332, 159296, 159814, 161018, 162795, 164693, 166470, 168405, 170726, 173096, 175045, 176644, 178305, 180104, 181688, 182755, 183302, 183493, 183599, 183954, 184623, 185133, 184858, 183696, 182122, 180562, 179006, 177283, 175449, 173659, 171814, 169667, 167238, 164868, 162707, 160413, 157646, 154760, 152617, 151683, 151601, 151751, 151853, 151833, 151477, 150561, 149111, 147236, 144925, 142283, 139677, 137325, 134985, 132457, 130070, 128176, 126442, 124336, 122222, 121201, 121708, 122844, 123375, 122935, 122032, 121301, 121045, 121235, 121632, 122020, 122397, 122847, 123268, 123480, 123559, 123744, 124042, 124269, 124443, 124734, 125058, 125216, 125397, 125996, 126879, 127435, 127518, 127743, 128565, 129692, 130806, 132229, 134267, 136319, 137409, 137457, 137389, 137952, 138962]
57423A38962Q70N53M57M22O5o32j253j416j168q25m93PP00J202J189R12R85J654
57405A42191K445K482J212r57k832l491l190k831k614j905n47N77P75O25J079
57390A33019K059K669K471J829J256J123J720K853L610L234K081J072L92m96j693
57375A57199k519k445j749j155j256k120l018k887j700r40j776l168l007r96R78
57360A29441J504J233J258J398R80L26K90R26J692K493L502M210L744K193P75
57345A55965L74O02O08L04K72P13J030O75Q5K85J490K643K662J828J363J759K273
57328A74931K090J398R39J035J438J827K063K176K306K563K823K831K563K175
57314B03158J645Q47M2j81L32J018J338J402J632K115K592K841K787K490K208
$$ y = [138962, 139832, 140385, 140842, 141264, 141329, 140697, 139444, 138028, 136860, 136035, 135542, 135549, 136249, 137451, 138640, 139552, 140537, 142191, 144636, 147118, 148330, 147373, 144541, 141050, 137860, 135029, 132415, 130510, 129963, 130540, 131315, 131940, 133019, 135078, 137747, 140218, 142047, 143303, 144426, 146146, 148999, 152609, 155843, 157924, 158996, 159388, 158892, 157199, 154680, 152235, 150486, 149331, 148075, 145955, 142937, 140050, 138350, 137410, 135634, 132466, 129459, 128463, 129441, 130945, 132178, 133436, 134834, 135814, 136140, 136430, 137356, 139048, 141541, 145043, 149253, 152997, 155190, 155965, 156339, 156941, 157549, 157853, 158125, 158838, 159868, 160543, 160628, 160913, 162403, 165046, 167708, 169536, 170899, 172658, 174931, 177021, 178419, 179358, 180393, 181831, 183658, 185721, 187897, 190203, 192766, 195589, 198420, 200983, 203158, 204803, 205650, 205692, 205511, 205843, 206861, 208199, 209601, 211233, 213348, 215940, 218781, 221568, 224058, 226266]
57299B26266K296K745L104L016K593K168J887J786J956K397K930L336L499L357
57285B63336L045K942L230L436L002K270K179K796L058K374J618J839K660K881
57271C00666K240J584J531J837K140K524L118L737M173M487M841N339O023O720
57257C50960O979O512N675N110M943M794M498M380M662N101N357N421N480N693
57243D25565O139O747P156P027O498O033N786N486N132N207N916O618O529N786
57229E11625N274N494O028O251O200O422P236Q368R344R930J0126R913R275Q452
57215F19938P956Q185R097J0268J1185J1483J1130J0537J0292J0601J1112J1394
57203G43178J1453J1579J1818J1962J1973J2099J2573J3347J4184J4711J4539
$$ y = [226266, 228562, 231307, 234411, 237427, 240020, 242188, 244075, 245861, 247817, 250214, 253144, 256480, 259979, 263336, 266381, 269323, 272553, 275989, 278991, 281261, 283440, 286236, 289294, 291668, 293286, 295125, 297785, 300666, 302906, 304490, 306021, 307858, 309998, 312522, 315640, 319377, 323550, 328037, 332878, 338217, 344240, 350960, 357939, 364451, 370126, 375236, 380179, 384973, 389471, 393851, 398513, 403614, 408971, 414392, 419872, 425565, 431704, 438451, 445607, 452634, 459132, 465165, 470951, 476437, 481569, 486776, 492692, 499310, 505839, 511625, 516899, 522393, 528421, 534672, 540872, 547294, 554530, 562898, 572242, 582172, 592298, 602211, 611486, 619938, 627894, 636079, 645176, 655444, 666629, 678112, 689242, 699779, 710071, 720672, 731784, 743178, 754631, 766210, 778028, 789990, 801963, 814062, 826635, 839982, 854166, 868877, 883416]
57192H83416J3621J2533J2029J2291J2887J3485J4203J5083J5734J5817J5598
57181A036697J5605J5954J6378J6836J7591J8706J9785K0359K0293J9750J8964
57170A236918J8216J7841J8059J8755J9529J9994K0069K0005K0128K0551K1227
57159A451292K2206K3568K5015K5893K5935K5748K6155K7176K8088K8488K8663
57148A738227K8862K8687K7742K6418K5495K5099K4594K3548K2346K1609K1334
57137B013961K0922K0018J9058J8847J9690K0996K1863K1932K1674K1805K2607
57126B243373K3788K4845K5496K5918K6658K8276L0964L4529L8724M3515M9111
57115B595197N5855O4078P3758Q4434R5630J07461J20622J35789J53378J73867
$$ y = [883416, 897037, 909570, 921599, 933890, 946777, 960262, 974465, 989548, 1005282, 1021099, 1036697, 1052302, 1068256, 1084634, 1101470, 1119061, 1137767, 1157552, 1177911, 1198204, 1217954, 1236918, 1255134, 1272975, 1291034, 1309789, 1329318, 1349312, 1369381, 1389386, 1409514, 1430065, 1451292, 1473498, 1497066, 1522081, 1547974, 1573909, 1599657, 1625812, 1652988, 1681076, 1709564, 1738227, 1767089, 1795776, 1823518, 1849936, 1875431, 1900530, 1925124, 1948672, 1971018, 1992627, 2013961, 2034883, 2054901, 2073959, 2092806, 2112496, 2133492, 2155355, 2177287, 2198961, 2220766, 2243373, 2267161, 2292006, 2317502, 2343420, 2370078, 2398354, 2429318, 2463847, 2502571, 2546086, 2595197, 2651052, 2715130, 2788888, 2873322, 2968952, 3076413, 3197035, 3332824, 3486202, 3660069]
57105C660069J98169K27546K63546L07973L62877M30698N14797O19548P49385
57096G334608R07814J097541J320430J575663J857553K156087K459543K755843
57088B1465082L032617L279168L489494L661140L788393L854680L827633L658163
57080E0056370L291092K695471J900593J000882J11900o88094j377398j962283
57072E5028533k444050k816918l083039l253828l337543l335870l254811l111913
57064C0390561k929552k725117k509510k290743k075206j867199j669838j485905
57056A2837491j316767j161916j020718q93587p80870o81850n95692n21996m59687
57047E404408m06601l60933l22116k89657k62294k38941k19329k03069j89230
$$ y = [3660069, 3858238, 4085784, 4349330, 4657303, 5020180, 5450878, 5965675, 6585223, 7334608, 8242422, 9339963, 10660393, 12236056, 14093609, 16249696, 18709239, 21465082, 24497699, 27776867, 31266361, 34927501, 38715894, 42570574, 46398207, 50056370, 53347462, 56042933, 57943526, 58944408, 59056308, 58368214, 56990816, 55028533, 52584483, 49767565, 46684526, 43430698, 40093155, 36757285, 33502474, 30390561, 27461009, 24735892, 22226382, 19935639, 17860433, 15993234, 14323396, 12837491, 11520724, 10358808, 9338090, 8444503, 7663633, 6981783, 6386091, 5864095, 5404408, 4997807, 4636874, 4314758, 4025101, 3762807, 3523866, 3304537, 3101468, 2912238]
57038B912238j77362j67698j59611j51101j40703j28828j16458j03579q9867p5889
57028A601142o2425m9346l6195k3634j3576q255r279j6620k7834l9144m8080n4556
57016A212198n9198o1773o1892o0047n6912n2537m7191m2100l8215l5042l1792
57005F65499k8923k7324k6509k5058k2564k0009j8257j7264j6664j6257j5812
56994D30858j5128j4244j3103j1254q424n134k082P59L806O956R579J1095J1077
56981D04761R217N804J828j999n802r568j2303j3108j2532j1859j1378j0399q608
56968C24054o416m165j952q5J282K830N435Q897J2184J4882J7384J9602K0346
56955D14278J8309J3148N679k421r289j3960j6885j8845j9687j8826j6584j4037
$$ y = [2912238, 2734876, 2567178, 2407567, 2256466, 2115763, 1986935, 1870477, 1766898, 1677031, 1601142, 1538717, 1489371, 1453176, 1429542, 1415966, 1407711, 1398432, 1381812, 1353978, 1314834, 1266754, 1212198, 1153000, 1091227, 1029335, 969288, 912376, 859839, 812648, 770548, 732333, 697291, 665499, 636576, 609252, 582743, 557685, 535121, 515112, 496855, 479591, 462927, 446670, 430858, 415730, 401486, 388383, 377129, 368705, 363571, 361489, 362248, 366054, 373010, 382589, 393684, 404761, 413978, 419782, 421610, 419611, 413809, 404241, 391938, 378830, 366298, 354439, 343061, 332662, 324054, 317638, 313473, 311521, 311436, 312718, 315548, 320983, 329880, 342064, 356946, 374330, 393932, 414278, 432587, 445735, 451414, 448993, 439704, 425744, 408859, 390014, 370327, 351501, 334917, 320880]
56943C20880j1651r058o143l352q17J941N218Q823J2663J6867K1206K5031K7767
56930D09375K8732K6691K0689J1595J876o476j3114j8379k2235k4529k5454k5242
56918C63529k3952k1932j9818j7870j5875j3898j2410j1379j0089q294o764o162
56906A95086o022n461m400l424k787k166j217K0J166J689J362P10P45J960L848
56891A81109N670P358R421J2172J5259J7789J8736J7557J4552J0475N818Q13l918
56878C12811p367r009r314r062q459p187n055k272Q54M222P899J1848J5786J9466
56864C15161K3174K7596L2982L8624M3182M5223M3307L6433K5114J1604j535j2898
56852F27967k1864k7688k9980k9609k7911k5143k0809j5300r901n059J57O602
$$ y = [320880, 309229, 300171, 294028, 290676, 289859, 291800, 297018, 305841, 318504, 335371, 356577, 381608, 409375, 438107, 464798, 485487, 497082, 498958, 492482, 479368, 460989, 438754, 414225, 388771, 363529, 339577, 317645, 297827, 279957, 264082, 250184, 237774, 226395, 216306, 208012, 201248, 195086, 189064, 183603, 179203, 175779, 172992, 170826, 169609, 169629, 170795, 172484, 173846, 174556, 175301, 177261, 181109, 186779, 194137, 203558, 215730, 230989, 248778, 267514, 285071, 299623, 310098, 315916, 316729, 312811, 305444, 296435, 287121, 278059, 269600, 262413, 257358, 255086, 255940, 260162, 268061, 279909, 295695, 315161, 338335, 365931, 398913, 437537, 480719, 525942, 569249, 605682, 630796, 642400, 640865, 627967, 606103, 578415, 548435, 518826, 490915, 465772, 444963, 429663, 419762, 414703, 414860, 421462]
56840D21462J4136K2447L1615M1450N1255O0523O8656P3508P1568O0798M2758
56829I60176K1297j73j9550l5356m6636n3372n6126n5393n1751m6275m0080l3586
56817E43175k6681j9426j2079m720K797J0631J8933K7743L6633M4591N0197N1558
56805G23352M6478L3991J6241k191j7608k9334l8203m4096m6140m4590m1130l7170
56793E19600l2868k7883k2387j7008j2218p933l580J374O771J1932J6528K0784
56781D53112K4411K5848K3307J6499O985l047j2043j9429k5185k9146l0801l0090
56769D00421k8196k6723k5862k4256k1109j7518j5021j3635j2359j0933r985r632
56757A85192r128p938o313m716l363k418k024k036k094k011j739j188m50Nj47
$$ y = [421462, 435598, 458045, 489660, 531110, 582365, 642888, 711544, 785052, 856620, 917418, 960176, 981473, 981300, 961750, 926394, 879758, 826386, 770260, 714867, 663116, 616841, 576761, 543175, 516494, 497068, 484989, 480269, 483066, 493697, 512630, 540373, 577006, 621597, 671794, 723352, 769830, 803821, 820062, 817871, 800263, 770929, 732726, 688630, 642490, 597900, 556770, 519600, 486732, 458849, 436462, 419454, 407236, 399303, 395723, 397097, 403868, 415800, 432328, 453112, 477523, 503371, 526678, 543177, 550162, 547115, 535072, 515643, 490458, 461312, 430511, 400421, 372225, 345502, 319640, 295384, 274275, 256757, 241736, 228101, 215742, 204809, 194824, 185192, 176064, 168126, 161813, 157097, 153734, 151316, 149292, 147256, 145162, 143151, 141412, 140224, 139774, 139779, 139632]
56742A39632o18j023j486k138k429j730m99R1l07p79m44N73J565K011J708P68
56726A34895k14n24j02L76M44M06O89J139J288J108J035J304J558J228K31p91
56710A44070j017l06O30J024Q62P22R66J420J770J921J871J537R37L81K66O20
56694A57674J013J012O70L89L63M01L28K63K97K90K56N47J222J686J475J079J198
56677A70163J539J260M54J02M57O75K26l35m58m41o57q51p46n85m65J7Q60J271
56659A72486Q41K86L01M95L05N7K14K81l77j252j403r88r88j635k176k046j360
56642A63041m35L52M77j57p83o58j09N5k16l91l49l23j71L26P74O87L55L14L14
56623A63103j11n43l42L2l76j261j412o76j27k15k35J13J33n09j102j171j211
$$ y = [139632, 139014, 137991, 136505, 134367, 131938, 130208, 129709, 129800, 129493, 128714, 128270, 128843, 130408, 132419, 134127, 134895, 134681, 134157, 134055, 134431, 134875, 135281, 135970, 137109, 138397, 139505, 140540, 141844, 143402, 144630, 144861, 144070, 143053, 142747, 143377, 144401, 145263, 145985, 146951, 148371, 150141, 152062, 153933, 155470, 156407, 156788, 157054, 157674, 158687, 159699, 160369, 160758, 161121, 161522, 161850, 162113, 162410, 162700, 162956, 163503, 164725, 166411, 167886, 168965, 170163, 171702, 172962, 173416, 173518, 173975, 174650, 174876, 174541, 174083, 173642, 172985, 172134, 171388, 170803, 170338, 170355, 171215, 172486, 173327, 173613, 173914, 174409, 174714, 174771, 174985, 175266, 174889, 173637, 172234, 171246, 170258, 168623, 166447, 164401, 163041, 162606, 162958, 163435, 163278, 162495, 161837, 161728, 161783, 161567, 161176, 160827, 160504, 160333, 160659, 161433, 162120, 162475, 162789, 163103, 162992, 162449, 162107, 162139, 161763, 160502, 159090, 158414, 158287, 158072, 157837, 157950, 158083, 157574, 156472, 155301, 154090]
56606A54090j600j843j534j074p92l36M44Q44L18n47q18m30N1L44N12N08K61%
56588A48398l1J03K51N01R56J428J612J343P25J67K41J046J827J739R30L25M84
56571A62045J273K488L916M861M624L643L305M325O113P913R676J1431J2744J3320
56557B51677J3438J3225J2112R577O017K427m17k216l040l310l517l681l536l208
56543B85548l214l655m047m104m068m110m049l833l717l731l627l436l436l502
56529B33019l245k828k801l068k940k351j994k050j921j527j620k390k907k662
56515A98715k417k824l271l039k608k676k860k452j821j735j875j300j14N53J82
56500A70458m81n60n2M29L87j14n01k34N11J036J171J472K079K204J359L72K84
$$ y = [154090, 152490, 150647, 149113, 148039, 147247, 146911, 147355, 148199, 148517, 147970, 147152, 146722, 146773, 147117, 147629, 148137, 148398, 148398, 148367, 148470, 148721, 149222, 150178, 151606, 153218, 154561, 155286, 155453, 155694, 156740, 158567, 160306, 161236, 161561, 162045, 163318, 165806, 169722, 174583, 179207, 182850, 186155, 190480, 196593, 204506, 214182, 225613, 238357, 251677, 265115, 278340, 290452, 300029, 306046, 308473, 308056, 305840, 302800, 299490, 295973, 292292, 288756, 285548, 282334, 278679, 274632, 270528, 266460, 262350, 258301, 254468, 250751, 247020, 243393, 239957, 236521, 233019, 229774, 226946, 224145, 221077, 218137, 215786, 213792, 211742, 209821, 208294, 206674, 204284, 201377, 198715, 196298, 193474, 190203, 187164, 184556, 181880, 179020, 176568, 174747, 173012, 171137, 169837, 169723, 170276, 170458, 169977, 169417, 169365, 169794, 170181, 170067, 169566, 169332, 169843, 170879, 172050, 173522, 175601, 177805, 179164, 179536, 179820]
56483A79820Q19Q76K12m01m51j88J14M91Q08N93k90j262j545q26N28J768K262
56466A83328J914R93k57j522k143j585l80K07k42p99o24p4J78L12Q05J433J721
56449A83265J906K552L398L532K593J159J9m63l73j61k70n53m42Pj34j274k397
56432A92364k285j161k04J27K39K50j63p87q09M6J093J605J518J128O71L88M26
56415A94446N23K09m38p30j48J046K105K440J944R96J91q1J36N14P10N05j1l74
56397B03983k33M0k66j060j358o47L31O10K57QJ38L46M52N56P02Q27Q97P82L26
56378B06691k06k45K22M83K16P5O47J441J624J194P18L92J61K98J012J792J967
56361B18482J639J318J045O08L41P07J316J308O66K93O79J311J579J558J643J841
$$ y = [179820, 180639, 181515, 181727, 181326, 180875, 180687, 180801, 181292, 182100, 182693, 182403, 181141, 179596, 178770, 179298, 181066, 183328, 185242, 186235, 185978, 184456, 182313, 180728, 180348, 180555, 180313, 179514, 178890, 178816, 178994, 179306, 180111, 181544, 183265, 185171, 187723, 191121, 194653, 197246, 198405, 198424, 197961, 197588, 197427, 197157, 196604, 196162, 196169, 196035, 194761, 192364, 190079, 188918, 188714, 188841, 189080, 189330, 189167, 188380, 187571, 187617, 188710, 190315, 191833, 192961, 193632, 194020, 194446, 194969, 195178, 194740, 194010, 193862, 194908, 197013, 199453, 201397, 202393, 202584, 202503, 202639, 203153, 203863, 204368, 204357, 203983, 203750, 203790, 203524, 202464, 201106, 200459, 200790, 201400, 201657, 201665, 201803, 202149, 202601, 203157, 203859, 204686, 205583, 206365, 206691, 206485, 206240, 206462, 206945, 207161, 207236, 207883, 209324, 210948, 212142, 212860, 213252, 213413, 213711, 214723, 216515, 218482, 220121, 221439, 222484, 223092, 223433, 224140, 225456, 226764, 227430, 227723, 228402, 229713, 231292, 232850, 234493, 236334]
56345B36334J687Q35l84r88l10J043J723J322R01J437K559L329L553L581L427
56330B60049L061K964L508M145M163L814L778L890L415K350J394P43k3q73j196
56315B95182q29l96l76n32m49r1L49O36N62K00J02P94K140L542M645N454N946
56298C16879N986N591M972M458M323M391L872K329P25N60J779K742K729K961M365
56283C68662N786N811N145N496O897P890P857P507P312P073O980P649Q933R956
56269D68954J0421J0891J1753J2849J4023J5175J5922J6206J6956J9157K2497
56258F34804K5913K9142L2717L6818M1322M6622N3068N9895O6036P1908P8951
56247A177196Q7475R6282J04446J12067J19065J24536J27724J28618J27244J23247
$$ y = [236334, 238021, 238856, 238472, 237484, 237174, 238217, 239940, 241262, 242163, 243600, 246159, 249488, 253041, 256622, 260049, 263110, 266074, 269582, 273727, 277890, 281704, 285482, 289372, 292787, 295137, 296531, 297274, 297251, 296378, 295182, 294353, 293957, 293581, 293049, 292600, 292509, 292858, 293494, 294056, 294256, 294358, 295152, 297292, 300834, 305479, 310933, 316879, 322865, 328456, 333428, 337886, 342209, 346600, 350472, 352801, 353526, 354086, 355865, 358607, 361336, 364297, 368662, 374448, 380259, 385404, 390900, 397797, 405687, 413544, 421051, 428363, 435436, 442416, 450065, 458998, 468954, 479375, 490266, 502019, 514868, 528891, 544066, 559988, 576194, 593150, 612307, 634804, 660717, 689859, 722576, 759394, 800716, 847338, 900406, 960301, 1026337, 1098245, 1177196, 1264671, 1360953, 1465399, 1577466, 1696531, 1821067, 1948791, 2077409, 2204653, 2327900]
56237B327900J16328J06428R3449P7514N9374L9858J9209k170k2815m1141n6906
56226B717028p0617q1962r0158r5580r9544j02538j03923j03352j01267r8102
56216A769985r4171r0210q6808q3434p9182p4287o9706o5498o0943n5995n1307
56205I58444m7005m2787l8903l5701l2614k9006k5595k3454k2054k0045j7466
56194F23814j5378j3745j1710r633q642q346p297n652n028n559n490m151k938
56181E20245k813l034k954k972l024k210o67K40J64L16J092J333O82N41J711L048
56165E11698L508L662M162M579M746N550P288Q799R238R275R754J0658J1991J4073
56151F18981J6410J8011J9334K1971K5974K9700L2949L7753M5114N3317O0760
$$ y = [2327900, 2444228, 2550656, 2644105, 2721619, 2780993, 2820851, 2840060, 2837890, 2815075, 2773934, 2717028, 2646411, 2564449, 2474291, 2378711, 2279167, 2176629, 2072706, 1969354, 1868087, 1769985, 1675814, 1585604, 1498796, 1415362, 1336180, 1261893, 1192187, 1126689, 1065746, 1009751, 958444, 911439, 868652, 829749, 794048, 761434, 732428, 706833, 683379, 661325, 641280, 623814, 608436, 594691, 582981, 573348, 564706, 556360, 549063, 543411, 538383, 532824, 527334, 523183, 520245, 517432, 514398, 511444, 508472, 505448, 503238, 502571, 502811, 502975, 503291, 504383, 505716, 506398, 506939, 508650, 511698, 515206, 518868, 523030, 527609, 532355, 537905, 545193, 553992, 563230, 572505, 582259, 592917, 604908, 618981, 635391, 653402, 672736, 694707, 720681, 750381, 783330, 821083, 866197, 919514, 980274]
56140I80274O8085P6077Q3716Q9865R4902R8918J00142R6928Q9916Q0902P1163
56129A930888O2099N5643N2265M9939M6410M1150L4233K5157J4228L372n885j3870
56117B295629k1237k7886l4530m3251n4973o7961q0074r0625r8809j02671j01377
56106A572235r6773r0956q3991p5458o6273n7441m8745m0279l3392k8512k3990
56095I26425j8726j4037j1281r596p701n930m750l303j199K49L94P68K414L929
56081H57656M050L949M850N628N114M588N613P323Q256Q975J0499J1987J2338
56068I50826J2311J2943J3652J3927J4762J6379J6866J5294J3786J4108J4787
56057A109641J4149J3482J4308J5137J4150J2685J2756J3368J2647J1530J1910
$$ y = [980274, 1048359, 1124436, 1208152, 1298017, 1392919, 1491837, 1591979, 1688907, 1778823, 1859725, 1930888, 1992987, 2048630, 2100895, 2150834, 2197244, 2238394, 2272627, 2297784, 2312012, 2315384, 2309499, 2295629, 2274392, 2246506, 2211976, 2168725, 2113752, 2045791, 1965717, 1875092, 1776283, 1673612, 1572235, 1475462, 1384506, 1300515, 1225057, 1158784, 1101343, 1052598, 1012319, 978927, 950415, 926425, 907699, 893662, 882381, 872785, 865084, 859154, 854404, 851101, 849902, 850151, 850545, 851313, 853727, 857656, 861706, 865655, 870505, 876133, 881247, 885835, 891448, 898771, 907027, 916002, 926501, 938488, 950826, 963137, 976080, 989732, 1003659, 1018421, 1034800, 1051666, 1066960, 1080746, 1094854, 1109641, 1123790, 1137272, 1151580, 1166717, 1180867, 1193552, 1206308, 1219676, 1232323, 1243853, 1255763]
56046A255763J3085J3426J3648J5161J7025J7738J8226J9916K1869K2875K4232
56035A452964K7273L0472L2152L3635L6357L8550L8356L7515L8191L8925L7684
56024A842074L6133L6695L8121L8360L8947M2027M5750M7478M8703N1898N5353
56013B321539N6408N7053O0731O6154O9865P2475P6538Q0848Q2845Q4365Q8815
56002C117636R4870R9082J02469J08311J15658J21491J27029J35394J45232J53264
55992D320436J60806J71134J82992J93494K04634K19812K36974K52619K69296
55983F212197K91259L16285L40112L65285L96786M32851M69386N09330N57812
55974I891303O12548O69641P34128Q13698R07021J010282J129788J275605J449274
$$ y = [1255763, 1268848, 1282274, 1295922, 1311083, 1328108, 1345846, 1364072, 1383988, 1405857, 1428732, 1452964, 1480237, 1510709, 1542861, 1576496, 1612853, 1651403, 1689759, 1727274, 1765465, 1804390, 1842074, 1878207, 1914902, 1953023, 1991383, 2030330, 2072357, 2118107, 2165585, 2214288, 2266186, 2321539, 2377947, 2435000, 2495731, 2561885, 2631750, 2704225, 2780763, 2861611, 2944456, 3028821, 3117636, 3212506, 3311588, 3414057, 3522368, 3638026, 3759517, 3886546, 4021940, 4167172, 4320436, 4481242, 4652376, 4835368, 5028862, 5233496, 5453308, 5690282, 5942901, 6212197, 6503456, 6819741, 7159853, 7525138, 7921924, 8354775, 8824161, 9333491, 9891303, 10503851, 11173492, 11907620, 12721318, 13628339, 14638621, 15768409, 17044014, 18493288]
55965A8493288J651624J895931K199108K568992L017345L576270M284762N171818
55957D2859138O272838P646718R354820J1445930J3986040J7056521K0662802
55950A29284807K4673762K8890876L3043914L6478157L7837170L5423384K8313187
55943C53945257J7273723M500199p616403j7535413k4700485k9113070l1025108
55936B65728700l0891168k9307760k6847745k3952462k0948572j8077660j5479984
55929A00223349j3197781j1225664r546989q130546o932555n919040n070308m361780
55921C5838686l761005l246677k812253k448196k137324j869359j643698j455164
55913A6465010j291405j146383j022809r19312q27816p45324o76140o20269n70720
$$ y = [18493288, 20144912, 22040843, 24239951, 26808943, 29826288, 33402558, 37687320, 42859138, 49131976, 56778694, 66133514, 77579444, 91565484, 108622005, 129284807, 153958569, 182849445, 215893359, 252371516, 290208686, 325632070, 353945257, 371218980, 375719179, 368102776, 350567363, 325866878, 296753808, 265728700, 234837532, 205529772, 178682027, 154729565, 133780993, 115703333, 100223349, 87025568, 75799904, 66252915, 58122369, 51189814, 45270774, 40200466, 35838686, 32077681, 28831004, 26018751, 23570555, 21433231, 19563872, 17920174, 16465010, 15173605, 14027222, 13004413, 12085101, 11257285, 10511961, 9835821, 9215552, 8644832]
55904H644832n24141m83599m49136m15596l81651l51543l26139l01095k75502
55895E136430k53623k36337k19151k00502j84228j71946j60320j47695j36515
55886C426113j27385j17368j05945r6474r0229q4751p9433p6874p7327p7372p5448
55875B417507p3537p2404p0331o7476o6283o6616o5458o2247n9584n8025n5256
55864A700290n1057m7965m6187m3089l8563l5667l4923l3101k9007k5410k3817
55853A291504k2254j9882j9009k0602k2177k2184k2398k4077k5537k5433k4890
55842A043061k4634k3478k1270k0068k0666k1058j9821j8095j6939j5660j3916
55831H27456j2593j1603r790p703p329q465q661p523p382q857r655q882q693j0085
$$ y = [8644832, 8120691, 7637092, 7187956, 6772360, 6390709, 6039166, 5713027, 5411932, 5136430, 4882807, 4646470, 4427319, 4226817, 4042589, 3870643, 3710323, 3562628, 3426113, 3298728, 3181360, 3075415, 2978941, 2888712, 2803961, 2724528, 2647654, 2570327, 2492955, 2417507, 2343970, 2271566, 2201235, 2133759, 2067476, 2000860, 1935402, 1873155, 1813571, 1755546, 1700290, 1649233, 1601268, 1555081, 1511992, 1473429, 1437762, 1402839, 1369738, 1340731, 1315321, 1291504, 1269250, 1249368, 1230359, 1209757, 1187580, 1165396, 1142998, 1118921, 1093384, 1067951, 1043061, 1018427, 994949, 973679, 953611, 932945, 911887, 892066, 873971, 857032, 841372, 827456, 814863, 803260, 793470, 785767, 778438, 769973, 761312, 753789, 746407, 737550, 727895, 719013, 710320, 700235]
55817G00235j0876r701q470q778r191q240p016o593n772l636j730j379j218L93
55803F18028K645M062M980O266P396P638P472P183N852L221P39o89k188m649o940
55788F61016p823p898q097q039p399p208q302r957j1370j2920j4808j6069j6157
55775E24969j5851j5495j4050j1105q012n944m487l243k884l435l450k328j550
55762D33135k193l126l136k966l640m463m455m180m447m631m028l500m076n075
55748C79219n300n010n130n523n489n109m817m475l979l800l963l661k813k616
55734C17534l567m351l927l140l018k987k243j529j829k527k506k086k209k657
55720B78958k574k079j892k029k067k056k114j843j057k79L10J304K690L305K667
$$ y = [700235, 689359, 679658, 671188, 662410, 653219, 644979, 637963, 631370, 625598, 621962, 620232, 618853, 617635, 618028, 620673, 624735, 629715, 635981, 643377, 651015, 658487, 665670, 671522, 674743, 675482, 674793, 672605, 667956, 661016, 653193, 645295, 637198, 629159, 621760, 614552, 606250, 596293, 584923, 572003, 557195, 541126, 524969, 509118, 493623, 479573, 468468, 460456, 454512, 450025, 446782, 443898, 440463, 437013, 434685, 433135, 430942, 427816, 424680, 421714, 418074, 413611, 409156, 404976, 400529, 395898, 391870, 388370, 384294, 379219, 373919, 368909, 363779, 358256, 352767, 347658, 342841, 338366, 334387, 330587, 326624, 322963, 320150, 317534, 313967, 309616, 305689, 302549, 299531, 296544, 294301, 292772, 290943, 288416, 285910, 283824, 281615, 278958, 276384, 274305, 272413, 270384, 268317, 266261, 264147, 262304, 261247, 260968, 261278, 262582, 265272, 268577, 271244]
55705B71244J944K023K020J019j84n76p69j728k813k899k359k168j955p67Q72
55690B62904J507Q88N1l55m09n4P56J486J700J841K280K352J452L04o9J00Q3P5
55672B76892N74J079Q55L00K08L49J26j45Lp5j055k045j755o84l89j041j403r61
55654B70833l10L22J281K271K425J738J096Q71O70L25q9r47k636m541n698o170
55638B61441o594o774o126n165m974n364n183m330l888m126m055l239k500k329
55624A96794k056j149j84J74J56K31L15J49j46m29q29j396j970k582l412m158
55608A79508m075k882j170J35M17l22j343j601q78k10n33j355j566j122q69r70
55592A61164p35K0N93N74L97M44M45J09l18l88J55J344K811L716L513K760K521
$$ y = [271244, 273188, 275211, 277231, 278250, 278066, 277490, 276721, 274993, 272180, 269281, 266922, 264754, 262799, 262032, 262904, 264411, 265299, 265350, 264995, 264586, 264532, 265288, 266774, 268474, 270315, 272595, 274947, 276399, 276703, 276634, 276734, 276817, 276892, 277466, 278545, 279400, 279700, 279908, 280257, 280383, 280238, 280241, 280166, 279111, 277066, 275311, 274627, 274238, 273197, 271794, 270833, 270523, 270845, 272126, 274397, 276822, 278560, 279656, 280527, 281197, 281522, 281433, 280486, 277850, 273309, 267611, 261441, 254847, 248073, 241947, 236782, 231808, 226444, 221261, 216931, 213043, 208917, 204862, 201623, 199123, 196794, 194738, 193589, 193405, 193579, 193735, 193966, 194281, 194430, 194284, 193855, 193026, 191630, 189660, 187078, 183666, 179508, 175433, 172551, 171381, 171516, 171933, 171611, 170268, 168667, 167789, 167579, 167046, 165691, 164125, 163003, 162134, 161164, 160429, 160449, 161042, 161616, 162013, 162457, 162902, 163011, 162693, 162305, 162460, 163804, 166615, 170331, 173844, 176604, 179125]
55575A79125L109M004M824N572O158O540P273Q854J0524J0718Q909O169L766K022
55561B67567N89r70l129n983q678r984r717q894q313p772o890n865m969m059l079
55546A79854k417k302k318k045j728j861k361k581k018p82N22J283J390J219J105
55531A64960R03M16m6j5L37K55o59j938k764k713j991j187q05q22q57q35j149
55514A51090j915k576k651k461k495k543k114j360q60o57l26J44L32J81J01K01
55498A32091R5m27j037j287j025m02J88L62K22K96O64O12k51j066p71L24R34N31
55480A30053j85n03l88j0N85J163J425J458J474J159P4j338k031j704j143j084
55464A29005j446j804j923j691j134o16m55m14q9L12L25J06J66L50J09l24j12
$$ y = [179125, 182234, 186238, 191062, 196634, 202792, 209332, 216605, 225459, 235983, 246701, 255610, 261779, 265545, 267567, 268156, 267186, 264057, 258074, 249396, 239412, 229695, 220801, 212488, 204716, 197826, 191961, 186992, 182933, 179854, 177437, 175135, 172817, 170772, 169044, 167183, 164822, 162241, 160223, 159441, 159963, 161246, 162636, 163855, 164960, 165863, 166279, 166233, 166218, 166555, 166810, 166151, 164213, 161449, 158736, 156745, 155558, 154753, 153931, 153074, 152239, 151090, 149175, 146599, 143948, 141487, 138992, 136449, 134335, 132975, 132115, 131458, 131132, 131276, 131608, 131789, 131890, 132091, 132186, 131759, 130722, 129435, 128410, 128008, 128196, 128558, 128780, 129076, 129740, 130352, 130101, 129035, 128264, 128588, 129522, 130053, 129868, 129365, 128977, 128967, 129552, 130715, 132140, 133598, 135072, 136231, 136305, 134967, 132936, 131232, 130089, 129005, 127559, 125755, 123832, 122141, 121007, 120391, 119936, 119522, 119433, 119745, 120070, 120176, 120342, 120692, 120801, 120477, 120365]
55447A20365O96R99K66p18j068q22l26M11J183J354P90K75L53M73k2o82o07J98
55429A23118R09J078R65Q53O84M15J63n9l73p12p58k77N32J101Q88r4j094j174
55411A26165j43J136J493N53q77j538r35J56N14k03j242j808j845j590j042l41
55395A18453j10p12j441j242q5R95J238R23P73J061J368J061M3q71p19L20R89
55378A22044O65J89M08P32J82q33j012j39O65O22N4m83q36r31p01m02l16k17J23
55359A19814K32l02p67j66J053J473P64m6l63o66j147j221q04p16j269j626j125
55342A13118j46P43J452J727J061j87p90l81Nk63l57L85J063O19l86o52p2L58
55324A17297J04n65j275j664j208J10J216J038o1p62m40L43Q83R80O83N7o75j161
$$ y = [120365, 121061, 122060, 122326, 121608, 120540, 119718, 119392, 119803, 120986, 122340, 123130, 123405, 123758, 124231, 124209, 123527, 122920, 123118, 124027, 125105, 126070, 126923, 127607, 128022, 128185, 128126, 127753, 127041, 126283, 126006, 126538, 127639, 128527, 128433, 127339, 126165, 126022, 127158, 128651, 129204, 128327, 126789, 125854, 126010, 126524, 126321, 125079, 123271, 121426, 119836, 118794, 118453, 118343, 117631, 116190, 114948, 114863, 115858, 117096, 118019, 118792, 119853, 121221, 122282, 122325, 121454, 120735, 121055, 122044, 122709, 122898, 123306, 124038, 124220, 123387, 122375, 122236, 122901, 123523, 123577, 123094, 122258, 121327, 120626, 120224, 119908, 119691, 119814, 120046, 119744, 118977, 118811, 119864, 121337, 122101, 122055, 121692, 121026, 119879, 118658, 117854, 117138, 115869, 114243, 113118, 112972, 113715, 115167, 116894, 117955, 117768, 116978, 116597, 116602, 116339, 115982, 116367, 117430, 118049, 117663, 117011, 116939, 117297, 117401, 116836, 115561, 113897, 112689, 112799, 114015, 115053, 114992, 114230, 113790, 114133, 115016, 115996, 116679, 116736, 116061, 114900]
55306A14900j171o94O6O60P05L61J50K12K31J33K08M05K60j78k26K70N44J58k37
55287A16757pM19L87J44K80O43O66K81k17q19j498j731j054J74J176J533J139
55270A18273j4j324j544j72J533J858P34l44k45P83J822K200J689N19o87j378
55254A23703j455j052k79N21P81M34J80N02Q91O72P3k10j33k25o45j006j013p31
55236A21008l33m6p5k30k2N21O50%o98o38q9J41j36n70r59j147p55J11N15r2q09
55215A16347n11M03O65J47j49J10J33m48q72m81L71J020J304J279Q50J16m59n74
55197A19251m14l07m03o87r38p49PP84R67O88N57P20P57M80J66O3J72M82Q56Q61
55177A23313K38n42p84m99k68l12l34k03p6N2K91M64L62K39M44P00M89Om0M66
$$ y = [114900, 113729, 113035, 113101, 113761, 114466, 114827, 114977, 115189, 115420, 115553, 115761, 116166, 116426, 116248, 116022, 116292, 116836, 116994, 116757, 116750, 117169, 117556, 117700, 117980, 118623, 119289, 119570, 119353, 118534, 117036, 115305, 114251, 114425, 115601, 117134, 118273, 118259, 116935, 115391, 115219, 116752, 118610, 119344, 119000, 118755, 119538, 121360, 123560, 125249, 125768, 125081, 123703, 122248, 121196, 120917, 121438, 122219, 122653, 122833, 123335, 124226, 124898, 124971, 124761, 124628, 124403, 123758, 122752, 121739, 121008, 120675, 120629, 120554, 120324, 120302, 120823, 121473, 121473, 120775, 120137, 120048, 120189, 120053, 119483, 118524, 117377, 116622, 116733, 117248, 117156, 116347, 115836, 116239, 116904, 117051, 116902, 117012, 117145, 116697, 115825, 115344, 115715, 116735, 118039, 119318, 120168, 120284, 119825, 119251, 118837, 118530, 118127, 117440, 116502, 115753, 115760, 116544, 117511, 118199, 118756, 119476, 120233, 120713, 120879, 120942, 121114, 121596, 122452, 123313, 123551, 123009, 122225, 121726, 121458, 121146, 120812, 120609, 120533, 120585, 120876, 121340, 121702, 121941, 122385, 123085, 123574, 123580, 123540, 124006]
55157A24006Q60O94J93k73m83k64L06N87J2j055j740j761j461q92R9J070J233
55140A21131O13K1j55k90n32n05r5L42P25J239J520R39p8k52O39J217M98o66r73
55121A25338m90j88l81o35p39q15p25j94N83J006P71J21m54m98R0Q75J221J050
55103A25936Q28P80O61M37M85Q18Q37K87k10j16K21L12M35R96J546J334N43Q8
55085A36218K80M85J72m00o93n57k57j53m76j132j703j848j641j281o76L06J271
55068A27915J509Q55k5m13k60mN0j29n69j205j558j025K33J065N77o52j183n83
55050A24598J15K0l79j63N31Q27M92R4m8j92m53n12j84L24P41Q55L81o15j327
55031A25105r93m6L61m6m05j43K72K79L4j25k17k35O1N27N50pm28j57M59Q67J025
$$ y = [124006, 124866, 125560, 125753, 125480, 124997, 124733, 125039, 125626, 125638, 124583, 122843, 121082, 119621, 118729, 118828, 119898, 121131, 121744, 121765, 121610, 121320, 120788, 120283, 120188, 120530, 121255, 122494, 124014, 124953, 124875, 124623, 125262, 126479, 126977, 126311, 125338, 124848, 124660, 124279, 123644, 122905, 122090, 121365, 121171, 121754, 122760, 123531, 123652, 123198, 122700, 122790, 123665, 124886, 125936, 126764, 127544, 128205, 128642, 129127, 129945, 130782, 131069, 130859, 130743, 130964, 131276, 131711, 132707, 134253, 135587, 136130, 136218, 136498, 136983, 137155, 136755, 136062, 135505, 135248, 135095, 134619, 133487, 131784, 129936, 128295, 127014, 126338, 126644, 127915, 129424, 130279, 130254, 129841, 129581, 129577, 129627, 129498, 128929, 127724, 126166, 125141, 125374, 126439, 127016, 126364, 125181, 124598, 124713, 124733, 124354, 124191, 124722, 125549, 126041, 126135, 126087, 125895, 125442, 124930, 124746, 125070, 125811, 126666, 127047, 126432, 125105, 124112, 124066, 124427, 124381, 123976, 123833, 124105, 124384, 124418, 124293, 124076, 123841, 123902, 124429, 124979, 124972, 124544, 124387, 124846, 125713, 126738]
55010A26738J004N52k62p08k98M48P97Q27J018J344J479J462J503J394Q58R8m96
54993A37758r13j150p91K95J213R27k92j147j047o56o22o17m7Q71J293Q03m7l11
54975A35520L62J345J677J075J63l25k73r6j46l69l94Q6Q08R63J28r08r47K0P85
54956A39474O63K99L84N51K14l15m49l68n81r11q70o09n57n25j18K71l8o95o74
54937A35146P7M93M6n00m17p2j42m74l25O31K017L166L591L293K837K831L265
54920A55463L700M040M599N392N945N971N671N088L839J795m61k299l705m861
54906A90177n566n553n096m626m023k917j652j178j755k379j954p06J08k40j208
54891A51432j859j956j785j360m20P89J502J411J163J476K187K596K533K481K821
$$ y = [126738, 127742, 128294, 128032, 127324, 127026, 127474, 128271, 129098, 130116, 131460, 132939, 134401, 135904, 137298, 138156, 138254, 137758, 136845, 135695, 134904, 135199, 136412, 137339, 137047, 135900, 134853, 134197, 133575, 132958, 132911, 133782, 135075, 135878, 135831, 135520, 135882, 137227, 138904, 139979, 140142, 139817, 139544, 139448, 139302, 138933, 138539, 138625, 139433, 140396, 140524, 139616, 138669, 138689, 139474, 140137, 140436, 140820, 141371, 141585, 141270, 140821, 140453, 139872, 138961, 138091, 137482, 136925, 136400, 136282, 136553, 136515, 135820, 135146, 135223, 135716, 135762, 135262, 134845, 134773, 134631, 134157, 133832, 134463, 136480, 139646, 143237, 146530, 149367, 152198, 155463, 159163, 163203, 167802, 173194, 179139, 185110, 190781, 195869, 199708, 201503, 201042, 198743, 195038, 190177, 184611, 179058, 173962, 169336, 165313, 162396, 160744, 159566, 157811, 155432, 153478, 152772, 152880, 152640, 151432, 149573, 147617, 145832, 144472, 144052, 144841, 146343, 147754, 148917, 150393, 152580, 155176, 157709, 160190, 163011]
54876A63011L472M278N234O153O583O252N305L965K199m8k471m487n636n823n327
54861A82660m648m188l923l495k760k106j977k190k070j380p65r38j688k153k038
54846A46341j959k399k932k878k272j573q63KO99P23L15K30N16M07l97j143j120
54829A31697n85j45J09L71O14Q23J199J581J281N2j285j789j510j105p89m17p3
54812A30029J29M81J182J717J521R00N96O89Q21J099J833K551K366J336M63K45
54796A47958R8n09j259j571j309o23K14O67K52o80j149p65j63K3j9J99O98J138
54778A43200J298J187J015J193J933K743K834K228J868K467L710M862N545N713
54764A81796N431N036N025N388N474M795L538K073M92j080k312l197m228n596
$$ y = [163011, 166483, 170761, 175995, 182148, 188731, 194983, 200288, 204253, 206452, 206404, 203933, 199446, 193810, 187987, 182660, 178012, 173824, 169901, 166406, 163646, 161540, 159563, 157373, 155303, 153923, 153158, 152220, 150532, 148379, 146341, 144382, 141983, 139051, 136173, 133901, 132328, 131465, 131467, 132166, 132889, 133204, 133434, 133950, 134357, 133960, 132817, 131697, 131112, 130967, 131076, 131447, 132061, 132884, 134083, 135664, 136945, 136997, 135712, 133923, 132413, 131308, 130519, 130102, 130029, 130158, 130639, 131821, 133538, 135059, 135959, 136555, 137244, 138065, 139164, 140997, 143548, 145914, 147250, 147713, 147958, 148056, 147547, 146288, 144717, 143408, 142785, 142999, 143666, 143918, 143238, 142089, 141324, 141161, 141184, 141165, 141364, 142062, 143200, 144498, 145685, 146700, 147893, 149826, 152569, 155403, 157631, 159499, 161966, 165676, 170538, 176083, 181796, 187227, 192263, 197288, 202676, 208150, 212945, 216483, 218556, 219048, 217968, 215656, 212459, 208231, 202635]
54750B02635o696o876o266n368m315l071j999j614j948k642l373l752l162j410
54736A50143O20J647J375P09N59R50J399J644J775J940K194K494K672K544K219
54721A74884K196K910M101M821M369L154K248J948J331m07k629l980m160m069
54707A86717m273m324l842l322l233l191k643j841j368j197r70q48j240j864k003
54692A50558j595j294j378j379j007o74p46r05o93l20l29o82p20j00O40O88k6
54675A40038p35p34j67K51J45j75k28P4M95Q17R22P16J72n38j122j292r12j68
54657A37559M33M72Q6k35k68j89n1K95O47M13m99j246j060l09N4j25q5O37J462
54638A37991J539P77q9k88L06J136J517J246O95L11K08K41K47P2l84r76j365j435
$$ y = [202635, 195939, 189063, 182797, 177429, 173114, 170043, 168044, 166430, 164482, 161840, 158467, 154715, 151553, 150143, 150763, 152410, 153785, 154494, 155053, 156003, 157402, 159046, 160821, 162761, 164955, 167449, 170121, 172665, 174884, 177080, 179990, 184091, 188912, 193281, 196435, 198683, 200631, 201962, 201555, 198926, 194946, 190786, 186717, 182444, 178120, 174278, 170956, 167723, 164532, 161889, 160048, 158680, 157483, 156513, 155665, 154425, 152561, 150558, 148963, 147669, 146291, 144912, 143905, 143231, 142485, 141580, 140887, 140567, 140238, 139556, 138836, 138736, 139376, 140064, 140038, 139303, 138569, 138402, 138653, 138798, 138623, 138395, 138469, 138964, 139781, 140703, 141419, 141591, 141053, 139931, 138639, 137727, 137559, 137992, 138464, 138550, 138315, 138047, 137858, 137807, 138102, 138749, 139162, 138663, 137417, 136357, 136048, 136102, 135977, 135892, 136529, 137991, 139530, 140307, 140218, 139930, 140236, 141372, 142889, 144135, 144830, 145141, 145349, 145590, 145837, 145909, 145525, 144549, 143184, 141749]
54620A41749j342j060l19P65J420J129M09J48M88Q89J081J176J038L28p50j400
54604A45749j153l57L38N36J34o57j207r85k48K30K21J65K70J78j81k60J46L52
54586A43271j71q59q49k53K00L68O40R26O74l6l84o4J97j74n87j53Q53J194L06
54567A45099q91j029J61J655K301J878R98K70j73l83l21o2M8j99m20p2P02J123
54549A50685P79J58o1J15J78m9j48K79J125J886K150J903J465J109P37L4r49j635
54531A59761j568r95n39m17m04m50p79j296j427q05K42J185J886K346K251J294
54515A60285j18j069j155q87r28j248j289q16k38o6k30j97K40N57J72o55j048
54498A51310o76k10k72n16k08O27J244J235Q37K96l56p90m37O05J383J250P06
$$ y = [141749, 140407, 139347, 139028, 139793, 141213, 142342, 142751, 142899, 143387, 144276, 145357, 146533, 147571, 147899, 147149, 145749, 144596, 144239, 144577, 145113, 145247, 144590, 143383, 142398, 142150, 142380, 142601, 142766, 143036, 143214, 143033, 142773, 142919, 143271, 143100, 142241, 141392, 141139, 141339, 141707, 142347, 143273, 143947, 143911, 143527, 143463, 143660, 143486, 142899, 142746, 143599, 144793, 145099, 144208, 143179, 143340, 144995, 147296, 149174, 150172, 150442, 150269, 149886, 149565, 149503, 149551, 149352, 148932, 148860, 149562, 150685, 151464, 151622, 151561, 151676, 151854, 151805, 151657, 151936, 153061, 154947, 157097, 159000, 160465, 161574, 162311, 162345, 161396, 159761, 158193, 157198, 156659, 156242, 155838, 155388, 154609, 153313, 151886, 151081, 151323, 152508, 154394, 156740, 158991, 160285, 160167, 159098, 157943, 157056, 156128, 154880, 153591, 152775, 152537, 152471, 152241, 152044, 152284, 152841, 153013, 152358, 151310, 150634, 150424, 150152, 149636, 149428, 150055, 151299, 152534, 153371, 153667, 153311, 152521, 152084, 152689, 154072, 155322, 156028]
54481A56028N70P95P61L66R0J16J33J07M63J298J980J947J504J350J622J845J713
54464A72688J431J256J057N90q1o47r60j102j104q66m11q3k38q30j399j552j282
54447A66467q47m53j74j08l71q95j299j198o80k89l69n83l78J66L60r7n87m32
54429A58233J21K86j18n17m88k24M7M75J160J824K241K529K660K161Q73l68n47
54412A70348J08L64l35j137j060l64l4l38o58n89m44m36q3J031K307K665J938
54395A73283J104J004J331J257N65k60q04j075j176j046o08J00R02J436J265L53
54379A77631o56j027p22k49J83P82J490J725J125J42l23K87J771L227L547K395
54363A91328Q05K62J026J922J965J449J109R48N27p3m42o02q77j240j436j619
$$ y = [156028, 156598, 157393, 158154, 158520, 158610, 158726, 158859, 158966, 159429, 160727, 162707, 164654, 166158, 167508, 169130, 170975, 172688, 174119, 175375, 176432, 177022, 176941, 176294, 175334, 174232, 173128, 172262, 171851, 171768, 171530, 170700, 169301, 167749, 166467, 165620, 165167, 164993, 164885, 164514, 163619, 162320, 161122, 160442, 160153, 159784, 159201, 158823, 158989, 159349, 159252, 158665, 158233, 158354, 158640, 158522, 158005, 157517, 157293, 157340, 157815, 158975, 160799, 163040, 165569, 168229, 170390, 171263, 170895, 170348, 170456, 170820, 170485, 169348, 168288, 167924, 167890, 167552, 166894, 166305, 165861, 165425, 165342, 166373, 168680, 171345, 173283, 174387, 175391, 176722, 177979, 178544, 178284, 177480, 176405, 175229, 174183, 173575, 173675, 174577, 176013, 177278, 177631, 176975, 175948, 175226, 174977, 175160, 175942, 177432, 179157, 180282, 180424, 180101, 180388, 182159, 185386, 188933, 191328, 192133, 192395, 193421, 195343, 197308, 198757, 199866, 200814, 201341, 201268, 200826, 200224, 199347, 198107, 196671, 195052]
54347A95052k107k635k617k106j802j974k147k011j925k190k394k008j170m93
54333A67473k75l11k63M3N41R31R03N35K56K89L77K10j32m00n63o27l57L48R57
54314A69935P55j33p03k89N73R06N52J47L5j65o91j024n77L21P57M28m1j4M10
54295A71182P60Q23O36J81n22j215j543j373p93mO53Q15N01K36M84J103J510J229
54277A74663K11j101j892j530l64L90lq43q91K5R15J001N34J83K06M97R62J468
54259A74431J747J614J218Q98Q88J170J500J542J168O15K00n0k83m62m10j78l7
54242A85571r1j69j40p5o3r8j78l08m62o59r69j264j233q70n95n32o6J205K483
54223A81487K553J462L86o3m01r15r72k41M24J93m07l78J47K30k77n59k56l3m99
$$ y = [195052, 192945, 190310, 187693, 185587, 183785, 181811, 179664, 177653, 175728, 173538, 171144, 169136, 167966, 167473, 167198, 166887, 166624, 166667, 167208, 168139, 169042, 169577, 169833, 170122, 170499, 170709, 170577, 170177, 169614, 168987, 168630, 168978, 169935, 170690, 170557, 169854, 169565, 170138, 171044, 171596, 171743, 171778, 171613, 170922, 169898, 169321, 169642, 170399, 170827, 170786, 170772, 171182, 171942, 172765, 173401, 173582, 173060, 171845, 170302, 168929, 168136, 168132, 168785, 169600, 170101, 170337, 170821, 171924, 173434, 174663, 174874, 173773, 171881, 170351, 169987, 170377, 170374, 169531, 168640, 168665, 169580, 170581, 171115, 171298, 171504, 172001, 172963, 174431, 176178, 177792, 179010, 179908, 180796, 181966, 183466, 185008, 186176, 186791, 186991, 186941, 186658, 186196, 185786, 185608, 185571, 185480, 185311, 185171, 185096, 185033, 184935, 184757, 184449, 183987, 183328, 182359, 181095, 179862, 178992, 178397, 177865, 177799, 179004, 181487, 184040, 185502, 185888, 185825, 185424, 184509, 183537, 183296, 183720, 183913, 183506, 183128, 183275, 183505, 183228, 182669, 182413, 182380, 181881]
54204A81881j347j864j775j235m86J74M21K35K9J96O70R92P74J01m04p3J011J853
54186A81153J569N42MM50J034Q01K1k82K60R65J131Q07M26Q8l75q91j080p44j66
54167A85713K27K97J84n4m89j006j197q14k43k05q82j604j585q84k95l49o92o42
54149A75480q0M71M97l5p74j237j024j12R20J345J065O75O02N92K62k57o10q29
54131A76951j087j071k82R79J646J170K48r0K94P72R59J038J150J065O46K59L18
54114A84965O37O46K65J82R75K277L173L267K954K669K429K229K320K765L150
54099B14903L115K854K625K226J447P08N05N00r9j317k340k702k797k974k909
54084B13745k210j046J84J314K257K770K778K526K157J550Q00M37P10J131J077
$$ y = [181881, 180534, 178670, 176895, 175660, 175174, 175348, 175769, 176004, 176033, 176229, 176899, 177891, 178665, 178766, 178362, 178289, 179300, 181153, 182722, 183264, 183268, 183718, 184752, 185553, 185574, 185292, 185552, 186517, 187648, 188455, 188881, 188969, 188594, 187703, 186623, 185879, 185713, 185940, 186237, 186421, 186367, 185878, 184872, 183675, 182861, 182618, 182413, 181531, 179927, 178342, 177458, 177163, 176814, 176122, 175480, 175400, 175871, 176368, 176333, 175559, 174322, 173298, 173186, 174106, 175451, 176516, 177191, 177793, 178385, 178647, 178390, 177780, 176951, 175864, 174793, 174511, 175490, 177136, 178306, 178554, 178464, 178758, 179530, 180489, 181527, 182677, 183742, 184388, 184647, 184965, 185602, 186248, 186513, 186695, 187670, 189947, 193120, 196387, 199341, 202010, 204439, 206668, 208988, 211753, 214903, 218018, 220872, 223497, 225723, 227170, 227878, 228383, 228883, 228784, 227467, 225127, 222425, 219628, 216654, 213745, 211535, 210489, 210673, 211987, 214244, 217014, 219792, 222318, 224475, 226025, 226825, 227262, 227972, 229103, 230180]
54069B30180O07K22J35J22j34p83j683k299k106j318p99q72p82K06J591K194J634
54052B26115O51J23L42J166K237L090L515L831M446N206N574N440N256N440N987
54037B78419O700P401P927Q203Q324Q369Q192P650O942O363N953N616N373N190
54023C76622M777L991L166K558J763L56j175j911j878k161l452n178o294o399
54009C64785n884n433n641o555p448p418o472n529n232n298n168m730m127l439
53995B86411k911k925l315l275k439j563j540k167k540k349k016j764j385r14
53981B55308p31q59q55o45p13j122j077r2R67Q67j72o15L60J840K546K515K715
53964B60237L583M744N946P362Q876R855R910R296Q227O461L938J251r85k804
$$ y = [230180, 230787, 231009, 231144, 231266, 231132, 230349, 228666, 226367, 224261, 222943, 222144, 221272, 220490, 220696, 222287, 224481, 226115, 226766, 226889, 227231, 228397, 230634, 233724, 237239, 241070, 245516, 250722, 256296, 261736, 266992, 272432, 278419, 285119, 292520, 300447, 308650, 316974, 325343, 333535, 341185, 348127, 354490, 360443, 366059, 371432, 376622, 381399, 385390, 388556, 391114, 392877, 393233, 392058, 390147, 388269, 386108, 382656, 377478, 371184, 364785, 358901, 353468, 347827, 341272, 333824, 326406, 319934, 314405, 309173, 303875, 298707, 293977, 289850, 286411, 283500, 280575, 277260, 273985, 271546, 269983, 268443, 266276, 263736, 261387, 259371, 257607, 256222, 255308, 254577, 253718, 252863, 252218, 251505, 250383, 249306, 249214, 250181, 251048, 250876, 250261, 250621, 252461, 255007, 257522, 260237, 263820, 268564, 274510, 281872, 290748, 300603, 310513, 319809, 328036, 334497, 338435, 339686, 338701, 335897]
53950C35897m365n277n089m100k973j812l80J050J880K178K603L331L848L931
53936C30722M043M498N013N250N178M688L607K372J880K338L041L585M454N848
53922C86517O980P264P375Q129R059R245R037R629J1115J2287J2460J2237J2182
53909E13516J1808J0430Q238N902L711J691J13p17r48j117j615k541l799n138
53895E39534o240p037p768q626r501j0214j0753j1143j1324j1301j1243j1197
53883D23187j0976j0412r595q652p579o432n561n322n673o132o121n379m254l607
53869C27492m051n158n776n357m653m694n413n741n014l700k649k130j863j689
53855B69604j751k099k454k537k410k298k163j689q32j23j47p91j276j038k91
$$ y = [335897, 331532, 326255, 321166, 317066, 314093, 312281, 311901, 312951, 314831, 317009, 319612, 322943, 326791, 330722, 334765, 339263, 344276, 349526, 354704, 359392, 362999, 365371, 367251, 369589, 372630, 376215, 380669, 386517, 393497, 400761, 408136, 416265, 425324, 434569, 443606, 453235, 464350, 476637, 489097, 501334, 513516, 525324, 535754, 543992, 549894, 553605, 555296, 555409, 554692, 553744, 552627, 551012, 548471, 544672, 539534, 533294, 526257, 518489, 509863, 500362, 490148, 479395, 468252, 456928, 445627, 434384, 423187, 412211, 401799, 392204, 383552, 375973, 369541, 363980, 358658, 352985, 346853, 340732, 335353, 331099, 327492, 323441, 318283, 312507, 307150, 302497, 297803, 292390, 286649, 281635, 277935, 275286, 273156, 271293, 269604, 267853, 265754, 263300, 260763, 258353, 256055, 253892, 252203, 251371, 251248, 251101, 250310, 249034, 247996, 247705]
53840B47705L66O20M84j2p73j393j383p66j20P6o5j84j76j14Q3N71J216J569J370
53821B49074P92K07j21k5N57J415K101K333K283K265K327K387K706L721N381O942
53805B84345P660P459O870O488O600P087P514P510P230P180P444P416O568N294
53791C82665M476M402M544M341L736K919J956Q81j87j175k120l057m057n317o889
53776C87118q269q733q258p674p680q013p922p148o077n188m658m425m295m054
53762B94724l720l575l719l811l473k821k345k310k544k688k495j996j557j597
53748B56073k037k267j894j286j000r64p14k28R3J18O3p0m56q23n78K25P80O39
53730B45674L27M37P16O22K64J67M20O95Q99J202J557J755J840J960J870J243
$$ y = [247705, 248071, 248691, 249175, 249163, 248390, 246997, 245614, 244848, 244728, 244804, 244739, 244555, 244379, 244265, 244348, 244919, 246135, 247704, 249074, 249866, 250073, 249952, 249927, 250484, 251899, 254000, 256333, 258616, 260881, 263208, 265595, 268301, 272022, 277403, 284345, 292005, 299464, 306334, 312822, 319422, 326509, 334023, 341533, 348763, 355943, 363387, 370803, 377371, 382665, 387141, 391543, 396087, 400428, 404164, 407083, 409039, 409920, 409733, 408558, 406438, 403381, 399324, 394007, 387118, 378849, 370116, 361858, 354184, 346504, 338491, 330569, 323421, 317344, 312156, 307498, 303073, 298778, 294724, 291004, 287429, 283710, 279899, 276426, 273605, 271260, 268950, 266406, 263718, 261223, 259227, 257670, 256073, 254036, 251769, 249875, 248589, 247589, 246625, 245911, 245683, 245776, 245894, 245957, 245887, 245431, 244608, 244030, 244255, 245035, 245674, 246001, 246438, 247154, 247776, 248040, 248207, 248627, 249322, 250221, 251423, 252980, 254735, 256575, 258535, 260405, 261648]
53714B61648M55M22J371K381K432J611Q78R47J716K596L045K878K406K287K975
53699B90048M226N252N480N045M460L976L474K937K630K639K475J619L52m81o01
53684C33531p14j469k536l092k869k210j402n47L1n8o00q82o22l51o81j509k215
53667C11805k303j708p34J34N65O59P04P08M59Ml42n23p89j145j245r71o15k66
53649C04397L69J186J435P52m0J27J174K147K590K872L200L190K602J834J432
53634C29267J473J733K028K225K218K126K240K618K985L202L471L905M160L841
53620C67492L133K676K883L536M127M376M368M246L951L416K941L037L753M406
53606D18341M351L846L700M092M276L578K282J166N96L35Q9k14n77j037j522j831
$$ y = [261648, 262103, 262525, 263896, 266277, 268709, 270320, 271198, 272145, 273861, 276457, 279502, 282380, 284786, 287073, 290048, 294274, 299526, 305006, 310051, 314511, 318487, 321961, 324898, 327528, 330167, 332642, 334261, 334613, 334132, 333531, 332817, 331348, 328812, 325720, 322851, 320641, 319239, 318692, 318723, 318665, 318065, 317183, 316561, 316210, 315529, 314020, 311805, 309502, 307794, 307060, 307194, 307759, 308418, 309122, 309830, 310289, 310293, 309951, 309428, 308639, 307494, 306249, 305278, 304663, 304397, 304766, 305952, 307387, 308139, 308099, 308226, 309400, 311547, 314137, 317009, 320209, 323399, 326001, 327835, 329267, 330740, 332473, 334501, 336726, 338944, 341070, 343310, 345928, 348913, 352115, 355586, 359491, 363651, 367492, 370625, 373301, 376184, 379720, 383847, 388223, 392591, 396837, 400788, 404204, 407145, 410182, 413935, 418341, 422692, 426538, 430238, 434330, 438606, 442184, 444466, 445632, 446228, 446563, 446652, 446438, 445861, 444824, 443302, 441471]
53590D41471j828j570j219r62r71j298j769k048j914j490j188j379k060k801l134
53575D15840k936k466k039j807j830k104k469k624k430k121j995j928j414k75
53561C87402Q62J099L25n18m05O36J664J971J737J434J064L40n52q75j40J326
53545C97370K646L181K957K525K426K799L430M102M783N459N978O214O226O143
53531D56239O079O341P388R221J1069J2078J2288J2459J3005J3599J3861J3909
53519E87536J4027J4262J4644J5408J6696J8270J9782K1166K2498K3685K4574
53508G92548K5197K5619K5780K5662K5520K5569K5620K5258K4354K3051K1443
53497A065621J9618J8026J7345J7743J8513J8739J8186J7366J6794J6487J6281
$$ y = [441471, 439643, 438073, 436854, 435892, 434921, 433623, 431854, 429806, 427892, 426402, 425214, 423835, 421775, 418974, 415840, 412904, 410438, 408399, 406592, 404762, 402658, 400189, 397565, 395135, 393014, 391019, 389091, 387677, 387402, 388264, 389363, 389688, 389170, 388765, 389401, 391065, 393036, 394773, 396207, 397271, 397611, 397059, 396184, 396044, 397370, 400016, 403197, 406154, 408679, 411105, 413904, 417334, 421436, 426219, 431678, 437656, 443870, 450096, 456239, 462318, 468659, 476047, 485268, 496337, 508415, 520703, 533162, 546167, 559766, 573627, 587536, 601563, 615825, 630469, 645877, 662573, 680843, 700625, 721791, 744289, 767974, 792548, 817745, 843364, 869144, 894806, 920326, 945895, 971515, 996773, 1021127, 1044178, 1065621, 1085239, 1103265, 1120610, 1138353, 1156866, 1175605, 1193791, 1211157, 1227951, 1244438, 1260719]
53486A260719J6375J7150J8451J9360J9104J8005J7180J7132J7087J5944J3652
53475A450159J1205R344P776N770L224O86j489l624o145q870j1173j2793j4082
53462A429988j5318j6209j6345j5947j5715j6055j6788j7642j8595j9666k0707
53451A241001k1551k2071k1987k0979j9264j7782j7354j7738j7796j6615j4281
53440A033583j1634r501q115p128o063m824l687k824j959p25Q25K257L331M268
53426I87804N434O861Q252R392J0419J1619J3061J4595J6221J8181K0477K2531
53414A144847K3710K4223K5019K6734K9023L1190L3007L4617L5910L6614L6985
53403A481879L7962M0281M3593M6732M8839N0098N1241N2518N3443N3652N3687
$$ y = [1260719, 1277094, 1294244, 1312695, 1332055, 1351159, 1369164, 1386344, 1403476, 1420563, 1436507, 1450159, 1461364, 1470708, 1478484, 1484254, 1487478, 1488164, 1486675, 1483051, 1476906, 1468036, 1456863, 1444070, 1429988, 1414670, 1398461, 1382116, 1366169, 1350454, 1334399, 1317611, 1299969, 1281374, 1261708, 1241001, 1219450, 1197379, 1175392, 1154413, 1135149, 1117367, 1100013, 1082275, 1064479, 1047864, 1033583, 1021949, 1012448, 1004333, 997205, 991142, 986318, 982631, 979807, 977848, 977123, 977948, 980205, 983536, 987804, 993238, 1000099, 1008351, 1017743, 1028162, 1039781, 1052842, 1067437, 1083658, 1101839, 1122316, 1144847, 1168557, 1192780, 1217799, 1244533, 1273556, 1304746, 1337753, 1372370, 1408280, 1444894, 1481879, 1519841, 1560122, 1603715, 1650447, 1699286, 1749384, 1800625, 1853143, 1906586, 1960238, 2013925]
53392B013925N4427N5897N7106N7222N6477N5689N5198N4591N3251N0892M7689
53381B612364M4128M0628L7178L3477K9464K5422K1374J6880J1752O508J629l371
53369B877433r357j6240k2915k8648l3827l9007m3882m7666n0129n1753n2979
53358B481030n3893n4557n5073n5135n4051n1608m8683m6457m5122m3872m2298
53347A930281m1153m1254m2121m2408m1471l9845l8207l6702l5393l4473l3603
53336A503651l1836k8837k5579k3109k1160j8831j6289j4685j4471j4814j4851
53325A279189j4661j4620j4575j4181j3544j3018j2601j1991j0993r667q179o673
53313A134486n145l390j385L51J209J378J753K785M028N108O499Q776J1628J4260
$$ y = [2013925, 2068352, 2124249, 2181355, 2238577, 2295054, 2350743, 2405941, 2460532, 2513783, 2564675, 2612364, 2656492, 2697120, 2734298, 2767775, 2797239, 2822661, 2844035, 2860915, 2872667, 2879175, 2880804, 2877433, 2868076, 2851836, 2828921, 2800273, 2766446, 2727439, 2683557, 2635891, 2585762, 2534009, 2481030, 2427137, 2372580, 2317507, 2262372, 2208321, 2156713, 2108030, 2061573, 2016451, 1972579, 1930281, 1889128, 1847874, 1805753, 1763345, 1721874, 1682029, 1643822, 1607120, 1571727, 1537254, 1503651, 1471815, 1442978, 1417399, 1394290, 1373130, 1354299, 1338010, 1323325, 1308854, 1294040, 1279189, 1264528, 1249908, 1235333, 1221152, 1207608, 1194590, 1181989, 1169998, 1159005, 1149338, 1141159, 1134486, 1129341, 1125951, 1124566, 1124917, 1126126, 1127504, 1129257, 1132042, 1136070, 1141178, 1147677, 1156453, 1168081, 1182341]
53299A182341J6392J8243J9779K0801K1669K3130K5301K7412K8791K9456K9562
53288A442877K8875K7272K5330K3800K2673K1244J9080J6490J3950J1474Q700
53277A661765N452J945j477m613p405r846j1982j3977j6042j8234k0458k2639
53265A542489k4739k6497k7411k7278k6687k6604k7386k8454k9017k8868k8338
53254A241210k7820k7579k7768k8195k8252k7477k6212k5301k5137k5302k5210
53243I46957k4733k4046k3272k2505k1889k1396k0697j9502j7910j6221j4543
53232G20243j2905j1540j0730j0393j0074r426q572q040q330r382j0456j0814
53220E99581j0633j0818j1727j2590j2674j2431j2737j3319j2955j1228r151p826
$$ y = [1182341, 1198733, 1216976, 1236755, 1257556, 1279225, 1302355, 1327656, 1355068, 1383859, 1413315, 1442877, 1471752, 1499024, 1524354, 1548154, 1570827, 1592071, 1611151, 1627641, 1641591, 1653065, 1661765, 1667217, 1669162, 1667685, 1663072, 1655667, 1645821, 1633839, 1619862, 1603820, 1585586, 1565128, 1542489, 1517750, 1491253, 1463842, 1436564, 1409877, 1383273, 1355887, 1327433, 1298416, 1269548, 1241210, 1213390, 1185811, 1158043, 1129848, 1101596, 1074119, 1047907, 1022606, 997469, 972167, 946957, 922224, 898178, 874906, 852401, 830512, 809116, 788419, 768917, 751007, 734786, 720243, 707338, 695798, 685068, 674675, 664601, 655175, 646603, 638563, 630233, 620851, 610395, 599581, 588948, 578130, 566403, 553813, 541139, 528708, 515971, 502652, 489697, 478469, 469318, 461492]
53208D61492p293p057o978p139p333p306p106o880o580o244o119o195o037n479
53194C67746n066n295n805n864n392m912m696m466l920l113k371k054k283k680
53180C09829k646k166j881k129k373k118j791k017k450k192j205l85k60m44m59
53165B85313l42k73k31k58n12q21p56k95J1k43q61j399j639j554j231r32q87r08
53147B72182o32j52K9k69p21j085j430j643j323m20N25J060J291J435J341Q71
53131B71059L64L34Q61J531J838J525P60P1m2M30J143J832K402K710K689K544
53115B92051K404J955J071N08J130K458K934J905L63n64r38j312j660j748j882
53100B98675k399k944k931k462k096k089k367k845l240k975j929r01p03j085j268
$$ y = [461492, 454199, 447142, 440164, 433025, 425692, 418386, 411280, 404400, 397820, 391576, 385457, 379262, 373225, 367746, 362680, 357385, 351580, 345716, 340324, 335412, 330716, 326250, 322330, 319217, 316846, 314792, 312509, 309829, 307183, 305017, 303136, 301007, 298634, 296516, 294725, 292708, 290258, 288066, 286861, 286476, 286216, 285772, 285313, 284971, 284698, 284467, 284209, 283697, 282876, 282120, 281825, 281836, 281593, 280732, 279333, 277694, 276140, 274909, 273977, 273090, 272182, 271550, 271398, 271427, 271158, 270437, 269352, 267922, 266279, 264956, 264536, 265061, 266121, 267412, 268847, 270188, 271059, 271423, 271757, 272618, 274149, 275987, 277512, 278272, 278343, 278301, 278731, 279874, 281706, 284108, 286818, 289507, 292051, 294455, 296410, 297481, 297989, 299119, 301577, 304511, 306416, 306779, 306215, 305277, 303965, 302305, 300557, 298675, 296276, 293332, 290401, 287939, 285843, 283754, 281387, 278542, 275302, 272327, 270398, 269497, 268794, 267709, 266441]
53085B66441j058p61l19M70J133Q78j56q70o34LK54Q2q8j23k12m59p39r06q85
53066B62051p26n55m57m40n22p16q92q66o74m57o8P05J437J244J13o85j79R39
53048B59252J289P48L83P15J132J094R13J022J230J068L96o54j828k644k605j790
53032B59721q77l59p7L61R24J196Q31m9q23q09M8J104J766K039K038J482L14o42
53014B68188n13L10N90o7q80j198j129p45K43J546K116J497N40R8j99j024j947
52997B67426j966j085k65K1L18J127K124K612K258J249J57k46N22K076L413L813
52981B83554L332K416J392N17J10K59N64N49L18M80J263K021J912R50J2k36L5
52964B99448L50O51J057J243O98m78j469j595r40j49P8o52k072l236l265k237
$$ y = [266441, 265383, 264622, 264303, 264773, 265906, 266784, 266628, 265758, 265124, 265127, 265381, 265463, 265375, 265252, 265040, 264581, 263842, 262936, 262051, 261325, 260770, 260313, 259873, 259351, 258635, 257743, 256877, 256203, 255746, 255678, 256383, 257820, 259064, 259177, 258492, 258313, 259252, 260541, 261289, 261672, 262387, 263519, 264613, 265526, 266548, 267778, 268846, 269242, 268588, 266760, 264116, 261511, 259721, 258844, 258485, 258408, 258769, 259693, 260889, 261720, 261671, 260848, 260039, 260087, 261191, 262957, 264996, 267034, 268516, 268830, 268188, 267675, 267985, 268575, 268508, 267628, 266430, 265301, 264556, 264799, 266345, 268461, 269958, 270498, 270596, 270397, 269373, 267426, 265460, 264375, 264110, 264131, 264449, 265576, 267700, 270312, 272570, 273819, 273976, 273730, 274252, 276328, 279741, 283554, 286886, 289302, 290694, 291211, 291321, 291580, 292144, 292693, 293011, 293491, 294754, 296775, 298687, 299637, 299649, 299413, 299448, 299798, 300449, 301506, 302749, 303447, 302969, 301500, 299905, 298965, 298816, 298894, 298242, 296170, 292934, 289669, 287432]
52948B87432j054m04k97n34j108j836k166j723q38j54Q1J08K20M46O08M83L5m89
52930B78810q08q50o97l67L5J59j98o40o31l08l10q08j263j277j030p52l73Q2
52912B68774L29L21L10K54j56o53m20O07J356J084M47L65N55J78n76o86J27J000
52894B73216J166P60L26J91M19Q36J040P75K54j58m05n22k72L98R02O91J46K4
52876B79787K74K24j44o5P88J853K562K922K990K626K041J822K046K101J689J293
52860C04809J210Q97j13j294j882j988k259k773l093l211l615m330m668m092k967
52845B70631k137k037k358k446j941j082m24j98j73r6p9k61m11j84L05N74M33
52828B58116K40L78P37Q64N16o5m49m57k69j30q9j15k84n86p29m33P3K20j17m28
$$ y = [287432, 286378, 285974, 285677, 285143, 284035, 282199, 280033, 278310, 277472, 277318, 277399, 277507, 277727, 278173, 278781, 279264, 279299, 278810, 278002, 277152, 276455, 276088, 276123, 276282, 276084, 275444, 274813, 274505, 274195, 273387, 272124, 270847, 269817, 269065, 268692, 268774, 269103, 269424, 269734, 269988, 269832, 269179, 268759, 269366, 270722, 271806, 272253, 272618, 273173, 273351, 272775, 272089, 272216, 273216, 274382, 275142, 275468, 275659, 276078, 276914, 277954, 278729, 278983, 278825, 278420, 277898, 277626, 278024, 278926, 279617, 279763, 279787, 280061, 280285, 280141, 280076, 280864, 282717, 285279, 288201, 291191, 293817, 295858, 297680, 299726, 301827, 303516, 304809, 306019, 306916, 306803, 305509, 303627, 301639, 299380, 296607, 293514, 290303, 286688, 282358, 277690, 273598, 270631, 268494, 266457, 264099, 261653, 259712, 258630, 258206, 258008, 257835, 257739, 257660, 257399, 256988, 256804, 257109, 257683, 258116, 258356, 258734, 259471, 260335, 260851, 260786, 260337, 259880, 259611, 259481, 259392, 259277, 258993, 258407, 257678, 257245, 257318, 257538, 257421, 256993]
52808B56993k89Q5K70K87M51P66Q92N66j52j022j734k018j884j670j585j386q56
52791B47714l12k46n40n59r0L77M16K53L28O29Q64R75J097J077N42m60j257j198
52773B49610m15L01L55p3l15%O06R79Q83M48q1n04o53m85k09j34k58k28K47J017
52753B51091J679K009K052J915J637J293J045J040J251J468J421J049O43O26J068
52738B71287J538J583J263J006J012J085J046R52Q29N12J2k36Q3N34K87p76j799
52721B80218k001j654j592j961j960r69N06J350J097L12k55n19q22j175j127m32
52705B69016N27J112J062N85M7k48j40J98K82j84q52j023m96K28O23O96P09O37
52687B72779K50l90q54p85k57K78L39k00r58j293r11j73L02K91nm00r12j416j479
$$ y = [256993, 256704, 256789, 257059, 257346, 257797, 258563, 259455, 260021, 259869, 258847, 257113, 255095, 253211, 251541, 249956, 248570, 247714, 247402, 247156, 246616, 246057, 245967, 246344, 246760, 247013, 247341, 247970, 248834, 249809, 250906, 251983, 252525, 252065, 250808, 249610, 249195, 249496, 249851, 249778, 249463, 249463, 250069, 251048, 251931, 252379, 252298, 251794, 251141, 250656, 250447, 250313, 250055, 249827, 250074, 251091, 252770, 254779, 256831, 258746, 260383, 261676, 262721, 263761, 265012, 266480, 267901, 268950, 269593, 270219, 271287, 272825, 274408, 275671, 276677, 277689, 278774, 279820, 280772, 281601, 282113, 282125, 281889, 281972, 282506, 282793, 282017, 280218, 278217, 276563, 274971, 273010, 271050, 270081, 270587, 271937, 273034, 273346, 273091, 272572, 271750, 270575, 269448, 269016, 269543, 270655, 271717, 272302, 272349, 272101, 271961, 272159, 272441, 272257, 271405, 270382, 269886, 270114, 270737, 271433, 272142, 272779, 273029, 272639, 271785, 271000, 270743, 271021, 271360, 271160, 270202, 268909, 267998, 267825, 268127, 268418, 268413, 268013, 267101, 265685, 264206]
52668B64206q25J96Q85R61P82P95J047J363J764K388L039L219K752K047J597J467
52652B87683J491J643J812J502L98q93j289o35L6j50q17j083q35o32o71n71j49
52635B86840K06J00l81q48r23m07N43J301J332Q84O95R23Q99J56q18j287j300
52618B87915j434j739j629q17J42O01N96O50R87J370J578J617J379N32r20k187
52602B88641k283j111M34J459J795J635J025J16m99l24K97O16N70Q28J648K426
52586B97273K595K364K169J929J337N88J96K83N16O20N35K32j67k39K41O92K94
52569C11458p99j469j055k03R7k29n34n35n29o80p72p44r02j374j727j469p25
52552B97809j16l8k52k14L44J083J318O53n02j240j049l22J75J86J16L81Q94J281
$$ y = [264206, 263381, 263577, 264462, 265423, 266205, 267000, 268047, 269410, 271174, 273562, 276601, 279820, 282572, 284619, 286216, 287683, 289174, 290817, 292629, 294131, 294529, 293636, 292347, 291712, 291748, 291598, 290781, 289698, 288863, 288231, 287560, 286989, 286840, 287046, 287146, 286765, 285917, 284994, 284587, 285130, 286431, 287763, 288647, 289342, 290265, 291164, 291320, 290502, 289215, 287915, 286481, 284742, 283113, 282296, 282438, 283039, 283635, 284285, 285272, 286642, 288220, 289837, 291216, 291748, 290828, 288641, 286358, 285247, 285681, 287140, 288935, 290570, 291595, 291711, 291212, 290888, 291185, 291801, 292371, 293199, 294847, 297273, 299868, 302232, 304401, 306330, 307667, 308255, 308451, 308734, 309250, 309870, 310405, 310637, 310470, 310231, 310472, 311164, 311458, 310659, 309190, 308135, 307932, 308029, 307800, 307266, 306731, 306202, 305522, 304750, 304006, 303104, 301730, 300003, 298534, 297809, 297693, 297655, 297403, 297189, 297533, 298616, 299934, 300587, 300085, 298845, 297796, 297474, 297649, 297835, 297951, 298332, 299226, 300507]
52534C00507J358J246J065P94L83n2k83k25l6R7K33N39R55J149R05L72j40m09
52516C08458k57M68J548K349K498K482L112M456N689O007N237L620J617k1o31
52501C46632n20q41k221l885m588m029k860j717q74n77j017j888k566k771k658
52486C13620k363j896j457j294j245q66j79K56J50o3J79R15J719K171K048J398
52470C13093O20K14L56Q68J585K442L230L680L900M210M452L969K520P21o96j608
52454C43556k211k504k508k623l144l680l627l021k445k166j941j621j368j244
52440C09453j022o12k93l32o88j183j677j889j429l43O10O32k01j026j172o97
52424B98131Q4J070K067K438J739O09L04J171K216K440K064J928K313L030M168
$$ y = [300507, 301865, 303111, 304176, 304970, 305353, 305301, 305018, 304793, 304757, 304854, 305087, 305626, 306581, 307730, 308635, 309007, 308867, 308458, 308201, 308669, 310217, 312566, 315064, 317546, 320658, 325114, 330803, 336810, 342047, 345667, 347284, 347263, 346632, 346112, 345271, 343050, 339165, 334577, 330548, 327688, 325971, 325097, 324520, 323503, 321615, 319049, 316278, 313620, 311257, 309361, 307904, 306610, 305365, 304499, 304320, 304576, 304726, 304663, 304842, 305757, 307476, 309647, 311695, 313093, 313713, 313927, 314283, 315151, 316736, 319178, 322408, 326088, 329988, 334198, 338650, 342619, 345139, 345860, 345164, 343556, 341345, 338841, 336333, 333710, 330566, 326886, 323259, 320238, 317793, 315627, 313686, 312065, 310697, 309453, 308431, 307819, 307526, 307194, 306506, 305323, 303646, 301757, 300328, 299985, 300595, 301227, 301026, 300000, 298828, 298131, 298215, 299285, 301352, 303790, 305529, 306138, 306442, 307613, 309829, 312269, 314333, 316261, 318574, 321604, 325772]
52409C25772N864P586Q619R165R982J0893J0693Q828O197L796J521j111l855o080
52395C97870p557q225p808o470n232m846m689l691k057j000r93j266r97j63Q61
52380C43737J718K029J682J262J537K475L433M158M881N453N360M695M217M203
52366C90840M116L675L255K850J650o59k963l925l566k899k462j968j156k26M82
52351C87044P86O62L91N22J288K255K860L112L392L800M082M032L738L505L738
52336D25207M610N722O466O947P926R632J1184J1789J1880J2460J3748J5230J6616
52323E59417J7906J8857J9247J9523K0243K0983K0755J9569J8554J8357J8378
52312G71789J7952J7443J7516J8008J8187J7774J7101J6592J6476J6790J7161
$$ y = [325772, 331636, 339222, 347841, 357006, 366988, 377881, 388574, 397402, 403599, 407395, 408916, 407805, 403950, 397870, 390313, 382088, 374280, 367810, 362578, 357732, 353043, 349352, 347295, 346295, 345302, 344036, 343039, 342876, 343737, 345455, 347484, 349166, 350428, 351965, 354440, 357873, 362031, 366912, 372365, 377725, 382420, 386637, 390840, 394956, 398631, 401886, 404736, 406386, 405727, 402764, 398839, 395273, 392374, 389912, 387944, 386788, 386562, 387044, 387830, 388492, 388883, 389405, 390693, 392948, 395808, 398920, 402312, 406112, 410194, 414226, 417964, 421469, 425207, 429817, 435539, 442005, 448952, 456878, 466510, 477694, 489483, 501363, 513823, 527571, 542801, 559417, 577323, 596180, 615427, 634950, 655193, 676176, 696931, 716500, 735054, 753411, 771789, 789741, 807184, 824700, 842708, 860895, 878669, 895770, 912362, 928838, 945628, 962789]
52301I62789J6885J5639J3989J2737J1900J0762Q880O550M209J746j234m627p593
52288A052632r263r574r270r071r095r044q733q069o913n250l420j736o6J821
52274I64949L628M887N807P153R082J0819J1673J1844J1867J1863J1806J2002
52262A077380J2784J3926J4863J5255J5090J4549J4108J4366J5266J5792J5047
52251A238426J3364J1784J0676R447P530M995K215n11k904m796o361p903r339
52238A266623j0303j0769j1123j1553j1803j1635j1139j0430r478q312p109n930
52226A147039m789m015m008m501m553l565j928l75Q34J749K257K285K241K712
52212A131383L789M991N797O038N889N730N842O013N737M989M499M880N774O316
$$ y = [962789, 979674, 995313, 1009302, 1022039, 1033939, 1044701, 1053581, 1060131, 1064340, 1066086, 1064852, 1060225, 1052632, 1043369, 1033795, 1024525, 1015454, 1006359, 997315, 988582, 980513, 973600, 968350, 964930, 963194, 963128, 964949, 968577, 973464, 979271, 986424, 995506, 1006325, 1017998, 1029842, 1041709, 1053572, 1065378, 1077380, 1090164, 1104090, 1118953, 1134208, 1149298, 1163847, 1177955, 1192321, 1207587, 1223379, 1238426, 1251790, 1263574, 1274250, 1283697, 1291227, 1296222, 1298437, 1297926, 1295022, 1290226, 1283865, 1275962, 1266623, 1256320, 1245551, 1234428, 1222875, 1211072, 1199437, 1188298, 1177868, 1168390, 1160078, 1152969, 1147039, 1142250, 1138235, 1134227, 1129726, 1125173, 1121608, 1119680, 1119305, 1120139, 1121888, 1124145, 1126430, 1128671, 1131383, 1135172, 1140163, 1145960, 1151998, 1157887, 1163617, 1169459, 1175472, 1181209, 1186198, 1190697, 1195577, 1201351, 1207667]
52198A207667O217N910N790N864O084O463O849P051P193P485P569O791N186L631
52184A295750K678J807K41j962m168o142q124j0103j1549j1979j1374j0065q528
52171A216482p279o600o251n759n039m342l567k150J10K418L702L831L653L821
52157A193030L971L351J950N75j16l72q46j632k069j645p32j66k30l71n3M60M05
52140A195510n02j673k246j852p35N89J697K412K896L568M818O729R111J1756
52126A232078J4580J7526K0441K3053K5071K6436K7426K8371K9155K9241K8340
52115A501718K6932K5721K4761K3557K1933K0330J9013J7562J5480J2969J0618
52104A720594Q624O803N269M426M211L868K778J178k72j428k835n023p871j0742
$$ y = [1207667, 1213884, 1219794, 1225584, 1231448, 1237532, 1243995, 1250844, 1257895, 1265088, 1272573, 1280142, 1286933, 1292119, 1295750, 1298428, 1300235, 1300476, 1298514, 1294346, 1288204, 1280080, 1269977, 1258428, 1246449, 1235075, 1225010, 1216482, 1209203, 1202603, 1196352, 1190593, 1185554, 1181212, 1177645, 1175495, 1175605, 1178023, 1181725, 1185556, 1189209, 1193030, 1197001, 1200352, 1202302, 1202877, 1202761, 1202389, 1201543, 1199911, 1197842, 1196197, 1195465, 1195299, 1195069, 1194698, 1194645, 1195105, 1195510, 1195008, 1193335, 1191089, 1189237, 1188502, 1189091, 1190788, 1193200, 1196096, 1199664, 1204482, 1211211, 1220322, 1232078, 1246658, 1264184, 1284625, 1307678, 1332749, 1359185, 1386611, 1414982, 1444137, 1473378, 1501718, 1528650, 1554371, 1579132, 1602689, 1624622, 1644952, 1663965, 1681527, 1697007, 1709976, 1720594, 1729218, 1736021, 1741290, 1745716, 1749927, 1753795, 1756573, 1757751, 1757479, 1756051, 1753216, 1748193, 1740322, 1729580]
52090A729580j3107j4956j6636j8291j9540j9834j9077j7703j6136j4422j2506
$$ y = [1729580, 1716473, 1701517, 1684881, 1666590, 1647050, 1627216, 1608139, 1590436, 1574300, 1559878, 1547372]
$$ [...]
##END NTUPLES=NMR SPECTRUM
##END=
