##TITLE=AC1756_VAR00028_9319824_1CXsmxYH48
##JCAMPDX= 6.0         $$ Bruker NMR JCAMP-DX V2.0
##DATA TYPE= NMR SPECTRUM
##DATA CLASS= NTUPLES
##ORIGIN= BRUKER
##OWNER= Administrator
$$ 1.72 TOPSPIN		Version 2.1
$$ 2015-08-11 21:06:10.523 -0700  Administrator@X
$$ Compression mode = diff/dup
##.OBSERVE FREQUENCY= 400.02188249412
##.OBSERVE NUCLEUS= ^1H
##.ACQUISITION MODE= SIMULTANEOUS (DQD)
##.ACQUISITION SCHEME= undefined
##.AVERAGES= 8
##.DIGITISER RES= 22
##SPECTROMETER/DATA SYSTEM= spect
##.PULSE SEQUENCE= zg30
##.SOLVENT NAME= COFFEE_meoh
##.SHIFT REFERENCE= INTERNAL, COFFEE_meoh, 1, 14.98509
##AUDIT TRAIL= $$ (NUMBER, WHEN, WHO, WHERE, PROCESS, VERSION, WHAT)
$$ ##TITLE= Audit trail, TOPSPIN		Version 2.1
$$ ##JCAMPDX= 5.01
$$ ##ORIGIN= Bruker BioSpin GmbH
$$ ##OWNER= Administrator
$$ $$ E:\/data/COFFEE/nmr/AC1756_VAR00028_9319824_1CXsmxYH48/10/pdata/1/auditp.txt
$$ ##AUDIT TRAIL=  $$ (NUMBER, WHEN, WHO, WHERE, PROCESS, VERSION, WHAT)
(   1,<2015-08-11 21:06:02.867 -0700>,<Administrator>,<X>,<go>,<TOPSPIN 2.1>,
      <created by zg
	started at 2015-08-11 21:04:56.742 -0700,
	POWCHK enabled, PULCHK disabled,
       configuration hash MD5:
       21 0F 79 D6 B3 7B B4 F6 88 20 88 DB 03 48 BD 9F
       data hash MD5: 64K
       68 9B D6 C9 79 06 CA 4A 48 AF 69 29 33 A2 21 C3>)
(   2,<2015-08-11 21:06:06.367 -0700>,<Administrator>,<X>,<proc1d>,<TOPSPIN 2.1>,
      <Start of raw data processing
       efp LB = 0 FT_mod = 6 PKNL = 1 PHC0 = 0 PHC1 = 0 SI = 32K 
       data hash MD5: 32K
       CC BD 28 82 87 60 89 AF A5 6F 85 3B 23 93 C8 87>)
(   3,<2015-08-11 21:06:06.648 -0700>,<Administrator>,<X>,<proc1d>,<TOPSPIN 2.1>,
      <pk PHC0 = 86.96777 PHC1 = 0 
       data hash MD5: 32K
       76 F3 FC 6F F9 5B 10 34 6F A1 4D 2E E8 58 8E A5>)
(   4,<2015-08-11 21:06:06.757 -0700>,<Administrator>,<X>,<proc1d>,<TOPSPIN 2.1>,
      <abs ABSG = 1 
       data hash MD5: 32K
       90 D9 45 A8 23 ED 47 76 BA 80 89 E0 A6 22 88 30>)
(   5,<2015-08-11 21:06:06.820 -0700>,<Administrator>,<X>,<proc1d>,<TOPSPIN 2.1>,
      <abs ABSG = 2 
       data hash MD5: 32K
       8C B3 37 B9 B4 5C F2 F5 98 56 D3 99 7F 25 FC 52>)
(   6,<2015-08-11 21:06:06.882 -0700>,<Administrator>,<X>,<proc1d>,<TOPSPIN 2.1>,
      <abs ABSG = 3 
       data hash MD5: 32K
       0D 23 2B 98 88 73 DB 5A DE DE 85 16 A2 C7 E4 6D>)
(   7,<2015-08-11 21:06:06.929 -0700>,<Administrator>,<X>,<proc1d>,<TOPSPIN 2.1>,
      <abs ABSG = 4 
       data hash MD5: 32K
       83 23 33 86 65 E1 1F 24 27 9C F8 E4 E1 18 CC 78>)
(   8,<2015-08-11 21:06:06.992 -0700>,<Administrator>,<X>,<proc1d>,<TOPSPIN 2.1>,
      <abs ABSG = 5 
       data hash MD5: 32K
       7C 8F 59 DC 07 F0 AE D7 11 A8 1E 30 8F C7 18 D6>)
$$ ##END=
$$ 
$$ $$ hash MD5
$$ $$ B2 34 5A B0 DB 46 99 05 BF 80 42 E4 9B A5 DF 23
##$RELAX= 
##$RELAX= 
##$RELAX= 
##$RELAX= 
##$RELAX= 
##$RELAX= 
##$RELAX= 
$$ Bruker specific parameters
$$ --------------------------
##$DU= <E:\>
##$EXPNO= 10
##$NAME= <AC1756_VAR00028_9319824_1CXsmxYH48>
$$ [...]
150 150 150 150 150 150 150 150
##$TP07= 0
##$TPNAME0= <>
##$TPNAME1= <>
##$TPNAME2= <>
##$TPNAME3= <>
##$TPNAME4= <>
##$TPNAME5= <>
##$TPNAME6= <>
##$TPNAME7= <>
##$TPOAL= (0..7)
0.5 0.5 0.5 0.5 0.5 0.5 0.5 0.5
##$TPOFFS= (0..7)
0 0 0 0 0 0 0 0
##$TUNHIN= 0
##$TUNHOUT= 0
##$TUNXOUT= 0
##$USERA1= <user>
##$USERA2= <user>
##$USERA3= <user>
##$USERA4= <user>
##$USERA5= <user>
##$V9= 5
##$VALIST= <valist>
##$VCLIST= <CCCCCCCCCCCCCCC>
##$VD= 0
##$VDLIST= <DDDDDDDDDDDDDDD>
##$VPLIST= <PPPPPPPPPPPPPPP>
##$VTLIST= <TTTTTTTTTTTTTTT>
##$WBST= 2048
##$WBSW= 25
##$XGAIN= (0..3)
0 0 0 0
##$XL= 0
##$YL= 0
##$YMAX_a= 595527
##$YMIN_a= -524295
##$ZGOPTNS= <>
##$ZL1= 120
##$ZL2= 120
##$ZL3= 120
##$ZL4= 120
##$ABSF1= 14.98509
##$ABSF2= -5.573092
##$ABSG= 5
##$ABSL= 3
##$ALPHA= 0
##$AQORDER= 0
##$ASSFAC= 0
##$ASSFACI= 0
##$ASSFACX= 0
##$ASSWID= 0
##$AUNMP= <proc_prof1d_extract_pilot.lims>
##$AXLEFT= 0
##$AXNAME= <>
##$AXNUC= <1H>
##$AXRIGHT= 0
##$AXTYPE= 0
##$AXUNIT= <>
##$AZFE= 0.1
##$AZFW= 0.1
##$BCFW= 0
##$BC_mod= 0
##$BYTORDP= 0
##$COROFFS= 0
##$CY= 15
##$DATMOD= 1
##$DC= 0
##$DFILT= <>
##$DTYPP= 0
##$F1P= 0
##$F2P= 0
##$FCOR= 0.5
##$FTSIZE= 32768
##$FT_mod= 6
##$GAMMA= 0
##$GB= 0
##$INTBC= 1
##$INTSCL= 1
##$ISEN= 128
##$LB= 0
##$LEV0= 0
##$LPBIN= 0
##$MAXI= 10000
##$MC2= 0
##$MEAN= 0
##$ME_mod= 0
##$MI= 0
##$NCOEF= 0
##$NC_proc= -8
##$NLEV= 6
##$NOISF1= 0
##$NOISF2= 0
##$NSP= 0
##$NTH_PI= 0
##$NZP= 0
##$OFFSET= 14.98509
##$PC= 1
##$PHC0= 86.96777
##$PHC1= 0
##$PH_mod= 1
##$PKNL= yes
##$PPARMOD= 0
##$PPDIAG= 0
##$PPIPTYP= 0
##$PPMPNUM= 2147483647
##$PPRESOL= 1
##$PSCAL= 4
##$PSIGN= 0
##$PYNMP= <proc.py>
##$REVERSE= no
##$SF= 400.02
##$SI= 32768
##$SIGF1= 0
##$SIGF2= 0
##$SINO= 400
##$SIOLD= 32768
##$SPECTYP= <>
##$SREGLST= <1H.CDCl3>
##$SSB= 0
##$STSI= 32768
##$STSR= 0
##$SW_p= 8223.68421052631
##$SYMM= 0
##$S_DEV= 0
##$TDeff= 65536
##$TDoff= 0
##$TI= <>
##$TILT= no
##$TM1= 0
##$TM2= 0
##$TOPLEV= 0
##$USERP1= <user>
##$USERP2= <user>
##$USERP3= <user>
##$USERP4= <user>
##$USERP5= <user>
##$WDW= 1
##$XDIM= 32768
##$YMAX_p= 454584274
##$YMIN_p= -672280
##$CURPLOT= <Network HP LaserJet P1505>
##$CURPRIN= <$Network HP LaserJet P1505>
##$DFORMAT= <normdp>
##$LAYOUT= <+/1D_H.xwp>
##$LFORMAT= <normlp>
##$PFORMAT= <normpl>
##$SURQMSG= 1
$$ End of Bruker specific parameters
$$ ---------------------------------
##NTUPLES= NMR SPECTRUM
##VAR_NAME=  FREQUENCY,     SPECTRUM/REAL,   SPECTRUM/IMAG
##SYMBOL=    X,             R,               I
##VAR_TYPE=  INDEPENDENT,   DEPENDENT,       DEPENDENT
##VAR_FORM=  AFFN,          ASDF,            ASDF
##VAR_DIM=   32768,         32768,           32768
##UNITS=     HZ,            ARBITRARY UNITS, ARBITRARY UNITS
##FACTOR=    0.250966925370066, 1,           1
##FIRST=     8223.43324360094, 91183,        25489
##LAST=      0,             -64566,          -370767
##MIN=       0,             -672280,         0
##MAX=       8223.43324360094, 454584274,    0
$$ Real data points
##PAGE= N=1
##DATA TABLE= (X++(R..R)), XYDATA
$$ [...]
19567b23358E1591c0048m6424A08654b58667f9428r2754I6309l7189a85196A57476
$$ -223358 51591 -30048 -76472 108654 -258667 -69428 -162182 96309 59120 -185196 157476
19555a98314A64926L3428N9375a92925d7706A13325j8301b13221k89280g8154
$$ -198314 164926 198354 257729 -192925 -47706 113325 95024 -213221 -502501 -78154
19544i0752O908m0919j04539c3774A16607e9916c423j94394P2917j05156f4098
$$ -90752 -83844 -124763 -229302 -33774 116607 -59916 -3423 -197817 -124900 -230056 -64098
19532c3265k9618C7306J4490a42716F9709J81095d37797e6072I977O0859J36229
$$ -33265 -62883 37306 51796 -142716 69709 250804 -437797 -56072 9977 70836 207065
19521B07065j6618c84002a27122A78088a77447b0984D8377N3142c38861E8511
$$ 207065 190447 -384002 -127122 178088 -177447 -20984 48377 101519 -338861 58511
19510b94322g2743B88543j16326b81758d2189j479N376A81622i5102A33853c12392
$$ -294322 -72743 288543 172217 -281758 -42189 -43668 -38292 181622 -95102 133853 -312392
19498a65066C75829b31032A09574B6932b74761D51074b27636h257k06341d4292
$$ -165066 375829 -231032 109574 26932 -274761 451074 -227636 -8257 -214598 -44292
19487A46383a74570C90994c0809B9012c50123A052c58657F9349J41713E0902a0061
$$ 146383 -174570 390994 -30809 29012 -350123 1052 -358657 69349 211062 50902 -10061
19475A56405c06063P8280b2169O423A16915e6037m06399A84900H4851J22493b47892
$$ 156405 -306063 -227783 -22169 -15746 116915 -56037 -462436 184900 84851 207344 -247892
19463a10989N3967I3920C6533i2645c5879k02805j6870B29116b91563G8468i9351
$$ -110989 -57022 93920 36533 -92645 -35879 -238684 -255554 229116 -291563 78468 -99351
19451A06029a00563I9046b09764C9028b59815i879n4018B08449a59066H4920m1410
$$ 106029 -100563 99046 -209764 39028 -259815 -9879 -63897 208449 -159066 84920 43510
19440D3510i3774k29905e8980G9808b7290m52601a75164p0834A18824a16816A15989
$$ 43510 -93774 -323679 -58980 79808 -27290 -479891 -175164 -245998 118824 -116816 115989
19428A59024A0661a51217N3817k03140l1114I4490M883b23385A61212c08143C8999
$$ 159024 10661 -151217 -97400 -300540 -331654 94490 99373 -223385 161212 -308143 38999
19416b33198P5994A31339b92013J24455b5339q1485m9278M6932j40796a08698
$$ -233198 -157204 131339 -292013 -167558 -25339 -106824 -156102 -109170 -249966 -108698
19405c06254i545k27870a9016B949d22791J94818A71996k7358b99813N5781B1843
$$ -306254 -9545 -237415 -19016 2949 -422791 -227973 171996 144638 -299813 -244032 21843
19393a11590c7609k93405L3143a7089j83842M064F355a20742p2177a0506G0556
$$ -111590 -37609 -331014 -297871 -17089 -200931 -196867 6355 -120742 -192919 -10506 70556
19381a46621A6981J31626K19809b67257k17374b13724j33071H4331h882k38040
$$ -146621 16981 148607 368416 -267257 -484631 -213724 -346795 84331 -8882 -246922
19371b46922O8990k4707j2044H5276N2977a57911d2918j66208M4891c8046n421
$$ -246922 -177932 -202639 -214683 85276 138253 -157911 -42918 -209126 -164235 -38046 -43467
19360d3467H5203b5688o549n3077a0957p0479A22855C5557J09099M8924a3741
$$ -43467 85203 -25688 -32237 -85314 -10957 -81436 122855 35557 144656 193580 -13741
19348a41974D5865a9235p2598k63302c5650j08305A41388j5179b44617Q1551f1150
$$ -141974 45865 -19235 -91833 -355135 -35650 -143955 141388 126209 -244617 -163066 -61150
19336f9366H5648M3573A2960R4065b66510A15905c3201A73J43949a89597M9457
$$ -69366 85648 129221 12960 107025 -266510 115905 -33201 173 144122 -189597 -140140
19325a40140C24389a18373J5251C20574a68561G9937d9781A43494K630d0564A64729
$$ -140140 324389 -118373 -103122 320574 -168561 79937 -49781 143494 146124 -40564 164729
19313a53460m7418B44192E8026a90622N3675B03404a64856D808e64625b05441
$$ -153460 -200878 244192 58026 -190622 -136947 203404 -164856 4808 -564625 -205441
19302c8191A10040c8607j78347a5360j41606J6267d9203n09003a6260k72488J22081
$$ -38191 110040 -38607 -216954 -15360 -156966 -140699 -49203 -558206 -16260 -288748 -166667
19291a66667d8854k14250O9066G4511J20699a56898b2674l8957l9177o0702P0945
$$ -166667 -48854 -263104 -194038 74511 195210 -156898 -22674 -61631 -100808 -161510 -90565
19280i0565C9259g6968k63816A0532a10469j33868G5695A1433b09034I5003d6548
$$ -90565 39259 -76968 -340784 10532 -110469 -244337 75695 11433 -209034 95003 -46548
19268B31855e9966D2782n090L7418i8853k17143A27557b33093C47683b16896a8684
$$ 231855 -59966 42782 37692 75110 -98853 -315996 127557 -233093 347683 -216896 -18684
19256C7216J79682g8344j90050J29593A99797b2292j00799j68128L8486A90720
$$ 37216 216898 -78344 -268394 -138801 199797 -22292 -123091 -291219 -252733 190720
19245h7600I0523c6441p3639d0398A82068b06258R3264Q9I2346k1483J29159a13509
$$ -87600 90523 -36441 -110080 -40398 182068 -206258 -112994 -112905 92346 70863 200022 -113509
19232b76005a14410j50749a06782j46827R0761M6854j7927N689a3762G8962K04673
$$ -276005 -114410 -265159 -106782 -253609 -162848 -115994 -133921 -128232 -13762 78962 283635
19221B83635G3274e1988A7543a7121o1636p5712A04850a9151D1756c63346C49936
$$ 283635 73274 -51988 17543 -17121 -78757 -154469 104850 -19151 41756 -363346 349936
19209b22016i2594L6248A03476b27544G3106A4316b60276L9116j02707J32024
$$ -222016 -92594 -56346 103476 -227544 73106 14316 -260276 -221160 -323867 -191843
19199a91843d399j3272m3440F5229D742O168R4500E2182K24253h9344A1497e3375
$$ -191843 -4399 -17671 -61111 65229 4742 10910 105410 52182 276435 -89344 11497 -53375
19186D8979a94318P616C6232c15675M9013e199k32813A69789F472K60421b39915
$$ 48979 -194318 -186702 36232 -315675 -266662 -5199 -238012 169789 6472 266893 -239915
19174B57063d97963F1804b13504G6196J41982p0919a1658k54169A11897d59076
$$ 257063 -497963 61804 -213504 76196 218178 147259 -11658 -265827 111897 -459076
19163c51479J48765A16228i3833l25154a95736i2605A04227b19354d2225H338
$$ -351479 -202714 116228 -93833 -418987 -195736 -92605 104227 -219354 -42225 8338
19152b30170A7228b1430j50816J6553A62010a35363O5732I7442M2231a6634B09121
$$ -230170 17228 -21430 -172246 -155693 162010 -135363 -69631 97442 139673 -16634 209121
19140B15500G2023a31949B13601a79872l4133e6261A64886j3940k3258a5965q1646
$$ 215500 72023 -131949 213601 -179872 -214005 -56261 164886 150946 127688 -15965 -97611
19129i7611l3265m56855a240a97j18237a8822l56106a66780P9167j20577B0499
$$ -97611 -130876 -587731 -1240 -197 -118434 -18822 -374928 -166780 -87613 -208190 20499
19117i7037K0921j81021B27718e7894o7055K047A5604g7529j97040C12524a57784
$$ -97037 -76116 -257137 227718 -57894 -124949 -122902 15604 -77529 -274569 312524 -157784
19105b83161R3686l7338L2118Q8383M7090k3570k12320a8445C4763d26883F4804
$$ -283161 -189475 -226813 -194695 -106312 -59222 -82792 -295112 -18445 34763 -426883 64804
19093I8332d2380n6077j15918B18177i3767A78520E2736O8532c5795m00145A36933
$$ 98332 -42380 -98457 -214375 218177 -93767 178520 52736 121268 -35795 -435940 136933
19081a82370j29229J00953l8528e6298A63004O9618C5575Q7325f6853J1957m180
$$ -182370 -311599 -210646 -249174 -56298 163004 232622 35575 122900 -66853 -54896 -59076
19070e9076B58497a09889B79990a553m7966k4063j64436L5329i4513j77265D4522
$$ -59076 258497 -109889 279990 -1553 -49519 -73582 -238018 -202689 -94513 -271778 44522
19058a45561O5494m8655o0317r2814D163L88044b18551j5914e8934B37801L8703
$$ -145561 -80067 -128722 -189039 -281853 4163 392207 -218551 -234465 -58934 237801 276504
19047B76504b42540M3543n1469K5446A34372f6706F2405f7393A0894K50404f0599
$$ 276504 -242540 -198997 -250466 -225020 134372 -66706 62405 -67393 10894 261298 -60599
19035a94054M6502E5721a02633B27835p2797d460G4613b138D2561J23390b34434
$$ -194054 -147552 55721 -102633 227835 155038 -4460 74613 -2138 42561 165951 -234434
19023a78286C48401l0627a53297n7316C14230A1829h0914j70044F8282a69868
$$ -178286 348401 317774 -153297 -210613 314230 11829 -80914 -250958 68282 -169868
19012C4158b5939B20751i441l19248J49085l7933J03361C7139a21868E4594a36512
$$ 34158 -25939 220751 -9441 -328689 -179604 -217537 -114176 37139 -121868 54594 -136512
19000a71017B57987n4538A2793M498a96729d379k1585H855a44936r9914I4859
$$ -171017 257987 203449 12793 17291 -196729 -4379 -25964 8855 -144936 -244850 94859
18988a50506o2480j64601A13482a31917k30803J12160f4401k82265k08689a95666
$$ -150506 -212986 -377587 113482 -131917 -362720 -250560 -64401 -346666 -555355 -195666
18977A81400d13213N3096B58359c50541B6646Q1170n3108G640b94971B4777R1734
$$ 181400 -413213 -360117 258359 -350541 26646 107816 54708 7640 -294971 24777 116511
18966A16511L673a40311N5982p4041K1803J8803a1473A00494g4380I3115D4787
$$ 116511 120184 -140311 -84329 -158370 -136567 -117764 -11473 100494 -74380 93115 44787
18954g0358j84984C48588c8521r0368J6976o4252F7982J95632a67010N5526b9623
$$ -70358 -255342 348588 -38521 -128889 -111913 -176165 67982 263614 -167010 -111484 -29623
18942a49178O3913b4325B51677e6426a1394A11115A6745b09475D3500K2731a95536
$$ -149178 -85265 -24325 251677 -56426 -11394 111115 16745 -209475 43500 66231 -195536
18930c24121J05794e9237k1975a1591j68929N6350A06147b46737e4275B01582
$$ -324121 -218327 -59237 -81212 -11591 -180520 -124170 106147 -246737 -54275 201582
18919a13887q8194J0375b433l10582B8893a79038I7869D7034J43269a23271E4701
$$ -113887 -202081 -191706 -2433 -313015 28893 -179038 97869 47034 190303 -123271 54701
18907a38535k24783a13145j24791I8172a51426k4547I3028e53393b36897k4528
$$ -138535 -363318 -113145 -237936 98172 -151426 -175973 93028 -553393 -236897 -261425
18897b61425C0243a16618K2421p5947B47076h3261c2311hA29713H087J43766d33960
$$ -261425 30243 -116618 -94197 -170144 247076 -83261 -32311 -8 129713 8087 151853 -433960
18884B8901c7374j59149A08070a23701d3782d48j59578p6724i0900r4280H9588
$$ 28901 -37374 -196523 108070 -123701 -43782 -448 -160026 -236750 -90900 -185180 89588
18872F5506P6707c02702a23790E1043J8804b34148A27436a43856j28540C19496
$$ 65506 142213 -302702 -123790 51043 69847 -234148 127436 -143856 -272396 319496
18861A59018n3389b47928E99113H4771c204A0824e9133p319B4448J13326P9744
$$ 159018 105629 -247928 599113 84771 -3204 10824 -59133 -66452 24448 137774 217518
18850B17518g7762A13977f5558F698e5815j00978A76770K3513b34353F6597C2596
$$ 217518 -77762 113977 -65558 6698 -55815 -156793 176770 200283 -234353 66597 32596
18838a7615r6503B35124h941A63125g0259k46306J37851A45592C4049a23477r1091
$$ -17615 -114118 235124 -8941 163125 -70259 -316565 -178714 145592 34049 -123477 -214568
18827b14568h5324j54615K5821A55007d1665G3119b29078N4520j37647A86042
$$ -214568 -85324 -239939 -214118 155007 -41665 73119 -229078 -174558 -312205 186042
18816A549K50346g6770A96573o3620J70130a7003p6413A58850G5083P6524F6823
$$ 1549 251895 -76770 196573 132953 303083 -17003 -93416 158850 75083 151607 66823
18804d9841A2600O3388O6750b7354l5153O216B88444A0034K60924b48413p3138
$$ -49841 12600 75988 142738 -27354 -62507 -56291 288444 10034 270958 -248413 -321551
18793c21551b3572H0186i9278j64168P0636j16061h8410j05884m166G4218J4372
$$ -321551 -23572 80186 -99278 -263446 -192810 -308871 -88410 -194294 -198460 74218 88590
18782H8590l0115b09339M1765b0884p21B39629j0677h9937B95165C4344b85191
$$ 88590 58475 -209339 -167574 -20884 -21605 239629 228952 -89937 295165 34344 -285191
18770d4143D23333D1291b5398o2612a2369I7357c68114I8690D1148e92404A60565
$$ -44143 423333 41291 -25398 -88010 -12369 97357 -368114 98690 41148 -592404 160565
18758a76396B44496c49718H1090a21961l0369L1000N2055k86098G1718d16109
$$ -176396 244496 -349718 81090 -121961 -152330 -121330 -69275 -355373 71718 -416109
18747g5264k25895h561q1309j13288C6661b77078J34273o7822g6216h989D31138
$$ -75264 -301159 -8561 -89870 -203158 36661 -277078 -142805 -210627 -76216 -8989 431138
18735b01890A33046a39664k42878J52327A3266Q5384R7744h6266D0749a24007
$$ -201890 133046 -139664 -382542 -230215 13266 98650 196394 -86266 40749 -124007
18724a86680n2189J137Q3498n8171G398a74163a8440p1352A31982C8875O1339
$$ -186680 -238869 -237732 -154234 -212405 7398 -174163 -18440 -89792 131982 38875 100214
18713A00214J21420a08959G2365b8981j14074K1583B76755a58417q4170M7241
$$ 100214 221634 -108959 72365 -28981 -143055 -121472 276755 -158417 -242587 -195346
18703a95346m8374I5127c84411a31977A79300a66868E2994J20427g4160c6991
$$ -195346 -243720 95127 -384411 -131977 179300 -166868 52994 173421 -74160 -36991
18692G165O9692c8163B01591j8049B8388J53350d0134A57187b18009g9582k523
$$ 7165 76857 -38163 201591 183542 28388 181738 -40134 157187 -218009 -79582 -82105
18681h2105J5352A10379b55804B4600d2522B0191a61437H5713j3565k5741P7179
$$ -82105 -66753 110379 -255804 24600 -42522 20191 -161437 85713 72148 46407 123586
18670A23586m7150i838G9469J43071b62942f561j06680c7896A16258a21130o2205
$$ 123586 76436 -9838 79469 222540 -262942 -6561 -113241 -37896 116258 -121130 -183335
18659a83335A92170i0928b8452j47672A07132b9094B302K0709a02621D4992h7280
$$ -183335 192170 -90928 -28452 -176124 107132 -29094 2302 23011 -102621 44992 -87280
18647e2235J8990k74339j8608a46515B20284K19563f0975j10005a1121B4923a32766
$$ -52235 -33245 -307584 -326192 -146515 220284 439847 -60975 -170980 -11121 24923 -132766
18635b45623L3281Q5531k06777m4793a50081A15563P9758E3709b40766f1499F1340
$$ -245623 -212342 -126811 -333588 -378381 -150081 115563 195321 53709 -240766 -61499 61340
18623b84207b0500l9791K5227q0569j48804P5590k6296C86446C6527L0887b33232
$$ -284207 -20500 -60291 -35064 -115633 -264437 -188847 -215143 386446 36527 67414 -233232
18611a71377m4779k7637k68716A94503D7512L86433d0561k87128a26043A8502
$$ -171377 -216156 -243793 -512509 194503 47512 433945 -40561 -327689 -126043 18502
18600A27011d5815H4462r85a2763A97153a34572E2786b07849I8107h5211A75646
$$ 127011 -45815 84462 83477 -12763 197153 -134572 52786 -207849 98107 -85211 175646
18588A50212b49064A23248b4128E6528j5686f5859A07315J05798a56442E775b5601
$$ 150212 -249064 123248 -24128 56528 40842 -65859 107315 213113 -156442 5775 -25601
18576a02867M4250m22962D4309M4763a33405J3155L1428A49815i8646D3619a76868
$$ -102867 -58617 -481579 44309 89072 -133405 -120250 -88822 149815 -98646 43619 -176868
18564a49352N7641C0507g7001l4073B5719a89954A00818c20814B70632a14305
$$ -149352 -91711 30507 -77001 -111074 25719 -189954 100818 -320814 270632 -114305
18553A40569A8374K03073a7796D3317f8295r1047P0835l13815b00376b5435j3586
$$ 140569 18374 221447 -17796 43317 -68295 -159342 -88507 -402322 -200376 -25435 -39021
18542c9021A80193b03041e5591l8773m0291A96700b30254B43967c84462J11602
$$ -39021 180193 -203041 -55591 -94364 -134655 196700 -230254 243967 -384462 -272860
18532b72860g8173j5384m7582a5647j19413C26298r6245j01476a58468A21747
$$ -272860 -78173 -93557 -141139 -15647 -135060 326298 230053 128577 -158468 121747
18521c4203j18247j24037L7777A58392j3399b28425n7661A891b6376j593l5628
$$ -34203 -152450 -276487 -238710 158392 144993 -228425 -286086 1891 -26376 -27969 -63597
18510f3597k0413C9852i2085A57833F128b0034F1672d6770j08668A0264Q1225
$$ -63597 -84010 39852 -92085 157833 6128 -20034 61672 -46770 -155438 10264 91489
18499I1489a20615m0274O4102F7072a47500f4686A24988m5848C3114b32787B3899
$$ 91489 -120615 -160889 -96787 67072 -147500 -64686 124988 79140 33114 -232787 23899
18487H3767h3388A07956b69278A37367g1101Q954j42499E7102a66071C735b46751
$$ 83767 -83388 107956 -269278 137367 -71101 -62147 -204646 57102 -166071 3735 -246751
18475a18261b6119I9814a63820o6495d2136m1380c1566F3657P2713A8261a65146
$$ -118261 -26119 99814 -163820 -230315 -42136 -83516 -31566 63657 136370 18261 -165146
18463B55135a13279E7019j4161b75266a08465k17118N2182A39256b54640J11141
$$ 255135 -113279 57019 42858 -275266 -108465 -325583 -273401 139256 -254640 -143499
18453a43499A45236N273d087B25975m6447b46538R3148f9012m35455B84182r1306
$$ -143499 145236 150509 -4087 225975 179528 -246538 -153390 -69012 -504467 284182 192876
18442A92876a2995m14360O5691a33576f1112A22581D99O9746b21758j38259a5307
$$ 192876 -12995 -427355 -361664 -133576 -61112 122581 499 70245 -221758 -360017 -15307
18430b22384j61295A38983c2236A60364J2130b43446B571a80443L7841K9283j1603
$$ -222384 -383679 138983 -32236 160364 172494 -243446 2571 -180443 -142602 -113319 -124922
18419a24922q933J9981j59110f3921j76472N6079A7772g4198c0489I4969K62442
$$ -124922 -133855 -113874 -272984 -63921 -240393 -184314 17772 -74198 -30489 94969 357411
18408C57411l4996G8047j7581d9800a815E0937b28618A14785a58324d3871A53358
$$ 357411 322415 78047 60466 -49800 -1815 50937 -228618 114785 -158324 -43871 153358
18396i4772L8701B54454Q043F6658A1168c8170A874c46410G5277M2107E4292b25067
$$ -94772 -56071 254454 262497 66658 11168 -38170 1874 -346410 75277 117384 54292 -225067
18383a57843B22993a20185k34756a68712A17939B4795e03313A79936E3693a31429
$$ -157843 222993 -120185 -354941 -168712 117939 24795 -503313 179936 53693 -131429
18372a1372o4179A2634Q4086L3708K23055b32578A6422L01281b35751A00080J08896
$$ -11372 -75551 12634 96720 130428 353483 -232578 16422 317703 -235751 100080 208976
18361B08976G0026L4495d5432j01180d7181A42280b09764e7272B45948j08131
$$ 208976 70026 104521 -45432 -146612 -47181 142280 -209764 -57272 245948 137817
18351A37817b02426A18594L4950c71624B37966d8353A46608J45231i3430F5625
$$ 137817 -202426 118594 153544 -371624 237966 -48353 146608 291839 -93430 65625
18340a59109F2939a02514d5732j08912j52398p6701A04272L03671P3598A16835
$$ -159109 62939 -102514 -45732 -154644 -307042 -383743 104272 407943 481541 116835
18329b35327I2396O0875a64004A10953a31562l0252M0486C65673A72552i1961
$$ -235327 92396 153271 -164004 110953 -131562 -161814 -121328 365673 172552 -91961
18318A17236k8696c1400A91489H6064a93923l4357Q6876O9623m8936F8844a62389
$$ 117236 88540 -31400 191489 86064 -193923 -228280 -141404 -71781 -120717 68844 -162389
18306a09052d10j84018b0496o4000j11570M751B66176j25869J84863c10454H0834
$$ -109052 -410 -184428 -20496 -84496 -196066 -191315 266176 140307 325170 -310454 80834
18294c10939O1330h1809r3769n0902R4289d7307j40438C8901o571a01386B08653
$$ -310939 -249609 -81809 -175578 -226480 -132191 -47307 -187745 38901 32330 -101386 208653
18282E9467c4404j04432c9619C8701K8419c9013c101A36344A8987O1342L72729
$$ 59467 -34404 -138836 -39619 38701 67120 -39013 -3101 136344 18987 80329 453058
18271D53058a9377A8722K89136a38286B6242K27062e7628F2869K76562C3743N4452
$$ 453058 -19377 18722 307858 -138286 26242 253304 -57628 62869 339431 33743 88195
18260H8195h2931j13889e3041G4078a05358G7336a48388R76d5684A53807c17085
$$ 88195 -82931 -196820 -53041 74078 -105358 77336 -148388 -147412 -45684 153807 -317085
18248A18501C7170b82406d5172j11553D6766f2357a0668j39849c1101G7272J402
$$ 118501 37170 -282406 -45172 -156725 46766 -62357 -10668 -150517 -31101 77272 78674
18237G8674k8327N9448B8095R7994e2649A22470q001c89542J72684P0945A40255
$$ 78674 50347 109795 28095 126089 -52649 122470 114469 -389542 -216858 -145913 140255
18225c4775B01380C330a7002A3610a03717M8920B0353e1054A81114k5830C3635
$$ -34775 201380 3330 -17002 13610 -103717 -54797 20353 -51054 181114 155284 33635
18213a44047A24738e5363J6420k3186k9009A54034f2320j14737G9929j1563a37490
$$ -144047 124738 -55363 -38943 -62129 -91138 154034 -62320 -177057 79929 68366 -137490
18201i5432A61148a35112k5338g6129H6256e70148B48433h0808e01j46240D9918
$$ -95432 161148 -135112 -160450 -76129 86256 -570148 248433 -80808 -501 -146741 49918
18189D90019b42882B08615C1358R4535b37268l677A94424a78915g5686j3553j85511
$$ 490019 -242882 208615 31358 125893 -237268 -240945 194424 -178915 -75686 -89239 -274750
18178b74750I0882b22968A63681B2500b35131N1011A86549c74192A56345f0684
$$ -274750 90882 -222968 163681 22500 -235131 -184120 186549 -374192 156345 -60684
18167a99050A08691b26929l46193b25946F7687O8655c16653a03325H7928b74797
$$ -199050 108691 -226929 -573122 -225946 67687 136342 -316653 -103325 87928 -274797
18156g0848G0778j9105J95220E7243J50317c13020C34657b54344j27539J50801
$$ -70848 70778 51673 246893 57243 207560 -313020 334657 -254344 -381883 -231082
18146b31082F9482P8704D1997a74887A08290C982b30469D391L7159a69126j98124
$$ -231082 69482 148186 41997 -174887 108290 3982 -230469 4391 41550 -169126 -367250
18135c67250J69868A21729h9507A21785J22568a87645c9009p0873L6877o2929
$$ -367250 -197382 121729 -89507 121785 244353 -187645 -39009 -109882 -73005 -135934
18125a35934h67B42722a83681e6562j92716C1247J49071g0053A46055a80664O0583
$$ -135934 -867 242722 -183681 -56562 -249278 31247 180318 -70053 146055 -180664 -120081
18114a20081P418A63915G7966b12840A65990a96559N7031j75614a18566k9303
$$ -120081 -112663 163915 77966 -212840 165990 -196559 -139528 -315142 -118566 -147869
18104a47869d9871j5633A2704B388c2726l0358B49071j16550Q4765c59143A02167
$$ -147869 -49871 -65504 12704 2388 -32726 -63084 249071 132521 217286 -359143 102167
18092h0045A64183R5871r1871a42008k3201C18621J4879a25987o8586M6750e1213
$$ -80045 164183 260054 168183 -142008 -165209 318621 333500 -125987 -194573 -147823 -51213
18080a21597d3668a8559K814E4822P1726J28980I5267Q6903d42337e7243C8149
$$ -121597 -43668 -18559 -15745 54822 126548 255528 95267 182170 -442337 -57243 38149
18068b77118a15749r8609c9961D49683o3602h5574B30788B776K87093b27355i8270
$$ -277118 -115749 -214358 -39961 449683 386081 -85574 230788 2776 289869 -227355 -98270
18056e2741D5735M4788A7154J63073h625k9072A6761a61623g7942A56438a7410
$$ -52741 45735 90523 17154 180227 -8625 -37697 16761 -161623 -77942 156438 -17410
18044b17918b9228A8227e50901c236l0965A99212f2776N678A37399b63441j0284
$$ -217918 -29228 18227 -550901 -3236 -34201 199212 -62776 -57098 137399 -263441 -273725
18033b73725I7381a64446A11532O0103c19165B7131K04352b8932d609B67437p2491
$$ -273725 97381 -164446 111532 171635 -319165 27131 231483 -28932 -4609 267437 194946
18022A94946d02108a44366H2590P3786f3605a7526C22768E2143J75967h6565A22312
$$ 194946 -402108 -144366 82590 156376 -63605 -17526 322768 52143 228110 -86565 122312
18010e8598B99481Q7680n5227g3505k99800J64774A83367a49284j24885C80575
$$ -58598 299481 387161 331934 -73505 -373305 -208531 183367 -149284 -274169 380575
17999f9895B7200f8385r4473B54599b1017m5903E8954d72927c5708j36232d2676
$$ -69895 27200 -68385 -162858 254599 -21017 -66920 58954 -472927 -35708 -171940 -42676
17987b21121a7708m8779A62904K59589A6225J86918a04396j85986J04838D4943
$$ -221121 -17708 -66487 162904 422493 16225 203143 -104396 -290382 -185544 44943
17976B21388F7957b5892B70109b54796P8290C40962D2731N7891M1826b01648A67208
$$ 221388 67957 -25892 270109 -254796 -176506 340962 42731 100622 142448 -201648 167208
17964D59077a66601b9029j88848E7624A5580g5109A93536a07428L0295B5259g5996
$$ 459077 -166601 -29029 -217877 57624 15580 -75109 193536 -107428 -77133 25259 -75996
17952B8245a83430N3629r8058e2767j63760A05074b77629j35882a23462h89j40911
$$ 28245 -183430 -129801 -227859 -52767 -216527 105074 -277629 -413511 -123462 -889 -141800
17941a41800k7544a7710A59546b04876C92375J3630A74900A7411f1526G6326i1245
$$ -141800 -169344 -17710 159546 -204876 392375 406005 174900 17411 -61526 76326 -91245
17929a38516j26140B4536a48134A53045c2012j94030a2594F744a47185B11317
$$ -138516 -264656 24536 -148134 153045 -32012 -226042 -12594 6744 -147185 211317
17918a71009L7606A38176c3872r309k2864A79908i5115m0299j66656J26092A270
$$ -171009 -133403 138176 -33872 -43181 -66045 179908 -95115 -135414 -302070 -175978 1270
17906E24113A48784e1238D879a09319M8478B18168F0128b88769d467C02823a19411
$$ 524113 148784 -51238 4879 -109319 -60841 218168 60128 -288769 -4467 302823 -119411
17894h3661A23204c37070C84941j73868Q3664r1336o9369E2279J54030F1972f0644
$$ -83661 123204 -337070 384941 211073 294737 203401 134032 52279 206309 61972 -60644
17882c64626B66817i2495o1295j55370a54469B49559f9903C8226b15531E3190
$$ -364626 266817 -92495 -153790 -309160 -154469 249559 -69903 38226 -215531 53190
17871A2146b9249j31261A44370i5360c1605l43811a1857n9281G1660H798K30226
$$ 12146 -29249 -160510 144370 -95360 -31605 -375416 -11857 -71138 71660 8798 239024
17860B39024b39533B39184F4018M3807h6922A16953K18356a46009L3862B54546
$$ 239024 -239533 239184 64018 107825 -86922 116953 335309 -146009 -112147 254546
17849A08996a80225A01777b47390G2858B2030N1344N5757J42296a98812O5513
$$ 108996 -180225 101777 -247390 72858 22030 73374 129131 271427 -198812 -133299
17839a33299b4712B9521M596K90759j47846g5115A21687d3914A85847e9719j44686
$$ -133299 -24712 29521 34117 324876 177030 -75115 121687 -43914 185847 -59719 -204405
17828b04405J00744D5427O4716M7463b31028Q2366E2913h7246C1710a68779L6694
$$ -204405 -103661 45427 110143 157606 -231028 -148662 52913 -87246 31710 -168779 -132085
17817a32085d6165A29059a61297B96438c2966B2255c0764j97120g7665B8295e4471
$$ -132085 -46165 129059 -161297 296438 -32966 22255 -30764 -227884 -77665 28295 -54471
17805C0444Q3040d6660o7494j2405B28265E2547m047a02250B04505b4832m9569
$$ 30444 113484 -46660 -114154 -126559 228265 52547 48500 -102250 204505 -24832 -74401
17794g4401A54246h6357L677H6556a59031f7537A20721g2723k25103M5313a03564
$$ -74401 154246 -86357 -82680 86556 -159031 -67537 120721 -72723 -297826 -252513 -103564
17782b88274e1756b4752A4874a12649A87594a71937j43450N2708A86396J89669
$$ -288274 -51756 -24752 14874 -112649 187594 -171937 -315387 -262679 186396 376065
17772C76065B5365c0692p9603A38154E3336b1325E3111F122K30845B3959f1566
$$ 376065 25365 -30692 -110295 138154 53336 -21325 53111 6122 236967 23959 -61566
17760b66627C75699C7157O4961A6621J36606a62929A424J18658i4610f642l07633
$$ -266627 375699 37157 102118 16621 153227 -162929 1424 120082 -94610 -6642 -314275
17749c14275A05398e46n289n9163A38901E6776N9733f8959A15314J33186G1135
$$ -314275 105398 -546 -5835 -64998 138901 56776 116509 -68959 115314 248500 71135
17737A00206m7342K1188c7042B68030h8109D6538a84590h2221A6393K046J80220
$$ 100206 52864 74052 -37042 268030 -88109 46538 -184590 -82221 16393 18439 198659
17726A98659M6590A6754c0309L150B23930A4276b5041B97724a74658P4488j22883
$$ 198659 245249 16754 -30309 -27159 223930 14276 -25041 297724 -174658 -100170 -223053
17715b23053f6449q9458d3668D2088a87384A46164a16202C39418b0597k0813j17935
$$ -223053 -66449 -155907 -43668 42088 -187384 146164 -116202 339418 -20597 -41410 -159345
17704a59345J4745A83052B2860J59562J3289a5683I8503C2857J43555g3254A95125
$$ -159345 -144600 183052 22860 182422 195711 -15683 98503 32857 176412 -73254 195125
17692e0595E4191M9263a52786f8515A0707a41862A82641j7976b59959L9175G5923
$$ -50595 54191 103454 -152786 -68515 10707 -141862 182641 164665 -259959 -220784 75923
17680D804A241M9564A9966J54413J1885b4471k06493F7935R653b10181A6327c17767
$$ 4804 1241 50805 19966 174379 186264 -24471 -230964 67935 77588 -210181 16327 -317767
17667A31354J0196a301l76802B75092B1081K38840c9287E2844i7307G34594A52925
$$ 131354 141550 -1301 -378103 275092 21081 259921 -39287 52844 -97307 734594 152925
17655A72202G9300A3830K68364a83963O4010o5010I5361k7814K3289J43374a07113
$$ 172202 79300 13830 282194 -183963 -119953 -184963 95361 67547 90836 234210 -107113
17643B9478N6629A9121K15950a28708l2708B52393a15608H8319m2325b59551A42301
$$ 29478 86107 19121 235071 -128708 -161416 252393 -115608 88319 45994 -259551 142301
17631f8397A48168i5593c5265j26386l6029A69030c46977h8087D7192J73229B8704
$$ -68397 148168 -95593 -35265 -161651 -197680 169030 -346977 -88087 47192 220421 28704
17619A27354b4917j44273A34939A9238L11473M4816i8956B09445P5154a34363
$$ 127354 -24917 -169190 134939 19238 330711 375527 -98956 209445 284599 -134363
17608A93808m458k4498k0108b10795I1468L9870a86933A77489n7581D9991a06352
$$ 193808 189350 164852 144744 -210795 91468 131338 -186933 177489 119908 49991 -106352
17596B65444g7897p2701b8531F794a55918A36620K8691m2323k9234a03785a6079
$$ 265444 -77897 -150598 -28531 6794 -155918 136620 165311 122988 93754 -103785 -16079
17584B40944H6303A6900d4540l0697A08674N5464e0876E4464P328R1274b21054
$$ 240944 86303 16900 -44540 -75237 108674 164138 -50876 54464 61792 153066 -221054
17572i9504j6059j80245c82A11407J27183D4589d524B11062j5570N1367p8543
$$ -99504 -115563 -295808 -382 111407 238590 44589 -4524 211062 195492 246859 168316
17561A68316k6743J35730e8544G795O3253R5599m8195K8940J19369a37505A27374
$$ 168316 141573 277303 -58544 7795 71048 166647 118452 147392 266761 -137505 127374
17549a10090C8403L4589Q0909a96181l3079C36208F0031O068L2059D0794e0741
$$ -110090 38403 72992 153901 -196181 -229260 336208 60031 66099 98158 40794 -50741
17537I2467K87102l6147A24996e969A55281K32785h422p0418n4022B6516K26048
$$ 92467 379569 343422 124996 -5969 155281 388066 -8422 -78840 -132862 26516 252564
17526B52564j01062p5274M0101c939A28167J61110J18654g8853b7123j59185H3283
$$ 252564 151502 76228 116329 -3939 128167 289277 407931 -78853 -27123 -186308 83283
17514C99992b97084A24511A9865a98463Q3602A48179J37053J31821A25028M2282
$$ 399992 -297084 124511 19865 -198463 -114861 148179 285232 417053 125028 167310
17504A67310d7904A1550J35008m836n3807Q2245E2343N6148m9782K10070j24470
$$ 167310 -47904 11550 146558 141722 87915 170160 52343 108491 58709 268779 144309
17493A44309a36363G2029b08238B60904j18420Q5687p8801o0291j3169O2821K92022
$$ 144309 -136363 72029 -208238 260904 142484 228171 149370 89079 75910 138731 430753
17482D30753A22612J04745n8371A2780d4952A55914g3757g317I732O7656L51686
$$ 430753 122612 227357 168986 12780 -44952 155914 -73757 -7317 9732 77388 429074
17471D29074B5116K14717e9134F4453O3016k5472a62731D21425k06830J23427
$$ 429074 25116 239833 -59134 64453 127469 101997 -162731 421425 214595 338022
17461C38022A58473n6683a43643E37168B57557n2069b46326A33062J60045L8619
$$ 338022 158473 101790 -143643 537168 257557 205488 -246326 133062 293107 331726
17451C31726j45234J82908J9078j02511J04889j8141p3650j14073L6109f1174
$$ 331726 186492 369400 388478 285967 390856 372715 299065 184992 221101 -61174
17440E493J85208c3919B67483H5047Q1341m6108J17858N6730a02772L3266B64976
$$ 5493 190701 -33919 267483 85047 166388 120280 238138 294868 -102772 -69506 264976
17428D61621A52976K08062I6308L30869q5250A70650L30426p2909j66249o0065
$$ 461621 152976 361038 96308 427177 341927 170650 501076 428167 261918 201853
17418B01853H6998K89827k3046r3864A01576a82850A55190o9783D1882J71839
$$ 201853 86998 376825 353779 259915 101576 -182850 155190 85407 41882 213721
17408B13721M4634J04913j43981j651n9961p0377K88988p7330A18598J05769E0967
$$ 213721 258355 363268 219287 217636 157675 87298 376286 298956 118598 224367 50967
17396A25468K82770K5872j11183B7175a57472A09737J07610N7316b47187E0227
$$ 125468 408238 434110 322927 27175 -157472 109737 217347 274663 -247187 50227
17385B38686J04798j61607J52933F1180J14647J03304q9890M0151A10733a713
$$ 238686 343484 181877 334810 61180 175827 279131 189241 229392 110733 -1713
17374D4058J75083O4379E9276k0041a05391B7918J06210o468L8877K38625H2365
$$ 44058 219141 283520 59276 39235 -105391 27918 134128 127660 166537 405162 82365
17362A31027K7934n0245K7923k9079R3648h388B89537j13046b61226f3976B05405
$$ 131027 158961 108716 136639 107560 201208 -8388 289537 176491 -261226 -63976 205405
17350A13013g8059A99592a55086C59836J6227o4491N942g1186B9856J87101J04452
$$ 113013 -78059 199592 -155086 359836 376063 311572 317514 -71186 29856 216957 321409
17339C21409j41490M6134h397j34223A19580P4176O9984J40360F0817i6473E05202
$$ 321409 179919 226053 -8397 -142620 119580 193756 263740 404100 60817 -96473 505202
17327d60B72104B2671G754J07844L32072B0054L04465A22528l4970R0806n036
$$ -460 272104 22671 7754 115598 447670 20054 324519 122528 87558 178364 173328
17316A73328N3607p402J45319C9919j9933J84378m8851J82360E7628L78343c8778
$$ 173328 226935 219533 364852 39919 19986 204364 155513 337873 57628 435971 -38778
17304C94558j73986C034L20543j60296G8462O4012B7260J32866D7652K81548j1553
$$ 394558 220572 3034 323577 163281 78462 142474 27260 160126 47652 329200 317647
17293C17647H751O0410K37384j26249h6719A46846j3096K53167j15976A20083
$$ 317647 8751 69161 306545 180296 -86719 146846 133750 386917 270941 120083
17282D9231J85516D2634K75916J6099J53612A60021m5298B7299K41383N7480J6812
$$ 49231 234747 42634 318550 334649 488261 160021 114723 27299 268682 326162 342974
17271C42974A02701J87784D7449B2137K32240K3615d7243C62341j07138j15899
$$ 342974 102701 290485 47449 22137 254377 277992 -47243 362341 255203 139304
17261A39304J46700E6168a42932A92686l7287K0673B1793R4301K4782J58477A08760
$$ 139304 286004 56168 -142932 192686 155399 176072 21793 116094 140876 299353 108760
17249B57575m4088E0204J52665H9813C9458L06055A44609l3308J11304A06739
$$ 257575 213487 50204 202869 89813 39458 345513 144609 111301 222605 106739
17238a2420B09048C2245L62761j03432G920M60512j53752C1896K70028j28571
$$ -12420 209048 32245 395006 291574 7920 468432 314680 31896 301924 173353
17228A73353J05300O9528F6152L80819q8303a6617G4934J9177a6312D25015A62055
$$ 173353 278653 348181 66152 446971 358668 -16617 74934 94111 -16312 425015 162055
17216B24882g8703B88340K00364A14180O465L812J08316k3061J23894A08016h9797
$$ 224882 -78703 288340 488704 114180 120645 124457 232773 209712 333606 108016 -89797
17204a0113D50015A82662L60513F088N10469H0011J33996r492L2503j3461J88466
$$ -10113 450015 182662 543175 6088 516557 80011 214007 204515 237018 223557 412023
17193D12023b6992D33942k5973j29419r4127d7001B81045O5634p3716m2920J74996
$$ 412023 -26992 433942 407969 278550 184423 -47001 281045 346679 272963 230043 405039
17182D05039J57143k45129L46748B65573a89914A59753q95M99804A92435K21130
$$ 405039 562182 317053 663801 265573 -189914 159753 158858 658662 192435 413565
17172D13565r3829G9469M45124E9569L98261J18915B62219e2258B23584r8429
$$ 413565 319736 79469 524593 59569 457830 576745 262219 -52258 223584 125155
17162A25155j6131L4427K70368K24840B56576L05489q5762C1847g0615D19972
$$ 125155 109024 143451 413819 638659 256576 562065 476303 31847 -70615 419972
17151B07874L74279J37879k72608j45583r5094K95623k06977J17596A59169e336
$$ 207874 582153 720032 447424 301841 206747 502370 295393 412989 159169 -5336
17140C98753J9089r1720k3971j6419B4384K87493k119Q1412A33075J28125j19744
$$ 398753 417842 326122 302151 285732 24384 311877 309758 391170 133075 261200 141456
17129A41456N2461K32978J0366A77948K84099j74446J83442J09586j72287M6626
$$ 141456 193917 426895 437261 177948 462047 287601 471043 580629 408342 454968
17119D54968L7368k09966o353L24844k91130q5453O1622J62901j34368K51443
$$ 454968 492336 282370 276017 600861 309731 224278 285900 448801 314433 565876
17109E65876R6616k26347J08046j83908L26030B05042L0967J67549A93331L76049
$$ 565876 662492 436145 544191 360283 686313 205042 236009 403558 193331 569380
17099E69380j08238N9694K6632j15772N1461B27285J60364L0270J34580L9478
$$ 569380 461142 520836 547468 431696 483157 227285 387649 417919 552499 591977
17089E91977B55144J84623B10640L28604m8660I0859L06433O9429j72l3063k1498
$$ 591977 255144 439767 210640 539244 490584 90859 397292 466721 466549 433486 411988
17078D11988j49891J29529K00101A98704K6984K43803j30755J66987J19146P2197
$$ 411988 262097 391626 591727 198704 225688 469491 338736 505723 624869 697066
17068F97066C31514K59919j70563L83547n1163j44636o8741j33818K36720O2190
$$ 697066 331514 591433 420870 804417 753254 608618 539877 406059 642779 704969
17058G04969k01879j32704J67194J99062k35103J48922m5424k20284J52186J44736
$$ 704969 503090 370386 537580 736642 501539 650461 605037 384753 536939 681675
17048F81675m3137j61900K72039o536Q1059j75565j05369K2665J39559k38622
$$ 681675 638538 476638 748677 742141 823200 647635 542266 564931 704490 465868
17038D65868l8227K53289j44170L21742k71592j29600J59502j67609J54145Q1607
$$ 465868 427641 680930 536760 858502 586910 457310 616812 449203 603348 684955
17028F84955k53159l8859K81017j92291K23440o138j75957K43772l07669K16689
$$ 684955 431796 392937 673954 481663 705103 698965 523008 766780 459111 675800
17018F75800p960k27223J71967K716K56085n4142k661j53978K6232o8250K94975
$$ 675800 667840 440617 612584 615300 871385 817243 814582 660604 686836 618586 913561
17007I13561l10657J14622l8337K40875k49505n3928K8002J20342j28093J63496
$$ 913561 602904 717526 679189 920064 670559 616631 644633 764975 636882 800378
16997H00378j66215N1514n5091O0840O2740M172J9329j40552J59128n298K41871
$$ 800378 634163 685677 630586 691426 754166 758338 777667 637115 796243 790945 1032816
16986A032816j42219o4359K8326J31843o8561j93223M4864q2689J23108J55363
$$ 1032816 890597 826238 854564 986407 917846 724623 769487 686798 809906 965269
16976I65269k07540J21160L33753J26272l51883j3404j26347M61056m10129j4510
$$ 965269 757729 878889 1212642 1338914 987031 973627 847280 1308336 898207 883697
16966H83697j20457N26601k48877j01138Q4252K3081k2755J95129k25596k12345
$$ 883697 763240 1289841 1040964 939826 1024078 1047159 1024404 1219533 993937 781592
16956G81592J69996J11131j06980J05858j57337P4302j4387J09600k2451K90377
$$ 781592 951588 1062719 955739 1061597 904260 978562 964175 1073775 1051324 1341701
16946A341701l68084M4845M9580l4426k03343N88418l59084K6948K86567j50399
$$ 1341701 973617 1018462 1068042 1033616 830273 1418691 1059607 1086555 1373122 1222723
16936A222723l14058L49005P5908j64779K33003K53737n82079J4829j2638J02782
$$ 1222723 908665 1257670 1333578 1168799 1401802 1655539 1073460 1088289 1075651 1178433
16926A178433J41403l0681k73441N67084n38859J65245L21573k33974R0884J99365
$$ 1178433 1319836 1289155 1015714 1582798 1043939 1209184 1530757 1296783 1387667 1587032
16916A587032q1466l73545O98269l51755j49355L76151j59744J33226q2999j7019
$$ 1587032 1505566 1132021 1830290 1478535 1329180 1705331 1545587 1678813 1595814 1578795
16906A578795J24252j10021L5583M79716k80684K68759n07132K86038J84127m47431
$$ 1578795 1703047 1593026 1628609 2108325 1827641 2096400 1589268 1875306 2059433 1612002
16896A612002L17318J17266k96331J13118r7338J61330j13470j2646J88043n5259
$$ 1612002 1929320 2046586 1750255 1863373 1766035 1927365 1813895 1801249 1989292 1934033
16886A934033J04320Q9018j29226K4567O0573K17035l49817M23836j95521J89672
$$ 1934033 2038353 2127371 1998145 2022712 2083285 2300320 1950503 2374339 2178818 2368490
16876B368490J39090o73302L24705L92287J76255j79414l82753N22117r6676J53120
$$ 2368490 2507580 1834278 2158983 2551270 2727525 2548111 2165358 2687475 2590799 2743919
16866B743919p6919K57464m17709M23331j79431K58056k97374n1786L96587l98890
$$ 2743919 2667000 2924464 2506755 2930086 2750655 3008711 2711337 2659551 3056138 2657248
16856B657248N93658k17648K32116j77020J36420m5606L1102p4097L50171o5467
$$ 2657248 3250906 3033258 3265374 3088354 3224774 3179168 3210270 3136173 3486344 3420877
16846C420877p5671L30335j39815r3147M79606j88483j22841K79508J89628o8923
$$ 3420877 3345206 3675541 3535726 3442579 3922185 3733702 3610861 3890369 4079997 4011074
16836D011074L43730o7470J5050Q6811J34504j69969J68134M03037p3854J17611
$$ 4011074 4354804 4287334 4302384 4389195 4523699 4353730 4521864 4924901 4851047 4968658
16826D968658L856J6390L443j71135L16700M9674J40727J96210K04288j16194
$$ 4968658 4972514 4988904 4992347 4821212 5137912 5187586 5328313 5524523 5728811 5612617
16816E612617L86801M3180j39358K38621L94290j23780J79051J70422J2224P9822
$$ 5612617 5999418 6042598 5903240 6141861 6536151 6412371 6591422 6761844 6774068 6853890
16806F853890L73885k39138P92597l14720L25383j49054M29734J46082O13848
$$ 6853890 7227775 6988637 7781234 7466514 7791897 7642843 8072577 8218659 8832507
16797H832507O1667J34391K74007R7305M83815L88815R0680L54642L27546K61561
$$ 8832507 8894174 9028565 9302572 9399877 9883692 10272507 10363187 10717829 11045375 11306936
16787A1306936J05013L97889M64601L58685M35269O8905L22845Q18570K67834
$$ 11306936 11411949 11809838 12274439 12633124 13068393 13137298 13460143 14278713 14546547
16778A4546547M60863N88354K66423Q35437K88973P98455L95330O59345J042106
$$ 14546547 15007410 15595764 15862187 16697624 16986597 17785052 18180382 18839727 19881833
16769A9881833N32821M81596J071429R56034N15615J219405Q09215J170167J019718
$$ 19881833 20414654 20896250 21967679 22923713 23439328 24658733 25467948 26638115 27657833
16760B7657833J194894J202440J639702J425243J102535J791178K072476J813366
$$ 27657833 28852727 30055167 31694869 33120112 34222647 36013825 38086301 39899667
16752C9899667J629082K324664K236974K605478K505033K892802K961373K691704
$$ 39899667 41528749 43853413 46090387 48695865 51200898 54093700 57055073 59746777
16744E9746777L737217L759405L890833M386368M585256M596994N219716N439547
$$ 59746777 63483994 67243399 71134232 75520600 80105856 84702850 89922566 95362113
16736I5362113N829973O452727O083321P215568O913504P464020P292352P667044
$$ 95362113 101192086 107644813 113728134 120943702 127857206 135321226 142613578 150280622
16728A50280622P113484O789968O776360O057143M821605M109245K928725J859342
$$ 150280622 157394106 164184074 170960434 177017577 181839182 185948427 188877152 190736494
16720A90736494K68405j192223k017761l652864m605491n474113o609373o769816
$$ 190736494 191004899 189812676 187794915 184142051 179536560 174062447 167453074 160683258
16712A60683258p274484p834485p372987p711986p468677p283308o882118o582799
$$ 160683258 153408774 145574289 138201302 130489316 123020639 115737331 108855213 102272414
16704A02272414o196934o101286n066901n396389m740002m287026m406417l615737
$$ 102272414 96075480 89974194 84907293 79510904 74770902 70483876 66077459 62461722
16696F2461722l640868l257420k961169l301750k534078k507975k337467k135127
$$ 62461722 58820854 55563434 52602265 49300515 46766437 44258462 41920995 39785868
16688C9785868k018354j798340j697077j735404j556694j082750j600300q79677
$$ 39785868 37767514 35969174 34272097 32536693 30979999 29897249 28296949 27417272
16680B7417272j505001j041322r24055j100353j128659k72334j028720j056675
$$ 27417272 25912271 24870949 23946894 22846541 21717882 21445548 20416828 19360153
16672A9360153q66625l68676r44645o76688j84247j096428m86180Q7253j165386
$$ 19360153 18493528 18124852 17180207 16503519 16319272 15222844 14736664 14823917 13658531
16663A3658531j58171k92736m65932l96616m81614o72749O0454k78900m55465
$$ 13658531 13500360 13207624 12741692 12345076 11863462 11190713 11251167 10972267 10516802
16654A0516802k98007m87019l41729m1365m80432j18667k06050l43656j93012
$$ 10516802 10218795 9731776 9390047 9348682 8868250 8749583 8543533 8199877 8006865
16645H006865j47932j64763m35954K27925p82470n0656K53393l64985j30072J55126
$$ 8006865 7858933 7694170 7258216 7486141 6703671 6653015 6906408 6541423 6411351 6566477
16635F566477l45105j68381k96736l7076o11651K00470P0709L0779l39687p9546
$$ 6566477 6221372 6052991 5756255 5719179 5107528 5307998 5378707 5409486 5069799 4990253
16625D990253l02592j08412j28230K61423m28570K0948J34762k25352J34173k21588
$$ 4990253 4687661 4579249 4451019 4712442 4283872 4304820 4439582 4214230 4348403 4126815
16615D126815p0420j53432l52554K75097j28519m53182P0167j90247K73084m6302
$$ 4126815 4056395 3902963 3550409 3825506 3696987 3243805 3313972 3123725 3396809 3350507
16605C350507k45521l2248j2694M9495j64710K1232r3763n9503j13565j55108
$$ 3350507 3104986 3072738 3060044 3109539 2944829 2966061 2872298 2812795 2699230 2544122
16595B544122K59150n64525N14898j31385K8482j18400l73098K54782J27982k81852
$$ 2544122 2803272 2238747 2753645 2622260 2650742 2532342 2159244 2414026 2542008 2260156
16585B260156P5418j34249j31953r830j6695q8320j65337M7539J38575J8693j42121
$$ 2260156 2335574 2201325 2069372 2059542 2042847 1954527 1789190 1836729 1975304 1993997 1851876
16574A851876j6623k28011K55469j37733J93767q0461L19525k89170k89283K11425
$$ 1851876 1835253 1607242 1862711 1724978 1918745 1838284 2157809 1868639 1579356 1790781
16564A790781k24580K61457l0037n15147P46493k47019l68292k6289o1281J49502
$$ 1790781 1566201 1827658 1797621 1282474 2028967 1781948 1413656 1387367 1326086 1475588
16554A475588k79709J52854l74868L93358k28862O64706m03615p7038p378l4708
$$ 1475588 1195879 1348733 973865 1367223 1138361 1803067 1399452 1322414 1315036 1280328
16544A280328l02203J77657R9049r9261j97161K82905j36767k5547R4962j95713
$$ 1280328 978125 1155782 1254831 1155570 958409 1241314 1104547 1079000 1173962 978249
16534I78249l3918Q5226j14794M43990l24109k12765K72617j87130o1144K57799
$$ 978249 944331 1029557 914763 1358753 1034644 821879 1094496 907366 846222 1104021
16524A104021l07647J77435l259J23130l24270J70226N2054j91711K0914J51023
$$ 1104021 796374 973809 970550 1093680 769410 939636 991690 799979 820893 971916
16514I71916J3770j59271m3937J17050J48278k03310k60439M06071m33247O05033
$$ 971916 985686 826415 782478 899528 1047806 844496 584057 990128 556881 1161914
16504A161914m93701J93359j19420B92418O03186j21425J70145j34588j97005
$$ 1161914 668213 861572 742152 292418 895604 774179 944324 809736 612731
16495F12731K24025q3878K40305l20296j39164O4506N58486m32962j68133J65577
$$ 612731 836756 752878 993183 672887 533723 598229 1156715 723753 555620 721197
16485G21197B71746N02879j18729J39269q0078k59062j06513L93791l60841K86045
$$ 721197 271746 774625 655896 795165 715087 456025 349512 743303 382462 668507
16475F68507o4184j9127j8806j43572R550Q6493B51864J65111J94794k85405L43747
$$ 668507 604323 585196 566390 422818 432368 518861 251864 416975 611769 326364 670111
16464F70111k96492J76478K73713l06964J3255j92882M8223L81111j82068B49345
$$ 670111 373619 550097 823810 516846 530101 337219 385442 766553 584485 249345
16453C92888k1017O8594A49826l1669J80587L0007J23444K14198J01529C50182
$$ 392888 371871 440465 149826 118157 298744 328751 452195 666393 767922 350182
16442E66704k53847D1562K89418L5920Q752H6070N8749K78015J02125m1758Q3398
$$ 566704 312857 41562 330980 366900 375652 86070 144819 422834 524959 483201 566599
16431E66599I3247L36272A08261L21545k5270G2550L4056J34877L93894B90750
$$ 566599 93247 429519 108261 429806 404536 72550 106606 241483 635377 290750
16420C85158j07463K27623B09792M69385k71844q341j24771K93613B79032J79466
$$ 385158 277695 505318 209792 679177 407333 398992 274221 567834 279032 458498
16410D58498C2441M00187a2487H2336J78347C537M00595m6565k7213r3697J19917
$$ 458498 32441 432628 -12487 82336 260683 3537 404132 357567 330354 236657 356574
16399C56574A47123J9905C0422K37683K65838E5732K47492O1691r7244J2852A33829
$$ 356574 147123 167028 30422 268105 533943 55732 303224 364915 267671 280523 133829
16387B7824L4512c0940A83000J6674L8870m5707E7864A2391L04841o0005j1711
$$ 27824 62336 -30940 183000 199674 238544 192837 57864 12391 317232 257227 245516
16376B45516M7896D6087j6651K77668A36720K54299j53959j10548q350J66219
$$ 245516 293412 46087 29436 307104 136720 391019 237060 126512 118162 284381
16366B84381D2047L46045K68216B04787h1215B23476k1527d3675A81679N9273
$$ 284381 42047 388092 656308 204787 -81215 223476 201949 -43675 181679 240952
16356B40952p6312J46100L2685K4484j14233f9684C66135A73184J2432K8538J60187
$$ 240952 164640 310740 343425 367909 253676 -69684 366135 173184 185616 214154 374341
16345C74341j55579M4859a74016A24292b15123B51502P2089A45934a4508B94969
$$ 374341 218762 263621 -174016 124292 -215123 251502 323591 145934 -14508 294969
16334a842k7108F8321J59198m3778q641n3837N0551E6714a7707l2720A81868i9567
$$ -1842 -28950 68321 227519 183741 175100 121263 171814 56714 -17707 -50427 181868 -99567
16321A67065l7323a86701B95285J22456h034j56586G048K63329a17304I2781J23743
$$ 167065 129742 -186701 295285 417741 -8034 -164620 7048 270377 -117304 92781 216524
16310B16524c1355B50363F3300f1018D73443A27044R9110a55170B32759a81205
$$ 216524 -31355 250363 63300 -61018 473443 127044 226154 -155170 232759 -181205
16299I295L29307j45295K8720o4421E7184c10737D26335A32672K26739A49934
$$ 9295 338602 193307 222027 157606 57184 -310737 426335 132672 359411 149934
16288i9337a0625G3136J32278K9097K54406A55512g0908J3977b1176A13180Q1336
$$ -99337 -10625 73136 205414 234511 488917 155512 -70908 -56931 -21176 113180 194516
16277A94516a12057e1275D1775J38079e0941A35567J26359C0401K12983A07246
$$ 194516 -112057 -51275 41775 179854 -50941 135567 261926 30401 243384 107246
16266B71302b29143A33193b8228D4555j3198Q4835M39583a82784c3168J3843k829
$$ 271302 -229143 133193 -28228 44555 31357 116192 555775 -182784 -33168 -19325 -22154
16255b2154A76141D8591g9080k28036A66035e4778G1004J24763o0697e1274B34190
$$ -22154 176141 48591 -79080 -307116 166035 -54778 71004 195767 135070 -51274 234190
16243F2338b77261C23930H7711l6630a15483B5597f6113C28582a0329A32178Q5050
$$ 62338 -277261 323930 87711 51081 -115483 25597 -66113 328582 -10329 132178 217228
16232B17228F620Q1597M4499h098E3298a59084l5539B1431a39729O2011I0704
$$ 217228 6620 88217 132716 -8098 53298 -159084 -194623 21431 -139729 -77718 90704
16220B47436d37058A28296B0808d3072G6971O955J05231a34220B52021D5747J74102
$$ 247436 -437058 128296 20808 -43072 76971 83926 189157 -134220 252021 45747 219849
16209B19849J12412b58242B71756q4428a5707A54243J03785h0627I0956e2487
$$ 219849 332261 -258242 271756 187328 -15707 154243 258028 -80627 90956 -52487
16198a21404I1849J61449r0611D6001J3019b32366c0130q2393E47661G1904J45379
$$ -121404 91849 253298 162687 46001 59020 -232366 -30130 -112523 547661 71904 217283
16187B17283a6422k22526i237A63251E0282j8668K59374B4005a75157n315H7595
$$ 217283 -16422 -238948 -9237 163251 50282 31614 290988 24005 -175157 -180472 87595
16175a93171E6572A5129b28294n2692Q957A66469H1883J55647G697J85795a47778
$$ -193171 56572 15129 -228294 -280986 -272029 166469 81883 237530 7697 193492 -147778
16163b7639A66681b620C2351a49814A0242J26732b11676G4323b77352a34732D34469
$$ -27639 166681 -2620 32351 -149814 10242 136974 -211676 74323 -277352 -134732 434469
16151a29812B6655e593k84866C1038a93721j38386f9600n3425B06325p9885b2032
$$ -129812 26655 -5593 -290459 31038 -193721 -332107 -69600 -123025 206325 126440 -22032
16139A50584K84643A27066L05356a43979c4576m5903E6710a53324A44452a3999
$$ 150584 435227 127066 432422 -143979 -34576 -80479 56710 -153324 144452 -13999
16128h8815B5036a92326d3687M575O234m9582I99a35558A87550a02357l9059k18530
$$ -88815 25036 -192326 -43687 -39112 -32878 -82460 999 -135558 187550 -102357 -141416 -359946
16116c59946R8152H2480O3436E2375a19597H985R3934b57317A15494a0590A73936
$$ -359946 -261794 82480 145916 52375 -119597 8985 102919 -257317 115494 -10590 173936
16104B34470I0847J67637f6010j52866h0623A66283i46A03933a40203B27324b23664
$$ 234470 90847 258484 -66010 -218876 -80623 166283 -946 103933 -140203 227324 -223664
16092A14013D7300A2157a72520L6852O0243m5798B39423a21239C19896c0166j61031
$$ 114013 47300 12157 -172520 -135668 -75425 -121223 239423 -121239 319896 -30166 -191197
16081a91197f9274b3940l4102m3431j46137i1085B9537Q0222N2772a46011k68898
$$ -191197 -69274 -23940 -58042 -101473 -247610 -91085 29537 109759 162531 -146011 -414909
16070d14909e1148G7061J78991I3774h2169m0853C2196a28810i823n4679j19482
$$ -414909 -51148 77061 256052 93774 -82169 -123022 32196 -128810 -9823 -64502 -183984
16059a83984B6745J64935a57093d2967J8987j57429r4879a35171j94187g846k82160
$$ -183984 26745 191680 -157093 -42967 -23980 -181409 -276288 -135171 -329358 -7846 -290006
16048b90006B45393b56043H390L22236B283c18533R0391E5454e1063a047A03387
$$ -290006 245393 -256043 8390 330626 2283 -318533 -228142 55454 -51063 -1047 103387
16036A00443a90225P3837A3916P2990i3843k17821F1331j1186I386f2752A07397
$$ 100443 -190225 -116388 13916 86906 -93843 -311664 61331 50145 9386 -62752 107397
16024G8631c21019A77649K5953K6884b29175f9364l94653G4454N5026a47751A88263
$$ 78631 -321019 177649 203602 230486 -229175 -69364 -464017 74454 129480 -147751 188263
16012a93079i5480l9275G3207J94667a45907L7288K7385k9754p20B03859D238
$$ -193079 -95480 -134755 73207 267874 -145907 -108619 -81234 -110988 -111708 203859 4238
16000B78086A06775g7056J7654C51189b34508a8507G0159b79475N5329I6528L26210
$$ 278086 106775 -77056 -59402 351189 -234508 -18507 70159 -279475 -224146 96528 422738
15989D22738G7505J6592J0573J34659j18671J20489O7487j30923d9469l3099A74304
$$ 422738 77505 94097 104670 239329 120658 241147 308634 177711 -49469 -82568 174304
15977B28340m0563a14287A66627a52901A34060b4658j11956N5386k36297J4654
$$ 228340 187777 -114287 166627 -152901 134060 -24658 -136614 -81228 -317525 -302871
15967c02871A06313c53400A96876c43862B60643I3467l9828b18572a2180q4641
$$ -302871 106313 -353400 196876 -343862 260643 93467 53639 -218572 -12180 -96821
15957i6821a172F5565j5833a08126A00211b04999A75490e6289J406p9137j1294
$$ -96821 -1172 65565 49732 -108126 100211 -204999 175490 -56289 -54883 -134020 -145314
15946a45314a1601j64078d4131k1813F2870b29C76743a27280A65717b39863j21109
$$ -145314 -11601 -175679 -44131 -65944 62870 -229 376743 -127280 165717 -239863 -360972
15935c60972J30291K8050o539C44844b40796A6325i6784p1269r8240A5278J42471
$$ -360972 -230681 -202631 -209170 344844 -240796 16325 -96784 -168053 -266293 15278 157749
15924A57749h7825A02469a20802o4237A18832J46271g9649A47553b4905o6034
$$ 157749 -87825 102469 -120802 -185039 118832 265103 -79649 147553 -24905 -90939
15914i0939A24543e2760B67798B3435b15984I5500b08053D9662a30065A63114
$$ -90939 124543 -52760 267798 23435 -215984 95500 -208053 49662 -130065 163114
15903a17686k0747B34498d7062q654j91391C0164b50344A23370Q466a08345L1020
$$ -117686 -138433 234498 -47062 -55716 -247107 30164 -250344 123370 131836 -108345 -77325
15892g7325A26646c36942J55437R795n8807b9464l03472g7543q3276B21036d4161
$$ -77325 126646 -336942 -181505 -171710 -230517 -29464 -332936 -77543 -160819 221036 -44161
15880B42173e1427k8383j7448k49647a33795m3719B59419b06940i1105M3698A28191
$$ 242173 -51427 -79810 -97258 -346905 -133795 -177514 259419 -206940 -91105 -47407 128191
15868C9414M5190b63289d4067j43154D2145c43793B7983K1862k796J7572J21517
$$ 39414 84604 -263289 -44067 -187221 42145 -343793 27983 49845 47049 64621 186138
15857A86138i9372A10144b08811I1394C7237i5517C06598A18780J29045A01454
$$ 186138 -99372 110144 -208811 91394 37237 -95517 306598 118780 247825 101454
15846A1392O0790c18281a22445A40188O3517k0433A1736P1145B8070a22126C5751
$$ 11392 72182 -318281 -122445 140188 203705 183272 11736 82881 28070 -122126 35751
15834f5564A10137r915b18581M9464A13161c13495P1947J16359J5983j40135A3899
$$ -65564 110137 100222 -218581 -169117 113161 -313495 -241548 -125189 -109206 -249341 13899
15822F6732c86258a05427B426c15978A32351K8632C4808g2259A97756J4089d5220
$$ 66732 -386258 -105427 2426 -315978 132351 160983 34808 -72259 197756 211845 -45220
15810b59270P2385A76029a27169j1624k36476f044j17387B94740j08123A0474
$$ -259270 -186885 176029 -127169 -138793 -375269 -6044 -123431 294740 186617 10474
15799d5672D857d85952D6052K30338G3167O6177A1113K80508b7943H5750a16205
$$ -45672 4857 -485952 46052 276390 73167 139344 11113 291621 -27943 85750 -116205
15787A1069c4517A8682c0644A24881b53022F0580a80226j22282B71559A26291
$$ 11069 -34517 18682 -30644 124881 -253022 60580 -180226 -302508 271559 126291
15776i0837B2631c5790f739j02272H7821R5988k7607K5371O5018c4158m5330c369
$$ -90837 22631 -35790 -6739 -109011 87821 183809 156202 181573 246591 -34158 -79488 -3369
15763A8586c38401A26805h9199A43744b2909h060j77043C18613b49516B05055
$$ 18586 -338401 126805 -89199 143744 -22909 -8060 -185103 318613 -249516 205055
15752a15556E7809K6701b98952q9662B08466E5959f6767A45724O6478H7988g3894
$$ -115556 57809 84510 -298952 -388614 208466 55959 -66767 145724 212202 87988 -73894
15740d3816A89048q710b60499j4586a26338E3074i0296H3760i5623l1129A14724
$$ -43816 189048 180338 -260499 -275085 -126338 53074 -90296 83760 -95623 -126752 114724
15728a28096F1470a5885C9257b01572g1572j57740j1258K0h1606q8014j02446
$$ -128096 61470 -15885 39257 -201572 -71572 -229312 -240570 -240550 -81606 -169620 -272066
15717b72066k26382a51532k1388A49479a31568K2482d8777G6765c1608A62390
$$ -272066 -498448 -151532 -172920 149479 -131568 -109086 -48777 76765 -31608 162390
15706h4002B15754C8877a95623a9404A94917c1973r569j53092F0262K11137a35952
$$ -84002 215754 38877 -195623 -19404 194917 -31973 -41542 -194634 60262 271399 -135952
15694B6916a98461A99283i4810H9731c51311G6848J85671r0018d2307l5674E1962
$$ 26916 -198461 199283 -94810 89731 -351311 76848 262519 172501 -42307 -77981 51962
15682C5369J61254H7606d44953a58928B22750q2560b3298j56897B6020J25947
$$ 35369 196623 87606 -444953 -158928 222750 140190 -23298 -180195 26020 151967
15672A51967M3939b61955A14481a08616H3344l6990d4011q9647C15275a2263A80465
$$ 151967 195906 -261955 114481 -108616 83344 46354 -44011 -133658 315275 -12263 180465
15660B2519a25807e5536B14246F1489a70424B9140E788a38561Q590m1991e4611
$$ 22519 -125807 -55536 214246 61489 -170424 29140 5788 -138561 -129971 -171962 -54611
15648a02891L4009B2383c12307A60220j0588F8071a00430A12585c4544q4912J6544
$$ -102891 -68882 22383 -312307 160220 149632 68071 -100430 112585 -34544 -119456 -102912
15637a02912l15517B44132g847D1991A49P0356a31170q9457O9451K3590k866C0375
$$ -102912 -418429 244132 -7847 41991 149 70505 -131170 -220627 -151176 -127586 -130452 30375
15624A71020a05214b1909B69994A17165b87067e892A26092b112I9193j7340a19975
$$ 171020 -105214 -21909 269994 117165 -287067 -5892 126092 -2112 99193 81853 -119975
15612I3943b3949A36093a04896j39806C10817A12427A571J24867c566A72842K9984
$$ 93943 -23949 136093 -104896 -244702 310817 112427 1571 126438 -3566 172842 202826
15601B02826F3152a52604C41572A4050L4425F158Q5412c21752A84888E0205i3010
$$ 202826 63152 -152604 341572 14050 48475 6158 91570 -321752 184888 50205 -93010
15589B08778a79758m7087b3305E74715B19724c68356A24281C7302b5688A6713
$$ 208778 -179758 -226845 -23305 574715 219724 -368356 124281 37302 -25688 16713
15578b26774a5909E2728d943k7127m5290p6862J5286f5450q2837E6990M7149D9863
$$ -226774 -15909 52728 -4943 -32070 -77360 -154222 -138936 -65450 -148287 56990 104139 49863
15565A99880a60372F7823g9292k77537B0683O2891O453A7003c1267j19041A28583
$$ 199880 -160372 67823 -79292 -356829 20683 83574 90027 17003 -31267 -150308 128583
15553B03759a42323C67897c02827c755C3780i1742D6198f7713E646f3194B80870
$$ 203759 -142323 367897 -302827 -3755 33780 -91742 46198 -67713 5646 -63194 280870
15541e81H0053d3041j99207r4494B04236J4171a21854P448D1244P8767M2941J33014
$$ -581 80053 -43041 -242248 -336742 204236 218407 -121854 -114406 41244 120011 162952 295966
15529B95966a14131k9107f4420j3343C5461J42210H1710a20790A68846c8161E7585
$$ 295966 -114131 -143238 -64420 -77763 35461 177671 81710 -120790 168846 -38161 57585
15517a34253J8749p7200H5684Q1905C6294f3062D3669J94224I1810A8813a62343
$$ -134253 -115504 -192704 85684 167589 36294 -63062 43669 237893 91810 18813 -162343
15505F1109a13751M9170H0787a97348c8208A11948j6692e3780j23167G464K08504
$$ 61109 -113751 -64581 80787 -197348 -38208 111948 95256 -53780 -176947 7464 215968
15494B15968b36183A89993l0434b26194J04435j07168A44738M9547b90875A26457
$$ 215968 -236183 189993 159559 -226194 -121759 -228927 144738 194285 -290875 126457
15483b05074A42196E054K20961r1781e6041C40281I7646A4315J07268K10346p6657
$$ -205074 142196 5054 226015 134234 -56041 340281 97646 14315 121583 331929 255272
15472B55272b48082C04224a12186F4216k7425b61463P6541B01867b5125A96206
$$ 255272 -248082 304224 -112186 64216 36791 -261463 -184922 201867 -25125 196206
15461b46524A91538D3622i4284L5990A35584g0994I3184a44823B93635j44760
$$ -246524 191538 43622 -94284 -58294 135584 -70994 93184 -144823 293635 148875
15451A48875h5482j27220g254k07378E8900a81193B06778f1258b6353H329a5391
$$ 148875 -85482 -212702 -7254 -214632 58900 -181193 206778 -61258 -26353 8329 -15391
15439B39848H7543O9893B9447I14K19938D8494b49677c8207F4017a07702j0804
$$ 239848 87543 157436 29447 914 220852 48494 -249677 -38207 64017 -107702 -118506
15428a18506A09940a51712B39263b73470A45412K2059g2713j97196A70183a1132
$$ -118506 109940 -151712 239263 -273470 145412 167471 -72713 -269909 170183 -11132
15417a09484a1704D9661c2830B839a3588j80682g5228c0382j3501j73791e6397
$$ -109484 -11704 49661 -32830 2839 -13588 -194270 -75228 -30382 -43883 -217674 -56397
15405H2128J71283J30689j70564b77344O0804A763a04682B04474A5677Q1925c7539
$$ 82128 253411 384100 213536 -277344 -216540 1763 -104682 204474 15677 97602 -37539
15393h214E0398b65099i8601A12015J03914G6959K46647d1021j63708L4951e0478
$$ -8214 50398 -265099 -98601 112015 215929 76959 323606 -41021 -204729 -169778 -50478
15381B93155j10204a51942n1387b136B33966o1113k7005a833l52025b1068A1211
$$ 293155 182951 -151942 -203329 -2136 233966 172853 145848 -1833 -353858 -21068 11211
15369A80538F5496J73123H446P1688a22783A6259a15575B01179J6091d487r0188
$$ 180538 65496 238619 8446 80134 -122783 16259 -115575 201179 217270 -4487 -94675
15358i4675m7623B10028j5345h0581j16136k4135A15835m0922Q7899C5186K33746
$$ -94675 -142298 210028 194683 -80581 -196717 -220852 115835 74913 162812 35186 268932
15347B68932h3r8819B52349A5627M8092i4964o024G0223L16445a05404h048l38564
$$ 268932 -83 -98902 252349 15627 63719 -94964 -100988 70223 386668 -105404 -8048 -346612
15335c46612H7506Q678f8118A00468J62332i5850I23L28086j51939F6123b23084
$$ -346612 87506 96184 -68118 100468 262800 -95850 923 329009 177070 66123 -223084
15323a28800H1030d5489j7659A91182e0615k82852f7666m7289C03105E2056Q2274
$$ -128800 81030 -45489 -63148 191182 -50615 -333467 -67666 -114955 303105 52056 134330
15312A34330e0512B45721A6438L76058A92807m9171a69703C0669J77416a03184
$$ 134330 -50512 245721 16438 392496 192807 143636 -169703 30669 208085 -103184
15301B31184a69227E3186L6706l8427H711M2605b73341A29972c3710C80378H4421
$$ 231184 -169227 53186 89892 51465 8711 51316 -273341 129972 -33710 380378 84421
15289A49903n4881j9574b11278C8320a42175K0695A80122p207H1313f8428B33430
$$ 149903 95022 75448 -211278 38320 -142175 -121480 180122 172915 81313 -68428 233430
15277C75135O7552b24366J06732C19984C6021K59624O2654n0472a99921B81678
$$ 375135 442687 -224366 -117634 319984 36021 295645 358299 307827 -199921 281678
15266A41298g9978B23604K7923C0679K24793q3238l604a7272A99469a46831E45270
$$ 141298 -79978 223604 251527 30679 255472 172234 168630 -17272 199469 -146831 545270
15254A24523b19756P9861b0850A15278J37527N6656N34044M94491l09371N12651
$$ 124523 -219756 -139895 -20850 115278 252805 309461 843505 1337996 1028625 1541276
15244A541276l87761B90500H8245f0522A1123K61949f2231D17368C5051a38060
$$ 1541276 1153515 290500 88245 -60522 11123 273072 -62231 417368 35051 -138060
15233B01835E9485a08957a2183D0789J14510c6582B03992e5625G256H08a09809
$$ 201835 59485 -108957 -12183 40789 155299 -36582 203992 -55625 7256 808 -109809
15221B64298b25362B04484G0722K34567b75091B80999q5477p5433d6100F0129
$$ 264298 -225362 204484 70722 305289 -275091 280999 195522 120089 -46100 60129
15210I8284K28534a75543B34508H940a01105p6471l8422I2230P8829A1140a60132
$$ 98284 326818 -175543 234508 8940 -101105 -177576 -215998 92230 171059 11140 -160132
15198B12113j4456r6035J13403b13277D23984r1264A07945d5669D29794B9263
$$ 212113 197657 101622 215025 -213277 423984 332720 107945 -45669 429794 29263
15187b39306G0802K61949j38580n1990P836J81975g3857c2422I1267a5513D70968
$$ -239306 70802 332751 194171 142181 150017 331992 -73857 -32422 91267 -15513 470968
15175E423J70271j7974N1893K09332B07203k879f4320j54076B60122A05690i9356
$$ 5423 175694 157720 209613 418945 207203 204324 -64320 -218396 260122 105690 -99356
15163B14549a21064a2192m8700K3303A9824O3848k6379L54892j85304o6963f014
$$ 214549 -121064 -12192 -60892 -37589 19824 83672 57293 412185 226881 159918 -6014
15151e9849A51155a25356c4467B00968b29861A65779J20113A22646b88497A14989
$$ -59849 151155 -125356 -34467 200968 -229861 165779 285892 122646 -288497 114989
15140B48546h128A28328a94381A52898l6364a43381E2088J9593c9514a1938B21486
$$ 248546 -8128 128328 -194381 152898 116534 -143381 52088 71681 -39514 -11938 221486
15128C1175J64245a93235B50746A12694g7417q4451C41910p9487G5451J67800
$$ 31175 195420 -193235 250746 112694 -77417 -161868 341910 262423 75451 243251
15118B43251E5781K26444j18111P446p9073B2853b47974B65015A12890E940K04133
$$ 243251 55781 282225 164114 171560 92487 22853 -247974 265015 112890 5940 210073
15107B10073n904l1850C8213K62597j3400p2771R8457J32912B08370e1652A18766
$$ 210073 204169 172319 38213 300810 287410 214639 313096 446008 208370 -51652 118766
15095h1033B72121a23000b0117A26218B6037O8666J79841A25520J53496J2807
$$ -81033 272121 -123000 -20117 126218 26037 94703 274544 125520 279016 291823
15085B91823A34081l5988J06783r2671n0466J54566N026D6030o636K42953b03352
$$ 291823 134081 98093 204876 112205 61739 216305 221331 46030 39394 282347 -203352
15073A36415n7103K74101D2538K62176j37645G4644J92155d313B25492D1016L00266
$$ 136415 79312 353413 42538 304714 167069 74644 266799 -4313 225492 41016 341282
15062C41282a27518C44162j01051n278J47750M6654a48654B18798J34319E9165
$$ 341282 -127518 344162 243111 237833 385583 432237 -148654 218798 353117 59165
15051B42334a03803D09720d7675B17415n1984F9886R2590M5078J99709E6279L8208
$$ 242334 -103803 409720 -47675 217415 165431 69886 162476 207554 407263 56279 94487
15040I4487J44201p7009K94027A84280o2674k9657D1904K02245L7675J9204k6109
$$ 94487 238688 161679 455706 184280 121606 91949 41904 244149 281824 301028 274919
15029B74919A1881L98635b0810B25402r2109J47620C1833J1712J31072m077K07848
$$ 274919 11881 410516 -20810 225402 133293 280913 31833 43545 174617 170540 378388
15018C78388G9219K25647A03557M10735A60261O1856F6938K29368C0025K93012
$$ 378388 79219 304866 103557 514292 160261 222117 66938 296306 30025 323037
15008C23037N6531a11151C93543K34001d6090l9076B41403E8791K63500Q542A37534
$$ 323037 379568 -111151 393543 627544 -46090 -85166 241403 58791 322291 330833 137534
14996B93632a82254A63002L01594q0591j17920K05319B2078J38222b9699B90649
$$ 293632 -182254 163002 464596 384005 266085 471404 22078 160300 -29699 290649
14985e3179A26862k2920J17072k8211K57812c4105C00276I3860K92005D2644a11937
$$ -53179 126862 103942 221014 192803 450615 -34105 300276 93860 385865 42644 -111937
14973E09132r8087j69710C0253L96000d1865D09443n1928A15655D9312J51092
$$ 509132 411045 241335 30253 426253 -41865 409443 357515 115655 49312 200404
14963B00404m9241L41799k39300G9917J76233o9822B2112N29998e1187C3525M48028
$$ 200404 151163 492962 253662 79917 256150 186328 22112 552110 -51187 33525 481553
14952D81553A65444J016m8016N6799J25181K12206i343C81870R1051A81405P3625
$$ 481553 165444 166460 118444 175243 300424 512630 -9343 381870 472921 181405 255030
14941B55030n1231A3960J21640M07040B63871J01804A48845M6970J00386j17280
$$ 255030 203799 13960 135600 542640 263871 365675 148845 195815 296201 178921
14931A78921K68060j36013Q5031h0825C70475j09447K7618j00357L44624A19888
$$ 178921 446981 310968 395999 -80825 370475 261028 288646 188289 532913 119888
14920G0029e9134F62602j48490j68827A39087L25300j08317k2588L83860C31894
$$ 70029 -59134 662602 514112 345285 139087 464387 356070 333482 717342 331894
14909C39086A40195K1073R914J49285l2910K7576K6164q8251N4837J89179j40053
$$ 339086 140195 161268 171182 320467 287557 315133 341297 253046 307883 497062 357009
14898C57009A31052K42964j75733J21877J78442A11502a18837C75302m5701j64125
$$ 357009 131052 374016 198283 320160 498602 111502 -118837 375302 329601 165476
14888A65476M48347k61861q0230P5792H1336L22596r1528j55959J74131A02869
$$ 165476 613823 351962 271732 347524 81336 403932 312404 156445 330576 102869
14877D60950J02909j75801l1304H0159L65178J81996j05309B12260J39795j07404
$$ 460950 563859 388058 356754 80159 445337 627333 522024 212260 352055 244651
14867B44651m15J2107L60477k34493j51498P5067Q1915P6668J03084j85667Q8903
$$ 244651 244236 256343 616820 382327 230829 305896 387811 464479 567563 381896 470799
14856D70799A92760J30531j979K44934p3405A17153K4029K52252K75583l10282
$$ 470799 192760 323291 321312 566246 492841 117153 141182 393434 669017 358735
14846C58735L1661o5173L7524m7457K74135m3539j07489K69420j26986j22465
$$ 358735 390396 325223 362747 315290 589425 545886 438397 707817 580831 458366
14836D58366A92035K80076j08462Q6826k13074L50007j41417B08561L27489l0471
$$ 458366 192035 472111 363649 450475 237401 587408 445991 208561 536050 505579
14826E05579n2817J1924J7487L00958k81778k24832K97530j93973A24247J39075
$$ 505579 452762 464686 482173 783131 501353 276521 574051 380078 124247 263322
14816B63322J16777l8127O1291J84056j50965L14002k56517J6689A9502M85917
$$ 263322 380099 341972 403263 587319 436354 750356 493839 510528 19502 505419
14806E05419M5581J10879j75618H6947Q0365K16293K02090j29154j10392L80864
$$ 505419 551000 661879 486261 86947 167312 383605 585695 456541 346149 727013
14796G27013j04119j62503m6509k1164A45694K16630j13446N09759l02282j85818
$$ 727013 622894 460391 413882 392718 145694 362324 248878 758637 456355 270537
14786B70537K07741M357J41491O4868l15386K84187k7727J48248J75230m34123
$$ 270537 478278 482635 624126 688994 373608 657795 630068 778316 953546 519423
14776E19423l8253K84679M8827j65602J59420l01433J45159J54457k93110K1172
$$ 519423 481170 765849 814676 649074 808494 507061 652220 806677 513567 534739
14766E34739L01901l70572M839K24253j61956M00713l72064k6147J39684J26690
$$ 534739 836640 466068 470907 695160 533204 933917 561853 535706 675390 802080
14756H02080J78411m50608N6790o3814L40006j57649O1669K57868m69299K34479
$$ 802080 980491 529883 586673 522859 862865 705216 766885 1024753 555454 789933
14746G89933j64276K78021k41502N5029j13244j96552N0054O54012l43804p2753
$$ 789933 625657 903678 662176 717205 603961 407409 457463 1111475 767671 694918
14736F94918M6075l38441K19743J12580j39283p6791K17081J45357k29100J60126
$$ 694918 740993 402552 622295 734875 595592 518801 735882 881239 652139 812265
14726H12265J25728N1448l17171k12806n6272K38843M08198l23146R0042k42917
$$ 812265 937993 989441 672270 459464 403192 642035 1050233 727087 817129 574212
14716E74212J31470M4202J13161K65112k95826j43872J10358P423m1940p4549
$$ 574212 705682 749884 863045 1128157 832331 688459 798817 806240 764300 689751
14706F89751J30794k25463M26863j46524M3952L23563m58557M03035l45432j31259
$$ 689751 820545 595082 1021945 875421 919373 1242936 784379 1187414 841982 710723
14696G10723K45143k49169j7523R5472K53225j46501j49144K68992j16745K22391
$$ 710723 955866 706697 689174 784646 1037871 891370 742226 1011218 894473 1116864
14686A116864k84794J84771l05085q688N47176k56111j28901n3841L04659K7172
$$ 1116864 832070 1016841 711756 703068 1250244 994133 865232 811391 1116050 1143222
14676A143222k077l46327l2130K13564l00464O7280N14424j34647L3521K4847
$$ 1143222 1141145 794818 762688 976252 675788 743068 1257492 1122845 1156366 1181213
14666A181213l90929J19492r305K20359j03135J20266J96546k50297j59276m5843
$$ 1181213 790284 909776 900471 1120830 1017695 1137961 1334507 1084210 924934 879091
14656H79091J000J1657J79052K18041k77253Q7617k48898J29294K22419J2194
$$ 879091 880091 891748 1070800 1288841 1011588 1099205 850307 979601 1202020 1214214
14646A214214q4554K47473l00297j5413J01538o2663J02784J52278j05840R9985
$$ 1214214 1129660 1377133 1076836 1061423 1162961 1100298 1203082 1355360 1249520 1349505
14636A349505q3126k46278L33214j94972K14329k23658K33850r0628k35550M34809
$$ 1349505 1266379 1020101 1353315 1158343 1372672 1149014 1382864 1292236 1056686 1491495
14626A491495k92244J85J83415q0487k33145N07847q3579k40159J70371K98752
$$ 1491495 1199251 1199436 1382851 1302364 1069219 1577066 1493487 1253328 1423699 1722451
14616A722451k24359k73883K92531k11483L18307J58316j95916O025k37232J31033
$$ 1722451 1498092 1224209 1516740 1305257 1623564 1781880 1585964 1591989 1354757 1485790
14606A485790K13552m7596j96899o3385P3680j94601K78925J0957K03488O4600
$$ 1485790 1699342 1651746 1454847 1391462 1465142 1270541 1549466 1560423 1763911 1828511
14596A828511l9719M0982m49182J56900K20637k00243Q7775L2764o2938N0780
$$ 1828511 1788792 1829774 1380592 1537492 1758129 1557886 1645661 1678425 1615487 1666267
14586A666267M4864j058j85336L09915q1502k33489M99276n1902j34653J61831
$$ 1666267 1711131 1710073 1524737 1834652 1753150 1519661 2018937 1967035 1832382 1994213
14576A994213K98368j42912j19461Q1291k3839J73763Q4429p1335n58789O72161
$$ 1994213 2292581 2149669 2030208 2111499 2087660 2261423 2345852 2274517 1715728 2387889
14566B387889k20514M28434j70431j23065J63881J90388l02838M06460k8044J71644
$$ 2387889 2167375 2595809 2425378 2302313 2466194 2656582 2353744 2760204 2732160 2903804
14556B903804J91858J71914k18058K11448K73214J139752N74017J531056M394374
$$ 2903804 3095662 3267576 3049518 3260966 3534180 4673932 5247949 6779005 11173379
14547A1173379J0514566K1894578j92139A9010261H452975D077422j627663m39421
$$ 11173379 21687945 43582523 43390384 19010261 8452975 4077422 2449759 2010338
14539B010338N9618k48648j30583J64504J34655k61906K05224L2132K01837l6424
$$ 2010338 2069956 1821308 1690725 1855229 1989884 1727978 1933202 1965334 2167171 2130747
14529B130747q2279j9981K06129J01166l07162L19093J51652j11718K64120k80268
$$ 2130747 2048468 2028487 2234616 2335782 2028620 2347713 2499365 2387647 2651767 2371499
14519B371499r7954M6661j8188K60563k72246K91300L9061j67750K14638j09712
$$ 2371499 2273545 2320206 2302018 2562581 2290335 2581635 2620696 2452946 2667584 2557872
14509B557872J7546K91331N6382J81170m48205K64010P6626j24933J78399J19485
$$ 2557872 2575418 2866749 2923131 3104301 2656096 2920106 2996732 2871799 3050198 3169683
14499C169683J0618L7383k92185R5937j34041R8363L72197j02441K6534J11935
$$ 3169683 3180301 3217684 2925499 3021436 2887395 2985758 3357955 3255514 3282048 3393983
14489C393983l4703k852O9958j9431J26778K70147l63988J51675J46890j07043
$$ 3393983 3359280 3356428 3426386 3406955 3533733 3803880 3439892 3591567 3738457 3631414
14479C631414L07031n06045O36748j71012J82707l91220K85650J19129k14808
$$ 3631414 3938445 3432400 4069148 3898136 4080843 3689623 3975273 4094402 3879594
14470C879594L64999j25847N07641n77682O15186j1960k11894L96511p1388k5186
$$ 3879594 4244593 4118746 4626387 4048705 4663891 4651931 4440037 4836548 4765160 4739974
14460D739974k85705J89689j48883N24078j75422J44185P1851k28206L45929J77756
$$ 4739974 4454269 4643958 4495075 5019153 4843731 4987916 5059767 4831561 5177490 5355246
14450E355246l53931O0312N9870n9654J85913L48378j71742L81515K3715O7323
$$ 5355246 5001315 5061627 5121497 5061843 5247756 5596134 5424392 5805907 5829622 5896945
14440E896945J2385L3744r6621O8730M14790o3295R5254k0074J7576R078K69599
$$ 5896945 5909330 5943074 5846453 5915183 6329973 6266678 6361932 6341858 6359434 6368512 6638111
14429F638111R1803j24065L03760l76156O20834j23193o5777K00706k1780M72248
$$ 6638111 6729914 6605849 6909609 6533453 7154287 7031094 6965317 7166023 7144243 7616491
14419G616491K46095j75586K40402N0634N23344j30570o4539L03509K16389l33292
$$ 7616491 7862586 7687000 7927402 7978036 8501380 8370810 8306271 8609780 8826169 8492877
14409H492877K53817K51034K49072o1566N67149m18600N36238J76929O7276J9882
$$ 8492877 8746694 8997728 9246800 9185234 9752383 9333783 9870021 10046950 10114226 10134108
14399A0134108K5945J83336M16869l36768P36337j58554M50603J46825J48963
$$ 10134108 10160053 10343389 10760258 10423490 11159827 11001273 11451876 11598701 11747664
14390A1747664J88591K90917K41243K10525L26986L90366p2574K47307P3762L21627
$$ 11747664 11936255 12227172 12468415 12678940 13005926 13396292 13323718 13571025 13644787 13966414
14380A3966414K23279N43357K53974o7287M77216J12086N80262J2579M98888Q4243
$$ 13966414 14189693 14733050 14987024 14919737 15396953 15509039 16089301 16101880 16600768 16685011
14370A6685011L59011N76665J37652L77200L64210M68041J44728M12708P22825
$$ 16685011 17044022 17620687 17758339 18135539 18499749 18967790 19112518 19525226 20248051
14361B0248051K51258K88841R73515K01232N46306L49479O83882O35309M02058
$$ 20248051 20499309 20788150 21761665 21962897 22509203 22858682 23542564 24177873 24579931
14352B4579931N90799P34453O21705P66732O64264O65954O08567P78858R17770
$$ 24579931 25170730 25905183 26526888 27293620 27957884 28623838 29232405 30011263 30929033
14343C0929033P66067Q21843J043217J173632O52253J134231O73868J629789R44796
$$ 30929033 31695100 32516943 33560160 34733792 35386045 36520276 37194144 38823933 39768729
14334C9768729J022144Q50840J639365J300836J462986J505032J572155J190314
$$ 39768729 40790873 41641713 43281078 44581914 46044900 47549932 49122087 50312401
14326E0312401J997548J546985J836083J999153K036033J876360K487840K246797
$$ 50312401 52309949 53856934 55693017 57692170 59728203 61604563 64092403 66339200
14318F6339200K017917L026189K652592K937692K955894L328309L609581L421366
$$ 66339200 68357117 71383306 74035898 76973590 79929484 83257793 86867374 90288740
14310I0288740M095528L571490M530000M023134N343513M926766N604852N547885
$$ 90288740 94384268 97955758 102485758 106508892 111852405 116779171 122384023 127931908
14302A27931908O286514O087903O777485P532509P398960Q325888Q785675Q927010
$$ 127931908 134218422 140306325 147083810 154616319 162015279 170341167 179126842 188053852
14294A88053852J0095455J0480645J0711703J1497758J1862159J2581635J3052212
$$ 188053852 198149307 208629952 219341655 230839413 242701572 255283207 268335419
14287B68335419J3157864J4057082J4160023J4630766J5135464J4835468J5088639
$$ 268335419 281493283 295550365 309710388 324341154 339476618 354312086 369400725
14280C69400725J4380585J3877677J3348942J2058122J0801893Q900943P234088
$$ 369400725 383781310 397658987 411007929 423066051 433867944 442768887 450002975
14273D50002975M440746J40553k598617k975129k815949n289244n169393q131309
$$ 450002975 454443721 454584274 451985657 449010528 446194579 440905335 435735942 427604633
14265D27604633j0942550j2552705j3906859j4288590j5062754j5435898j5874633
$$ 427604633 416662083 404109378 390202519 375913929 360851175 345415277 329540644
14258C29540644j5725197j5120188j4767322j4370766j2771409j2890427j2391688
$$ 329540644 313815447 298695259 283927937 269557171 256785762 243895335 231503647
14251B31503647j1818805j1330860j0475894r790345r471517r040854q083621
$$ 231503647 219684842 208353982 197878088 188087743 178616226 169575372 161491751
14244A61491751p442192p442763o910482o601756o095643n531071n193220m708124
$$ 161491751 154049559 146606796 139696314 133094558 126998915 121467844 116274624 111566500
14236A11566500n427324m216912m877865l899848l520689l072134l498672l607227
$$ 111566500 106139176 101922264 97044399 93144551 89623862 86551728 83053056 79445829
14228G9445829k844032l120426k782289k215155k633035k472707k225521j941594
$$ 79445829 76601797 73481371 70699082 68483927 65850892 63378185 61152664 59211070
14220E9211070j793428k103305k097034j689134j666978j498723j031033j286007
$$ 59211070 57417642 55314337 53217303 51528169 49861191 48362468 47331435 46045428
14212D6045428j838067j252201j246289j495751o69698r24588j007336j349321
$$ 46045428 44207361 42955160 41708871 40213120 39543422 38618834 37611498 36262177
14204C6262177j300437j028435o21536n27124n39912j063632r94574j029596q33368
$$ 36262177 34961740 33933305 33311769 32784645 32244733 31181101 30186527 29156931 28323563
14195B8323563m21319m62029p34622r50558o64206n30165m03875q47154l68496
$$ 28323563 27902244 27440215 26705593 25755035 25090829 24560664 24156789 23309635 22941139
14186B2941139o32302j14410q01672n41892m04333l11214p53271l59918r0242
$$ 22941139 22308837 22194427 21392755 20850863 20446530 20135316 19382045 19022127 18931885
14177A8931885n30143l16813n13910k21478n55132k29903j87970o80925r5456
$$ 18931885 18401742 18084929 17571019 17349541 16794409 16564506 16376536 15695611 15600155
14168A5600155n13956J32108n23170j82153l76119j79523m64177n7942m6189k08708
$$ 15600155 15086199 15218307 14695137 14512984 14136865 13957342 13493165 13435223 13389034 13180326
14158A3180326l21077l32821k85656j46216k70796j09712j20616k49974n12794
$$ 13180326 12859249 12526428 12240772 12094556 11823760 11714048 11593432 11343458 10830664
14149A0830664L47844m55295j25564l45682R2270K3016q05946L58822k97932Q8311
$$ 10830664 11178508 10723213 10597649 10251967 10344237 10367253 9561307 9920129 9622197 9710508
14139I710508k07823K16942o21070p9131j45274l2041j42463j95980J28415n01405
$$ 9710508 9502685 9719627 9098557 9019426 8874152 8842111 8699648 8503668 8632083 8130678
14129H130678Q1851k72407j53807J43928l25824l4065k03467k59614k0258l3628
$$ 8130678 8212529 7940122 7786315 7930243 7604419 7570354 7366887 7107273 7087015 7053387
14119G053387r9095L47947k56898l68573L8472j12325j86975J22135Q6924m07981
$$ 7053387 6954292 7302239 7045341 6676768 6715240 6602915 6415940 6538075 6624999 6217018
14109F217018k9511K58254m41465J5463r4190j87416K08003l39897J11038p5515
$$ 6217018 6187507 6445761 6004296 6019759 5925569 5738153 5946156 5606259 5717297 5641782
14099E641782q1163M0119j56275J03757n41983K81598l2674n2100J8870l82146
$$ 5641782 5560619 5600738 5444463 5548220 5006237 5287835 5255161 5203061 5221931 4839785
14089D839785K41616m28311o968K31480k75577Q5366k8778O0343r3730M8968J16353
$$ 4839785 5081401 4653090 4646122 4877602 4602025 4687391 4658613 4718956 4625226 4674194 4790547
14078D790547k21375l32892J84289J32098k87620j06964k84109J43623Q762j97875
$$ 4790547 4569172 4236280 4420569 4552667 4265047 4158083 3873974 4017597 4026359 3828484
14068C828484J129j2031K15137k0748j35946r6639k8541j43870L82331p222R910
$$ 3828484 3829613 3817582 4032719 4011971 3876025 3779386 3750845 3606975 3989306 3982084 3991994
14057C991994j39756J35611l13762k25012j09698O5269O4511l49274R2967J93449
$$ 3991994 3852238 3987849 3674087 3449075 3339377 3404646 3469157 3119883 3212850 3406299
14047C406299l65154L42647k48168k90579J78559J10346o5997k6303N6557k64887
$$ 3406299 3041145 3383792 3135624 2845045 3023604 3133950 3067953 3041650 3098207 2833320
14037B833320K68763m65081M30292j16136l29251J79904q0637J59622l22317J49119
$$ 2833320 3102083 2637002 3067294 2951158 2621907 2801811 2721174 2880796 2558479 2707598
14027B707598k11249L45025j12806N7838k2368M9472n17625K20435o8878P3137
$$ 2707598 2496349 2841374 2728568 2786406 2764038 2813510 2295885 2516320 2447442 2520579
14017B520579J96677l00340J67447m71675L81761R489k86386j55126J49409J66775
$$ 2520579 2717256 2416916 2584363 2112688 2494449 2503938 2217552 2062426 2211835 2378610
14007B378610r6179n55885M88225m66665L97541J54576k80499j65101j8664K81612
$$ 2378610 2282431 1726546 2214771 1748106 2145647 2300223 2019724 1854623 1835959 2117571
13997B117571n7280J59344n08276K00195l19762Q8641J67262M18381J065194K368645
$$ 2117571 2060291 2219635 1711359 1911554 1591792 1680433 1847695 2266076 3331270 5699915
13987E699915Q411455K2043028R800169k2875152A1400029m429581j548841j275291
$$ 5699915 14111370 36154398 45954567 23079415 11400029 6970448 5421607 4146316
13979D146316n36671n25793K44497m76282j9320l59875L9409K3426k31640J14382
$$ 4146316 3609645 3083852 3328349 2852067 2832747 2472872 2512281 2535707 2304067 2418449
13969B418449j06144l9612J03035n4422n02815J4150K05553p7385j25445M05234
$$ 2418449 2312305 2272693 2375728 2321306 1818491 1832641 2038194 1960809 1835364 2240598
13959B240598m06542K8671K70352N4811j84671k12530Q3555J04250k97382J57256
$$ 2240598 1834056 1862727 2133079 2187890 2003219 1790689 1874244 1978494 1681112 1838368
13949A838368l64110K22147M5516J23061m3574K06394k04192J10166m59499K96169
$$ 1838368 1474258 1696405 1741921 1864982 1821408 2027802 1823610 1933776 1474277 1770446
13939A770446j37980m6011M2340l19584L72262j41640K54187m4036k20100J03845
$$ 1770446 1632466 1586455 1628795 1309211 1681473 1539833 1794020 1749984 1529884 1633729
13929A633729j17487K58980j13061l26085o624O7910J91879q3457n8693k19069
$$ 1633729 1516242 1775222 1662161 1336076 1329452 1397362 1589241 1505784 1447091 1228022
13919A228022J30501j20300J3119k152l26488M92164j30471P0411r5382J49215
$$ 1228022 1358523 1238223 1251342 1249190 922702 1414866 1284395 1354806 1259424 1408639
13909A408639j7976K03831l40143l020j6871j64715M80952k97464j74276R1956
$$ 1408639 1390663 1594494 1254351 1251331 1234460 1069745 1550697 1253233 1078957 1170913
13899A170913m684J51061j68184l8926o1334K68151k68844J79457j92259R6580
$$ 1170913 1166229 1317290 1149106 1110180 1048846 1316997 1048153 1227610 1035351 1131931
13889A131931j31188P6849J45383k93206n5146J01913L15113M2019p1847j78169
$$ 1131931 1000743 1077592 1222975 929769 874623 976536 1291649 1333668 1261821 1083652
13879A083652K80671l53484j0202J94336p6546Q56j55959J07356K25327m50567
$$ 1083652 1364323 1010839 1000637 1194973 1118427 1119283 963324 1070680 1296007 845440
13869H45440L52471O8304k49631k86754M81493l01611J50782m20788L77616j78391
$$ 845440 1197911 1266215 1016584 729830 1211323 909712 1060494 639706 1017322 838931
13859H38931K42386n6139O2227p5487R3214p8607j69213J13892k62401M2937L52459
$$ 838931 1081317 1025178 1087405 1011918 1105132 1026525 857312 971204 708803 751740 1104199
13848A104199r2208q7909R692q8994J77094l8213j76085J64628p1802j51795R1959
$$ 1104199 1011991 924082 933774 844780 1021874 983661 807576 972204 900402 748607 840566
13837H40566k07334K33582k9351j04604j9550J26121k35509j88723M06371L75302
$$ 840566 633232 866814 837463 732859 713309 839430 603921 415198 821569 1196871
13827A196871j04186k81060j34454M63194n08365J98024J46428J05878J16565
$$ 1196871 1092685 811625 677171 1140365 632000 830024 976452 1082330 1198895
13818A198895m99347M56430k24545O2939j80293J39672m9553m3469J13304j59509
$$ 1198895 699548 1155978 931433 994372 814079 953751 904198 860729 974033 814524
13808H14524J00391D20963N95053l77081J50039J1670J6137k63724M39301j80178
$$ 814524 914915 420963 1016016 638935 788974 800644 816781 553057 992358 812180
13798H12180k6042j9630j47935l6314L80265j69460l1302K19721K4912j90714
$$ 812180 786138 766508 618573 582259 962524 793064 761762 981483 1006395 815681
13788H15681m548j04747l49393L13349J54359j65603k25145M63245m06693J87623
$$ 815681 811133 706386 356993 670342 824701 659098 433953 897198 490505 678128
13778F78128k28683n4058N5984R5169n4591J63062P9498O1034k2630j98061A30067
$$ 678128 449445 395387 451371 546540 491949 655011 734509 795543 772913 574852 130067
13766E56939K76579l27277K58166j85877j38645J99222K885K9651k36586o7048
$$ 556939 833518 506241 764407 578530 439885 639107 641992 671643 435057 368009
13756C68009J69566L66812l14903J75642l09970J67227J73346l27411m8749J24972
$$ 368009 537575 904387 589484 765126 455156 622383 795729 468318 419569 544541
13746E44541J5622j10287L81288k67782K52505j92695o7538K23882k25626K81113
$$ 544541 560163 449876 831164 563382 815887 623192 555654 779536 553910 835023
13736H35023j1669O089j62680R4316k06894J52666k47555J21778K147A72405O04440
$$ 835023 823354 829443 666763 761079 554185 706851 459296 581074 583221 172405 776845
13725G76845l39780K86642N7615l64769j02969L5477L12278q5519j24441J12178
$$ 776845 437065 723707 781322 416553 313584 349061 661339 575820 451379 563557
13715E63557n5860k140P0150j32976M4751j28557p0232l6295L61008j40498J62850
$$ 563557 507697 505557 575707 442731 487482 358925 288693 252398 613406 472908 635758
13704F35758k73368M24772j95459n2672k12037J6625O03740l91568k27562j54460
$$ 635758 362390 787162 591703 539031 326994 343619 947359 555791 328229 173769
13694A73769J89243K26782k02424K13046k2424n4382J28768O7671p9522k54992
$$ 173769 363012 589794 387370 600416 577992 523610 652378 720049 640527 385535
13684C85535R178p3665M9830J77692o446B54306L01066B70394L0598L88675j04829
$$ 385535 394713 321048 370878 548570 542124 254306 555372 270394 300992 689667 584838
13673E84838n005I4503N43276B99499L3476J03697K40259j57700A94436K03671
$$ 584838 579833 94503 637779 299499 332975 436672 676931 519231 194436 398107
13663C98107m3070q4531J74992N4406j31642j1101m0409L00908M7605k00987j21171
$$ 398107 355037 270506 445498 499904 368262 357161 316752 617660 665265 464278 343107
13652C43107K75530G44J86475o49K57457r7379K9353a7209B46764P6637K95688
$$ 343107 618637 744 187219 186570 444027 346648 376001 -17209 246764 323401 619089
13641F19089o4966j80208R5043q3196K18657j29198k1135Q4515j1901A88863L21932
$$ 619089 554123 373915 468958 385762 604419 475221 454086 538601 526700 188863 510795
13630E10795j19128J28881j38411L68218k51859B13528k9107J07783K7462j05556
$$ 510795 391667 520548 382137 750355 498496 213528 184421 292204 319666 214110
13620B14110L11382A23794B8189Q1268J75837K32105A56271g014B90709J43307
$$ 214110 525492 123794 28189 109457 285294 517399 156271 -7014 290709 434016
13610D34016G6442K34079m3623l3828J97825A76893O0077a12541C45027b832E45247
$$ 434016 76442 310521 266898 233070 430895 176893 236970 -112541 345027 -2832 545247
13598D07928j71004n8997K57762p8086o4837d6362B70405K8864J57443I1057K91335
$$ 407928 236924 177927 435689 357603 292766 -46362 270405 299269 456712 91057 382392
13587C82392K86145j36496k07266m0061R1221j13569Q5032A49905N2983J8057
$$ 382392 668537 532041 324775 284714 375935 262366 347398 149905 202888 220945
13577B20945L28802q6192j34737J9413J3996f979D56130a72609B6569K41161J44156
$$ 220945 549747 463555 328818 348231 362227 -6979 456130 -172609 26569 267730 411886
13566D11886k03271L9118K36726q1202j43746q5372j7548E8682J15063J6064L98331
$$ 411886 208615 247733 484459 403257 259511 174139 156591 58682 173745 189809 588140
13555E88140k63663j05161K42776j66652j04943N9914r1750K74838M6058A93414
$$ 588140 324477 219316 462092 295440 190497 250411 158661 433499 479557 193414
13544B35978H0831L818a83989D65998n6488A55249p7192J40803J73287j00744
$$ 235978 80831 84649 -183989 465998 409510 155249 78057 218860 392147 291403
13534B91403a9251C43441L0558a35871C18245A14241J18325P8642Q5837N6121
$$ 291403 -19251 343441 373999 -135871 318245 114241 232566 311208 397045 453166
13524D53166j67822k9682p983K39947A90137r3407J86987L09483j31461o7760
$$ 453166 285344 255662 247679 487626 190137 96730 283717 593200 461739 393979
13514C93979j8964n0379L5870J48315H1603C7106c0127B1290c5175B80556A07934
$$ 393979 375015 324636 360506 508821 81603 37106 -30127 21290 -35175 280556 107934
13502E24800I3824J34615K45821j86974a1659A96173J37858G3202r793K53825
$$ 524800 93824 228439 474260 287286 -11659 196173 334031 73202 63409 317234
13492C17234l0124J277R5003a70151F36101G2730L00725J67223B31911n6746k8188
$$ 317234 287110 288387 383390 -170151 636101 72730 373455 540678 231911 175165 146977
13481A46977N7872j8285m0655J93564A03315J06633K58775A02080L38480J90952
$$ 146977 204849 186564 145909 339473 103315 209948 468723 102080 440560 631512
13471F31512A02648F123J03796K0421L19147A35775J99779j22746J80292A07057
$$ 631512 102648 6123 109919 130340 449487 135775 335554 212808 393100 107057
13460A18625R6144b4717n8885B10423J00503n1146M3944K28820A55312E7775M06939
$$ 118625 214769 -24717 -83602 210423 310926 259780 303724 532544 155312 57775 464714
13449D64714j84298j40056R5759F4887a40866B97836C8140M06023j31128J69022
$$ 464714 280416 140360 236119 64887 -140866 297836 38140 444163 313035 482057
13439D82057A12737L91038B22896l0800J62285j54248D3043L48069f5557D31922
$$ 482057 112737 503775 222896 192096 354381 200133 43043 391112 -65557 431922
13428a24953B94076A16953M81847B57295J49095A87597d4044B23401m0080m7907
$$ -124953 294076 116953 598800 257295 406390 187597 -44044 223401 183321 135414
13418A35414a82468E72869A32768K29312J10828a75564B5315K52240k2560G1043
$$ 135414 -182468 572869 132768 362080 472908 -175564 25315 277555 254995 71043
13407d8205j4659m3642B49104L42643B40435B225K18711O5743J00482i6486A30882
$$ -48205 -62864 -106506 249104 591747 240435 2225 220936 286679 387161 -96486 130882
13395B52300e0498G1410O5484J02605c6878n6579A78955o011M4349N6851f4660
$$ 252300 -50498 71410 136894 239499 -36878 -93457 178955 172944 217293 274144 -64660
13383A85460G5543L86087a29548B77363p347d0267B57131k5014k7695m9308L97038
$$ 185460 75543 461630 -129548 277363 270016 -40267 257131 232117 204422 155114 552152
13372E52152A97038r933K01771j79640R5773k0517j10775n2014m9735K67713G5603
$$ 552152 197038 187105 388876 209236 305009 284492 173717 121703 71968 339681 75603
13360B56620o2891D8910O4755P6456J16356G2569J91669H7420m3378K2420P1916
$$ 256620 193729 48910 113665 190121 306477 72569 264238 87420 44042 66462 138378
13349A38378L318O7879M069O1193p6443D2665J23654J43915j09548F1163L32932
$$ 138378 141696 209575 213644 274837 198394 42665 166319 310234 200686 61163 394095
13338C94095j63162J69833q9961A0717K21004q9891A673L95436N516F1571L9876
$$ 394095 230933 400766 310805 10717 231721 141830 1673 397109 402625 61571 101447
13327A01447a2694C09645K31734k08734n1917o6735D7011J75144I6332M1901L03523
$$ 101447 -12694 309645 541379 332645 280728 213993 47011 222155 96332 138233 441756
13316D41756j25358l0959j5906d9135E7729J44524K79159A46860K07476I4113
$$ 441756 316398 285439 269533 -49135 57729 202253 481412 146860 354336 94113
13305I6944J93732a35392L9866B70774q0210N6423r3985F5159K65570L3949a09809
$$ 96944 290676 -135392 -95526 270774 190564 246987 153002 65159 330729 364678 -109809
13293i8836F2292K96517b72047J20692q5028B29901d5219C8564K73017F476a11892
$$ -98836 62292 358809 -272047 -151355 -236383 229901 -45219 38564 311581 6476 -111892
13281g2708A03500d9735j20986P0999D13980D9765J27514D923O3652h3815C89278
$$ -72708 103500 -49735 -170721 -99722 413980 49765 177279 4923 68575 -83815 389278
13269a33324A85980q4438f8050D17689A79140J91245a77249B81161o6364i3171
$$ -133324 185980 101542 -68050 417689 179140 370385 -177249 281161 214797 -93171
13258A47845L8369I807L12134A53901B3610K90912j41461m8768N4646L9631m9613
$$ 147845 186214 9807 321941 153901 23610 314522 173061 124293 178939 218570 168957
13247A68957k7013d3850A50499B9499J74729o9472K1342c0300A69694a4648B87574
$$ 168957 141944 -43850 150499 29499 204228 134756 156098 -30300 169694 -14648 287574
13235B45479b375l09391C45940a09685A61446i0068L173a063B52386E9611d8379
$$ 245479 -2375 -311766 345940 -109685 161446 -90068 -86895 -1063 252386 59611 -48379
13223b00385b4314A36972j6719J70991h2961A53941n5585K36544j32293b09279
$$ -200385 -24314 136972 120253 291244 -82961 153941 98356 334900 202607 -209279
13212E7729L742J9901A762c6673A03170e9434A11492f2174o3176E8164c2930A10939
$$ 57729 61471 81372 1762 -36673 103170 -59434 111492 -62174 -125350 58164 -32930 110939
13199C80398a5785F3549L2581Q4549G7424n311D210f3979A2806J29756i0603A14635
$$ 380398 -15785 63549 96130 180679 77424 72113 4210 -63979 12806 142562 -90603 114635
13186B31191r1223K84930C7571A4680a52281B51699c7630B5161M39877k20787
$$ 231191 139968 424898 37571 14680 -152281 251699 -37630 25161 465038 244251
13176B44251f784j05573A60996l7049Q6262G081a58393K0609A1619O3693N7045
$$ 244251 -6784 -112357 160996 123947 210209 7081 -158393 -137784 11619 75312 132357
13165A32357L22559k3048b68235C23736A38347K34353I626l206K16497a12247
$$ 132357 454916 431868 -268235 323736 138347 372700 9626 6420 222917 -112247
13154a14413d2097D07105a98679A62669c04349f52A46422b47284a7460j49692
$$ -114413 -42097 407105 -198679 162669 -304349 -652 146422 -247284 -17460 -167152
13144a67152H2340A3299a11537B20394e6798A22585c1024k33591i5898b24D7531
$$ -167152 82340 13299 -111537 220394 -56798 122585 -31024 -264615 -95898 -224 47531
13132I8681L9666i2570F9027L55930j09095a51418H2633a30244A06264J9002q486
$$ 98681 138347 -92570 69027 424957 315862 -151418 82633 -130244 106264 125266 116780
13121A16780O512C2791m034f8249C7364a5852C02228A20503j167K07412P3613
$$ 116780 123292 32791 28757 -68249 37364 -15852 302228 120503 119336 326748 400361
13110D00361p9547j04001A3996N8441f3850B92745J89808k36820f640C43053G0358
$$ 400361 320814 216813 13996 72437 -63850 292745 482553 245733 -6640 343053 70358
13098a90367P1066j38884C66001A39749C1291K23325g1857K9410B04477d2846
$$ -190367 -119301 -258185 366001 139749 31291 254616 -71857 -42447 204477 -42846
13087f4250A55713a10192B88827j26271a00359a7222B72261H8775J2390a74919
$$ -64250 155713 -110192 288827 162556 -100359 -17222 272261 88775 101165 -174919
13076a99784C47996E5362K29171a31497H7013C6645R1382n9470J05789h1075D62234
$$ -199784 347996 55362 284533 -131497 87013 36645 128027 68557 174346 -81075 462234
13064G2912h916n4964B0611d4832n6587A7128J15264a11479A14874L8591P3385
$$ 72912 -8916 -63880 20611 -44832 -101419 17128 132392 -111479 114874 153465 226850
13053B26850a76106C26618B5146R5822M8269b81646P7627J7607E3464L63843e1246
$$ 226850 -176106 326618 25146 120968 169237 -281646 -204019 -186412 53464 417307 -51246
13041A43168m4413b93340B89998E9802O4673N868K50081A78002O5007j19601m4139
$$ 143168 98755 -293340 289998 59802 124475 130343 380424 178002 243009 123408 79269
13030G9269K83263I0367J7052K18371j38445a84654a313C21377p2868I889c6846
$$ 79269 362532 90367 107419 325790 187345 -184654 -1313 321377 248509 9889 -36846
13018A35292P3972L3531R7129c2699j29528E0933L71020E3996b8976A83281Q7955
$$ 135292 209264 242795 339924 -32699 -162227 50933 421953 53996 -28976 183281 271236
13007B71236G0074A6081a1629B8926K17218P80f0251J6031J8504C53572A36015
$$ 271236 70074 16081 -11629 28926 246144 246924 -60251 -44220 -25716 353572 136015
12995A80809E5463J56816B0495d3868j1089j33925A71126b21684I8863C458J75759
$$ 180809 55463 212279 20495 -43868 -54957 -188882 171126 -221684 98863 3458 179217
12984A79217i7972j47167B25346E4917a61354E0856M84241a22382D6216J55580
$$ 179217 -97972 -245139 225346 54917 -161354 50856 535097 -122382 46216 201796
12974B01796g6351j33862A30015a6669I1c33720C27681j06491R9227A8513e6328
$$ 201796 -76351 -210213 130015 -16669 91 -333720 327681 221190 320417 18513 -56328
12962A46066O0477a87017M5212L6875B87353I8610A536i3771A94781F7333J71492
$$ 146066 206543 -187017 -141805 -104930 287353 98610 1536 -93771 194781 67333 238825
12951B38825B0416L2336k5897J34055A6113a65512M9993k2378f8402E0815J652
$$ 238825 20416 52752 26855 160910 16113 -165512 -115519 -137897 -68402 50815 52467
12940E2467J88927i5959H4250e3209B4206c5505j01918b1520B36074B0300P1132
$$ 52467 241394 -95959 84250 -53209 24206 -35505 -137423 -21520 236074 20300 91432
12929I1432c9692k4297A87041c00429A52307a75312j32738D6069b47398G953b48469
$$ 91432 -39692 -63989 187041 -300429 152307 -175312 -308050 46069 -247398 7953 -248469
12917a4986n6455F9260J0977k6793a56023B30069q9196h4271L3355F6794J31476
$$ -14986 -71441 69260 80237 53444 -156023 230069 140873 -84271 -50916 66794 198270
12906A98270A4086b60526B60889b15405f3390a1418j30359k21742a02238A33528
$$ 198270 14086 -260526 260889 -215405 -63390 -11418 -141777 -363519 -102238 133528
12895A97509E8454K07718I7154J67290a76609p3525H4370B0885J62716g5198c4813
$$ 197509 58454 266172 97154 264444 -176609 -250134 84370 20885 183601 -75198 -34813
12883c42596c1102r597n8612j13806P5174a5172C52550b15991g1637A20292a90212
$$ -342596 -31102 -40699 -99311 -213117 -137943 -15172 352550 -215991 -71637 120292 -190212
12871b4936A59742R7862N5460j41050N5489j03926l6901m1080K66217I3658d4869
$$ -24936 159742 257604 313064 172014 227503 123577 86676 45596 311813 93658 -44869
12859a76773a7541B2958a87158k2288A52511I588J83675a26287M8528A32035A3924
$$ -176773 -17541 22958 -187158 -209446 152511 9588 193263 -126287 -77759 132035 13924
12847H8209J04236L6876b32132a07829F7587J02229f9436I5103C6463a93646h9408
$$ 88209 192445 229321 -232132 -107829 67587 169816 -69436 95103 36463 -193646 -89408
12835B45947D8305K37701j23732g0077B20034a84370L8173N3046H634a59687r4000
$$ 245947 48305 286006 162274 -70077 220034 -184370 -146197 -93151 8634 -159687 -253687
12824b53687i5415A16381b16444j26791d6227k44983J6908p6570D6607J87718
$$ -253687 -95415 116381 -216444 -343235 -46227 -291210 -274302 -350872 46607 234325
12814B34325J1533G8773N27344d16388g4793k56910A76842a42882N5801H1367
$$ 234325 245858 78773 606117 -416388 -74793 -331703 176842 -142882 -87081 81367
12803a5968j4024A59381P8413e6063B21529n1221l3045D4823P9147a57483l19511
$$ -15968 -29992 159381 237794 -56063 221529 170308 137263 44823 123970 -157483 -476994
12792d76994g451l4999Q878D45931b74621A84693b7759B40089a93204L0968A25455
$$ -476994 -7451 -42450 -33572 445931 -274621 184693 -27759 240089 -193204 -162236 125455
12780c69807A33222J6157a34403p9971a757C11514c5614A47498K14425B0722L69111
$$ -369807 133222 149379 -134403 -214374 -1757 311514 -35614 147498 361923 20722 389833
12769C89833f8505j61280h9585j06027D05242a64358C04958g1943C28823J3055
$$ 389833 -68505 -229785 -89585 -195612 405242 -164358 304958 -71943 328823 341878
12759C41878G3258d8010D5355J37503a02841G6609N3561a42612D2876j890M41249
$$ 341878 73258 -48010 45355 182858 -102841 76609 130170 -142612 42876 40986 482235
12748D82235A01129d0202B1393h8061B81663h7822L0142C14595h9861j28183A20655
$$ 482235 101129 -40202 21393 -88061 281663 -87822 -57680 314595 -89861 -218044 120655
12736B68907m4283g2511j9677c7702C93285G1592a97108B17371j7063G7682N3185
$$ 268907 224624 -72511 -92188 -37702 393285 71592 -197108 217371 200308 77682 130867
12725A30867J35251A16594O6040c7258l5190B51512Q6285f381n248C8720a05171
$$ 130867 266118 116594 182634 -37258 -72448 251512 337797 -6381 -11629 38720 -105171
12713C56836h5553o0452A29230a61683C55667d8842n4055H5264n745J86482L7680
$$ 356836 -85553 -146005 129230 -161683 355667 -48842 -102897 85264 79519 266001 303681
12702C03681A32476k0715P0941n2764A7654n782g0757H0570b24017A41118P9582
$$ 303681 132476 111761 182702 129938 17654 11872 -70757 80570 -224017 141118 220700
12691B20700F5064K3267R2540p7869a52035a9026G5129B6405J11372K03540i7489
$$ 220700 65064 88331 180871 103002 -152035 -19026 75129 26405 137777 341317 -97489
12679B13888A9088L95820M1276l8862b6234B0953J52977a18927G0264B6273L4817
$$ 213888 19088 414908 456184 417322 -26234 20953 173930 -118927 70264 26273 61090
12668F1090J02962q1184c0296Q934B30560E3954a64803a1233p2924A96028q8927
$$ 61090 164052 82868 -30296 -21362 230560 53954 -164803 -11233 -84157 196028 107101
12657A07101J13141J56522D6560b7985B73964f2051C31594I8742J2761d5537j8538
$$ 107101 220242 376764 46560 -27985 273964 -62051 331594 98742 111503 -45537 -64075
12646f4075j44434g4556n5121B1583c06410j25475D7532b06136A51535A699J2695
$$ -64075 -208509 -74556 -129677 21583 -306410 -431885 47532 -206136 151535 1699 14394
12635A4394b5753A24060M9967a99904B25066J96304j77407l2616a0576H7010c9967
$$ 14394 -25753 124060 174027 -199904 225066 421370 243963 211347 -10576 87010 -39967
12623H8716J61496O863g3832A25259o943h3064m6566L5488D84630a5723I599P3044
$$ 88716 250212 257075 -73832 125259 118316 -83064 -129630 -94142 484630 -15723 9599 82643
12611H2643b40760C41139c48042A75160J06472r1440a46088B21090J9065j05404
$$ 82643 -240760 341139 -348042 175160 281632 190192 -146088 221090 240155 134751
12601A34751b0640k04337H4546J00439N1614k111A08478m391f3359B55809l254
$$ 134751 -20640 -224977 84546 184985 236599 234488 108478 104087 -63359 255809 252555
12590B52555e5723G5254M0213N7940p4019a02281j36105c0897D318L61528p5613
$$ 252555 -55723 75254 115467 173407 99388 -102281 -238386 -30897 4318 365846 290233
12579B90233e1000A577c887j98492B63675B0328P6385a1703A7139b21921c3548
$$ 290233 -51000 1577 -3887 -202379 263675 20328 96713 -11703 17139 -221921 -33548
12567A6472i499q5649A70821K0367F3251F492K93893F1439K92747A31929e4937
$$ 16472 -9499 -95148 170821 191188 63251 6492 300385 61439 354186 131929 -54937
12555b866j98765h3337j60759A08067J49264a9886c980E0104L970L71926A56251
$$ -2866 -201631 -83337 -244096 108067 257331 -19886 -3980 50104 54074 426000 156251
12543A83981c55777e428A1445O7039C8965a3222k82970i1103b1966A0640a61405
$$ 183981 -355777 -5428 11445 78484 38965 -13222 -296192 -91103 -21966 10640 -161405
12531a3165k371A10069C4081K93443a47297I326b65939a18204A22631k2010R7045
$$ -13165 -15536 110069 34081 327524 -147297 9326 -265939 -118204 122631 100621 197666
12520A97666M5695b42677m2829e2703C24485a30707k5105B0776J9526a48578A01396
$$ 197666 243361 -242677 -285506 -52703 324485 -130707 -155812 20776 40302 -148578 101396
12508e3134e59D3563B0969a70273l6172N004g9060l06411B72596c25043f9920
$$ -53134 -559 43563 20969 -170273 -206445 -201441 -79060 -385471 272596 -325043 -69920
12496d4764A24707J75600m9950e878A94564a19766e7349A36510B2875J63784e0147
$$ -44764 124707 300307 250357 -5878 194564 -119766 -57349 136510 22875 186659 -50147
12484c6007p6165F176M6364J65699a16664d5571A94905a8795o1643A74568J22887
$$ -36007 -112172 6176 52540 218239 -116664 -45571 194905 -18795 -80438 174568 297455
12473B97455b55972i0295B02745c5654A6158a4045k41069B2221J57410a58706
$$ 297455 -255972 -90295 202745 -35654 16158 -14045 -255114 22221 179631 -158706
12462b09682A10257c6102o093j19149I0659C054M8157Q0271d7320j88894B41457
$$ -209682 110257 -36102 -42195 -161344 90659 3054 51211 131482 -47320 -236214 241457
12450D12505b9362E5943f1097A2961Q7734a7044O317B27194o2066P8316h3882
$$ 412505 -29362 55943 -61097 12961 100695 -17044 -10727 227194 165128 243444 -83882
12438b2023H2479J58010A08425f2003I7701e5245r2851A66429F1966a18489H344
$$ -22023 82479 240489 108425 -62003 97701 -55245 -148096 166429 61966 -118489 8344
12426a24100D0958a52495G3666a24597B19289h218C42299l9550D6072J47617C1112
$$ -124100 40958 -152495 73666 -124597 219289 -8218 342299 302749 46072 193689 31112
12414b20440a00882r6511F3680e9438J8738A839g5901a0696I078f4715p2372A26513
$$ -220440 -100882 -197393 63680 -59438 -40700 1839 -75901 -10696 9078 -64715 -137087 126513
12401h2047n8427a5221k10560P3436B7662J04473e4741H8654b79235J8453E793
$$ -82047 -140474 -15221 -225781 -152345 27662 132135 -54741 88654 -279235 -260782 5793
12389A64468a78856B13912B6887J592K25777A6797b61585i207A11346B3491i09
$$ 164468 -178856 213912 26887 28479 254256 16797 -261585 -9207 111346 23491 -909
12377b78902b0267D2901a55457k1018d3791E928J40952K14204i7344D7463O8893
$$ -278902 -20267 42901 -155457 -176475 -43791 5928 146880 361084 -97344 47463 116356
12366A16356M8787f0860B6837K17842o9092i7880j46075D9462e5088j25763B5996
$$ 116356 165143 -60860 26837 244679 175587 -97880 -243955 49462 -55088 -180851 25996
12354b0474H6050J58693A13114g4096H8368j6755L0364a2730q4438p3465L1897
$$ -20474 86050 244743 113114 -74096 88368 71613 101977 -12730 -97168 -170633 -138736
12343a38736B0985a82867L7742E7163J30853b8967A51340a33004F4010b10120
$$ -138736 20985 -182867 -145125 57163 188016 -28967 151340 -133004 64010 -210120
12332f8116A04976J990D4347b01013B2746l907b39629F258K87604b30595A80319
$$ -68116 104976 106966 44347 -201013 22746 18839 -239629 6258 293862 -230595 180319
12320A85297a71040C02899B5156m523b63812E4163K26685a81757A0437J00157
$$ 185297 -171040 302899 25156 20633 -263812 54163 280848 -181757 10437 110594
12310A10594d8810m37702a41687o2892F6797J5095K59458E9236a48801A0472R0941
$$ 110594 -48810 -486512 -141687 -204579 66797 81892 341350 59236 -148801 10472 101413
12299A01413a12296C813g7406A48864Q2959a3110A29170A1100O1070J94165A8877
$$ 101413 -112296 3813 -77406 148864 231823 -13110 129170 11100 72170 266335 18877
12287b99286B34493p2791L1467a77393A63607e0953B42701i6950A12839a82994
$$ -299286 234493 161702 193169 -177393 163607 -50953 242701 -96950 112839 -182994
12276i2383h059C00061A36720J98513C9936L0312R4877K00340j07190q2285J56314
$$ -92383 -8059 300061 136720 335233 39936 70248 165125 365465 258275 175990 332304
12265C32304a81907B48564b24228B6308J11078D7901L21037A58137g2423J6366
$$ 332304 -181907 248564 -224228 26308 137386 47901 368938 158137 -72423 -56057
12255e6057C31089o942b02415B44032b3920B25285e7147D941J38056J40423b98018
$$ -56057 331089 324147 -202415 244032 -23920 225285 -57147 4941 142997 283420 -298018
12243a72946B29328j3657a6838I3961C8747P2768b14198H4320C5369K34731b1040
$$ -172946 229328 215671 -16838 93961 38747 111515 -214198 84320 35369 270100 -21040
12231D98654b99462B95262f1853C37901A49833J13178a20227B09889k8344K52415
$$ 498654 -299462 295262 -61853 337901 149833 263011 -120227 209889 181545 433960
12221D33960j01454N0182r4758k7681j01151B7364L4387M344K86905L1560l4695
$$ 433960 332506 382688 287930 260249 159098 27364 61751 66095 353000 384560 349865
12210C49865E8446c23195I6709d8574A21501b13411A15808N2798K6228J23031
$$ 349865 58446 -323195 96709 -48574 121501 -213411 115808 168606 194834 317865
12200C17865o4682b3747A16055k9913J07346L81414j5358A27327J29132A22938
$$ 317865 253183 -23747 116055 86142 193488 574902 559544 127327 256459 122938
12189f3846k8086b5228e667D27567A34212K6300h4073B18290c4511c833C13636
$$ -63846 -91932 -25228 -5667 427567 134212 160512 -84073 218290 -34511 -3833 313636
12177a5712A31182K13384r2560q0027Q7438r1864o978n2540l9084n745O8726Q235
$$ -15712 131182 344566 252006 171979 259417 167553 160575 108035 68951 63206 131932 140167
12165A40167J43947b463H7106N8043b60724B71632G2893B9780M19109b3769B02642
$$ 140167 284114 -2463 87106 145149 -260724 271632 72893 29780 448889 -23769 202642
12153I9015m5019J81737n1373L17195i9012B04956l4019Q3417H1152a62559B33177
$$ 99015 53996 235733 184360 501555 -99012 204956 170937 254354 81152 -162559 233177
12141A25766d1046j17791D6716M7399b58440e0878J2125B33227b56335A30593
$$ 125766 -41046 -158837 46716 94115 -258440 -50878 -38753 233227 -256335 130593
12130a55392C0910K02528A515a57340l0382C4761J3589a3037j58615A85946a5638
$$ -155392 30910 233438 1515 -157340 -187722 34761 48350 -13037 -171652 185946 -15638
12118D2080J42940a28278j56k1625k0975j5421o4800G9488b10465I1536a45554
$$ 42080 185020 -128278 -128434 -150059 -171034 -186455 -251255 79488 -210465 91536 -145554
12106a7093j06063C00112B6888f9926j48462j96090E0586J24135k2569J90652
$$ -17093 -123156 300112 26888 -69926 -218388 -414478 50586 174721 152152 342804
12096C42804a25374B17510D8919O9399g2159b8627j14810a2450m91484B05377
$$ 342804 -125374 217510 48919 118318 -72159 -28627 -143437 -12450 -503934 205377
12085C14103a8785B51915a52705k0410B0038J30971N22948N73717J129272A048435
$$ 314103 -18785 251915 -152705 -173115 20038 151009 673957 1247674 2376946 1048435
12074C85842A18424D4447b5770q039k84253a33399L0385B624a46661c8303B1499
$$ 385842 118424 44447 -25770 -33809 -318062 -133399 -103014 2624 -146661 -38303 21499
12062A17869A8315c4178l74865c0827A7068a87123A9608P0960j341a175I4531
$$ 117869 18315 -34178 -409043 -30827 17068 -187123 19608 90568 89227 -1175 94531
12050e7701C48691A05523N6007M5492J04817g7313B81014G6381d1463A37217a8178
$$ -57701 348691 105523 161530 207022 311839 -77313 281014 76381 -41463 137217 -18178
12038a90887j9823A19623c33179I492J9250b64119C18853b73886A85466n2150
$$ -190887 -210710 119623 -333179 9492 28742 -264119 318853 -273886 185466 133316
12028A33316b79315e0231B40499H8323e8767K2163m3765C9305K22584a15735A18026
$$ 133316 -279315 -50231 240499 88323 -58767 -36604 -80369 39305 261889 -115735 118026
12016f5559j39620G2252O3743g3355j27818A90059L49731a99932M6644B08425
$$ -65559 -205179 72252 135995 -73355 -201173 190059 539790 -199932 -153288 208425
12005C63590A00235J06675I4198K81627F4598J63332h6029n6424H5520O0625a08358
$$ 363590 100235 206910 94198 375825 64598 227930 -86029 -142453 85520 146145 -108358
11993E0468A4776b4444j82590B70932A31035i5535p9908G322c23972R6736l3389
$$ 50468 14776 -24444 -207034 270932 131035 -95535 -175443 7322 -323972 -227236 -260625
11982b60625H1456a3708j60776j05635A44097a68875B77398c64327d9093o3010
$$ -260625 81456 -13708 -174484 -280119 144097 -168875 277398 -364327 -49093 -112103
11972a12103j68251A7849R106J59094J6662a28940D43483h0186p7122L8810j70449
$$ -112103 -280354 17849 26955 186049 202711 -128940 443483 -80186 -157308 -118498 -288947
11961b88947a42971J7720A10978A800a45663a903j35790k27162B66723a92591
$$ -288947 -142971 -125251 110978 1800 -145663 -1903 -137693 -364855 266723 -192591
11950C13355a16932A75740A8332J36388a4502k9394A21700b2283k7868A36967
$$ 313355 -116932 175740 18332 154720 -14502 -43896 121700 -22283 -50151 136967
11939B13305H5136i1266A13529c8692r3488q0135B41370g4856A71608d2547A27892
$$ 213305 85136 -91266 113529 -38692 -132180 -212315 241370 -74856 171608 -42547 127892
11927A55585J1940B2030O6448g4195L3452B0915G929a8948k00093a00648k18193
$$ 155585 167525 22030 88478 -74195 -40743 20915 7929 -18948 -219041 -100648 -318841
11916c18841A5292J6501K26294G7145f9797A88165B9019a72607H0519a01116k62316
$$ -318841 15292 31793 258087 77145 -69797 188165 29019 -172607 80519 -101116 -363432
11905c63432a25710j1563A2460J96785J16205A1189N2337a78345j55436D12808
$$ -363432 -125710 -137273 12460 209245 325450 11189 63526 -178345 -333781 412808
11894A29834a31003A53058a85884P3293k92835c4292n4036D2127b06097A6667
$$ 129834 -131003 153058 -185884 -112591 -405426 -34292 -88328 42127 -206097 16667
11883a38047B1779Q6682c39915a4915l51068H202i1941H757J55950a93318k8090
$$ -138047 21779 108461 -339915 -14915 -365983 8202 -91941 8757 164707 -193318 -221408
11872b21408A95736a38101D7748c11582B44441b14039a02647A02647a35849j69566
$$ -221408 195736 -138101 47748 -311582 244441 -214039 -102647 102647 -135849 -305415
11862c05415C307i4033A39778a25785l5399F4014f0152A70487b75962a4743D3036
$$ -305415 3307 -94033 139778 -125785 -161184 64014 -60152 170487 -275962 -14743 43036
11850G9372c73504A10465i563F9659a80320A15446h8347A89936c9199k52950A72821
$$ 79372 -373504 110465 -9563 69659 -180320 115446 -88347 189936 -39199 -292149 172821
11838b09591l2179N7790C0668a39149L4177r4086B26590b20071g4953H3382C0039
$$ -209591 -241770 -183980 30668 -139149 -104972 -199058 226590 -220071 -74953 83382 30039
11826A05087a0122j82312D7592L2888N4462n9675N2123M5460c3322A18443a06205
$$ 105087 -10122 -192434 47592 80480 134942 75267 127390 172850 -33322 118443 -106205
11814A16040C6449L7360B7168a80570a0530j40551j7089N6931A7106b28037A54560
$$ 116040 36449 73809 27168 -180570 -10530 -151081 -168170 -111239 17106 -228037 154560
11802E9465c1330D6406i3912J5765D1496Q2456C0176N4269d6766C151Q0177f5728
$$ 59465 -31330 46406 -93912 -78147 41496 123952 30176 84445 -46766 3151 83328 -65728
11789E3128K02008b37181i1620j07443Q991G1331R703C6419a61116A11069a56544
$$ 53128 255136 -237181 -91620 -199063 -190072 71331 81034 36419 -161116 111069 -156544
11777A9979c2135A16773b76069A42904F26d7918j79114F6069K02718b01786p2883
$$ 19979 -32135 116773 -276069 142904 626 -47918 -227032 66069 268787 -201786 -274669
11766b74669D4301L0425I661a7811l30548J66171a4525j20550j69656J02783J286
$$ -274669 44301 74726 9661 -17811 -348359 -182188 -14525 -135075 -304731 -201948 -200662
11755b00662d9925A69949B7204J46817a13353B13335a56100A91248f537D228d17954
$$ -200662 -49925 169949 27204 174021 -113353 213335 -156100 191248 -6537 4228 -417954
11743h8170R457A30358C7840A4118J47058K1858a25610A21342b48860A61113n0439
$$ -88170 -78713 130358 37840 14118 161176 183034 -125610 121342 -248860 161113 110674
11732A10674J73438A8025a42703A2342c47218B44741E0054J65398i7350n3425
$$ 110674 284112 18025 -142703 12342 -347218 244741 50054 215452 -97350 -150775
11722a50775A2952g8132r5173H6541b03582E7042a36844k50355a7795B9725Q5605
$$ -150775 12952 -78132 -173305 86541 -203582 57042 -136844 -387199 -17795 29725 115330
11711A15330K68790a06602A98955n6020i8147k65100A35572J23595a05198B15062
$$ 115330 384120 -106602 198955 142935 -98147 -363247 135572 259167 -105198 215062
11700B292a43109a5720F4315a90564c2776F6732g2501K2427B37356a2093A09439
$$ 2292 -143109 -15720 64315 -190564 -32776 66732 -72501 -50074 237356 -12093 109439
11688D7691J77070c0208A91897J67914h1572A8261J51551c3796j20999B25764
$$ 47691 224761 -30208 191897 359811 -81572 18261 169812 -33796 -154795 225764
11677B8514A0172J24636J08797a30275m749Q857j69061a4885k69565I5729g8737
$$ 28514 10172 134808 243605 -130275 -135024 -126167 -295228 -14885 -284450 95729 -78737
11665h8697D2923H054Q946c37479B6193L645f2944B97369H1704a97643A63665
$$ -88697 42923 8054 17000 -337479 26193 29838 -62944 297369 81704 -197643 163665
11653B93847B6662L50832H3920a18709K1376C35187a26642A66801c1656A05977
$$ 293847 26662 377494 83920 -118709 -97333 335187 -126642 166801 -31656 105977
11642B66607A05408A1510d2274C10879D5766a02114c7257q2096j73646C4133i6629
$$ 266607 105408 11510 -42274 310879 45766 -102114 -37257 -119353 -292999 34133 -96629
11630D6450O4886n4319J20578J45954C1493J92679o663H352O7881R7493c01598
$$ 46450 111336 57017 177595 323549 31493 224172 217509 8352 76233 173726 -301598
11618e5017j86623i3172J4461A40678L82284A54919i1215A4097L06579D097a90773
$$ -55017 -241640 -93172 -78711 140678 522962 154919 -91215 14097 320676 4097 -190773
11606C9838d4194C56991b15985a05976b9913n7425A95548b72982A48301a48873
$$ 39838 -44194 356991 -215985 -105976 -29913 -87338 195548 -272982 148301 -148873
11595A80056b0659C03553f3352m6096j24870B10893C7998J17679R0467Q3135A04604
$$ 180056 -20659 303553 -63352 -109448 -234318 210893 37998 155677 246144 329279 104604
11583B56570A01082C5078a32191E7076a24613B93653B7634f6708B15088I1314
$$ 256570 101082 35078 -132191 57076 -124613 293653 27634 -66708 215088 91314
11572i0169C4657J69119B4590K41358b19457h4436B5090N3580K11964r8685L713
$$ -90169 34657 203776 24590 265948 -219457 -84436 25090 78670 290634 191949 195662
11561A95662l9659J10073J93462A3962a1553k50229j14215A68875O3764g6638
$$ 195662 156003 266076 459538 13962 -11553 -261782 -375997 168875 232639 -76638
11550A26573e7419r4946E0336b34141D5798L5456e735C9681J5772J10051B6644
$$ 126573 -57419 -152365 50336 -234141 45798 81254 -5735 39681 55453 165504 26644
11538B13765o6589a73080B64526A04463N1512K2803K12157A58072M5439i5304
$$ 213765 147176 -173080 264526 104463 155975 178778 390935 158072 203511 -95304
11527B27695K4796p4525B2560J62474m2287b23806A43050P1527j01456b34992
$$ 227695 252491 177966 22560 185034 142747 -223806 143050 214577 113121 -234992
11516F4295J959J9990L4174f5867K4151j45223G1534j6263a2088A51198A7480
$$ 64295 66254 86244 120418 -65867 -41716 -186939 71534 55271 -12088 151198 17480
11504b08331B3356e5950j5467A41867k0455J36514C762b9049p2249D5683J37429
$$ -208331 23356 -55950 -71417 141867 121412 257926 3762 -29049 -101298 45683 183112
11493A83112h196G8375B5349i7907B18508k5197p6596J74730k2863C3873O1562
$$ 183112 -8196 78375 25349 -97907 218508 193311 116715 291445 268582 33873 95435
11482I5435K2535C4114N5248k3579j6421O4749L17396D7452K12533A24840O4448
$$ 95435 117970 34114 89362 65783 49362 114111 431507 47452 259985 124840 189288
11471A89288K35145A25974L25278a40983B63532a99016A99700l5116H0854i1734
$$ 189288 424433 125974 451252 -140983 263532 -199016 199700 164584 80854 -91734
11460d1785C49939F5271K00019b18295B3236J91643M7923G1411J36660o7283J99275
$$ -41785 349939 65271 265290 -218295 23236 214879 262802 71411 208071 140788 340063
11449C40063g0362p350E729K7937R5951a55531c4351C44350G8225c1965D81201
$$ 340063 -70362 -77712 5729 33666 129617 -155531 -34351 344350 78225 -31965 481201
11437C43671A60017k2658K27664F5783J23247J56549h7269F0279J7638e8789A68666
$$ 343671 160017 137359 365023 65783 189030 345579 -87269 60279 77917 -58789 168666
11425a2077j388r4449H2986a00629a1466G3299M6195b6407j01975H5591b06393
$$ -12077 -13465 -107914 82986 -100629 -11466 73299 119494 -26407 -128382 85591 -206393
11413a8381A40722B6693K13554e5938j47473e285E2864L8526A3620J65168F5793
$$ -18381 140722 26693 240247 -55938 -203411 -5285 52864 91390 13620 178788 65793
11401b82698A43249E807J33111K18203a21677A01932f1852l03912B60621b47762
$$ -282698 143249 5807 138918 357121 -121677 101932 -61852 -365764 260621 -247762
11390f1328J0361j70655c0094A84247o2694c6309B2899J4509J31409a63944E2177
$$ -61328 -50967 -221622 -30094 184247 121553 -36309 22899 37408 168817 -163944 52177
11378b5069j79399A98305E9316L8808P93a86273A56998E0389K76788d10568J88803
$$ -25069 -204468 198305 59316 98124 98917 -186273 156998 50389 327177 -410568 -221765
11367b21765e8436C7556c27685B58437D3764a80512O6467D3864b4657r4610A60694
$$ -221765 -58436 37556 -327685 258437 43764 -180512 -114045 43864 -24657 -119267 160694
11355b43013A24666D1311e3487D7281O0642C1049G517g8826A9939d06604H8910
$$ -243013 124666 41311 -53487 47281 107923 31049 7517 -78826 19939 -406604 88910
11343A96236p5975a15977B99430B3979M6031a53297c526l5086o4540k27412a21771
$$ 196236 120261 -115977 299430 23979 70010 -153297 -3526 -38612 -103152 -330564 -121771
11331c4585A78368a29297B93636a078C1947b09587B18574H2891Q6090e3355H6923
$$ -34585 178368 -129297 293636 -1078 31947 -209587 218574 82891 168981 -53355 86923
11319A2821a30373A89200a64213o5189f1974H8282c2705j38771n9306a00145n258
$$ 12821 -130373 189200 -164213 -229402 -61974 88282 -32705 -171476 -230782 -100145 -105403
11308a05403r0295E8882k059e1994j6135j4726B74246H869R1646K9041a02977
$$ -105403 -195698 58882 56823 -51994 -68129 -82855 274246 8869 100515 129556 -102977
11296g0096k46810A07771n2623a32082a7327k63592j3897A98364i4582k1754j47514
$$ -70096 -316906 107771 55148 -132082 -17327 -280919 -294816 198364 -94582 -116336 -263850
11285b63850I8925b5768j07740O2195B98594b63093a4162F5236g0166m1764j62611
$$ -263850 98925 -25768 -133508 -71313 298594 -263093 -14162 65236 -70166 -111930 -274541
11274b74541A1904L8159c1029F7275J07315B6036a80374j78780C0613N09638a74568
$$ -274541 11904 50063 -31029 67275 174590 26036 -180374 -359154 30613 540251 -174568
11262a08762A17893A7303i6752C27P0501b64220D295L6887K93013E7979f1501
$$ -108762 117893 17303 -96752 327 70828 -264220 4295 41182 334195 57979 -61501
11250d1991n0668j41360B75569J41634b77148g1109A88332C2581b90380G5881
$$ -41991 -92659 -234019 275569 417203 -277148 -71109 188332 32581 -290380 75881
11239A79629E9787K4831k655B0722G660b1158j15840A3390b88137i0513L3405
$$ 179629 59787 84618 81963 20722 7660 -21158 -136998 13390 -288137 -90513 -57108
11228e7108A92091g7030C6435J17645C7586R3865h8573M1490a1941F269K06846
$$ -57108 192091 -77030 36435 154080 37586 131451 -88573 -47083 -11941 6269 213115
11217B13115A7278d323B40762I6593D3165c1887I455b25911A06684b23252P6203
$$ 213115 17278 -4323 240762 96593 43165 -31887 9455 -225911 106684 -223252 -147049
11206a47049J4841j10138E385a23739j79212J30249D0240a2099m1726k26430p4375
$$ -147049 -132208 -242346 5385 -123739 -302951 -172702 40240 -12099 -53825 -280255 -354630
11195c54630C0667a38630l5508G1002l2735a58377I2641C0809M9583R1255p0066
$$ -354630 30667 -138630 -174138 71002 38267 -158377 92641 30809 80392 171647 101581
11184A01581D638a48461A5438K67429j29539F7963a41648B23351I4904o895a77842
$$ 101581 4638 -148461 15438 282867 153328 67963 -141648 223351 94904 88009 -177842
11172A00501c42493J07050A44190g9532B1481O3103d23990b02716B6280a06510
$$ 100501 -342493 -235443 144190 -79532 21481 84584 -423990 -202716 26280 -106510
11161a46038C5237h2714j27450B8638a38185d5358H2523J34796e27597A69533
$$ -146038 35237 -82714 -210164 28638 -138185 -45358 82523 217319 -527597 169533
11150d77317i4148A16626i5088m015B23875A1257R5153f8861E6304b73467B24383
$$ -477317 -94148 116626 -95088 -99103 223875 11257 106410 -68861 56304 -273467 224383
11138b99831A1755c6888j02900L3746A76295n0244a25960D4788J55872g2010A22425
$$ -299831 11755 -36888 -139788 -106042 176295 126051 -125960 44788 200660 -72010 122425
11126h9620j29565P5179k719a8857C64623a62059L7081H7376K78390g9538B81129
$$ -89620 -219185 -144006 -146725 -18857 364623 -162059 -124978 87376 365766 -79538 281129
11114D67879b55332B01295K62146A82574J55162d20469d9832i368A84050J32534
$$ 467879 -255332 201295 463441 182574 337736 -420469 -49832 -9368 184050 316584
11104C16584d2915I1959J17300K23319c4407H8043h2103a4541r8332A01285K22035
$$ 316584 -42915 91959 209259 432578 -34407 88043 -82103 -14541 -112873 101285 323320
11093C23320m8090j34883M8466J47845a2753A81458B1032N5771k4176K16722O114
$$ 323320 275230 140347 188813 336658 -12753 181458 21032 76803 52627 269349 275463
11082B75463K87815k59307R4843A7531L12418P1057J13031B02061Q5453l5203
$$ 275463 563278 303971 398814 17531 329949 401006 514037 202061 287514 252311
11072B52311a12148C88497j72274J56413j30902J42963J03150A56474j8618M35866
$$ 252311 -112148 388497 216223 372636 241734 384697 487847 156474 137856 573722
11062E73722j61759L23261j57632P4970k97393K82856O6325k47592N899M35104
$$ 573722 411963 735224 577592 652562 355169 638025 704350 456758 462657 897761
11052H97761m17096L72880k18360K49647k95535O9608k64508M79109k04355k01709
$$ 897761 480665 853545 635185 884832 589297 658905 394397 873506 669151 467442
11042D67442K05504K24261C90974N5416N1695q9133K19586J30186k90310k26036
$$ 467442 672946 897207 390974 446390 498085 408952 628538 758724 468414 242378
11032B42378L71925j19844P7669J46785j99634J44893k37734L22184M3732j67278
$$ 242378 614303 494459 572128 718913 519279 664172 426438 748622 792354 625076
11022F25076q247K6118K8398j24748K64465j51852N9789l5090K51454D20770K41963
$$ 625076 616829 642947 671345 546597 811062 659210 718999 683909 935363 420770 662733
11011F62733p3729n3339N1965J33368r2962k06393L97054k19739R0087J10740
$$ 662733 589004 535665 587630 720998 628036 421643 818697 598958 689045 799785
11001G99785j9317o1693j70522J85321j52039L20043j05454l6936k28433L16654
$$ 799785 780468 718775 548253 733574 581535 901578 796124 759188 530755 847409
10991H47409k08888R8128j29456M04406q0534R9375J17184J70839l25458Q7998
$$ 847409 638521 736649 607193 1011599 931065 1030440 1147624 1318463 993005 1081003
10981A081003j0963J99785K09803O2875J6271J63292K37061M23957K29968M83633
$$ 1081003 1070040 1269825 1479628 1542503 1558774 1722066 1959127 2383084 2613052 3096685
10971C096685l73382K56073m53087P6729n35164J18084m03577j51488j39008M04735
$$ 3096685 2723303 2979376 2526289 2603018 2067854 2185938 1782361 1630873 1491865 1896600
10961A896600p3538k02663j81858N26121K81902n29432L04667n47767Q7665n54685
$$ 1896600 1823062 1620399 1438541 1964662 2246564 1717132 2021799 1474032 1561697 1007012
10951A007012K46229j75455m15788K32280B90220K504N7963l2757R1311j02986
$$ 1007012 1253241 1077786 661998 894278 290220 292724 350687 317930 409241 306255
10941C06255A23118P8378A3629Q7409J11816M7122J91673C1041K54560A04876
$$ 306255 123118 201496 13629 101038 212854 259976 451649 31041 285601 104876
10930B48531A03686M6450b07025A21039d20089F6339J14835n9242N2861p773G6833
$$ 248531 103686 150136 -207025 121039 -420089 66339 181174 121932 174793 167020 76833
10918B3870M3114a46711j99496G3690a07729j83139J34013d5221p8637C6546P4499
$$ 23870 66984 -146711 -346207 73690 -107729 -290868 -156855 -45221 -123858 36546 111045
10907A11045c07310A67858b47115B8135a39493O7859J5494n6150C66397F364g8019
$$ 111045 -307310 167858 -247115 28135 -139493 -71634 -56140 -112290 366397 6364 -78019
10895b73882G3343i1968A800e1232q5209A15094a16585c3257l6350I5184b17860
$$ -273882 73343 -91968 1800 -51232 -136441 115094 -116585 -33257 -69607 95184 -217860
10883A7822J70105O0444H877B376a8968B75P0828a60916e4631D2058a37844A06598
$$ 17822 187927 248371 8877 2376 -18968 275 71103 -160916 -54631 42058 -137844 106598
10870B73543d4837j10909L3094I3445K50005b63316g1941A39603A5868c23828
$$ 273543 -44837 -155746 -122652 93445 343450 -263316 -71941 139603 15868 -323828
10859a67592d946k17409b4379j0414A10710c78774a50861I5445j3641b63476D7677
$$ -167592 -4946 -222355 -24379 -34793 110710 -378774 -150861 95445 81804 -263476 47677
10847A52461b71904g8909L9410j62944O3646L7447C6590b13992A15252I455a04744
$$ 152461 -271904 -78909 -39499 -202443 -138797 -101350 36590 -213992 115252 9455 -104744
10835b46527J13281J9076b8088D2794M48176H5717h5286j3900j08299E3349f5942
$$ -246527 -133246 -114170 -28088 42794 490970 85717 -85286 -99186 -207485 53349 -65942
10823C12333p1080j00752K1796c69112e3891H2603O0896R7678i9937D2043b53414
$$ 312333 241253 140501 162297 -369112 -53891 82603 143499 241177 -99937 42043 -253414
10811B951c1848l11510M9486J28843J3537C0625N0061h6188j11445H0345a83813
$$ 2951 -31848 -343358 -293872 -165029 -151492 30625 80686 -86188 -197633 80345 -183813
10799A99727E7801K61477G9227d8826Q752m6510o6996A89558A4426b26403B29865
$$ 199727 57801 319278 79227 -48826 -40074 -86584 -153580 189558 14426 -226403 229865
10787I4591f6870B34024E1539h1203a1542j816I695c22251a03940d1966k01286
$$ 94591 -66870 234024 51539 -81203 -11542 -13358 9695 -322251 -103940 -41966 -243252
10776b43252C70Q6941a12840I4832M6879O317c44907A98905d2462j09635B7213
$$ -243252 370 87311 -112840 94832 141711 148028 -344907 198905 -42462 -152097 27213
10764B21602I1256d7077l72651F3305a28452k77390G6909K25472b99287A26946
$$ 221602 91256 -47077 -419728 63305 -128452 -405842 76909 302381 -299287 126946
10753e5108l5317k4821A25414b54344L8798A13294a42619G9892f511A91337q5785
$$ -55108 -90425 -115246 125414 -254344 -215546 113294 -142619 79892 -6511 191337 105552
10742A05552a32112j24205B40971a63230e248k15929p6159H9292h3631A79097
$$ 105552 -132112 -256317 240971 -163230 -5248 -221177 -297336 89292 -83631 179097
10731a06047J898j67825e4712r3925A04048M7755g6586c0550j55289O740h2757
$$ -106047 -104149 -271974 -54712 -148637 104048 151803 -76586 -30550 -185839 -179099 -82757
10719G596K36611a10473A07612a68046C1654g034A01422P4328a87372j21517E6438
$$ 7596 244207 -110473 107612 -168046 31654 -7034 101422 175750 -187372 -308889 56438
10707A20925n2799G88a44865B33009G824a51704a1978r0065j70169a17045J41
$$ 120925 68126 788 -144865 233009 7824 -151704 -11978 -102043 -272212 -117045 -116904
10696a16904j49000D6863h5442J5929k7177A16612a39243l2564O0716b3093A08863
$$ -116904 -265904 46863 -85442 -69513 -96690 116612 -139243 -171807 -111091 -23093 108863
10684A44747d16882A98767c1468j34985h2777r682K8493D72768d9100n8827L5961
$$ 144747 -416882 198767 -31468 -166453 -82777 -92459 -63966 472768 -49100 -107927 -71966
10673g1966K3713A102Q9947A016b36208h7428E956c62518c5527q4586d9517k0763
$$ -71966 -48253 1102 91049 1016 -236208 -87428 5956 -362518 -35527 -120113 -49517 -70280
10661g0280j04790c6268k68001C10951d5651j74633f2149I3310g2295B62917g1449
$$ -70280 -175070 -36268 -304269 310951 -45651 -220284 -62149 93310 -72295 262917 -71449
10649A29998d4319j21560N0385c7398j31559f0983D5218J14862e4749B940f452
$$ 129998 -44319 -165879 -115494 -37398 -168957 -60983 45218 160080 -54749 2940 -6452
10637h8753I3174a0719m3960A95628g9306A65207G9185l9419O4415a51544P1485
$$ -88753 93174 -10719 -54679 195628 -79306 165207 79185 39766 104181 -151544 -80059
10626h0059k8076J3641B79927G8346a36942o2381A05513b2087j20830c9774a8966
$$ -80059 -108135 -94494 279927 78346 -136942 -199323 105513 -22087 -142917 -39774 -18966
10614h1032C15465a4383G1790l2666i1698B3033J42733o8914c19502a52317A66242
$$ -81032 315465 -14383 71790 39124 -91698 23033 165766 96852 -319502 -152317 166242
10602G6226b06791d3296k32769C51746d665I23a06032B95394a96230J836P4670
$$ 76226 -206791 -43296 -276065 351746 -4665 923 -106032 295394 -196230 -194394 -119724
10591a19724F9989a453j44229O8859K3011B69679a5036j34641k11304F5249J09
$$ -119724 69989 -1453 -145682 -76823 -53812 269679 -15036 -149677 -360981 65249 65358
10580F5358b6517l37079H9224a00119k904A09866b8981o5411K4696a6759n2739
$$ 65358 -26517 -363596 89224 -100119 -103023 109866 -28981 -94392 -69696 -16759 -69498
10569f9498J5695j90284D0187c4158E0920d6692k8649D8385J13900a65310A08273
$$ -69498 -53803 -244087 40187 -34158 50920 -46692 -75341 48385 162285 -165310 108273
10557E9086B4192O0294g6184A74969b43741a9713j8583B1470N1709l5594d13286
$$ 59086 24192 84486 -76184 174969 -243741 -19713 -38296 21470 73179 37585 -413286
10545a69837j61170h1434B33061O7342c07948j19417i1200K4963G2330a23065
$$ -169837 -331007 -81434 233061 300403 -307948 -427365 -91200 -66237 72330 -123065
10534A83686b16166B63042m4402b57389i8972A68660D9880a86746k57371C02489
$$ 183686 -216166 263042 218640 -257389 -98972 168660 49880 -186746 -444117 302489
10523A04508N5717G3681c414B42076b08410E6604a10816j23750k5486F7952a0379
$$ 104508 160225 73681 -3414 242076 -208410 56604 -110816 -234566 -260052 67952 -10379
10511b49374g2723m03991a44738A74452a53877q7659E3327c51652i2411k60894
$$ -249374 -72723 -476714 -144738 174452 -153877 -241536 53327 -351652 -92411 -353305
10501c53305a14280o8440H1232J12377d42j10854J0670p1952D619J03829C209
$$ -353305 -114280 -182720 81232 193609 -442 -111296 -100626 -172578 4619 108448 3209
10489a55213A04423b44723b8102H5252P8209o9261M4035c56628D45182J85425
$$ -155213 104423 -244723 -28102 85252 163461 94200 138235 -356628 445182 630607
10479F30607A77265K18362j20668o1410h3875k59881J17525C33957a86987E716
$$ 630607 177265 395627 274959 213549 -83875 -343756 -226231 333957 -186987 5716
10468b24104d1994p8161K4613F722b68971J16625j71669J0089A46565h1497A77236
$$ -224104 -41994 -120155 -95542 6722 -268971 -152346 -324015 -313926 146565 -81497 177236
10456h9704L9768j06108B79455a218k15204f3175A31429E7573h4392j41395g3934
$$ -89704 -49936 -156044 279455 -1218 -216422 -63175 131429 57573 -84392 -225787 -73934
10444g7706c8492A37121J67962b66453B14520B8963N8130Q8686d6583A31156B3819
$$ -77706 -38492 137121 305083 -266453 214520 28963 87093 175779 -46583 131156 23819
10432d5881m2021J0160E1386c42936O2324o813B3449h228A2625d52860D2066d3004
$$ -45881 -87902 -77742 51386 -342936 -280612 -287425 23449 -8228 12625 -452860 42066 -43004
10419I5242P0190d70388a22893C857Q7099a50023G9989C1595K84389a11574A28634
$$ 95242 165432 -470388 -122893 3857 90956 -150023 79989 31595 315984 -111574 128634
10407B1990c19847F0739j5347a4167j54175I3179c45303A0430a20508I8061c358
$$ 21990 -319847 60739 45392 -14167 -168342 93179 -345303 10430 -120508 98061 -3358
10395b4773B0793J74455J15278b50690a483B97884J60458b75620a01896B80027
$$ -24773 20793 195248 310526 -250690 -1483 297884 458342 -275620 -101896 280027
10384I0996l3320h4417C3505j3856b7970e010B81570f4635C20462A46201K23053
$$ 90996 57676 -84417 33505 19649 -27970 -5010 281570 -64635 320462 146201 369254
10373C69254j75486J00179q6757K3004Q3457J68125j09407J75745B55071k7555
$$ 369254 193768 293947 207190 230194 313651 481776 372369 548114 255071 227516
10363B27516L04865r2313j74954K9875j15735R4714F6509P6676D0566J31815K44169
$$ 227516 532381 440068 265114 294989 179254 273968 66509 143185 40566 172381 416550
10352D16550P2926K264o7901q5517p4242q0343K53101k12471e2253D67183K6816
$$ 416550 489476 491740 423839 338322 264080 183737 436838 224367 -52253 467183 493999
10341D93999R7990h8773B87532j36268B9482a2642B45341I8753i318A39266a900
$$ 493999 591989 -88773 287532 151264 29482 -12642 245341 98753 -9318 139266 -1900
10329B7755J76875I4973O5100g9799b3480E41766F0125N97254B10059j5127J00879
$$ 27755 204630 94973 160073 -79799 -23480 541766 60125 657379 210059 194932 295811
10318B95811P2277M8962j85109B8717A2624g7901D878a81844a7075A644i9338
$$ 295811 368088 417050 231941 28717 12624 -77901 4878 -181844 -17075 1644 -99338
10306d6213j33395B8269J85519l3217i848C37816G2317a268I1865J21028a21964
$$ -46213 -179608 28269 213788 180571 -9848 337816 72317 -1268 91865 212893 -121964
10294A21786g9516B309a19834A42159c1705j28248j57729k35139A38052a15798
$$ 121786 -79516 2309 -119834 142159 -31705 -159953 -317682 -552821 138052 -115798
10283a23614M3108A22300b87593a00843L686A47439E8202h5458J7119B0668b84817
$$ -123614 -80506 122300 -287593 -100843 -97157 147439 58202 -85458 -68339 20668 -284817
10271g8185A02147C1878b16398A41394a43121j15476b4147B38012I5462b29203
$$ -78185 102147 31878 -216398 141394 -143121 -258597 -24147 238012 95462 -229203
10260B71660R1364J08176k33114j584I6937Q0146J99450h0367o0602E8125M977
$$ 271660 363024 471200 238086 236502 96937 177083 376533 -80367 -140969 58125 63102
10249F3102j4191a60304c3573k71217J51441c5305a7017p217D4361b14914O3278
$$ 63102 48911 -160304 -33573 -304790 -153349 -35305 -17017 -24234 44361 -214914 -151636
10238a51636e4873o269c415I6136a08915A84267k4026b00789k8041O1315A9576
$$ -151636 -54873 -61142 -3415 96136 -108915 184267 160241 -200789 -228830 -167515 19576
10226b0655m6706j82662A35913l9789g388k2258H1891J78091J0817G2001A5763
$$ -20655 -67361 -250023 135913 96124 -7388 -29646 81891 259982 270799 72001 15763
10214B37189h8847o953j45873d6108n6206G7921d7190p4845p6283j36400J28490
$$ 237189 -88847 -95800 -241673 -46108 -102314 77921 -47190 -122035 -198318 -334718 -206228
10203b06228b1751A42119a8606C17098h4450A15938D5055b38587a6546k18413
$$ -206228 -21751 142119 -18606 317098 -84450 115938 45055 -238587 -16546 -234959
10193b34959K9531K8379e3856j07293Q0572k4476I2760d55643b07827j91024J47336
$$ -234959 -205428 -177049 -53856 -161149 -80577 -105053 92760 -455643 -207827 -398851 -251515
10182b51515A72352E1553a42294d1620H9886Q9977a34422K9046E5195c30585a01968
$$ -251515 172352 51553 -142294 -41620 89886 179863 -134422 -105376 55195 -330585 -101968
10170e9503j50243c977j38218G7253R3129i0473a4869m9708C974L21864j13300
$$ -59503 -209746 -3977 -142195 77253 170382 -90473 -14869 -64577 3974 325838 212538
10159B12538a08494n1590j1875g7642j10702n96C8127A0362N899J86906b16738
$$ 212538 -108494 -160084 -171959 -77642 -188344 -188940 38127 10362 16261 203167 -216738
10147D4540b45953H4632b61369K2908H633e509q8964l6904A08219c64187a62097
$$ 44540 -245953 84632 -261369 -238461 8633 -5509 -94473 -131377 108219 -364187 -162097
10135c81258d9309k49517A02754d6335j08728g0011B2259c28497c0770A5227b5943
$$ -381258 -49309 -298826 102754 -46335 -155063 -70011 22259 -328497 -30770 15227 -25943
10123a29649b3131C5377Q1172d95709b17487M6320g1554C530d6237D4761b80319
$$ -129649 -23131 35377 116549 -495709 -217487 -171167 -71554 3530 -46237 44761 -280319
10111b33902B68823d4363r8186N358C41280A15609b89705J30663l3348j04896
$$ -233902 268823 -44363 -142549 -137191 341280 115609 -289705 -159042 -192390 -297286
10101b97286G527c4047k16190k8767A27772a50704C01227j00268B447c2028A56338
$$ -297286 7527 -34047 -250237 -279004 127772 -150704 301227 200959 2447 -32028 156338
10089a55443j11938B0870a10903C0120a9919G3429d94273B11861f8452j99273
$$ -155443 -267381 20870 -110903 30120 -19919 73429 -494273 211861 -68452 -267725
10079b67725a4993j35109k5097B99648c58832m7698a09051j06189A91708J21836
$$ -267725 -14993 -150102 -175199 299648 -358832 -406530 -109051 -215240 191708 313544
10069C13544i0860k660j12716A3899b96343d0844A69075b26359B3527N44583D0168
$$ 313544 -90860 -93520 -206236 13899 -296343 -40844 169075 -226359 23527 568110 40168
10057C13091d48655A25995a54273F7261a1560l22141A76512b6606r8703j10160
$$ 313091 -448655 125995 -154273 67261 -11560 -333701 176512 -26606 -125309 -235469
10047b35469b1680k2133A12586a41891f7318J9500B1218m555a25027c5506E7525
$$ -235469 -21680 -43813 112586 -141891 -67318 -47818 21218 16663 -125027 -35506 57525
10035a44180D4057b13692o3153p9250f0194C6362c7178A75320b53953A84437b8564
$$ -144180 44057 -213692 -276845 -356095 -60194 36362 -37178 175320 -253953 184437 -28564
10023a74519C34736b18532F4286a74473c7341H9711a44925c3161n9629B73962
$$ -174519 334736 -218532 64286 -174473 -37341 89711 -144925 -33161 -92790 273962
10012B83005e8643m842k23560A84102R9904H8545d4290l79997c2125k64307H3472
$$ 283005 -58643 -63485 -287045 184102 284006 88545 -44290 -424287 -32125 -296432 83472
10000a85723e2946k32709A02812d84836A12333b26735B12737L6919a94529A62604
$$ -185723 -52946 -285655 102812 -484836 112333 -226735 212737 249656 -194529 162604
9989i5220B29181E8301c82938A49613i6398J1117D2131b47685J7635Q825J07516
$$ -95220 229181 58301 -382938 149613 -96398 -85281 42131 -247685 -230050 -221225 -113709
9978a13709A97602a5665j8092r7525F5178K25168b2018H4015a60853g32k74635
$$ -113709 197602 -15665 -33757 -131282 65178 290346 -22018 84015 -160853 -732 -275367
9967b75367D1399R2448b92435A55609h3462a6641A68583a53543n2073E6502b62151
$$ -275367 41399 133847 -292435 155609 -83462 -16641 168583 -153543 -205616 56502 -262151
9955d2819B3066O2365J53300a0105A04944a97556j94969C7325b40198B13352a62025
$$ -42819 23066 85431 238731 -10105 104944 -197556 -392525 37325 -240198 213352 -162025
9943G6094b59030C45704b57995Q2338D2480c70313a3092f061o361A54383a4467
$$ 76094 -259030 345704 -257995 -175657 42480 -370313 -13092 -6061 -12422 154383 -14467
9931C44424E255c02486B29191a98157l3999c9189B5339e6296l40708J92618l7557
$$ 344424 5255 -302486 229191 -198157 -232156 -39189 25339 -56296 -397004 -204386 -241943
9920b41943A19825n7478a00931A25277c6686I92J9018a12547k11873E45260g5412
$$ -241943 119825 62347 -100931 125277 -36686 992 20010 -112547 -324420 545260 -75412
9908a45468O7568m26317A28704h7226j60412a04170A3617a62475K2126L5992d0906
$$ -145468 -77900 -504217 128704 -87226 -247638 -104170 13617 -162475 -140349 -104357 -40906
9896G6347R0415a47811B7340a30589j41286J16646A02539I638a14006I6217a76767
$$ 76347 166762 -147811 27340 -130589 -271875 -155229 102539 9638 -114006 96217 -176767
9884c20437H2269G572a03465c9415F941K13914b6968l22401i1729j81176C67523
$$ -320437 82269 7572 -103465 -39415 6941 220855 -26968 -349369 -91729 -272905 367523
9872a38199B17038f5575j31422N4325L5167C8851b39629b2719O142j83127h2465
$$ -138199 217038 -65575 -196997 -142672 -107505 38851 -239629 -22719 -16577 -199704 -82465
9860d48887b07016B89765E9786k8790a32283B7560L0777b735A01046g5828r0351
$$ -448887 -207016 289765 59786 30996 -132283 27560 58337 -2735 101046 -75828 -166179
9849a66179q7958M3042B29933b20500E4569c78824B02133J4740b6662l80655a80299
$$ -166179 -254137 -211095 229933 -220500 54569 -378824 202133 216873 -26662 -407317 -180299
9837A3490b28789e0862j58477L8745J6454k46762a34816B27578b68724j11086
$$ 13490 -228789 -50862 -209339 -170594 -154140 -400902 -134816 227578 -268724 -379810
9827c79810B00617C5821b12986k7338k8065D8519d11953D8367b51622A33546a45869
$$ -379810 200617 35821 -212986 -240324 -268389 48519 -411953 48367 -251622 133546 -145869
9815a84441c7541j88569F8242i1656c3218B7930J87084g7125a0867j65599H5389
$$ -184441 -37541 -226110 68242 -91656 -33218 27930 215014 -77125 -10867 -176466 85389
9803a3115A61570b55197L5567j1233J12335e5044b5197B31515D3637e9814k41690
$$ -13115 161570 -255197 -219630 -230863 -118528 -55044 -25197 231515 43637 -59814 -301504
9792c01504a12752B96710a39125A8616R774K26796G415a12283j49243L9991A44165
$$ -301504 -112752 296710 -139125 18616 28390 255186 7415 -112283 -261526 -221535 144165
9780a93410B1171c87202a16888l37277a70762B33435a62078L9587l1384B73715
$$ -193410 21171 -387202 -116888 -454165 -170762 233435 -162078 -122491 -153875 273715
9769A21860b75490A59089b32774c7274j95085G9981k9931a6744l302r4662n747
$$ 121860 -275490 159089 -232774 -37274 -232359 79981 50050 -16744 -20046 -114708 -120455
9758a20455G4014R728D0184e8964A74936b18384J9748d6503q7060c3550j57436
$$ -120455 74014 83742 40184 -58964 174936 -218384 -198636 -46503 -133563 -33550 -190986
9747a90986B16722b5334j74243D0436h9229K210a5544k55857J21772m23174a66786
$$ -190986 216722 -25334 -199577 40436 -89229 -87019 -15544 -271401 -149629 -572803 -166786
9735b08125A55307K18989f6752j16291q4972P2353i1565B66836a24370j18357
$$ -208125 155307 374296 -66752 -183043 -268015 -195662 -91565 266836 -124370 -242727
9725b42727J11236A94904h2212C8221E129J78790a60029F0182a92977O7180m0282
$$ -242727 -131491 194904 -82212 38221 5129 183919 -160029 60182 -192977 -125797 -166079
9714a66079c9952k83333g5024B04190G6721J9895a05454k034N0396I7555P7302
$$ -166079 -39952 -323285 -75024 204190 76721 96616 -105454 -107488 -57092 97555 174857
9703A74857R107b29800i4824j33646M3664p648j5656A36511e03426a37190A96616
$$ 174857 183964 -229800 -94824 -228470 -184806 -192454 -208110 136511 -503426 -137190 196616
9691C51355H0883e94598F521b04058A14603d5925D7832i9588m1113A88154a86035
$$ 351355 80883 -594598 6521 -204058 114603 -45925 47832 -99588 -140701 188154 -186035
9679C32780A40683a4185n75707K87368e8944j68063q1915P3895J0996L5470e0037
$$ 332780 140683 -14185 -589892 -302524 -58944 -227007 -308922 -235027 -224031 -188561 -50037
9667b56085a01405E589b74444a33632m6454C0844J33841g8575F4522K6550a08709
$$ -256085 -101405 5589 -274444 -133632 -180086 30844 164685 -78575 64522 91072 -108709
9655d1294j47234L0863C2390d5505j59161B07320a18401j68682g7657j85613A35673
$$ -41294 -188528 -157665 32390 -45505 -204666 207320 -118401 -287083 -77657 -263270 135673
9643C5592J47729C2828L08406b8151A4540M4738j2711j7815i2769k84461D8932
$$ 35592 183321 32828 341234 -28151 14540 59278 46567 28752 -92769 -377230 48932
9631B25513G9438b32897R1055e0267G9568d1778J7380l68722B84586a12357M9536
$$ 225513 79438 -232897 -141842 -50267 79568 -41778 -24398 -393120 284586 -112357 -62821
9620f2821k28730f1591E8291J883f3125k1395k7031D02518b19175O1831L4076
$$ -62821 -291551 -61591 58291 60174 -63125 -84520 -111551 402518 -219175 -157344 -123268
9609a23268B3022i7489A35557F0587d9186I2311a06403a4110B75544p9487B6908
$$ -123268 23022 -97489 135557 60587 -49186 92311 -106403 -14110 275544 196057 26908
9597a36252B98496F0693i5604J3004c9040j68638A7139b94209d398B95440f4955
$$ -136252 298496 60693 -95604 -82600 -39040 -207678 17139 -294209 -4398 295440 -64955
9585A4338a1123o1399M347p509k72084J56843A68347a27227p703j14895P3750
$$ 14338 -11123 -72522 -68175 -75684 -347768 -190925 168347 -127227 -134930 -249825 -176075
9574a76075J4247P7086n5368N6591k55980A01135a04182l1991D349O6266b63413
$$ -176075 -161828 -84742 -140110 -83519 -339499 101135 -104182 -136173 4349 70615 -263413
9562d5139A05377h7979B82409b2371j96567d1981k78767g4233j91110N5163O1546
$$ -45139 105377 -87979 282409 -22371 -218938 -41981 -320748 -74233 -265343 -210180 -148634
9551a48634K4471A01756a86468a0646A54925a41797G2556d7802A74432g9572E4884
$$ -148634 -124163 101756 -186468 -10646 154925 -141797 72556 -47802 174432 -79572 54884
9539b97973l09346a2739A04693c42409I403a48621A15575a26572a5089A26279
$$ -297973 -607319 -12739 104693 -342409 9403 -148621 115575 -126572 -15089 126279
9528c89442g6833q5372L2575i485j88473C73775a77454c6912F7451b2015j95526
$$ -389442 -76833 -162205 -129630 -9485 -197958 373775 -177454 -36912 67451 -22015 -217541
9517b17541L9595A03927K68928b00930B2304N3465O2864n215N575A9095d8466
$$ -217541 -177946 103927 372855 -200930 22304 75769 138633 133418 138993 19095 -48466
9505b8823F0758a7881G4786J03211q6121c15062a8744j78795j7183e8035H0836
$$ -28823 60758 -17881 74786 177997 91876 -315062 -18744 -197539 -214722 -58035 80836
9493c43986Q069B3742b41048C4991J73112J435B2990M1566j9503i0758k64244
$$ -343986 -335917 23742 -241048 34991 208103 209538 22990 64556 45053 -90758 -355002
9482c55002J23953a03569k78552a60698k4617A24b21912A75183R1133a50073l12661
$$ -355002 -231049 -103569 -382121 -160698 -185315 124 -221912 175183 266316 -150073 -462734
9471d62734a46841E9106a46778j93253J42696H1984B3885d298p1949j49985L8893
$$ -462734 -146841 59106 -146778 -340031 -197335 81984 23885 -4298 -76247 -226232 -187339
9460a87339O9904A10221a84616N2912D2182h6086D4518b68544j97782h0316b3408
$$ -187339 -117435 110221 -184616 -131704 42182 -86086 44518 -268544 -466326 -80316 -23408
9448b77600D831K30643b9750j45871C29573a82253N4597B26305F0381K0192K788
$$ -277600 4831 235474 -29750 -175621 329573 -182253 -127656 226305 60381 80573 83361
9437H3361K02738B0558c5022o0613k19935a19885C3191a41186j67481D2758J2249
$$ 83361 286099 20558 -35022 -95635 -315570 -119885 33191 -141186 -308667 42758 55007
9426E5007b32518H9278a89644R28Q2777A49315D1167b3310j17374j04104A97244
$$ 55007 -232518 89278 -189644 -188716 -105939 149315 41167 -23310 -140684 -244788 197244
9414a42099A38343b17252i0771M3723j06092M1186k26150e6091c279k24334b0605
$$ -142099 138343 -217252 -90771 -47048 -153140 -111954 -338104 -56091 -3279 -227613 -20605
9402b09641H7108a05996A00405a56327P2861G737h0830j8838l77048O4868G4360
$$ -209641 87108 -105996 100405 -156327 -83466 7737 -80830 -99668 -476716 -411848 74360
9390e5209l94837a17302K6504j40969e7809B21932j4635D5187b43581f8189L1920
$$ -55209 -450046 -117302 -90798 -231767 -57809 221932 207297 45187 -243581 -68189 -36269
9379c6269G6360Q7528a14575A28290J8910C2200P1786b34955A09878k9644A8977
$$ -36269 76360 163888 -114575 128290 147200 32200 103986 -234955 109878 80234 18977
9367b24050h7801j2551B9170N1248P3148a74409a3238B10720B444c7920n7203
$$ -224050 -87801 -100352 29170 80418 153566 -174409 -13238 210720 2444 -37920 -95123
9356i5123J0164D3043M7194C9587b33243K0767B8931c25436i7100q7326M0962
$$ -95123 -84959 43043 90237 39587 -233243 -212476 28931 -325436 -97100 -184426 -143464
9345a43464J327B25856F9827M6742c2197r2769j13591Q0707m7590B8640L7926
$$ -143464 -142137 225856 69827 116569 -32197 -124966 -238557 -157850 -205440 28640 66566
9334F6566J84184i1097O951o4195q4714k2807j0826Q9068A44712K06350a90362
$$ 66566 250750 -91097 -84146 -148341 -233055 -255862 -266688 -177620 144712 351062 -190362
9322a08385M0029B095a51681B76229a27429A90795C3944f3702B22920H8984d48416
$$ -108385 -68356 2095 -151681 276229 -127429 190795 33944 -63702 222920 88984 -448416
9310G3832d6633h107A5868Q7763a60045C23341a03667D7471f2331k8505M5232
$$ 73832 -46633 -8107 15868 103631 -160045 323341 -103667 47471 -62331 -90836 -45604
9299d5604C4493g6770j64157d3457A5849A257c8658A54370a21146A04969J2470
$$ -45604 34493 -76770 -240927 -43457 15849 1257 -38658 154370 -121146 104969 117439
9288A17439a03915L8276q1614j04965A27804g7725A101c28665f7784C4953j6239
$$ 117439 -103915 -65639 -147253 -252218 127804 -77725 1101 -328665 -67784 34953 18714
9277A8714a81384J6773e7424b5965D3187c20070A76294e1265k16605C40693a77761
$$ 18714 -181384 -164611 -57424 -25965 43187 -320070 176294 -51265 -267870 340693 -177761
9265B9807a97903k5665a0533F4318a06731j41333c062m3134j09252j01036a6262
$$ 29807 -197903 -223568 -10533 64318 -106731 -248064 -3062 -46196 -155448 -256484 -16262
9253a12550c1205B60384a63889J2129f1001r5817A64324b90439j3242a49758P307
$$ -112550 -31205 260384 -163889 -151760 -61001 -156818 164324 -290439 -303681 -149758 -142451
9242a42451A12849n4141b63130f9412j8705c3736j24493O7224C1772J14342C2798
$$ -142451 112849 58708 -263130 -69412 -88117 -33736 -158229 -91005 31772 146114 32798
9230C3428a80185j67039B57921E1702h6428C9279J46482c4968B3191j0424J22009
$$ 33428 -180185 -347224 257921 51702 -86428 39279 185761 -34968 23191 12767 134776
9219A34776a47052M4116q7799D852a33338l3845j54723r3451A5093a72660c1420
$$ 134776 -147052 -102936 -190735 4852 -133338 -167183 -321906 -415357 15093 -172660 -31420
9207B03282b34325A68266a13792c1176l12309J65630g5962j35361f616k15819
$$ 203282 -234325 168266 -113792 -31176 -343485 -177855 -75962 -211323 -6616 -222435
9197b22435k06I7480O8884o3136a02293b0623A17566D3634i4523B8780K94a00379
$$ -222435 -222641 97480 166364 103228 -102293 -20623 117566 43634 -94523 28780 29074 -100379
9184A34289l0298a1591k91132E0920a82076F9000b15064k48865F4212c8041r0523
$$ 134289 103991 -11591 -302723 50920 -182076 69000 -215064 -463929 64212 -38041 -128564
9173a28564B18007a69901O4585k3875B06029c17955A02037d777j83210G8407J53969
$$ -128564 218007 -169901 -105316 -129191 206029 -317955 102037 -4777 -187987 78407 232376
9162B32376c71927c2078G5088a3310E6868a4041A8871d1233A99436I8530k3842
$$ 232376 -371927 -32078 75088 -13310 56868 -14041 18871 -41233 199436 98530 74688
9151G4688a66687J550M9843A53735b6486J0749B41115c55836a63540c4239k23890
$$ 74688 -166687 -165137 -115294 153735 -26486 -15737 241115 -355836 -163540 -34239 -258129
9140b58129j38753a82889A52099l074O922R4523b12711B71599l7410b20185e7436
$$ -258129 -396882 -182889 152099 149025 155947 250470 -212711 271599 234189 -220185 -57436
9128a14764F7683a63425M9152c1861k73749A96518D8982G822b61498R8487A01405
$$ -114764 67683 -163425 -114273 -31861 -305610 196518 48982 7822 -261498 -163011 101405
9116b43166N3225c6384J5602l642A44082b72455K5534B23513a79836H6273a02239
$$ -243166 -189941 -36384 -20782 -24424 144082 -272455 -246921 223513 -179836 86273 -102239
9104a99151L6710j01306g6n4649K5979E4713b79102A93192b36392C5398a11646
$$ -199151 -162441 -263747 -76 -54725 -28746 54713 -279102 193192 -236392 35398 -111646
9092I9139C6493a60679p6333n6594a32029H0424a59395d7699m5874C2185b75659
$$ 99139 36493 -160679 -237012 -293606 -132029 80424 -159395 -47699 -93573 32185 -275659
9080e4701j71872A1501a02263L9932j38479i6695k9455d0335j72372A47165c9168
$$ -54701 -226573 11501 -102263 -62331 -200810 -96695 -126150 -40335 -212707 147165 -39168
9068I1955c26286E9551c2730k47278o65A01644a84129f4202n6138j44502J22996
$$ 91955 -326286 59551 -32730 -280008 -280673 101644 -184129 -64202 -120340 -264842 -141846
9057a41846j38885J19773c8076q4730h45n2126j68956i9042k2713N8178D0887
$$ -141846 -280731 -160958 -38076 -122806 -845 -52971 -221927 -99042 -121755 -63577 40887
9045b08551i3663m1773A53545a30793I9182h889A46856a83069a4922D0824J00886
$$ -208551 -93663 -135436 153545 -130793 99182 -8889 146856 -183069 -14922 40824 141710
9034A41710C7369N2430f4868l78908a87421J0262l1396I0769a31656m93814b523
$$ 141710 37369 89799 -64868 -443776 -187421 -177159 -208555 90769 -131656 -625470 -2523
9022a96407J3951k00776h7469a4434j78891P6070j25485A18241K15294a5257A67362
$$ -196407 -182456 -383232 -87469 -14434 -193325 -117255 -242740 118241 333535 -15257 167362
9010B37549a82189a5191k69638P250N5879L2412j13730f6193m4321a7169F7084
$$ 237549 -182189 -15191 -284829 -277579 -221700 -189288 -303018 -66193 -110514 -17169 67084
8998a84468g5480j93185L3072r8098a3768I4756b12214A07016C3466K1349A6158
$$ -184468 -75480 -268665 -235593 -333691 -13768 94756 -212214 107016 33466 54815 16158
8986b97269C7764P5441j0984F743K67228C4710J46341b02233A09546l3195a6945
$$ -297269 37764 113205 102221 6743 273971 34710 181051 -202233 109546 76351 -16945
8974B19705c04237a12241p1326J9788I68i5963B93749b69319I4270g3727D4542
$$ 219705 -304237 -112241 -183567 -163779 968 -95963 293749 -269319 94270 -73727 44542
8962B32950h6822I1289h8609d269j19622A12745b4768d663k25249Q8369E1185
$$ 232950 -86822 91289 -88609 -4269 -123891 112745 -24768 -4663 -229912 -141543 51185
8950h7926d3519g293H4951q038h2268Q089A11292a04738A05150a87841K5417G4235
$$ -87926 -43519 -7293 84951 76913 -82268 -74179 111292 -104738 105150 -187841 -162424 74235
8937a29861A62284e7900C23669j36163a92857N5444A67807C5178c98319A24979
$$ -129861 162284 -57900 323669 187506 -192857 -137413 167807 35178 -398319 124979
8926C29035c8278A55263C8632Q06229K659815p43753C74738C5085c9966B89157
$$ 329035 -38278 155263 38632 844861 3504676 2760923 374738 35085 -39966 289157
8915c0732B13879m4300e097B3939c0280A32225B2075J9291b66313i3926N713g824
$$ -30732 213879 169579 -5097 23939 -30280 132225 22075 41366 -266313 -93926 -88213 -7824
8902e20483a33677k7895B18632p8454O1165h8588m19898f9944B37678l4511g7977
$$ -520483 -133677 -161572 218632 140178 201343 -88588 -508486 -69944 237678 203167 -77977
8890A59868b23121k03353G8050m814a80267A1932i9561j08729A45838b47997Q9080
$$ 159868 -223121 -426474 78050 73236 -180267 11932 -99561 -208290 145838 -247997 -158917
8879a58917A74103q6732e552k4361j86087b2213g697C2400J04772a43055j148
$$ -158917 174103 87371 -5552 -29913 -216000 -22213 -7697 32400 137172 -143055 -144203
8868a44203A52c10451N6589I8471B6527b37113P4778r6546p7313f0444q5368L8945
$$ -144203 152 -310451 -253862 98471 26527 -237113 -162335 -258881 -336194 -60444 -145812 -106867
8856a06867B0146K03438b73364g8349B45294b32775A32798a42571G0908C1f6985
$$ -106867 20146 223584 -273364 -78349 245294 -232775 132798 -142571 70908 31 -66985
$$ [...]
##END NTUPLES=NMR SPECTRUM
##END=
