##TITLE=AC1757_VAR00029_9319893_Oe2PvKAeSc
##JCAMPDX= 6.0         $$ Bruker NMR JCAMP-DX V2.0
##DATA TYPE= NMR SPECTRUM
##DATA CLASS= NTUPLES
##ORIGIN= BRUKER
##OWNER= Administrator
$$ 1.72 TOPSPIN		Version 2.1
$$ 2015-08-12 01:56:22.460 -0700  Administrator@X
$$ Compression mode = diff/dup
##.OBSERVE FREQUENCY= 400.02188249412
##.OBSERVE NUCLEUS= ^1H
##.ACQUISITION MODE= SIMULTANEOUS (DQD)
##.ACQUISITION SCHEME= undefined
##.AVERAGES= 8
##.DIGITISER RES= 22
##SPECTROMETER/DATA SYSTEM= spect
##.PULSE SEQUENCE= zg30
##.SOLVENT NAME= COFFEE_meoh
##.SHIFT REFERENCE= INTERNAL, COFFEE_meoh, 1, 14.98509
##AUDIT TRAIL= $$ (NUMBER, WHEN, WHO, WHERE, PROCESS, VERSION, WHAT)
$$ ##TITLE= Audit trail, TOPSPIN		Version 2.1
$$ ##JCAMPDX= 5.01
$$ ##ORIGIN= Bruker BioSpin GmbH
$$ ##OWNER= Administrator
$$ $$ E:\/data/COFFEE/nmr/AC1757_VAR00029_9319893_Oe2PvKAeSc/10/pdata/1/auditp.txt
$$ ##AUDIT TRAIL=  $$ (NUMBER, WHEN, WHO, WHERE, PROCESS, VERSION, WHAT)
(   1,<2015-08-12 01:56:15.273 -0700>,<Administrator>,<X>,<go>,<TOPSPIN 2.1>,
      <created by zg
	started at 2015-08-12 01:55:09.367 -0700,
	POWCHK enabled, PULCHK disabled,
       configuration hash MD5:
       21 0F 79 D6 B3 7B B4 F6 88 20 88 DB 03 48 BD 9F
       data hash MD5: 64K
       EA EC 7E DD A9 91 57 F2 E0 C6 ED 88 B0 2E 30 C4>)
(   2,<2015-08-12 01:56:18.304 -0700>,<Administrator>,<X>,<proc1d>,<TOPSPIN 2.1>,
      <Start of raw data processing
       efp LB = 0 FT_mod = 6 PKNL = 1 PHC0 = 0 PHC1 = 0 SI = 32K 
       data hash MD5: 32K
       5F 4A 6F 4C 95 2D 3B 7A 9D 81 AC 3F EB B7 07 52>)
(   3,<2015-08-12 01:56:18.617 -0700>,<Administrator>,<X>,<proc1d>,<TOPSPIN 2.1>,
      <pk PHC0 = 89.76379 PHC1 = 0 
       data hash MD5: 32K
       2A FA 5A A8 E3 85 36 33 3C F7 D9 39 F4 18 17 1F>)
(   4,<2015-08-12 01:56:18.726 -0700>,<Administrator>,<X>,<proc1d>,<TOPSPIN 2.1>,
      <abs ABSG = 1 
       data hash MD5: 32K
       15 62 B6 C2 1C 17 09 A3 31 58 77 FE FA 0C BB D2>)
(   5,<2015-08-12 01:56:18.789 -0700>,<Administrator>,<X>,<proc1d>,<TOPSPIN 2.1>,
      <abs ABSG = 2 
       data hash MD5: 32K
       A4 EE 5C 5E 74 3B F5 BE BE 6B A9 D0 39 70 99 56>)
(   6,<2015-08-12 01:56:18.851 -0700>,<Administrator>,<X>,<proc1d>,<TOPSPIN 2.1>,
      <abs ABSG = 3 
       data hash MD5: 32K
       1F 1B 0D 3D 26 C9 A8 37 4A 7F D6 6B 51 CB 56 37>)
(   7,<2015-08-12 01:56:18.914 -0700>,<Administrator>,<X>,<proc1d>,<TOPSPIN 2.1>,
      <abs ABSG = 4 
       data hash MD5: 32K
       16 23 FA 12 2A 33 84 53 1D ED A3 25 44 AA C0 79>)
(   8,<2015-08-12 01:56:18.960 -0700>,<Administrator>,<X>,<proc1d>,<TOPSPIN 2.1>,
      <abs ABSG = 5 
       data hash MD5: 32K
       0F 96 63 8A B1 0A 9E DC 6A 06 CB 97 54 A3 ED 07>)
$$ ##END=
$$ 
$$ $$ hash MD5
$$ $$ 9A E8 9B 00 86 D8 E2 65 05 22 A7 E6 C5 F5 22 48
##$RELAX= 
##$RELAX= 
##$RELAX= 
##$RELAX= 
##$RELAX= 
##$RELAX= 
##$RELAX= 
$$ Bruker specific parameters
$$ --------------------------
##$DU= <E:\>
##$EXPNO= 10
##$NAME= <AC1757_VAR00029_9319893_Oe2PvKAeSc>
$$ [...]
##$TP= (0..7)
150 150 150 150 150 150 150 150
##$TP07= 0
##$TPNAME0= <>
##$TPNAME1= <>
##$TPNAME2= <>
##$TPNAME3= <>
##$TPNAME4= <>
##$TPNAME5= <>
##$TPNAME6= <>
##$TPNAME7= <>
##$TPOAL= (0..7)
0.5 0.5 0.5 0.5 0.5 0.5 0.5 0.5
##$TPOFFS= (0..7)
0 0 0 0 0 0 0 0
##$TUNHIN= 0
##$TUNHOUT= 0
##$TUNXOUT= 0
##$USERA1= <user>
##$USERA2= <user>
##$USERA3= <user>
##$USERA4= <user>
##$USERA5= <user>
##$V9= 5
##$VALIST= <valist>
##$VCLIST= <CCCCCCCCCCCCCCC>
##$VD= 0
##$VDLIST= <DDDDDDDDDDDDDDD>
##$VPLIST= <PPPPPPPPPPPPPPP>
##$VTLIST= <TTTTTTTTTTTTTTT>
##$WBST= 2048
##$WBSW= 25
##$XGAIN= (0..3)
0 0 0 0
##$XL= 0
##$YL= 0
##$YMAX_a= 597148
##$YMIN_a= -517345
##$ZGOPTNS= <>
##$ZL1= 120
##$ZL2= 120
##$ZL3= 120
##$ZL4= 120
##$ABSF1= 14.98509
##$ABSF2= -5.573092
##$ABSG= 5
##$ABSL= 3
##$ALPHA= 0
##$AQORDER= 0
##$ASSFAC= 0
##$ASSFACI= 0
##$ASSFACX= 0
##$ASSWID= 0
##$AUNMP= <proc_prof1d_extract_pilot.lims>
##$AXLEFT= 0
##$AXNAME= <>
##$AXNUC= <1H>
##$AXRIGHT= 0
##$AXTYPE= 0
##$AXUNIT= <>
##$AZFE= 0.1
##$AZFW= 0.1
##$BCFW= 0
##$BC_mod= 0
##$BYTORDP= 0
##$COROFFS= 0
##$CY= 15
##$DATMOD= 1
##$DC= 0
##$DFILT= <>
##$DTYPP= 0
##$F1P= 0
##$F2P= 0
##$FCOR= 0.5
##$FTSIZE= 32768
##$FT_mod= 6
##$GAMMA= 0
##$GB= 0
##$INTBC= 1
##$INTSCL= 1
##$ISEN= 128
##$LB= 0
##$LEV0= 0
##$LPBIN= 0
##$MAXI= 10000
##$MC2= 0
##$MEAN= 0
##$ME_mod= 0
##$MI= 0
##$NCOEF= 0
##$NC_proc= -8
##$NLEV= 6
##$NOISF1= 0
##$NOISF2= 0
##$NSP= 0
##$NTH_PI= 0
##$NZP= 0
##$OFFSET= 14.98509
##$PC= 1
##$PHC0= 89.76379
##$PHC1= 0
##$PH_mod= 1
##$PKNL= yes
##$PPARMOD= 0
##$PPDIAG= 0
##$PPIPTYP= 0
##$PPMPNUM= 2147483647
##$PPRESOL= 1
##$PSCAL= 4
##$PSIGN= 0
##$PYNMP= <proc.py>
##$REVERSE= no
##$SF= 400.02
##$SI= 32768
##$SIGF1= 0
##$SIGF2= 0
##$SINO= 400
##$SIOLD= 32768
##$SPECTYP= <>
##$SREGLST= <1H.CDCl3>
##$SSB= 0
##$STSI= 32768
##$STSR= 0
##$SW_p= 8223.68421052631
##$SYMM= 0
##$S_DEV= 0
##$TDeff= 65536
##$TDoff= 0
##$TI= <>
##$TILT= no
##$TM1= 0
##$TM2= 0
##$TOPLEV= 0
##$USERP1= <user>
##$USERP2= <user>
##$USERP3= <user>
##$USERP4= <user>
##$USERP5= <user>
##$WDW= 1
##$XDIM= 32768
##$YMAX_p= 444523165
##$YMIN_p= -789839
##$CURPLOT= <Network HP LaserJet P1505>
##$CURPRIN= <$Network HP LaserJet P1505>
##$DFORMAT= <normdp>
##$LAYOUT= <+/1D_H.xwp>
##$LFORMAT= <normlp>
##$PFORMAT= <normpl>
##$SURQMSG= 1
$$ End of Bruker specific parameters
$$ ---------------------------------
##NTUPLES= NMR SPECTRUM
##VAR_NAME=  FREQUENCY,     SPECTRUM/REAL,   SPECTRUM/IMAG
##SYMBOL=    X,             R,               I
##VAR_TYPE=  INDEPENDENT,   DEPENDENT,       DEPENDENT
##VAR_FORM=  AFFN,          ASDF,            ASDF
##VAR_DIM=   32768,         32768,           32768
##UNITS=     HZ,            ARBITRARY UNITS, ARBITRARY UNITS
##FACTOR=    0.250966925370066, 1,           1
##FIRST=     8223.43324360094, -64805,       99901
##LAST=      0,             -105167,         14218
##MIN=       0,             -789839,         0
##MAX=       8223.43324360094, 444523165,    0
$$ Real data points
##PAGE= N=1
##DATA TABLE= (X++(R..R)), XYDATA
$$ [...]
19595A92021G6659a8503D00326F6823b08375F1023a37638c2543k41635E0307h4873
$$ 192021 76659 -18503 400326 66823 -208375 61023 -137638 -32543 -274178 50307 -84873
19583a91998E7133b0173C4720a32528A79312N847f4959D7529c27725B18041c746
$$ -191998 57133 -20173 34720 -132528 179312 185159 -64959 47529 -327725 218041 -3746
19571c0981J0918j27667B57651q3456n2656b55265P4323B52883b60505k36004
$$ -30981 -20063 -147730 257651 174195 121539 -255265 -180942 252883 -260505 -496509
19561d96509F7511b76694j61736a6001a867j72521J7281N1262D05919j3092D2940
$$ -496509 67511 -276694 -438430 -16001 -1867 -174388 -157107 -105845 405919 392827 42940
19549d1530D2041M5777a92593B20808r9024J73451B5378c31699G2798B9263f5137
$$ -41530 42041 87818 -192593 220808 121784 295235 25378 -331699 72798 29263 -65137
19537I5313b00110O739B2973J63554b98474J29556A57673b55632F9239d4954p0305
$$ 95313 -200110 -193371 22973 186527 -298474 -168918 157673 -255632 69239 -44954 -115259
19526a15259j9062A6324P5154G060c61049J73209d132j77273A47664b08530L9807
$$ -115259 -134321 16324 91478 7060 -361049 -187840 -4132 -181405 147664 -208530 -168723
19515a68723e8187K6136D5434a24359E9315d2140A06653J3351B1194a88696c8999
$$ -168723 -58187 -32051 45434 -124359 59315 -42140 106653 120004 21194 -188696 -38999
19503g4330B2816M8019g872j57806J4592p7186f8741k4837l35715B2695c8944
$$ -74330 22816 70835 -7872 -165678 -151086 -228272 -68741 -93578 -429293 22695 -38944
19491C2970a22357b5184G9660d5573q2782d4333m3378j20985A83587d21500e0951
$$ 32970 -122357 -25184 79660 -45573 -128355 -44333 -87711 -208696 183587 -421500 -50951
19479A57494h9258A88700L3916J50118I5103P5758h2872A52156a16019L9600A60527
$$ 157494 -89258 188700 222616 372734 95103 170861 -82872 152156 -116019 -76419 160527
19467b26732C979J4660i8437A72298f6695q652o5723F213J58351a19603b6650
$$ -226732 3979 18639 -98437 172298 -66695 -75347 -141070 6213 164564 -119603 -26650
19455a41229M856d1334k61266P3663k73326K27704A27262g9661j67384C20420
$$ -141229 -136373 -41334 -302600 -228937 -502263 -274559 127262 -79661 -247045 320420
19444b51746a874F5333a14008b0216B64334a91660A91320a86434j85287a84529
$$ -251746 -1874 65333 -114008 -20216 264334 -191660 191320 -186434 -371721 -184529
19433E4337R9005G1551k5963h783j68768a1135E8779c6603k3340E6603c06503
$$ 54337 153342 71551 45588 -8783 -177551 -11135 58779 -36603 -59943 56603 -306503
19421b51838a20138N2627r8141A38281e608H8629J97617A04457j1439c6346p2509
$$ -251838 -120138 -67511 -165652 138281 -5608 88629 286246 104457 93018 -36346 -108855
19410a08855r4753B75696H9468Q9908a72409Q6144H1075i2209C43134a67610L4341
$$ -108855 -203608 275696 89468 179376 -172409 -86265 81075 -92209 343134 -167610 -133269
19399a33269L7389j44724a17489k66816A51473a13031n3922c9531A7918a60375
$$ -133269 -95880 -240604 -117489 -384305 151473 -113031 -166953 -39531 17918 -160375
19388a04990m260B48848I3866d02344a3904B1300J30354E8149f9802J7093m3820
$$ -104990 -109250 248848 93866 -402344 -13904 21300 151654 58149 -69802 -52709 -96529
19377i6529B52907b01271f9102j97526P218B7182a79707E46014B13972a75600
$$ -96529 252907 -201271 -69102 -266628 -259410 27182 -179707 546014 213972 -175600
19366b41538a16318B20732a78081j38846a30533A09390d19058J79038e0653C5038
$$ -241538 -116318 220732 -178081 -316927 -130533 109390 -419058 -240020 -50653 35038
19355a14652c8047B0141a44493e993A94260a57310b268o5496C3845a24009l0015
$$ -114652 -38047 20141 -144493 -5993 194260 -157310 -2268 -67764 33845 -124009 -154024
19344a54024k7109n293H1656c93908a1434l2110q0386E4468b98867h0486n9492
$$ -154024 -181133 -186426 81656 -393908 -11434 -43544 -123930 54468 -298867 -80486 -139978
19333a39978H0038a43380k08016B935a69638e530k18553C6549b39606d3787j7816
$$ -139978 80038 -143380 -351396 2935 -169638 -5530 -224083 36549 -239606 -43787 -61603
19322f1603A1846a74646g1844D2888K39594b30410B3272c11381A5856e684k89240
$$ -61603 11846 -174646 -71844 42888 282482 -230410 23272 -311381 15856 -5684 -294924
19311b94924B40306q1520b20814R1342p671A4253c73703a1984B9354b40818b8394
$$ -294924 240306 158786 -220814 -129472 -137143 14253 -373703 -11984 29354 -240818 -28394
19299a70A01174k470i0384F4164M6580J72587a55627A7115P7407B1370e3953j49365
$$ -170 101174 98704 -90384 64164 110744 283331 -155627 17115 94522 21370 -53953 -203318
19287b03318J8253D4696Q3351r041a77868h2118L8524G2784l0713b89263D780
$$ -203318 -185065 44696 128047 119006 -177868 -82118 -43594 72784 42071 -289263 4780
19275b60925E4162f0142n0340p3782e8003j6909A63363a60887m9510j67988c0952
$$ -260925 54162 -60142 -110482 -184264 -58003 -74912 163363 -160887 -210397 -378385 -30952
19263a45155B2413a8041b034A01367c0509E9253b42814j038A7316L8918d731o1504
$$ -145155 22413 -18041 -2034 101367 -30509 59253 -242814 -243852 17316 56234 -4731 -66235
19251f6235j9433D2151a6274B56048F0236J22594q5739b13938K8477m4447k77079
$$ -66235 -85668 42151 -16274 256048 60236 182830 97091 -213938 -185461 -229908 -506987
19240e06987b18802O6263B48288p8690c0903B5872b81495L4963C47497d4159j53974
$$ -506987 -218802 -152539 248288 169598 -30903 25872 -281495 -246532 347497 -44159 -198133
19229a98133B0020h8657k15237b2719C78130b7680A25521b35496g0049C9699g9898
$$ -198133 20020 -88657 -303894 -22719 378130 -27680 125521 -235496 -70049 39699 -79898
19217f9598N804r7494N7993p45l759I8731c5787D67861a4490K875A16170d5134
$$ -69598 -63794 -161288 -103295 -104040 -107799 98731 -35787 467861 -14490 -11615 116170 -45134
19204e5933E4865a65658A48411a97778o4465k3408A52826p0379a75712N10N5163
$$ -55933 54865 -165658 148411 -197778 -262243 -285651 152826 82447 -175712 -175202 -120039
19193a20039K367p3876E1018a8324G14a03129A44688e0721B2108a5665j50693
$$ -120039 -117672 -191548 51018 -18324 714 -103129 144688 -50721 22108 -15665 -166358
19182a66358j03923D009a05483N1473j86906b5182C5583a13949N2054F6762K38446
$$ -166358 -270281 4009 -105483 -54010 -240916 -25182 35583 -113949 -61895 66762 305208
19171C05208a27735A15533a34107j67053C33213D3603N902d0979A03894a31563
$$ 305208 -127735 115533 -134107 -301160 333213 43603 49505 -40979 103894 -131563
19160a65658g7587C9709h5008m2245O1702B7281f1873J9048F5247a52183j3521
$$ -165658 -77587 39709 -85008 -127253 -65551 27281 -61873 -42825 65247 -152183 -165704
19149a65704B31516b29902E7627J57814I617a48797k4183I7199a48884l2419A51328
$$ -165704 231516 -229902 57627 215441 9617 -148797 -172980 97199 -148884 -181303 151328
19137E4204H592i1916d4760J0324k3542A57794g8587A18902m0045L9230a66747
$$ 54204 8592 -91916 -44760 -34436 -57978 157794 -78587 118902 78857 118087 -166747
19125B3659d8315j74362A76832a06998A3485b68307O5522J8389M1083k19228I3960
$$ 23659 -48315 -222677 176832 -106998 13485 -268307 -202785 -184396 -143313 -362541 93960
19113A11641a89633j2822F9773R0941k4618d1012j8419i277k82510H3667b5042
$$ 111641 -189633 -202455 69773 160714 136096 -41012 -59431 -9277 -291787 83667 -25042
19101a71155B48793A04682M4639C896J35621N4317o3128m3879a75017L3914P0388
$$ -171155 248793 104682 149321 3896 139517 193834 130706 86827 -175017 -141103 -70715
19090g0715a9208m0153A6140b15310r429F2622a38433j27151l1767B43491c8868
$$ -70715 -19208 -59361 16140 -215310 -224739 62622 -138433 -265584 -297351 243491 -38868
19078a92692n3155o9853e4111H8327D0070Q191c23665a5978A0241b60261A6125
$$ -192692 -245847 -315700 -54111 88327 40070 48261 -323665 -15978 10241 -260261 16125
19066e9667q4653J1581m0722j23322g7919B8135J11857i7627j47990c2279A02734
$$ -59667 -144320 -132739 -173461 -296783 -77919 28135 139992 -97627 -245617 -32279 102734
19054A3965N2058J30280E8895Q1404E0556J50780c21876a21809a0217j63847d263
$$ 13965 66023 196303 58895 140299 50556 201336 -321876 -121809 -10217 -174064 -4263
19042a0196E6539i6072G270a57506j4494A53371F8441a05776G8687C955a02498
$$ -10196 56539 -96072 7270 -157506 -172000 153371 68441 -105776 78687 3955 -102498
19030G6453j0949M9454b08203B88525D4763L01565r2699b49119F646e7709C42738
$$ 76453 65504 114958 -208203 288525 44763 346328 253629 -249119 6646 -57709 342738
19018A36253f8621j6898B93015i9604l335B34760d0320l05532J35378A96389J12
$$ 136253 -68621 -85519 293015 -99604 -102939 234760 -40320 -345852 -210474 196389 196501
19007A96501a36393k26617g5665k9193a0714l6269o5812j11704A70458a76311
$$ 196501 -136393 -363010 -75665 -104858 -10714 -46983 -112795 -224499 170458 -176311
18996C65752b72711a08502G6248f7412k51325a14388o3569C9542a32628M3619
$$ 365752 -272711 -108502 76248 -67412 -318737 -114388 -177957 39542 -132628 -89009
18986h9009A20277a02212q6744A27248J7043k0450i6588l22996J91507g0653o7219
$$ -89009 120277 -102212 -188956 127248 144291 123841 -96588 -419584 -228077 -70653 -137872
18975a37872A8638a90296L1276b1988D2870M1242e0753j85561g6284k77988j65892
$$ -137872 18638 -190296 -159020 -21988 42870 84112 -50753 -236314 -76284 -354272 -520164
18964e20164C4407j3987c04304C2121J29418o1808O853M0014c8982A00395a00588
$$ -520164 34407 20420 -304304 32121 161539 99731 106584 146598 -38982 100395 -100588
18952a24415d9701k0876r4755A4576d8190k3131j12306g823k00054h0850C3141
$$ -124415 -49701 -70577 -165332 14576 -48190 -71321 -183627 -7823 -207877 -80850 33141
18940E9029J34367n6732c2787B6089R572b11352c1087A9813J59533e4697D1095
$$ 59029 193396 136664 -32787 26089 35661 -211352 -31087 19813 179346 -54697 41095
18928g5385j78423i5034A162N1641b74156E5144j0402a4277k15696a6652j47463
$$ -75385 -253808 -95034 1162 52803 -274156 55144 44742 -14277 -229973 -16652 -164115
18917a64115B78181a21086C9949O6949E1665J4640a21858c9898k65686H0861R733
$$ -164115 278181 -121086 39949 106898 51665 66305 -121858 -39898 -305584 80861 90594
18906I0594e69671b40903a08068f131k03998F5066h8014M0739A72532R4347a4176
$$ 90594 -569671 -240903 -108068 -6131 -210129 65066 -88014 -47275 172532 266879 -14176
18894g0218r1276d3729A62582a66045d5290A1370c72092B9395i5997n8838A96145
$$ -70218 -161494 -43729 162582 -166045 -45290 11370 -372092 29395 -95997 -154835 196145
18882b87467g6404k12765i8942d1753k7592H326a9794q9554E8458a79750G3737
$$ -287467 -76404 -289169 -98942 -41753 -69345 8326 -19794 -109348 58458 -179750 73737
18870a5397A1196L77449A11695a4945A93403b93671P3678j03698C12474E5172
$$ -15397 11196 388645 111695 -14945 193403 -293671 -219993 -323691 312474 55172
18859b68187C3554a97409k31374H8168a76878A49082b91477b2989A54105b23479
$$ -268187 33554 -197409 -428783 88168 -176878 149082 -291477 -22989 154105 -223479
18848g2598o5981A72567a29594l4157m379C41200c0093C3680c34312A06609g8750
$$ -72598 -138579 172567 -129594 -163751 -168130 341200 -30093 33680 -334312 106609 -78750
18836c89195J60254I9961a29995H6743a13324M1772J5348B3195a79496D5651L9456
$$ -389195 -228941 99961 -129995 86743 -113324 -71552 -56204 23195 -179496 45651 85107
18825H5107N162a20160B35221A03978d8429k17560h159l85203H6144k7977K162
$$ 85107 90269 -120160 235221 103978 -48429 -265989 -8159 -393362 86144 58167 60329
18814F0329g725k403H98J79294K32252d1614C83536A39730a03854k04949k8085
$$ 60329 -7725 -10128 898 180192 412444 -41614 383536 139730 -103854 -308803 -336888
18803c36888L7332E3877d5027j76559C8816A0348f6311k64969h8500j54801Q1664
$$ -336888 -299556 53877 -45027 -221586 38816 10348 -66311 -331280 -88500 -243301 -161637
18792a61637B57512L2224i6095j91433a02479o7247H7230c4605m32568A97122
$$ -161637 257512 289736 -96095 -287528 -102479 -169726 87230 -34605 -467173 197122
18781G717a4254p1601M0204k0099D0730b87119g6469G9731d29339A35159b09188
$$ 7717 -14254 -85855 -45651 -65750 40730 -287119 -76469 79731 -429339 135159 -209188
18769i4790j36313p6436J17182E7692J39795M1942b39865A8146N2409d5003C18965
$$ -94790 -231103 -307539 -190357 57692 197487 239429 -239865 18146 70555 -45003 318965
18757D3477L865J40321a98111j6467j4715N2649J4329k02641a02021a5100F6285
$$ 43477 47342 187663 -198111 -214578 -229293 -176644 -162315 -364956 -102021 -15100 66285
18745C31165b50452A63930E4976J807b60624c330j93357A02338i8091o066B02103
$$ 331165 -250452 163930 54976 56783 -260624 -3330 -196687 102338 -98091 -104157 202103
18733a26631J5815m6857a0069l2890k0917B20204h7046c4426B72229a47137A54477
$$ -126631 -110816 -157673 -10069 -42959 -63876 220204 -87046 -34426 272229 -147137 154477
18721e1781m4628M0166D8147b16143r9354a36594L9403C8779Q6594J57868a15476
$$ -51781 -96409 -56243 48147 -216143 -315497 -136594 -97191 38779 125373 283241 -115476
18709b45455J01008A74310b56135e7376p962l11866J46133B9526a37621A6636
$$ -245455 -144447 174310 -256135 -57376 -65338 -377204 -231071 29526 -137621 16636
18698B11883E5164a71311j3518A84001b28945b7840l7822j66342c5516a5569j33290
$$ 211883 55164 -171311 -184829 184001 -228945 -27840 -65662 -232004 -35516 -15569 -148859
18687a48859n304P5486j3385j45973C0304c9842m22921a34290k55918A10424b42477
$$ -148859 -154163 -78677 -92062 -238035 30304 -39842 -462763 -134290 -390208 110424 -242477
18675A98186d07293g7620b8217D8652b21051R7458F385P8621N3323n3605J22126
$$ 198186 -407293 -77620 -28217 48652 -221051 -123593 6385 85006 138329 84724 206850
18664B06850d02452F43J10798L255g1858J5688k63973I0485c0664H4514c01744
$$ 206850 -402452 643 111441 114696 -71858 -56170 -320143 90485 -30664 84514 -301744
18652A11639A5609c8388A72237Q5996D2828c6356j3844j36493D7895c47050i0076
$$ 111639 15609 -38388 172237 258233 42828 -36356 -50200 -186693 47895 -347050 -90076
18640F7382B6448I360f5804j05210A25935l0907c2999j26512c6092j6804b5062
$$ 67382 26448 9360 -65804 -171014 125935 95028 -32999 -159511 -36092 -52896 -25062
18628d98362I1266K2416C7832M35060B7567L18361F7943J60867G1995b09340c2112
$$ -498362 91266 113682 37832 472892 27567 345928 67943 228810 71995 -209340 -32112
18616a21305Q118k1894C3233K415b76988O2079l6222F6804a84622H1402c05905
$$ -121305 -113187 -135081 33233 35648 -276988 -214909 -251131 66804 -184622 81402 -305905
18604B47349a90385G0541B1196c00799D8710a20553A3693d42534F4053R736a47944
$$ 247349 -190385 70541 21196 -300799 48710 -120553 13693 -442534 64053 73789 -147944
18592c18072a54701r6722A91892k907a356j40743D0303c4660j67517Q599F5243
$$ -318072 -154701 -251423 191892 188985 -1356 -142099 40303 -34660 -202177 -193578 65243
18580C03088h5042m4791e0620k21472b8834k55770c5620j44760h0945j19101K7267
$$ 303088 -85042 -129833 -50620 -272092 -28834 -284604 -35620 -180380 -80945 -200046 -172779
18569a72779e4692G2599A9331c27670A90397b14293B96895b8899l61459H675b2716
$$ -172779 -54692 72599 19331 -327670 190397 -214293 296895 -28899 -390358 8675 -22716
18557h3090L971m1363A91942B8229Q3709b9438q8831L4557G7808a62944d0241
$$ -83090 -79119 -120482 191942 28229 111938 -29438 -118269 -83712 77808 -162944 -40241
18545a81241M9139B9803P0154a40480C1738b27446B58924a57295C06438a88045
$$ -181241 -132102 29803 99957 -140480 31738 -227446 258924 -157295 306438 -188045
18534f1008b9187B51100b58039J14398f0219r71j13192j61260a27011G3096c32200
$$ -61008 -29187 251100 -258039 -143641 -60219 -61190 -174382 -335642 -127011 73096 -332200
18522a29813c441B01632g1258C3922P9442J2107D4361a72673p1045i6108b6972
$$ -129813 -3441 201632 -71258 33922 113364 125471 44361 -172673 -243718 -96108 -26972
18510A33325g5348n9089E7705a9120F3459a78936B32101c86539i272k77958K8222
$$ 133325 -75348 -134437 57705 -19120 63459 -178936 232101 -386539 -9272 -287230 -259008
18499b59008C80293B4166L8894Q99c6452H9365A4368K08790c5393k3100A45236
$$ -259008 380293 24166 63060 63959 -36452 89365 14368 223158 -35393 -58493 145236
18487c14280E0809K812K5104d07030K9679G7270B2320a01116M8510B72094d5306
$$ -314280 50809 53621 78725 -407030 -377351 77270 22320 -101116 -52606 272094 -45306
18475H2856a28802o6566F3343J25908a63810D6820a6928l48350A49398a07912
$$ 82856 -128802 -195368 63343 189251 -163810 46820 -16928 -365278 149398 -107912
18464a30691d7417B47950b02669i0328j45390J09228A20255a54157A21821A2186
$$ -130691 -47417 247950 -202669 -90328 -235718 -126490 120255 -154157 121821 12186
18453G9972J78598a03253L3285l1723A41160b42078A32094a1164j54819m1455
$$ 79972 258570 -103253 -69968 -101691 141160 -242078 132094 -11164 -165983 -207438
18443b07438A72096K14561A40661a16063d709k6989j67152g6491k56849f4729
$$ -207438 172096 386657 140661 -116063 -4709 -31698 -198850 -76491 -333340 -64729
18432b08572a01358d0364j08632A51995b26764O6170p0890j82887e5780r3910
$$ -208572 -101358 -40364 -148996 151995 -226764 -160594 -231484 -414371 -55780 -149690
18422a49690f0150j62651A295b83805K102M7896g5720p2944o6147J8359b6145
$$ -149690 -60150 -222801 1295 -283805 -281703 -233807 -75720 -148664 -214811 -196452 -26145
18410A10539b69459J3041f1713A61139a62591m3253b6183B08729O0236g5503n3277
$$ 110539 -269459 -256418 -61713 161139 -162591 -205844 -26183 208729 268965 -75503 -128780
18399a28780B17614a59856A73300D8001f9607Q857B31070a69525C662e72166B91262
$$ -128780 217614 -159856 173300 48001 -69607 -60750 231070 -169525 3662 -572166 291262
18387g431k35610i3538A73038k3454A8000b65589a26559B04883F6834J00611e4439
$$ -7431 -243041 -93538 173038 149584 18000 -265589 -126559 204883 66834 167445 -54439
18375a63906J6618C44278c5489k74081J53132K7034M734F6402a7976n9595A61960
$$ -163906 -147288 344278 -35489 -309570 -156438 -129404 -124670 66402 -17976 -77571 161960
18363C9968d0798m5190n340K360A2332b48665K4535d2834A14280K60375d6271
$$ 39968 -40798 -85988 -91328 -88968 12332 -248665 -224130 -42834 114280 374655 -46271
18351C3562O9702e66779a03324k8372l3132P2400b1453q3272C37461a78241L7027
$$ 33562 103264 -566779 -103324 -131696 -164828 -92428 -21453 -104725 337461 -178241 -141214
18340a41214j5678B48343B449a00955b140j38285o6665h2574G8121a34053A04910
$$ -141214 -156892 248343 2449 -100955 -2140 -140425 -207090 -82574 78121 -134053 104910
18328D5609R033K37618I534a23476A202J60089a39568q1776e6410A07153R9301
$$ 45609 54642 292260 9534 -123476 1202 161291 -139568 -221344 -56410 107153 206454
18317B06454a00867j5139b1589I0163R2844i2388j17982A25577b12646D704i9615
$$ 206454 -100867 -116006 -21589 90163 183007 -92388 -210370 125577 -212646 4704 -99615
18305a21388H0093a81126B06770E9169a14416j05399I8352K28070E8142c27012
$$ -121388 80093 -181126 206770 59169 -114416 -219815 98352 326422 58142 -327012
18294I199J39677N4773D8493J16706M90085d91638g0321G6536a54011I1570o380
$$ 9199 148876 203649 48493 165199 655284 -491638 -70321 76536 -154011 91570 85190
18283H5190b01849A24986b67071F9984K13643c79422K0066M8266A96984a17885
$$ 85190 -201849 124986 -267071 69984 283627 -379422 -359356 -311090 196984 -117885
18272c60698E4891a84735I5870L469f3437j67651j81990I1782c44739B45934h7243
$$ -360698 54891 -184735 95870 99339 -63437 -231088 -413078 91782 -344739 245934 -87243
18260D1186R9649h1060b8336A00238a41368A73984b00780k4098k7952P2576I2865
$$ 41186 140835 -81060 -28336 100238 -141368 173984 -200780 -224878 -252830 -180254 92865
18248A15952a85194I3781b27174i0631q3487A28153h4139A35110A8480c29469
$$ 115952 -185194 93781 -227174 -90631 -174118 128153 -84139 135110 18480 -329469
18237A30731D1360L788J15274a37885C04669b31065Q3289B709K5857a1423l2307
$$ 130731 41360 45148 160422 -137885 304669 -231065 -147776 2709 28566 -11423 -43730
18226d3730J0453j17992A15660b1584A5157a67085J2887B02228L0831b93807B186
$$ -43730 -33277 -151269 115660 -21584 15157 -167085 -154198 202228 233059 -293807 2186
18214d7278k94577C42236b40102D5906A0525J25209f061B6990a39770f5605k77368
$$ -47278 -341855 342236 -240102 45906 10525 135734 -6061 26990 -139770 -65605 -342973
18203c42973A38655d3630J6918H5966a06882A92462L20987a09236a6346m02601
$$ -342973 138655 -43630 -26712 85966 -106882 192462 513449 -109236 -16346 -418947
18193d18947f7298A1886O4900O3429C142b86547A60999i2857B56508c24779J60460
$$ -418947 -67298 11886 76786 140215 3142 -286547 160999 -92857 256508 -324779 -164319
18182a64319B23117E5588B4409a40518a6916j90428k09557C8160M1802J60524
$$ -164319 223117 55588 24409 -140518 -16916 -207344 -416901 38160 79962 240486
18172B40486a15498A39359k4539b54149d3582m3310B88540H4040b39352e9140
$$ 240486 -115498 139359 114820 -254149 -43582 -86892 288540 84040 -239352 -59140
18161I5135h1253K9166B50953j24298J68073a731A46837H195J00196B7764d31087
$$ 95135 -81253 -52087 250953 126655 294728 -1731 146837 8195 108391 27764 -431087
18149b52290A95504c13025a21603C71053a09869B32636I1981b61029a11281A22601
$$ -252290 195504 -313025 -121603 371053 -109869 232636 91981 -261029 -111281 122601
18138a20231A64590b47800h2014k28428d8844A71110f1587H3950F918a81712a8545
$$ -120231 164590 -247800 -82014 -310442 -48844 171110 -61587 83950 6918 -181712 -18545
18126b64029M5242A27313a1557j70522D4009a31120A26380i4899l8270B1579e485
$$ -264029 -218787 127313 -11557 -182079 44009 -131120 126380 -94899 -133169 21579 -5485
18114a78005B53912j23480a07827b9085j94953A95382j1766a10257L2321j70092
$$ -178005 253912 130432 -107827 -29085 -224038 195382 183616 -110257 -77936 -248028
18104b48028q387E0819J83845a62949D0785a48096I1100c7026j57576f2391a2293
$$ -248028 -256415 50819 234664 -162949 40785 -148096 91100 -37026 -194602 -62391 -12293
18092a6412A5678b2890p9092F0076M465K56618F0766K24661E571d84169a70700
$$ -16412 15678 -22890 -101982 60076 64541 321159 60766 285427 5571 -484169 -170700
18080A76753a96428d1980j95906A04261a87184B9263k287e2656A39528R9356g7348
$$ 176753 -196428 -41980 -237886 104261 -187184 29263 26976 -52656 139528 238884 -77348
18068A07440a5099l06412O2067e4411K0221e770j92910A26117n105h0942A1803
$$ 107440 -15099 -321511 -259444 -54411 -34190 -5770 -198680 126117 121012 -80942 11803
18056b0292r4055M7304l6286D918O6115K11971a75743B90332a18886A3752a69379
$$ -20292 -114347 -67043 -103329 4918 71033 283004 -175743 290332 -118886 13752 -169379
18044B0880a90562A37638P1695a12932H6870f4510B7815K36067E9596Q1430M1369
$$ 20880 -190562 137638 209333 -112932 86870 -64510 27815 263882 59596 141026 182395
18033A82395i806A15993b00619J2387C2897J65269J13176d5767F2322a4024B8962
$$ 182395 -9806 115993 -200619 -188232 32897 198166 311342 -45767 62322 -14024 28962
18021A8845J25843b31479F741i8563k35573B72009g5446A08063b41741g0662A49017
$$ 18845 144688 -231479 6741 -98563 -334136 272009 -75446 108063 -241741 -70662 149017
18009c30426M7347R6521B67643A9224N7156a08390o4666Q3940k33953g6731B7654
$$ -330426 -283079 -186558 267643 19224 76380 -108390 -173056 -89116 -323069 -76731 27654
17997b22102H2963J17688a79853A01803c57877d6573l0657j43467P8713B8508
$$ -222102 82963 200651 -179853 101803 -357877 -46573 -77230 -220697 -141984 28508
17986g0204K5183J7526A16664J68730b46064g3643B46548a34912c0893A75650
$$ -70204 -45021 -27495 116664 285394 -246064 -73643 246548 -134912 -30893 175650
17975b85692N607A36076n8579b78189e9410r8200C7528j193M0611Q7115a3787
$$ -285692 -280085 136076 77497 -278189 -59410 -157610 37528 36335 76946 164061 -13787
17963a34544f4685A84750g7863J0621I8482b5248k84197R1168A76066M4502b87453
$$ -134544 -64685 184750 -77863 -67242 98482 -25248 -309445 -218277 176066 220568 -287453
17951e45888e6327C74282D3754J1925O1088C6467b99246A7574h216j36832N1026
$$ -545888 -56327 374282 43754 55679 116767 36467 -299246 17574 -8216 -145048 -94022
17940i4022n3763A81104l7444i175n3921b3183g96l91161f3645A14941J04537
$$ -94022 -147785 181104 143660 -9175 -63096 -23183 -796 -391957 -63645 114941 219478
17929B19478a26450j68205O7282j26372A50573j7934o5575j8010b9930p655o8444
$$ 219478 -126450 -294655 -227373 -353745 150573 132639 67064 49054 -29930 -37585 -106029
17918a06029A94626D4297a46040O570j19305A53934F0404g724m2572o4558A17216
$$ -106029 194626 44297 -146040 -139470 -258775 153934 60404 -7724 -50296 -114854 117216
17906b6916C46894a2239k8516C02994a02298C29176b22825A72578a51648d0817
$$ -26916 346894 -12239 -40755 302994 -102298 329176 -222825 172578 -151648 -40817
17895c2217C7956L3301h4063q5956j14591F9394b39477B17809e0283q6657G4351
$$ -32217 37956 71257 -84063 -170019 -284610 69394 -239477 217809 -50283 -136940 74351
17883F7441g5505k4673j47882A06471P6321J1317C361R2365M3900a21955H3725
$$ 67441 -75505 -100178 -248060 106471 182792 194109 3361 95726 139626 -121955 83725
17871D4956c43193B087c7207k54017A80399m8391N3014C3291P8548J77028a96868
$$ 44956 -343193 2087 -37207 -291224 180399 132008 185022 33291 111839 288867 -196868
17859g8912o8038F0764A5038J37243b29939f198A27364c20418I9291J97771c3611
$$ -78912 -146950 60764 15038 152281 -229939 -6198 127364 -320418 99291 297062 -33611
17847B99971q5999p5531c7697A09606b26060P1825d9251o5065G5049K63998A11069
$$ 299971 213972 138441 -37697 109606 -226060 -154235 -49251 -114316 75049 339047 111069
17835B62125e2797m1509d0065J0184l69110i786E1518J68596a68597D8259K08049
$$ 262125 -52797 -94306 -40065 -29881 -398991 -9786 51518 220114 -168597 48259 256308
17824B56308D7086a44527j35323f5806r223C45840e3019k25435A12329b4994p9677
$$ 256308 47086 -144527 -279850 -65806 -75029 345840 -53019 -278454 112329 -24994 -104671
17813a04671D7958a02362B37378a67998k03147B27708E1521M53J2719L2859f5155
$$ -104671 47958 -102362 237378 -167998 -371145 227708 51521 51974 64693 97552 -65155
17801a38667A29213a06907D5742b11029F1608r179b5424k03553A52259k7148o932
$$ -138667 129213 -106907 45742 -211029 61608 52429 -25424 -228977 152259 125111 118179
17790A18179L9302f9776k0698r3396D05406A91049c7542I7312f1097A80693e2800
$$ 118179 157481 -69776 -90474 -183870 405406 191049 -37542 97312 -61097 180693 -52800
17778A35527H807c98704a18615F3144J77105m6809k2400o2563b10982C02717A14386
$$ 135527 8807 -398704 -118615 63144 240249 193440 171040 108477 -210982 302717 114386
17766A51136h9277A94528J07984l4807E2577Q2590l889h2092J1870C6012c32895
$$ 151136 -89277 194528 302512 267705 52577 135167 131278 -82092 -70222 36012 -332895
17754A43271i8681A72685b77904J23710H1203l3594J56358q4164N4235a89136
$$ 143271 -98681 172685 -277904 -154194 81203 47609 203967 119803 174038 -189136
17743C12533b90759J04665C9830a53821E5998J72221a00760k5043C9552f4522
$$ 312533 -290759 -186094 39830 -153821 55998 228219 -100760 -125803 39552 -64522
17732A62926c18340E0246N1468o444d0717G2748a42175O3185o0390f5502A84825
$$ 162926 -318340 50246 101714 95270 -40717 72748 -142175 -78990 -139380 -65502 184825
17720a81110D6852a38424b0763A45839c8380C01795a41977B17064i1436D2930
$$ -181110 46852 -138424 -20763 145839 -38380 301795 -141977 217064 -91436 42930
17709I9978C1890L3893J11534D0225K15125c4563A84296i2717p2981E866O3574
$$ 99978 31890 65783 177317 40225 255350 -34563 184296 -92717 -165698 5866 69440
17698F9440e6689I8749K0815E0369K8565K9108K11201e1181B75864a61305i161
$$ 69440 -56689 98749 119564 50369 78934 108042 319243 -51181 275864 -161305 -9161
17686d8980F1684b82519B89459d6749I1581i7462j3759l0195c3088j31112k4612
$$ -48980 61684 -282519 289459 -46749 91581 -97462 -111221 -141416 -33088 -164200 -188812
17675a88812A18289b03875P5363p7267E9731K8397A3594b52752A89237e7457B67850
$$ -188812 118289 -203875 -128512 -205779 59731 88128 13594 -252752 189237 -57457 267850
17663D8975a79108C09950b33587B07261G2328i2907F5189N55091c03999A73863
$$ 48975 -179108 309950 -233587 207261 72328 -92907 65189 620280 -303999 173863
17652C54108F6814a68075j46336A26696f2977C4918J97265P3935a05878d8976
$$ 354108 66814 -168075 -314411 126696 -62977 34918 232183 306118 -105878 -48976
17641b78694O4962C3313a33664N3386j43742A32334f037C44292c9837B22747A0326
$$ -278694 -213732 33313 -133664 -80278 -224020 132334 -6037 344292 -39837 222747 10326
17629c13679J45265C2191N7895C4639P250c6189l08846B74278I065a97706e7885
$$ -313679 -168414 32191 90086 34639 41889 -36189 -345035 274278 9065 -197706 -57885
17617A12462b32818A87149a7529J376G9714N5665e5314A91908C3092a53434P4315
$$ 112462 -232818 187149 -17529 -16153 79714 135379 -55314 191908 33092 -153434 -79119
17606g9119k8906B74688q3709g7407a858j6612l0174D12211j36634j0511B4756
$$ -79119 -108025 274688 190979 -77407 -1858 -18470 -48644 412211 275577 265066 24756
17594a38069D0907f4048B0711L1569a28637m425A6572m109b7600E3049g4863J7207
$$ -138069 40907 -64048 20711 52280 -128637 -133062 16572 12463 -27600 53049 -74863 -57656
17582e7656o4000B99917C2127a28092m906B1353J1025d4848A15842a15784B89635
$$ -57656 -121656 299917 32127 -128092 -132998 21353 32378 -44848 115842 -115784 289635
17570A11954E1111a93154k10068G0005b82938B4161J97219f8968A25403E13K41349
$$ 111954 51111 -193154 -403222 70005 -282938 24161 221380 -68968 125403 513 241862
17559B41862a27522j33304E2639P6843o1311j6106g4812B60988H2297K09910a5455
$$ 241862 -127522 -260826 52639 129482 68171 52065 -74812 260988 82297 292207 -15455
17547E334L18308i1240B63557I8241l3905K5704a90981F2123J17302A3747g352
$$ 5334 323642 -91240 263557 98241 64336 90040 -190981 62123 179425 13747 -7352
17535a74038C2881a17112A65306J2670m4505F0397i1599c5581B13181J1078J74876
$$ -174038 32881 -117112 165306 177976 133471 60397 -91599 -35581 213181 224259 399135
17524C99135p3600b54921J05092g1810F203a87499C20667j60093L3600c8684n366
$$ 399135 325535 -254921 -149829 -71810 6203 -187499 320667 160574 194174 -38684 -44050
17513d4050C62313o8541A37622J7535p003J25510G7898b92711G5899L88086A4064
$$ -44050 362313 293772 137622 155157 148154 273664 77898 -292711 75899 463985 14064
17501B26582N788q013b071A49621B7277a53785E2338M4481a90906C249J64980
$$ 226582 232370 224357 -2071 149621 27277 -153785 52338 96819 -190906 3249 168229
17490A68229a16703A33917j1150J15838C7047A3967b47608B48439d6865B1382
$$ 168229 -116703 133917 122767 238605 37047 13967 -247608 248439 -46865 21382
17479A46612J63558i7044B11910p738n434C0968K13890n4167j7548Q4901n0723
$$ 146612 310170 -97044 211910 204172 198738 30968 244858 190691 173143 258044 207321
17468B07321c2196E300K02954F9766K28718A45254E7818H010L30566I8408R0791
$$ 207321 -32196 5300 208254 69766 298484 145254 57818 8010 338576 98408 189199
17457A89199A079a60859C21635j15250L6756J15714a95381g3242B4503N76478
$$ 189199 1079 -160859 321635 206385 243141 358855 -195381 -73242 24503 600981
17447F00981B13049l6013J18244A12093J16719J25926m7011q5034J0739b6462
$$ 600981 213049 177036 295280 112093 228812 354738 307727 222693 233432 -26462
17436D3930a35652B38194K0234L5760C7218O6457l3278l4279K06402K2257A04362
$$ 43930 -135652 238194 258428 294188 37218 103675 70397 36118 242520 264777 104362
17424B97447n457F6658h290B27909E182L93859b9317A59799J35384J68181A76644
$$ 297447 291990 66658 -8290 227909 5182 399041 -29317 159799 295183 463364 176644
17412B87895k2323O388b99475B59155O609A22743K23648A9970J70782J0165L7869
$$ 287895 265572 271960 -299475 259155 265764 122743 346391 19970 190752 200917 238786
17401B38786l3514K19891I9114K25909o6618C6063Q6614e465j44727C42276j35959
$$ 238786 205272 425163 99114 325023 258405 36063 122677 -5465 -150192 342276 206317
17390B06317K3071A01988L8668M29808a92311A49229n7320Q3928d2450B68520
$$ 206317 229388 101988 140656 570464 -192311 149229 91909 175837 -42450 268520
17379a9050G6957J89221a50326F24165C8693L26548G8385J82745A25468n5080
$$ -19050 76957 266178 -150326 624165 38693 365241 78385 261130 125468 70388
17369G0388K43045G9853M4442J46030L1193A5409K87888o7590A1390K62305A23165
$$ 70388 313433 79853 124295 270325 301518 15409 303297 235707 11390 273695 123165
17357B5775L5651B3570J71210J02795j31355h928A35543J53560j16428k103F922
$$ 25775 61426 23570 194780 297575 166220 -8928 135543 289103 172675 170572 6922
17345G2345i1818k7609A72576J47277I8571J4764E6277O0898J08569j10695j1051
$$ 72345 -91818 -119427 172576 319853 98571 113335 56277 117175 225744 115049 103998
17334A03998M3829J53881i7859m843C15108J39146L4271A85045H2201M1670J42572
$$ 103998 147827 301708 -97859 -102702 315108 454254 488525 185045 82201 123871 266443
17323B66443k9854J00320h7866C80992k5419A22996k1124J8337Q6268g0908a577
$$ 266443 236589 336909 -87866 380992 355573 122996 101872 120209 206477 -70908 -1577
17311C1736M2987h5178B46331k3242B6351B297O3564K66716J2848A16483k3922
$$ 31736 74723 -85178 246331 223089 26351 2297 65861 332577 345425 116483 92561
17300I2561N0670c47111G7094J72510a94650B24947c69866B83830F1967O2925
$$ 92561 143231 -347111 77094 249604 -194650 224947 -369866 283830 61967 124892
17290A24892b79649e9013F1764L0894o425J330R4011L26169e9955D76507A57216
$$ 124892 -279649 -59013 61764 92658 86233 87563 181574 507743 -59955 476507 157216
17278A8975J56344n3427P3284J78974j59880K66474k37912a8528A37886f3198
$$ 18975 175319 121892 195176 374150 214270 480744 242832 -18528 137886 -63198
17267B29953A9016a84477B2034K67122g0987A25859N2033F3413M0590L05093A57723
$$ 229953 19016 -184477 22034 289156 -70987 125859 177892 63413 104003 409096 157723
17255A27998I433a65615B87532j6010l0550J79277p2040f4211A39073J81879A07053
$$ 127998 9433 -165615 287532 271522 240972 420249 348209 -64211 139073 320952 107053
17243A70052L5081G1456i1353A37655c2161m2261q8101D57169e5222C84192j74982
$$ 170052 205133 71456 -91353 137655 -32161 -74422 -162523 457169 -55222 384192 209210
17232B09210I4645e3870E5355L13751p8331P1501J25834a01687d5105C08072J71612
$$ 209210 94645 -53870 55355 369106 290775 362276 488110 -101687 -45105 308072 479684
17221D79684j75107q376A15493J79890I4097K81655A51365R7063I3326C9584K92266
$$ 479684 304577 296201 115493 295383 94097 375752 151365 248428 93326 39584 331850
17210C31850n2098m1528K697r7279J51159j165L6096k5288J26765b8994A09972
$$ 331850 279752 238224 240921 143642 294801 293636 329732 304444 431209 -28994 109972
17198g992D33155j39084L35180A96618J4761J77887J97890A58697Q8498o9477
$$ -7992 433155 294071 629251 196618 211379 389266 587156 158697 247195 177718
17188A77718J6928K66527j03057j45078j7533J34367J3369R8960a127A85998C2710
$$ 177718 194646 461173 358116 213038 195505 329872 343241 442201 -1127 185998 32710
17176C71357j82132K00215m0538A25671L28876A57633G58J26353m8619K98653
$$ 371357 189225 389440 348902 125671 454547 157633 758 127111 78492 377145
17166C77145m0331j05139j12942P30J13926R1296j31510J53252o8169Q4790m3692
$$ 377145 336814 231675 118733 119463 233389 324685 193175 346427 278258 363048 319356
17155C19356o3360K62681A47351K25057A02348O90826l67068b2316H69303B92640
$$ 319356 255996 518677 147351 372408 102348 793174 426106 -22316 869303 292640
17144B23634l6734J52916j09784K92322P7390q4695G7897O08932j70805K600l7811
$$ 223634 186900 339816 230032 522354 599744 515049 77897 686829 516024 518624 480813
17133D80813E1554B846K18142J46948G6581K42712p2009j8832o727L67145q1807
$$ 480813 51554 2846 220988 367936 76581 319293 247284 228452 221725 588870 507063
17122E07063k15377J99270j38257A70605K71343j20832A37690J18012L0720K11262
$$ 507063 291686 490956 352699 170605 441948 321116 137690 255702 286422 497684
17112D97684k33317L92428k80567K46409B75453K63484B18214l7092R9939n718
$$ 497684 264367 656795 376228 622637 275453 538937 218214 181122 281061 275343
17102B75343q949M80825B18700J20262J32692j97697J4415L7306r581L590r1988
$$ 275343 266394 747219 218700 338962 471654 273957 288372 325678 316097 319687 227699
17091B27699O464J87140M9503R0092k33617j21086M04720j69326L80056C77281
$$ 227699 234163 421303 470806 560898 327281 206195 610915 441589 821645 377281
17080E47511q1098J79449C01123k3727J74088J02174K3007k58177J6027J1357
$$ 547511 466413 645862 301123 277396 451484 553658 576665 318488 334515 345872
17070C45872K91309k86565k3478H9P12285k96974j05838K98947k25195J76369
$$ 345872 637181 350616 327138 89 712374 415400 309562 608509 383314 559683
17060E59683J494k26020A51850K93567m7038j9946O2861k10438J84153J94546
$$ 559683 561177 335157 151850 445417 398379 378433 441294 230856 415009 609555
17050F09555j56522m8477K0110A74693J05978L27364q1573Q4304k67624k7998
$$ 609555 453033 404556 424666 174693 280671 608035 526462 610766 343142 315144
17040C15144K75198Q1719j82742O8477J65851j33895l8981J02471r1593J54429
$$ 315144 590342 672061 489319 557796 723647 589752 550771 653242 561649 716078
17030G16078N7616r4726j11475L52835l21003O756L1876j06185J44498k34861
$$ 716078 773694 678968 567493 920328 599325 606081 637957 531772 676270 441409
17020D41409K28248N8207k37967j2782k8963M23808l33494J58339l44855J64757
$$ 441409 669657 727864 489897 477115 448152 871960 538466 696805 351950 516707
17010E16707K05122L28634k82226l8067J57782j93067j5692J6245l20395K42228
$$ 516707 721829 1050463 768237 730170 887952 694885 679193 695438 375043 617271
17000F17271K64351k0555q816J13274P7905J73368E67573O0390L54380Q1101k97939
$$ 617271 881622 861067 852251 965525 1043430 1216798 567573 627963 982343 1063444 765505
16989G65505J6702j1781k65946o2249N50347k96930L08960l57030J87744j79143
$$ 765505 782207 770426 504480 442231 992578 695648 1004608 647578 835322 656179
16979F56179K51456k79506L76639L4400m82302K14849K25033n1336j80425n5317
$$ 656179 907635 628129 1004768 1039168 556866 771715 996748 945412 764987 709670
16969G09670M32718j70056O5685k84763L3024L49584Q2273L4387k00270j51294
$$ 709670 1142388 972332 1038017 753254 786278 1135862 1218135 1252522 1052252 900958
16959I00958L25390k71330K38077q4652j16147m5456q8502J37609K84020k77905
$$ 900958 1226348 955018 1193095 1108443 992296 946840 858338 995947 1279967 1002062
16949A002062P2758L78230m70221l0500O7187J79229j6920J38j32179K17898J42719
$$ 1002062 1074820 1453050 982829 952329 1019516 1198745 1181825 1181963 1049784 1267682 1410401
16938A410401m45763J82582m7087K97859k57170J40782m383K02590l61377K63317
$$ 1410401 964638 1147220 1100133 1397992 1140822 1281604 1277221 1479811 1118434 1381751
16928A381751j39954N75094l67131j7340j40992N7480R4199l5709J10980r7249
$$ 1381751 1241797 1816891 1449760 1432420 1291428 1348908 1443107 1407398 1518378 1421129
16918A421129j70794p8907L17273j65200M3983l46905N40896p7793N4655K328
$$ 1421129 1250335 1171428 1488701 1323501 1367484 1020579 1561475 1483682 1538337 1540665
16908A540665k86838J60797J91469o2963K9242j20565J62283R5906p4217J44918
$$ 1540665 1253827 1414624 1606093 1543130 1572372 1451807 1614090 1709996 1635779 1780697
16898A780697m2776J4795K1993L5301Q281M5039p7600K25570j15929j35677j43993
$$ 1780697 1737921 1752716 1774709 1810010 1818291 1863330 1785730 2011300 1895371 1759694 1615701
16887A615701K22784M7858K05580Q9639j67144O1343O9912k06487Q424m7031K38849
$$ 1615701 1838485 1886343 2091923 2181562 2014418 2075761 2145673 1939186 1947610 1900579 2139428
16876B139428M26687m57421J66848J56212j60515P657L0762j15169K49382J64025
$$ 2139428 2566115 2108694 2275542 2431754 2271239 2278896 2309658 2194489 2443871 2607896
16866B607896J57912j05073j22829J81116l0593p1114p2276j3364L92728n1309
$$ 2607896 2765808 2660735 2537906 2719022 2688429 2617315 2545039 2531675 2924403 2873094
16856B873094Q6426k7617R6707K62552L09378n33321K64887j58094K17865j69248
$$ 2873094 2959520 2931903 3028610 3291162 3600540 3067219 3332106 3174012 3391877 3222629
16846C222629j53323M05082J95291K75072m48641L45649O4524K41519n6019j96511
$$ 3222629 3069306 3474388 3669679 3944751 3496110 3841759 3906283 4147802 4091783 3895272
16836C895272K33520k24229J7833J72191J88082k63841K47179L81725J00279m35683
$$ 3895272 4128792 3904563 3922396 4094587 4282669 4018828 4266007 4647732 4748011 4312328
16826D312328K59187L29118k65098K11558o6010K77861L12612j17982M85828P6166
$$ 4312328 4571515 4900633 4635535 4847093 4781083 5058944 5371556 5253574 5739402 5815568
16816E815568n6738j16255L49769j31731r4582M97604K15522j57038M44576m65533
$$ 5815568 5758830 5642575 5992344 5860613 5766031 6263635 6479157 6322119 6766695 6301162
16806F301162R32561R347J51773Q2735O7155N79392k66755J85851K30518K33108
$$ 6301162 7233723 7243070 7394843 7477578 7544733 8124125 7857370 8043221 8273739 8506847
16796H506847N3634M90853N03507o700K05751M00418J27791L28656K61880L63009
$$ 8506847 8560481 9051334 9554841 9548141 9753892 10154310 10282101 10610757 10872637 11235646
16786A1235646K59798M00273q1414N43592L81447N50260L07468O17287K04301
$$ 11235646 11495444 11895717 11814303 12357895 12739342 13289602 13597070 14214357 14418658
16777A4418658N22380M65570L96283O73065K40181R43080P09289N18228N67048
$$ 14418658 14941038 15406608 15802891 16475956 16716137 17659217 18368506 18886734 19453782
16768A9453782R88555P76706N31445J354466M67422J140597Q49676J095455Q51092
$$ 19453782 20442337 21219043 21750488 23104954 23572376 24712973 25562649 26658104 27509196
16759B7509196J475018J368704J435919J430149J523390J316519K618161J465863
$$ 27509196 28984214 30352918 31788837 33218986 34742376 36058895 38677056 40142919
16751D0142919K129913J949181K545869K315470K752209K536987L543965L490029
$$ 40142919 42272832 44222013 46767882 49083352 51835561 54372548 57916513 61406542
16743F1406542L778991L657473M328193M432609M827294M648882N730050N826175
$$ 61406542 65185533 68843006 73171199 77603808 82431102 87079984 92810034 98636209
16735I8636209O168785O435631O699699P342126P312886P746526P472733P192685
$$ 98636209 104804994 111240625 117940324 125282450 132595336 140341862 147814595 155007280
16727A55007280O927039P221851N999315N512673M055458L201633K019640O31609
$$ 155007280 161934319 169156170 175155485 180668158 184723616 187925249 189944889 190576498
16719A90576498m49593k088490l386607m238178n692357n697926o872986p439083
$$ 190576498 190126905 188038415 184651808 180413630 174721273 169023347 162150361 154711278
16711A54711278p482545p816898p488045p595430p192737p094759o884613n947812
$$ 154711278 147228733 139411835 131923790 124328360 117135623 110040864 103156251 97208439
16703I7208439o276726n551799n225336m997702m434920m211287l791845l518122
$$ 97208439 90931713 85379914 80154578 75156876 70721956 66510669 62718824 59200702
16695E9200702l121350l531633k997637k279192k946458k165907k394957j682895
$$ 59200702 56079352 52547719 49550082 47270890 44324432 42158525 39763568 38080673
16687C8080673k171040j431743k112652j268604j416443j338240j592061j043185
$$ 38080673 35909633 34477890 32365238 31096634 29680191 28341951 26749890 25706705
16679B5706705j152249p53911j422964o20873r65638j041283o19634r09189n16780
$$ 25706705 24554456 23800545 22377581 21756708 20791070 19749787 19130153 18220964 17704184
16670A7704184o89062n16639m99412j095645m64799k37795n79390m99822l24916
$$ 17704184 17015122 16498483 15999071 14903426 14438627 14200832 13621442 13121620 12796704
16661A2796704n51927j11456k53670k23071o86529o52816j85586k50736k42082
$$ 12796704 12244777 12133321 11879651 11656580 10970051 10317235 10131649 9880913 9638831
16652I638831k83244k97838j10468m54051j61335m8784k64820n16845j15408L6756
$$ 9638831 9355587 9057749 8947281 8493230 8331895 8283111 8018291 7501446 7386038 7422794
16642G422794n58399K4825N6227J9102p45608q4331J34634q8716l15394j12235
$$ 7422794 6864395 6889220 6945447 6964549 6218941 6134610 6269244 6180528 5865134 5752899
16632E752899j35432k87962j11327k16385j55088J23015k59755M3930o7595k41893
$$ 5752899 5617467 5329505 5218178 5001793 4846705 4969720 4709965 4753895 4686300 4444407
16622D444407j49100L31412m93580R7807p4505p5785k56189L45693p09317L71983
$$ 4444407 4295307 4626719 4133139 4230946 4156441 4080656 3824467 4170160 3460843 3832826
16612C832826o21779L38817k05590l3076m6744J73380k07216k91965J76798l24194
$$ 3832826 3211047 3549864 3344274 3311198 3264454 3437834 3230618 2938653 3115451 2791257
16602B791257J15716O970j70564J11069J80476j67866k90824l8489n6167j96546
$$ 2791257 2906973 2913943 2743379 2854448 3034924 2867058 2576234 2537745 2481578 2285032
16592B285032M80385l59033L0570K88656k96572m69505J64127j82016J08911K16015
$$ 2285032 2765417 2406384 2436954 2725610 2429038 1959533 2123660 1941644 2050555 2266570
16582B266570l45297J81006J05454k61619J35466l0128k37078j4830K00063k01450
$$ 2266570 1921273 2102279 2207733 1946114 2081580 2051452 1814374 1799544 1999607 1798157
16572A798157j67440k3459K75343l76259K02733k01615L12366j46794l73593K40060
$$ 1798157 1630717 1607258 1882601 1506342 1709075 1507460 1819826 1673032 1299439 1539499
16562A539499Q6706R4404k12705r7818j50569K50556J0833q859M74378m54705
$$ 1539499 1626205 1720609 1507904 1410086 1259517 1510073 1520906 1512047 1986425 1531720
16552A531720M2235j51001J28630n45782J69994J34461j61648m6619J43017k12763
$$ 1531720 1573955 1422954 1551584 1005802 1175796 1310257 1148609 1101990 1245007 1032244
16542A032244N0775K95670l56302J14770J21234O4522j39231j40832l08676P3193
$$ 1032244 1083019 1378689 1022387 1137157 1258391 1322913 1183682 1042850 734174 807367
16532H07367M20118J43214l73012M4483o1697K26670l13437J93508o2890k08110
$$ 807367 1227485 1370699 997687 1042170 980473 1207143 893706 1087214 1024324 816214
16522H16214J33050k99622L33154j96642J26666j27149J07089Q5795j36354j11824
$$ 816214 949264 649642 982796 786154 912820 785671 892760 978555 842201 730377
16512G30377J90487L272k45091K79420j20362R0749P6835k02696r2711j1592J11422
$$ 730377 920864 924136 679045 958465 838103 928852 1005687 802991 710280 698688 810110
16501H10110J14931k29489N1680j48538k44733L95594K72236k90384j60181J8392
$$ 810110 925041 695552 747232 598694 353961 749555 1021791 731407 571226 589618
16491E89618B79106M91585j1236j28272J43545j04913l3054k16089J69461j0205
$$ 589618 279106 770691 759455 631183 774728 669815 636761 420672 590133 579928
16481E79928j05580R9059J78927j83256J16829A88112L06331j12433K80168M7389
$$ 579928 474348 573407 752334 569078 685907 188112 494443 382010 662178 709567
16471G09567j87448B54068L58617j39964J14094j67552J3259M4320J38454j83859
$$ 709567 522119 254068 612685 472721 586815 419263 432522 476842 615296 431437
16461D31437j21202K20203j71515P0030j66555R9952j12631o6481L1591L18719
$$ 431437 310235 530438 358923 428953 262398 362350 249719 183238 214829 533548
16451E33548q1404N1312m3391r9511A71590L98770j36413A69687K70904A59068
$$ 533548 452144 503456 460065 360554 171590 570360 433947 169687 440591 159068
16440C17986A03847k1699L63522B00109K59181j54450J06414R9138j11759r0621
$$ 317986 103847 82148 445670 200109 459290 304840 411254 510392 398633 308012
16430C08012M9622J28079j78347J05485j97330r2597L84314B09645J96831K18677
$$ 308012 357634 485713 307366 412851 215521 122924 507238 209645 406476 625153
16420F25153k58662K1982A90031M83509A16409J57123J03892j32676k2821R0363
$$ 625153 366491 388473 190031 673540 116409 273532 377424 244748 221927 312290
16410C12290J53915B15636n7057J75917n1629q5591h6801E53026A61459K53296
$$ 312290 466205 215636 158579 334496 282867 197276 -86801 553026 161459 414755
16400D14755A88920m1895K3649P5802H1080J5496K3454K18461p2073J58098A44997
$$ 414755 188920 147025 170674 246476 81080 96576 120030 338491 266418 424516 144997
16388D10461A50601K21114a88815F0435J17416Q5285B6659d4065F3064O0142E3416
$$ 410461 150601 371715 -188815 60435 177851 263136 26659 -44065 63064 123206 53416
16376D55290j41348N5478n0956H6693J49528a51353D01926D528L0712J21372C4144
$$ 455290 313942 369420 318464 86693 236221 -151353 401926 4528 35240 156612 34144
16364E5343K43524k4182J79219O2023f5731B69351F6679J4800a00118A16137l8756
$$ 55343 298867 274685 453904 515927 -65731 269351 66679 81479 -100118 116137 77381
16353G7381b56927B00638K11971q5612A32183J58486j8035k0989F7339d7836F3105
$$ 77381 -256927 200638 412609 326997 132183 290669 272634 251645 67339 -47836 63105
16341B13461k5863m2674B0190J55094C6108K10104j16918J86289P4435A17824
$$ 213461 187598 144924 20190 175284 36108 246212 129294 315583 390018 117824
16330A75309C498f2160B74632L3937N7534A01995J27645j09678K67480A75348
$$ 175309 3498 -62160 274632 308569 366103 101995 229640 119962 387442 175348
16319A29156J09015J11362I4776L1794f5334H9210J04390F0617j2763J04758o5013
$$ 129156 238171 349533 94776 126570 -65334 89210 193600 60617 47854 152612 87599
16308H7599K57458A25759k121C1649a77381o4642A31292i1129B06762o6297C2653
$$ 87599 345057 125759 123638 31649 -177381 -242023 131292 -91129 206762 140465 32653
16296A92828G5964Q9206a42861D8438a99366C7512a56678e5685A85998E0911K02650
$$ 192828 75964 165170 -142861 48438 -199366 37512 -156678 -55685 185998 50911 253561
16285B53561l6744b00607H7463R5780n7202M9700Q7030J0147I677K62900p6838
$$ 253561 216817 -200607 87463 183243 126041 175741 262771 272918 9677 272577 195739
16274A95739e6784B35913J01664q2716j9956q3228a81455C17240A3349c31203
$$ 195739 -56784 235913 337577 254861 234905 151677 -181455 317240 13349 -331203
16263a16404B59229A0107J28574F0277J86242n0159C1275a06234B6948M3619b65035
$$ -116404 259229 10107 138681 60277 246519 196360 31275 -106234 26948 70567 -265035
16251d6255j02019d1622q5972L3558C4977K84738G7429b3316n7135B86311D756
$$ -46255 -148274 -41622 -127594 -94036 34977 319715 77429 -23316 -80451 286311 4756
16239f1855j11344J5010K5644D1914b363E6132L2853K1260d3194I108Q9436a37206
$$ -61855 -173199 -158189 -132545 41914 -2363 56132 88985 110245 -43194 9108 98544 -137206
16226H5606C7291J619J79596E7986J33432p3612k724f1493B05471C3078O5486
$$ 85606 37291 38910 218506 57986 191418 117806 115082 -61493 205471 33078 98564
16215I8564D6631a19824A38905B6101J0121d8160B88045b0626A41942f4433A84908
$$ 98564 46631 -119824 138905 26101 36222 -48160 288045 -20626 141942 -64433 184908
16203a19662C71713j56516e6150o8408B65071b88037H4326a74154A51060j966
$$ -119662 371713 215197 -56150 -124558 265071 -288037 84326 -174154 151060 149094
16193A49094A6201J51411b88753A38054A0926a55968C0228J7624a35640K5183
$$ 149094 16201 167612 -288753 138054 10926 -155968 30228 47852 -135640 -110457
16183a10457j12819e0146o2249l30637c5904D0944p67i3840N253C9093a60498
$$ -110457 -223276 -50146 -112395 -443032 -35904 40944 40177 -93840 -88587 39093 -160498
16171I1777j580K5633K32109b51662b4979k85410b4474A28724o1132Q6535m5422
$$ 91777 90197 115830 347939 -251662 -24979 -310389 -24474 128724 67592 154127 108705
16160A08705e72643B3394M9861r718d47999B6463b11288l063B11819e3216n6091
$$ 108705 -572643 23394 73255 63537 -447999 26463 -211288 -214351 211819 -53216 -109307
16149a09307j31630G5118j7063N0542b26536A11980b84368K1691L3645f6052K5077
$$ -109307 -240937 75118 58055 108597 -226536 111980 -284368 -262677 -229032 -66052 -40975
16138d0975o2503M3971A16408J1973i2720B05074F2476a91402j73552F507c4696
$$ -40975 -103478 -59507 116408 128381 -92720 205074 62476 -191402 -364954 6507 -34696
16126E9447a57161j12622A35214a12319A54767e2210j90195L0477o8997B9129
$$ 59447 -157161 -269783 135214 -112319 154767 -52210 -242405 -211928 -280925 29129
16115b14725D5a91109E6907a28285B44909a02671J3651K0037m9825E9878c1339
$$ -214725 45 -191109 56907 -128285 244909 -102671 -89020 -68983 -118808 59878 -31339
16103C69555b13816A62097k6324l881C22c0380E7917L1376d6343q2964A05734
$$ 369555 -213816 162097 135773 131892 322 -30380 57917 89293 -46343 -129307 105734
16091c2672D294c10006A76509p3408c37634J40482G8024N5499a03296a9149A01563
$$ -32672 4294 -310006 176509 103101 -337634 -197152 78024 133523 -103296 -19149 101563
16079D53298a33191I0861i0625C3058a78976j74345a26982r6566C2709A0605i1451
$$ 453298 -133191 90861 -90625 33058 -178976 -353321 -126982 -223548 32709 10605 -91451
16067A06732b51804B1731M3441M038E066a38707k19103I7457a25736N8309a0933
$$ 106732 -251804 21731 65172 69210 5066 -138707 -357810 97457 -125736 -67427 -10933
16055B8141g8251c0444A57425Q3863B0048a83558d5966j96892g2883D3498b24659
$$ 28141 -78251 -30444 157425 241288 20048 -183558 -45966 -242858 -72883 43498 -224659
16043c5637k62085f8079A52541e0283A05055m669b38079j71512a71296B50950
$$ -35637 -297722 -68079 152541 -50283 105055 100386 -238079 -409591 -171296 250950
16032D8952K762P5865a14370j14117n7251e4320p8940k7936C46310j52078H2239
$$ 48952 51714 127579 -114370 -228487 -285738 -54320 -133260 -161196 346310 194232 82239
16020a58508q0095A28318d20788D8944O2449N5972F8759b32081G1462J8292b00941
$$ -158508 -238603 128318 -420788 48944 111393 167365 68759 -232081 71462 89754 -200941
16008d9046B97233e852A46865G2134a48909A30089n0816Q7289a63479A14268D89
$$ -49046 297233 -5852 146865 72134 -148909 130089 79273 166562 -163479 114268 489
15996A08403e074r4793H0275j4790L5575O4354L4588D8054q071N7073a77980C71807
$$ 108403 -5074 -99867 80275 65485 101060 165414 200002 48054 39983 97056 -177980 371807
15983B47088k9170b9203E87934a9504A77209Q9315r4393O385e8044l7118A45537
$$ 247088 217918 -29203 587934 -19504 177209 266524 172131 178516 -58044 -95162 145537
15971A94561E1491M2851b33143D9755b69542P9959d7606G7493e4644B01649g6933
$$ 194561 51491 94342 -233143 49755 -269542 -189583 -47606 77493 -54644 201649 -76933
15959c01407B19061a46510E0332B749R2812a00753k32055m0308a28639C0696a59452
$$ -301407 219061 -146510 50332 2749 95561 -100753 -332808 -373116 -128639 30696 -159452
15947A01993b50550C24184B641J32890f0C49808I9556A5047a78429O1889B9284
$$ 101993 -250550 324184 2641 135531 -60 349808 99556 15047 -178429 -116540 29284
15935a09989E5146b86297J24910o2220D5750b8702j71931R757b931o6340H9037
$$ -109989 55146 -286297 -161387 -223607 45750 -28702 -200633 -190876 -2931 -69271 89037
15923c8328k02426B6000c11863H4326a30660I4401J35399b22877i3409j3298F4032
$$ -38328 -240754 26000 -311863 84326 -130660 94401 229800 -222877 -93409 -106707 64032
15911B8170J9964n137c44208J14607A43815h679n80j84886A37431E1688c7875
$$ 28170 48134 42997 -344208 -229601 143815 -8679 -9259 -194145 137431 51688 -37875
15899A08959b42950A49241o8316N2895N9227b14173E5560a20318k1077d60o2720
$$ 108959 -242950 149241 80925 133820 193047 -214173 55560 -120318 -141395 -460 -63180
15888f3180A6560e5413A80969H0267a20904B1003K02123A11035C4272b13090O8377
$$ -63180 16560 -55413 180969 80267 -120904 21003 223126 111035 34272 -213090 -144713
15877a44713b5159k75655H5445a70126M4341A83674F8190g8038j13467m5252c0767
$$ -144713 -25159 -300814 85445 -170126 -125785 183674 68190 -78038 -191505 -236757 -30767
15865F1887b71588E5036a92671L4234P7949m3965p4458e7198j36659A27714b30651
$$ 61887 -271588 55036 -192671 -158437 -80488 -124453 -198911 -57198 -193857 127714 -230651
15853b15234c6511F5896J11149G1360P3327j0621m6466b32800G454J08788e1826
$$ -215234 -36511 65896 177045 71360 144687 134066 87600 -232800 7454 116242 -51826
15841B645b92031E8043K41173a43166C46743j38466a23165K0678G4164c4252A67875
$$ 2645 -292031 58043 299216 -143166 346743 208277 -123165 -102487 74164 -34252 167875
15829F6558b32517j06149F8297K1907e4345k1619B1888e5747n340j29649p5987
$$ 66558 -232517 -338666 68297 90204 -54345 -75964 21888 -55747 -61087 -190736 -266723
15818b66723f0382A01605m6073a78344D0419i4624m9843C2378a43046B12115J08594
$$ -266723 -60382 101605 55532 -178344 40419 -94624 -144467 32378 -143046 212115 320709
15807C20709A8380c7529A28952B25h9082B02455a79143D6862b68412C2610h7871
$$ 320709 18380 -37529 128952 225 -89082 202455 -179143 46862 -268412 32610 -87871
15795b71726d7516l8773F6306J35292e3087A98270q9118e4915b0087j14112F8520
$$ -271726 -47516 -86289 66306 201598 -53087 198270 109152 -54915 -20087 -134199 68520
15783B0307a06064I2069a37240a9258k29755E4680a91132A60918b60250b2375
$$ 20307 -106064 92069 -137240 -19258 -249013 54680 -191132 160918 -260250 -22375
15772b82306h7690j58135A81415a35828F0855a16773H2757b01988O7956B32025
$$ -282306 -87690 -245825 181415 -135828 60855 -116773 82757 -201988 -134032 232025
15761h1833A91591e6239A28173c4922J396j76840l23380a4224j36992n760j97050
$$ -81833 191591 -56239 128173 -34922 -33526 -210366 -533746 -14224 -151216 -156976 -354026
15750c54026B64920E8032L93408g8912j53429h0964F9617N5632b5274A66078b09096
$$ -354026 264920 58032 451440 -78912 -232341 -80964 69617 125249 -25274 166078 -209096
15738c03087D1145a80096A17129J03386C2283B249d2726p3073A53101a31870f619
$$ -303087 41145 -180096 117129 220515 32283 2249 -42726 -115799 153101 -131870 -6619
15726b9744r4116c2394D35079G2405c3353l80817b0395j40836P0364B0097c20672
$$ -29744 -123860 -32394 435079 72405 -33353 -414170 -20395 -161231 -90867 20097 -320672
15714D9508N2154J6324M4965a12096A06884b12710B3803J04536f4450A84342G9249
$$ 49508 101662 117986 162951 -112096 106884 -212710 23803 128339 -64450 184342 79249
15702I1265c85324H179O0167c50625A19a42847A29516d8973B72659a09183D7503
$$ 91265 -385324 8179 68346 -350625 119 -142847 129516 -48973 272659 -109183 47503
15690a86804A36041b52688c6078J1110B02938h9793B8370a5710C519g2542F6155
$$ -186804 136041 -252688 -36078 -24968 202938 -89793 28370 -15710 3519 -72542 66155
15678B42701a63063b673k56532B99342a75250M3660B48489b83443B65752I3629
$$ 242701 -163063 -2673 -259205 299342 -175250 -131590 248489 -283443 265752 93629
15667B37304A100J85674h705k25598I7515i4012A79833D3401c01537h8483j23724
$$ 237304 1100 186774 -8705 -234303 97515 -94012 179833 43401 -301537 -88483 -212207
15656b12207p7359b6420m1516P866H6374A8097a52125A57675C1614a99859g7721
$$ -212207 -289566 -26420 -67936 -60070 86374 18097 -152125 157675 31614 -199859 -77721
15644e7146H6728c7316j02137b9874k34727b9056A35948K17628a54946j0430b320
$$ -57146 86728 -37316 -139453 -29874 -264601 -29056 135948 353576 -154946 -165376 -2320
15632A4859e866q2171I7875a3838r5059o9617p2829A89079G2475C3874J06817
$$ 14859 -5866 -88037 97875 -13838 -108897 -178514 -251343 189079 72475 33874 140691
15621A40691b66895A37536J66722b2088G5012J62759l3564e6160j16694j34806
$$ 140691 -266895 137536 304258 -22088 75012 237771 204207 -56160 -172854 -307660
15611c07660d5071r7953q1635R2391A49561a01046A4801i7655o8166n8038B22764
$$ -307660 -45071 -143024 -224659 -132268 149561 -101046 14801 -97655 -165821 -223859 222764
15599A62895c28747I0143b48411q0135a49312a1413j9423j41393Q3972j34023
$$ 162895 -328747 90143 -248411 -328546 -149312 -11413 -30836 -172229 -88257 -222280
15589b22280j6980L4513A86607A9493a40323B40500r8144C1478J23763a35481
$$ -222280 -239260 -204747 186607 19493 -140323 240500 142356 31478 155241 -135481
15578e9978j18045l179c380j79801B64542c03933a35209B68912G2335J14306b36907
$$ -59978 -178023 -181202 -3380 -183181 264542 -303933 -135209 268912 72335 186641 -236907
15566A56035L7960h1212j0300c7429j92077A37452f0003A1783M99608c41293C14333
$$ 156035 193995 -81212 -91512 -37429 -229506 137452 -60003 11783 511391 -341293 314333
15554B35996q5194M8012D3076J85475a60047k4832i860C5703b6261j50999g7818
$$ 235996 150802 198814 43076 228551 -160047 -184879 -9860 35703 -26261 -177260 -77818
15542A02674B7398b00648l1846B90197h1036k31361C0928b78555c4503n3782j24482
$$ 102674 27398 -200648 -232494 290197 -81036 -312397 30928 -278555 -34503 -88285 -212767
15531b12767B585a00799d189j36458B27985j09561C2303O3360k7185d5733m9769
$$ -212767 2585 -100799 -4189 -140647 227985 118424 32303 95663 68478 -45733 -95502
15520i5502k6684m6120B96437A06201b90827J41806A10501a1082B53342F3468
$$ -95502 -122186 -168306 296437 106201 -290827 -149021 110501 -11082 253342 63468
15509A17803a29792A00003j3640b04819A55201b30555A90212b18728H6531K32408
$$ 117803 -129792 100003 86363 -204819 155201 -230555 190212 -218728 86531 318939
15499C18939j33288d38033A05527b730k80777f1953j7464o6444D4531L13736a73058
$$ 318939 185651 -438033 105527 -2730 -283507 -61953 -79417 -145861 44531 358267 -173058
15487C69509D2809J10058a46301A30832J7727h4559A1112a49404P0656A05394
$$ 369509 42809 152867 -146301 130832 148559 -84559 11112 -149404 -78748 105394
15476c08381I5029b60574A6471L6953a23382O1187l2630o4526K1616L9090j0551
$$ -308381 95029 -260574 16471 53424 -123382 -62195 -94825 -159351 -137735 -98645 -109196
15465a09196f717k74263B2688a8781C53505j32535h2570a0348C15286j44847N995
$$ -109196 -6717 -280980 22688 -18781 353505 220970 -82570 -10348 315286 170439 176434
15454A76434M6305C7263L7230J51428D4484M238J51800a69951c6408Q803C1521
$$ 176434 222739 37263 74493 225921 44484 48722 200522 -169951 -36408 -27605 31521
15442A49668h1662j1154n9647K6182C36717b45973J05839f3944B56753a09180
$$ 149668 -81662 -92816 -152463 -126281 336717 -245973 -140134 -63944 256753 -109180
15431a38972E2184O6325K1743a88140k3894A84234B1720G818K42389k0234b63237
$$ -138972 52184 118509 140252 -188140 -212034 184234 21720 7818 250207 229973 -263237
15419a01310k04183a32521j13417A59375e7121A4754J54199F1836L6457A7584
$$ -101310 -305493 -132521 -245938 159375 -57121 14754 168953 61836 98293 17584
15408b34955I3977m4297M6639i2529k2755E73498a06217k05110R0946g9443o8187
$$ -234955 93977 49680 96319 -92529 -115284 573498 -106217 -311327 -220381 -79443 -147630
15397a47630b2945C35699b69950M2659a0202D07323A56572h8722j6546Q415d928
$$ -147630 -22945 335699 -269950 -227291 -10202 407323 156572 -88722 -105268 -96853 -4928
15385A07840a51583A61096N888h4338j45980I2204a72984k41764h4093A73348
$$ 107840 -151583 161096 166984 -84338 -230318 92204 -172984 -414748 -84093 173348
15374A60994o2411M3792B4105J66845n0530k170d32949A49341D5439A0243b58920
$$ 160994 98583 142375 24105 190950 140420 138250 -432949 149341 45439 10243 -258920
15362A91135g0649A10276B1052J64772d8996a6138A42074b18319A09801k9573
$$ 191135 -70649 110276 21052 185824 -48996 -16138 142074 -218319 109801 80228
15352H0228a46262H3832a3188j67594b5414A59076O7567j4277b21643H3632b44163
$$ 80228 -146262 83832 -13188 -180782 -25414 159076 226643 212366 -221643 83632 -244163
15340A3595Q6105k2382a15270B52693b28774H4798J96706j06080n7705C2581L63172
$$ 13595 99700 77318 -115270 252693 -228774 84798 281504 175424 117719 32581 395753
15329C95753f7945l52930a15984A86414a95525N6260A57681L9975D1315J5078
$$ 395753 -67945 -420875 -115984 186414 -195525 -139265 157681 197656 41315 56393
15319E6393c2791A55793J2489F9175L04135a32143c0450A04794k7803R4431J41799
$$ 56393 -32791 155793 168282 69175 373310 -132143 -30450 104794 76991 171422 313221
15308C13221q0037J1893a89934F0099a38190C3177J37759M6869a38763b4779C45175
$$ 313221 233184 245077 -189934 60099 -138190 33177 170936 217805 -138763 -24779 345175
15296b60468A32899E8536J08821B9943J04397K09190I1406O7144C3324Q2936m121
$$ -260468 132899 58536 167357 29943 134340 343530 91406 158550 33324 116260 112139
15285A12139n0221a0889C1915M8407a97370A88514g7681H7627c2846a4253H1229
$$ 112139 61918 -10889 31915 80322 -197370 188514 -77681 87627 -32846 -14253 81229
15273A86018o0820L9915c05779j767I5078M3334o2435Q2750a27388A57820J91234
$$ 186018 125198 165113 -305779 -307546 95078 138412 75977 158727 -127388 157820 349054
15262C49054A12173E2183b5377A95903f2510C99016j32515j14629E1838h9001
$$ 349054 112173 52183 -25377 195903 -62510 399016 266501 151872 51838 -89001
15251G8968J90035R4147J12771K34459L13870N09833l43124L85598G46364B81020
$$ 78968 269003 363150 475921 710380 1024250 1534083 1190959 1576557 746364 281020
15240C42561o142j08234H4480J09350F8987j153k6750c05926A32367c5578C50588
$$ 342561 336419 228185 84480 193830 68987 67834 41084 -305926 132367 -35578 350588
15228E6666k0407h3371E5572f4886a0855A17097d7893j83360f4252B98838a94369
$$ 56666 36259 -83371 55572 -64886 -10855 117097 -47893 -231253 -64252 298838 -194369
15216b52066f701B75676f4318A2056J31111b2p3650r7629A88780H1492Q8735d2716
$$ -252066 -6701 275676 -64318 12056 143167 -22 -73672 -171301 188780 81492 170227 -42716
15203B68487J18812a39440K0633D8231N6396i9061B68925a0865D68131i3776E2234
$$ 268487 387299 -139440 -118807 48231 104627 -99061 268925 -10865 468131 -93776 52234
15191B60231F6599b83551a9036B75637b44428B41440l4213J01830a29443d029
$$ 260231 66599 -283551 -19036 275637 -244428 241440 207227 309057 -129443 -4029
15180A0388b48680A69318G4122j6750M6800J6074J35474d339k23584j01290B90818
$$ 10388 -248680 169318 74122 57372 104172 120246 255720 -4339 -227923 -329213 290818
15168b21930A30663Q1836m6659H0615L1289c87122B62875a38232f0393C26400
$$ -221930 130663 212499 165840 80615 111904 -387122 262875 -138232 -60393 326400
15157B09860E4351O530b09321a7648A18988E6709j5427J13209P012k3144j1596
$$ 209860 54351 60881 -209321 -17648 118988 56709 41282 154491 161503 138359 126763
15146A26763D1016J78905Q1805c521C27434A34917M6393a61768A55030a1064B05241
$$ 126763 41016 219921 301726 -3521 327434 134917 181310 -161768 155030 -11064 205241
15134I223J58960a88720G9728g3138B89201A8818O4567b60623C2836K70473J70602
$$ 9223 168183 -188720 79728 -73138 289201 18818 83385 -260623 32836 303309 473911
15123D73911B02874l6130b26925R0197a289A87529K04548r2412j18208b3398A73606
$$ 473911 202874 166744 -226925 -136728 -1289 187529 392077 299665 181457 -23398 173606
15111H7047b38072I8073b5217A00705m1374J63442N150Q6893E4116J47464a7335
$$ 87047 -238072 98073 -25217 100705 59331 222773 227923 314816 54116 201580 -17335
15099A80407m3899E4556J05418a716F6255L12664a14200p5555H8163A0145N7099
$$ 180407 136508 54556 159974 -1716 66255 378919 -114200 -189755 88163 10145 67244
15088F7244P5596L03146D8199i4190j18613I119a31787C84930l7403I2723J27859
$$ 67244 142840 445986 48199 -94190 -212803 9119 -131787 384930 347527 92723 220582
15077B20582E7118P5386n8597L02416j36545K81183a32792B13140a13522A22320
$$ 220582 57118 132504 73907 376323 239778 520961 -132792 213140 -113522 122320
15066B80100q9577C2879J08676k8741J61595g8655B54568J17372A31353Q4255
$$ 280100 190523 32879 141555 112814 274409 -78655 254568 371940 131353 215608
15056B15608C3301K048b35726B43766B0464K15950b61486H9239k3907K92617A23425
$$ 215608 33301 35349 -235726 243766 20464 236414 -261486 89239 65332 357949 123425
15044I6766J96651g7514B04466o8619J29965I9729j8443Q5574J65151L0952I3347
$$ 96766 293417 -77514 204466 135847 265812 99729 81286 166860 332011 362963 93347
15032a07950D20476A53113E9659a58705D4073K18116c9222A9236K18518P8403
$$ -107950 420476 153113 59659 -158705 44073 262189 -39222 19236 237754 316157
15022C16157j12680l2410J37979c9114B25687A0686K45054d1675B51521J4725
$$ 316157 203477 171067 309046 -39114 225687 10686 255740 -41675 251521 266246
15012B66246D625M0735N6763P8872q4956K52334A08635J20667R6571j61637a0093
$$ 266246 4625 45360 102123 180995 96039 348373 108635 229302 325873 164236 -10093
15000A23148J91012g5594B76089C9244J70854j4353J07338k7083A24982C0588
$$ 123148 314160 -75594 276089 39244 210098 195745 303083 276000 124982 30588
14989I279O725K01648A03536L12075J74531B43391j0786n0322J84245E5036k6162
$$ 9279 16004 217652 103536 415611 590142 243391 232605 182283 366528 55036 28874
14978B8874P1381M32052B43657p5009J02871q0722Q3718J37511a8940C52507j74066
$$ 28874 100255 532307 243657 168648 271519 190797 274515 412026 -18940 352507 178441
14967A78441K19982A23509M39764B68766J1059C3483K24979A25014K21033A62145
$$ 178441 398423 123509 563273 268766 279825 33483 258462 125014 346047 162145
14956C31786P003j22822K23458j00006j68151J31230p0633j1956h5856A73009
$$ 331786 338789 215967 439425 339419 171268 302498 231865 219909 -85856 173009
14945C07945r3043J28408j45366j4805a03535A88968K33222j89239L61986j35748
$$ 307945 214902 343310 197944 183139 -103535 188968 422190 232951 594937 459189
14935D59189A52737L48901A45316K1001a33279C24869j51934K20060p3400N7819
$$ 459189 152737 501638 145316 166317 -133279 324869 172935 392995 319595 377414
14925C77414L0643J46839j73650A15028D0398M71331j58321L29567B96074c2946
$$ 377414 408057 554896 381246 115028 40398 511729 353408 682975 296074 -32946
14914B93082j9702J81359k03081P7759P8661N0190A82844J15841m1952J73248
$$ 293082 273380 454739 251658 329417 408078 458268 182844 298685 256733 429981
14904D29981j50129L29521A50838K80349k10150o3655J86653M20002k91689m0707
$$ 429981 279852 609373 150838 431187 221037 157382 344035 764037 472348 431641
14894D31641j32688K18827A59065K49144i1254D69385p9832Q1236j87896O0166
$$ 431641 298953 517780 159065 408209 -91254 469385 389553 470789 282893 343059
14884C43059J14273O4398q912A54596L88823k67232H246L43206q9516I8039J08763
$$ 343059 457332 521730 512818 154596 543419 276187 8246 351452 261936 98039 206802
14873B06802k3105J14864A37442F5044K11366R166q8676L79134k79022A08010
$$ 206802 183697 298561 137442 65044 276410 285576 196900 576034 297012 108010
14862C16242D024P06117K58467B65976J03278J86913A92960N00620A76518H2488
$$ 316242 4024 710141 968608 265976 369254 556167 192960 693580 176518 82488
14851F53717j26862k19839j40494K75605A62671L4839k5070J39194m8084O1005
$$ 653717 526855 307016 166522 442127 162671 197510 172440 311634 263550 324555
14841C24555L1266L53708A14952J73051N16438C13108J39347J83106P6146o3548
$$ 324555 355821 709529 114952 288003 804441 313108 452455 635561 711707 648159
14831F48159j86566J55151B15293J62745J6270R9622F1418O03094B60965N60331
$$ 648159 461593 616744 215293 378038 394308 493930 61418 664512 260965 821296
14821H21296k79501K13269k2149j65570j24148B10775K25722j48176L81711o8167
$$ 821296 541795 755064 732915 567345 443197 210775 436497 288321 670032 601865
14811F01865B66117L80078j95708r2837O9652J74767k54292K76686j77904q2957
$$ 601865 266117 646195 450487 357650 427302 602069 347777 624463 446559 363602
14801C63602j12047J14268j14227N41329k28026j70381m1022J44491k35230K23321
$$ 363602 251555 365823 251596 792925 564899 394518 353496 497987 262757 486078
14791D86078M3602k53155L07501j71484K43600B07758M43629B94853L64804J14829
$$ 486078 529680 276525 584026 412542 656142 207758 651387 294853 659657 774486
14781G74486C35860L28080n9791J61074J61638O199D17481L14257C02998M83217
$$ 774486 335860 663940 604149 765223 926861 933060 417481 731738 302998 786215
14771G86215k51827K94668k2627C06908J87701n1333L28261k28054R8594A85467
$$ 786215 534388 829056 806429 306908 494609 443276 771537 543483 642077 185467
14760H40722j79251o5303r1154M3278j0405J98448J18110l36400L46259j59642
$$ 840722 661471 596168 505014 548292 537887 736335 854445 518045 864304 704662
14750G04662j1232j62879K96309l6339m2012j05447K35585C33966K36923j6344
$$ 704662 693430 530551 826860 790521 748509 643062 878647 333966 570889 554545
14740E54545N97387l03348k72230J47571r1312j10163L95170j57105C65511M37099
$$ 554545 1151932 848584 576354 723925 632613 522450 917620 760515 365511 802610
14730H02610r2993j56228J90336J99572l33313K12139J20890N2483m57001O2408
$$ 802610 709617 553389 743725 943297 609984 822123 943013 995496 538495 600903
14720F00903J58223L7800k03638m0224m5301L28127j05945j96083K83568m5994
$$ 600903 759126 796926 593288 553064 507763 835890 729945 533862 817430 771436
14710G71436K20695m40771M42242l14237M4870l7664p0727J51419K2407k49658
$$ 771436 992131 551360 993602 679365 724235 686571 615844 767263 789670 540012
14700E40012M6721L74080m54892L04218j73994R3995j61036N07123j88218m3838
$$ 540012 586733 960813 505921 810139 636145 730140 569104 1076227 888009 844171
14690H44171o9178K45247j282k65943n0546J36816K24059m3417l21862J75944
$$ 844171 774993 1020240 1018958 753015 702469 839285 1063344 1019927 698065 874009
14680H74009l3094N6829J21696m66326M68697o1429l18847J69679k18103R5320
$$ 874009 840915 897744 1019440 553114 1021811 960382 641535 811214 593111 688431
14670F88431L52953m0906o7011q1724K71985k40824K79267m1930l40323O4438
$$ 688431 1041384 1000478 933467 851743 1123728 882904 1162171 1120241 779918 844356
14660H44356J52136P3470J07868k87320L94020j20310l80575K87425k677j07314
$$ 844356 996492 1069962 1177830 890510 1284530 1164220 783645 1071070 1068393 961079
14650I61079k17677L71468k56737J21217P9671M7906j67692L19748k04982J95538
$$ 961079 743402 1114870 858133 979350 1059021 1106927 939235 1258983 1054001 1249539
14640A249539j52611J56787O006j25837j47234m5642L65381j08700K28256l63194
$$ 1249539 1096928 1253715 1259721 1133884 986650 941008 1306389 1197689 1425945 1062751
14630A062751j14847J61568K99829k34147J36890l785n9474L06113F36927O45998
$$ 1062751 947904 1109472 1409301 1175154 1312044 1308259 1248785 1554898 636927 1282925
14620A282925J75025Q9750l92056L33145m9602j57799J57098l24590L57255j02905
$$ 1282925 1457950 1547700 1155644 1488789 1439187 1281388 1438486 1113896 1471151 1368246
14610A368246k97229N06795l71470K56704N6320m4503J20146O8617r5606j96147
$$ 1368246 1071017 1577812 1206342 1463046 1519366 1474863 1595009 1663626 1568020 1371873
14600A371873J48276j04973J10272k64889l4034M59706K3179k28943M281M13700
$$ 1371873 1520149 1415176 1525448 1260559 1226525 1686231 1709410 1480467 1484748 1898448
14590A898448k71949P928K32724o1301k63547P40K10944q2899L43168n00497J69159
$$ 1898448 1626499 1634427 1867151 1805850 1542303 1543043 1753987 1671088 2014256 1513759 1682918
14579A682918L90943k11766J69257q3843J21498l94417K65153J20052r0670J86235
$$ 1682918 2073861 1862095 2031352 1947509 2069007 1674590 1939743 2059795 1969125 2155360
14569B155360k49178K60748j17202M12499j62480K6434m7609K1474L60363k9187
$$ 2155360 1906182 2166930 2049728 2462227 2299747 2326181 2278572 2300046 2660409 2631222
14559B631222R0155j60491K16587o4252J76142K64553M10187O48204N70639R98819
$$ 2631222 2721377 2560886 2777473 2713221 2889363 3153916 3564103 4212307 4782946 5781765
14549E781765J678496M788660J0268808J7458145L51977A8257370q857732m383220
$$ 5781765 7460261 12248921 22517729 39975874 40327851 18257370 9399638 5016418
14541E016418k016413r46896r5758R6193j04876j32183j07534N9521K29391p9769
$$ 5016418 3000005 2053109 1957351 2053544 1948668 1816485 1708951 1768472 1997863 1918094
14531A918094L7771o2969j16685L38573J64548j19230J46201k20364O9774l9651
$$ 1918094 1955865 1892896 1776211 2114784 2279332 2160102 2306303 2085939 2155713 2116062
14521B116062j30755N89578J19339j80473l55257L99715k44834K08631J28962
$$ 2116062 1985307 2574885 2694224 2513751 2158494 2558209 2313375 2522006 2650968
14512B650968l07443K4848p1161J90826J17450L658J14367N5727K24442j20698
$$ 2650968 2343525 2368373 2297212 2488038 2605488 2609146 2723513 2779240 3003682 2882984
14502B882984K02299l10967j29149M44856j87959K10539j3419N0706O2872J84176
$$ 2882984 3085283 2774316 2645167 3090023 2902064 3112603 3099184 3149890 3212762 3396938
14492C396938k21626k36964O8172J12861M78712J35351l38633P5695J68721j15243
$$ 3396938 3175312 2938348 3006520 3119381 3598093 3733444 3394811 3470506 3639227 3523984
14482C523984J45299k2399L29505l97478k9302j14978M71162j03307K03112K3975
$$ 3523984 3669283 3646884 3976389 3578911 3549609 3434631 3905793 3802486 4005598 4029573
14472D029573r3470k82786J58604L32488j19044K00833k34879K70712k51052L94842
$$ 4029573 3936103 3653317 3811921 4144409 4025365 4226198 3991319 4262031 4010979 4405821
14462D405821k33024M43210j38434K37921J22976m01005M19643r424m02120K99017
$$ 4405821 4172797 4616007 4477573 4715494 4838470 4437465 4857108 4847684 4445564 4744581
14452D744581L18065o7789r0809K95514r7715K68890n93584L81631N0882J4286
$$ 4744581 5062646 4994857 4904048 5199562 5101847 5370737 4777153 5158784 5209666 5223952
14442E223952L96318K14890j31593k7831K12705N714N3919L42479l30107M27309
$$ 5223952 5620270 5835160 5703567 5675736 5888441 5894155 5948074 6290553 5960446 6387755
14432F387755k22938K21833j894K96811m6377J94000j95917P21172j31227M6803
$$ 6387755 6164817 6386650 6384756 6681567 6635190 6829190 6633273 7354445 7223218 7270021
14422G270021k43673M5754M48500J81194k55553M84605L6856J86145l33039K54297
$$ 7270021 7026348 7072102 7520602 7701796 7446243 7930848 7967704 8153849 7820810 8075107
14412H075107M92118O9478k57623J15908K71783j30712N00444J16401j26823M05416
$$ 8075107 8567225 8636703 8379080 8494988 8766771 8636059 9136503 9252904 9126081 9531497
14402I531497n8162J0422M57939n0656J98044L95902O4376J74292K22026L96645
$$ 9531497 9473335 9483757 9941696 9891040 10089084 10484986 10549362 10723654 10945680 11342325
14392A1342325L4481J23100K35198J75510R6934j83098M94992K52487J07378M91563
$$ 11342325 11376806 11499906 11735104 11910614 12007548 11824450 12319442 12571929 12679307 13170870
14382A3170870K01768K18089J10429M05190P093M82782L68486L73147J67836K68125
$$ 13170870 13372638 13590727 13701156 14106346 14113439 14596221 14964707 15337854 15505690 15773815
14372A5773815J99317L18570L60129N11932P1520M29209O45208P6515N41647N29703
$$ 15773815 15973132 16291702 16651831 17163763 17235283 17664492 18309700 18386215 18927862 19457565
14362A9457565N73098J33074K4855Q46590L63315N88320P84858K96894L63464
$$ 19457565 20030663 20163737 20188592 21035182 21398497 21986817 22771675 23068569 23432033
14353B3432033Q43057J64729Q78362Q23573M16494P26386P04562O97873R62301
$$ 23432033 24275090 24439819 25318181 26141754 26558248 27284634 27989196 28687069 29649370
14344B9649370L68650R60181O84029J231065O14752R68796P20698J223844R88464
$$ 29649370 30018020 30978201 31662230 32893295 33508047 34476843 35197541 36421385 37409849
14335C7409849J258528P51756J421862J321123J206253J254025J567083J889748
$$ 37409849 38668377 39420133 40841995 42163118 43369371 44623396 46190479 48080227
14327D8080227Q68363J586952J773586K148463J950293J459281K275879J872067
$$ 48080227 48948590 50535542 52309128 54457591 56407884 57867165 60143044 62015111
14319F2015111K694685K096263K499199K872542K586116K369744L774194L395172
$$ 62015111 64709796 66806059 69305258 72177800 74763916 77133660 80907854 84303026
14311H4303026K970367L693480L945347M219697M170461M669212N016540N029040
$$ 84303026 87273393 90966873 94912220 99131917 103302378 107971590 112988130 118017170
14303A18017170N378919N974115O187315O598640O701197P557092Q046331Q110684
$$ 118017170 123396089 129370204 135557519 142156159 148857356 156414448 164460779 172571463
14295A72571463R051853R234170J0110503J0176557J1055550J1901166J2366796
$$ 172571463 181623316 190857486 200967989 211144546 222200096 234101262 246468058
14288B46468058J2416421J3520903J3596452J4273846J3871644J5044854J4361090
$$ 246468058 258884479 272405382 286001834 300275680 314147324 329192178 343553268
14281C43553268J4698022J4151089J3417579J2918128J1930894J1005941R968681
$$ 343553268 358251290 372402379 385819958 398738086 410668980 421674921 431643602
14274D31643602P654784N224779q07270k741623n39675r19533m762559m789485
$$ 431643602 439298386 444523165 443715895 440974272 440434597 439515064 434752505 429963020
14266D29963020o445206r018490j0989042j2362435j3761873j4359930j5055150
$$ 429963020 423517814 414499324 403510282 391147847 377385974 363026044 347970894
14259C47970894j4994451j5296373j4785216j4666910j4460834j2885651j2839082
$$ 347970894 332976443 317680070 302894854 288227944 273767110 260881459 248042377
14252B48042377j2219555j1872616j1218419j0834820r994753r858320q643298
$$ 248042377 235822822 223950206 212731787 201896967 191902214 182043894 173400596
14245A73400596q215196p771258p534178p402077o519146n985024o042076n396903
$$ 173400596 165185400 157414142 149879964 142477887 135958741 129973717 123931641 118534738
14237A18534738n015828n330613m448597m589088m035528l662601l572248l233758
$$ 118534738 113518910 108188297 103739700 99150612 95115084 91452483 87880235 84646477
14229H4646477l605520l422333k648624l425991k263710k418338k520738k269817
$$ 84646477 81040957 77618624 74970000 71544009 69280299 66861961 64341223 62071406
14221F2071406j935224j834560k143690k095813j662188j736120j587711j288551
$$ 62071406 60136182 58301622 56157932 54062119 52399931 50663811 49076100 47787549
14213D7787549j200780j705851j527676j410803r28411j162989n08663j567286
$$ 47787549 46586769 44880918 43353242 41942439 41014028 39851039 39342376 37775090
14205C7775090r23361j415657p44406r40487q55743o04878j096258p36164j268307
$$ 37775090 36851729 35436072 34691666 33751179 32895436 32290558 31194300 30458136 29189829
14196B9189829m39448n66815j102638l55835n73002o52908o96204n36778q59738
$$ 29189829 28750381 28183566 27080928 26725093 26152091 25499183 24802979 24266201 23406463
14187B3406463k85851l74447n55608n52107m64981p10388j22778m08598m38084
$$ 23406463 23120612 22746165 22190557 21638450 21173469 20463081 20340303 19931705 19493621
14178A9493621p11482J30645n27548o20432k49438k05941n91070k58365r0o42749
$$ 19493621 18782139 18912784 18385236 17764804 17515366 17309425 16718355 16459990 16459900 15817151
14168A5817151K16224o19660l25694j90889o55464L2867k38282k96348m54496
$$ 15817151 16033375 15413715 15088021 14897132 14241668 14274535 14036253 13739905 13285409
14159A3285409J79112k06311o30952J75678m74898m83633j62089N1169l26357
$$ 13285409 13464521 13258210 12627258 12802936 12328038 11844405 11682316 11733485 11407128
14150A1407128N3050l71723l89597n441K1569n11621J40881j05341j71501p1376
$$ 11407128 11460178 11088455 10698858 10693417 10714986 10203365 10344246 10238905 10067404 9996028
14140I996028p8004l36334j37891k53458r3564J56538n11294J37471l68293m1119
$$ 9996028 9918024 9581690 9443799 9190341 9096777 9253315 8742021 8879492 8511199 8470080
14130H470080J26158l42007m31398J98842N9051k80011L7967j29217k94127J67752
$$ 8470080 8596238 8254231 7822833 8021675 8080726 7800715 7838682 7709465 7415338 7583090
14120G583090l65696M3941l59436J28473J30108n03271M26621l92005R9555k96621
$$ 7583090 7217394 7261335 6901899 7030372 7160480 6657209 7083830 6691825 6791380 6494759
14110F494759k90952L85030m36878L11991k37086l49254R9904n4606j07201o8785
$$ 6494759 6203807 6588837 6151959 6463950 6226864 5877610 5977514 5922908 5815707 5746922
14100E746922J040R8034l13002J06261J49680m66885J2349j36752l1733J42888
$$ 5746922 5747962 5845996 5532994 5639255 5788935 5322050 5334399 5197647 5165914 5308802
14090E308802l42768J36354L5474O5043l79733r8187J83971j85475k20896O3673
$$ 5308802 4966034 5102388 5137862 5202905 4823172 4724985 4908956 4723481 4502585 4566258
14080D566258j25104J27166j14226j08324K19039n48613L52767m4092j37981k81634
$$ 4566258 4441154 4568320 4454094 4345770 4564809 4016196 4368963 4324871 4186890 3905256
14070C905256K29413j5168o2738l35928K47284K24467j63128l95349m6710L545
$$ 3905256 4134669 4119501 4056763 3720835 3968119 4192586 4029458 3634109 3587399 3590944
14060C590944M10577q4902K84501l4991k18267m23149L25726k59962j84928N3185
$$ 3590944 4001521 3916619 4201120 4166129 3947862 3524713 3850439 3590477 3405549 3458734
14050C458734k43080J2187r3581O4612l3918J14413M8295n5913l20446J27375
$$ 3458734 3215654 3227841 3134260 3198872 3164954 3279367 3327662 3271749 2951303 3078678
14040C078678k17959k08829M75964j19126k49448p8069R4540L49059j89322L06610
$$ 3078678 2860719 2651890 3127854 3008728 2759280 2681211 2775751 3124810 2935488 3242098
14030C242098m23442K43674l92295K93175m92856P5266j46981M19568n10483K19112
$$ 3242098 2818656 3062330 2670035 2963210 2470354 2545620 2398639 2818207 2307724 2526836
14020B526836J46888k27315K41076k70972l31015L21814n2065p070k96116R5463
$$ 2526836 2673724 2446409 2687485 2416513 2085498 2407312 2355247 2348177 2052061 2147524
14010B147524K7682Q4165q1835J94010J396k00297Q0907k04464j73189L46545
$$ 2147524 2175206 2259371 2177536 2371546 2372942 2172645 2253552 2049088 1875899 2222444
14000B222444j5654n2498o6479j50041k67510L32756J05940l588J39005o3685
$$ 2222444 2206790 2154292 2087813 1937772 1670262 2003018 2108958 2105370 2244375 2180690
13990B180690M40794N73743L355971Q911437J8011433R726232k0194680j1223251
$$ 2180690 2621484 3195227 6551198 15462635 33474068 43200300 23005620 11782369
13982A1782369m525485k023571r61560o09796k75106k38245k95656J47399m5311
$$ 11782369 7256884 5233313 4271753 3661957 3386851 3148606 2852950 3000349 2955038
13973B955038r8227l80516K21587l01961K8485j62346m5057j39277k09954L72614
$$ 2955038 2856811 2476295 2697882 2395921 2424406 2262060 2217003 2077726 1867772 2240386
13963B240386l21685K18079p0764J03890k00045l6831o5470J26941n2720o7527
$$ 2240386 1918701 2136780 2066016 2169906 1969861 1933030 1867560 1994501 1941781 1874254
13953A874254J17210j16099j55544L50743m52866j31548K57129m1632K43956K8725
$$ 1874254 1991464 1875365 1719821 2070564 1617698 1486150 1743279 1701647 1945603 1974328
13943A974328l50949K10767l49700M22772k59532N7562l76166Q8476J03195j95239
$$ 1974328 1623379 1834146 1484446 1907218 1647686 1705248 1329082 1417558 1520753 1325514
13933A325514L89075j36170J64419n37284L97314K03313m10446Q2498j54569N06602
$$ 1325514 1714589 1578419 1742838 1205554 1602868 1806181 1395735 1478233 1323664 1830266
13923A830266k38472m9279M7421r8864L0385p812m3456k63772P529k3122P2152
$$ 1830266 1591794 1542515 1589936 1491072 1521457 1513645 1470189 1206417 1213946 1190824 1262976
13912A262976N612j5834j91131M96527N8305m34435R6561J89522K63934n01695
$$ 1262976 1268588 1252754 1061623 1558150 1616455 1182020 1278581 1468103 1732037 1230342
13902A230342N3891K45143l0012l27305K93338j47956Q0922j77924j49792K80282
$$ 1230342 1284233 1529376 1499364 1172059 1465397 1317441 1398363 1220439 1070647 1350929
13892A350929O2275K12771k26100k96569o074O8447j36255K16914J54347l94167
$$ 1350929 1413204 1625975 1399875 1103306 1097232 1165679 1029424 1246338 1400685 1006518
13882A006518N3371k41937K47832J10319n3437j72668n8054L62102k57412j3433
$$ 1006518 1059889 817952 1065784 1176103 1122666 949998 891944 1254046 996634 983201
13872I83201J69409K70464j59995l86673R1722L31316j85073q5472Q6904j29904
$$ 983201 1152610 1423074 1263079 876406 968128 1299444 1114371 1028899 1115803 985899
13862I85899M9674k05590j65788K88949K80853o9681j43997J97877l22193K37241
$$ 985899 1035573 829983 664195 953144 1233997 1164316 1020319 1218196 896003 1133244
13852A133244m4425l15859K33415M3238R6424n65593J85051L28283p9414j76352
$$ 1133244 1088819 772960 1006375 1049613 1146037 580444 765495 1093778 1014364 838012
13842H38012j5325J79415K3198m93080L38639J56673J88978n29773L6965J62480
$$ 838012 822687 1002102 1025300 532220 870859 1027532 1216510 686737 723702 886182
13832H86182L50177k31141r8653K24811k71324O0204j75493k12266K62110r1974
$$ 886182 1236359 1005218 906565 1131376 860052 920256 744763 532497 794607 702633
13822G02633o4063L94559n05236K64328o1570J9768J03058L50320k71311l38122
$$ 702633 638570 1033129 527893 792221 730651 750419 853477 1203797 932486 594364
13812E94364O6472K27356j72327J10146n3918N559J5660l3011K21892l0275j74921
$$ 594364 660836 888192 715865 826011 772093 777652 793312 760301 982193 951918 776997
13801G76997j46572J66072q3948J56941l16175p3996L56053J9924p5892J5195
$$ 776997 630425 796497 712549 869490 553315 479319 835372 855296 779404 794599
13791G94599l77001N01715j82809M5206L4460K70541m06741P8076p8851K15417
$$ 794599 417598 919313 736504 781710 816170 1086711 679970 758046 679195 894612
13781H94612k71751O7423K497P0453J61427l67497K18379l52278N50751l15885
$$ 894612 622861 690284 692781 763234 924661 557164 775543 423265 974016 658131
13771F58131K40915j78688K13646k34564J82430j86440k10852B25784L14632J56526
$$ 658131 899046 720358 934004 699440 881870 695430 484578 225784 540416 696942
13761F96942j53809R0405R0015L61228l99697j68905p5373M25905l31570j62862
$$ 696942 543133 633538 723553 1084781 685084 516179 440806 866711 535141 372279
13751C72279J70758L6033J49452k04809K5691p1037K03227J15207n593k17382
$$ 372279 543037 579070 728522 523713 549404 478367 681594 796801 791208 573826
13741E73826j52791K14236n9070J96860C81897L57640C36116J88671k09243N58320
$$ 573826 421035 635271 576201 773061 381897 739537 336116 524787 315544 873864
13731H73864D11639r1906K36821q4516j25845J26341r2997K40842q321N5502j48336
$$ 873864 411639 319733 556554 472038 346193 472534 379537 620379 612058 667560 519224
13720E19224r9004L49650j20674k2367B20038N9629K06586O5828j29344J81518
$$ 519224 420220 769870 649196 626829 220038 279667 486253 552081 422737 604255
13710F04255k5978N8107j43977j14586J20547K86877B62446J72326p1319J88704
$$ 604255 578277 636384 492407 377821 498368 785245 262446 434772 363453 552157
13700E52157J21212l08499R8225L82926k86709J21298K45072A26739M69104k02529
$$ 552157 673369 364870 463095 846021 559312 680610 925682 126739 595843 393314
13690C93314K58351l17576j25949K16340l9695j194K52160l8444J60468l77139
$$ 393314 651665 334089 208140 424480 384785 383591 635751 597307 757775 380636
13680C80636l4724J32465J26064k57115K03449B40767K08091K14332k58477h903
$$ 380636 345912 478377 604441 347326 550775 240767 448858 663190 404713 -8903
13669C64296H3743M01631A26171J61025o2976O1856L53072j35313k14536j8437
$$ 364296 83743 485374 126171 287196 224220 286076 639148 503835 289299 270862
13659B70862J64823K0719j56149j7114J17125N6927K0886j95223k9406k5912J80384
$$ 270862 435685 456404 300255 283141 400266 457193 478079 282856 253450 227538 407922
13648D07922L07472j43547q3571p7420j21738N8437m7578M38840C35311j44965
$$ 407922 715394 571847 488276 410856 289118 347555 299977 738817 335311 190346
13638A90346K15032J69547J46551o5747k95575n7017J95659L2545J47123k19659
$$ 190346 405378 574925 721476 655729 360154 303137 498796 531341 678464 458805
13628D58805Q8585q1698J3685j73620m2527K17999j02027O9684Q8076j0989j78286
$$ 458805 547390 465692 479377 305757 263230 481229 379202 448886 536962 525973 347687
13617C47687M7253o3836j7173J29840Q317H9678J06837K08142O2153q1978n263
$$ 347687 394940 331104 313931 443771 452088 89678 196515 404657 466810 384832 379569
13606C79569j1666R0319l001j62048F0906J17678K25028M476A82754K65018q2766
$$ 379569 367903 458222 455221 293173 60906 178584 403612 408088 182754 447772 365006
13595C65006J91279B33395L42030j35997e9390D78968k07554J39423l9178J15416
$$ 365006 556285 233395 575425 439428 -59390 478968 271414 410837 371659 487075
13585D87075A74330L67951j30202j55124r8615E8490K24214R8826A28609J90537
$$ 487075 174330 542281 412079 256955 158340 58490 282704 381530 128609 319146
13575C19146J32816J31065j79103j23559R0625F7087J75491O1700O80l7749A05561
$$ 319146 451962 583027 403924 280365 370990 67087 242578 304278 304958 267209 105561
13563C03161O7192A20248N9503M66537k79872J39893k04126A5361R0434J53040
$$ 303161 370353 120248 179751 646288 366416 506309 302183 15361 105795 258835
13553B58835M3989O9079l7740N9039j70278l6424p8010J00426J01274A00937K11584
$$ 258835 302824 371903 334163 393202 222924 186500 108490 208916 310190 100937 312521
13542C12521j42592D0189M67730B22364J7111M6446h900B65801n5054O5325R5593
$$ 312521 169929 40189 507919 222364 239475 285921 -8900 265801 210747 276072 371665
13531C71665K4497j70310J58240A31698J48329K58108k00107N5834P5702A96351
$$ 371665 396162 225852 384092 131698 280027 538135 338028 393862 469564 196351
13520D11354m1200J2340j81588K99082J2750B15430L9166A12897K4650K01776
$$ 411354 370154 382494 200906 499988 512738 215430 254596 112897 137547 339323
13510C39323b6684E3550L10404L75369C26381k7211L8992A40207J96943j02212
$$ 339323 -26684 53550 363954 739323 326381 299170 338162 140207 337150 234938
13500B34938K35109m4487K39863A54364J04650P3332j21435J27048q6823g0638
$$ 234938 470047 425560 665423 154364 259014 332346 210911 337959 251136 -70638
13489A21663m3978K72481j32600p0117j751k3190K65652j5919J94745k47618j0588
$$ 121663 77685 350166 217566 147449 145698 122508 388160 372241 566986 319368 308780
13478C08780J65340K25263A6534J19883J53392J63663B11777H459R7392L37599
$$ 308780 474120 699383 16534 136417 289809 453472 211777 8459 105851 443450
13468D43450A25171J91200j55592O05n3899P3962J79650l0853J04848k09888J09783
$$ 443450 125171 316371 160779 161384 107485 181447 361097 330244 435092 225204 334987
13457C34987F6968K83872A27994Q4307J83203l7795l4195k6093r409j5017b19193
$$ 334987 66968 350840 127994 212301 395504 357709 323514 297421 288012 272995 -219193
13445B56274c05838A663a5667C61111b58313G3539c6052i73D01606P929j39576
$$ 256274 -305838 1663 -15667 361111 -258313 73539 -36052 -973 401606 409535 269959
13434B69959M3684C421R9106J11926l3707d2951G05N4009P3999F3967N0585J57469
$$ 269959 313643 3421 102527 214453 180746 -42951 705 54714 128713 63967 114552 272021
13422B72021j06385J12603L0714e0901A07703j9275K73680o4619H9036J28423
$$ 272021 165636 278239 308953 -50901 107703 88428 362108 297489 89036 217459
13412B17459n1404l2603L17123j07466a5273B83071J32399k1799A69316c2341
$$ 217459 166055 133452 450575 343109 -15273 283071 415470 393671 169316 -32341
13401A4984M60619B25084a14106E80552B19338b17670D84664F5729Q0031J18168
$$ 14984 475603 225084 -114106 580552 219338 -217670 484664 65729 145760 263928
13391B63928J90270a67974a3745l6921j47601a8345D42398A41134L37903A24440
$$ 263928 454198 -167974 -13745 -50666 -198267 -18345 442398 141134 479037 124440
13380A82250J09868A10765L32635D2853N7602J37029J8673k954p4000J52E9151
$$ 182250 292118 110765 443400 42853 100455 237484 256157 253203 179203 179355 59151
13368A77009M78424B14693K85936j46367J19942E0739k568L48349j17664c9858
$$ 177009 655433 214693 500629 354262 474204 50739 48171 396520 278856 -39858
13357A40147C670J66759K0420J37196R5454L5593A19705L71086B08250c5776D44292
$$ 140147 3670 170429 190849 328045 423499 459092 119705 490791 208250 -35776 444292
13345B90125j37935M4919Q7640k7638O181J34451N2422A33840K07940M1649A46846
$$ 290125 152190 197109 284749 257111 263292 397743 450165 133840 341780 383429 146846
13333C42645j16799J45961n0449P8353f1679D09006O8338A73168a34458B22699
$$ 342645 225846 371807 321358 399711 -61679 409006 477344 173168 -134458 222699
13322A05221Q7007O668K60671J2928j28350P9058j47059a21833R613A88570J4704
$$ 105221 192228 198896 459567 472495 344145 423203 276144 -121833 -112220 188570 203274
13311B03274q5228A2668f85B08175q4389d5683E55922H699c6634F4434M80675
$$ 203274 118046 12668 -685 208175 123786 -45683 555922 8699 -36634 64434 545109
13300E45109a47630B23061q1849F7833K41653I5227j8478k7334L8682L18806P9165
$$ 545109 -147630 223061 141212 67833 309486 95227 76749 49415 88097 406903 486068
13289D86068a48861n144B19870d3092D25850A97701J53902B1412L95567j49523
$$ 486068 -148861 -154005 219870 -43092 425850 197701 351603 21412 416979 267456
13279B67456F2695K46555j6811q6922J24858G7522a568q9614C3186J18559a07380
$$ 267456 62695 309250 292439 205517 330375 77522 -1568 -91182 33186 151745 -107380
13267I1912l0399k8359R0612B577h8664A94425p4799B3903L97605j91756F333
$$ 91912 61513 33154 123766 2577 -88664 194425 119626 23903 421508 229752 6333
13255g6078A56505O8741k1913l0316Q1032A5982a16676A29514B8186J82191j1512
$$ -76078 156505 225246 203333 173017 254049 15982 -116676 129514 28186 210377 198865
13244A98865P1562F0862f332k38063l0614B00432H8459c44821d9794A23011o55
$$ 198865 270427 60862 -6332 -244395 -275009 200432 88459 -344821 -49794 123011 122356
13233A22356J04976L6234A16311b73353J14100A25226P215a00334A02852K50718
$$ 122356 227332 263566 116311 -273353 -159253 125226 132441 -100334 102852 353570
13223C53570A33540p98J4499K00539D7419b25256h1163I2741j5175D744K68677
$$ 353570 133540 132742 147241 347780 47419 -225256 -81163 92741 77566 4744 273421
13212B73421k6394c1938C94238G4250L44183A6112J94445b8640J1309q8217i418
$$ 273421 247027 -31938 394238 74250 418433 16112 210557 -28640 -17331 -105548 -9418
13200D7226J43420R4525B9340d6547H5303O5560M709F6674J19308N7308D798K13269
$$ 47226 190646 285171 29340 -46547 85303 150863 155572 66674 185982 243290 4798 218067
13188B18067O8311f8395H6433a85433B29113B8162K17619F8679c44012A4842a14504
$$ 218067 286378 -68395 86433 -185433 229113 28162 245781 68679 -344012 14842 -114504
13176G1458a00513E3336b24175C6666h1432B50252N8217a10937M9064A52014d6214
$$ 71458 -100513 53336 -224175 36666 -81432 250252 308469 -110937 -61873 152014 -46214
13164c6398A38557c9512B99241F7985b1142l5348G2202L19504L0223f3931Q731
$$ -36398 138557 -39512 299241 67985 -21142 -56490 72202 391706 421929 -63931 -55200
13153e5200A06213m5557A4948K78699D8909J66510p7027a01502a5174I9905M2161
$$ -55200 106213 60656 14948 293647 48909 215419 138392 -101502 -15174 99905 142066
13142A42066G0842e2963E3703L53495F5344a65362H6396K47919c32371A73636
$$ 142066 70842 -52963 53703 407198 65344 -165362 86396 334315 -332371 173636
13131C51926C3551a32771I8022Q3505a63971e47p2447A69127G8369Q8206c5366
$$ 351926 33551 -132771 98022 181527 -163971 -547 -72994 169127 78369 166575 -35366
13119A06538a68464A22497e7039k54932E4548b29078a07778C78062a39232L5113
$$ 106538 -168464 122497 -57039 -311971 54548 -229078 -107778 378062 -139232 -104119
13109a04119A52368C7783R0708N1402j0078b02848A43321F9801b0354A85037k0327
$$ -104119 152368 37783 128491 179893 169815 -202848 143321 69801 -20354 185037 164710
13098A64710m9776a62141P4704j39018k5492A62228J526i0763B84302a03222B32879
$$ 164710 114934 -162141 -87437 -226455 -251947 162228 163754 -90763 284302 -103222 232879
13086B43584j3591g6621B03134B1033b1533j47928c0709A92302a59378B02579
$$ 243584 229993 -76621 203134 21033 -21533 -169461 -30709 192302 -159378 202579
13075f5942C17248J54309A33183F1418b76624C1939K14559N0294a70056F5419
$$ -65942 317248 471557 133183 61418 -276624 31939 246498 296792 -170056 65419
13064A11654N6874J32179l8042A0874K08829q2428c168j94811C48497j10753a21403
$$ 111654 168528 300707 262665 10874 219703 137275 -3168 -197979 348497 237744 -121403
13052A70007a59048b4801D5561Q5153K51284q6260m9527J06812A13117g912A35657
$$ 170007 -159048 -24801 45561 130714 381998 295738 246211 353023 113117 -7912 135657
13040A00411O4749G5721e17I7981g5703B3339i948A67779a71816I3398l5885K9916
$$ 100411 165160 75721 -517 97981 -75703 23339 -9948 167779 -171816 93398 57513 87429
13028H7429h5168A87788c4124j91749D9998a3758B04808h0601p3943C18249a21482
$$ 87429 -85168 187788 -34124 -225873 49998 -13758 204808 -80601 -154544 318249 -121482
13016A86246K7261G6448A3426L69411C489c9702B80170D1280N2963O614a9695
$$ 186246 213507 76448 13426 382837 3489 -39702 280170 41280 94243 100857 -19695
13004B05018B9369O474N3213j1214a07319C0184P3610a95993A6363L08790l5400
$$ 205018 29369 35843 89056 77842 -107319 30184 103794 -195993 16363 325153 289753
12993B89753J14956j80998P8447m3180q3739a7061A24992J8017b0648G7818J95649
$$ 289753 404709 223711 302158 258978 175239 -17061 124992 143009 -20648 77818 273467
12982B73467d6271E0958M0940L5231K94559F2133a5713j87151A64443d533k12502
$$ 273467 -46271 50958 91898 127129 421688 62133 -15713 -202864 164443 -4533 -217035
12971b17035b2590A06357O839N461J72050A4587i1502n06B09896K5182q9114K29760
$$ -217035 -22590 106357 113196 118657 290707 14587 -91502 -92008 209896 235078 145964 375724
12959C75724A82400e7546j10310B76299G128f3323k70388B21569r5371L8435M9279
$$ 375724 182400 -57546 -167856 276299 7128 -63323 -333711 221569 126198 164633 213912
12948B13912K31541A90166a32478C99563G2246a28862N1248j02043l4892B47412
$$ 213912 445453 190166 -132478 399563 72246 -128862 -77614 -179657 -214549 247412
12937G2036A5220a91756Q020d002k01967g5668A32934o2147K25474j37112a67648
$$ 72036 15220 -191756 -183736 -4002 -205969 -75668 132934 70787 296261 159149 -167648
12925b63576a29141p9815C8721Q9988b98998r327a2064j10554N3695I1303R5020
$$ -263576 -129141 -208956 38721 128709 -298998 -308325 -12064 -122618 -68923 91303 186323
12914A86323J04962A7515J58926N38a49651p1365A02161R4058b63957G4101a07360
$$ 186323 291285 17515 176441 176979 -149651 -221016 102161 196219 -263957 74101 -107360
12902I2903C3807c03960F3261b40630c4634G593J00665A4764g4588A22048M3998
$$ 92903 33807 -303960 63261 -240630 -34634 7593 108258 14764 -74588 122048 166046
12891A66046g0883m2195N2776J6673A07410a20163B5616a25795B0552a74985C85753
$$ 166046 -70883 -113078 -60302 -43629 107410 -120163 25616 -125795 20552 -174985 385753
12879F3088e2513A49211K701c65465c9753B74954A27050d5358m3409a9749B08473
$$ 63088 -52513 149211 151912 -365465 -39753 274954 127050 -45358 -88767 -19749 208473
12867A77815n2920J15116E2188a02417m6132A93386d12573H9764a75521f1871
$$ 177815 124895 240011 52188 -102417 -148549 193386 -412573 89764 -175521 -61871
12856h9244E8407N6750Q4671G3012k8181K2837R347P2443f4091k0545A59450K18858
$$ -89244 58407 115157 199828 73012 44831 67668 77015 149458 -64091 -84636 159450 378308
12844C78308j13783a14509A2277J21720d7897F5634M1761e2656A12862J28984
$$ 378308 264525 -114509 12277 133997 -47897 65634 107395 -52656 112862 241846
12834B41846I8973a52959N6654A4091J32473o2520Q5315b9739I109O4681c5896
$$ 241846 98973 -152959 -96305 14091 146564 84044 169359 -29739 9109 73790 -35896
12822b000A93673a8907B6309a07038d6854B81615a23285L1334d1225G3454a45845
$$ -2000 193673 -18907 26309 -107038 -46854 281615 -123285 -91951 -41225 73454 -145845
12810a50858k0742A06242B0225J11601m9761a14740k23221a52204q1825k7503
$$ -150858 -171600 106242 20225 131826 82065 -114740 -337961 -152204 -234029 -261532
12800b61532A90861E5815c433A23881a1666j51205b4467B2789J71126c17699A15147
$$ -261532 190861 55815 -3433 123881 -11666 -162871 -24467 22789 193915 -317699 115147
12788b379k39983B11111B6255J80793H9482l8451b1958A75987a0215n9895A86082
$$ -2379 -242362 211111 26255 207048 89482 51031 -21958 175987 -10215 -70110 186082
12776a74154P0516G3835A3588K39425h902F5789h0709B69836A23592b8383r1691
$$ -174154 -103638 73835 13588 253013 -8902 65789 -80709 269836 123592 -28383 -120074
12765a20074A0422g1519j05755M3648B23247j4915n6354m5575a90019C4020N436
$$ -120074 10422 -71519 -177274 -133626 223247 208332 151978 106403 -190019 34020 39456
12754C9456R6458a99660A30178C1545M0725J08579G2309a4735j25825A05622b00529
$$ 39456 135914 -199660 130178 31545 72270 180849 72309 -14735 -140560 105622 -200529
12742e24341C21519j09581J42959A43663O9036p1375D661Q6212a10579A37164
$$ -524341 321519 211938 354897 143663 212699 141324 4661 90873 -110579 137164
12731e661A36900E0626J68975b051k46040A16494M1542c55496A41943o0758C6664
$$ -5661 136900 50626 219601 -2051 -248091 116494 158036 -355496 141943 81185 36664
12719A6513b05103d7725n8203C48561A23357n6070j9873K02704h8323A71268H3266
$$ 16513 -205103 -47725 -105928 348561 123357 67287 47414 250118 -88323 171268 83266
12707C40160p0968N966m1666r3611f9191a4686A94510N1298k5466H8258a48729
$$ 340160 269192 275158 233492 139881 -69191 -14686 194510 245808 220342 88258 -148729
12695a00833A57528a18832k41715A96517a72054A07511a18515M1646C28460d3016
$$ -100833 157528 -118832 -360547 196517 -172054 107511 -118515 -76869 328460 -43016
12684d1450k7394C27592j34562p8914f2895A68168Q7554m3552E6824J471K42681
$$ -41450 -68844 327592 193030 114116 -62895 168168 255722 212170 56824 58295 300976
12673C00976a12008j10452C21682I690a29193A28942g2774k12640C87396a34834
$$ 300976 -112008 -222460 321682 9690 -129193 128942 -72774 -285414 387396 -134834
12662a4710A30141j5134N1316b05412c7136H2946B9188K13147H179J54192p5696
$$ -14710 130141 115007 166323 -205412 -37136 82946 29188 242335 8179 162371 86675
12651H6675r879c50114F7109A3749J05426f6412A30678c27836E8828M165B5921
$$ 86675 76796 -350114 67109 13749 119175 -66412 130678 -327836 58828 62993 25921
12639D6007c1327A84622F136a16007A56910M7916c6905l8767C290e8469B80205
$$ 46007 -31327 184622 6136 -116007 156910 204826 -36905 -75672 3290 -58469 280205
12627B50277d3257J033L248A10901b6595A15333b22893A98377I3232L36187c1912
$$ 250277 -43257 -42224 -38976 110901 -26595 115333 -222893 198377 93232 429419 -31912
12615A6727O6938F946a02457k6446C87700j29763a6445B3245J6740J02151Q4712
$$ 16727 83665 6946 -102457 -128903 387700 257937 -16445 23245 39985 142136 226848
12604B26848a15265R456B19072A04722N6141o9635a80413D9516L8976a94688F5671
$$ 226848 -115265 -105809 219072 104722 160863 91228 -180413 49516 88492 -194688 65671
12592D47506E5830J54163i4846C65773C8651d5595G5390b06725R8965D3984M9195
$$ 447506 55830 209993 -94846 365773 38651 -45595 75390 -206725 -107760 43984 93179
12581I3179Q6517a64599J4828I4622i4759j1136d1445J3249C03421a48530B13563
$$ 93179 179696 -164599 -149771 94622 -94759 -105895 -41445 -28196 303421 -148530 213563
12569a23308B74686f5339A05279P089J7390K48930c6528B9205J33640K0718m8810
$$ -123308 274686 -65339 105279 112368 129758 378688 -36528 29205 162845 183563 134753
12558A34753k5327a75217A24842J69296C8705b67347c5923j9003j3047A47821
$$ 134753 109426 -175217 124842 294138 38705 -267347 -35923 -54926 -67973 147821
12547H6252b90662G2571J04617b5389a1888k22717C6004a13411B03672J91448
$$ 86252 -290662 72571 177188 -25389 -11888 -234605 36004 -113411 203672 395120
12537C95120j58578h4660o778b3319A17210K5716F5654b74240B9143P3027K24090
$$ 395120 236542 -84660 -91438 -23319 117210 142926 65654 -274240 29143 102170 326260
12526C26260g436k15983F1374M6177J33983H1033J19460J40156A26184J17096
$$ 326260 -7436 -223419 61374 107551 241534 81033 200493 340649 126184 243280
12516B43280A9886a60386j2970c0777A49146b33605g7367A77430F6338a31358
$$ 243280 19886 -160386 -173356 -30777 149146 -233605 -77367 177430 66338 -131358
12505F2991b64302B07747c20706A47629a2938B23342n6130a67200h0286k12684
$$ 62991 -264302 207747 -320706 147629 -12938 223342 167212 -167200 -80286 -292970
12495b92970A71143J56595F2342a01392A1683d2110j6713Q597r7011B64253B4466
$$ -292970 171143 327738 62342 -101392 11683 -42110 -58823 -50226 -147237 264253 24466
12483g8659B27223a25410A81207A071b30450r430i8286A42450a21537E7525Q0086
$$ -78659 227223 -125410 181207 1071 -230450 -239880 -98286 142450 -121537 57525 137611
12472A37611K27355c1904m1919m2159j12099J02420K2322G1225i3181A40494n6968
$$ 137611 364966 -31904 -73823 -115982 -228081 -125661 -103339 71225 -93181 140494 83526
12461H3526b11861j15205A25187a49857f5741A12328i0574j94054a17796j18897
$$ 83526 -211861 -327066 125187 -149857 -65741 112328 -90574 -284628 -117796 -236693
12451b36693e663j13948o4443h4995A65754c6995n8125H5164f261A46908C6294
$$ -236693 -5663 -119611 -184054 -84995 165754 -36995 -95120 85164 -6261 146908 36294
12439I1676a31503b012j12660o8404C54988c6469j31040e9259F9840k9718a52138
$$ 91676 -131503 -2012 -114672 -183076 354988 -36469 -167509 -59259 69840 40122 -152138
12427I1507a23868j64755C6571a08317a9647q3603B98446g9772k36577c5421B40166
$$ 91507 -123868 -288623 36571 -108317 -19647 -103250 298446 -79772 -316349 -35421 240166
12415a64553B89246g0519a5046I7258k5417C0839i8961C5236b76658a8655p5871
$$ -164553 289246 -70519 -15046 97258 71841 30839 -98961 35236 -276658 -18655 -94526
12404i4526C5561L06703b83612C2162b8874E1125P457f9649e790k66367B09269
$$ -94526 35561 342264 -283612 32162 -28874 51125 58582 -69649 -5790 -272157 209269
12392b22693d2466E7275Q6343a00779k73397E7153f2288j28399b082F167N4116
$$ -222693 -42466 57275 143618 -100779 -374176 57153 -62288 -190687 -2082 6167 60283
12381F0283a04193K7314A47716d117B30403L5335a99076n8722e7956j14553l7780
$$ 60283 -104193 -76879 147716 -4117 230403 265738 -199076 -257798 -57956 -172509 -210289
12370b10289d0780k5422a3236H4156K11907c19462o9801h10A37124a20895C8952
$$ -210289 -40780 -66202 -13236 84156 296063 -319462 -389263 -810 137124 -120895 38952
12358i5675l5080M4859j58392C35473F9434a10249A8577a16988K9541D1577R4507
$$ -95675 -130755 -85896 -244288 335473 69434 -110249 18577 -116988 -87447 41577 136084
12347A36084o6990h0102A10031K075a79894Q4615D9863M2645c56337A1402K2202
$$ 136084 69094 -80102 110031 112106 -179894 -95279 49863 92508 -356337 11402 33604
12336C3604r623J58424a4251E1531J04173R7641K46940j10333H0049L00530b7015
$$ 33604 23981 182405 -14251 51531 155704 253345 500285 389952 80049 380579 -27015
12324e2917p393j89618J5218F6244M8767l9239c41430a06762B82026a31031M0579
$$ -52917 -60310 -249928 -234710 66244 115011 75772 -341430 -106762 282026 -131031 -90452
12313i0452A9979a9478E2317a63110A35738b6497r558J449j4435A19667c63450
$$ -90452 19979 -19478 52317 -163110 135738 -26497 -36055 -34606 -49041 119667 -363450
12301e6160j7798B01943o7044l5935i1971m4672c7072p9322A19085m6613K3772
$$ -56160 -73958 201943 134899 98964 -91971 -136643 -37072 -116394 119085 72472 96244
12290I6244a86886M6301C8690i5932a9699A55366f9900A07938N6855E2671K82418
$$ 96244 -186886 -140585 38690 -95932 -19699 155366 -69900 107938 164793 52671 335089
12279C35089q0056K8953j09225h6498F8212K5044a17684H7705R2319K34873d9431
$$ 335089 255033 283986 174761 -86498 68212 93256 -117684 87705 180024 414897 -49431
12267E89698A16310m1974h989E7023Q1568D9567e1574k46356a16409b2113B0569
$$ 589698 116310 74336 -8989 57023 138591 49567 -51574 -297930 -116409 -22113 20569
12255B29765K5283J0942j01063a16684j43591C41332A4940J95629D4891O495K07542
$$ 229765 255048 265990 164927 -116684 -260275 341332 14940 210569 44891 51386 258928
12244B58928A27772a70310A13221O7328p5314j3910a19235D29380A17754b30423
$$ 258928 127772 -170310 113221 180549 105235 91325 -119235 429380 117754 -230423
12233a10813B27280O2965A44417L3681C7355O1193M8175R4143J61420A75331R4002
$$ -110813 227280 290245 144417 178098 37355 98548 146723 240866 402286 175331 269333
12222B69333e6344j99885C37230j24981H3599P2419n3707J01347N0407F4330K99461
$$ 269333 -56344 -256229 337230 212249 83599 156018 102311 203658 254065 64330 363791
12211C63791A0094K19434c7525A21306b7446j14327C55136q2604e526B97123C6238
$$ 363791 10094 229528 -37525 121306 -27446 -141773 355136 272532 -5526 297123 36238
12199A3364J18327K40276D7343a4268D01897A84182J44973A53345f8612D24047
$$ 13364 131691 371967 47343 -14268 401897 184182 329155 153345 -68612 424047
12188D40828a69260A04703D7899k070a00403B7089a04449N607C96276j50827f8192
$$ 440828 -169260 104703 47899 45829 -100403 27089 -104449 -98842 396276 245449 -68192
12176c92255C67240G2864J19416F9790N6166l7153g14o417A87655B1742J50784
$$ -392255 367240 72864 192280 69790 125956 88803 -714 -7131 187655 21742 172526
12165A72526K0977c9313j25090e448A25245J02668I2611J33112q2197C9155d1509
$$ 172526 193503 -39313 -164403 -5448 125245 227913 92611 225723 143526 39155 -41509
12153a93273A08238O4782G9194b12841F9858d5985E5863a37701E9650a4606B93960
$$ -193273 108238 173020 79194 -212841 69858 -45985 55863 -137701 59650 -14606 293960
12141d45202B1731J27970a0763B03168e5958B11955K80361c8482E476O1959j4180
$$ -445202 21731 149701 -10763 203168 -55958 211955 492316 -38482 5476 67435 53255
12130E3255J99546a64826C72196a31386B52764d0955r2322k59688B19323B9832
$$ 53255 252801 -164826 372196 -131386 252764 -40955 -133277 -392965 219323 29832
12119G1597J84146g494O94B8644K22239b64092D1643A5836a56153C13843j6219
$$ 71597 255743 -7494 -6800 28644 250883 -264092 41643 15836 -156153 313843 297624
12108B97624k9832A9587K03290a4399q6238B8460P2418a0819j60123B24186F1363
$$ 297624 267792 19587 222877 -14399 -100637 28460 100878 -10819 -170942 224186 61363
12096d2070A36541o3057A0037M2555a66037C0637A3610a86653A02601f2554B49394
$$ -42070 136541 73484 10037 52592 -166037 30637 13610 -186653 102601 -62554 249394
12084a15539j396H4687m0394c2281A02656J15609K558P91500Q83295k51424H07048
$$ -115539 -116935 84687 44293 -32281 102656 218265 220823 1012323 1895618 1644194 807048
12072C91697l9509A13302E5715e5126I4240m949c74085a59519e432j73182P2916
$$ 391697 352188 113302 55715 -55126 94240 89291 -374085 -159519 -5432 -178614 -105698
12061a05698C31860p4387a83935I780O205M12676A1775i283C3368O0539a86396
$$ -105698 331860 257473 -183935 9780 15985 428661 11775 -9283 33368 93907 -186396
12049b04409J707A1464e539n6686n8296J2837a5392k47565A00106J06504i0921
$$ -204409 -202702 11464 -5539 -62225 -120521 -107684 -15392 -262957 100106 206610 -90921
12037I3194I834N0189L45019b47488C32054j12273h0977B3076J12307a03529C28856
$$ 93194 9834 60023 405042 -247488 332054 219781 -80977 23076 135383 -103529 328856
12025b51875B10803a35759p5531H0006a10904j6487B79221a48693n1694F4831
$$ -251875 210803 -135759 -211290 80006 -110904 -127391 279221 -148693 -200387 64831
12014A28356k1110a0109k84760h5305c3452B6939c4545k29445J14715j25400H47
$$ 128356 107246 -10109 -294869 -85305 -33452 26939 -34545 -263990 -149275 -274675 847
12002B21603c0549B03464g5698B99878a57646G1492b88137c7227B53551K8863
$$ 221603 -30549 203464 -75698 299878 -157646 71492 -288137 -37227 253551 282414
11992B82414q2304c94166N4989F7923i0080j3931L4565j19098l260L2738A35374
$$ 282414 200110 -394166 -339177 67923 -90080 -104011 -69446 -188544 -191804 -159066 135374
11980b08168M5380j36858A33317e7560B64418I6548b65009A41115c64517a48404
$$ -208168 -162788 -299646 133317 -57560 264418 96548 -265009 141115 -364517 -148404
11969A29748a00803B20908a7698r8841B02297L3877E3155k4732A300J72948k8411
$$ 129748 -100803 220908 -17698 -116539 202297 236174 53155 28423 1300 174248 145837
11958A45837F5240m836a11662A17279g5972A12071P9136O1302n7205a64290N2333
$$ 145837 65240 60404 -111662 117279 -75972 112071 191207 252509 195304 -164290 -111957
11947a11957k6239K3513J2872k48469b530p8100D9852c9505n0677r9698B06500
$$ -111957 -138196 -114683 -101811 -350280 -2530 -80630 49852 -39505 -90182 -189880 206500
11935A7131J0669K45829b16045d3404A33357D1674d0371j10957m9023A19802A0652
$$ 17131 27800 273629 -216045 -43404 133357 41674 -40371 -151328 -200351 119802 10652
11923E0538J92901a01430M5310p0781k1634n481b8799F5553C0653a83880A9423
$$ 50538 243439 -101430 -56120 -126901 -148535 -154016 -28799 65553 30653 -183880 19423
11911a26683o0773p7762d0810A4031e9952j52914D5333c16527C4588M06916k05889
$$ -126683 -187456 -265218 -40810 14031 -59952 -212866 45333 -316527 34588 441504 235615
11900B35615E5032a93796J7908A3882J10033b04505K8068A29295g0362I344O6219
$$ 235615 55032 -193796 -175888 13882 123915 -204505 -176437 129295 -70362 9344 75563
11889G5563K4783a35626C8420J47362I2120B4509b43909Q9030M9834A63074j3773
$$ 75563 100346 -135626 38420 185782 92120 24509 -243909 -154879 -105045 163074 149301
11878A49301g4372j62884f9603B01268a12144D3249J46007o2162b61636C53786
$$ 149301 -74372 -237256 -69603 201268 -112144 43249 189256 127094 -261636 353786
11867a65076B27631H3653J63662i3196B60157j11272C0576b32038A08005h0630
$$ -165076 227631 83653 247315 -93196 260157 148885 30576 -232038 108005 -80630
11856B53989a38685k54527a69919F7988J66256A998J98273b03197A98184a69557
$$ 253989 -138685 -393212 -169919 67988 234244 1998 200271 -203197 198184 -169557
11845a57904b2095l84325a56037M519j25169D36896b4115l5685k6586G2032e8373
$$ -157904 -22095 -406420 -156037 -151518 -276687 436896 -24115 -59800 -86386 72032 -58373
11833a02068M6763B43159b81456J24394k5355K0470A6651J55347F7268k1040f2805
$$ -102068 -55305 243159 -281456 -157062 -182417 -161947 16651 171998 67268 46228 -62805
11821B7166g7428p9397e9984k12235K5108E2025h3561B71634a16554q2418A37399
$$ 27166 -77428 -156825 -59984 -272219 -247111 52025 -83561 271634 -116554 -198972 137399
11809a39325O7069C771J12824a63507f7749o9899m1832J3426N0741I686a11398
$$ -139325 -72256 3771 116595 -163507 -67749 -137648 -179480 -166054 -115313 9686 -111398
11797C88921d20556H7558C0656L06613c16608b3805A16071a56356G6580b4350
$$ 388921 -420556 87558 30656 337269 -316608 -23805 116071 -156356 76580 -24350
11786b95011A85507c3932q0969A25278J55994g3024J5603j43681a32q0235m0995
$$ -295011 185507 -33932 -114901 125278 281272 -73024 -57421 -201102 -132 -80367 -121362
11775a21362D094J2927a44835B19609c10033A32605K36651A12923a80B42245N7325
$$ -121362 4094 17021 -144835 219609 -310033 132605 369256 112923 -180 242245 299570
11764B99570A8660b04248A86118a52726a5126l02224F5721a87148Q6666A43627
$$ 299570 18660 -204248 186118 -152726 -15126 -317350 65721 -187148 -100482 143627
11753a48216K3179B59707a33796N9314C5115R2321b35397K2796l18409G6301k0690
$$ -148216 -125037 259707 -133796 -74482 35115 127436 -235397 -212601 -531010 76301 55611
11742E5611M5203f424A20007n8559b73710J0026I0543a55196M3237a7337I6777
$$ 55611 100814 -6424 120007 61448 -273710 -263684 90543 -155196 -111959 -17337 96777
11730b2441C4399b03249O8739F0330g6825o997o9428A71420m8172c09268F2086
$$ -22441 34399 -203249 -134510 60330 -76825 -83822 -153250 171420 123248 -309268 62086
11718E3383c01820A9269f2850b0511C1246A0573Q912L4189b7727r4572A86367
$$ 53383 -301820 19269 -62850 -20511 31246 10573 19485 53674 -27727 -122299 186367
11706A10575m51K59343a75703A24765J6099a76250d0184m25B58444a09906A29815
$$ 110575 110124 369467 -175703 124765 140864 -176250 -40184 -40609 258444 -109906 129815
11694I4225J15929a94680F5680M140c2560j35378B07892p4714J267O0971c22481
$$ 94225 210154 -194680 65680 69820 -32560 -167938 207892 133178 134445 195416 -322481
11682a22906B90962f3440B27326c6608B95140d6720C0603M0265k2331J73374P3427
$$ -122906 290962 -63440 227326 -36608 295140 -46720 30603 70868 48537 221911 295338
11671B95338j25177D9489j3517M0412i6156B00121F7774a32795A79833b7562k00165
$$ 295338 170161 49489 35972 76384 -96156 200121 67774 -132795 179833 -27562 -227727
11660b27727B46622N6422A38402E786K78246a76596F679b44751l764A65429a62219
$$ -227727 246622 303044 138402 5786 284032 -176596 6679 -244751 -248515 165429 -162219
11648F0699B8324N338a90526D4778a43592C36202F8343J9365i5602l4727A68846
$$ 60699 28324 33662 -190526 44778 -143592 336202 68343 87708 -95602 -130329 168846
11636D8434a66573r1587a8812G3082P2314O0808f9662r1037c4882p3687b414E0150
$$ 48434 -166573 -258160 -18812 73082 145396 206204 -69662 -160699 -34882 -108569 -2414 50150
11623F8942I23d5091j81174a06271n8541N3749A27459a71971j34180A1711a7769
$$ 68942 923 -45091 -226265 -106271 -164812 -111063 127459 -171971 -306151 11711 -17769
11611A48133F8120N2316J3984h9129K5622B48043D5031J48029a42420A27856e639
$$ 148133 68120 120436 134420 -89129 -63507 248043 45031 193060 -142420 127856 -5639
11599c0889C25445H6673n726B3548Q3468a77376B05521p6094J53211a92675h8770
$$ -30889 325445 86673 80947 23548 107016 -177376 205521 129427 282638 -192675 -88770
11587a1536A17840f009G3819a9893E5159a04644k9837o5678A14589l0498J86323
$$ -11536 117840 -6009 73819 -19893 55159 -104644 -134481 -200159 114589 84091 270414
11576B70414h1194A24656b5648H2014B5015M37142b30054A80642a93810F5052
$$ 270414 -81194 124656 -25648 82014 25015 462157 -230054 180642 -193810 65052
11565b69520G3158P415a96578k07430a00510A73586j1171F109J46101a74013A86265
$$ -269520 73158 80573 -196578 -404008 -100510 173586 162415 6109 152210 -174013 186265
11553A62174b73715d7113A46599n7079J33046a49979C8474J59456c815k99003
$$ 162174 -273715 -47113 146599 89520 222566 -149979 38474 197930 -3815 -302818
11543c02818F8107k7129J02859O1583a77330K9878A43409K07642E881b7551B12285
$$ -302818 68107 40978 143837 205420 -177330 -147452 143409 351051 5881 -27551 212285
11531B9629c01539B29875A6258J58730a7297C11595C6373A7127J09575I848a13619
$$ 29629 -301539 229875 16258 174988 -17297 311595 36373 17127 126702 9848 -113619
11519A80264a70029B49570n0666A5853N9004J75056J12475j31790J11840A17070
$$ 180264 -170029 249570 198904 15853 74857 249913 362388 230598 342438 117070
11508c4291m2524A26500D8279i7495c0932p00B80860B3093L45272d5900B41995
$$ -34291 -76815 126500 48279 -97495 -30932 -31632 280860 23093 368365 -45900 241995
11496C8946J56751k4601n9296b6550A12273g720A88482b52077k07951c06A3810
$$ 38946 195697 171096 111800 -26550 112273 -7720 188482 -252077 -460028 -306 13810
11484A68013l3516m5823C1725M35450G7274J5276J71303m0909d4802I0267B7292
$$ 168013 134497 88674 31725 467175 77274 92550 263853 222944 -44802 90267 27292
11472a62913P7465f533K141A38592a96182A92557a35468G9533f7379A55418K38378
$$ -162913 -85448 -6533 -4392 138592 -196182 192557 -135468 79533 -67379 155418 393796
11461C93796a18288E9375Q8438b05702B90543f9182A85279i9562j9623F0765f9725
$$ 393796 -118288 59375 147813 -205702 290543 -69182 185279 -99562 -119185 60765 -69725
11449C88927b347j87879c7057A27859a246C82216a62918A571N398d1757J1567
$$ 388927 -2347 -190226 -37057 127859 -1246 382216 -162918 1571 6969 -41757 -30190
11438c0190A56581E7136J61592G7433C0375R6728O5681I2360j6323l7604b48753
$$ -30190 156581 57136 218728 77433 30375 127103 192784 92360 76037 38433 -248753
11426a7693m8308B50300b98783F640K40837d6884n8768A35209I920a39079j6039
$$ -17693 -66001 250300 -298783 6640 247477 -46884 -105652 135209 9920 -139079 -155118
11415a55118r566d5506m0319I4664f0128A12245d9134k3230E6996i7936n9953
$$ -155118 -164684 -45506 -85825 94664 -60128 112245 -49134 -72364 56996 -97936 -157889
11404a57889p1828f0604j35845k59840I0166c86479G8778N8404a07172n7735h824
$$ -157889 -229717 -60604 -196449 -456289 90166 -386479 78778 137182 -107172 -164907 -8824
11392C59683A31243e8493B9974J38076l8371a29144j51013e6596A47619L7715
$$ 359683 131243 -58493 29974 168050 129679 -129144 -280157 -56596 147619 185334
11382A85334J9609b40095b6492j15590e6965a7471D790i309B12517e7818A71484
$$ 185334 204943 -240095 -26492 -142082 -56965 -17471 4790 -9309 212517 -57818 171484
11370B0534K29558b94291f5382A03965a92201j45125H2897a69801R801C55830
$$ 20534 250092 -294291 -65382 103965 -192201 -337326 82897 -169801 -160000 355830
11359a24090k16065D7502d2636A51876b99813L6610L2079H8531J21067G3318a27331
$$ -124090 -340155 47502 -42636 151876 -299813 -263203 -231124 88531 209598 73318 -127331
11347A27497d1510o5402l0792E09988B2925c25642B9252F992a87306b532k96534
$$ 127497 -41510 -106912 -137704 509988 22925 -325642 29252 6992 -187306 -2532 -299066
11336b99066Q4604P7166I0468E12J5925b05442Q1016f1398A89401F8163a66206
$$ -299066 -214462 -137296 90468 512 16437 -205442 -124426 -61398 189401 68163 -166206
11324c5184j88506A01274b63278Q2423A36563a61063O6670J6125A9667m868a59167
$$ -35184 -223690 101274 -263278 -180855 136563 -161063 -94393 -78268 19667 14799 -159167
11312f2794m09315a34922k07667A06183a8125k73325G9903e37792b6999l5004
$$ -62794 -472109 -134922 -342589 106183 -18125 -291450 79903 -537792 -26999 -62003
11302f2003c093o1357r0774A9977f6822h550j10309C18725D7580a17565I3994
$$ -62003 -3093 -64450 -155224 19977 -66822 -8550 -118859 318725 47580 -117565 93994
11290G8405K91120A70954b04494E9440B383Q2155c61257A2357a35929K3017B79018
$$ 78405 369525 170954 -204494 59440 2383 84538 -361257 12357 -135929 -112912 279018
11278B32216e0600p5877j61719Q8883B1847b81456A49498A7215O3904d231j00645
$$ 232216 -50600 -126477 -288196 -199313 21847 -281456 149498 17215 81119 -4231 -104876
11267a04876B2678J58998a07305k2259k285c9813D3606c09892a20417A13746b73124
$$ -104876 22678 181676 -107305 -129564 -131849 -39813 43606 -309892 -120417 113746 -273124
11255d9867L790B34422k9138Q7631A42180b91462J22549o9842a3324k90032B46775
$$ -49867 -46077 234422 205284 292915 142180 -291462 -168913 -238755 -13324 -303356 246775
11243F1749n810R9460F4693J69689a7218m516o7227j6444j9235j9578j67799c2997
$$ 61749 55939 155399 64693 234382 -17218 -21734 -88961 -105405 -124640 -144218 -312017 -32997
11230G5176B0816J91858D445a50527j5715e7394k5426B8649b06537Q6794j19497
$$ 75176 20816 212674 4445 -150527 -166242 -57394 -82820 28649 -206537 -119743 -239240
11219b39240N104J13544a4825j2026B07071b49630I0421L3040A359b72627a07819
$$ -239240 -234136 -120592 -14825 -26851 207071 -249630 90421 123461 1359 -272627 -107819
11207I670K58714a03728d9992I3720L903g6624A23393B3133L9797N6749E5673
$$ 9670 268384 -103728 -49992 93720 97623 -76624 123393 23133 62930 119679 55673
11195f788A44815c88532B47592n2888P3314i2129A92171H2560B5869K3369J8290
$$ -6788 144815 -388532 247592 194704 268018 -92129 192171 82560 25869 49238 67528
11184F7528Q9749L15570h3406D7184A332P7318C0106a51300D9947N7551a40568
$$ 67528 157277 472847 -83406 47184 1332 78650 30106 -151300 49947 107498 -140568
11172c0577m90574a47833O2865G1475d1713j2787D1276b23903A02307O1450a89533
$$ -30577 -521151 -147833 -84968 71475 -41713 -54500 41276 -223903 102307 163757 -189533
11160F8406h2863B75016j21071h0408A85454b20440N8711A33764c176m35695l9171
$$ 68406 -82863 275016 153945 -80408 185454 -220440 -161729 133764 -3176 -438871 -478042
11149d78042a89122J8829B01528E0194O3388N4608c04405A39767a5997j66602
$$ -478042 -189122 -170293 201528 50194 113582 168190 -304405 139767 -15997 -182599
11139a82599p2186C7964A4153J02221a37034j10170d9559m5701A04733C9212b8723
$$ -182599 -254785 37964 14153 116374 -137034 -247204 -49559 -95260 104733 39212 -28723
11127d4795k04819a08962B99530A17388h3989A91442a29285A88037b2528C0889
$$ -44795 -249614 -108962 299530 117388 -83989 191442 -129285 188037 -22528 30889
11116B08008D0225d16863a66535b2738B12389a29235A12642J27724G063K84746
$$ 208008 40225 -416863 -166535 -22738 212389 -129235 112642 240366 7063 291809
11106B91809n5578C4966a68250E1881L35840I0980G969b10489B62686c3316F6616
$$ 291809 236231 34966 -168250 51881 387721 90980 7969 -210489 262686 -33316 66616
11094C75742h5068B30451D7486R2526d4797A03396k3632h0003B1470J73196B5235
$$ 375742 -85068 230451 47486 140012 -44797 103396 79764 -80003 21470 194666 25235
11082A97569J49052o5440A39336B6013M30934k00699J75684A05022J83814j362
$$ 197569 346621 281181 139336 26013 456947 256248 431932 105022 288836 287474
11072B87474l5112r4265P3484r2862J70628B4572K30020m1550K5022R2181J01738
$$ 287474 252362 158097 231581 138719 309347 24572 254592 213042 238064 330245 431983
11061D31983j97409R817M7228L03464q9455l5365K59688k28000J41227j60280
$$ 431983 234574 244391 291619 595083 505628 470263 729951 501951 643178 482898
11051D82898j29392K58735j93609K21803J32782k29908l7035o4725J61079K5518
$$ 482898 353506 612241 418632 640435 773217 543309 506274 441549 602628 628146
11041F28146K04609m13881K39494J2434j27391L76760C52201J87794K15439j03828
$$ 628146 832755 418874 658368 670802 543411 920171 352201 539995 755434 651606
11031F51606j00280J0932R0680j22489M24121k45979K0739L6680l04871L43073
$$ 651606 551326 562258 652938 530449 954570 708591 729330 766010 461139 804212
11021H04212l80797R7758J80174O7545Q9146o2625j29838C24512L48617j2696
$$ 804212 423415 521173 701347 768892 858038 795413 665575 324512 673129 660433
11011F60433k53519J82891j08769L06838j49999j33407J41953r4139J16281j28919
$$ 660433 406914 589805 481036 787874 637875 504468 646421 552282 668563 539644
11001E39644K4876M7692p1663q7347J32382B58323N13758k77488K67948j50862
$$ 539644 564520 612212 540549 453202 585584 258323 772081 494593 762541 611679
10991F11679K45131j09848m7609j20857K99298l32706L04950J52307k55768P6032
$$ 611679 856810 746962 699353 578496 877794 545088 850038 1002345 746577 822609
10981H22609K09723j30775M20365j88126L44145L20504k82391O37166q7064K40201
$$ 822609 1032332 901557 1321922 1133796 1477941 1798445 1516054 2153220 2066156 2306357
10971B306357K66849m40479J17544l2858j72642o02479L16222L2656q02779K65113
$$ 2306357 2573206 2132727 2250271 2217413 2044771 1442292 1758514 1791170 988391 1253504
10961A253504J32800K8229j48492n1123L75853n0808k11777j1805j50982j71118
$$ 1253504 1386304 1414533 1266041 1214918 1590771 1539963 1328186 1316381 1165399 994281
10951I94281Q0592k9562m76369J57378k72191l2904A50399J12743K68596B5347
$$ 994281 1074873 1045311 568942 726320 454129 421225 150399 263142 531738 25347
10940G3797A1847L22196n6828A1555b47621B44407L4638F861J98399F744K90555
$$ 73797 11847 334043 277215 11555 -247621 244407 279045 6861 205260 6744 297299
10929B97299H8195d4794J8941A29466e8523k1811B21087a5017C69274d5836D0383
$$ 297299 88195 -44794 -25853 129466 -58523 -80334 221087 -15017 369274 -45836 40383
10917a88362F6932O5475J23984G2584c8662j29198C83134A13961l3393N6649m7058
$$ -188362 66932 132407 256391 72584 -38662 -167860 383134 113961 80568 137217 90159
10906I0159d68543i0876c3712G0238c04349f8193r185C25890a97029R40N2007
$$ 90159 -468543 -90876 -33712 70238 -304349 -68193 -77378 325890 -197029 -196089 -144082
10895a44082K6336C027e0992D1910N6569J9951m0050h8540A19229K8755k6482
$$ -144082 -117746 3027 -50992 41910 98479 118430 78380 -88540 119229 147984 121502
10884A21502a93966M5842e5611j03268B78260j36908I511R2092F494L9310M8449
$$ 121502 -193966 -148124 -55611 -158879 278260 141352 9511 101603 6494 45804 94253
10873I4253E609a58062f8328c1713F8431Q0651h1380A74742o0654b80815a04842
$$ 94253 5609 -158062 -68328 -31713 68431 149082 -81380 174742 114088 -280815 -104842
10861A64083i1652l4393l014b1441H2565K5881o9R6578a66013a979k83845j06427
$$ 164083 -91652 -126045 -129059 -21441 82565 108446 108377 204955 -166013 -1979 -285824 -392251
10849c92251i1088j34772J12088F1822h4194p1725A30208m3303i2354k6416K8587
$$ -392251 -91088 -225860 -113772 61822 -84194 -155919 130208 86905 -92354 -118770 -90183
10838i0183A82580e331E2303J82713F0157d05151J05649N3843q2736e7642A62678
$$ -90183 182580 -5331 52303 235016 60157 -405151 -299502 -245659 -328395 -57642 162678
10826B65053C3652J51273a05114o4261o6691O4563a6000j29865K7310m7226J226
$$ 265053 33652 184925 -105114 -169375 -236066 -171503 -16000 -145865 -118555 -165781 -164555
10815a64555A74180a4892o6561q0675A5409J50415A8617G440J47721d8957I9332
$$ -164555 174180 -14892 -81453 -162128 15409 165824 18617 7440 155161 -48957 99332
10803b90001a36430A01688K4891a04230m4417q7960j8546a2974I2617a81952k6016
$$ -290001 -136430 101688 126579 -104230 -148647 -236607 -255153 -12974 92617 -181952 -207968
10792b07968i8895k0001c9252B0066c81420I3884g8180j84108e2914b3153j2052
$$ -207968 -98895 -118896 -39252 20066 -381420 93884 -78180 -262288 -52914 -23153 -35205
10781c5205F3907a4285A0682N2933J47542C7665N8830a59137A76439F2411J25484
$$ -35205 63907 -14285 10682 63615 211157 37665 96495 -159137 176439 62411 187895
10770A87895b3049j26604m4056P5607G1983b35406C5170a6071A42868b14864J07041
$$ 187895 -23049 -149653 -193709 -118102 71983 -235406 35170 -16071 142868 -214864 -107823
10759a07823k2918l2596A39349A341a84200j74510d2073D3114b05099C5813h3224
$$ -107823 -130741 -163337 139349 1341 -184200 -358710 -42073 43114 -205099 35813 -83224
10747a97838G3494a59620a0469H1243o337M61939i7507e539k87359c5274C6733
$$ -197838 73494 -159620 -10469 81243 74906 536845 -97507 -5539 -292898 -35274 36733
10735a91718g6672B07082r8928O7621q5439a19118j88637g7327A42417J42020
$$ -191718 -76672 207082 108154 175775 90336 -119118 -307755 -77327 142417 284437
10725B84437p633E4823K03134a35333A30103P9238I550J29849c32536h6279C7746
$$ 284437 276804 54823 257957 -135333 130103 209341 9550 139399 -332536 -86279 37746
10713B24548J3946a65133D29135d5587C6495a51618g3539B19679a88072r2711
$$ 224548 238494 -165133 429135 -45587 36495 -151618 -73539 219679 -188072 -280783
10703b80783a17064d2024E6000a98790Q6021e2091k5613E15882a19719A36510
$$ -280783 -117064 -42024 56000 -198790 -112769 -52091 -77704 515882 -119719 136510
10692A20689c58587J18912m5638b2123o5680A9553c45365J54456b4570A11772
$$ 120689 -358587 -239675 -285313 -22123 -87803 19553 -345365 -190909 -24570 111772
10681a45970O8471L5511D4130A7857a10294A08233e09729e2564j05930N661C50586
$$ -145970 -77499 -41988 44130 17857 -110294 108233 -509729 -52564 -158494 -152833 350586
10669a04869j2027e6204k1577A4585K06599p4522a48039A960g2705A84888d3507
$$ -104869 -116896 -56204 -77781 14585 221184 146662 -148039 1960 -72705 184888 -43507
10657a21585p5791I9580e75036D00032a66123o9196a12699d6006q9485J3473A76255
$$ -121585 -197376 99580 -575036 400032 -166123 -235319 -112699 -46006 -135491 -122018 176255
10645B55685B1862a70521d422m856m0256l45024A95779E2573c3289A93397E754
$$ 255685 21862 -170521 -4422 -9278 -49534 -394558 195779 52573 -33289 193397 5754
10633a73021A40069c29898a20645H5494b55347D3103f1364c554j67813P0981H5250
$$ -173021 140069 -329898 -120645 85494 -255347 43103 -61364 -3554 -171367 -100386 85250
10621c9744a9164k06130j4519D029a24389l9597E6676b92038a37988k35031D4071
$$ -39744 -19164 -225294 -239813 4029 -124389 -163986 56676 -292038 -137988 -373019 44071
10609a53499F2844b46252B15579a14461B69779i9837F7478J22511B3355a56631
$$ -153499 62844 -246252 215579 -114461 269779 -99837 67478 189989 23355 -156631
10598c07742D46991e9232j07633D5610K18296a04372r21F9060N50b25638h8313
$$ -307742 446991 -59232 -166865 45610 263906 -104372 -105293 69060 69610 -225638 -88313
10586I2960M27913f9784E8335b57868A8880M5342a69569i453A93415a4865j85584
$$ 92960 520873 -69784 58335 -257868 18880 64222 -169569 -9453 193415 -14865 -200449
10575b00449d4900A28799c42509F9927c2462m3070j49539C3227J50329f9274C06119
$$ -200449 -44900 128799 -342509 69927 -32462 -75532 -225071 33227 183556 -69274 306119
10563a86279Q7009J8539j65709q8973h3955K7733A23569m6563g1776A37521b99272
$$ -186279 -99270 -80731 -246440 -335413 -83955 -56222 123569 77006 -71776 137521 -299272
10551a59335A53180E8394c8277D23628h4316m168c6012A36068d5762j24252A61460
$$ -159335 153180 58394 -38277 423628 -84316 -88484 -36012 136068 -45762 -170014 161460
10539D1827a56407J0993j76061Q2873E0103N6311D955b0848k37104J10475o7859
$$ 41827 -156407 -145414 -321475 -238602 50103 106414 4955 -20848 -257952 -147477 -215336
10528b15336D9696R7913e7456j46974K1741C38029i820k6793E4676K22692b10945
$$ -215336 49696 147609 -57456 -204430 -182689 338029 -9820 -36613 54676 277368 -210945
10516c6847k05440P5338E2039A9852b7699j47965d2723j85943A72347J6898a9020
$$ -36847 -242287 -166949 52039 19852 -27699 -175664 -42723 -228666 172347 189245 -19020
10504A66638b29758B35753d2925j27843B60616h5942j05816j04990G3939a39175
$$ 166638 -229758 235753 -42925 -170768 260616 -85942 -191758 -296748 73939 -139175
10493D43106C7632a47069a6261A22973a47435A33026A8842a39901I6731l2971
$$ 443106 37632 -147069 -16261 122973 -147435 133026 18842 -139901 96731 63760
10483F3760Q1450J55524J15375K1003j80856H8588g7697k1020I0775J83147d60856
$$ 63760 145210 300734 416109 437112 256256 88588 -77697 -98717 90775 273922 -460856
10471B50702B9972e2233A11129L5694n0869d6725I9085b76253R3017m9343B44640
$$ 250702 29972 -52233 111129 146823 95954 -46725 99085 -276253 -183236 -232579 244640
10459a06751a8660A65401f4840H8250M0963B0783b53484E0510k428b00648R7676
$$ -106751 -18660 165401 -64840 88250 129213 20783 -253484 50510 48082 -200648 -102972
10448a02972q5263k31220B40671q7820R3598a45442a500A61728b99027A32053
$$ -102972 -188235 -419455 240671 152851 246449 -145442 -1500 161728 -299027 132053
10437A71638D9185b7519F6348b59366a8435r1111A59998C2049J59977c77765A94754
$$ 171638 49185 -27519 66348 -259366 -18435 -109546 159998 32049 192026 -377765 194754
10425c5317B04886d8390A50868D353e9358j89930A66847a71614f310A81938a56935
$$ -35317 204886 -48390 150868 4353 -59358 -249288 166847 -171614 -6310 181938 -156935
10413E1847J38743n2128a16169M8495I4601h878B09239e0272A75189e3483D3977
$$ 51847 190590 138462 -116169 -67674 94601 -8878 209239 -50272 175189 -53483 43977
10401c9776F803b27054B94967a62446P1577K5001D9567a6495A67479D0575c90368
$$ -39776 6803 -227054 294967 -162446 -90869 -65868 49567 -16495 167479 40575 -390368
10389e3913E44Q598c0982B11791J64245B0259N8791a45869d6773i547B40193g671
$$ -53913 544 9142 -30982 211791 376036 20259 79050 -145869 -46773 -9547 240193 -7671
10376B9610J9445K00353J827a04665A63835A4979A685K56853b6172D46057p9924
$$ 29610 49055 249408 251235 -104665 163835 14979 1685 258538 -26172 446057 366133
10365C66133j8638A46410J86416J06530H9693J63381A4785R6069G959K76191M6365
$$ 366133 347495 146410 332826 439356 89693 253074 14785 110854 7959 284150 330515
10354C30515r3435M55723A87491P9272p8487p608K26686j43110j5654J44318J19037
$$ 330515 237080 692803 187491 266763 188276 180668 407354 264244 248590 392908 511945
10343E11945j18787q9995j36611a16118C90191A259Q4851K54727i9890A34034
$$ 511945 393158 303163 166552 -116118 390191 1259 86110 340837 -99890 134034
10332E0709K00684o2001M7523a83394A10384m8169f3936A1326J83567J5955J63020
$$ 50709 251393 189392 236915 -183394 110384 62215 -63936 11326 194893 210848 373868
10321C73868h7544A73495b15870B36202Q7437B2484f1687A03235K07967A30624
$$ 373868 -87544 173495 -215870 236202 323639 22484 -61687 103235 311202 130624
10310F9369o222a28435K9004A74769H0704l8307j023a2362D2250b62698h2324
$$ 69369 63147 -128435 -99431 174769 80704 42397 41374 -12362 42250 -262698 -82324
10298A53676H892a83008j6784A7011a83212C1393N3204k6417b70772P5299q8813
$$ 153676 8892 -183008 -199792 17011 -183212 31393 84597 58180 -270772 -195473 -284286
10287b84286J12765O2638B56556c9367A4473a73193A04287C4622a35478K249r7136
$$ -284286 -171521 -108883 256556 -39367 14473 -173193 104287 34622 -135478 -133229 -230365
10276b30365I4674a81775C23912g6342k27921c8453q2970j9696A56983G0232j7523
$$ -230365 94674 -181775 323912 -76342 -304263 -38453 -121423 -141119 156983 70232 52709
10265E2709h2131c953I6951m3376a57114P6501F9957A5044K13286M019R634A01507
$$ 52709 -82131 -3953 96951 53575 -157114 -80613 69957 15044 228330 232349 241983 101507
10252A57499d9691F5872a30147L184c5878C10572a91054A77014a2968k1585A86565
$$ 157499 -49691 65872 -130147 -126963 -35878 310572 -191054 177014 -12968 -34553 186565
10240c72234a6719j09136k7198j1035g9199A01383J12510P533G2551i0933j50509
$$ -372234 -16719 -125855 -153053 -164088 -79199 101383 213893 221426 72551 -90933 -241442
10229b41442B04532H1709b12405j18809J60628F8588a12808a6909I9526c99335
$$ -241442 204532 81709 -212405 -331214 -170586 68588 -112808 -16909 99526 -399335
10218a25840L3529n7711k47379J36430m6009E8385J73366b1200p6056k5502j54911
$$ -125840 -92311 -150022 -397401 -260971 -306980 58385 231751 -21200 -97256 -122758 -277669
10207b77669D01641A65749b32764A69167a99147g9422K9477J1914f931m1479A7360
$$ -277669 401641 165749 -232764 169167 -199147 -79422 -49945 -38031 -6931 -48410 17360
10195B17732a49238A1033a7125j22330j65041J12163R4794A34668a51028B07560
$$ 217732 -149238 11033 -17125 -139455 -304496 -192333 -97539 134668 -151028 207560
10184H1396J650b94885I483O3199c75677d8780k01480n7775H0663b46816H608
$$ 81396 83046 -294885 9483 72682 -375677 -48780 -250260 -308035 80663 -246816 8608
10172c07366L4739P8113E977d81921a10196B50392j10933l6476c79790B86850
$$ -307366 -272627 -194514 5977 -481921 -110196 250392 139459 102983 -379790 286850
10161e8402B42672c6782F0319a86346e2486b908j29633C8439J63637G832f8911
$$ -58402 242672 -36782 60319 -186346 -52486 -2908 -132541 38439 202076 7832 -68911
10149A92704A5881J03600l7207L1782a23400k0039P1525j3045m620A66372E0452
$$ 192704 15881 119481 82274 114056 -123400 -143439 -71914 -84959 -89579 166372 50452
10137c90490h791j72513A69481a27374A55170c75545R1267d4624C4546e11700
$$ -390490 -8791 -181304 169481 -127374 155170 -375545 -284278 -44624 34546 -511700
10126A24829b54864a027A3992a72544k03647a30350A84345a26797B09140c52901
$$ 124829 -254864 -1027 13992 -172544 -376191 -130350 184345 -126797 209140 -352901
10115a04239j54389A44938a50769A49883a53539L9316E867a63623C5406d72750
$$ -104239 -258628 144938 -150769 149883 -153539 -114223 5867 -163623 35406 -472750
10104B52707d3563j72177A33803d1525j0363k22601G7075b3337k86404j19044
$$ 252707 -43563 -215740 133803 -41525 -51888 -274489 77075 -23337 -309741 -428785
10094d28785E3484b37489N3341M3127I2530b10332K732a4019k1489l48162F7610
$$ -428785 53484 -237489 -184148 -141021 92530 -210332 -207600 -14019 -35508 -383670 67610
10082e0331J9617j6770F1321c45944P8656j08121a55735H8961O8166o1450L3176
$$ -50331 -30714 -47484 61321 -345944 -267288 -375409 -155735 88961 157127 95677 128853
10071A28853M4984Q8279a81536A00096b54721g7960j2392D0194e5728A25180B580
$$ 128853 173837 262116 -181536 100096 -254721 -77960 -90352 40194 -55728 125180 2580
10059a49249b7924B21597a61076B207b08078a0051j48530B46829F2183a04361
$$ -149249 -27924 221597 -161076 2207 -208078 -10051 -158581 246829 62183 -104361
10048A27947A7055L93328Q177A65148a05247j18305a08247c1439l4689n8353L0524
$$ 127947 17055 410383 418560 165148 -105247 -223552 -108247 -31439 -66128 -124481 -93957
10037i3957C9326K01493c21301O2993a09003j99563f5989n9780c2461C61928a60119
$$ -93957 39326 240819 -321301 -258308 -109003 -308566 -65989 -125769 -32461 361928 -160119
10025c35420a48450L4725j35296G6380a25842A009K05293f2001m3093A39761f8178
$$ -335420 -148450 -113725 -249021 76380 -125842 1009 206302 -62001 -105094 139761 -68178
10013e4502B70510j12587a15909A11285D5993h4863A55394a92029G0691O5141
$$ -54502 270510 157923 -115909 111285 45993 -84863 155394 -192029 70691 135832
10003A35832n6845q676b78203E0767A1999a29870C95261a15796M8048k68728a1007
$$ 135832 78987 70311 -278203 50767 11999 -129870 395261 -115796 -67748 -336476 -11007
9991a13306j83726a10508I9372j0651b42353B0b02556G61K70894b69169E1691
$$ -113306 -297032 -110508 99372 88721 -242353 20 -202556 761 271655 -269169 51691
9979h0122j57234A81759b09568A40643K6220a13929o8241b5635l20665F3844g1268
$$ -80122 -237356 181759 -209568 140643 166863 -113929 -182170 -25635 -346300 63844 -71268
9967a91018R4352B5073P5003b691l38381a55755B01340C2445b37007e1624j34345
$$ -191018 -96666 25073 100076 -2691 -341072 -155755 201340 32445 -237007 -51624 -185969
9956a85969F2675K20410g8567B67108f2572n5662j51947J11000j34359M2562o9760
$$ -185969 62675 283085 -78567 267108 -62572 -118234 -270181 -159181 -293540 -250978 -320738
9945c20738h3425k16256M0501G7340d9226l10945a15363e2003I9831a99118r294
$$ -320738 -83425 -299681 -259180 77340 -49226 -360171 -115363 -52003 99831 -199118 -208412
9934b08412A30518a67642L9947A89438e0513A25119d1101j60380c1692j00375
$$ -208412 130518 -167642 -127695 189438 -50513 125119 -41101 -201481 -31692 -132067
9924a32067B94899a85693l7403G440b6252F8071H988J22499m9464B8996J59226
$$ -132067 294899 -185693 -223096 7440 -26252 68071 8988 131487 82023 28996 188222
9913A88222q9122B5634c43384g8596l60789C5827a66328A47124d96759b10313
$$ 188222 99100 25634 -343384 -78596 -439385 35827 -166328 147124 -496759 -210313
9902b10435A09459a68841k05038E2415J12535b65213F6055a93033B77953c54153
$$ -210435 109459 -168841 -373879 52415 164950 -265213 66055 -193033 277953 -354153
9891A35759A3973J19332a28571m7373I4401a55374A69477D4741b60462l17342
$$ 135759 13973 133305 -128571 -175944 94401 -155374 169477 44741 -260462 -577804
9881e77804K31409B00085a02157I1279C4288a0443l38105A04078b22666h2084
$$ -577804 -346395 200085 -102157 91279 34288 -10443 -348548 104078 -222666 -82084
9870a62037H9736a97104L8479j56682B75708A0258a0881A04933c8192l63185J41176
$$ -162037 89736 -197104 -158625 -315307 275708 10258 -10881 104933 -38192 -401377 -260201
9859b60201P0791E7007a35699K0007D5225b18203G0944b01307A90626d00219a1169
$$ -260201 -189410 57007 -135699 -115692 45225 -218203 70944 -201307 190626 -400219 -11169
9847A7177a43735G5869K0137l8992B0995O6293b19931c6911F1953b31689O4259
$$ 17177 -143735 75869 96006 57014 20995 87288 -219931 -36911 61953 -231689 -167430
9836a67430a3384A20608N5967f978n30824K39445M6092d8050j1336A8857R9587
$$ -167430 -13384 120608 176575 -6978 -537802 -298357 -252265 -48050 -59386 18857 118444
9825A18444j6865a44670a0482C03994E6944j5166P6766a15332A16181j2253B1362
$$ 118444 101579 -144670 -10482 303994 56944 41778 118544 -115332 116181 103928 21362
9813a48620O3736a8626p3611L7894C40619a69024I0178k0046a75967B4142P6900
$$ -148620 -84884 -18626 -92237 -54343 340619 -169024 90178 70132 -175967 24142 101042
9802A01042C4418e1448j47409J7364n0684j54269O202A48292b05842b8162c374
$$ 101042 34418 -51448 -198857 -181493 -232177 -386446 -380244 148292 -205842 -28162 -3374
9790A47069a23067j38890k63600a12785A21005b05357B38542g6911F248f4853
$$ 147069 -123067 -261957 -525557 -112785 121005 -205357 238542 -76911 6248 -64853
9779D047i6062m1329H6829c80125A01188b68183a25176l07793a07871I233e9861
$$ 4047 -96062 -137391 86829 -380125 101188 -268183 -125176 -432969 -107871 9233 -59861
9767h916k9022D91337c48854e999j07132k61763a75517f9151A45589b42562h4496
$$ -8916 -37938 491337 -348854 -5999 -113131 -374894 -175517 -69151 145589 -242562 -84496
9755D6774a34571N5102k02603d2222k16788L2965a943B97681F5868P0724m3911
$$ 46774 -134571 -79469 -282072 -42222 -259010 -226045 -1943 297681 65868 136592 92681
9744I2681h5545A06953l2737b01181d0313A41410a26423f673k03994O1755a3770
$$ 92681 -85545 106953 74216 -201181 -40313 141410 -126423 -6673 -210667 -148912 -13770
9732A2171a73259o1395j25926c1784k7333k7732B4158a24998P466M4211F0745
$$ 12171 -173259 -234654 -360580 -31784 -59117 -86849 24158 -124998 -117532 -73321 60745
9720F890J54152a49835F5764J44859a90318b1600G987a45965j9412l529m1374
$$ 6890 161042 -149835 65764 210623 -190318 -21600 7987 -145965 -165377 -168906 -210280
9709b10280A5495i5423L3185A56448g2570m4801C08006g0270A20964a53691A79458
$$ -210280 15495 -95423 -62238 156448 -72570 -117371 308006 -70270 120964 -153691 179458
9697I7236a81157L9697j27510F233i8441A36028n5909K6182c96950f1230G9305
$$ 97236 -181157 -141460 -268970 6233 -98441 136028 80119 106301 -396950 -61230 79305
9685a07172L2545i186C45623B3875L3654h8801I2123k5370K9735m3809b46398
$$ -107172 -74627 -9186 345623 23875 57529 -88801 92123 66753 96488 52679 -246398
9673d1117A85561p9702a04636C00929c5015J6704E0588e6391j5324j63640b8951
$$ -41117 185561 105859 -104636 300929 -35015 -18311 50588 -56391 -71715 -235355 -28951
9661B17775a21565d3674j92975G716a02603j8846j12611A48536B5722g2599c5483
$$ 217775 -121565 -43674 -236649 7716 -102603 -121449 -234060 148536 25722 -72599 -35483
9649A34998c3315A86759C2218R1630c0558E2376a35592h491B2562c8807j9102
$$ 134998 -33315 186759 32218 123848 -30558 52376 -135592 -8491 22562 -38807 -57909
9638e7909n4a9808p9212k46743C8427d3201j80402H2316c34265d2821a7113l6023
$$ -57909 -57963 -19808 -99020 -345763 38427 -43201 -223603 82316 -334265 -42821 -17113 -53136
9626e3136O505D4120N677a72921j8487f986k15839h565k00104A97191c9962a5477
$$ -53136 -46631 44120 49797 -172921 -191408 -6986 -222825 -8565 -208669 197191 -39962 -15477
9613A8146c6029J6195j93501J7667N8073B03852c20098k4339b1940m2809k4876
$$ 18146 -36029 -19834 -213335 -195668 -137595 203852 -320098 -344437 -21940 -64749 -89625
9602h9625B2061J70331n6742a83230n9129H3473g3648F8368c48079a50523C466
$$ -89625 22061 192392 135650 -183230 -242359 83473 -73648 68368 -348079 -150523 3466
9590a55341N9882j03753h5152B06538J7466H7684a4660k65223a28896k30677J62400
$$ -155341 -95459 -199212 -85152 206538 224004 87684 -14660 -279883 -128896 -359573 -197173
9579a97173f4152m601j63909D4915J17537b14991K2385A68775a26183q9738N3410
$$ -197173 -64152 -68753 -232662 44915 162452 -214991 -192606 168775 -126183 -215921 -162511
9568a62511g9928j08175e7035A677J82469g5204B14796D0609f8138r8086j86215
$$ -162511 -79928 -188103 -57035 1677 184146 -75204 214796 40609 -68138 -166224 -352439
9557c52439G9190k7289a16616B7991O7298a28819B85598a22758k11182J53565
$$ -352439 79190 51901 -116616 27991 95289 -128819 285598 -122758 -333940 -180375
9547a80375C33616B5433i5329j17190h5457K8645j5046p7052J2650o4889e9076
$$ -180375 333616 25433 -95329 -212519 -85457 -56812 -71858 -148910 -136260 -201149 -59076
9535a24851o654k45462A11700a51500A9797b41077b6350A66202a23596l3189r4968
$$ -124851 -131505 -376967 111700 -151500 19797 -241077 -26350 166202 -123596 -156785 -251753
9524b51753A04908c15505H2201a35998q3990m0301P5952F904f1925j41831M9313
$$ -251753 104908 -315505 82201 -135998 -219988 -260289 -184337 6904 -61925 -203756 -154443
9513a54443f1315K5698B16929k558a09746P786b7316j31220d2534B20749a41295
$$ -154443 -61315 -35617 216929 214371 -109746 -101960 -27316 -158536 -42534 220749 -141295
9501D7714b2219k92712J45603J7315C8496a38270A51046c75399H5446J58387a76371
$$ 47714 -22219 -314931 -169328 -152013 38496 -138270 151046 -375399 85446 243833 -176371
9489E6947K6522G897b42598a19168J0900c417A44721a72946A57292K22233e5040
$$ 56947 83469 7897 -242598 -119168 -108268 -3417 144721 -172946 157292 379525 -55040
9477A18410c1427B57471b33582d6986j1639n0349d9574j87706A24742e7642o0559
$$ 118410 -31427 257471 -233582 -46986 -58625 -108974 -49574 -237280 124742 -57642 -118201
9466a18201M6992j26862f0671m371l37667a80219B90574b08627p253A50778c30458
$$ -118201 -71209 -198071 -60671 -65042 -402709 -180219 290574 -208627 -215880 150778 -330458
9454a28587i426k01878j01557c2707j7529k12577k3772C17740B600b87449g0316
$$ -128587 -9426 -211304 -312861 -32707 -50236 -262813 -286585 317740 2600 -287449 -70316
9442c14788J44702l0612j06616A44020i4698r2672I0784a87150A19244a83234
$$ -314788 -170086 -200698 -307314 144020 -94698 -187370 90784 -187150 119244 -183234
9431a94835j02853H212a95661r4131C7887I655n31j825N7886I582K03734L8162
$$ -194835 -297688 8212 -195661 -289792 37887 9655 9124 7299 65185 9582 213316 251478
9419B51478D3450a62127E7740e1l87443g9134K8022r0175k06317A94271a65266
$$ 251478 43450 -162127 57740 -51 -387494 -79134 -51112 -141287 -347604 194271 -165266
9407c08908G8896a17089j97305L9924B99886b53123j81798A8012O6329J15573
$$ -308908 78896 -117089 -314394 -274470 299886 -253123 -434921 18012 84341 199914
9397A99914a75347j45575C07029A26648l0783a7873H7464b76123h3562B10430
$$ 199914 -175347 -320922 307029 126648 95865 -17873 87464 -276123 -83562 210430
9386A44343A0944c4203F0467g2184j06624a016m16140e0342j24699A67084F0958
$$ 144343 10944 -34203 60467 -72184 -178808 -1016 -417156 -50342 -175041 167084 60958
9374A54355a41553C35330b95230A56077g5324A48857b0263j30055C1731J9011
$$ 154355 -141553 335330 -295230 156077 -75324 148857 -20263 -150318 31731 50742
9364E0742c1457C0861d54513G0683K5928d13014a47797j85265C4919a54573C01642
$$ 50742 -31457 30861 -454513 70683 96611 -413014 -147797 -333062 34919 -154573 301642
9352b6714A33710B3194e8202C48682c25012e6640m0196d5940A43388a75417j89874
$$ -26714 133710 23194 -58202 348682 -325012 -56640 -96836 -45940 143388 -175417 -365291
9341c65291A75270C2885b72305E5675A0514L58925a72208L6151j57066n9672a73071
$$ -365291 175270 32885 -272305 55675 10514 369439 -172208 -136057 -293123 -352795 -173071
9329A14360a99215A72522G540b0305C22917b7802l5378A14963B1737a20567A74070
$$ 114360 -199215 172522 7540 -20305 322917 -27802 -63180 114963 21737 -120567 174070
9317d7860r8752G9015a84544B64857a88751c2826k2627j21399k5394A54809c3925
$$ -47860 -146612 79015 -184544 264857 -188751 -32826 -55453 -176852 -202246 154809 -33925
9305a72359p407A79353b7182q4394k36381h1125q311B47719D4387K8518a7275
$$ -172359 -179766 179353 -27182 -111576 -347957 -81125 -89436 247719 44387 72905 -17275
9293i2300B89134a43830C22483h4742j67432h5817H2860a21496G9841d674j7007
$$ -92300 289134 -143830 322483 -84742 -252174 -85817 82860 -121496 79841 -4674 -21681
9282b1681I8816J9861e1304Q464o1926M3664k77055A98103G1476L535J77089c9244
$$ -21681 98816 118677 -51304 -42840 -104766 -61102 -338157 198103 71476 75011 252100 -39244
9269d4279d782j89409k3511f8971A50824a0887m7484j50074G460b59675a5198
$$ -44279 -4782 -194191 -217702 -68971 150824 -10887 -58371 -208445 7460 -259675 -15198
9257A06495J04252b14250h8367A52703d24378a41486j0487j10135K4130g3302
$$ 106495 210747 -214250 -88367 152703 -424378 -141486 -151973 -262108 -237978 -73302
9246g8869C55348e2329A43751K13378D0686a10562D33045A32276a6808A47839
$$ -78869 355348 -52329 143751 357129 40686 -110562 433045 132276 -16808 147839
9235a77435O7280M1269j1064A55983a31019l9538m9832J5786J01006n23405a2900
$$ -177435 -110155 -68886 -79950 155983 -131019 -170557 -220389 -204603 -103597 -627002 -12900
9223A19605O3278E2637e4434A16135f9069m4325j03234F5153R9774b9062p3792
$$ 119605 182883 52637 -54434 116135 -69069 -113394 -216628 65153 164927 -29062 -102854
9212a02854j68078G9852a51092A22559A6761a34527k32199d6543J8608B4687b818
$$ -102854 -270932 79852 -151092 122559 16761 -134527 -366726 -46543 -27935 24687 -2818
9200g6994A30434b00200A2177c7998I1857R6290d7226j8251k12165B08282a40270
$$ -76994 130434 -200200 12177 -37998 91857 188147 -47226 -65477 -277642 208282 -140270
9188B21466b14336J9726g2658C6427a77329e7133k89600D26236b5706p5861A89996
$$ 221466 -214336 -194610 -72658 36427 -177329 -57133 -346733 426236 -25706 -101567 189996
9176B43037b96582F145a59406H2754a71906g6675L272k2663d5265A63820h3653
$$ 243037 -296582 6145 -159406 82754 -171906 -76675 -73403 -96066 -45265 163820 -83653
9164A84895m3307D2880F437J7749Q6823b36698N0793O0239q6870B3206J62455
$$ 184895 141588 42880 6437 24186 111009 -236698 -185905 -125666 -212536 23206 185661
9153A85661L0014a91437c1181l42309A14448D2148f8561o8181I3673g0760C61390
$$ 185661 215675 -191437 -31181 -373490 114448 42148 -68561 -136742 93673 -70760 361390
9141a11725L731k44230A23282a33996o5553k4764p1403i5823p6206c8400m6010
$$ -111725 -107994 -352224 123282 -133996 -199549 -224313 -295716 -95823 -172029 -38400 -84410
9130h4410b6116B6760f8920B50007a42080a6001j48568n2755B7285a09209E1564
$$ -84410 -26116 26760 -68920 250007 -142080 -16001 -164569 -217324 27285 -109209 51564
9118c8238j32672d4052b1743j04229c6392k3819C0448b76731M8775B23933E7690
$$ -38238 -170910 -44052 -21743 -125972 -36392 -60211 30448 -276731 -227956 223933 57690
9106B09850b20017b5675k67332g7096m5805r0446b6248l8772b9695A35988b31547
$$ 209850 -220017 -25675 -293007 -77096 -122901 -213347 -26248 -65020 -29695 135988 -231547
9094A7459a16448D5193d3095r7200A78064b2065j29523A06683b2400A3753c8353
$$ 17459 -116448 45193 -43095 -140295 178064 -22065 -151588 106683 -22400 13753 -38353
9082b14403C7464J24131h3017A75195a64932k0063A44021e8052k00306O849d7123
$$ -214403 37464 161595 -83017 175195 -164932 -184995 144021 -58052 -258358 -251509 -47123
9070B97566e5130j46743F6516k3395a32226j40621E399a64542C7452a5551H4358
$$ 297566 -55130 -201873 66516 43121 -132226 -272847 5399 -164542 37452 -15551 84358
9058C0731a62184j06919Q8263I0749d5638j82545q58Q255B02084e4480b1215o9404
$$ 30731 -162184 -269103 -180840 90749 -45638 -228183 -229041 -220786 202084 -54480 -21215 -90619
9046i0619B24308E6125P6339b22353J07004k644B8416N7451B106b62624a02200
$$ -90619 224308 56125 132464 -222353 -115349 -117993 28416 85867 2106 -262624 -102200
9034H672b28073j87532B05939b83960A15134a18559b6864r711A00591J06392a01922
$$ 8672 -228073 -415605 205939 -283960 115134 -118559 -26864 -36575 100591 206983 -101922
9022a9375n5807D6888J60325o8277b64432k03930a22609B81810d05427F1162c37819
$$ -19375 -75182 46888 207213 138936 -264432 -468362 -122609 281810 -405427 61162 -337819
9010d439j26806k9900A11017a903C5430K7500J82190d3811j58808C8978l25g5202
$$ -4439 -131245 -161145 111017 -1903 35430 62930 245120 -43811 -202619 38978 38653 -75202
8997B4333J79522C3038b83476B06514a54014b384q6695j01233i1237Q765A67808
$$ 24333 203855 33038 -283476 206514 -154014 -2384 -89079 -190312 -91237 -82472 167808
8985e0555f948k6124m81153b38541E5524M7413m8559b61563a24491p2264J9058
$$ -50555 -6948 -33072 -514225 -238541 55524 102937 54378 -261563 -124491 -196755 -177697
8974a77697l7717A40902E6947A3400b96140h0544a523o21122I9787M2216b8883
$$ -177697 -215414 140902 56947 13400 -296140 -80544 -1523 -622645 99787 142003 -28883
8962a25193J606H2627b46766O8000C3138a06390B11740a84794B58445b93623C2247
$$ -125193 -123587 82627 -246766 -178766 33138 -106390 211740 -184794 258445 -293623 32247
8950B9638b14131J06917r5880B10628a9045j47707F3567b5229B06761G8268P5400
$$ 29638 -214131 -107214 -203094 210628 -19045 -166752 63567 -25229 206761 78268 153668
8939A53668K78912i1682m06909I2266G203K0598J2530a80827E5324J14612b6241
$$ 153668 432580 -91682 -498591 92266 7203 27801 40331 -180827 55324 169936 -26241
8927G0822P9932b43399b4330A60481P41678J577101L02586A044415C46276j0612
$$ 70822 150754 -243399 -24330 160481 902159 2479260 2781846 1044415 346276 335664
8917C35664j54756J8320E7718c0451m314j93691R895h1384A04020f0133a1953
$$ 335664 180908 199228 57718 -30451 -34765 -228456 -218561 -81384 104020 -60133 -11953
8905a8828l0697A95467g1109A78309b02116O9802p2091A88481F0969J53777d02173
$$ -18828 -49525 195467 -71109 178309 -202116 -132314 -204405 188481 60969 214746 -402173
8893a35068k0218m391K9596q7039h9658F5911J05781b61856C55783c21135N3716
$$ -135068 -155286 -159677 -130081 -217120 -89658 65911 171692 -261856 355783 -321135 -267419
8882b67419E4499M5729b46704B50606b67499f5887b0044p2728B70016A02742g3200
$$ -267419 54499 100228 -246704 250606 -267499 -65887 -20044 -92772 270016 102742 -73200
8870I2866b1286H7659b35913L2899B19047b87207B21909a42949A45092b69249
$$ 92866 -21286 87659 -235913 -203014 219047 -287207 221909 -142949 145092 -269249
8859D2576a9656r0090C12240a96562M9851M9483n5276K4506c7522j65569K2821
$$ 42576 -19656 -109746 312240 -196562 -146711 -97228 -152504 -127998 -37522 -203091 -180270
$$ [...]
##END NTUPLES=NMR SPECTRUM
##END=
