##TITLE=AC1757_VAR00029_9319893_Oe2PvKAeSc
##JCAMPDX= 6.0         $$ Bruker NMR JCAMP-DX V2.0
##DATA TYPE= NMR SPECTRUM
##DATA CLASS= NTUPLES
##ORIGIN= BRUKER
##OWNER= Administrator
$$ 1.72 TOPSPIN		Version 2.1
$$ 2015-08-12 02:09:26.539 -0700  Administrator@X
$$ Compression mode = diff/dup
##.OBSERVE FREQUENCY= 400.02188249412
##.OBSERVE NUCLEUS= ^1H
##.ACQUISITION MODE= SIMULTANEOUS (DQD)
##.ACQUISITION SCHEME= undefined
##.AVERAGES= 64
##.DIGITISER RES= 22
##SPECTROMETER/DATA SYSTEM= spect
##.PULSE SEQUENCE= noesygpps1d.comp
##.SOLVENT NAME= COFFEE_meoh
##.SHIFT REFERENCE= INTERNAL, COFFEE_meoh, 1, 14.96092
##AUDIT TRAIL= $$ (NUMBER, WHEN, WHO, WHERE, PROCESS, VERSION, WHAT)
$$ ##TITLE= Audit trail, TOPSPIN		Version 2.1
$$ ##JCAMPDX= 5.01
$$ ##ORIGIN= Bruker BioSpin GmbH
$$ ##OWNER= Administrator
$$ $$ E:\/data/COFFEE/nmr/AC1757_VAR00029_9319893_Oe2PvKAeSc/12/pdata/1/auditp.txt
$$ ##AUDIT TRAIL=  $$ (NUMBER, WHEN, WHO, WHERE, PROCESS, VERSION, WHAT)
(   1,<2015-08-12 02:09:21.085 -0700>,<Administrator>,<X>,<go>,<TOPSPIN 2.1>,
      <created by zg
	started at 2015-08-12 01:57:51.414 -0700,
	POWCHK enabled, PULCHK disabled,
       configuration hash MD5:
       21 0F 79 D6 B3 7B B4 F6 88 20 88 DB 03 48 BD 9F
       data hash MD5: 64K
       3E 9A BA BE 63 FD 39 E3 CF B2 31 0B 69 11 F8 28>)
(   2,<2015-08-12 02:09:24.492 -0700>,<Administrator>,<X>,<proc1d>,<TOPSPIN 2.1>,
      <Start of raw data processing
       efp LB = 0.3 FT_mod = 6 PKNL = 1 PHC0 = 0 PHC1 = 0 SI = 128K 
       data hash MD5: 128K
       56 3C CF CD BB 35 AB C2 BC 3E D5 90 F4 EA DC A7>)
(   3,<2015-08-12 02:09:25.367 -0700>,<Administrator>,<X>,<proc1d>,<TOPSPIN 2.1>,
      <pk PHC0 = -88.1543 PHC1 = 0 
       data hash MD5: 128K
       A8 6C 33 33 44 90 19 CD 43 02 40 BC A9 E6 8D 30>)
(   4,<2015-08-12 02:09:25.742 -0700>,<Administrator>,<X>,<proc1d>,<TOPSPIN 2.1>,
      <abs ABSG = 1 
       data hash MD5: 128K
       06 6E A1 5F 92 55 EA 67 39 75 C3 4F C2 36 1C 8A>)
(   5,<2015-08-12 02:09:25.851 -0700>,<Administrator>,<X>,<proc1d>,<TOPSPIN 2.1>,
      <abs ABSG = 2 
       data hash MD5: 128K
       51 D1 92 50 28 37 53 FD 68 07 47 2C D9 BE 94 67>)
(   6,<2015-08-12 02:09:25.929 -0700>,<Administrator>,<X>,<proc1d>,<TOPSPIN 2.1>,
      <abs ABSG = 3 
       data hash MD5: 128K
       45 5E B2 30 B5 D5 6C 5D E8 5D 3C 5A 0C 26 00 C7>)
(   7,<2015-08-12 02:09:26.023 -0700>,<Administrator>,<X>,<proc1d>,<TOPSPIN 2.1>,
      <abs ABSG = 4 
       data hash MD5: 128K
       44 29 A0 2D 33 CD D3 7A 60 0B F3 41 81 CE 26 96>)
(   8,<2015-08-12 02:09:26.101 -0700>,<Administrator>,<X>,<proc1d>,<TOPSPIN 2.1>,
      <abs ABSG = 5 
       data hash MD5: 128K
       EB A5 FA BC 70 DF E2 BA 4C 45 7B FB E3 F3 07 5F>)
$$ ##END=
$$ 
$$ $$ hash MD5
$$ $$ F8 81 BB FA F3 7D 10 AB FF E4 B0 28 65 D8 67 2C
##$RELAX= 
##$RELAX= 
##$RELAX= 
##$RELAX= 
##$RELAX= 
##$RELAX= 
##$RELAX= 
##$RELAX= 
$$ Bruker specific parameters
$$ --------------------------
##$DU= <E:\>
##$EXPNO= 12
$$ [...]
##$TP07= 0
##$TPNAME0= <>
##$TPNAME1= <>
##$TPNAME2= <>
##$TPNAME3= <>
##$TPNAME4= <>
##$TPNAME5= <>
##$TPNAME6= <>
##$TPNAME7= <>
##$TPOAL= (0..7)
0.5 0.5 0.5 0.5 0.5 0.5 0.5 0.5
##$TPOFFS= (0..7)
0 0 0 0 0 0 0 0
##$TUNHIN= 0
##$TUNHOUT= 0
##$TUNXOUT= 0
##$USERA1= <user>
##$USERA2= <user>
##$USERA3= <user>
##$USERA4= <user>
##$USERA5= <user>
##$V9= 5
##$VALIST= <valist>
##$VCLIST= <CCCCCCCCCCCCCCC>
##$VD= 0
##$VDLIST= <DDDDDDDDDDDDDDD>
##$VPLIST= <PPPPPPPPPPPPPPP>
##$VTLIST= <TTTTTTTTTTTTTTT>
##$WBST= 2048
##$WBSW= 25
##$XGAIN= (0..3)
0 0 0 0
##$XL= 0
##$YL= 0
##$YMAX_a= 5631248
##$YMIN_a= -11459485
##$ZGOPTNS= <>
##$ZL1= 120
##$ZL2= 120
##$ZL3= 120
##$ZL4= 120
##$ABSF1= 14.96092
##$ABSF2= -5.597261
##$ABSG= 5
##$ABSL= 3
##$ALPHA= 0
##$AQORDER= 0
##$ASSFAC= 0
##$ASSFACI= 0
##$ASSFACX= 0
##$ASSWID= 0
##$AUNMP= <proc_prof1d_extract.lims>
##$AXLEFT= 0
##$AXNAME= <>
##$AXNUC= <1H>
##$AXRIGHT= 0
##$AXTYPE= 0
##$AXUNIT= <>
##$AZFE= 0.1
##$AZFW= 0.1
##$BCFW= 0
##$BC_mod= 0
##$BYTORDP= 0
##$COROFFS= 0
##$CY= 15
##$DATMOD= 1
##$DC= 0
##$DFILT= <>
##$DTYPP= 0
##$F1P= 0
##$F2P= 0
##$FCOR= 0.5
##$FTSIZE= 131072
##$FT_mod= 6
##$GAMMA= 0
##$GB= 0
##$INTBC= 1
##$INTSCL= 1
##$ISEN= 128
##$LB= 0.3
##$LEV0= 0
##$LPBIN= 0
##$MAXI= 10000
##$MC2= 0
##$MEAN= 0
##$ME_mod= 0
##$MI= 0
##$NCOEF= 0
##$NC_proc= -2
##$NLEV= 6
##$NOISF1= 0
##$NOISF2= 0
##$NSP= 0
##$NTH_PI= 0
##$NZP= 0
##$OFFSET= 14.96092
##$PC= 1
##$PHC0= -88.1543
##$PHC1= 0
##$PH_mod= 1
##$PKNL= yes
##$PPARMOD= 0
##$PPDIAG= 0
##$PPIPTYP= 0
##$PPMPNUM= 2147483647
##$PPRESOL= 1
##$PSCAL= 4
##$PSIGN= 0
##$PYNMP= <proc.py>
##$REVERSE= no
##$SF= 400.020009668595
##$SI= 131072
##$SIGF1= 0
##$SIGF2= 0
##$SINO= 400
##$SIOLD= 131072
##$SPECTYP= <>
##$SREGLST= <1H.CDCl3>
##$SSB= 0
##$STSI= 131072
##$STSR= 0
##$SW_p= 8223.68421052631
##$SYMM= 0
##$S_DEV= 0
##$TDeff= 65536
##$TDoff= 0
##$TI= <>
##$TILT= no
##$TM1= 0
##$TM2= 0
##$TOPLEV= 0
##$USERP1= <user>
##$USERP2= <user>
##$USERP3= <user>
##$USERP4= <user>
##$USERP5= <user>
##$WDW= 1
##$XDIM= 131072
##$YMAX_p= 424052458
##$YMIN_p= -449350
##$CURPLOT= <Network HP LaserJet P1505>
##$CURPRIN= <$Network HP LaserJet P1505>
##$DFORMAT= <normdp>
##$LAYOUT= <+/1D_H.xwp>
##$LFORMAT= <normlp>
##$PFORMAT= <normpl>
##$SURQMSG= 1
$$ End of Bruker specific parameters
$$ ---------------------------------
##NTUPLES= NMR SPECTRUM
##VAR_NAME=  FREQUENCY,     SPECTRUM/REAL,   SPECTRUM/IMAG
##SYMBOL=    X,             R,               I
##VAR_TYPE=  INDEPENDENT,   DEPENDENT,       DEPENDENT
##VAR_FORM=  AFFN,          ASDF,            ASDF
##VAR_DIM=   131072,        131072,          131072
##UNITS=     HZ,            ARBITRARY UNITS, ARBITRARY UNITS
##FACTOR=    0.0627417313425164, 1,          1
##FIRST=     8223.62146879497, 1934,         -53549
##LAST=      0,             4431,            -53888
##MIN=       0,             -449350,         0
##MAX=       8223.62146879497, 424052458,    0
$$ Real data points
##PAGE= N=1
##DATA TABLE= (X++(R..R)), XYDATA
$$ [...]
65206 160540 162156 162769 162243 161272 160710 160796 161008 160494 158717 155931 153137 151423 151130 151713 152441 153145 154137
65189 154137 155548 157059 158375 159706 161509 163860 166351 168652 170915 173431 176071 178348 180001 181280
65175 181280 182565 183856 184760 184993 184784 184707 185033 185389 185296 185084 185930 188657 192748 196959 200778 204754 209389
65158 209389 214293 218757 222746 226959 232150 238699 246512 254921 262966 270347 278127 288046 301045 316810
65144 316810 334745 354892 377622 402803 429682 457456 485603 513639 540850 566470 590117
65133 590117 611958 632429 651780 669834 685961 699094 707818 710902 708097 700418 689452 676396
65121 676396 661783 645776 628181 608226 584883 557873 528230 497731 467845 439310 412364
65110 412364 387004 363066 340461 319512 300933 285269 272352 261365 251452 242256 233924 226750
65098 226750 220871 216206 212478 209247 206090 202885 199804 196987 194420 192283 191156 191545 193235 195389
65084 195389 197251 198502 198991 198561 197299 195654 194084 192755 191707 191020 190592 190029 189110 188248 188081 188612
65068 188612 189064 188762 187956 187526 187921 188593 188610 187776 186927 187011 188059 189291 190185 191046 192418 194264 196015 197246
65050 197246 197934 198150 197860 197162 196455 196121 196100 195943 195342 194519 193976 193858 193662 192704 190818 188445 186051 183741
65032 183741 181479 179360 177337 174921 171633 167800 164518 162584 161711 161084 160484 160477 161425 162727 163373 163112
65016 163112 162692 162886 163656 164513 165477 167180 169954 173135 175576 176800 177510 178943 181786 185699 189780 193402
65000 193402 196540 199376 201800 203438 204026 203616 202515 201231 200418 200595 201868 204047 206912 210198 213470
64985 213470 216429 219293 222422 225556 227955 229451 230761 232414 233888 234263 233282 231198 227984 223477 218155
64970 218155 212997 208484 204329 200291 196641 193631 191101 188882 187081 185654 184193 182498 180959 179933
64956 179933 179151 178218 177367 177080 177153 176835 175859 174692 173687 172660 171611 171244 172197 174042 175609 176210 176156
64939 176156 176134 176493 177188 178047 178856 179397 179648 179908 180568 181722 183007 183791 183701 183055 182677 183012 183501 183153 181732
64920 181732 180015 178775 177992 177354 177046 177478 178487 179453 180208 181251 182940 185012 187123 189427 192308 195873
64904 195873 200079 205094 211157 218204 225960 234311 243264 252566 261641 269993 277485 284207 290182 295254
64890 295254 299196 301907 303503 304162 304002 303231 302244 301109 298958 294496 287471 279288 271682 265091 258848
64875 258848 252722 247523 244065 242125 240781 239448 238280 237685 237747 238167 238602 238910 238989 238520 237125 234793
64859 234793 231773 227946 222863 216772 211088 207090 204430 201684 198340 195353 193602 192672 191617 190209
64845 190209 188876 187867 187158 186874 187208 188009 188882 189580 189928 189605 188511 187255 186723 187136 187983 188900 190107
64828 190107 191798 193612 195055 196169 197437 199212 201499 204175 207130 210289 213832 218401 224736 232945
64814 232945 242351 252222 262495 273593 285668 298344 311094 323433 334610 343470 348997 350853
64802 350853 349185 344132 335890 325181 313222 301116 289479 278652 268950 260565 253442 247402 242235
64789 242235 237679 233556 230044 227517 225943 224709 223288 221909 221310 221882 223298 225011 226917 229478 233240
64774 233240 238308 244323 250927 258104 266047 274899 284798 295891 307917 319852 330509 339565 347678
64761 347678 355521 363047 369753 375210 379192 381781 383564 385282 386942 387715 386987 385053 382403 378847 373943
64746 373943 367890 361280 354150 345944 336358 325628 314117 302290 291063 281482 273830 267612 262506
64733 262506 258761 256461 255035 253866 252944 252514 252500 252659 253003 253684 254675 255968 257924 261009 265167 269731
64717 269731 273957 277524 280560 283349 285972 288168 289637 290436 290820 290613 289028 285399 279901 273370 266581
64702 266581 259967 253835 248488 244044 240367 237229 234499 232178 230319 228880 227646 226421 225305 224624
64688 224624 224565 225110 226351 228539 231665 235323 239262 243805 249450 256396 264754 274864 286842 299957
64674 299957 313089 325767 338210 350279 360976 369131 374131 375736 373710 368033 359202 348024 335384
64661 335384 322403 310418 300304 292032 285231 279900 276084 273154 270209 267225 265149 264626 265270 266575
64647 266575 268925 273036 278709 284948 291402 299037 309026 321364 335008 349177 364093 380345 397767
64634 397767 415106 430655 443160 452207 457973 460773 460832 458363 453643 446981 438670 429067 418587 407546
64620 407546 396082 384381 372886 362111 352265 343359 335762 330241 327109 325486 323933 321920 320287
64607 320287 319991 320752 321306 320917 320085 319623 319400 318405 315922 312326 308575 305195 301963 298506 294888 291474
64591 291474 288378 285360 282314 279629 277860 277173 277312 278039 279399 281561 284561 288277 292461 296753 300789
64576 300789 304368 307387 309640 310855 310940 309946 307746 304119 299342 294337 289877 285854 281650 277000 272022
64561 272022 266620 260517 254014 248035 243120 238843 234656 230964 228732 228090 227830 226518 223872 220921 218973
64546 218973 218537 219110 219822 220238 220649 221701 223822 226894 230263 232977 234221 233782 232240 230589 229540 229065
64530 229065 228593 227653 226281 224746 223032 220876 218446 216697 216739 218896 222524 226586 230178 232790 234561
64515 234561 236282 238687 241647 244448 246930 249859 253985 259221 265093 271595 279157 287999 297966 308879
64501 308879 320676 333198 346028 358436 369333 377552 382463 384139 382725 378011 370060 359971 349438
64488 349438 339559 330455 321941 314055 306924 300594 295169 290757 287178 284027 281131 278685 276870 275547
64474 275547 274358 272860 270582 267284 263243 259077 255297 252221 250141 249169 248992 249290 250384 252904 256686
64459 256686 260513 263282 264996 266365 267788 269059 269806 269899 269591 269429 269830 270614 271204 271366 271489 272082 273468
64442 273468 276033 280169 285624 291421 296937 302615 309150 316443 324043 332295 342216 354265 368020 383218
64428 383218 400494 420812 444633 471969 503030 538654 580336 629896 688832 757791 836825
64417 836825 926028 1025397 1133754 1248041 1363911 1477017 1583913 1682301 1770885 1848812
64407 1848812 1914853 1966982 2002876 2020874 2020635 2003154 1970374 1924531 1867350 1799508 1720818 1631107
64395 1631107 1531241 1423663 1312084 1200481 1092130 989379 894075 807891 732091 667083
64385 667083 612318 566549 528190 495642 467651 443533 423057 406052 392039 380228 369795
64374 369795 360220 351416 343577 336812 330852 325058 318820 312043 305264 299238 294323 290202 286123 281486
64360 281486 276415 271896 269133 268470 269051 269795 270644 272498 275977 280775 286376 292857 300583 309448 318860
64345 318860 328227 336994 344383 349609 352346 352670 350657 346514 341040 335405 330282 325525 320820 316304
64331 316304 312466 309773 308505 308594 309504 310590 311762 313424 315613 317629 318797 319225 319434 319502 318993 317594
64315 317594 315452 312966 310501 308132 305414 301635 296703 291614 287534 284453 281215 276898 271677 266259
64301 266259 261099 256469 252743 250058 247945 245853 243959 242937 242964 243447 243918 244700 246311 248586 250895
64286 250895 253164 256121 260406 265859 271951 278609 286179 294749 303915 313259 322594 331707 340313 348558
64272 348558 357116 366295 375244 382524 387428 390256 391322 390403 387491 383533 379814 376823 374334 372482
64258 372482 372066 373493 375932 377902 378424 377197 373951 368266 360170 350440 339950 328991 317511 305939
64244 305939 295374 286836 280491 275681 271604 267846 264452 261696 259873 259118 259269 259889 260480 260725 260557
64229 260557 260167 260059 260940 263194 266344 269290 271253 272358 273055 273245 272363 270251 267496 264781 262266 259813
64213 259813 257458 255368 253545 251924 250604 249670 248909 248070 247353 247251 247840 248585 249012 249340 250208 251952 254294
64196 254294 256703 259029 261865 266274 272970 281818 292307 304439 318725 335213 352983 370898 388483
64183 388483 405575 421391 434494 443684 448469 448749 444629 436725 426129 413666 399484 383743 367397
64170 367397 351856 337957 325638 314507 304312 294856 285972 277801 270785 265159 260646 256852 253770
64157 253770 251706 250891 251382 253169 256047 259491 262979 266476 270326 274606 278871 282623 285806 288652 291215
64142 291215 293300 294767 295698 296214 296224 295480 293851 291561 289095 286891 285111 283724 282644 281750 280923 280268
64126 280268 280221 281219 283258 285993 289254 293207 297984 303450 309488 316240 323882 332350 341527 351549 362665
64111 362665 374841 387678 400644 413210 424806 434781 442549 447784 450667 451963 452745 453932 456168
64098 456168 460001 465808 473376 481919 490744 499587 508061 515156 519749 521461 520649 517784 513308 507882
64084 507882 502115 495986 488952 480650 471092 460376 448803 437257 426719 417209 407914 398596 390119
64071 390119 383136 377003 370712 364366 358897 354639 351029 347644 344658 342153 339739 337220 335118 334149
64057 334149 334446 335561 336980 338435 339937 341753 344226 347462 351330 355843 361258 367736 375173 383564
64043 383564 393263 404566 417220 430721 444934 460081 476062 492093 507082 520186 531018 539569
64031 539569 545979 550167 551661 550128 546228 541615 537748 534820 532119 529230 526439 523970 521415 518171
64017 518171 514075 509253 503570 496598 488072 478082 466937 455179 443730 433538 424879 417184 409718
64004 409718 402338 395540 389943 385768 382630 379765 376687 373729 371772 371351 372281 374198 377079 380935 385309
63989 385309 389564 393565 397668 402024 406298 410209 414101 418739 424629 431570 438789 445564 451925 458750
63975 458750 466982 476696 487159 497846 509095 521616 535656 550987 567544 585628 605417 626585
63963 626585 648661 671619 695973 722384 751318 783052 817823 856013 898346 946011 1000454
63952 1000454 1062956 1134502 1216114 1309208 1415467 1536426 1673363 1827610 2000781 2194421
63942 2194421 2409318 2645006 2899845 3171517 3457508 3755046 4060538 4369096 4674606
63933 4674606 4970213 5248810 5503455 5727839 5916610 6065352 6170497 6229573 6241451 6206083
63923 6206083 6124069 5996868 5827532 5620830 5382483 5118553 4835546 4540476 4240118 3940159
63913 3940159 3645230 3359519 3086928 2830646 2592800 2374435 2175716 1996354 1836148
63904 1836148 1694992 1572128 1465667 1373259 1293160 1224273 1165320 1114583 1070556 1032353 999216
63893 999216 969960 943150 917628 892683 867918 843116 818143 792924 767714 743375 721018
63882 721018 701135 683258 666691 651430 638186 627599 619624 613671 609317 606868 607192 610826 617318
63869 617318 625609 635120 646239 659713 675791 693977 713404 733334 753482 773992 795055 816601
63857 816601 838429 860403 882098 902429 920177 935000 947462 958028 966492 972439 975562 975274
63845 975274 970762 961914 949616 934680 917044 896560 873835 849411 822748 793229 761908 731005
63833 731005 701567 672749 643695 615007 587812 562374 538387 516010 495732 477532 460874
63822 460874 445363 430873 417254 404444 392725 382399 373302 365071 357721 351505 346312 341656 337335
63809 337335 333626 330768 328555 326580 324701 323130 322130 321557 320742 319053 316643 314249 312061 309301 305399
63794 305399 301111 297755 295558 293564 291070 288247 285207 281482 276947 272515 269184 266787 264391 261724
63780 261724 259509 258431 258371 258765 259242 259656 259756 259170 257718 255693 253780 252547 251959 251445 250522 249221 247907
63763 247907 246894 246388 246502 247076 247593 247590 247059 246289 245472 244718 244261 244288 244639 245040 245621 246793 248590 250510
63745 250510 252162 253710 255480 257461 259480 261702 264519 267898 271152 273581 275272 277023 279398 282010
63731 282010 283997 285127 286100 287685 289973 292715 296014 300138 304854 309487 313651 317439 320855 323641
63717 323641 325837 327966 330386 332823 334873 336530 337847 338422 337722 335805 333331 330958 328997 327464 326075
63702 326075 324393 322388 320797 320492 321530 323180 324847 326556 328602 331217 334596 338684 342792 346008
63688 346008 348295 350686 353997 357743 360744 362453 363083 362721 361115 358407 355438 353031 351327 350099 349318
63673 349318 349077 349231 349544 350097 351164 352648 353982 354703 354912 355016 355185 355181 354616 353228 350972 348000 344568
63656 344568 340890 337100 333312 329597 325820 321685 317158 312784 309341 307155 305904 305094 304530 304298 304536
63641 304536 305373 306862 308814 310863 312881 315223 318371 322385 326908 331579 336221 340704 344921 349006
63627 349006 353403 358595 364843 372085 379952 387914 395691 403647 412619 423277 435757 449883 465554
63614 465554 482851 501999 523308 546921 572492 599410 627538 657418 689317 722156 753811
63603 753811 782549 807828 829630 847427 860172 867177 868769 866136 860775 854070 847046 840206 833448
63590 833448 826180 817551 806703 793022 776331 756902 735225 711740 686851 661240 636022 612364
63578 612364 590927 571764 554782 540044 527548 517012 508187 501313 496971 495398 496138 498336 501193
63565 501193 504227 507461 511458 516907 523990 532273 541175 550228 558916 566872 574609 583596 595127 609384
63551 609384 626075 645601 668863 696112 726859 760863 798282 838472 879356 918279 952794
63540 952794 980356 998400 1005907 1004550 997449 987007 974597 961698 949967 940011 931072 922158 912626
63527 912626 901506 887317 869219 847636 823198 795742 765108 732406 699654 668322 638812
63516 638812 611124 585340 561481 539540 519713 502206 486774 472815 459898 447899 436766
63505 436766 426560 417677 410548 405060 400534 396289 391939 387353 382807 379071 376784 375636 374651 373333
63491 373333 371986 370881 369787 368617 367855 367809 367911 367469 366881 367405 369646 372859 375961 378833 382267 386794
63475 386794 391910 396553 400111 402733 404696 405772 405472 403755 401185 398364 395520 392666 389847 387074
63461 387074 384296 381647 379501 378079 377147 376345 375695 375530 376052 377249 379215 382200 386255 391053 396254
63446 396254 401957 408604 416456 425235 434381 443611 453208 463747 475616 488840 503358 519390 537600
63433 537600 558869 583667 611310 639796 666600 689903 709141 724587 736720 746154 753975 761886
63421 761886 771793 785113 802328 823174 847312 874714 905311 938355 972328 1005388 1035640 1061101
63409 1061101 1079956 1091290 1095593 1094416 1089546 1082369 1073717 1064042 1053655 1042757 1031146 1018036
63397 1018036 1002437 983723 961638 935895 906299 873464 839002 804677 771514 739808 709676
63386 709676 681255 654631 629955 607597 587941 571091 556924 545296 536041 528942 523964 521402
63374 521402 521569 524350 529224 535583 542961 551117 560151 570400 582019 594873 608998 624934 643227
63361 643227 663800 686230 710545 737300 766819 798712 832284 867048 902576 937976 971673
63350 971673 1001767 1026660 1045499 1058089 1064486 1064941 1060337 1052364 1042823 1032825 1022779 1012864 1002951
63337 1002951 992097 978666 961262 939400 913391 884040 852616 820699 789606 759944 731828
63326 731828 705432 681216 659757 641490 626554 614828 606118 600262 596876 594980 592991 589146 581958
63313 581958 570586 555187 537021 517924 499501 482765 468274 456149 445920 436789 428318 420694
63301 420694 414245 408937 404489 400745 397711 395360 393507 391764 389550 386438 382652 378974 375909 373089
63287 373089 369753 365681 361388 357469 354038 350884 347898 345192 342903 341054 339656 338815 338608 338856 339207
63272 339207 339519 340016 340881 341855 342508 342848 343370 344443 345909 347352 348601 349875 351609 354076 356999 359656
63256 359656 361721 363912 367257 371658 375767 378578 380620 383147 386667 390821 395350 400413 406095 412305
63242 412305 419256 427452 436972 447250 457821 468928 481165 494781 509552 525098 541159 557779
63230 557779 575420 594643 615445 637101 658884 680697 702726 724719 746065 766572 786719
63219 786719 807043 827636 848420 869492 890830 911894 931979 950962 969256 986817 1002533
63208 1002533 1014796 1022511 1025297 1023020 1015607 1003404 987252 967919 945696 920859 894401 867922
63196 867922 842669 818934 796533 775668 757036 741117 727748 716580 707737 701685 698507 697691
63184 697691 698760 701812 707244 715198 725527 737998 752101 766856 781378 795725 810750 826900
63172 826900 843537 859618 874669 888754 901746 913135 922589 930393 937162 943100 947461 948816 946060
63159 946060 939277 929399 916940 901419 882291 860098 836251 811880 787409 763167 739774 717695
63147 717695 696886 677313 659562 644438 631898 620779 609892 599267 590013 582886 577296 572027
63135 572027 566772 562501 560240 559939 560764 562113 563921 566212 568826 571591 574482 577702 581892 588001 596401
63120 596401 606098 615336 623091 629548 635104 639574 642783 645353 648193 651329 653884 655353 656433 658276
63106 658276 661115 663932 665545 665745 665196 664360 663009 660979 658929 657770 657476 657119 656167 655120 654540 654077
63090 654077 653031 651529 650511 650638 651727 653245 654909 656748 659015 662061 665892 669767 672656 674313
63076 674313 675575 677499 680553 684779 690224 696774 703866 710890 717852 725277 733512 742469 752092 762682
63062 762682 774592 787880 802506 818730 837131 858247 882315 909319 939140 971626 1006583
63051 1006583 1043848 1083428 1125531 1170357 1217735 1266994 1317288 1368083 1419328 1471197 1523678
63040 1523678 1576364 1628573 1679710 1729600 1778504 1826811 1874761 1922387 1969489 2015474 2059285
63029 2059285 2099708 2135734 2166498 2190874 2207358 2214416 2210937 2196427 2171006 2135302 2090242 2036918
63017 2036918 1976779 1911836 1844342 1776151 1708668 1643464 1582508 1527420 1478711 1436132 1399648
63006 1399648 1369682 1346518 1329920 1319403 1314433 1314239 1317927 1325145 1336337 1351866 1370954 1391916
62994 1391916 1413522 1435816 1459457 1484489 1510073 1535352 1560272 1585424 1611154 1636908 1661367
62983 1661367 1683099 1701167 1715284 1725389 1730944 1730643 1723071 1707862 1686023 1658965 1627335 1591012
62971 1591012 1550089 1505471 1458484 1410242 1361563 1313275 1266376 1221893 1180558 1142455 1106975
62960 1106975 1073376 1041503 1011852 984850 960233 937173 914768 892378 869825 847512 826114
62949 826114 805925 786676 768191 750871 735154 720747 706898 693361 680585 668892 658033
62938 658033 647793 638577 630943 624737 619144 613602 608353 603947 600462 597491 594829 592841 591929 591785
62924 591785 591554 590816 590068 589870 589792 588691 586128 583072 580926 580002 579190 577086 573336 568881 564936 561738
62908 561738 558429 554255 549712 546123 544111 542882 541181 538594 535675 533186 531607 531138 531610 532392 532793
62893 532793 532707 532554 532551 532427 531999 531676 532074 533245 534526 535118 534704 533644 532705 532497 533010 533707 534089 534034 533579
62874 533579 532668 531360 530041 529073 528282 527121 525262 522762 519778 516584 513942 512922 513955 516276 518571
62859 518571 520028 520676 521025 521681 523055 525007 526878 528219 529397 531146 533570 535997 537786 538808 539099
62844 539099 538579 537364 535926 534610 533299 531902 530832 530514 530616 530299 529257 528050 527283 526860 526284 525452
62828 525452 524804 524760 525293 526113 527098 528362 529938 531585 533022 534256 535473 536657 537650 538719 540706 544236
62812 544236 548867 553410 557095 560149 563221 566600 570163 573794 577508 581240 584796 588126 591619 596029
62798 596029 601967 609251 616817 623579 629615 636337 645262 656723 670024 684695 701195 720301 742327
62785 742327 767270 795503 827797 864671 906147 952277 1003528 1060274 1122095 1188009 1257359
62774 1257359 1330153 1406412 1485428 1565692 1645244 1721993 1793976 1859638 1917698 1966576 2004140
62763 2004140 2028395 2038407 2034363 2016829 1986361 1943838 1890815 1829275 1761194 1688400 1612633
62752 1612633 1535413 1457904 1381113 1306176 1234253 1166115 1101980 1041828 985766 933994 886574
62741 886574 843397 804364 769454 738563 711393 687617 667039 649481 634513 621459 609713
62730 609713 599015 589457 581306 574728 569542 565239 561405 558090 555564 553742 552160 550653 549704 549887
62716 549887 551206 553239 555842 559391 564479 571635 581194 593027 606400 620517 635403 651991 671193
62703 671193 693133 717483 744338 774409 808332 846000 886716 929919 975639 1024219 1075739
62692 1075739 1129821 1185925 1243542 1301944 1359823 1415292 1466186 1510437 1546457 1573365 1590682
62681 1590682 1597708 1593527 1577934 1552123 1518012 1477012 1429773 1377010 1320090 1260764 1200718 1141409
62669 1141409 1083893 1028667 975996 926447 880710 838947 800773 766011 734869 707151 681927
62658 681927 658464 637025 618261 602169 588206 576052 565566 556194 547222 538697 531334 525250
62646 525250 519382 512625 505181 498323 493037 489256 486328 483802 481672 480145 479403 479514 480414 481890 483591
62631 483591 485116 486159 486554 486137 484698 482199 479116 476370 474787 474505 474962 475462 475738 476022 476669 477916
62615 477916 479990 483189 487556 492497 497101 500982 504649 508956 514364 520874 528354 536589 545146 553654
62601 553654 562352 572129 583859 597861 614098 632689 653982 678184 705184 734832 767262 802744
62589 802744 841149 881625 922847 963461 1002258 1038088 1069865 1096666 1117657 1131906 1138587 1137525
62577 1137525 1129384 1115132 1095425 1070629 1041296 1008421 973312 937316 901524 866454 832004
62566 832004 797924 764396 732159 702128 674973 650921 629776 611174 594948 581160 569722
62555 569722 560157 551924 544801 538677 533181 527895 522842 518375 514554 511101 508009 505760 504671 504362
62541 504362 504166 503807 503369 502836 502078 501218 500658 500606 500765 500666 500260 500164 501203 503610 506684 509467 511858 514841
62523 514841 519440 525699 532980 541049 550478 562039 576137 592916 612502 634875 659767 686984
62511 686984 716727 749348 784861 822861 862848 904343 946644 988671 1029244 1067563 1103302
62500 1103302 1136207 1165605 1190530 1210586 1226672 1240620 1254063 1267917 1283029 1300845 1322987
62489 1322987 1350370 1383219 1421739 1466151 1516060 1570483 1628825 1691192 1757209 1824687 1889723
62478 1889723 1947823 1994894 2028094 2046816 2052667 2047484 2030983 2000810 1954995 1893945 1820129 1736725
62466 1736725 1646973 1554024 1460464 1367914 1277484 1190547 1108807 1033774 966440 907296 856326
62455 856326 813007 776535 746020 720424 698653 680078 664774 652930 644147 637623 632887 629960
62443 629960 628884 629495 631695 635520 640883 647574 655592 665050 675499 685641 694107 700473 705244 708796
62429 708796 710556 709428 704952 697787 688927 678694 666847 653628 640174 627622 616116 604975
62417 604975 593626 582083 570765 560212 550842 542591 534889 527345 520304 514333 509291 504529 499980
62404 499980 496400 494254 492912 491340 489262 487174 485508 484269 483442 483330 484364 486761 490423 494969 499791
62389 499791 504199 507667 510067 511748 513369 515484 518179 521163 524285 527906 532701 539013 546440 554126
62375 554126 561530 568860 576626 584884 593215 601459 610015 619194 628760 638596 649539 662939 679479
62362 679479 698948 721149 746438 775302 808045 845040 886679 932716 982113 1033935 1088005
62351 1088005 1144178 1201123 1256255 1306844 1351021 1387912 1417120 1438207 1450716 1454833 1451787 1443150
62339 1443150 1429629 1410981 1387131 1358716 1326341 1290187 1251008 1210938 1172379 1136285 1102222
62328 1102222 1069874 1039710 1012199 987205 964319 943175 923221 903774 884543 865616 846700
62317 846700 826898 805626 783406 761384 740320 720332 701380 683576 667070 651974 638433
62306 638433 626643 616742 608696 602272 597141 593119 590284 588748 588397 589026 590665 593539 597779 603470
62292 603470 610814 619760 629449 638562 646461 653587 660515 667085 672806 677682 682077 685964 688766 689978
62278 689978 689650 688279 686505 684804 683268 681727 680244 679332 679526 681000 683861 688461 694963 702826 711289
62263 711289 720414 731209 744809 762001 783515 810126 842237 879780 922653 970736 1023251 1078675
62251 1078675 1135708 1193890 1252780 1310816 1365463 1414247 1455294 1487283 1509658 1522911 1527939
62240 1527939 1524932 1513270 1492550 1463276 1426451 1383057 1334246 1281569 1226615 1170664 1114953
62229 1114953 1060948 1009829 961865 916806 874937 837348 804973 777640 754243 733729 715675
62218 715675 700029 686531 674605 663832 654372 646733 641099 636955 633415 629846 626165 622685 619788
62205 619788 617726 616621 616589 617759 620076 623117 626264 629083 631537 633948 636904 640966 646091 651382 655847
62190 655847 659523 663485 668728 675407 683262 692122 701699 711505 721496 732323 744308 756560 767766
62177 767766 777607 786648 795138 802845 810034 817577 825838 834399 843365 854245 868928 888280 912250
62164 912250 940795 973968 1011309 1051774 1094223 1137589 1180626 1221889 1259950 1293412 1320886
62153 1320886 1341283 1354141 1359602 1358220 1350895 1338604 1321846 1300586 1275006 1246038 1214892 1182355
62141 1182355 1148900 1115251 1082453 1051599 1023745 999740 979649 962606 947726 934938 924439
62130 924439 915668 907507 899377 891429 883700 875858 867807 859869 852152 844413 836812 830182 825229 821950
62116 821950 820171 820121 822030 825541 829948 834696 839204 842472 843376 841409 836969 831059 824902 819542 815472
62101 815472 812560 810334 808107 804897 799807 792881 785235 778028 771584 765832 761120 757954 756157 754940
62087 754940 753923 753568 754524 756858 760075 763661 767544 772176 778205 785942 795273 806164 818949 833852
62073 833852 850560 868711 888483 910054 932628 954805 976078 997332 1019621 1043127 1067655
62062 1067655 1093487 1121047 1149995 1179211 1207432 1233410 1255733 1273285 1285997 1294612 1299489 1300043
62050 1300043 1295497 1285736 1271111 1251744 1227425 1198113 1164303 1126954 1087187 1045955 1003873 961468
62038 961468 919639 879627 842286 807566 775025 744720 717273 693106 671967 653243 636435
62027 636435 621239 607507 595326 584937 576386 569436 563834 559371 555548 551590 547117 542535 538353
62014 538353 534332 529809 524742 519887 515866 512574 509720 507512 506443 506614 507545 508544 509129 509276 509470 510402
61998 510402 512463 515573 519523 524193 529264 534006 537723 540363 542448 544391 546056 546888 546299 543945 539801
61983 539801 534046 526884 518570 509654 500988 493324 486967 481883 477907 474677 471553 467975 463882 459680
61969 459680 455929 453098 451344 450230 448948 447208 445651 444945 444656 443664 441632 439378 437653 436241 434635
61954 434635 433001 431919 431528 431484 431627 432158 433208 434671 436524 439024 442517 447232 453254 460517 468819
61939 468819 477992 487989 498699 509817 521091 532547 544195 555677 566630 577333 588528 600393
61927 600393 611977 621881 629329 634444 637710 639412 639562 638154 635360 631446 626558 620824 614809 609631
61913 609631 606197 604279 602800 601238 600438 601779 605788 611898 619359 627878 637258 646814 655497 662539
61899 662539 667819 671580 673956 674899 674463 672943 670542 667085 662320 656490 650332 644438 638887 633616 628814
61884 628814 624711 621181 617796 614102 609595 603675 596110 587510 578906 570726 562478 553570 544147 534943
61870 534943 526557 519192 512993 508317 505469 504251 503949 503918 504130 505043 506988 510043 514542 521145 529957
61855 529957 539911 549716 559360 570072 582806 597431 613504 630982 649666 668611 686838 704253
61843 704253 721163 737192 751411 763416 773452 781430 786663 788831 788554 786583 782992 777712 771394
61830 771394 765114 759398 754198 749844 747477 748268 752463 759299 767596 776258 784484 791883 798399 803882
61816 803882 807669 808733 806335 800506 791865 781124 768906 755835 742446 728924 715209 701523
61804 701523 688560 676974 666854 657911 649920 642618 635357 627456 619023 610982 604057 598111 592721
61791 592721 587967 584186 581173 578192 574891 571771 569606 568626 568410 568315 567787 566404 564002 560923 557992
61776 557992 556028 555294 555466 556103 557045 558278 559652 560983 562325 563839 565405 566760 568176 570565 574579
61761 574579 579878 585689 591834 598666 606090 613324 619805 625775 631569 636734 640306 641722 641055 638480
61747 638480 634020 627900 620756 613333 606172 599609 593803 588602 583613 578564 573535 568764 564456 560849
61733 560849 558222 556569 555436 554314 553146 552276 551955 552130 552631 553346 554175 555032 555898 556746 557463 558018 558665
61716 558665 559735 561236 562919 564723 566825 569105 570936 571737 571554 570876 570047 569075 567846 566292 564427
61701 564427 562411 560446 558444 555973 552809 549336 546079 542999 539655 535963 532276 528685 524762 520230
61687 520230 515441 510864 506424 501752 496929 492510 488815 485535 482200 478793 475773 473564 472173 471237
61673 471237 470313 469045 467219 464860 462317 460062 458274 456783 455499 454687 454589 454951 455261 455394 455687 456420
61657 456420 457556 459087 461205 463980 467138 470328 473391 476245 478773 480943 482814 484280 485145 485576 486142
61642 486142 487141 488212 488934 489468 490234 491189 491827 491753 490944 489637 488316 487598 487669 487920 487573 486515 485129 483485
61624 483485 481276 478433 475138 471283 466614 461505 456814 452753 448668 444320 440561 438123 436385 434156
61610 434156 431207 428161 425169 421721 417766 414070 411151 408566 405602 402128 398428 394703 391144 388056
61596 388056 385462 382854 379784 376456 373332 370396 367372 364500 362452 361336 360366 358848 357120 356103
61582 356103 356088 356416 356342 355819 355237 354669 353745 352217 350380 348818 347962 347964 348705 349648 349993 349445 348792 349172 350672
61563 350672 352127 352532 352181 352098 352847 354391 356621 359281 361555 362669 363001 363918 366229 369346 372192 374303
61547 374303 375703 376312 376090 375388 374629 373906 373327 373410 374478 375915 376807 377233 378181 380058 382109 383643 385110
61530 385110 387342 390169 392497 393603 393708 393248 392207 390439 388198 385890 383474 380587 377350 374627 373207
61515 373207 372894 372682 371773 370148 368241 366457 365176 364760 365199 365903 366209 366110 366218 367029 368367 369574 370132
61498 370132 370167 370392 371473 373342 375334 377111 379159 382061 385511 388406 389860 389819 388839 387643 386901 387059
61482 387059 388185 390059 392331 394565 396434 398160 400466 403703 407266 410326 412838 415219 417319 418506
61468 418506 418699 418507 418235 417585 416509 415558 415028 414509 413658 412711 411787 410441 408566 407121 407106 408196 409163
61451 409163 409396 409304 409363 409503 409497 409398 409424 409736 410343 411033 411506 411792 412291 413151 413884 414001 413711 413531 413479 413145 412456
61430 412456 411872 411877 412598 413800 414901 415277 414927 414651 415135 416186 417305 418594 420418 422446 423910 424737 425627
61413 425627 426960 428360 429452 430385 431419 432578 433862 435169 435884 435174 433010 430416 428472 427484 427246
61398 427246 427526 428016 428282 428172 427920 427672 427271 426752 426597 427192 428317 429399 430034 430141 429967 430059 430872 432268
61380 432268 433741 435218 437187 439953 443299 446991 450992 454982 458367 461154 464146 467775 471288 473698
61366 473698 475100 476385 478041 479914 481903 484158 486650 489135 491567 494027 496254 497822 498823 499954
61352 499954 501774 504290 507428 511516 516921 523317 529672 535144 539863 544590 549544 553820 556296 556954
61338 556954 556872 556984 557328 557563 557551 557156 556004 553937 551389 548851 546228 543082 539307 535185 531066 527374
61322 527374 524696 523396 523211 523639 524630 526527 529464 533169 537367 542091 547623 554352 562604 572413 583522
61307 583522 595710 608932 623063 637864 653413 670148 688095 706331 723548 738813 751426
61296 751426 760561 765733 767378 766360 763038 757377 749742 740831 730891 719769 707819 696041 685082
61283 685082 674676 664379 654318 644911 636221 628021 620324 613537 608159 604441 602191 600880 600100 599955
61269 599955 600812 602665 605001 607296 609424 611559 613898 616533 619416 622493 626063 630894 637608 645898
61255 645898 654526 662181 668193 672577 675644 677602 678410 678042 676885 675522 673927 671289 667040 661745 656519
61240 656519 651886 647732 644051 641017 638488 636233 634603 634269 635226 636723 638234 639900 642081 645183 649877
61225 649877 656546 664334 671755 678602 686376 696325 707856 719439 730282 740420 749889 758700 767218
61212 767218 775763 784017 791477 798283 805011 811873 818644 825071 830851 835552 839246 842927 847626 853350
61198 853350 859579 866598 875483 886794 900108 914917 931171 948647 966427 983364 998575 1011267
61186 1011267 1020649 1026542 1029736 1031312 1031669 1030405 1027016 1021499 1014389 1006311 997456 987538 976350 964213
61172 964213 951608 938509 924529 909639 894223 878399 861913 844891 828076 811877 795747
61161 795747 779048 762161 746083 731208 717233 704229 692975 683924 676447 669557 663090 657758
61149 657758 654268 652795 653170 655107 658100 661378 664092 665521 665214 663208 660108 656629 653027 649220 645538
61134 645538 642910 642098 643049 645241 648410 652609 657859 664219 672075 681899 693758 707435 723010 740841
61120 740841 760924 782733 805820 830223 856120 883445 911982 941473 971434 1001200 1030340
61109 1030340 1058704 1085927 1111333 1134598 1156066 1176055 1194191 1209826 1222766 1233129 1240714
61098 1240714 1244990 1245634 1242620 1235853 1225105 1210301 1191692 1169863 1145823 1120827 1095733 1070637
61086 1070637 1045428 1020520 996696 974474 954048 935588 919076 904016 889924 877082 866263
61075 866263 857798 851492 847381 845785 846456 848408 850924 854161 858454 863634 869527 876560 885275 895549
61061 895549 906920 919537 934159 951181 970166 990431 1011805 1034598 1059091 1085279 1113044
61050 1113044 1142417 1173502 1206177 1240050 1274923 1311192 1349549 1390303 1433136 1477422 1522471
61039 1522471 1567621 1612573 1657628 1703088 1748318 1792027 1833675 1873989 1913703 1952418 1989343
61028 1989343 2024674 2059413 2093971 2127673 2159678 2189786 2218270 2245452 2271644 2297197 2322484
61017 2322484 2348159 2375479 2406138 2441814 2484150 2534955 2595835 2667589 2750556 2845890 2956353
61006 2956353 3086108 3240600 3427279 3656483 3941839 4300276 4751718 5318210 6022877
60997 6022877 6889028 7938327 9187811 10648519 12326099 14213697 16266048 18365752
60989 18365752 20319711 21914569 23007877 23589642 23770484 23718299 23599371 23547578 23638690
60980 23638690 23852212 24049856 24014893 23548244 22559254 21091027 19278280 17283999 15256302
60971 15256302 13311589 11529858 9954134 8595656 7444591 6480550 5678915 5014307
60963 5014307 4463326 4006074 3625764 3307799 3039718 2811394 2614619 2442816 2291430
60954 2291430 2157866 2040073 1935272 1840668 1755091 1678955 1612463 1554527 1503422 1457568 1415243
60943 1415243 1374310 1333003 1290808 1248245 1206128 1165316 1126588 1090162 1055583 1022572 991642
60932 991642 963381 937542 913565 891639 872322 855210 839098 823624 809780 798304 788432 778912
60920 778912 769574 761131 753877 747446 741635 736575 732046 727377 722294 717379 713413 710580 708512 706794
60906 706794 705250 703958 703207 703249 703886 704417 704153 702916 700970 698534 695524 691674 686745 680575 673125 664664
60890 664664 655901 647616 639917 632074 623470 614669 607014 601057 595913 590451 584557 578686 572693 565951
60876 565951 558472 551062 544281 537985 532103 527126 523419 520613 518181 516195 515054 514821 515296 516497 518554
60861 518554 521330 524582 528339 532714 537530 542604 548153 554336 560481 565419 568739 571179 573666 576488
60847 576488 579614 583245 587608 592439 597065 600853 603392 604446 603985 602056 598486 592973 585776 578023
60833 578023 570907 564704 558968 553593 549138 545901 543130 539596 534954 530220 526745 524780 523201 520655
60819 520655 516793 512305 507924 503783 499705 495701 491880 488060 483762 478600 472616 466387 460832 456639
60805 456639 453639 450898 447637 443925 440276 436864 433558 430552 428427 427507 427509 427919 428364 428526 428076 426981
60789 426981 425652 424662 424414 425112 426666 428470 429650 429942 430163 431463 434142 437464 440548 443131 445416
60774 445416 447578 449642 451665 453746 455775 457348 458098 458143 458133 458738 460090 461786 463370 464643 465462 465473
60758 465473 464286 461967 459178 456754 455089 453946 452837 451576 450392 449492 448667 447521 446051 444785 444254
60743 444254 444463 444916 444995 444207 442257 439113 434990 430204 425106 420177 416003 412892 410519 408126 405185
60728 405185 401866 398877 396884 396012 395825 395730 395406 394857 394256 393939 394418 396013 398349 400532 402000 402988 404005
60711 404005 405211 406584 408331 410629 413085 415021 416344 417724 419774 422450 425373 428324 431154 433549
60697 433549 435285 436594 437934 439420 440697 441433 441719 441957 442445 443089 443426 442942 441447 439200 436669 434253
60681 434253 432262 431018 430779 431468 432656 433918 435239 436951 439280 441991 444546 446556 447965 448791 448879
60666 448879 448020 446210 443621 440363 436502 432303 428265 424784 421959 419820 418552 418291 418754 419288 419379 419063
60650 419063 418858 419344 420772 422935 425347 427571 429385 430656 431173 430753 429500 427820 426051 424106 421521
60635 421521 417934 413562 409231 405859 403793 402686 402078 401997 402720 403982 404915 405042 405003 405803 407464 408973
60619 408973 409624 409799 410151 410598 410636 410246 409851 409624 409543 409989 411434 413393 414577 414519 414389 415573 417969 420346
60601 420346 421944 422890 423276 422806 421541 420225 419499 419268 419193 419387 420245 421839 423800 425686 427275 428688
60585 428688 430390 432858 436029 439224 441789 443660 445163 446452 447389 447852 448036 448540 450217 453589 458212
60570 458212 462906 466985 471102 476553 483862 492445 501515 510901 520831 531305 541863 551770 560270 566831
60556 566831 571306 573822 574463 573131 569744 564539 558196 551762 546368 542827 541407 541956 544171 547691 552187
60541 552187 557601 564169 571955 580551 589650 599866 612515 628391 647052 667342 688146 708452
60529 708452 727110 743029 755465 763905 767881 767284 762691 755072 745291 734189 722873 712407 703123
60516 703123 694634 686553 678870 671662 664931 658916 654166 651037 649356 648797 649304 651002 654021 658763 666118
60501 666118 677021 691836 710413 732586 758403 787994 821532 859210 900923 946028 993660
60490 993660 1043107 1093403 1142661 1188453 1229040 1263747 1291826 1311495 1320668 1318458 1305467 1282670
60478 1282670 1250582 1209708 1161393 1107874 1051581 994609 938754 885646 836578 792237 752765
60467 752765 718067 687906 661714 638636 618087 600145 585084 572503 561271 550439 539911
60456 539911 530061 521046 512826 505576 499547 494490 489687 484728 479929 475737 471948 467890 463310 458805
60442 458805 455305 453373 453025 453877 455182 455933 455443 453946 452428 451706 451835 452382 452922 453037 452260 450478 448287
60425 448287 446435 444957 443334 441505 440141 439685 439630 439205 438506 438485 439919 442685 445915 448537 449811 449774
60409 449774 449223 448987 449186 449447 449785 450822 452958 455696 458174 460215 462452 465349 468504 471219 473499
60394 473499 476039 479123 482023 483839 484642 485327 486477 487884 489227 490672 492523 494724 497002 499249 501449
60379 501449 503458 505187 506854 508802 511111 513545 515752 517436 518567 519460 520394 521080 520971 520294 520193 521476
60363 521476 523687 525880 527829 529863 531915 533567 534868 536398 538550 541351 544846 548966 553112 556664
60349 556664 559925 563800 568443 573029 577007 580721 584441 587531 589126 589045 587618 585154 582058 578932 576030
60334 576030 573056 569959 567404 565901 564930 563587 561736 559812 557780 555085 551493 547311 542820 538274
60320 538274 534443 532357 532233 533204 534378 535632 537131 538682 540109 541941 545153 550272 557075 565120 574170
60305 574170 584124 594901 606575 619356 633240 647787 662430 676800 690431 702206 710487 714027
60293 714027 712553 706464 696371 683331 669127 655651 643856 633624 624647 617049 611034 606376 602443
60280 602443 598501 593955 588677 583221 578369 574229 570072 565194 559606 553760 547975 542445 537433 533150
60266 533150 529625 526863 524853 523243 521421 519271 517432 516422 515828 514847 513378 512079 511548 511888 512912
60251 512912 514225 515227 515566 515654 516256 517504 518722 519299 519387 519561 520088 520730 521103 521079 520860 520680 520474 519986
60233 519986 519256 518825 519313 520910 523382 526337 529396 532411 535735 539941 545015 550172 554791 559201 564145
60218 564145 569828 576001 582667 590099 598319 607146 616669 627116 638294 649695 661091 672522 683768
60205 683768 694424 704463 714144 723378 731791 739453 746858 754040 760342 765322 769267 772519 774836 775803
60191 775803 775436 773958 771282 767028 760898 752928 743685 734312 725901 718571 711519 704132 696625 689367
60177 689367 682176 674757 667419 660850 655345 650634 646330 642284 638690 636033 634628 633978 632952 630949
60163 630949 628538 626548 624891 622835 620231 617843 616472 616192 616480 616722 616593 616305 616527 617761 619763 621875
60147 621875 623882 626213 629253 632831 636507 640097 643774 647922 653039 659520 667286 675722 684191 692558
60133 692558 701141 710254 719997 730317 740914 750933 759142 764825 768527 771577 774831 778159 781241
60120 781241 784388 788185 792643 797289 802011 807195 812845 818106 822048 824609 826411 827841 828629 828278 826549
60105 826549 823524 819400 814319 808278 801225 793298 784999 777024 769871 763598 757995 753025 749020 746314
60091 746314 744730 743681 742851 742465 742694 743184 743525 743845 744384 744724 744120 742553 740733 738966 736699 733401
60075 733401 729245 724458 718627 711169 702201 692444 682529 672787 663479 654799 646756 639347 632657 626550
60061 626550 620511 614136 607640 601625 596589 592842 590556 589491 588952 588441 588205 588820 590475 593026 596493
60046 596493 600974 606250 611984 618312 625794 634746 644859 655380 665356 673923 680808 686506 691594 695921
60032 695921 698813 699913 699387 697469 694337 690356 685878 680734 674408 666870 658711 650353 641549 631850
60018 631850 621201 609909 598405 587250 577011 567854 559470 551611 544488 538487 533704 529912 526812
60005 526812 524202 522066 520591 519909 519774 519704 519530 519559 520145 521340 523036 525164 527615 530240 533089 536459
59989 536459 540600 545577 551421 558103 565146 571654 576927 580886 583739 585507 586091 585512 583767 580633 575968
59974 575968 570142 563972 558286 553646 550243 547774 545604 543322 541071 539193 537781 536908 537087 538983 542647
59959 542647 547402 552547 557782 562821 566989 569560 570386 570015 569296 568995 569555 570883 572384 573408 573730 573526
59943 573526 572996 572229 571429 570915 570686 570238 569059 567247 565425 564083 563291 563061 563683 565491 568487 572436
59927 572436 577257 583129 590149 598050 606293 614345 621797 628249 633211 636259 637354 636937 635588 633684
59913 633684 631545 629770 629066 629673 631249 633453 636279 639588 642686 644810 645901 646447 646681 646367 645427 644267
59897 644267 643315 642550 641777 641186 641400 643018 646214 650672 655846 661353 667220 673729 681050 689126 697836
59882 697836 707017 716272 725049 733136 741006 749399 758536 767742 775883 782134 786327 788684 789388 788575 786568
59867 786568 783737 780035 775061 768869 762395 756619 751495 746186 740288 734240 728497 722881 716999 710861
59853 710861 704817 699249 694628 691482 689920 689468 689785 691308 694784 700349 707496 715727 724678 733620 741521
59838 741521 747856 752947 757279 760923 763953 767055 771147 776437 782258 787811 792599 796010 797023 794893
59824 794893 790111 784181 778223 771966 764324 754854 744345 734059 724680 716124 708117 700629 693780 687594
59810 687594 681966 676753 671811 666950 661973 656736 651234 645691 640562 636334 633149 630634 628187 625519
59796 625519 622895 620833 619618 619057 618663 617989 616865 615394 613799 612232 610715 609195 607593 605905 604335
59781 604335 603275 602968 603195 603524 603947 605002 607096 609953 612982 615941 618881 621630 623914 625964 628459
59766 628459 631633 634856 637387 639242 641089 643562 646976 651451 656928 663137 669794 676728 683768 690760
59752 690760 697883 705676 714430 723816 733345 742871 752233 760740 767668 773193 778268 783440 788265 791955
59738 791955 794249 795495 796247 796895 797426 797379 796276 794263 792165 790870 790723 791434 792333 792833 792905 793073 793633
59721 793633 794024 793441 791960 790506 789638 788934 787730 785857 783328 779951 775791 771676 768616 766789 765514
59706 765514 764183 762862 762091 762421 764136 767095 770788 774765 779055 784114 790452 798400 808041 819040
59692 819040 830585 841704 851657 859993 866402 870695 872838 872786 870478 866229 861030 856062 851822 847895
59678 847895 843519 838153 831514 823479 814240 804445 794930 786214 778212 770463 762701 755304 749123 744722
59664 744722 741839 739784 738364 738131 739565 742288 745381 748479 752187 757342 764084 771784 779627 786937
59650 786937 793058 797458 800182 801924 803275 803969 803125 800165 795223 788713 780850 771770 761872 751718
59636 751718 741723 732142 723358 715945 710284 706180 702956 699913 696652 693104 689448 686004 682888 679603
59622 679603 675207 669233 662260 655261 648519 641693 634825 628583 623343 618772 614685 611647 610063 609255
59608 609255 608229 607077 606753 607633 609135 610782 612705 614835 616400 616764 616270 615750 615527 615317 614980 615011 616210
59591 616210 618853 622107 624463 625127 624834 624813 625118 624615 622633 619784 616924 614119 611147 608293 605940 603813
59575 603813 601369 598758 596699 595455 594445 592931 590803 588680 587450 587507 588189 588113 586393 583469 580542
59560 580542 578413 577114 576385 576073 576063 576178 576189 575860 575199 574728 575170 576582 578127 579148 580193 582510 586600
59543 586600 591785 597202 602810 609269 617210 626922 638680 653051 670508 690516 711037 729227 742729
59530 742729 750378 752158 749103 743218 736702 730843 725947 722307 720502 720549 721601 723003 724937 727415 729328
59515 729328 729407 727609 724647 720522 714568 706854 698550 690746 683593 676632 669267 660963 651795 642959 636018
59500 636018 631477 628615 626692 625554 624949 624279 623427 623058 623548 624292 624681 625192 626798 629567 632606 635270
59484 635270 637850 641003 645020 649778 655126 661056 667618 674750 682258 689962 697838 705922 714114 722087
59470 722087 729258 734789 737871 738346 736936 734568 731603 728011 724118 720629 717958 716147 715566 717114 721425
59455 721425 728169 736458 745667 755683 766639 778642 791612 805134 818472 830695 840716 847453
59443 847453 850385 849914 846831 841453 833696 823915 813103 802181 791628 781882 773486 766552 760573 754993
59429 754993 749595 744240 738882 734032 730543 728590 727545 727348 729334 735027 744590 757125 772116 789836
59415 789836 810602 834319 860654 889120 919172 950542 982863 1014043 1039392 1053747 1055053 1045586
59403 1045586 1029824 1011874 994764 980888 972174 969990 975007 986423 1000927 1013175 1018266 1014027
59391 1014027 1001060 981364 957488 932367 908704 888026 870546 855939 843906 834134 826323 820522
59379 820522 817023 815675 815564 815661 815607 815614 815691 815358 814211 812467 810684 809031 807182 805009 803034 801894 801512
59362 801512 801288 801120 801765 803878 807105 810591 814177 818578 824457 831859 840685 851147 863432 877329
59348 877329 892629 909600 928626 949462 971260 993267 1015155 1036718 1057648 1077597 1096073
59337 1096073 1112121 1124492 1132353 1135720 1135121 1131086 1124023 1114264 1101953 1087090 1069918 1051205 1031996
59324 1031996 1013070 994612 976255 957520 938448 919835 902614 887043 872749 859414 846938
59313 846938 834948 822876 810766 799393 789210 779778 770692 762449 755724 750218 745023 739919 735572
59300 735572 732604 731234 731844 735093 741275 750077 761102 774032 788025 801334 811735 817227 816541
59287 816541 809623 797803 783091 767211 751511 737448 726309 718300 712657 708897 707445 708824 712947
59274 712947 719561 728729 740357 753722 768044 783192 799330 816124 832767 848566 863067 875777
59262 875777 886187 893968 898832 900416 898712 894454 888658 881764 873525 863759 852976 842275 832810
59249 832810 825289 819766 815842 813109 811356 810436 810237 810945 813063 816896 822091 827850 833550 839117 844948
59234 844948 851553 859073 867028 874537 880692 884650 885699 883765 879737 874666 868583 860715 850942 840253
59220 840253 829414 818068 805738 793088 781289 770512 759894 748920 738124 728434 720436 714271
59208 714271 709677 705981 702523 699241 696522 694478 692729 690984 689513 688930 689727 691970 695226 698775 702180
59193 702180 705641 709588 714056 718786 723828 729609 736339 743762 751595 759868 768565 777167 784812 790907
59179 790907 795528 799269 802716 805997 808801 810795 811907 812225 811880 811175 810583 810373 810415 810574 811039 811994 813163
59162 813163 814109 814805 815445 815710 814773 812174 808259 803432 797280 788881 778036 765910 754222 743787
59148 743787 733928 723433 711975 700425 689840 680459 671772 663305 655144 647837 641842 636905 631965
59135 631965 626111 619753 614434 611233 609781 609087 608730 608721 608770 608583 608678 610055 613042 617199 622370 629032 637359
59118 637359 646676 656280 666274 677135 688839 700924 713131 725465 737719 749366 760042 769925
59106 769925 779487 788930 797892 805691 811842 816203 818607 818661 816285 812305 808006 803990 799892 795297 790445
59091 790445 785776 781279 776856 773014 770551 769553 769201 768709 767907 766702 764463 760490 754909 748651 742545
59076 742545 736854 731621 726922 722557 717946 712750 707338 702223 697338 692327 687337 682954 679399 676341
59062 676341 673548 671149 669132 667129 664970 662953 661299 659775 658222 657014 656569 656630 656401 655260 653132
59047 653132 650431 647881 646045 644792 643506 642042 640975 640629 640424 639773 639180 639756 641876 644968 648513
59032 648513 652577 657362 662790 668632 674744 681191 688438 697250 707961 719987 732439 745034 757936
59019 757936 770942 783402 794839 805034 813545 819745 823389 824689 823811 820822 816137 810490 804443
59006 804443 798434 793291 790118 789447 790934 793955 798131 803248 809121 815620 822399 828655 833748 838023
58992 838023 842380 846946 850837 853388 854898 855816 855945 854915 852994 850865 848950 847415 846599 847010 849030
58977 849030 852877 858703 866464 875850 886466 897929 909775 921654 933776 946797 961026 976055
58965 976055 991296 1006495 1021413 1035421 1047850 1058547 1067733 1075390 1081067 1084179 1084266 1081074 1074654
58952 1074654 1065323 1053412 1039097 1022629 1004600 985825 966971 948408 930422 913514 898412
58941 898412 885641 875059 866074 858468 852705 849085 846947 845216 843628 842778 843005 843829 844673 845576 846924
58926 846924 848849 851158 853476 855227 855792 855092 853871 853114 853136 853372 853080 852288 852000 853289 856245 860209
58910 860209 865137 872021 881497 892713 904412 916599 930038 944365 958057 970464 982675 995902
58898 995902 1009999 1024105 1037813 1050962 1063020 1073552 1082939 1092066 1101621 1112133 1124255 1138383
58886 1138383 1154307 1171658 1190391 1210301 1230383 1249164 1265504 1278812 1288819 1295564 1299344 1300310
58874 1300310 1298315 1293385 1286054 1276974 1266547 1255155 1243280 1231072 1218236 1204734 1191142 1177923
58862 1177923 1164783 1151182 1137062 1122675 1108072 1093180 1077979 1062221 1045531 1028283 1011864
58851 1011864 997415 984659 972505 960399 948449 936708 925115 913860 902986 891763 879246
58840 879246 865416 851142 837090 823332 809983 797500 786214 776095 767144 759592 753581 749005
58828 749005 745713 743619 742573 742404 743071 744623 747134 750813 755878 762045 768457 774513 780462 786844 793633
58813 793633 800287 806248 810950 813797 814748 814598 814048 812772 810056 806022 801425 796454 790654 784005 777233
58798 777233 770889 764807 758646 752316 745727 738722 731487 724550 718225 712478 707453 703642 701404 700709
58784 700709 701460 703656 707148 711691 717276 724039 731800 740096 748682 757444 765781 772617 777200 779432
58770 779432 779309 776620 771507 764856 757732 750635 743491 736106 728400 720401 712228 704034 695963 688294
58756 688294 681556 676218 672293 669439 667365 665858 664617 663421 662343 661440 660456 659355 659009 660638 664560
58741 664560 670066 676500 683725 691387 698574 704701 710229 716096 722767 730127 737830 745326 751856 756949
58727 756949 760869 764383 768178 772535 777247 781735 785603 789254 793599 798965 804731 810268 815793 821822
58713 821822 828225 834395 840163 845829 851252 855410 857140 855987 852149 845874 837204 826254 813409 799131
58699 799131 783693 767176 749700 731547 713139 695028 677882 662222 648125 635370 623949
58688 623949 614188 606228 599645 593772 588166 582537 576550 570164 564046 559136 555675 552969 550211 547334
58674 547334 545012 544001 544549 546263 548503 550993 554090 558493 564801 573376 584287 597114 610917 624567
58660 624567 637010 647162 653943 656821 656188 652875 647417 639992 630915 620885 610805 601470 593220
58647 593220 585752 578596 571930 566491 562444 558919 555170 551677 549423 548515 548318 548673 550073 552699 556151
58632 556151 560183 564845 569670 573535 575711 576521 576618 576135 574962 573377 571890 570672 569589 568719 568499 569313
58616 569313 571162 573848 577445 582405 589050 596987 605267 613156 620482 627148 632708 636711 639180 640520
58602 640520 641195 641615 641934 641755 640472 638135 635491 632945 630172 627132 624640 623307 622737 622613 623843 627593
58586 627593 633712 641217 649851 659980 671367 683360 696066 709922 724079 736601 746557 754734
58574 754734 762045 768478 774039 779566 786023 793861 803594 816171 832280 851950 875189 902212 932660
58561 932660 965333 999206 1034057 1069709 1105245 1139204 1169820 1194836 1212052 1220808 1222460 1219129
58549 1219129 1212534 1204123 1195304 1186902 1178999 1171697 1165280 1159222 1151817 1141391 1127331 1109511 1087555
58536 1087555 1061367 1031878 1000635 969007 938130 909075 882557 858853 838224 820845 806147
58525 806147 793043 781212 771407 764101 758582 753876 749714 746031 742362 738452 734785 731774 729011 725968
58511 725968 722803 719840 716943 714121 712071 711246 710992 710458 709805 709617 709627 709082 708029 707223 706895 706538 705877
58494 705877 705223 704848 704721 704899 705610 706915 708833 711819 716680 723899 733282 744245 756320 769634 785025
58479 785025 803381 824693 848058 872653 898036 923302 946749 966862 982924 994144 999051 996727
58467 996727 988189 975733 961257 945988 931332 918861 909325 902462 897940 895981 897066 901453 909023
58454 909023 919362 932079 947166 964639 983518 1001556 1016419 1026815 1032114 1031492 1024229 1010736
58442 1010736 992691 972187 950975 930247 910585 892189 875421 861028 849658 841368 835785 832450
58430 832450 830885 830734 832059 835236 840445 847641 856947 868447 881427 894390 905911 914957 920469
58417 920469 921654 918901 913533 906340 897198 886295 874645 862962 851070 838951 827343 816776
58405 816776 807007 797973 790312 784298 779289 774878 771584 769691 768540 767743 767982 769749 772376 775277 779035
58390 779035 784174 789930 795399 800918 807066 813259 818634 823519 828717 834034 838740 842769 846281 848804
58376 848804 850102 851158 853043 855509 857930 860799 864902 869822 874765 880227 887246 895698 904838 914975
58362 914975 926934 940343 954118 968303 983754 1000200 1016136 1030395 1042409 1051235 1055996 1057226
58350 1057226 1056415 1054282 1050801 1046586 1042777 1039748 1037324 1036056 1036862 1039578 1043310 1048103 1054860 1063764
58336 1063764 1074176 1085982 1099693 1115250 1131952 1149367 1167163 1184356 1200045 1214569 1228644
58325 1228644 1241704 1252415 1260390 1265997 1269028 1269224 1267693 1266142 1265000 1263792 1262949 1263479 1265236 1267344
58311 1267344 1270116 1274779 1281476 1289263 1297876 1307774 1318703 1329991 1342044 1355790 1370862 1386073
58299 1386073 1401318 1417202 1433245 1448475 1463460 1479662 1497104 1514780 1533001 1553015 1574592
58288 1574592 1596487 1619173 1644587 1673065 1702984 1733594 1765762 1799724 1834570 1870229 1907538
58277 1907538 1945892 1983112 2018031 2051097 2082293 2110822 2137187 2163338 2190537 2219127 2250286
58266 2250286 2285476 2324191 2364830 2407829 2455244 2507227 2561778 2618058 2676923 2738004 2799441
58255 2799441 2860924 2923893 2988293 3052332 3115936 3181281 3249324 3319030 3390642 3466397 3547354
58244 3547354 3632773 3723277 3821301 3927748 4041523 4162839 4293384 4432736 4578534 4730998
58234 4730998 4893539 5068127 5253947 5451234 5662316 5888153 6128097 6383860 6659315
58225 6659315 6955686 7271519 7608087 7969963 8359840 8778251 9229145 9719865 10254646
58216 10254646 10834221 11463104 12151042 12906235 13734114 14644577 15653821 16777876 18031985
58207 18031985 19438394 21028019 22834411 24895750 27265626 30015640 33230679 37016960
58199 37016960 41522494 46949684 53562265 61704066 71812206 84390463 99958281 119014602
58191 119014602 141995455 169189463 200671650 236300807 275574200 317051982 357584684
58184 357584684 392244878 415640477 424052458 416901331 396571727 367045360 332518095
58177 332518095 296639268 262184372 230844458 203184136 178930487 157475854 138285198
58170 138285198 121041724 105600492 91890515 79844279 69370948 60357824 52673704
58163 52673704 46165745 40666042 36013642 32070786 28719733 25855989 23392487 21263693
58155 21263693 19418128 17809877 16400041 15159295 14062622 13084929 12205189 11409868
58147 11409868 10688051 10027365 9418214 8857409 8343511 7872174 7439165 7043547 6683930
58138 6683930 6355085 6051926 5773543 5519821 5287035 5070021 4865878 4672482 4486294
58129 4486294 4304999 4130096 3963946 3806318 3656178 3514407 3381977 3257562 3139589
58120 3139589 3028741 2926039 2830267 2739584 2653970 2573957 2498675 2427206 2360214 2298226 2239815
58109 2239815 2183345 2128975 2077214 2027014 1976973 1927022 1877381 1827340 1776550 1726016 1676323
58098 1676323 1626361 1575226 1524016 1474454 1427230 1382898 1342822 1307880 1277666 1252122 1232302
58087 1232302 1218311 1208103 1199571 1192140 1185194 1176892 1166157 1154067 1141720 1128333 1113071 1097052
58075 1097052 1081713 1066593 1050593 1034170 1018551 1003845 989571 976005 963449 951240 939004
58064 939004 927842 918756 910864 902670 894103 885837 877650 869032 860523 852757 844907 835660 825265 815203
58050 815203 806261 798125 790398 782914 775491 768295 761946 756531 751168 745230 739088 732995 726392 719244
58036 719244 712856 708223 704542 700451 695664 690280 683627 675158 665704 656551 647982 639724 631964 624844
58022 624844 617889 610992 604997 600298 595926 591084 586363 582259 577904 572794 568350 565901 564238 561236
58008 561236 557071 553773 552165 551331 550713 550671 551058 551138 550994 551414 552335 552892 552999 553365 553900 553584 552036 549867
57990 549867 547360 544138 540350 536915 534220 531637 528603 525303 522107 519176 516651 514434 511830 508322
57976 508322 504628 502130 501250 501245 501463 501847 502281 502402 502188 501885 501407 500582 499932 500326 501870 503883 505863 507669
57958 507669 508853 508820 507688 506202 504683 502739 500069 496929 493815 491213 489494 488551 487702 486442 484984
57943 484984 483674 482506 481798 482557 485241 488848 492294 496029 501120 507366 513668 519756 526029 532092 537106
57928 537106 541360 545748 549667 551183 549568 546028 541561 535843 528869 522045 516591 512026 507208 501919
57914 501919 496511 490884 484833 478836 473662 469612 466783 465540 466080 467891 470139 472256 473756 474011 472720
57899 472720 470289 467402 464546 462200 460947 461024 462163 464179 467332 471795 477163 482788 488252 493344 497989
57884 497989 502382 506791 511070 514776 517881 520778 523446 525263 525876 525568 524407 521704 516971 510984 505250
57869 505250 500667 497069 493913 490875 487946 485382 483583 482762 482689 482871 483022 483250 483880 485127 486946 489188
57853 489188 491879 495152 498950 503102 507755 513309 519613 525682 530595 534267 536990 538775 539789 540860
57839 540860 542665 544713 545969 546256 546187 546015 545533 544973 544826 544779 543916 542166 540504 539526 538898 538458 538635 539192
57821 539192 538703 536143 532209 528228 524485 520492 516316 512612 509527 506507 503236 500099 497522 495242
57807 495242 492481 488649 483802 478353 472390 465571 457908 450336 443986 439062 435009 431623 429228 427789
57793 427789 426686 425612 424948 424904 424952 424492 423600 422797 422503 422925 423997 425303 426587 428352 431325 435315 439429
57776 439429 443494 448264 453914 459415 463915 467743 471384 474441 476399 477587 478437 478569 477600 476251 475486
57761 475486 475020 473768 471563 469364 467855 466846 466095 465784 466019 466636 467705 469618 472433 475654 478794
57746 478794 481721 484345 486405 487754 488546 488982 489131 489036 488786 488464 488138 487823 487336 486429 485272 484472 484314
57729 484314 484226 483415 481799 479962 478363 477108 476360 476421 477313 478633 479915 480994 482054 483474 485512 487996
57713 487996 490445 492588 494570 496609 498792 501231 503890 506081 506825 506172 505541 506208 507957 509822 511562
57698 511562 513486 515281 516145 516042 515825 515906 515592 513996 510922 506596 501105 494455 486852 478684 470517 463168
57682 463168 457362 453140 449959 447504 446124 446426 448862 453864 462082 474349 491617 514992 545474
57669 545474 583500 628880 681191 739995 804324 871603 936524 990994 1026293 1036773 1022196
57658 1022196 986659 935782 875247 810922 748383 691397 641351 598368 562328 532650 508100
57647 508100 487637 471009 458036 447827 439313 432195 426659 422441 418827 415486 412646 410378 408239
57634 408239 405860 403523 401954 401703 402708 404260 405367 405357 404254 402528 400582 398619 396784 395089 393163
57619 393163 390519 387202 383916 381270 379122 376918 374528 372392 370861 369768 368768 367806 366981 366195 365260
57604 365260 364274 363520 363004 362479 362000 361990 362481 362653 361646 359692 357972 357277 357191 356696 355269 353198 351090
57587 351090 349336 347934 346539 344669 342078 339101 336524 334904 334038 333223 332085 330935 330191 329709 328995
57572 328995 327909 326710 325453 323827 321711 319490 317545 315807 314095 312544 311386 310545 309819 309179 308554
57557 308554 307594 306100 304519 303532 303279 303505 304289 305980 308370 310559 311932 312851 314106 315962 317972 319465
57541 319465 320047 319883 319622 319857 320553 321220 321669 322230 323083 323826 324003 323744 323493 323333 323016 322515 322145 322104 322227
57522 322227 322303 322384 322641 323099 323706 324557 325928 327941 330236 332064 332958 333376 334482 337019 340439 343373 344983
57505 344983 345618 346070 346555 346731 346504 346246 346121 345670 344429 342610 340743 338826 336399 333459 330746 328912
57489 328912 327847 327099 326530 326181 325828 325202 324506 324220 324348 324219 323175 321279 319247 317794 317030 316375 315119
57472 315119 313141 311018 309322 308012 306662 305088 303483 302096 301033 300246 299470 298304 296703 295320 294991
57457 294991 295886 297418 298909 300007 300578 300669 300698 301276 302581 304167 305501 306468 307255 307964 308549 309037 309668
57440 309668 310801 312620 314807 316622 317522 317674 317695 317995 318631 319625 320999 322470 323607 324424 325524 327455
57424 327455 330200 333336 336384 338854 340313 340725 340556 340275 339910 339282 338582 338429 339290 340931 342500 343230
57408 343230 343146 343048 343733 345313 347279 348974 349745 349001 346688 343692 341270 339941 339266 338729 338394 338553 339219
57391 339219 340220 341466 342809 343990 345016 346361 348488 351371 354703 358352 362318 366392 370148 373174
57377 373174 375222 376381 377300 378873 381305 383609 384411 383184 380467 377099 373637 370426 367707 365471 363489
57362 363489 361616 359864 358088 355926 353221 350316 347693 345428 343297 341426 340520 341197 343209 345596 347617
57347 347617 349378 351490 354339 357833 361667 365547 369260 372722 375941 378805 381092 382898 384849 387506
57333 387506 390620 393395 395463 397180 398920 400573 401941 403221 404734 406386 407639 407954 407193 405816 404753
57318 404753 404789 405922 407513 409063 410530 411867 412809 413395 414198 415628 417317 418648 419624 420714 421981 422955
57302 422955 423427 423923 425165 427270 429711 431996 434190 436688 439555 442310 444533 446439 448526 450817 452969
57287 452969 455059 457637 460831 464047 466874 469676 472770 475575 477278 478056 478950 480712 483324 486508 490024
57272 490024 493519 496731 499939 503679 507889 511870 515226 518361 521784 525314 528287 530368 531985 534062
57258 534062 537305 541595 546106 550281 554510 559470 564946 569993 574373 579102 585146 592061 598554 604122
57244 604122 609493 615410 621573 627070 631618 636010 641294 647719 654592 661072 666916 672386 677667 682601
57230 682601 686992 690997 695173 700168 706351 713672 721905 731013 741042 751693 762311 772491 782377
57217 782377 792193 801895 811684 822440 834863 848306 861236 873022 884646 897421 911590 926558
57205 926558 941966 957952 974641 991969 1010010 1029051 1049215 1070232 1091730 1113712 1136629
57194 1136629 1160884 1186268 1212068 1237921 1264308 1291885 1320519 1349520 1378704 1408592 1439498
57183 1439498 1471183 1503821 1538584 1576555 1617386 1659698 1702662 1746549 1791846 1838437 1885812
57172 1885812 1933541 1981237 2028355 2074332 2118990 2162733 2206363 2250594 2295703 2341810 2389540
57161 2389540 2440050 2494113 2551423 2611170 2673148 2737918 2806070 2877795 2953107 3031936 3113826
57150 3113826 3197773 3282383 3365958 3446511 3522238 3592101 3655644 3712114 3760018 3797549 3823204
57139 3823204 3836017 3835742 3823097 3799676 3767686 3730153 3691483 3657448 3634355 3628245 3644368 3686361
57127 3686361 3755088 3848078 3959874 4082685 4207191 4324152 4426402 4509802 4572989 4617264
57117 4617264 4646944 4668877 4690931 4721126 4767550 4836927 4931447 5047165 5176392 5311843 5449165
57106 5449165 5587769 5731285 5886871 6062623 6265473 6501923 6779836 7108501 7498141
57097 7498141 7961228 8513926 9174667 9961505 10891546 11980895 13241385 14676068 16278225
57088 16278225 18032954 19917209 21900672 23951585 26041037 28135237 30183019 32119654
57080 32119654 33888110 35448112 36752832 37718868 38233610 38204026 37603051 36474633 34902979
57071 34902979 32978128 30778540 28370682 25817830 23189412 20562230 18011530 15600162
57063 15600162 13374197 11363502 9581864 8027472 6687484 5544345 4578540 3768372
57055 3768372 3091383 2527358 2058963 1670009 1345307 1072649 843349 650393 487310
57046 487310 348974 232015 133712 51175 -18285 -76972 -127051 -170164 -206685 -236381 -260006
57035 -260006 -279377 -295781 -309245 -319494 -326637 -330624 -330836 -326542 -317066 -301435 -278614 -248149 -209697
57022 -209697 -161960 -103518 -35761 35303 100484 150390 177811 179175 155426 111581 54736 -8050
57009 -70898 -129551 -181585 -225999 -262522 -291608 -314796 -334102 -350760 -365100 -377601 -389156 -400081
56997 -400081 -409854 -418281 -426055 -433608 -440208 -444919 -447806 -449350 -449105 -445824 -438737 -428003 -413979 -396706
56983 -396706 -376328 -353752 -330860 -310195 -294245 -284586 -281410 -283697 -289671 -297332 -305086 -312146 -318249
56970 -318249 -323075 -326154 -327129 -325648 -321200 -313575 -303373 -291326 -277144 -259789 -238896 -215029 -188436
56957 -188436 -158772 -126824 -95804 -70126 -53122 -46110 -48743 -59379 -75503 -94625 -114822 -134340
56945 -134340 -151350 -164751 -174726 -181785 -185542 -185097 -180315 -171974 -160615 -145889 -127113 -103992 -76651
56932 -76651 -45289 -10128 27984 66553 100984 125913 137666 135718 122037 99682 72071 42513
56920 42513 13345 -14496 -40781 -65073 -86860 -106026 -122653 -136645 -148007 -157178 -164584 -170187
56908 -170187 -173978 -176608 -178951 -181256 -183276 -184945 -186368 -187332 -187441 -186671 -185269 -183188 -180063 -175668 -169985
56893 -169985 -162999 -154726 -145165 -133839 -119757 -102372 -82236 -60200 -36500 -11607 12252 31435
56881 31435 43026 46280 42142 32293 18809 3957 -10242 -22172 -30590 -35042 -36184 -34954 -31340
56868 -31340 -24527 -14124 -334 17323 40511 70752 108066 151308 199271 250709 303228 352482
56856 352482 392571 417731 424670 414100 390027 357366 320206 281900 245687 214347 189401 171165
56844 171165 159608 154894 157251 166778 183673 208591 242687 287102 342250 407555 481695 562460
56832 562460 645528 723298 785828 824088 833249 813801 770439 710186 640622 568479 498790 434869
56820 434869 378831 331992 294896 267320 248658 238504 236860 243800 259149 282683 314520 354899
56808 354899 403416 458480 517072 574203 622542 653789 661896 645681 608553 556232 494804 429925
56796 429925 366307 307249 254772 210115 173800 145406 123935 108601 99140 95497 97615 105473
56784 105473 118962 137768 161593 190147 222280 255077 284251 305560 315828 313309 298172 272923
56772 272923 241661 208317 175445 144259 115268 88825 65527 46070 30420 17377 5570 -5267
56759 -14605 -22442 -29479 -36011 -41582 -45961 -49567 -52606 -54602 -55316 -55446 -55951 -57106 -58637 -60166 -61112
56744 -61112 -60807 -59378 -58095 -58172 -59439 -60663 -60909 -60133 -58758 -57255 -55959 -54827 -53469 -51745 -50157 -49246
56728 -49246 -48848 -48370 -47630 -46936 -46417 -45758 -44641 -43107 -41449 -39970 -38794 -37638 -35907 -33315 -30353 -27799
56712 -27799 -25855 -24131 -22479 -21293 -20812 -20557 -19869 -18803 -18022 -17833 -17774 -17311 -16586 -16103 -15936 -15730 -15415 -15311
56694 -15311 -15390 -15020 -13862 -12563 -12078 -12543 -13261 -13485 -12736 -10730 -7652 -4339 -1517 1021 3852 6728
56678 6728 8896 10497 12616 15701 18840 21052 22420 23405 23891 23640 23125 23054 23409 23691 23889 24510 25716
56661 25716 27051 28072 28858 29819 31230 32891 34154 34445 33962 33542 33675 33970 33865 33406 32915 32286 31187
56644 31187 29773 28598 27889 27428 27151 27434 28641 30653 32920 34790 35849 36204 36460 37158 38213 39001
56628 39001 38985 38127 36770 35311 33975 32781 31633 30419 28981 27165 25102 23391 22702 23085 23877 24373
56612 24373 24346 23909 23218 22434 21714 21086 20506 20071 19989 20300 20884 21649 22416 22734 22308 21616 21568 22448 23724 24970
56592 24970 26373 28106 29851 31342 32866 34814 37130 39448 41384 42477 42435 41804 41860 43366 45817 48252
56576 48252 50267 51788 52488 52198 51611 51858 53426 55892 58576 61070 63355 65786 68939 73298 79288
56561 79288 87509 98352 111195 124669 137979 151168 163693 173704 179630 181867 182029 181027 178766
56548 178766 175257 170996 166451 162026 158307 155519 152919 149603 145752 142263 139363 136554 133860 132014
56534 132014 131226 130656 129425 127439 125024 122469 120196 118681 117889 117307 116812 116924 117914 119188 119931 119936 119488
56517 119488 118719 117467 115544 112943 109913 106961 104590 102879 101438 99787 97723 95392 93198 91512
56503 91512 90294 89121 87739 86366 85226 84135 82895 81771 81166 81057 81147 81312 81474 81406 81210 81595 83014
56486 83014 84768 85717 85669 85370 85306 85414 85895 87342 89836 92607 94862 96381 97165 97098 96227 94959 93796
56469 93796 93124 93144 93615 93823 93395 92972 93432 94605 95601 96235 97172 98535 99427 99229 98565 98498 99410 101050 103003
56450 103003 104679 105412 105177 104838 105274 106528 108093 109627 111059 112384 113720 115273 116914 118035 118093 117213
56434 117213 116138 115723 116391 117722 118643 118464 117715 117494 118023 118427 117963 116855 115796 115270 115515 116488 117591
56417 117591 118016 117685 117351 117553 118111 118857 120135 122085 124061 125361 126130 126983 128078 129094 129842 130396 130795
56400 130795 131011 131107 131087 130775 130142 129591 129577 130037 130468 130535 130444 130749 131874 133692 135607 137183 138667 140621
56382 140621 143063 145319 146756 147339 147457 147540 147926 148692 149460 149648 149086 148250 147880 148551 150426 153064 155471
56365 155471 156741 156705 155877 154990 154849 156161 158865 161808 163764 164669 165351 166287 167410 168918 171343 174617
56349 174617 177857 180289 181808 182611 182918 183136 183594 184016 183895 183381 183157 183502 184226 185437 187417 189753 191581
56332 191581 192866 194481 196892 199744 202849 206451 210288 213615 216595 220465 225758 231408 236171 239883
56318 239883 242761 244694 245978 247545 249500 250462 249460 247549 246465 246535 247123 248362 251049 255195 259984
56303 259984 265018 270529 276546 282870 289786 297785 306599 315297 323292 330520 336725 341440 344801 347705
56289 347705 350997 354919 359404 364441 370103 376517 383787 391750 400004 408431 417419 427287 437801 448591
56275 448591 459727 471509 483975 497040 510916 526034 542720 561163 581444 603428 626938
56264 626938 652166 679585 709475 742069 778236 819271 865856 917877 975511 1039764 1111748
56253 1111748 1192279 1282475 1383860 1497421 1623373 1762189 1914721 2080646 2257805 2443890
56243 2443890 2637826 2838556 3043248 3247618 3447283 3637805 3814105 3970942 4103756
56234 4103756 4208409 4280919 4318634 4321420 4290938 4229199 4138537 4022380 3884944 3730352 3562620
56223 3562620 3386044 3204718 3021963 2840727 2663969 2493988 2331952 2178708 2035342
56214 2035342 1902261 1778645 1663804 1558293 1462581 1375411 1294769 1219945 1151380 1088872
56204 1088872 1031251 977632 927795 881510 838570 799432 764763 734315 706992 681934 658917
56193 658917 637912 618963 602182 587269 573467 560601 549515 540758 533471 526492 519817 514007
56181 514007 508801 503468 498000 492826 487836 482829 478456 475581 474069 473261 473192 474247 476081 478018 480079
56166 480079 482525 484902 486710 488492 491069 494235 497482 501481 507387 515058 523341 531826 541014 551081
56152 551081 561868 573855 587862 603959 621789 641673 664356 690245 720048 755361 797155
56141 797155 844380 895649 951663 1014202 1083374 1157790 1236913 1320878 1407971 1494348 1576494
56130 1576494 1652375 1720381 1779358 1830144 1875322 1916897 1955337 1990594 2022176 2048048 2065330
56119 2065330 2072585 2070203 2058580 2037618 2008057 1971431 1928196 1877295 1817727 1749278 1671908 1586341
56107 1586341 1495607 1404457 1316858 1235148 1161180 1096355 1040463 992319 951688 918976 893161
56096 893161 871951 854097 839729 828455 819215 812083 808013 806521 805756 805151 805923 808559 811974 815573
56082 815573 820001 825346 830710 836120 842752 850758 858968 867301 877202 888990 900985 912078 923053
56069 923053 934628 946362 958396 972086 987858 1004391 1020836 1037928 1056021 1074043 1091354
56058 1091354 1108672 1126208 1142833 1158033 1172781 1187497 1201099 1213109 1224923 1238028 1252608
56047 1252608 1268669 1286773 1306907 1328350 1351231 1376507 1404085 1432971 1463419 1496546 1531523
56036 1531523 1565667 1597702 1628330 1657242 1682672 1704638 1725664 1747445 1769718 1793205 1820375
56025 1820375 1852054 1886303 1921807 1959348 1998961 2039079 2079870 2124097 2173131 2225284 2279451
56014 2279451 2336994 2398498 2462187 2527326 2595822 2668750 2744694 2823142 2905923 2993544 3083887
56003 3083887 3176460 3274164 3378876 3489173 3604382 3726810 3857741 3995423 4139368 4292517
55993 4292517 4456703 4630274 4812705 5007166 5216066 5438540 5674871 5928594 6201613
55984 6201613 6492372 6801665 7134938 7495899 7883551 8298729 8747708 9235981 9764743
55975 9764743 10337278 10962534 11648782 12400672 13226640 14142260 15162490 16298845 17569109
55966 17569109 19002281 20630487 22486357 24614798 27079879 29958766 33344621 37367175
55958 37367175 42208293 48105737 55367702 64392556 75652793 89643586 106844076 127688984
55950 127688984 152499692 181408764 214356364 251018325 290338830 329726336 364709350
55943 364709350 389896771 401006007 396589108 378267971 349605587 314690769 277242946
55936 277242946 240242536 205780162 175031961 148411212 125829750 106926000 91213750
55929 91213750 78187622 67390644 58428691 50960264 44700318 39427290 34967815 31175113
55921 31175113 27927439 25133705 22723070 20630609 18800123 17192421 15778805 14529930
55913 14529930 13418531 12426968 11542629 10749599 10032134 9381830 8793748 8259077 7768223
55904 7768223 7317294 6904838 6525421 6172551 5844783 5542997 5264384 5004537 4762659
55895 4762659 4539425 4332219 4137466 3955278 3787097 3630985 3483689 3345081 3216239
55886 3216239 3095331 2979715 2870275 2769631 2677703 2592627 2514254 2443281 2378582 2318572
55876 2318572 2263356 2212500 2162648 2110427 2055801 1999765 1941087 1878606 1814617 1752561 1693032
55865 1693032 1635138 1579843 1528623 1480388 1432967 1386324 1341448 1297532 1253122 1208707 1165514
55854 1165514 1123246 1081654 1042721 1008575 978642 951397 927185 906632 888049 869410 851448
55843 851448 835894 822111 808350 794906 782956 771571 758960 745607 733228 721668 709760
55832 709760 698181 688410 679804 670810 662195 655901 651343 646064 639609 633555 627875 620513 610810 600484
55818 600484 590803 581209 571193 561356 552241 543986 537213 532435 528643 524355 519991 517303 516667 516874
55804 516874 517483 519358 522835 527286 532536 538926 545836 551829 556246 559185 560056 557865 552736 545573 536499
55789 536499 525366 513476 502826 493717 485040 476882 470835 467435 465078 461826 456766 449478 439874
55776 439874 428985 418462 408904 399791 391094 383636 377850 373527 370824 370095 370634 370975 370557 369827 368698
55761 368698 366331 362600 358427 354397 350226 345739 341203 336562 331390 325699 319834 313721 307215 300892
55747 300892 295267 289549 282563 274711 267569 261719 256478 251658 247922 245235 242544 239277 235841 232480
55733 232480 229049 226061 224510 224284 224061 223074 221707 220180 218010 215178 212526 210553 208918 207361 206008
55718 206008 204540 202319 199634 197646 196792 196404 196085 196147 196415 196041 195001 194485 195189 196366 197161 197769 198597
55701 198597 199300 199359 198834 197953 196588 194539 191711 187859 182995 178101 174385 171666 168700 165324 162955
55686 162955 162447 162813 162820 162683 163328 164956 167319 170603 175098 180464 186039 191447 196333 200080 202383 203714
55670 203714 204705 205477 205870 205859 205438 204648 204025 204378 205751 207158 207666 207301 206655 206235 206465 207675 209737 212151
55652 212151 214712 217585 220654 223389 225402 226453 225981 223583 220036 216786 214140 210940 206337 200810
55638 200810 195039 188978 182767 177473 173933 171547 169168 166652 164665 163431 162496 161492 160372 158997
55624 158997 157134 154941 153156 152643 153673 155390 156217 155294 153456 152189 151727 151016 149454 147624 146064
55609 146064 144430 142352 140159 138199 136283 134382 133073 132590 132215 131321 130354 130043 130181 129970 129100 127840
55593 127840 126472 125284 124681 124671 124580 123903 123092 122957 123606 124524 125366 126155 127030 128271 130255 132940 135744
55576 135744 138420 141576 145848 150959 156255 161868 168651 177139 187106 198020 209407 220781 231549
55563 231549 240976 248159 252305 253290 251621 247730 241716 233945 225246 216122 206329 195807 185471 176428
55549 176428 168807 162002 155791 150514 146287 142778 139771 137386 135675 134385 133252 132206 131253 130320 129294
55534 129294 128123 126928 126001 125534 125348 125106 124733 124323 123696 122454 120524 118220 115769 113202 110684 108356
55518 108356 105929 103114 100532 99302 99548 100122 100113 99757 99504 99165 98574 98150 98054 97590 96294 94905 94353 94322
55500 94322 93812 92661 91526 90727 90065 89612 89680 90136 90592 91164 92219 93448 94073 94024 94071 94615 95117 94986 94424
55481 94424 94088 94297 94812 95083 94638 93584 92750 92965 94132 95323 95785 95554 95115 94823 94688 94465 93884 92982
55463 92982 92025 91030 89658 87923 86633 86565 87417 88142 88222 88066 88191 88621 89141 89574 89606 88808 87097 84953
55445 84953 83008 81658 81106 81483 82735 84594 86776 89068 91166 92623 93046 92346 90827 89117 87929
55430 87929 87670 88227 89190 90219 91168 91958 92474 92571 92210 91630 91295 91477 91981 92489 93043 93788 94396 94335 93821
55411 93821 93911 95326 97562 99434 100085 99324 97504 95444 94042 93506 93274 92911 92692 92951 93355 93259 92506 91492
55393 91492 90774 90842 91852 93248 94086 94135 94193 94918 95927 96524 96703 96751 96419 95328 93905 93063 93037 93254 93220
55374 93220 92898 92354 91656 91035 90561 89778 88214 86095 84045 82278 80658 79383 78904 79252 80055 81148 82623
55357 82623 84355 85987 87305 88140 88199 87610 87356 88397 90454 92402 93735 94834 95877 96438 96288 95817
55341 95817 95406 95028 94620 94204 93562 92414 91035 90071 89680 89551 89767 90746 92168 92899 92396 91314 90304
55324 90304 89119 87509 86143 85787 86117 86225 85943 85769 85765 85455 84840 84684 85486 86732 87505 87444 86839 86072 85317
55305 85317 84650 84056 83259 81890 80072 78665 78550 79680 81198 82576 84209 86627 89498 91855 93112
55290 93112 93431 93287 93130 93347 94039 94817 95239 95449 95980 96873 97423 96915 95317 93185 91177 89724 88880 88375
55272 88375 87987 87816 87987 88246 88205 87949 88031 88827 90142 91405 92034 91789 91071 90712 91145 91930 92393 92423 92238
55253 92238 91776 90932 90130 89963 90439 91181 92117 93165 93559 92506 90545 89206 89179 89745 90216 90881 92152 93727
55235 93727 95182 96508 97516 97517 96347 94993 94443 94382 93798 92447 91002 90019 89468 89141 88889 88545 88073 87750
55217 87750 87825 88137 88383 88619 89201 90346 91894 93330 94034 93927 93935 95197 97524 99341 99571 98872 98400 98058
55199 98058 96910 94896 93024 91977 91430 90885 90272 89547 88421 86946 85884 86002 87194 88560 89269 89215
55183 89215 88965 89095 89555 89726 89212 88377 87881 87834 87751 87270 86610 86282 86600 87516 88760 90113 91562 93110
55165 93110 94425 94984 94770 94511 94897 95753 96401 96650 96947 97631 98501 99188 99547 99537 99088 98310 97593 97278 97286 97210
55145 97210 96722 95830 94878 94324 94438 95061 95684 95818 95376 94768 94577 95005 95589 95583 94681 93294 92112 91516 91405
55126 91405 91451 91428 91455 91893 92871 93941 94509 94641 95102 96454 98442 100405 101952 103000 103517 103643 103816 104392
55108 104392 105225 105885 106158 106043 105470 104446 103417 103063 103590 104443 104798 104298 103358 102851 103412 104911 106658
55091 106658 108142 109390 110560 111549 112271 112996 114046 115330 116487 117299 117605 117082 115691 114245 113903 114899
55075 114899 116220 116774 116526 116233 116398 116916 117593 118504 119626 120398 120079 118625 117004 116343 116805 117515 117596 116989
55057 116989 116190 115536 115094 114980 115373 116144 116779 116775 116054 114945 113867 113021 112270 111294 109903 108215 106580 105412
55039 105412 105036 105454 106226 106744 106786 106684 106911 107635 108637 109465 109656 109144 108507 108453 108928 109158 108776 108403 108696
55020 108696 109273 109201 108341 107563 107635 108424 109287 109801 109998 110247 111004 112394 113937 115035 115750 116708 118066 119001
55002 119001 118645 117303 116311 116677 118082 119277 119250 117988 116373 115504 115992 117550 119120 119564 118482 116417
54986 116417 114261 112555 111378 110666 110295 109926 109204 108261 107741 108137 109250 110464 111413 112291 113584 115502
54970 115502 117538 118686 118444 117584 117535 118843 120607 121596 121543 121103 120971 121441 122507 123878 124980 125365 125167
54953 125167 124930 125040 125521 126218 126902 127241 126920 125827 124070 121921 119804 118131 117005 116273 115927 116130 116726
54936 116726 117138 117035 116774 116853 117272 117780 118437 119462 120878 122794 125749 130088 135108 139541 143074 146857
54920 146857 152319 159753 168220 176459 183670 189603 194143 196955 197630 196211 193295 189462 184805 179244
54906 179244 173022 166584 160225 154205 148985 144953 142046 140013 138802 138268 137723 136332 133956 131193 128657
54891 128657 126668 125509 125434 126330 127824 129720 131965 134272 136326 138394 141205 145109 149772 154780 160056
54876 160056 165545 170927 175911 180482 184678 188355 191224 192826 192505 189873 185465 180562 176138 172175
54862 172175 168061 163421 158445 153711 149711 146380 143120 139611 136470 134659 134239 134200 133635 132608 131718
54847 131718 131232 130865 130030 128088 124763 120589 116743 114185 113037 112791 112839 112747 112371 111887 111536 111264 110884
54830 110884 110541 110637 111210 111790 111993 111970 112099 112525 113121 113689 114145 114685 115723 117336 118866 119490 119173 118652
54812 118652 118453 118380 118057 117499 117004 116793 116898 117154 117316 117469 118119 119462 120841 121498 121647 122058 122839 123506
54794 123506 124122 125203 126427 126683 125794 125035 125364 126207 126617 126584 126381 125689 124448 123731 124578 126466 128108
54777 128108 129264 130652 132485 134392 136619 139965 144409 148944 153066 157467 162946 169469 176644 184305
54763 184305 192144 199362 205256 209848 213580 216577 218430 218505 216365 212118 206386 199804 192652 185226 178217
54748 178217 172197 166908 161680 156499 152006 148495 145635 143261 141658 140767 139836 138373 136888 136193 136344
54733 136344 136794 137260 137885 138681 139410 140072 141135 143124 146193 150187 154893 160095 165510 170910 176319 181868
54717 181868 187298 191727 194208 194512 193120 190480 186649 181724 176085 169987 163449 156939 151623 148265
54703 148265 146161 143951 141307 139128 138055 137601 136941 135891 134777 133848 133162 132734 132485 132230 131896 131555
54687 131555 131185 130682 130130 129738 129465 129101 128731 128664 128784 128460 127373 126019 125075 124565 123966 122881 121373 119800
54669 119800 118572 117908 117649 117466 117321 117499 118073 118637 118754 118446 118037 117756 117651 117664 117635 117451 117381 118007 119610
54650 119610 121772 123736 124988 125363 124879 123725 122305 121030 120147 119858 120445 122041 124264 126220 127031 126560
54634 126560 125663 125449 126109 126738 126597 126165 126387 127234 127845 127978 128320 129186 129846 129598 128733 127914 127296 126794 126546
54615 126546 126431 125706 123914 121750 120342 120012 120372 121142 122098 122646 122410 122001 122287 123086 123552 123725 124507 126046
54597 126046 127304 127567 127377 127468 127673 127526 127230 127307 127791 128374 129005 129794 130659 131475 132253 132780 132549 131480 130274
54578 130274 129520 128836 127498 125607 123983 123154 123068 123563 124454 125282 125635 125668 125735 125689 125207 124703 125025 126187 127240
54559 127240 127653 127976 128767 129669 130135 130366 130799 131195 131067 130702 130886 131736 132600 133159 133795 134678 135265 135169 134973
54540 134973 135578 137026 138509 139442 139989 140464 140652 140035 138572 136988 136147 136188 136383 135930 134842 133864 133521
54523 133521 133526 133310 132884 132815 133406 134285 134946 135384 135914 136532 136839 136589 136031 135574 135323 135094 134730 134216 133593 132993
54503 132993 132672 132744 132900 132670 131994 131261 130724 130185 129470 128871 128844 129461 130469 131708 133081 134301 135144 135832
54485 135832 136685 137375 137155 136000 134947 134968 136030 137584 139490 141850 144301 146165 147229 147833 148252 148587
54469 148587 149138 150187 151260 151403 150512 149758 150171 151283 151790 151278 150652 150984 152461 154435 155975 156354 155499
54452 155499 154142 153145 152599 151924 150839 149661 148506 146841 144370 141907 140713 141081 142072 142588 142264 141352
54436 141352 140337 139755 139912 140527 140968 141026 141155 141748 142539 142973 142874 142476 142017 141678 141706 142267 143297 144783 147031
54417 147031 150210 153762 156608 157998 157945 156954 155681 154733 154279 153814 152716 151148 150026 149953 150628 151392 151941
54400 151941 152285 152451 152615 153177 154350 155815 157056 157815 158053 157781 157261 157103 157767 159115 160718 162335 163754
54383 163754 164468 164033 162726 161360 160492 160153 160312 161101 162506 164192 165753 166943 167698 168186 168818 169892
54367 169892 171349 173153 175769 179713 184652 189495 193488 196757 199603 201869 203278 203977 204275 204121 203166
54352 203166 201165 198081 194041 189479 185091 181337 178115 175092 172173 169401 166746 164356 162733 162199
54338 162199 162284 162142 161516 160835 160316 159489 157879 155777 154011 153076 152771 152656 152596 152736 153065 153250 153025 152669
54320 152669 152832 153791 155081 156028 156493 156852 157341 157712 157587 156913 156003 155291 155062 155260 155414 154948 153737 152349
54302 152349 151556 151587 151902 151748 150913 149916 149456 149720 150259 150529 150429 150289 150461 151052 151987 153152 154402 155549
54284 155549 156499 157416 158612 160218 161982 163481 164505 165122 165373 165131 164402 163541 162891 162300 161362 160162 159389
54267 159389 159494 160020 160071 159327 158346 157967 158619 160136 161982 163640 164988 166374 168225 170562 172967 174998
54251 174998 176509 177593 178329 178672 178593 178285 178169 178519 179077 179204 178505 177209 175907 175071 174850 175043 175121 174561
54233 174561 173425 172397 171957 171723 170969 169610 168265 167465 167237 167450 168063 168931 169762 170398 170845 171033 170982 171203
54215 171203 172317 174015 175008 174475 173066 171942 171245 170217 168554 166846 165621 164744 164021 163781 164401 165591
54199 165591 166616 167089 167252 167579 168395 169745 171376 172768 173446 173350 172840 172332 172020 171917 172034 172399 172901 173231
54181 173231 173127 172703 172459 172843 173837 175063 176193 177074 177504 177154 175882 174019 172258 171224 171053 171268 171155
54164 171155 170482 169839 169974 170826 171498 171208 169911 167925 165478 162910 160867 159795 159472 159438 159586 159884 159802
54147 159802 158777 157157 156013 155903 156435 157163 158199 159628 160980 161781 162224 162759 163369 163760 163991 164372 164810
54130 164810 164806 164124 163113 162355 162238 162788 163627 164201 164384 164751 165885 167556 169011 169988 170972 172396 174108
54113 174108 175780 177403 179126 180929 182722 184508 186192 187486 188251 188827 189788 191441 193699 196328 199185
54098 199185 202243 205453 208582 211169 212748 213029 211820 209029 205060 201025 198025 196184 194866 193892 193928
54083 193928 195409 197703 199873 201797 203898 206033 207405 207643 207360 207414 208024 208808 209376 209577 209356 208680 207661
54066 207661 206598 205868 205754 206287 207187 207923 207969 207193 206057 205323 205303 205475 205052 203889 202607 201798 201545 201789
54048 201789 202746 204615 207153 209901 212646 215461 218457 221773 225540 229561 233310 236647 240314 245242
54034 245242 251520 258462 265516 272558 279416 285849 292091 298737 305781 312259 317192 320517 322807 324486
54020 324486 325686 326626 327657 328957 330341 331320 331303 330010 327773 325176 322299 318693 314207 309352 304528
54005 304528 299440 293782 288054 283018 278626 274215 269671 265633 262474 259858 257553 255939 255185 254500 252839
53990 252839 250110 247037 244008 240715 237057 233771 231783 231203 231286 231222 230658 229571 228038 226338 224990 224343
53974 224343 224131 223718 222939 222451 223013 224591 226460 228083 229493 230796 231873 232878 234539 237338 240656
53959 240656 243452 245861 249472 255736 264569 274770 285183 294884 302716 307581 309330 308790 306762 303482
53945 303482 299223 294847 291345 289129 288097 288087 288894 290083 291317 292826 295096 298046 300881 302891 304131
53930 304131 305156 306310 307480 308417 309140 310105 312061 315644 320937 327355 333990 340101 345464 350389 355498
53915 355498 361336 368122 375769 384010 392459 400730 408718 416699 424946 433194 440657 446568 450640 453087
53901 453087 454433 455201 455473 454725 452387 448709 444715 441147 437693 433482 428145 422079 415823 409422 402454
53886 402454 394509 385674 376583 367881 359617 351363 343043 335275 328640 322938 317568 312480 308213 305036
53872 305036 302501 299963 297125 293961 290464 286692 282802 278849 274743 270488 266255 262122 258066 254321
53858 254321 251372 249332 247647 245734 243686 241970 240635 239219 237356 235123 232856 230949 229760 229336
53844 229336 229249 229046 228865 229246 230252 231174 231289 230620 229797 229396 229591 230187 230772 230915 230417 229397 228226 227456
53826 227456 227639 228837 230346 231287 231521 231579 231729 231686 231403 231490 232462 234088 235963 238203 240944 243540 245118
53809 245118 245778 246526 247988 249884 251834 254033 256907 260687 265533 271546 278359 285170 291544 297868 304655
53794 304655 311733 318464 324537 330151 335504 340363 344200 346672 348032 349085 350486 352059 353032 352906 351793
53779 351793 349907 347267 344029 340581 336983 332735 327502 321662 315783 309950 304099 298614 293889 289495
53765 289495 284487 278619 272745 267895 264374 261749 259315 256489 253205 250041 247652 246005 244507 242882
53751 242882 241487 240635 240063 239308 238283 237218 236297 235614 235273 235253 235304 235132 234606 233735 232660 231767 231502 231818
53733 231818 232085 231850 231482 231694 232563 233448 233846 233893 233949 234142 234644 235989 238587 241976 244994 246890 247968
53716 247968 248992 250280 251633 252925 254274 255644 256724 257427 258232 259712 261902 264344 266738 269293 272377
53701 272377 276015 279827 283484 287107 291125 295710 300492 304980 309057 312854 316237 318850 320675 322065
53687 322065 323059 323117 321874 319798 317680 315746 313722 311619 309917 308957 308531 308201 307740 307212 306797 306555 306218
53670 306218 305315 303744 302102 301159 301059 301376 301888 302842 304301 305609 305855 304753 302896 301148 299938 299176
53654 299176 298714 298622 298899 299164 299038 298820 299293 300724 302506 303953 304968 305659 305911 305868 306271 307620 309339
53637 309339 310577 311608 313539 316715 320260 323338 326055 328894 331925 334901 337620 339926 341777 343492
53623 343492 345522 347908 350412 353174 356680 361040 365972 371488 377782 384256 389622 393424 396657 400368
53609 400368 404390 408030 411311 414775 418608 422724 427230 432063 436460 439605 441598 443192 444746 445975
53595 445975 446439 445774 443792 440994 438598 437319 436389 434612 432088 430024 428936 428086 426768 425168 423617
53580 423617 421830 419447 416733 414241 412102 410052 407862 405381 402435 398974 395267 391744 388714 386248
53566 386248 384157 382114 380069 378549 378223 379104 380448 381459 381822 381565 380879 380209 380129 380840 381949 382897 383489
53549 383489 383947 384613 385656 386929 388112 389171 390601 393037 396628 400927 405253 408947 411595 413502 415820
53534 415820 419656 425007 431005 437153 443744 451019 458660 466476 475041 485082 496503 508421 520090
53521 520090 531464 542983 555079 567945 581637 596308 612175 629132 646610 664221 682449
53510 682449 702201 723645 745988 768546 791500 815290 839749 864253 888416 912152 935258
53499 935258 957363 978274 998042 1016708 1034208 1050545 1065965 1081040 1096563 1113061 1130240
53488 1130240 1147154 1163105 1178236 1193135 1208158 1223355 1238764 1254439 1270360 1286553 1303084
53477 1303084 1319682 1335574 1349964 1362516 1373119 1381474 1387295 1390758 1392274 1391897 1389337 1384479 1377488
53464 1377488 1368407 1357127 1343843 1329190 1313797 1298006 1282069 1266193 1250209 1233576 1216030
53453 1216030 1197943 1179757 1161295 1142108 1122353 1102858 1084229 1066247 1048320 1030237 1012254
53442 1012254 994816 978501 964036 951830 941502 932287 924058 917561 913465 911523 910910 911021 911615
53429 911615 912566 914074 916927 921872 928633 936095 943680 952060 962210 974184 987209 1000757 1015156
53416 1015156 1031227 1049608 1070375 1093052 1116922 1141438 1166409 1191910 1218176 1245528 1274159
53405 1274159 1303962 1334820 1367049 1401220 1437425 1475126 1513970 1554428 1597326 1643030 1691314
53394 1691314 1741692 1793446 1845538 1897066 1947973 1998990 2050783 2103245 2155594 2206982 2257043
53383 2257043 2305947 2353824 2400119 2443721 2483921 2520973 2555466 2587303 2615585 2639278 2657676
53372 2657676 2670419 2677506 2679286 2676071 2667753 2654047 2635010 2610913 2581710 2547161 2507561 2463961
53360 2463961 2417487 2368764 2318113 2265980 2213044 2160191 2108415 2058314 2009573 1961404 1913765
53349 1913765 1867661 1823953 1782378 1742200 1703309 1665891 1629322 1592444 1555117 1518664 1484345
53338 1484345 1452075 1421197 1391921 1365117 1340956 1318640 1297634 1278386 1261497 1246750 1233439
53327 1233439 1221189 1209917 1199209 1188373 1177114 1165679 1154295 1142909 1131587 1120718 1110601
53316 1110601 1101147 1092248 1084182 1077360 1071839 1067329 1063599 1060719 1059021 1059004 1061086 1065181 1070572 1076469
53302 1076469 1082725 1089880 1098576 1109087 1121374 1135373 1151170 1168966 1188823 1210398 1233053 1256418
53290 1256418 1280711 1306265 1332752 1359175 1384688 1409171 1432850 1455552 1476589 1495325 1511599
53279 1511599 1525568 1537288 1546570 1553153 1556887 1557728 1555717 1550923 1543298 1532626 1518847 1502498 1484536
53266 1484536 1465536 1445262 1423264 1399716 1375283 1350339 1324761 1298477 1271790 1245067 1218464
53255 1218464 1192009 1165606 1138914 1111652 1084128 1057046 1030663 1004652 978910 953884 929744
53244 929744 905858 881614 857332 833779 811204 789441 768666 749352 731608 715155 699852
53233 699852 685682 672441 660015 648835 639359 631227 623639 616470 610102 604078 596965 588015 578128
53220 578128 568574 559362 549573 538802 527504 516148 504763 493345 482195 471665 461888 452757
53208 452757 444021 435435 427019 419161 412266 406309 400846 395370 389634 383743 378054 372837 367926 362846
53194 362846 357330 351523 345632 339700 333867 328506 323828 319592 315473 311495 307846 304523 301475 298880
53180 298880 296864 295149 293404 291848 290985 290655 289892 287971 285302 282953 281496 280630 279868 279190 278774 278357
53164 278357 277316 275558 273872 273010 272633 271717 269985 268295 267400 266887 265771 263785 261636 260216 259909 260426
53148 260426 260882 260302 258584 256816 256183 256653 257249 257444 257598 257976 258134 257615 256735 256218 256346 256841 257381 257912
53130 257912 258588 259611 261017 262496 263599 264274 264989 266180 267759 269315 270604 271635 272502 273367 274476
53115 274476 275968 277785 279905 282451 285341 287992 289730 290477 290784 291170 291588 291534 290533 288523 285917 283294
53099 283294 280907 278544 275960 273301 270945 269022 267299 265526 263677 261872 260219 258748 257410 256122
53085 256122 254963 254202 254004 254171 254342 254422 254604 255026 255607 256211 256751 257089 257038 256549 255754 254817 253905 253254 252991
53066 252991 252869 252464 251750 251139 250811 250325 249237 247880 247097 247217 247632 247543 246817 245938 245351 245147 245339 246121
53048 246121 247607 249483 251165 252369 253314 254239 254956 255061 254488 253577 252626 251648 250551 249300 247886 246385
53032 246385 245105 244383 244195 244258 244610 245627 247308 248941 249851 250086 249972 249396 248170 246907 246740 248043 249996
53015 249996 251550 252324 252382 251819 251018 250849 251960 253950 255671 256308 255854 254664 253070 251548 250821 251428 253200
52998 253200 255400 257369 258949 260241 261145 261352 260859 260204 260010 260401 261143 262267 264170 267005 270298 273291
52982 273291 275466 276701 277297 278032 279702 282172 284181 284553 283534 282458 282248 282725 283358 284002 284610 284759
52966 284759 284057 282873 282142 282378 283216 284062 284904 286147 287768 289020 289128 288103 286584 285035 283363 281293
52950 281293 278785 276021 273295 271010 269469 268410 267111 265224 263288 262056 261572 261286 260900 260584 260478
52935 260478 260520 260766 261379 262159 262613 262616 262535 262503 262073 260949 259601 258762 258611 258875 259380 260028 260451 260280 259708 259373
52915 259373 259669 260562 261879 263291 264081 263614 262198 260897 260211 259510 258171 256683 256043 256393 256997 257408 257906
52898 257906 258693 259391 259681 259933 260710 261946 263054 263699 264068 264445 264917 265495 266187 266842 267168 267019 266568 266144
52880 266144 266017 266237 266522 266351 265476 264386 263996 264743 266273 268060 270029 272356 275002 277806 280899 284599
52864 284599 288849 292991 296188 297931 298166 297133 295166 292526 289384 285935 282457 279205 276351 274048
52850 274048 272367 271036 269486 267417 265133 263050 261036 258634 255873 253411 251760 250736 249821 248735
52836 248735 247481 246116 244744 243570 242707 242049 241513 241266 241555 242421 243723 245247 246583 247107 246458 245030
52820 245030 243691 242917 242451 241823 241006 240406 240425 241174 242441 243773 244706 245180 245689 246799 248463 250004 250832
52803 250832 250910 250438 249425 247871 246157 244740 243489 241812 239622 237704 236779 236520 235963 234718 233348 232583
52787 232583 232595 233084 233666 234004 233884 233423 233007 232863 232860 232884 233209 234230 235911 237736 239215 240278 241145 241937
52769 241937 242514 242646 242269 241575 240858 240328 240002 239752 239455 239170 239169 239697 240649 241645 242485 243395 244685 246307 247937
52750 247937 249380 250695 252049 253694 255983 259004 262210 264765 266411 267658 268968 270062 270329 269723 268879
52735 268879 268404 268370 268534 268766 269132 269686 270391 271185 271991 272640 272926 272815 272468 271997 271263 270063 268451 266682
52717 266682 264913 263182 261653 260599 260095 260039 260499 261561 262672 262696 261095 258749 257059 256445 256205 255664
52701 255664 254869 254206 253898 254003 254422 254788 254721 254332 254115 254304 254683 255084 255697 256746 258179 259769 261231 262250
52683 262250 262734 263053 263598 264124 263971 263033 262005 261541 261621 261822 261768 261156 259942 258756 258636 259987 262104 263943
52665 263943 264961 265172 264871 264612 264906 265676 266394 266966 267965 269776 272125 274707 277636 280901 284052 286863
52649 286863 289610 292207 293769 293690 292479 290836 288588 285380 281814 278919 276933 275557 274941 275298 275924
52634 275924 275833 275257 275340 276405 277699 278894 280552 282768 284574 285244 285246 285311 285367 284960 284018 282628 280706 278478
52616 278478 276699 275821 275385 274816 274368 274636 275493 276106 275878 274902 273665 272709 272420 272744 273180 273287 273112 273006
52598 273006 273297 274292 276243 278947 281601 283398 284189 284468 284875 285815 287250 288667 289496 289676 289573 289338 288844
52581 288844 288351 288621 289997 291762 292847 292867 292202 291416 291015 291361 292348 293312 293616 293137 292000 290182 287800
52564 287800 285443 283767 282932 282754 283090 283674 283916 283441 282685 282395 282643 282777 282313 281436 280653 280349 280640 281313
52546 281313 281941 282331 282732 283400 284186 284927 285890 287222 288200 287833 286252 284791 284453 284882 285122 284836 284343 283938
52528 283938 283731 283979 284967 286522 287983 288854 289314 289968 291149 292602 293843 294755 295650 296831 298311 300118
52512 300118 302614 306219 310916 316314 322113 328221 334285 339455 342825 344026 343284 341019 337532 333080
52498 333080 328069 323024 318289 313883 309776 306208 303509 301590 299933 298143 296260 294386 292420 290455
52484 290455 289086 288906 289864 291488 293553 296021 298466 300156 300859 301106 301488 302089 302786 303709 305098 306896
52468 306896 308832 310778 312818 315068 317641 320758 324653 329294 334202 338605 341774 343314 343166 341410
52454 341410 338202 333950 329359 325054 321200 317631 314275 311228 308465 305823 303314 301133 299244 297240
52440 297240 294897 292655 291241 290814 290761 290407 289713 289122 288841 288590 288134 287811 288245 289548 291157 292503 293574
52423 293574 294645 295780 296896 298072 299341 300292 300350 299532 298591 298236 298573 299411 300803 303017 306273 310798
52407 310798 316895 324618 333479 342890 352762 363143 373251 381398 386240 387725 386489 382838 376984 369967
52393 369967 363378 357885 352783 347387 342190 338025 334727 331500 328283 325806 324327 323302 322449 322244 323020
52378 323020 324388 326058 328517 332241 336767 341195 345293 349514 354239 359543 365305 370941 375314 377688
52364 377688 378641 379398 380300 380550 379396 376949 373884 370936 368754 367586 367004 366398 365804 365754 366337 367025 367455
52347 367455 367766 368024 368027 367902 368302 369680 371848 374481 377512 380759 383750 386360 389140 392631 396738 401223
52331 401223 406380 412769 420578 429619 439623 450179 460780 471407 482688 495005 507727 519922
52319 519922 531526 543256 555516 568014 580355 592437 604212 615638 626974 638725 651201
52308 651201 664435 678571 693925 710600 728338 746793 765646 784505 803059 821371 839586
52297 839586 857295 873588 887807 899857 909682 916980 921739 924574 926082 926098 924073 920040 914733 908778
52283 908778 902264 895252 888259 881838 875887 869778 863296 857165 852454 849582 848108 847419 847411 848437 850841
52268 850841 854675 859681 865329 870955 876093 880825 885710 891394 898307 906741 917031 929500 944159
52255 944159 960525 977817 995349 1012687 1029510 1045521 1060534 1074351 1086391 1095734 1101918 1105507
52243 1105507 1107438 1107907 1106442 1103030 1098438 1093187 1086903 1079114 1070151 1060669 1050740 1040126 1029176 1018657
52229 1018657 1008766 998969 988813 978251 967204 955580 943970 933562 924943 917467 910228 903183
52217 903183 896884 891507 886782 882672 879509 877438 876167 875361 874970 875093 875787 877067 878900 881148 883642
52202 883642 886325 889212 892281 895520 899004 902777 906784 911114 916163 922246 929056 935882 942391 948901
52188 948901 955734 962550 968524 972996 975760 976914 976703 975441 973297 970011 964993 957794 948581 938177
52174 938177 927716 918155 909892 902764 896443 890922 886593 883827 882533 882246 882684 884117 887027 891417
52160 891417 896588 901712 906435 910752 914417 916868 917825 917703 917159 916465 915555 914530 913734 913362 913348 913756 914965
52143 914965 917241 920294 923486 926352 928785 930820 932438 933549 934015 933755 933052 932738 933906 937329 943151
52128 943151 951040 960548 971418 983765 998048 1014712 1033725 1054482 1076173 1098231 1120476 1142905
52116 1142905 1165373 1187523 1209041 1229941 1250415 1270369 1289270 1306517 1321749 1334757 1345491
52105 1345491 1354505 1363082 1372424 1382716 1393391 1404158 1415272 1426750 1437874 1447648 1455288 1460122
52093 1460122 1461535 1459489 1454646 1447521 1437712 1424443 1407690 1388399 1367785 1346882 1326623 1307701
52081 1307701 1290163 1273583 1257857 1243517 1231112 1220549 1211273 1202907 1195565 1189656 1185495 1182997
52069 1182997 1181713 1181387 1182485 1185893 1191931 1199872 1208587 1217494 1226779 1237006 1248741 1262182 1276707
52056 1276707 1291006 1304217 1316975 1330776 1346145 1361817 1375912 1387448 1396352 1402439 1405108 1404052
52044 1404052 1399711 1392840 1383958 1373373 1361467 1348704 1335495 1322181 1309001 1295981 1283043 1270370
52032 1270370 1258512 1247933 1238560 1229841 1221019 1211324 1200300 1188289 1176362 1165369 1155181 1145210
52020 1145210 1135444 1126445 1118386 1110660 1102620 1094286 1086177 1078845 1072735 1068064 1064452 1060931 1056628 1051264
52006 1051264 1044725 1036421 1025568 1012097 996863 980826 964275 947073 929504 912566 897243 883647
51994 883647 871128 859199 848059 838013 828738 819519 810021 800371 790545 780115 768568 755451
51982 755451 740289 723006 704528 686341 669183 652740 636774 621817 608261 595525 582894
51971 582894 570827 560740 553738 550169 550054 553164 558764 566006 574547 584229 594265 603473 611302 617895
51957 617895 623056 625940 626050 623906 620306 615463 609242 601884 594147 587003 581441 578201 577414 578765 582243
51942 582243 588435 597795 609984 624315 640664 659523 681193 705168 730337 755628 780501 804834
51930 804834 828211 849362 866508 878239 883736 882174 872535 854495 829251 799132 766462 732922
51918 732922 699690 667779 638191 611827 589171 570024 553785 540129 529170 520897 514919 511066
51906 511066 509856 511884 516863 523686 531323 539326 547542 555669 563044 568622 571251 570325 566145 559420
51892 559420 550547 539701 527508 515074 503235 492184 481999 473177 466325 461613 458845 457986 459258
51879 459258 462678 467740 473777 480591 488562 498034 508608 519149 528534 536358 542878 548316 552280 553905
51865 553905 552639 548960 544239 539706 535544 531155 526297 521750 518821 518405 520524 524457 529075 533279
51851 533279 536414 538345 539104 538568 536449 532396 526059 517413 507146 496488 486436 477286 468962 461410
51837 461410 454542 448226 442689 438591 436279 435277 434913 435141 436245 438029 439882 441448 442584 442746 441182
51822 441182 437882 433727 429602 425910 423014 421405 421065 421269 421493 422058 423477 425576 427784 429971 432397
51807 432397 434967 437037 438008 437821 436932 436044 435761 436173 436806 437164 437221 437221 437223 437169 437157 437182 436708 435014 432084 428773
51787 428773 425945 423768 421968 420425 419258 418528 418217 418459 419572 421725 424598 427477 429830 431956 434929
51772 434929 439726 446340 453878 461514 469170 477314 486323 496175 506592 517256 527783 537430 544883
51759 544883 548655 548063 543790 537242 529282 519849 508736 496283 483219 470335 458588 449020 441904
51746 441904 436207 430565 424853 420263 417761 417073 417482 419036 422371 427625 434184 441563 450008 459941 471047
51731 471047 482140 491806 499104 503834 506439 507669 508235 508711 509701 511898 515678 520518 524926 527159 526204
51716 526204 522202 516098 509017 501944 495732 490953 487540 484711 481534 477634 473294 468996 465091 461948
51702 461948 460026 459530 460020 460604 460532 459568 457872 455785 453725 452089 451127 450852 451072 451368 451112 449789 447484
51685 447484 444932 442829 441139 439265 436925 434700 433547 433889 435265 436817 438034 439085 440615 443272
51671 443272 447314 452603 458971 466629 476128 487885 501774 517203 533498 550007 565750 579079
51659 579079 587969 590944 587864 579856 568525 555329 541615 528859 518453 511212 507270 506382 507987
51646 507987 510898 513373 513824 511464 506151 498032 487765 476865 467154 459535 453548 448257 443386 439446
51632 439446 437088 436578 437722 439897 442163 443611 443828 442981 441407 439170 436065 432055 427556 423200 419323
51617 419323 415864 412750 410076 407722 405079 401534 397186 392719 388654 385110 382244 380318 379179 378191
51603 378191 377111 376682 377988 381350 386226 391974 398432 405882 414790 425406 437318 449499 460956
51590 460956 471049 478929 483184 482743 478063 470835 462608 454261 446647 440862 437519 436371 436998 439445
51576 439445 443913 450428 459176 470592 484491 499529 514251 528603 543803 560748 579061 597740
51564 597740 616163 634307 652525 671570 692588 716627 744108 774868 808595 844844 882472
51553 882472 919207 952099 978603 997342 1008010 1010794 1006048 994260 975938 951538 921808 888292
51541 888292 853122 818125 784359 752607 723834 698813 677529 659458 644315 632164 622794 615340
51529 615340 608541 601200 592571 582622 571916 560930 549619 537939 526583 516537 507923 499899 491921
51516 491921 484465 478110 472465 466617 460343 454289 449079 444751 441057 437823 434860 431886 428728 425477
51502 425477 422432 419979 418439 417787 417568 417395 417459 418230 419681 421220 422492 423755 425230 426528 427150 427323
51486 427323 427809 428929 430104 430460 429605 427785 425574 423507 421831 420475 419326 418420 417689 416541 414155
51471 414155 410415 406268 402811 400132 397378 393911 390021 386358 383004 379464 375544 371878 369381 368244
51457 368244 367689 366776 365345 364017 363363 363338 363625 364331 366029 369179 373739 379437 386193 394121 403267 413541
51441 413541 424890 437320 450678 464492 477968 490101 499884 506748 511005 513713 515832 517418 517690
51428 517690 515900 512039 506693 500373 493175 485071 476359 467652 459459 451913 444972 438780 433668 429828
51414 429828 427057 424889 422939 421173 419936 419682 420466 421631 422201 421783 420943 420534 420791 421394 422264 423817
51398 423817 426334 429469 432740 436219 440350 445227 450468 455877 461962 469625 479463 491373 504764 519182
51384 519182 534956 553315 575723 603086 635654 673511 716771 765226 818163 874709 934023
51373 934023 994748 1054316 1109082 1155229 1189713 1210836 1218471 1213731 1198046 1172382 1137478 1094722
51361 1094722 1046372 994714 941284 887098 833346 781456 732590 687455 646638 610707 579780
51350 579780 553301 530540 511179 495068 481534 469426 458029 447600 438753 431502 425258 419614
51338 419614 414753 411046 408560 407074 406274 405806 405379 405030 405155 406063 407583 409212 410510 411195 411021 409874
51322 409874 407963 405711 403389 400973 398424 395976 394092 393076 392747 392553 392185 392068 393031 395359 398364
51307 398364 401035 402869 403825 403745 402361 399906 397277 395272 393813 392130 389677 386731 384064 382077 380386
51292 380386 378363 376025 374147 373421 373730 374447 375199 376080 377397 379642 383559 389629 397311 405236 412306
51277 412306 418299 423349 427359 430222 432250 433868 435109 435807 436179 436851 438243 440242 442547 445122 448166
51262 448166 451694 455174 457634 458285 457116 454745 451601 447527 442357 436639 431381 427125 423571 420127
51248 420127 416459 412501 408289 404063 400320 397486 395547 394095 392681 391070 389296 387640 386473 385969
51234 385969 385938 386087 386387 387009 387929 388828 389551 390411 391734 393224 394150 394226 393888 393502 392740 391170 389224 387964
51216 387964 387881 388427 388930 389429 390320 391606 393020 394674 396939 399649 401955 403280 404104 405525 408166 411756
51200 411756 415642 419371 422744 425649 428083 430170 431933 433137 433609 433621 433603 433499 432806 431440 430081 429329
51184 429329 428822 427651 425458 422706 420042 417942 416823 416827 417407 417770 417886 418521 420073 421998 423655 425109
51168 425109 426695 428302 429613 430548 430971 430422 428819 427101 426512 427403 429245 431479 433680 435170 435369 434459
51152 434459 432963 430747 427271 422838 418651 415437 412885 410757 409564 409556 409852 409405 408338 407551 407391 407498
51136 407498 407786 408722 410541 412783 414816 416391 417579 418510 419319 420141 420986 421718 422256 422748 423566 425040 427047
51119 427047 428917 430063 430783 432064 434375 437063 439236 440828 442366 444048 445652 447210 449138 451645
51105 451645 454462 457239 459858 462314 464651 467016 469444 471568 472911 473459 473595 473501 473033 472208 471301 470327
51089 470327 469013 467469 466401 466237 466426 466062 464981 463852 463334 463547 464248 465164 466064 466798 467349 467761 468053
51072 468053 468287 468610 469117 469872 471181 473633 477622 483059 489839 498394 509419 523196 539620 558746
51058 558746 580699 604847 629597 653272 674844 693556 708491 719254 727059 734402 743231 753514
51046 753514 763592 771696 777068 779986 781037 780321 777207 770964 761772 751068 740782 732228 725685 720679
51032 720679 716271 711168 704004 693898 680798 665336 648455 631130 614219 598509 584953 574693
51020 574693 568479 565996 566073 567786 571137 576564 584140 593528 604373 616292 628681 640984 653014
51007 653014 664563 674909 683339 690115 696117 701366 704684 705320 704214 702913 701679 699440 695401 689903
50993 689903 683748 677578 672139 668339 666481 665894 665849 666614 669188 674241 681739 691457 703318 717160 732576
50978 732576 749176 766697 784723 802531 819507 835691 851812 868806 887405 908157 931632
50967 931632 958487 989268 1024199 1063179 1106025 1152689 1203238 1257579 1315179 1374964 1435445
50956 1435445 1495047 1552473 1606867 1657640 1704141 1745503 1780869 1809824 1832611 1849889 1862268
50945 1862268 1870189 1874264 1875606 1875543 1874945 1873867 1871788 1868022 1861937 1853140 1841744 1828412 1813904 1798524
50931 1798524 1782035 1764058 1744394 1723032 1699962 1675013 1647747 1617583 1584159 1547596 1508285
50920 1508285 1466544 1422706 1377599 1332572 1288861 1247023 1207207 1169802 1135480 1104520 1076408
50909 1076408 1050337 1026054 1003987 984485 967080 950724 934732 919300 905062 892275 880623
50898 880623 869687 859349 849747 841148 834002 828863 825889 824434 823419 822241 821156 820722 821047 821799
50884 821799 822774 824130 825999 828197 830515 833178 836741 841571 847642 854812 862995 871981 881351 890780
50870 890780 900312 910231 920811 932423 945679 961140 978890 998591 1019985 1043126 1068235 1095630
50858 1095630 1125837 1159464 1196881 1238282 1284173 1335518 1393268 1457969 1529941 1609536 1697003
50847 1697003 1792335 1895461 2006298 2124313 2248287 2376843 2508966 2643479 2778100 2909493
50837 2909493 3034331 3149901 3253696 3343020 3415371 3469089 3503528 3519044 3517140 3500376 3471786
50826 3471786 3434350 3391081 3345209 3299805 3257184 3218899 3186178 3160009 3140635 3127114 3117314
50815 3117314 3108216 3096343 3078402 3051934 3015500 2968357 2910193 2841180 2761988 2673471 2576508
50804 2576508 2472446 2363677 2253372 2144352 2038341 1936493 1840467 1752439 1673857 1604532
50794 1604532 1543255 1489114 1441851 1401174 1366419 1337118 1313355 1295104 1281462 1271010 1262862
50783 1262862 1256951 1253291 1251369 1250390 1249810 1249434 1249166 1248797 1247974 1246314 1243683 1240398 1236904 1233093 1228082
50768 1228082 1220881 1211265 1199900 1187692 1175018 1161529 1146658 1130474 1114033 1098738 1085229 1073142
50756 1073142 1062012 1052037 1043678 1036877 1031252 1026970 1024827 1025379 1028562 1034430 1043675 1056936 1073978
50743 1073978 1094174 1117708 1145642 1178681 1216362 1257698 1302260 1350269 1401858 1456681 1514257
50732 1514257 1574352 1636829 1701190 1766513 1831974 1897357 1962868 2028312 2092651 2154515 2213016
50721 2213016 2267727 2317911 2362126 2398673 2426071 2443044 2448523 2442085 2424209 2395857 2358194 2313106
50709 2313106 2263682 2213509 2165407 2121197 2082432 2050570 2026212 2008832 1997590 1991869 1990538 1991170
50697 1991170 1990710 1986768 1977815 1962381 1938880 1906407 1865274 1816614 1761949 1703242 1642754 1582324
50685 1582324 1522989 1465618 1411604 1362509 1319190 1281706 1249967 1224047 1203904 1189339 1180393
50674 1180393 1177311 1179820 1186796 1196975 1209789 1225190 1242906 1262282 1282669 1303386 1323299 1341095
50662 1341095 1356373 1370153 1383970 1398629 1414020 1429829 1445988 1462618 1480006 1498724 1519348
50651 1519348 1541950 1566044 1591131 1617131 1644356 1673392 1705075 1740177 1778832 1820501 1864666
50640 1864666 1911286 1960337 2011164 2062687 2114141 2165241 2215677 2264852 2312248 2357774 2401593
50629 2401593 2443755 2484083 2522358 2558581 2593112 2626256 2657075 2682308 2697014 2697167 2682206 2655275
50617 2655275 2621229 2584559 2548753 2516594 2490226 2470865 2458707 2453143 2452873 2455936 2460023 2462992
50605 2462992 2463006 2458229 2446757 2427115 2398643 2361215 2314871 2260097 2198276 2131369 2061035 1988465
50593 1988465 1915093 1842839 1773238 1706669 1642856 1581965 1524717 1471532 1422094 1375877 1332748
50582 1332748 1292946 1256751 1224328 1195698 1170723 1149268 1131327 1116731 1104766 1094652 1086696
50571 1086696 1082541 1083664 1089726 1098837 1109381 1121147 1134695 1150239 1167474 1186083 1205919 1226831
50559 1226831 1248649 1271348 1294920 1319074 1343343 1367544 1391848 1416243 1440138 1462728 1483721
50548 1483721 1503595 1523200 1543191 1563764 1584748 1605965 1627705 1650986 1677315 1708029 1743784
50537 1743784 1784563 1830211 1880969 1937499 2000335 2069391 2144207 2224682 2311346 2404781 2504988
50526 2504988 2611468 2723664 2840864 2961857 3085084 3209158 3332799 3454154 3570580
50517 3570580 3679252 3777583 3862954 3932610 3984348 4017048 4030227 4023493 3996966 3951935 3890431
50506 3890431 3814318 3725516 3627066 3523192 3418138 3315579 3219358 3133844 3062813 3008291 2970955
50495 2970955 2951178 2948966 2963089 2990999 3029618 3075716 3125519 3174503 3217680 3249778 3265428
50484 3265428 3260126 3231588 3180005 3106952 3014606 2906203 2786500 2660849 2533670 2407988
50474 2407988 2286123 2170206 2061978 1962514 1872250 1790942 1717512 1650323 1587994 1529953 1476207
50463 1476207 1426849 1381962 1341827 1306861 1277271 1252888 1233434 1218851 1209274 1204638 1204374 1207542
50451 1207542 1213372 1221698 1232836 1247032 1264117 1283780 1306099 1331602 1360728 1393269 1428392 1465044
50439 1465044 1502054 1537764 1569814 1595725 1613972 1624624 1628997 1628703 1624919 1618322 1609530 1599492
50427 1599492 1589375 1580068 1571882 1564808 1559036 1555052 1553309 1553990 1557239 1563539 1573793 1589077 1610250
50414 1610250 1637636 1670976 1709757 1753608 1802323 1855592 1912912 1973675 2036974 2101241 2164533
50403 2164533 2225447 2283446 2337935 2387368 2429748 2463857 2489449 2506267 2513406 2509699 2494236 2466394
50391 2466394 2425960 2373676 2311491 2242073 2168241 2092863 2018803 1948550 1884008 1826811 1778501
50380 1778501 1740123 1711898 1693518 1684550 1684350 1691876 1705851 1724781 1746506 1768101 1786695 1800237
50368 1800237 1807134 1805671 1794521 1773701 1744328 1707482 1663969 1615184 1563407 1511002 1459937 1412187
50356 1412187 1369701 1333310 1302185 1274960 1251130 1230806 1213469 1197683 1181997 1165527 1147527
50345 1147527 1126977 1103063 1075991 1047118 1018300 991186 967055 946978 931665 920940 913707
50334 913707 908911 906476 906813 909445 912871 916146 919977 925627 933081 941051 948634 956272 964892 974686
50320 974686 985035 995172 1004523 1012645 1019306 1024738 1029483 1033793 1037220 1038984 1038888 1037790 1037030 1037424 1038956
50305 1038956 1041371 1044727 1049240 1054929 1061766 1070062 1080494 1093860 1110947 1132450 1158617 1188977
50293 1188977 1222644 1258895 1297154 1336062 1372309 1400370 1414015 1409288 1386888 1351684 1309605
50282 1309605 1264940 1220311 1178062 1140528 1109007 1083356 1062856 1046976 1035190 1026632 1020330 1015608
50270 1015608 1012121 1009737 1008446 1008107 1008264 1008525 1009126 1010720 1013545 1017239 1021649 1027344 1035027 1044726 1055837
50255 1055837 1067650 1079600 1091272 1102434 1112930 1122419 1130540 1137510 1144129 1150871 1157246 1162444 1166306
50242 1166306 1169161 1170904 1170856 1168613 1164544 1159295 1153240 1146741 1140714 1136470 1134894 1135890 1138698 1142514 1146520
50227 1146520 1149295 1148623 1142273 1129141 1109616 1085103 1057410 1028351 999310 971043 944098 919411
50215 919411 898034 880164 864893 851131 838478 826993 816607 807120 798461 790580 783277 776464
50203 776464 770361 765151 760659 756652 753085 749682 745735 740921 736063 732342 729797 727204 723508 718800
50189 718800 713784 708881 704118 699468 694998 690906 687520 684983 682813 680193 676837 673282 670189 667712
50175 667712 665692 664032 662566 660979 659323 658417 659200 661673 664792 667444 669307 670754 672187 673696 675279
50160 675279 677170 679739 682975 686257 688965 691305 694253 698593 704323 711141 719131 728637 739696 751965
50146 751965 765097 778791 792533 805789 818657 832077 847189 864547 884009 905139 927526
50135 927526 950873 975018 999875 1025235 1050682 1075784 1100303 1124043 1146444 1166416 1182582
50124 1182582 1193627 1198595 1197163 1189837 1177777 1162227 1144041 1123747 1101871 1079052 1055949 1033275
50112 1033275 1011907 992754 976422 963100 952615 944332 937066 929575 921384 912765 903753 893677
50100 893677 882167 870234 859553 850561 841925 832141 821216 810451 801033 793296 787064 782072 777921
50087 777921 774118 770478 767400 765535 765166 765969 767325 768790 770271 771903 773878 776348 779341 782719 786370
50072 786370 790502 795536 801473 807530 812738 816899 820646 824550 828545 832277 835563 838115 839234 838326
50058 838326 835722 832550 829700 827214 824712 821985 818955 815400 811165 806584 802392 799148 796918 795602
50044 795602 795397 796744 799903 804718 810875 818279 827081 837246 848254 859435 870708 882777 896329
50031 896329 911073 925932 940271 954597 969753 985761 1001966 1018130 1034692 1051716 1068228
50020 1068228 1083143 1096556 1109594 1123104 1136913 1150259 1162428 1172794 1180666 1185485 1187182 1186285
50008 1186285 1183682 1180072 1175385 1168726 1159060 1145926 1129411 1109839 1088006 1065533 1044209 1024798
49996 1024798 1007002 990724 976632 965052 954969 944954 934763 925291 916991 909024 900094 889523
49984 889523 877261 863418 848276 832541 817091 802343 787994 773511 758866 744772 732191
49973 732191 721621 712919 705723 699726 694530 689650 685037 681265 678766 677005 674950 672251 669465 667109
49959 667109 665178 663774 663536 665013 668094 672599 679043 688087 699359 711489 723355 734773 745825
49946 745825 756066 764730 771380 776106 779338 781694 783704 785338 785945 784932 782383 778689 773743 766883
49932 766883 757577 745862 732206 717429 702810 689646 678266 667849 657641 648163 640749 635984
49920 635984 633135 631185 629926 629774 630899 632968 635612 638739 642311 646083 649752 653316 657153 661726
49906 661726 667295 674010 682233 692492 704909 718729 732706 745983 758413 770030 780591 789856
49894 789856 798015 805403 811820 816447 818513 817795 814408 808349 799487 787955 774374 759659 744683
49881 744683 730148 716643 704565 693811 683668 673405 663105 653760 646373 641056 637159 634053
49869 634053 631523 629542 628061 627172 627194 628467 631166 635334 640907 647641 655254 663784 673638 685162 698295
49854 698295 712711 728011 743510 758068 770678 781344 791039 800517 809302 816026 819691 820337 818521
49841 818521 814530 808343 800181 790647 780211 768862 756539 743755 731465 720317 710300 701152
49829 701152 692856 685644 679803 675637 673405 673055 674133 676245 679491 684198 690272 697173 704536 712529
49815 712529 721439 731168 741269 751298 760879 769604 777148 783472 788701 792824 795640 796994 796896 795399
49801 795399 792582 788714 784279 779699 775047 770045 764193 756905 747729 736645 724156 711024 697978
49788 697978 685732 675012 666214 659046 652766 646961 642016 638697 637328 637475 638341 639373 640513 641991
49774 641991 644042 646809 650481 655358 661670 669340 677962 687048 696264 705425 714390 722981 731039 738454
49760 738454 745107 750768 755100 757836 758885 758166 755372 750148 742567 733234 722765 711466 699750 688627
49746 688627 679224 671878 666119 661606 658553 657044 656472 656064 655623 655328 655135 654908 654936 655788 657670 660434
49730 660434 664178 669224 675331 681511 686974 691964 697391 703956 711916 721445 732813 746251 761772
49717 761772 778970 796733 813387 827426 838106 845255 848766 848599 845042 838576 829564 818427 806105
49704 806105 793980 783252 774557 768110 763878 761617 761007 761726 763071 763639 761982 757807 752132 746150
49690 746150 740369 735075 731011 728951 728904 730341 733150 737831 744769 753839 764833 777804 792799 809645
49676 809645 828376 849594 873965 901137 929082 954473 973845 984904 987285 982463 973116 962437
49664 962437 953432 948072 946791 948996 954188 962291 972670 983078 990004 990238 982246 966471 944774
49651 944774 919608 893284 867568 843695 822567 804749 790322 778932 770158 763811 759853 758018
49639 758018 757677 758211 759495 761716 764601 767061 767975 767192 765361 762760 758815 752969 745593 737647 729770
49624 729770 722123 714938 708680 703587 699356 695378 691182 686748 682646 679813 678823 679347 680483 681586 682596
49609 682596 683682 684955 686553 688530 690580 692194 693286 694326 695689 697194 698526 699783 701260 702839
49595 702839 704029 704548 704644 704826 705496 706774 708409 709849 710631 710800 710836 711200 712055 713347 714884 716264 717019
49578 717019 717031 716727 716640 716925 717491 718561 720729 724381 729305 735109 741848 749914 759438 770161 781897
49563 781897 794672 808177 821418 833262 843153 851070 856934 860457 861456 860028 856426 851057 844538
49550 844538 837509 830395 823564 817590 812952 809556 806956 805048 804162 804397 805352 806637 808168 809813 811233
49535 811233 812403 813873 816135 819111 822718 827651 835017 845251 857826 872092 888071 906381 927632
49522 927632 952015 979248 1008672 1039148 1068714 1094624 1114433 1127444 1134895 1138580 1139727 1139428
49510 1139428 1139482 1141835 1147162 1154504 1162209 1168657 1172072 1170486 1162505 1148038 1128136 1104306 1078030
49497 1078030 1050665 1023559 998207 976035 957659 942403 929001 916873 906378 897802 890687 884516
49485 884516 879632 876886 876415 877161 877657 877102 875722 874370 873869 874556 876220 878380 880668 882987 885406 887934
49469 887934 890471 893056 896077 900017 904852 909929 914629 919019 923612 928608 933675 938433 942756 946553
49455 946553 949550 951434 951975 950945 948166 943795 938386 932567 926774 921321 916422 912045 908009 904460
49441 904460 902074 901567 903109 906375 911052 917056 924339 932726 942007 952077 962977 974940 988466
49428 988466 1004310 1023334 1046304 1073702 1105592 1141622 1181330 1224606 1271614 1321371 1369639
49417 1369639 1408478 1429364 1428125 1407325 1373897 1334822 1294984 1257793 1226001 1201352 1184317
49406 1184317 1174727 1172283 1176158 1184710 1196180 1209537 1224452 1240734 1258035 1275710 1292676 1307826
49394 1307826 1320972 1333101 1345204 1357115 1367776 1376344 1382506 1386014 1386538 1383936 1378185 1369147 1356962
49381 1356962 1342618 1327478 1312156 1296422 1280374 1265070 1251606 1240119 1230182 1221864 1215788 1212278
49369 1212278 1211026 1211651 1214059 1218046 1222857 1227483 1231225 1233769 1234897 1234492 1232770 1230179 1226844 1222326
49355 1222326 1216104 1208208 1199258 1190066 1181329 1173554 1166935 1161313 1156540 1152858 1150683 1149957 1149997 1150042 1149774
49340 1149774 1149238 1148545 1147663 1146163 1143097 1137584 1129834 1121280 1113332 1106281 1099768 1094002 1089935 1088357 1089443
49325 1089443 1093278 1100268 1110780 1124773 1142054 1162490 1185464 1209100 1230378 1246220 1254710 1255654
49313 1255654 1250277 1240286 1226924 1210776 1192440 1173116 1154204 1136357 1119358 1103153 1088671 1077251
49301 1077251 1069306 1064040 1060540 1058730 1058964 1061011 1063951 1067049 1070313 1074058 1078176 1082018 1084863 1086397
49287 1086397 1086781 1086251 1084636 1081381 1076231 1069713 1062698 1055613 1048485 1041657 1035890 1031675 1028923 1027582
49273 1027582 1028067 1030697 1035045 1040190 1045381 1050162 1054161 1057156 1059220 1060408 1060481 1059277 1057222 1055126 1053607
49258 1053607 1053057 1054120 1057885 1065562 1078058 1095563 1117235 1141463 1166768 1192250 1216836 1238401
49246 1238401 1254218 1262288 1261986 1253746 1238799 1219051 1196494 1172543 1148288 1125153 1104534 1086804
49234 1086804 1071476 1058536 1048836 1042869 1040051 1039731 1042053 1047029 1053398 1059494 1065032 1071073 1078181 1085493
49220 1085493 1091888 1097334 1102669 1108470 1114646 1120912 1127205 1133609 1140007 1145903 1150604 1153781 1155905 1158073
49206 1158073 1161366 1166465 1173770 1183502 1195526 1209277 1224095 1239580 1255590 1272096 1289101 1306409
49194 1306409 1323225 1338258 1350730 1361190 1370885 1380227 1388328 1394237 1398129 1400927 1403215 1405133 1407142
49181 1407142 1410161 1414898 1421655 1430930 1443675 1460645 1482034 1508057 1539423 1576788 1620124 1669015
49169 1669015 1722916 1780100 1836348 1885640 1922701 1944975 1952654 1947871 1934188 1915927 1896915 1879490
49157 1879490 1864646 1852737 1843734 1837070 1831722 1826673 1821376 1816033 1811507 1808618 1807380 1807109 1807409 1808744
49143 1808744 1811831 1816813 1823299 1830906 1839351 1848340 1857842 1868371 1880480 1893926 1907808 1921526 1935231
49130 1935231 1949270 1963684 1978460 1993783 2009665 2025688 2041561 2057704 2074791 2092867 2111434
49119 2111434 2130448 2150745 2173414 2199307 2229444 2265382 2308702 2360506 2421961 2495149 2582837
49108 2582837 2687681 2812410 2960578 3135411 3336046 3554290 3775977 3987405 4182792
49099 4182792 4366676 4547544 4725622 4884711 4997196 5040404 5010889 4924491 4803539 4663434
49089 4663434 4508442 4336439 4146235 3942111 3733648 3531940 3345438 3178513 3032743
49080 3032743 2908339 2804323 2718537 2648283 2590755 2542899 2501828 2465930 2434919 2408319 2384546
49069 2384546 2362147 2341286 2323103 2307948 2295010 2283344 2272413 2261798 2251316 2241530 2233384 2227080
49057 2227080 2221870 2217102 2212957 2210058 2208830 2209469 2212035 2216321 2221963 2228906 2237492 2247939 2259965 2272939
49043 2272939 2285955 2297575 2305936 2309722 2309068 2305375 2300312 2295100 2290573 2287523 2286764 2288793 2293476 2300136
49029 2300136 2307968 2316263 2324283 2331213 2336499 2340147 2342467 2343609 2343537 2342382 2340638 2339032 2338310 2338925 2340787
49014 2340787 2343475 2346861 2351236 2356617 2362390 2368117 2374326 2381822 2390402 2399034 2407199 2415250 2423343 2430967
49000 2430967 2437877 2444606 2451524 2458082 2463683 2468625 2473305 2476980 2478356 2477385 2475471 2473701 2471758 2468924
48986 2468924 2465416 2462041 2458986 2455677 2451742 2447531 2443543 2439770 2435813 2431397 2426531 2421275 2415619 2409517
48972 2409517 2402877 2395464 2387078 2377882 2368388 2358935 2349352 2339476 2329875 2321683 2315593 2311310 2308217 2306312
48958 2306312 2306266 2308706 2313734 2320994 2329944 2340129 2351534 2364675 2380085 2397666 2416817 2437212 2459021
48945 2459021 2482151 2505639 2528334 2550125 2572091 2595319 2619853 2644977 2670330 2696505 2724605
48934 2724605 2755441 2789153 2825383 2863626 2903437 2944468 2986439 3029159 3072665 3117354 3163886
48923 3163886 3212802 3264065 3317036 3370997 3425709 3481321 3537710 3594183 3650010 3705055 3759456
48912 3759456 3812791 3864127 3913054 3960175 4006138 4050648 4093042 4133571 4173265 4212400 4249891
48901 4249891 4284607 4316693 4347118 4376316 4403814 4428874 4450904 4469408 4484206 4495770 4504845
48890 4504845 4511676 4515991 4517828 4517820 4516453 4513475 4508348 4500908 4491166 4478691 4462697 4442863 4419799 4394587
48876 4394587 4367876 4339431 4308421 4274162 4236584 4196068 4152887 4107009 4058403 4007388 3954631
48865 3954631 3900980 3847328 3794386 3742479 3691713 3642445 3595341 3550822 3508699 3468608 3430665
48854 3430665 3395381 3363046 3333447 3306191 3281029 3257924 3237075 3218811 3203166 3189591 3177465
48843 3177465 3166988 3159187 3154824 3153645 3154923 3158377 3164155 3172209 3182247 3194282 3208699 3225598 3244398
48830 3244398 3264208 3284309 3304182 3323518 3342506 3361834 3382035 3402956 3424099 3445282 3466671
48819 3466671 3488391 3510454 3532928 3555735 3578398 3600423 3621871 3643064 3663751 3683173 3701106
48808 3701106 3718262 3735451 3752926 3770884 3789991 3810803 3833074 3856303 3880678 3906743 3934271
48797 3934271 3962233 3989931 4017463 4044836 4071236 4095570 4117323 4136605 4153772 4169374 4184144
48786 4184144 4198507 4212105 4224119 4233965 4241517 4246688 4249025 4247631 4241393 4229445 4211655 4188633
48774 4188633 4161180 4129837 4095032 4057319 4017148 3974544 3929319 3881600 3831915 3780873 3729062
48763 3729062 3677209 3626041 3575849 3526425 3477506 3429086 3381307 3334387 3288805 3245227 3203959
48752 3203959 3164731 3127274 3091943 3059373 3029654 3002266 2976721 2952792 2930099 2908153 2887161
48741 2887161 2868288 2852523 2839587 2828539 2819264 2812610 2808959 2807408 2806708 2806440 2806744 2807360 2807696 2807776 2808461
48726 2808461 2810469 2813535 2816734 2819461 2821914 2824733 2828272 2832225 2835968 2839244 2842322 2845389 2848006 2849553
48712 2849553 2850066 2850283 2850832 2851765 2852939 2854484 2856688 2859698 2863462 2867721 2871888 2875247 2877571 2879415 2881558
48697 2881558 2884387 2888048 2892960 2899693 2908294 2918125 2928475 2939081 2949935 2960766 2970972 2980051 2988048
48684 2988048 2995615 3003627 3012604 3022482 3032993 3044242 3056701 3070544 3085211 3099770 3113695 3127196
48672 3127196 3140956 3155722 3171897 3189154 3206388 3222311 3236116 3247329 3254976 3257426 3253282 3242047
48660 3242047 3223524 3196992 3161717 3118262 3068675 3015226 2959439 2902513 2846095 2792082 2741899
48649 2741899 2696312 2655719 2620265 2589758 2563754 2541617 2522291 2504297 2486410 2468392 2450742
48638 2450742 2433694 2416681 2398781 2379520 2359244 2338835 2319031 2299918 2281075 2262188 2243277
48627 2243277 2224345 2205249 2186181 2167854 2150787 2134729 2119279 2104756 2091807 2080289 2069323
48616 2069323 2058592 2048997 2041776 2037432 2035757 2036380 2038912 2042793 2047371 2052072 2056342 2059631 2061592 2062274
48602 2062274 2062063 2061511 2061159 2061311 2062024 2063476 2066208 2070597 2076127 2081551 2085845 2088686 2090027 2089672 2087365
48587 2087365 2082844 2075622 2065111 2051263 2034871 2017099 1998937 1981111 1964038 1947704 1931918 1916917
48575 1916917 1903448 1892079 1882774 1875265 1869535 1865732 1863976 1864418 1867189 1872026 1878191 1884864 1891328 1896792
48561 1896792 1900471 1901866 1900496 1895377 1885605 1871715 1855705 1839310 1822930 1806665 1791413 1778072
48549 1778072 1766310 1755149 1744341 1734143 1724018 1712662 1699404 1684677 1669045 1652628 1635700
48538 1635700 1619075 1603506 1589216 1576178 1564420 1553876 1544503 1536746 1531444 1529123 1529755 1533239 1539580
48525 1539580 1548554 1559862 1573788 1590853 1610165 1628537 1641825 1647097 1643525 1631918 1614114 1592478
48513 1592478 1569275 1546348 1525518 1508772 1497414 1491177 1488844 1489823 1494589 1503636 1516665 1533110
48501 1533110 1552813 1575587 1600397 1625519 1649338 1670327 1686160 1693684 1690508 1676792 1655306 1629850
48489 1629850 1603603 1578404 1554776 1532365 1510738 1490079 1471022 1453811 1437946 1422834 1408482
48478 1408482 1395296 1383438 1372690 1362855 1353963 1346090 1339219 1333327 1328432 1324458 1321170 1318303 1315827
48465 1315827 1314053 1313376 1313821 1315031 1316861 1319825 1324555 1330944 1338291 1346253 1354952 1363912 1371580 1376491
48451 1376491 1378504 1378375 1376486 1372697 1367246 1361066 1355051 1349451 1344027 1338378 1332040 1324685 1316409 1307570
48437 1307570 1298331 1288644 1278686 1268953 1259758 1250880 1241876 1232610 1223372 1214599 1206549 1199162 1192180 1185343
48423 1185343 1178416 1171126 1163350 1155456 1148118 1141622 1135574 1129423 1122993 1116327 1109437 1102539 1096131 1090392
48409 1090392 1084728 1078438 1071659 1065185 1059483 1054396 1049760 1045836 1043013 1041435 1040884 1040756 1040175 1038427 1035368
48394 1035368 1031320 1026699 1021905 1017322 1013133 1009262 1005644 1002319 999142 995882 992861 990951 990569 991184
48380 991184 992242 993933 996391 998836 1000427 1001509 1002970 1004716 1005881 1006370 1007065 1008493 1010360 1012576 1015694
48365 1015694 1020078 1025519 1032045 1040305 1050822 1063545 1078429 1095788 1115779 1138024 1161830 1186079
48353 1186079 1208703 1227053 1239317 1245394 1246502 1244593 1242055 1241053 1242691 1247219 1254991 1266521 1281622
48340 1281622 1299447 1319662 1342871 1369729 1400368 1434921 1473831 1517416 1565799 1619533 1679814
48329 1679814 1747952 1825101 1912434 2011236 2123188 2251213 2399520 2572320 2773613 3009605
48319 3009605 3290992 3632574 4052990 4577205 5237956 6072307 7117317 8408900 9978682
48310 9978682 11845837 14014689 16481286 19219463 22117815 24906627 27171653 28497734
48302 28497734 28654168 27679936 25820676 23397981 20713055 18010166 15467060 13190673
48294 13190673 11223913 9565388 8189417 7058452 6131760 5372667 4750817 4239929 3816982
48285 3816982 3464206 3169323 2922772 2715892 2541568 2394459 2269817 2163233 2071606 1992905
48275 1992905 1924847 1865131 1812973 1768848 1732335 1701523 1674774 1651773 1632363 1615615 1600718
48264 1600718 1587822 1577327 1569019 1562487 1557819 1555362 1555129 1556825 1560107 1564556 1569674 1575172 1581107 1587613
48250 1587613 1594537 1601045 1605325 1605007 1598615 1586651 1570961 1553226 1534508 1515904 1498667 1483465
48238 1483465 1470088 1458165 1447774 1439229 1432632 1427748 1424001 1420533 1416575 1411844 1406373 1400010 1392412
48225 1392412 1383513 1373679 1363428 1353151 1342877 1331928 1319025 1303290 1285124 1265723 1245716 1224734
48213 1224734 1202224 1178259 1153485 1128663 1104270 1080238 1056102 1031735 1007866 985488 964886
48202 964886 945625 927350 910083 893817 878432 864100 851206 839696 828920 818350 808133
48191 808133 798834 790876 784257 778501 772926 767306 762216 758273 755165 751970 748379 744970 742188 739798
48177 739798 737523 735531 733923 732367 730648 729020 727576 725824 723539 721555 720970 721683 722360 721787 719829
48162 719829 717197 714831 713481 713352 713961 714617 715058 715370 715470 715144 714563 714279 714540 715044 715508 716075 716945 717987
48144 717987 718988 720013 721167 722310 723335 724562 726365 728508 730308 731512 732570 733862 735075 735666
48130 735666 735735 736052 737276 739423 742089 744888 747574 749960 751891 753284 754241 755148 756571 758835 761712
48115 761712 764770 768005 771873 776583 781623 786188 789976 793424 797319 802250 808269 814901 821636 828538
48101 828538 836178 844802 853882 862886 872287 883227 896052 909637 922453 934093 945480 957726
48089 957726 971044 984723 997848 1009957 1021111 1031590 1041687 1051797 1062403 1073720 1085335
48078 1085335 1096489 1106829 1116707 1126582 1136257 1144982 1152270 1158484 1164584 1171463 1179554 1188795 1198775
48065 1198775 1208942 1218859 1228309 1237098 1244932 1251616 1257259 1262045 1265892 1268591 1270260 1271198 1271219 1269570
48051 1269570 1265797 1260258 1253416 1245046 1234808 1223380 1212229 1202150 1192594 1182521 1171389 1159128
48039 1159128 1145808 1131658 1117014 1101923 1086194 1070055 1054288 1039363 1024875 1010210 995300
48028 995300 980271 964826 948699 932435 917001 902712 889058 875507 861953 848539 835645
48017 835645 823934 813721 804291 794557 784446 775000 766984 760093 753772 747991 742777 737614 731978
48004 731978 726063 720392 715036 709799 704940 701047 698227 695935 693662 691377 689181 686986 684698 682458
47990 682458 680508 678962 677780 676803 675780 674526 673150 671945 671049 670285 669347 667904 665562 662078 657817
47975 657817 653784 650913 649341 648509 647811 646902 645571 643751 641772 640232 639391 638888 638250 637457 636785 636335
47959 636335 636050 636047 636447 636950 637068 636890 637198 638583 640800 643214 645567 648018 650793 654128 658303 663316
47943 663316 668707 674111 679879 686762 695047 704364 714208 724201 733850 742645 750570 758074 765337 771896
47929 771896 777310 781864 786232 790591 794422 797208 798969 800009 800343 799619 797663 794886 791901 788750 784820
47914 784820 779699 773924 768521 763867 759268 753715 746846 739116 731274 723833 717010 710981 706079 702549
47900 702549 700159 698263 696419 694762 693721 693606 694663 697146 700952 705383 709737 713986 718476 723134
47886 723134 727526 731627 735976 741008 746803 753521 761458 770362 779236 787124 793741 799106 803068 805666
47872 805666 807575 809677 812215 814652 816227 816477 815374 813158 809905 805238 798786 790936 782608 774115
47858 774115 764861 754514 743871 733905 724478 714820 704997 695987 688271 681249 674260 667503 661548 656483
47844 656483 652024 648195 645427 644093 644190 645378 647136 648933 650495 651915 653486 655479 658109 661513 665590
47829 665590 669949 674202 678309 682522 687003 691601 696055 700340 704732 709586 715159 721626 729040 737156
47815 737156 745527 754108 763728 775591 790177 806920 825040 844371 865180 887494 911020 935483
47803 935483 960530 985243 1008124 1027856 1044027 1057051 1067496 1075496 1080670 1082513 1080782 1075521
47791 1075521 1066872 1055194 1041432 1026995 1012899 999124 985093 970755 956957 944795 934857 927094
47779 927094 921116 916414 912448 908712 904895 901059 897560 894585 891712 888176 883713 878862 874209 869561
47765 869561 864173 857609 849969 841426 832014 821981 811995 802797 794782 787901 781779 775928 770112 764631
47751 764631 760123 757088 755667 755663 756539 757562 758387 759497 761701 765155 769273 773605 778377 784034 790742
47736 790742 798566 807677 817992 828993 840355 852504 866010 880546 895017 908778 922199 935772
47724 935772 949059 960924 970581 978078 983766 987741 989965 990665 990253 988864 986180 981773 975475 967341
47710 967341 957460 945988 933324 920112 906994 894322 881997 869644 857147 845091 834424 825551
47698 825551 818020 811312 805595 801304 798269 795873 794064 793600 795088 798243 802348 807055 812441 818681
47684 818681 826070 835115 846073 858466 871416 884470 897722 911186 924432 937062 949227 961374
47672 961374 973589 985459 996572 1006853 1016208 1024063 1029593 1032467 1033117 1032116 1029504 1024927 1018223
47659 1018223 1009586 999361 988040 976323 964666 952756 939958 926402 913127 901006 890057
47648 890057 880114 871491 864404 858308 852615 847760 844635 843119 842211 841764 843001 846721 851928 857121 862370
47633 862370 869080 877960 888370 899834 913148 929393 948552 969813 992826 1017892 1045027 1073495
47621 1073495 1102361 1131009 1158859 1184963 1208184 1227669 1242988 1253878 1259919 1260386 1254533 1242224
47609 1242224 1224276 1201870 1175600 1145387 1111320 1074173 1035040 995030 955610 918585 885045
47598 885045 854567 826060 799255 774800 753052 733536 715694 699532 685233 672629 661352
47587 661352 651135 641761 633129 625614 619941 616307 613860 611400 608448 605358 602614 600302 598139 595796
47573 595796 593273 591092 589884 589649 589661 589241 588286 586996 585555 584359 583913 583946 583126 580401 576335 572446
47557 572446 569430 566842 564254 561771 559300 556314 552689 549027 545752 542600 539402 536717 535110 534328
47543 534328 533816 533577 533874 534424 534597 534216 533528 532562 531211 529833 529038 528794 528414 527604 526885 526730 526845 526723
47525 526723 526481 526667 527431 528309 528815 528988 529372 530490 532295 534117 535329 536034 536826 537847 538506 538299 537535
47508 537535 536960 536965 537392 537886 538070 537718 537079 536801 537132 537496 537306 536881 536911 537268 537187 536648 536623 537591 538708 539033
47488 539033 538894 539207 539903 540024 539325 538875 539737 541696 543640 544808 545311 545744 546747 548805 552020 555929
47472 555929 559753 562941 565487 567738 570025 572500 575223 578175 581075 583335 584482 584701 584764 585276 586149
47457 586149 586963 587582 588120 588458 588273 587597 587016 587203 588498 591025 594925 600311 607169 615446 625046 635672
47441 635672 646952 658923 672139 687018 703283 720351 738132 757037 777208 798075 818711
47430 818711 838291 856106 871461 883935 893614 900828 905645 907809 907180 904005 898711 891626 883058
47417 883058 873464 863240 852388 840649 828070 815139 802280 789497 776812 764769 754006 744363
47405 744363 734862 724734 714121 703657 693688 684191 675182 666856 659340 652603 646664 641771 638289
47392 638289 636362 635599 635179 634530 633984 634487 636497 639377 642001 643791 645051 646624 649486 654361 661200
47377 661200 669070 676851 684025 690599 696453 701259 705009 708103 710761 712692 713540 713308 712112 709779 705954
47362 705954 700503 693603 685545 676619 667125 657278 647125 636610 625720 614536 603275 592335 582142
47349 582142 572823 564093 555603 547331 539565 532574 526424 521049 516351 512170 508285 504553 501038 497955
47335 497955 495398 493188 491080 489183 488024 488071 489260 491102 493184 495380 497712 500230 503034 506177 509467
47320 509467 512536 515159 517357 519225 520849 522415 524074 525623 526559 526596 525918 524821 523395 521748 520241
47305 520241 519186 518494 517888 517324 516929 516681 516513 516651 517455 518909 520609 522328 524320 526959 530298 534172
47289 534172 538583 543805 550136 557522 565384 572933 579970 587387 596569 608140 621493 635721 650736
47276 650736 667154 685263 704565 724387 744522 764824 784228 800541 811472 815947 814482 808535
47264 808535 799671 789164 777904 766400 754967 744010 733937 724712 715824 707023 698839 691941 686040
47251 686040 679959 672891 665168 657644 650788 644604 639068 634220 630052 626607 624010 622114 620351 618279
47237 618279 616127 614449 613454 613044 613315 614426 616056 617623 619178 621550 625407 630627 636754 643518 650596
47222 650596 657446 663917 670700 678619 687687 697255 706793 715955 724119 730650 735646 739796 743327 745662
47208 745662 746269 745255 742823 738721 732791 725696 718465 711459 704266 696612 688912 681865 675905 671188
47194 671188 667751 665437 663858 662711 662070 662230 663316 665257 668114 672148 677404 683371 689416 695599 702803
47179 702803 711835 722605 734410 746892 760301 774827 790117 805603 821036 836463 851914 867274
47167 867274 882286 896462 909198 920212 929706 937962 944954 950549 954783 957568 958431 957030 953832
47154 953832 949744 945034 939148 931734 923356 914889 906612 898263 889785 881545 873815 866439 859195 852366
47140 852366 846733 842910 840734 839419 838322 837501 837462 838557 840840 844309 848913 854288 859855 865357 871061
47125 871061 877224 883537 889278 893930 897405 899684 900386 898856 894734 888413 880793 872498 863475 853519
47111 853519 842959 832445 822190 811859 801224 790482 779784 768910 757670 746328 735347
47100 735347 725027 715626 707467 700516 694072 687353 680318 673651 668012 663558 660005 656832 653561 650202
47086 650202 647405 645912 645939 647312 649903 653488 657371 660794 663778 667047 670976 675140 679071 682970 687380
47071 687380 692452 697863 703179 707943 711653 714005 715146 715498 715458 715386 715680 716544 717777 719020 720133 721209
47055 721209 722303 723410 724622 726121 728041 730491 733651 737619 742207 747089 752173 757640 763552 769581
47041 769581 775258 780433 785445 790826 796876 803470 810258 816999 823663 830283 836852 843457 850373 857882
47027 857882 865958 874233 882255 889791 896939 903956 910928 917627 923737 929211 934205 938677 942262 944663
47013 944663 945976 946402 945814 943830 940254 935281 929290 922705 916041 909871 904602 900310 896802 893724 890650
46998 890650 887257 883601 880233 877925 877130 877590 878524 879389 880496 882685 886331 890873 895484 899968 904755
46983 904755 910232 916507 923683 931839 940627 949386 957923 966844 976792 987659 998928 1010529 1022781
46970 1022781 1035490 1047645 1058323 1067588 1076253 1084947 1093655 1101982 1109475 1115715 1120467 1123857 1126222
46957 1126222 1127716 1128261 1128007 1127552 1127495 1127913 1128528 1129207 1129988 1130754 1131350 1132102 1133761 1136624 1140016 1142992 1145509
46940 1145509 1148612 1153401 1159983 1167447 1174818 1181953 1189515 1198023 1207119 1215972 1224256 1232315 1240325 1247974
46926 1247974 1255285 1263177 1272427 1282343 1291221 1298070 1303173 1306820 1308378 1307067 1303066 1297169 1289698 1280366
46912 1280366 1269133 1256549 1243114 1228761 1213262 1197000 1181140 1166980 1155115 1145156 1136335 1128438
46900 1128438 1122061 1117935 1116245 1116761 1119392 1124271 1131448 1140836 1152513 1166656 1183047 1200924 1219514
46887 1219514 1238559 1258168 1278296 1298551 1318391 1337306 1354899 1371008 1385757 1399218 1410991
46876 1410991 1420404 1427365 1432831 1438083 1443503 1448435 1452285 1455412 1458618 1462167 1465787 1469516 1473961 1479660
46862 1479660 1486694 1495136 1505346 1517408 1530648 1544113 1557396 1570594 1583702 1596502 1608930 1620965
46850 1620965 1632153 1641741 1649512 1656021 1661711 1666083 1668120 1667430 1664652 1660732 1655974 1649956 1642287 1633365
46836 1633365 1624267 1615916 1608455 1601502 1594817 1588573 1583160 1579012 1576560 1576040 1577283 1579961 1584027 1589738
46822 1589738 1597236 1606409 1617125 1629225 1642191 1655237 1667925 1680404 1692786 1704597 1715124 1724057
46810 1724057 1731402 1736942 1740178 1740851 1739231 1735824 1730950 1724652 1716894 1707861 1698097 1688230 1678448 1668367
46796 1668367 1657576 1646128 1634363 1622419 1610285 1598292 1587172 1577543 1569487 1562727 1557010 1552257
46784 1552257 1548447 1545489 1543186 1541397 1540269 1540135 1541047 1542502 1543881 1545073 1546413 1548066 1549827 1551580
46770 1551580 1553594 1556166 1559149 1562067 1564621 1567004 1569760 1573390 1577944 1582958 1588017 1593423 1600109 1608675
46756 1608675 1618734 1629426 1640412 1652023 1664511 1677591 1690799 1703961 1716982 1729391 1740534
46745 1740534 1750370 1759758 1769667 1780071 1789805 1797553 1802889 1806349 1808743 1810590 1812143 1813653 1815410 1817605
46731 1817605 1820229 1823079 1825801 1828044 1829768 1831398 1833565 1836621 1840472 1844936 1850148 1856448 1863899 1872062
46717 1872062 1880300 1888154 1895321 1901425 1906004 1908695 1909279 1907619 1903744 1898002 1890879 1882542 1872727 1861151
46703 1861151 1847882 1833211 1817324 1800191 1781673 1761700 1740543 1718973 1697816 1677163 1656334
46692 1656334 1634923 1613591 1593392 1574500 1556150 1537823 1519929 1503195 1487865 1473760 1460705
46681 1460705 1448501 1436792 1425378 1414545 1404717 1395872 1387662 1380063 1373534 1368411 1364399 1360858 1357401
46668 1357401 1354132 1351493 1350069 1350392 1352679 1356693 1362040 1368611 1376651 1386328 1397407 1409399 1421880
46655 1421880 1434524 1446952 1458781 1469766 1479725 1488378 1495546 1501505 1506774 1511358 1514414 1514923 1512657
46642 1512657 1508427 1503604 1499501 1496846 1495514 1494902 1494889 1496246 1499843 1505754 1513625 1523726 1536918 1553491
46628 1553491 1572619 1593193 1614654 1636697 1658673 1679842 1699888 1718665 1735551 1749557 1760069
46617 1760069 1767048 1770486 1770096 1765739 1757827 1746991 1733461 1717059 1697867 1676709 1654835 1633143
46605 1633143 1611819 1590752 1570091 1550242 1531396 1513329 1495709 1478455 1461757 1445889 1431041
46594 1431041 1417216 1404223 1391940 1380538 1370313 1361319 1353313 1346032 1339224 1332482 1325389 1317971 1310629
46581 1310629 1303474 1296061 1288000 1279567 1271454 1264122 1257615 1251730 1246110 1240383 1234555 1229170 1224805 1221577
46567 1221577 1219311 1217968 1217586 1217987 1218855 1219937 1220923 1221392 1221289 1221246 1221907 1223072 1224007 1224520 1225156 1226306 1227752
46550 1227752 1229300 1231317 1234280 1238234 1242977 1248390 1254240 1260029 1265565 1271503 1278747 1287317 1296275 1304916
46536 1304916 1313676 1323640 1335409 1348709 1362933 1377671 1392715 1407958 1423583 1440182 1458327 1478034
46524 1478034 1498903 1520751 1543756 1567880 1592504 1616826 1640422 1663264 1685487 1707334 1728990
46513 1728990 1750057 1769461 1786280 1800507 1812661 1822925 1831209 1837827 1843334 1847674 1850227 1850929 1850678
46500 1850678 1850240 1849319 1847241 1844190 1841146 1838744 1836643 1834051 1830495 1826045 1821019 1815496 1808984 1800613
46486 1800613 1789815 1776830 1762448 1747324 1731563 1714796 1696506 1676379 1654505 1631229 1606771
46475 1606771 1581138 1554429 1527010 1499260 1471373 1443569 1416344 1390303 1365819 1343027 1322015
46464 1322015 1302854 1285629 1270562 1258007 1248082 1240511 1235076 1232129 1232312 1235779 1241941 1250002 1259487
46451 1259487 1270199 1281874 1294081 1306398 1318618 1330794 1343052 1355274 1366980 1377632 1387004
46440 1387004 1395157 1402111 1407677 1411692 1414217 1415423 1415364 1414030 1411641 1408720 1405761 1402884 1400039 1397547
46426 1397547 1396198 1396625 1398693 1401707 1405132 1408948 1413503 1419327 1427056 1437140 1449528 1463923 1480396
$$ [...]
##END NTUPLES=NMR SPECTRUM
##END=
