##TITLE=AC1759_VAR00031_9319955_LepgiUL7zF
##JCAMPDX= 6.0         $$ Bruker NMR JCAMP-DX V2.0
##DATA TYPE= NMR SPECTRUM
##DATA CLASS= NTUPLES
##ORIGIN= BRUKER
##OWNER= Administrator
$$ 1.72 TOPSPIN		Version 2.1
$$ 2015-08-12 01:20:04.554 -0700  Administrator@X
$$ Compression mode = diff/dup
##.OBSERVE FREQUENCY= 400.02188249412
##.OBSERVE NUCLEUS= ^1H
##.ACQUISITION MODE= SIMULTANEOUS (DQD)
##.ACQUISITION SCHEME= undefined
##.AVERAGES= 8
##.DIGITISER RES= 22
##SPECTROMETER/DATA SYSTEM= spect
##.PULSE SEQUENCE= zg30
##.SOLVENT NAME= COFFEE_meoh
##.SHIFT REFERENCE= INTERNAL, COFFEE_meoh, 1, 14.98509
##AUDIT TRAIL= $$ (NUMBER, WHEN, WHO, WHERE, PROCESS, VERSION, WHAT)
$$ ##TITLE= Audit trail, TOPSPIN		Version 2.1
$$ ##JCAMPDX= 5.01
$$ ##ORIGIN= Bruker BioSpin GmbH
$$ ##OWNER= Administrator
$$ $$ E:\/data/COFFEE/nmr/AC1759_VAR00031_9319955_LepgiUL7zF/10/pdata/1/auditp.txt
$$ ##AUDIT TRAIL=  $$ (NUMBER, WHEN, WHO, WHERE, PROCESS, VERSION, WHAT)
(   1,<2015-08-12 01:19:57.289 -0700>,<Administrator>,<X>,<go>,<TOPSPIN 2.1>,
      <created by zg
	started at 2015-08-12 01:18:50.882 -0700,
	POWCHK enabled, PULCHK disabled,
       configuration hash MD5:
       21 0F 79 D6 B3 7B B4 F6 88 20 88 DB 03 48 BD 9F
       data hash MD5: 64K
       EF C5 25 D3 9F 00 CF AF D3 59 B6 7E 3C 83 60 53>)
(   2,<2015-08-12 01:20:00.398 -0700>,<Administrator>,<X>,<proc1d>,<TOPSPIN 2.1>,
      <Start of raw data processing
       efp LB = 0 FT_mod = 6 PKNL = 1 PHC0 = 0 PHC1 = 0 SI = 32K 
       data hash MD5: 32K
       AD 0A 02 0C 23 32 E5 8A D5 CD 8F 17 76 92 2E 85>)
(   3,<2015-08-12 01:20:00.695 -0700>,<Administrator>,<X>,<proc1d>,<TOPSPIN 2.1>,
      <pk PHC0 = 85.81421 PHC1 = 0 
       data hash MD5: 32K
       6D CA 08 41 73 8F 84 0A 1E 01 B1 19 3C 09 47 4B>)
(   4,<2015-08-12 01:20:00.804 -0700>,<Administrator>,<X>,<proc1d>,<TOPSPIN 2.1>,
      <abs ABSG = 1 
       data hash MD5: 32K
       ED 06 EF F1 B5 05 FF 93 B7 10 1E CD 06 28 92 15>)
(   5,<2015-08-12 01:20:00.882 -0700>,<Administrator>,<X>,<proc1d>,<TOPSPIN 2.1>,
      <abs ABSG = 2 
       data hash MD5: 32K
       CD B7 1E 2C 85 1E D5 31 8F AA 54 A2 32 82 DD DB>)
(   6,<2015-08-12 01:20:00.945 -0700>,<Administrator>,<X>,<proc1d>,<TOPSPIN 2.1>,
      <abs ABSG = 3 
       data hash MD5: 32K
       0F 39 53 B9 6C A2 A3 65 6F EB 51 0C 7F CC EB D7>)
(   7,<2015-08-12 01:20:01.007 -0700>,<Administrator>,<X>,<proc1d>,<TOPSPIN 2.1>,
      <abs ABSG = 4 
       data hash MD5: 32K
       4C 90 53 2E B7 3B C1 88 BA 02 E9 43 67 10 5E A6>)
(   8,<2015-08-12 01:20:01.070 -0700>,<Administrator>,<X>,<proc1d>,<TOPSPIN 2.1>,
      <abs ABSG = 5 
       data hash MD5: 32K
       A8 10 A5 99 43 E5 5F 7E 41 4E 19 8D 2F A8 F1 18>)
$$ ##END=
$$ 
$$ $$ hash MD5
$$ $$ 27 7F B2 92 4B 84 1F 21 21 32 E2 F8 D3 16 7D 78
##$RELAX= 
##$RELAX= 
##$RELAX= 
##$RELAX= 
##$RELAX= 
##$RELAX= 
##$RELAX= 
$$ Bruker specific parameters
$$ --------------------------
##$DU= <E:\>
##$EXPNO= 10
##$NAME= <AC1759_VAR00031_9319955_LepgiUL7zF>
$$ [...]
##$TP= (0..7)
150 150 150 150 150 150 150 150
##$TP07= 0
##$TPNAME0= <>
##$TPNAME1= <>
##$TPNAME2= <>
##$TPNAME3= <>
##$TPNAME4= <>
##$TPNAME5= <>
##$TPNAME6= <>
##$TPNAME7= <>
##$TPOAL= (0..7)
0.5 0.5 0.5 0.5 0.5 0.5 0.5 0.5
##$TPOFFS= (0..7)
0 0 0 0 0 0 0 0
##$TUNHIN= 0
##$TUNHOUT= 0
##$TUNXOUT= 0
##$USERA1= <user>
##$USERA2= <user>
##$USERA3= <user>
##$USERA4= <user>
##$USERA5= <user>
##$V9= 5
##$VALIST= <valist>
##$VCLIST= <CCCCCCCCCCCCCCC>
##$VD= 0
##$VDLIST= <DDDDDDDDDDDDDDD>
##$VPLIST= <PPPPPPPPPPPPPPP>
##$VTLIST= <TTTTTTTTTTTTTTT>
##$WBST= 2048
##$WBSW= 25
##$XGAIN= (0..3)
0 0 0 0
##$XL= 0
##$YL= 0
##$YMAX_a= 586505
##$YMIN_a= -520208
##$ZGOPTNS= <>
##$ZL1= 120
##$ZL2= 120
##$ZL3= 120
##$ZL4= 120
##$ABSF1= 14.98509
##$ABSF2= -5.573092
##$ABSG= 5
##$ABSL= 3
##$ALPHA= 0
##$AQORDER= 0
##$ASSFAC= 0
##$ASSFACI= 0
##$ASSFACX= 0
##$ASSWID= 0
##$AUNMP= <proc_prof1d_extract_pilot.lims>
##$AXLEFT= 0
##$AXNAME= <>
##$AXNUC= <1H>
##$AXRIGHT= 0
##$AXTYPE= 0
##$AXUNIT= <>
##$AZFE= 0.1
##$AZFW= 0.1
##$BCFW= 0
##$BC_mod= 0
##$BYTORDP= 0
##$COROFFS= 0
##$CY= 15
##$DATMOD= 1
##$DC= 0
##$DFILT= <>
##$DTYPP= 0
##$F1P= 0
##$F2P= 0
##$FCOR= 0.5
##$FTSIZE= 32768
##$FT_mod= 6
##$GAMMA= 0
##$GB= 0
##$INTBC= 1
##$INTSCL= 1
##$ISEN= 128
##$LB= 0
##$LEV0= 0
##$LPBIN= 0
##$MAXI= 10000
##$MC2= 0
##$MEAN= 0
##$ME_mod= 0
##$MI= 0
##$NCOEF= 0
##$NC_proc= -8
##$NLEV= 6
##$NOISF1= 0
##$NOISF2= 0
##$NSP= 0
##$NTH_PI= 0
##$NZP= 0
##$OFFSET= 14.98509
##$PC= 1
##$PHC0= 85.81421
##$PHC1= 0
##$PH_mod= 1
##$PKNL= yes
##$PPARMOD= 0
##$PPDIAG= 0
##$PPIPTYP= 0
##$PPMPNUM= 2147483647
##$PPRESOL= 1
##$PSCAL= 4
##$PSIGN= 0
##$PYNMP= <proc.py>
##$REVERSE= no
##$SF= 400.02
##$SI= 32768
##$SIGF1= 0
##$SIGF2= 0
##$SINO= 400
##$SIOLD= 32768
##$SPECTYP= <>
##$SREGLST= <1H.CDCl3>
##$SSB= 0
##$STSI= 32768
##$STSR= 0
##$SW_p= 8223.68421052631
##$SYMM= 0
##$S_DEV= 0
##$TDeff= 65536
##$TDoff= 0
##$TI= <>
##$TILT= no
##$TM1= 0
##$TM2= 0
##$TOPLEV= 0
##$USERP1= <user>
##$USERP2= <user>
##$USERP3= <user>
##$USERP4= <user>
##$USERP5= <user>
##$WDW= 1
##$XDIM= 32768
##$YMAX_p= 452682439
##$YMIN_p= -730026
##$CURPLOT= <Network HP LaserJet P1505>
##$CURPRIN= <$Network HP LaserJet P1505>
##$DFORMAT= <normdp>
##$LAYOUT= <+/1D_H.xwp>
##$LFORMAT= <normlp>
##$PFORMAT= <normpl>
##$SURQMSG= 1
$$ End of Bruker specific parameters
$$ ---------------------------------
##NTUPLES= NMR SPECTRUM
##VAR_NAME=  FREQUENCY,     SPECTRUM/REAL,   SPECTRUM/IMAG
##SYMBOL=    X,             R,               I
##VAR_TYPE=  INDEPENDENT,   DEPENDENT,       DEPENDENT
##VAR_FORM=  AFFN,          ASDF,            ASDF
##VAR_DIM=   32768,         32768,           32768
##UNITS=     HZ,            ARBITRARY UNITS, ARBITRARY UNITS
##FACTOR=    0.250966925370066, 1,           1
##FIRST=     8223.43324360094, -86922,       4045
##LAST=      0,             -2866,           -181683
##MIN=       0,             -730026,         0
##MAX=       8223.43324360094, 452682439,    0
$$ Real data points
##PAGE= N=1
##DATA TABLE= (X++(R..R)), XYDATA
$$ [...]
$$ plain form
19562 156414 64444 -204193 65164 178870 -257684 192868 -132076 241191 -7416 4322 9893
19551 9893 19401 -10931 -27126 -60938 -262297 -234761 54328 -49538 -46440 178066 -131376 -238834
19539 -238834 -356651 -380279 -216096 -125066 -172434 -75582 23268 -189848 -207272 113681 -411506
19527 96653 156140 49686 -352783 -38587 175413 99807 134102 -213041 42013 190444 -52561
19515 231057 89946 -150197 -420482 -269447 286538 -83854 -123044 168695 -394625 -404373
19505 -404373 457874 -342357 -262194 2171 -65538 207904 -147588 -116890 -230500 -54772 -115239
19494 -115239 30345 -296460 172202 -12256 13155 29933 167778 -256609 98073 193478 -169952
19482 -376714 -35235 79669 -83581 20605 -72140 -162839 -28803 301833 -114555 -8753 293295
$$ packed form
19562A56414F4444b04193F5164J13706b57684A92868a32076B41191g416D322N571
19551I893R508a0931j6195l3812k01359K7536E4328d9538L098A78066a31376j07458
19539b38834j17817k3628J64183R1030m7368g5582B3268a89848j7424A13681d11506
19527I6653N9487D9686c52783c8587A75413p5606L4295b13041D2013J48431e2561
19515B31057H9946a50197k70285J51035B86538h3854l9190A68695c94625r748
19505d04373D57874c42357Q0163B171f5538B07904a47588L0698j13610e4772o0467
19494a15239C0345b96460A72202a2256A3155J6778J37845b56609I8073R5405a69952
19482c76714c5235G9669h3581B0605g2140r0699b8803C01833a14555h753B93295
$$ plain form
19470 68924 -18288 -198405 -228010 243970 -368953 -210770 184227 -297834 -242692 -97533
19459 30736 -60005 239041 -175566 -124113 -125273 -205890 -29456 44804 -295700 137058 -153510
19447 -136353 -303266 -359879 262745 -354016 -113801 -152966 -166054 -281427 61866 32656
19437 32656 79421 -24082 78371 -244091 26180 22621 12447 -95679 92001 284546 273455
19426 273455 198261 -90598 244241 465720 -169578 -173471 -280934 764 173795 -27868 242480
19414 2184 -76890 -19506 355168 -87337 -110808 289732 -223515 126082 -133760 -28453 233040
19402 -41973 138673 -70335 -206479 -79957 -23117 -505619 -239059 -270855 159648 -28241 -155740
19391 -155740 13424 214207 -207888 86141 -76351 -64966 -221653 -316916 19690 -271768 187629
$$ packed form
19470F8924a8288j80117k9605B43970c68953J58183A84227b97834N5142i7533
19459C0736f0005B39041a75566N1453j160q0617b9456D4804b95700A37058a53510
19447a36353j66913n6613B62745c54016a13801l9165j3088j15373F1866k9210
19437C2656M6765b4082G8371b44091B6180l559j0174i5679I2001J92545j1091
19426B73455p5194i0598B44241K21479a69578l893j07463G64J73031b7868B42480
19414B184g6890a9506C55168h7337k3471B89732b23515A26082a33760b8453B33040
19402d1973A38673g0335j36144g9957b3117m82502b39059l1796A59648b8241j27499
19391a55740A3424K00783b07888H6141g6351J1385j56687r5263A9690b71768A87629
$$ plain form
19379 -145548 -154036 153691 -148903 -327456 -286500 41031 -431361 -137195 75035 236790
19369 236790 -319211 -232993 71991 -47622 -88977 240436 -22474 -182493 -62119 -201131 -132417
19358 -132417 96730 148094 20308 -36570 -134703 -139336 -52993 -157317 -73057 79659 -64509
19346 -118060 33866 157031 -134436 129837 -160496 230036 -41610 -272724 46920 -161811
19335 75067 -184511 -535398 -133492 -110170 -237744 -413567 -297386 -206292 312593 -151969
19324 -179849 89807 -73161 15986 20139 -244950 -137953 153710 59991 -118467 151695 177799
19313 177799 40439 -99378 -202917 28752 1342 -137981 161008 -220491 57174 -250727 -337717
19302 -337717 -8976 -208575 139562 -79900 -4403 117518 14612 -267908 47466 -80377 -57399
$$ packed form
19379a45548q488A53691a48903j78553M0956D1031d31361a37195G5035J61755
19369B36790c19211Q6218G1991d7622m1355B40436b2474j60019f2119j39012O8714
19358a32417I6730N1364B0308c6570r8133m633e2993j04324g3057G9659f4509
19346a18060C3866J23165a34436A29837a60496B30036d1610k31114D6920a61811
19335G5067a84511l50887a33492K3322j27574j75823J16181R1094C12593a51969
19324a79849H9807g3161A5986M153b44950J06997A53710E9991a18467A51695K6104
19313A77799D0439i9378j03539B8752A342a37981A61008b20491E7174b50727q6990
19302c37717h976j99599A39562g9900d403A17518A4612b67908D7466h0377K2978
$$ plain form
19291 -57399 154882 79238 275127 -247420 -54128 -265800 167185 -382740 147862 12266
19280 340608 -48433 -221917 43148 28580 152746 -221752 23000 -14719 9666 229774 -314638
19268 75893 -94649 -148480 -164674 -231587 -149718 -109390 192330 70746 -17899 -10525 -74777 94708
19255 -192259 35360 278550 -138877 -69631 215967 -162843 47261 -419668 -98215 -184449
19245 -184449 51783 -18165 106935 -206036 -88380 -41822 -5404 -44825 -179422 -101512 -231133
19234 -231133 -198173 -166901 -71444 33935 42231 -92738 -203540 -39840 -326411 231122 298384
19223 298384 -81848 -186563 -286692 -14600 -8488 -256535 29553 145288 121305 -67919 -252276
19212 -252276 -22451 -183053 -32103 -37301 -24186 206591 190144 -8602 11566 -218482 -34445
$$ packed form
19291e7399A54882p5644J95889b47420e4128k11672A67185c82740A47862A2266
19280C40608d8433j73484D3148j4568J24166b21752B3000a4719I666K20108c14638
19268G5893i4649n3831j6194o6913Q1869M0328A92330G0746a7899P374o4252I4708
19255a92259C5360K43190a38877O9246B15967a62843D7261d19668i8215q6234
19245a84449E1783a8165A06935b06036h8380d1822e404l9421j34597P7910j29621
19234b31133L2960L1272g1444C3935Q296i2738j10802c9840k86571B31122O7262
19223B98384h1848j04715j00129a4600O112k48047B9553J15735k3983f7919j84357
19212b52276b2451j60602c2103n198J3115B06591j6447h602A1566b18482c4445
$$ plain form
19200 244700 -407093 -178934 -301743 -40799 79145 190312 -299926 -89026 -222233 217732
19189 156859 13972 -200482 64794 -58356 -62940 -142004 103887 26910 63640 89237 354537
19178 354537 -190703 260952 -218790 -58269 -38102 -224483 -241673 231354 -72087 -74456 -246509
19167 -246509 -154516 -102236 -144372 -42292 -110177 -25980 -142984 -40932 -350797 67544 219151
19156 219151 -68049 115554 -291285 -382955 -34850 -237115 -181610 -33603 -62393 -267454 -32208
19144 -123475 20115 46852 -34385 363674 -61362 -212195 14470 58391 85886 129180 68713
19133 68713 30592 135563 64973 58042 -123675 15393 -8744 -211645 18286 156939 -255315
19121 -12354 -58468 -16052 -52368 -271359 -73188 -344649 -128077 36467 42631 73870 30015
$$ packed form
19200B44700d07093a78934j22809d0799G9145J11167b99926h9026j33207B17732
19189A56859A3972b00482F4794e8356m584p9064A03887B6910L6730K5597K65300
19178C54537a90703B60952b18790e8269K0167j86381j7190B31354g2087k369j72053
19167b46509R1993N2280m2136d2292o7885b5980j17004d0932l09865F7544J51607
19156B19151f8049A15554b91285r1670c4850k02265N5505c3603k8790k05061c2208
19144a23475B0115K6737c4385C63674f1362j50833A4470M3921K7495M3294o0467
19133F8713C0592J04971F4973o931a23675A5393h744k02901A8286J38653b55315
19121a2354m6114a6052l6316k18991g3188k71461a28077C6467O164L1239C0015
$$ plain form
19109 -320918 124401 25982 -80416 53182 -71891 187385 -89891 31822 -217045 72076 -61591
19097 -72349 103511 42055 259740 -307891 229845 55629 10936 -222047 -284103 -351828 -339769
19086 -339769 774 -422746 125474 -92841 -66966 -104405 -304455 -42091 -54558 -2893 -40242
19075 -40242 158036 -36487 92615 287 154549 -360449 -235202 -475768 260903 -54630 -393389
19064 -393389 116837 -252765 110688 92449 85070 354392 26892 -30339 -250394 -272404 -75817
19052 103674 187526 -79894 22930 -39090 132628 -148280 -117145 -87534 -42525 -151336 -155267
19041 -155267 -45083 97661 76106 200450 -322788 162295 -103411 92187 15462 59142 -36826
19029 -38277 221496 -40171 48014 84967 -58562 254329 110577 -26767 -255192 -252399 144221
$$ packed form
19109c20918A24401B5982h0416E3182g1891A87385h9891C1822b17045G2076f1591
19097g2349A03511D2055K17685c07891B29845E5629A0936b22047o2056o7725J2059
19086c39769G74d22746A25474i2841K5875l7439k00050d2091j2467b893l7349
19075d0242A58036c6487I2615B87J54262c60449J25247k40566B60903e4630l38759
19064c93389A16837b52765A10688j8239p379K69322B6892c0339k20055k2010g5817
19052A03674Q3852g9894B2930c9090A32628a48280L1135K9611d2525j08811l931
19041a55267d5083I7661k1555J24344c22788A62295a03411I2187A5462M3680c6826
19029c8277B21496d0171D8014L6953e8562B54329A10577b6767k28425K793A44221
$$ plain form
19017 -128991 47582 150194 -338680 -200100 -108047 34740 12779 230548 -341356 -164514
19006 136536 -338930 -217068 126600 -187483 153394 61614 254593 -162023 243538 -322411
18995 -63396 -163459 -166392 16151 -284270 274471 -212055 -113611 58872 -88946 -253917 -62695
18983 -443588 -274565 -175744 398639 102911 -13152 930 -141006 48654 -239005 247290 -97629
18971 -11719 -223418 64425 58227 -261499 -155872 -4863 -140 149938 218976 308946 21132 11867
18959 11867 -215651 172883 98213 -157789 -211140 180380 13630 -232520 -210316 -7096 -11192
18948 -11192 -124994 -245075 -1861 -140356 209590 -89109 -183928 -123305 -163576 279211 -65220
18936 80898 140514 58045 -120369 -358397 -114267 338527 -581209 19747 416961 301707
$$ packed form
19017a28991D7582J02612c38680J38580R2053C4740A2779K17769c41356a64514
19006A36536c38930J21862A26600a87483A53394F1614J92979a62023B43538c22411
18995f3396j00063k933A6151b84270B74471b12055R8444E8872h8946j64971f2695
18983d43588J69023R8821C98639A02911a3152I30a41006D8654b39005B47290i7629
18971a1719k11699F4425o198b61499J05627d863a40A49938O9038Q9970B1132r265
18959A1867b15651A72883p4670a57789n3351A80380A3630b32520K2204g096m096
18948a1192j13802j20081a861j38495B09590h9109r4819O0623m0271B79211f5220
18936H0898N9616E8045a20369k38028a14267C38527e81209A9747L97214j15254
$$ plain form
18926 301707 91812 8318 -289087 99571 24020 4718 -259878 -217476 -8397 369020 -164664
18914 -36764 -108212 141558 18308 107987 66425 -372763 -8898 90195 -71062 -151406 274409
18902 44786 -53278 -273298 -404678 307214 23200 295912 -114343 -133693 -22124 -145581
18892 -145581 154213 11027 142945 -125545 -35829 100185 -54145 -278029 -125037 -123192
18882 -123192 67814 -78313 -109567 183468 151398 -52239 -193714 135344 -170879 -135573 298277
18870 -228781 -126220 -212810 20248 -205494 -6395 180136 11867 -30869 -72072 -300618 210421
18858 -82458 -48254 85293 -65318 59921 -361618 -258366 137809 7869 -30933 16965 -47661
18846 -168384 71195 -212565 51878 34089 -92146 25320 -58140 260847 -34427 -108264 -451
$$ packed form
18926C01707I1812H318b89087I9571B4020D718b59878M2402h397C69020a64664
18914c6764p1448A41558A8308Q9679m1562c72763h898I0195g1062q0344B74409
18902D4786e3278k20020j31380C07214B3200K72712a14343j9350b2124j23457
18892a45581A54213A1027J31918a25545c5829A00185e4145k23884a25037J845
18882a23192F7814g8313l1254A83468l2070e2239j41475A35344a70879L5306B98277
18870b28781J02561q6590B0248b05494f395A80136A1867c0869m1203k28546B10421
18858h2458L4204H5293f5318E9921c61618J03252A37809G869c0933A6965d7661
18846a68384G1195b12565E1878j7789i2146B5320e8140B60847c4427p3837d51
$$ plain form
18834 -29998 214122 -208208 211693 79298 52303 -35578 -377475 134535 -58775 55555 -17026
18822 -333455 73422 -14310 92376 -77802 -17186 121933 97312 129296 -171052 128213 188143
18811 188143 54685 126747 297030 -77316 180959 -183040 85488 -11990 -75696 102644 -136521
18799 -65217 -57048 53260 -181208 17357 -231831 -133687 36017 -212174 138583 2556 127849
18788 127849 57779 -387545 -46657 -207391 -119371 -18929 -258929 201311 -33177 61875 -78487
18776 -222812 21796 -301965 -521150 -58662 20679 50499 -252027 -88594 -348157 -60874 -82810
18765 -82810 -56982 -94176 57323 26473 -32368 13565 221094 319776 189061 -243820 239815
18753 23159 -108734 252288 -133093 52149 -120817 -212627 206178 13943 -297901 -25743
$$ packed form
18834b9998B14122b08208B11693G9298k6995c5578l41897A34535e8775E5555a7026
18822c33455G3422a4310I2376g7802a7186A21933k4621L1984a71052A28213N9930
18811A88143E4685P2062J70283g7316A80959a83040H5488a1990o3706A02644a36521
18799f5217Q169E3260a81208A7357b31831R8144C6017b12174A38583B556J25293
18788A27849E7779c87545d6657j60734Q8020a8929k40000B01311c3177F1875g8487
18776b22812B1796c01965k19185e8662B0679K9820b52027h8594k59563f0874k1936
18765h2810K5828l7194E7323B6473c2368A3565K07529R8682j30715b43820B39815
18753B3159a08734B52288a33093E2149a20817r1810B06178A3943b97901b5743
$$ plain form
18742 -40030 -7162 91923 -130879 160158 -314331 -88531 -449088 -204484 -105144 -282197 2469
18730 15033 -18210 -193356 88596 -242316 -80203 -26204 -143341 -219499 401788 -278187 60252
18718 -119082 -24266 38655 -78105 -73968 -138298 -474004 -100078 -185607 72936 -24760 201967
18706 -226941 -289086 -100752 99583 26509 -82592 195955 7452 -144602 -103070 -150196 -104679
18695 -104679 -90002 73593 -233519 177193 43400 111774 -211672 54333 324670 -87549 -181519
18684 -181519 255698 -106971 34441 -139557 351051 -13857 -156204 91 90204 -355003 -75923
18672 -395146 99820 107641 -89999 178625 -52469 -177638 -141824 -100488 56673 -95259 -15877
18660 107921 -18177 -72997 -326163 -257580 244862 -220009 -209099 -322159 -93569 -110761 159539
$$ packed form
18742d0030g162I1923a30879A60158c14331h8531l60557b04484R9340j77053B469
18730A5033a8210j75146H8596b42316h0203b6204j17137p6158D01788b78187F0252
18718a19082b4266C8655g8105M137o4330l35706a00078q5529G2936b4760B01967
18706b26941o2145a00752I9583B6509h2592A95955G452a44602M1532m7126M5517
18695a04679J4677G3593b33519A77193D3400O8374b11672E4333K70337h7549r3970
18684a81519B55698a06971C4441a39557C51051a3857j42347I1R0113c55003g5923
18672c95146I9820P821h9999A78625e2469j25169L5814M1336E6673i5259a5877
18660A07921a8177n4820k53166O8583B44862b20009J0910j13060i3569j7192A59539
$$ plain form
18648 -53818 -148477 -131597 -67083 -23330 -288987 -137601 83877 -57063 -9076 6379 -79042 247240
18635 260186 124175 224979 -40207 299519 -214216 -13290 -177574 -224533 -42364 -83745
18625 -83745 40129 -188800 -233035 504983 -314525 90526 -3050 -18890 -81870 245991 -227622
18613 -99234 72715 -16709 23967 314929 125931 -216415 -43124 -172955 -200983 53276 55079
18602 55079 132367 152444 -211665 -233641 95350 -177729 100503 34680 21334 139226 197828
18591 197828 61133 -159647 -99472 -211344 13337 -258133 -170232 71853 -136442 -405097
18581 -405097 -20540 -118937 216772 146681 -283958 62698 -181973 -132806 -62379 -119394 -160579
18570 -160579 -7891 -8539 -252407 138744 137845 -155631 -84783 244681 -231571 372841 -281821
$$ packed form
18648e3818r4659J6880O4514b3330k65657a37601H3877e7063i076F379g9042B47240
18635B60186A24175J00804d0207B99519b14216a3290j64284m6959d2364m1381
18625h3745D0129a88800m4235E04983c14525I0526c050j5840o2980B45991b27622
18613i9234G2715a6709B3967K90962A25931b16415d3124j29831k8028E3276J803
18602E5079P7288K0077b11665k1976I5350a77729A00503C4680j3346J17892N8602
18591A97828F1133a59647O0175j11872A3337b58133Q7901G1853a36442k68655
18581d05097b0540r8397B16772p0091b83958F2698a81973M9167f2379n7015m1185
18570a60579g891o48k43868A38744q99a55631P0848B44681b31571C72841b81821
$$ plain form
18558 -100177 -32171 -84433 26495 -185779 74073 -279378 -143200 -91143 -385562 167920
18547 152543 245380 2141 -99320 -160180 110767 -36352 178175 -117083 -103984 -369970 -106848
18535 -218482 54009 -48590 192194 100424 168807 61717 82484 -73242 -211729 -415441 -71136
18523 12900 -69480 -110002 320585 -329477 -54722 55944 135960 -291030 86643 137360 29516
18511 -215609 69993 41276 83487 -70355 144224 -223198 131411 140348 7186 -177643 -276238
18500 -276238 -359090 -201143 -158433 -25348 -58266 -7985 -286351 -318621 55399 74731 -147695
18488 67593 79656 -102312 -163044 -132663 -178615 -114183 -124856 36573 -151526 127176 -225185
18476 -83297 -43699 160361 6003 -34690 -100803 4358 -141525 -28840 100324 -149548 -350409
$$ packed form
18558a00177c2171n2262B6495a85779G4073b79378J36178N2057k94419A67920
18547A52543R2837B141i9320o0860A10767c6352A78175a17083J3099k65986a06848
18535b18482E4009d8590A92194r1770O8383F1717K0767g3242j38487k03712g1136
18523A2900f9480m0522C20585c29477e4722E5944Q0016b91030H6643N0717B9516
18511b15609F9993k8717M2211g0355A44224b23198A31411Q937G186a77643r8595
18500b76238q2852J57947M2710b5348l2918g985k78366l2270E5399J9332a47695
18488F7593J2063a02312o0732L0381m5952O4432j0673C6573a51526A27176b25185
18476h3297L9598A60361F003c4690o6113D358a41525b8840A00324a49548k00861
$$ plain form
18465 -350409 69492 17448 18509 15684 -161851 66279 -170010 -278303 -156485 -289936 -12767
18453 -303437 6236 -4802 -190848 -248185 -9219 -84015 118631 -194012 176052 -250972 -310414
18442 -310414 14503 210734 214453 16119 -45327 -103788 147708 48680 114259 130520 -8390
18430 127839 168610 -104777 -134901 -120830 34686 -123 -50499 150352 139553 15365 182356
18419 182356 -197165 -436163 -221529 -314011 -226357 -193554 12725 -272953 65345 -99441 -243335
18408 -243335 198685 -68855 -137432 64754 146683 -198295 188325 -59145 12914 44866 44604
18397 44604 215121 175757 46544 -23252 29990 -34479 -84704 89879 -9914 42289 53907 -46087
18384 -92116 -151854 119782 37230 287070 58781 337122 13544 -110308 211404 -232261
$$ packed form
18465c50409F9492A7448J061k825a61851F6279a70010j08293J21818j33451a2767
18453c03437F236d802j86046n7337i219p4796A18631a94012A76052b50972n9442
18442c10414A4503J96231L719A6119d5327n8461A47708D8680O5579J6261h390
18430A27839M0771a04777l0124J4071C4686a23n0376A50352j0799A5365J66991
18419A82356a97165k38998K14634r2482Q7654L2803A2725b72953F5345i9441j43894
18408b43335A98685f8855o8577F4754Q1929a98295A88325e9145A2914L1952k62
18397D4604J70517l9364D6544b3252B9990c4479n0225H9879i914D2289J1618d6087
18384i2116n9738A19782C7230K49840E8781K78341A3544a10308B11404b32261
$$ plain form
18373 -119616 -146571 -234303 25976 -83834 -38365 19452 205234 -87905 8502 119285 -108784
18361 41207 -131581 -100261 329604 -76033 -45912 -157039 22575 60973 -157641 301922 52430
18349 72004 -90024 169554 -9804 -40069 -41900 80401 348934 68410 61339 -198568 81774 168926
18337 168926 -16464 87654 -228008 -15162 24844 211113 -70260 79361 -7458 -79097 -133638
18326 -133638 7927 173819 14031 -111533 -56559 64781 -33562 -362756 -88501 12532 -18061
18314 -473209 -91478 306893 -121897 146599 70086 26527 -143050 132188 -84325 169396
18303 -221193 -28091 5210 15249 -144210 62596 87406 206180 -189139 -130281 -1639 -100156
18292 -100156 -172469 95198 94745 65739 -36918 -138927 81565 206412 -422982 -231324 76679
$$ packed form
18373a19616k6955q7732B5976h3834c8365A9452J85782h7905H502J10783a08784
18361D1207a31581L1320C29604g6033L0121j11127B2575L8398a57641C01922E2430
18349G2004i0024A69554i804l0265j831H0401K68533F8410p071a98568H1774Q7152
18337A68926a6464H7654b28008a5162B4844J86269g0260G9361g458p1639n4541
18326a33638G927J65892A4031a11533N4974F4781c3562l29194h8501A2532a8061
18314d73209i1478C06893a21897A46599G0086B6527a43050A32188h4325A69396
18303b21193b8091E210J0039a44210F2596K4810J18774a89139N8858a639r8517
18292a00156p2313I5198m53k9006c6918j02009H1565J24847d22982J91658G6679
$$ plain form
18280 -53267 -118146 71677 87438 -200351 -94276 240356 -402331 -118922 27279 -220242 185166
18268 -130591 20247 79134 78083 -62411 34412 -371515 219718 -17775 57848 421009 -145904
18256 -404574 130119 -70015 -259429 -119556 96426 -57549 -68327 22829 96122 -96679 123415
18244 -29510 -272209 -21466 -203705 124106 -77085 -260647 -129579 37757 62584 157945 29832
18232 -128495 -245783 -154507 14515 292042 34062 -102494 190194 -222104 132021 -71196
18221 -34333 -184626 -146568 64068 -164526 -182951 144547 112793 -17305 105526 -75750 -179022
18210 -179022 179484 210193 -22672 94422 114771 7785 156876 139317 -111022 -61058 -65201
18199 -65201 48280 -384194 -50461 125369 -136558 -40652 -241296 -283906 161897 169168 -227799
$$ packed form
18280e3267o4879G1677J5761b00351i4276B40356d02331a18922B7279b20242A85166
18268a30591B0247N8887j051f2411C4412c71515B19718a7775E7848L63161a45904
18256d04574A30119g0015j89414a19556I6426e7549j0778B2829P3293i6679A23415
18244b9510k42699b1466j82239A24106g7085j83562a29579C7757K4827R5361B9832
18232a28495j17288R1276A4515K77527C4062a02494A90194b22104A32021g1196
18221c4333j50293L8058F4068a64526j8425A44547l1754a7305A05526g5750j03272
18210a79022A79484L0709b2672I4422K0349G785J49091j7559a11022M9964m143
18199f5201D8280c84194e0461A25369a36558d0652k00644m2610A61897P271b27799
$$ plain form
18187 -120008 -68889 -6510 -290916 -91544 -137716 115952 -92718 101548 496414 -208714 -32944
18175 -36101 -395944 -14316 176571 -83437 -1210 310725 -153359 -379556 -112062 -376357
18165 -376357 -19883 163348 -215305 98912 -111793 54715 -123229 -56039 53605 -238560
18154 -7131 238575 -181531 -33765 -152098 -140120 -120174 -83662 120296 -318705 -261175 -41623
18142 24928 -196335 -289271 -191366 -367906 -137102 -200662 5754 102589 -229023 -6414 -52828
18131 -52828 -74368 -233601 -177652 -128465 -98399 -110118 137312 7634 -17538 -253915 31936
18119 -185303 -200056 -105828 -45922 -83013 -136409 -31306 -100744 335872 -166017 -126085 -206605
18108 -206605 16975 -131481 205149 90742 22796 191743 13024 164807 27786 -122703
$$ packed form
18187a20008N1119f510k84406i1544m6172A15952i2718A01548L94866b08714c2944
18175c6101l59843a4316A76571h3437a210C10725a53359k26197a12062k64295
18165c76357a9883A63348b15305I8912a11793E4715a23229e6039E3605b38560
18154g131B38575a81531c3765j18333J1978J9946L6512A20296c18705N7530d1623
18142B4928a96335r2936R7905j76540a37102o3560E754R6835b29023f414m6414
18131e2828k1540j59233N5949M9187L0066j1719A37312G634a7538k36377C1936
18119a85303j4753R4228d5922l7091n3396c1306o9438C35872a66017L9932q0520
18108b06605A6975a31481B05149I0742B2796J68947A3024J51783B7786a22703
$$ plain form
18097 -42177 -235747 -73650 251103 -183565 161333 -21101 237119 203194 336378 22740
18086 -277417 -16945 69771 166289 129757 -217352 -168787 -8838 277732 222775 -105955 -61978
18075 -61978 -39702 -35170 -86006 197965 -117283 224643 -354866 -216775 -5459 -178612 104386
18063 -335694 92488 -85597 -201207 26435 -122106 158467 137237 -145634 18210 25882 164737
18052 164737 -137559 -217503 -64798 129377 -23557 -204718 -262804 456072 -156072 -72962
18041 -348291 -107721 194930 -90047 -13689 140869 -210593 -98404 337798 335491 -20103 -16927
18030 -16927 -65286 -79124 18545 265739 -164268 -391475 129296 -290045 48582 201034
18020 201034 -84368 171247 95435 -194052 -51087 264275 -231893 96437 -179013 166870
$$ packed form
18097d2177j93570g3650B51103a83565A61333b1101B37119l3925J33184B2740
18086b77417a6945F9771R6518l6532b17352M8565h838B77732n4957a05955M3977
18075f1978K2276M532n0836A97965a17283B24643c54866J38091e459j73153A04386
18063c35694I2488h5597j15610B6435a22106A58467k1230a45634A8210P672J38855
18052A64737a37559p9944f4798A29377b3557j81161n8086D56072a56072g2962
18041c48291a07721A94930i0047a3689A40869b10593i8404C37798k307b0103L176
18030a6927m8359j3838A8545K47194a64268k27207A29296b90045D8582J52452
18020B01034h4368A71247p5812a94052e1087B64275b31893I6437a79013A66870
$$ plain form
18009 -58842 -35849 62401 12952 158580 -7476 31071 56979 -198096 272432 -83100 44941
17997 -318642 -81982 184220 65973 -8879 -235196 230573 135063 -187182 -76891 -147711 107651
17985 -8384 -118830 84092 86817 39084 274779 23047 234115 -165888 -27474 -246812 -69664
17973 45041 244370 203558 96100 38059 127106 236283 -140276 -130267 39657 102468 375151
17962 375151 92922 -352618 86454 -111766 -98008 174960 -256758 83994 10427 -200957
17951 -153228 143108 77530 24468 215737 45703 107820 152405 -198147 -58864 -68322 -11069
17939 -7910 113971 36626 -211866 200844 147513 -82656 77008 -49197 281061 -312125 36226
17927 -2847 -34461 -2520 -70420 25247 -3883 47613 -166345 -419336 186956 25986 158190
$$ packed form
18009e8842K2993F2401A2952J45628g476C1071K5908a98096B72432h3100D4941
17997c18642h1982A84220F5973h879k26317B30573r5510a87182g6891p0820A07651
17985h384j10446H4092K725C9084K35695B3047K11068a65888b7474k19338f9664
17973D5041J99329m0812I6100C8059Q9047J09177a40276J0009C9657O2811K72683
17962C75151I2922c52618H6454a11766J3758A74960b56758H3994A0427b00957
17951a53228A43108o5578B4468J91269D5703O2117M4585a98147e8864r458a1069
17939g910A13971C6626b11866B00844n3331h2656G7008d9197B81061c12125C6226
17927b847l1614b520o7900B5247c883D7613a66345k52991A86956B5986J32204
$$ plain form
17916 158190 -61012 -400499 163276 346590 103360 45966 65484 106428 -66972 -4881 235065
17904 -122311 -368083 -186924 -9761 -85482 -18832 -232504 38915 118878 -114790 -102712 172553
17892 73531 325597 128008 -450747 167393 -33544 -304941 74923 -2363 47510 102899 30092
17880 -172615 -432773 -91927 167807 329363 -192060 -34572 -207930 -70133 -110654 -46239
17869 -158237 -215891 -38019 8901 -113221 191985 -76262 38913 -15742 -82504 301243 285418
17858 285418 -95336 81642 107624 -163817 18270 52343 -62016 49614 -118723 -282250 -82080
17846 147050 -202551 151507 -23012 -47653 45250 -126471 -203734 249912 -2841 -94498 58727
17834 172145 66355 57119 151590 -151317 -143727 -22702 334353 -36439 37286 44613 -243939
$$ packed form
17916A58190f1012l39487A63276J83314A03360D5966J9518M0944f6972d881B35065
17904a22311k45772J81159i761p5721a8832k13672C8915P9963a14790J2078A72553
17892G3531K52066A28008d50747A67393c3544k71397G4923b363D7510N5389C0092
17880a72615k60158i1927A67807J61556a92060c4572j73358g0133m0521d6239
17869a58237n7654c8019H901a13221A91985g6262C8913a5742o6762C01243j5825
17858B85418i5336H1642K5982a63817A8270L4073f2016D9614a18723j63527h2080
17846A47050b02551A51507b3012k4641D5250a26471p7263B49912b841r1657E8727
17834A72145F6355r236R4471a51317P590b2702C34353c6439C7286P327b43939
$$ plain form
17822 144689 50438 172715 34286 -232375 -130252 -99679 247372 50704 238695 80308
17811 91158 67351 132 -11443 131423 -277612 258268 116366 -126377 318348 68827 -72496
17799 51802 -27136 195043 336561 30331 -45356 17437 259604 27729 -106541 -251464 25708
17787 210694 -66367 -35927 40302 -93490 14935 -33856 -515342 70383 -96347 168280 130859
17776 130859 125083 81269 162364 127395 64364 66440 -24187 150081 -3940 -51974 11856 227029
17764 227029 165189 -31235 72431 -20698 -30855 137210 -260343 256839 -160405 -527825
17754 -527825 -230232 18330 79773 -5563 -320611 -336195 -19333 246351 150433 -105081 -78537
17743 -78537 159231 15161 51933 -97473 -25025 -137556 149917 178257 76688 -167070 340890
$$ packed form
17822A44689E0438J22277C4286b32375J02123L0573B47372E0704J87991H0308
17811I1158k3807A32a1443A31423b77612B58268A16366a26377C18348F8827g2496
17799E1802b7136A95043J41518C0331d5356A7437K42167B7729a06541j44923B5708
17787B10694f6367L0440D0302i3490A4935c3856m81486G0383i6347A68280l7421
17776A30859n776m3814Q1095l4969o3031K076b4187A50081c940m8034A1856K15173
17764B27029o1840c1235G2431b0698j0157A37210b60343B56839a60405l67420
17754e27825b30232A8330O1443e563l15048j5584a9333B46351r5918a05081K6544
17743g8537A59231A5161L6772i7473b5025j12531A49917K8340G6688a67070C40890
$$ plain form
17731 -74012 -81010 -106996 -330727 20123 -175774 85039 32747 124295 80785 -98614 115642
17719 -183541 138940 7211 173051 -172808 84743 242130 47364 24416 10595 59973 114508
17708 114508 -272947 320681 -73163 6617 113956 386551 37454 18386 -1830 -36089 -194268
17697 -194268 186851 -16994 268812 17666 181267 -142129 163191 -9943 -63533 -122931 267950
17685 -25247 -19165 11359 -115548 -246408 -401898 251868 -18889 162043 -188589 -177286 -186956
17674 -186956 38040 -2135 30181 -10825 57966 26010 6642 -59809 82262 113767 78013 -42955
17661 -310639 240506 -73349 -161333 59680 264308 -279650 6246 -11226 71597 -1675 -231943
17650 -231943 14483 23595 -34967 -163868 235583 -38536 157979 99810 253224 68429 -140294
$$ packed form
17731g4012o998k5986k23731B0123a75774H5039C2747R1548m3510i8614A15642
17719a83541A38940G211J65840a72808H4743J57387D7364k2948A0595M9378N4535
17708A14508b72947C20681g3163F617J07339K72595C7454A8386a830l4259j58179
17697a94268A86851a6994B68812A7666J63601a42129A63191i943n3590n9398B67950
17685b5247O082A1359a15548j30860j55490B51868a8889A62043a88589J1303r670
17674a86956C8040b135C0181a0825E7966B6010F642e9809H2262L1505l5754d2955
17661c10639B40506g3349q7984E9680K04628b79650F246a1226G1597a675k30268
17650b31943A4483R112c4967j28901B35583c8536A57979n8169J53414F8429a40294
$$ plain form
17638 -73113 42666 -26567 66757 40790 19204 -217182 61486 -17275 -256560 -78806 -14992
17626 -156977 63501 30589 -17408 37919 90199 80155 212046 -36691 63870 93837 224024
17615 224024 3416 141012 123454 217582 122183 107896 -289031 117729 75441 -231995 190391
17603 91549 -206591 132327 195415 -62478 -80772 131113 -146425 -400134 110425 160131
17593 160131 -155922 75060 -67386 325920 40296 -139199 -70156 219273 294953 149660
17583 149660 317724 249271 -55674 14481 -15452 -144921 -118139 -24512 -102078 111001 178617
17572 178617 93594 -84408 100265 -186894 25731 256074 -143206 -76153 -24766 81740 -6907
17560 3672 -68538 293530 30051 242834 299002 426881 -148971 -239876 104011 -146677 162926
$$ packed form
17638g3113D2666b6567F6757k5967A9204b17182F1486a7275k39285g8806a4992
17626a56977F3501C0589a7408C7919N2280j0044J31891c6691F3870K9967J30187
17615B24024C416J37596j7558R4128r5399j4287b89031A17729m2288b31995A90391
17603I1549b06591A32327O3088f2478j8294A31113a46425k53709A10425M9706
17593A60131a55922G5060f7386C25920D0296a39199O9043B19273P5680j45293
17583A49660J68064o8453e5674A4481a5452j29469K6782b4512p7566A11001O7616
17572A78617q5023h4408A00265a86894B5731K30343a43206O7053b4766H1740f907
17560C672f8538B93530C0051K12783N6168J27879a48971r0905A04011a46677A62926
$$ plain form
17548 245439 9539 63145 268000 -136399 -121416 -163114 -304758 -211683 69194 74347 221422
17537 221422 -38696 7114 -181190 -34730 564718 -106303 623211 65021 260074 -79512 298216
17525 145387 113292 -8223 215621 -115331 57022 125263 221942 273181 69516 136520 338148
17514 338148 -130067 12670 107188 170851 -19632 -101901 286114 381062 -69744 89066 112470
17503 112470 206398 102911 367089 198178 209554 200405 209564 -112637 -15518 158682 192250
17492 192250 385308 139193 286884 123309 256316 92136 121044 281590 -29013 -9145
17481 -279687 348739 362874 -107853 14624 103554 130425 127378 330699 301401 340438 167375
17469 67534 -184874 -25485 -166682 142280 54901 525726 172380 70958 -27259 -13470 201631
$$ packed form
17548B45439I539N3606K04855a36399J4983m1698j41644R3075F9194N153J47075
17537B21422c8696G114a81190c4730E64718a06303F23211F5021J95053g9512B98216
17525A45387l2095h223B15621a15331E7022O8241R6679N1239F9516O7004K01628
17514C38148a30067A2670R4518O3663a9632q2269B86114R4948f9744H9066K3404
17503A12470R3928A02911K64178j68911J1376r149R159a12637a5518A58682L3568
17492A92250J93058A39193J47691A23309J33007I2136K8908J60546b9013i145
17481b79687C48739J4135a07853A4624Q8930K6871l047K03321k9298L9037A67375
17469F7534a84874b5485j41197A42280E4901M70825A72380G0958b7259a3470B01631
$$ plain form
17457 264143 80655 287463 238843 55622 564053 403393 418211 153699 200407 250291 258388
17446 258388 329621 319950 40107 -48490 62161 -90281 226329 -17666 2565 108578 336957
17435 336957 239011 500437 344710 355439 291455 380728 252661 10079 459368 224987
17424 432485 355880 301765 380593 402505 409174 394845 394044 416495 -55598 508070 27426 57926
17412 57926 278118 198875 88095 239153 447805 -113443 66694 -130296 -44716 61066 -18934
17400 153867 173812 451714 22542 50594 336562 -72232 317567 -6158 -156730 74473 -50901
17388 69929 -9841 186399 142507 92210 294372 159481 -124924 141887 -102699 93429 126436
17377 126436 -105349 -256563 57219 163812 -77161 167436 523316 249090 62094 -17820
$$ packed form
17457B64143H0655K06808m8620E5622N08431j60660J4818A53699M6708M9884Q097
17446B58388P1233r671D0107d8490F2161i0281B26329a7666B565J06013K28379
17435C36957r7946K61426j55727J0729o3984Q9273j28067A0079M49289B24987
17424D32485p6605n4115P8828K1912O669j4329q01K2451e5598E08070B7426L0500
17412E7926K20192p9243H8095J51058K08652a13443F6694a30296d4716F1066a8934
17400A53867J9945K77902B2542K8052K85968g2232C17567f158j50572G4473e0901
17388F9929i841A86399m3892n0297K02162j34891a24924A41887a02699I3429L3007
17377A26436a05349j51214E7219J06593g7161A67436L55880B49090F2094a7820
$$ plain form
17366 315702 170581 59512 270340 -32756 145795 208991 65337 151063 292562 448099
17356 448099 -207773 -146618 315345 107152 174139 204961 445652 252665 117704 39122
17345 315563 257232 345445 20162 146161 -115298 443081 -131760 368035 25561 -30723
17334 305533 -59876 135550 42781 -303263 94697 137122 131331 391912 -39472 -127315 -35115
17322 261989 345638 326108 288887 332707 88304 -59771 520039 -207373 289911 292685 32158
17310 243116 373411 170648 59720 80252 96673 67948 526774 211721 161295 28379 25018
17299 25018 46283 183797 272500 214067 133583 472103 365428 348651 321295 80130 83505
17288 83505 124658 216331 17781 231673 70268 329659 273170 114927 6907 231678 243565
$$ packed form
17366C15702j45121E9512K10828c2756A45795O3196F5337Q5726J41499J55537
17356D48099b07773O1155C15345A07152O6987L0822K40691j92987A17704C9122
17345C15563n8331Q8213B0162J25999a15298D43081a31760C68035B5561c0723
17334C05533e9876A35550D2781c03263I4697M2425n791K60581c9472q7843c5115
17322B61989Q3649j9530l7221M3820H8304e9771E20039b07373B89911K774C2158
17310B43116J30295A70648E9720K0532J6421k8725M58826B11721n0426B8379l361
17299B5018K1265J37514Q8703n8433q0484L38520j06675j6777k7356H0130L375
17288H3505M1153R1673A7781K13892G0268K59391n6489A14927F907K24771J1887
$$ plain form
17277 243565 230020 159238 570706 285951 448551 160426 -183674 102328 -95412 303690
17266 153598 102202 134879 142251 188042 -139812 399488 393064 59491 348407 -60482 97355
17254 186411 7362 344968 194739 313026 320988 180499 166653 240371 339381 250126 156134
17243 156134 274813 479804 435754 246232 208793 254914 229060 248893 129938 -31370 28956
17231 460427 99894 -213207 99207 266539 474451 -243375 358994 -75596 376040 123003
17220 -97185 128000 -133812 181838 65745 183958 340885 111504 176945 155946 229337
17210 229337 553399 365111 291366 262298 265765 -108448 112046 306359 60706 345843
17200 345843 124914 272616 264540 78577 285727 32708 423623 286260 283880 489055 512986
$$ packed form
17277B43565j3545p0782M11468k84755J62600A60426a83674A02328i5412C03690
17266A53598n1396L2677P372M5791a39812C99488o424E9491K88916f0482I7355
17254A86411G362L37606j50229J18287P962j40489j3846P3718R9010q9255r3992
17243A56134J18679K04991m4050j89522l7439M6121k5854J9833j18955c1370B8956
17231D60427I9894b13207I9207J67332K07912b43375C58994g5596C76040A23003
17220i7185A28000a33812A81838F5745J18213J56927A11504O5441k0999P3391
17210B29337L24062j88288p3745k9068L467a08448A12046J94313F0706K85137
17200C45843A24914J47702q076G8577K07150C2708L90915j37363k380K05175K3931
$$ plain form
17189 512986 -50341 60163 4337 355833 274317 393027 332881 60590 8259 42892 113226
17178 113226 233733 98992 406313 531147 37373 220402 468673 55729 -77537 443465
17167 98871 292634 377060 45992 529029 343699 487932 380695 97324 377770 70642
17156 -271468 294360 439981 439409 603345 334086 492465 316023 264712 250475 766356
17146 766356 15053 235171 553590 753425 205234 538224 324502 229761 208588 110559
17136 110559 232440 369422 306473 133436 291427 330646 275451 155703 126131 314398
17126 314398 231037 580832 215180 286102 -64662 363050 95964 297283 158799 395297
17116 395297 160071 334962 339813 187952 318103 424520 472234 313954 295735 460610
$$ packed form
17189E12986e0341F0163D337L51496q1516J18710o0146F0590H259L4633P0334
17178A13226J20507I8992L07321J24834C7373J83029K48271E5729g7537D43465
17167I8871J93763Q4426D5992M83037j85330J44233j07237I7324K80446G0642
17156b71468B94360J45621n72J63936k69259J58379j76442n1311j4237N15881
17146G66356A5053K20118L18419J99835B05234L32990k13722r4741k1173r8029
17136A10559J21881J36982o2949A33436J57991L9219n5195j19748k9572J88267
17126C14398q3361L49795B15180P0922f4662C63050I5964K01319j38484K36498
17116C95297A60071J74891M851j51861J30151J06417M7714j58280j8219J64875
$$ plain form
17106 460610 192339 713066 447493 619203 699460 400978 295202 523207 155164 603780
17096 603780 550338 448605 230103 287912 252099 285096 344675 592887 219032 98210 513005
17085 513005 768643 361783 535512 343154 229721 120319 433202 314807 662785 344645
17075 344645 537510 429207 454448 502386 561110 603038 473539 631812 449971 107918
17064 141564 357332 405304 218242 568196 504673 587695 310451 629325 530381 535422 604405
17053 604405 528580 483363 736544 261726 558324 555183 409115 637518 372707 442773
17043 442773 245898 389564 458976 695722 788507 207078 538508 520896 494910 960189
17033 960189 744726 589813 704239 792647 585324 723657 490325 657311 533119 705592
$$ packed form
17106D60610A92339N20727k65573J71710Q0257k98482j05776K28005A55164M48616
17096F03780n3442j01733k18502N7809l5813L2997N9579K48212B19032I8210M14795
17085E13005K55638C61783J73729j92358j13433j09402L12883j18395L47978l18140
17075C44645J92865j08303K5241M7938N8724M1928j29499J58273j81841A07918
17064A41564K15768M7972j87062L49954o3523Q3022k77244L18874r8944N041O8983
17053F04405p5825m5217K53181B61726K96598l141j46068K28403k64811P0066
17043D42773j96875J43666O9412K36746R2785B07078L31430j7612k5986M65279
17033I60189k15463j54913J14426Q8408k07323J38333k33332J66986j24192J72473
$$ plain form
17023 705592 513518 578241 723106 532301 657768 810134 538031 735907 902778 548677
17013 548677 874213 796945 927501 697739 913776 708515 977439 635129 905718 728557
17003 728557 703424 669662 708809 628341 648314 891268 896267 755934 994975 792555 894173
16992 894173 695948 907393 826705 878548 839603 831204 523842 881490 957252 845238 822563
16981 822563 1072498 784665 873532 633150 807444 709478 734367 942268 877046 881427 686478
16970 686478 569109 936440 828980 996756 854312 1097792 873436 925512 833799 1409422
16960 1409422 749281 820211 980404 1073731 785192 791239 901117 1034173 886778 1184276
16950 1184276 1085394 932674 755592 820404 939924 1098766 1399881 1254373 1057300 1225499
$$ packed form
17023G05592j92074O4723J44865j90805J25467J52366k72103J97876J66871l54101
17013E48677L25536p7268J30556k29762K16037k05261K68924l42310K70589j77161
17003G28557k5133l3762L9147q0468J9973K42954M999j40333K39041k02420J01618
16992H94173j98225K11445q0688N1843l8945q399l07362L57648P5762j12014k2675
16981H22563K49935k87833Q8867k40382J74294r7966K4889K07901o5222M381j94949
16970F86478j17369L67331j07460J67776j42444K43480k24356N2076r1713N75623
16960A409422o60141P0930J60193R3327k88539O047J09878J33056j47395K97498
16950A184276r8882j52720j77082O4812J19520J58842L01115j45508j97073J68199
$$ plain form
16940 1225499 1349265 1245703 1503057 1093734 1101114 1298690 1045594 1331543 1050765 1600799
16930 1600799 1091236 1157525 1171963 1514732 1168533 1408060 1429918 1352707 1580113 1476216
16920 1476216 1692286 1474194 1565581 1591353 1586400 1374866 1501337 1731406 1573498 1536031
16910 1536031 1384146 1657144 1543122 1546228 1516417 1833765 1391330 1708306 1543871 1685638
16900 1685638 1670202 1862676 1736115 1833362 1971933 1946663 1802724 2192338 1848639 2136062
16890 2136062 1922512 2029992 1848252 1815806 2275770 1932428 2100385 2233971 2377565 2308026
16880 2308026 2261637 2255938 2424836 2307772 2287753 2576460 2407432 2294426 2241888 2299720
16870 2299720 2553432 2635049 2747396 2681137 2581144 2508499 2497722 2827007 3056067 2739627
$$ packed form
16940A225499J23766j03562K57354m09323P380J97576k53096K85949k80778N50034
16930A600799n09563O6289J4438L42769l46199K39527K1858p7211K27406j03897
16920A476216K16070k18092R1387K5772m953k11534J26471K30069j57908l7467
16910A536031j51885K72998j14022L106k9811L17348m42435L16976j64435J41767
16900A685638j5436J92474j26561R7247J38571k5270j43939L89614l43699K87423
16890B136062k13550J07480j81740l2446M59964l43342J67957J33586J43594o9539
16880B308026m6389n699J68898j17064k0019K88707j69028j13006n2538N7832
16870B299720K53712Q1617J12347o6259r9993p2645j0777L29285K29060l16440
$$ plain form
16860 2739627 2729897 2900126 2975461 2923057 3284551 2963785 2903501 3030754 3215412 3053400
16850 3053400 3633044 3563987 3366454 3418110 3551148 3320122 3760041 3587778 3730393 3956878
16840 3956878 3944656 3551735 4136527 4093688 4393994 4397255 4141023 3904494 4421887 4143605
16830 4143605 4522593 4507584 4597806 5093373 4964360 4956796 5197307 5530532 5460410 5367868
16820 5367868 5698174 5496701 5821994 5876341 5933503 5829491 5865355 6229787 6302650 7008777
16810 7008777 6575934 6807471 6974001 7398237 7150135 7728682 7844808 7783564 8089777 7963970
16800 7963970 8578826 9128484 8992197 9289023 9099696 9441209 9808680 9919378 10228967
16791 10228967 10728827 10723994 11052933 11382887 11710774 12007040 12568986 12933615 13219970 13853585
$$ packed form
16860B739627r730J70229P5335n2404L61494l20766o0284J27253J84658j62012
16850C053400N79644o9057j97533N1656J33038k31026M39919j72263J42615K26485
16840C956878j2222l92921N84792m2839L00306L261k56232k36529N17393k78282
16830D143605L78988j5009R0222M95567j29013p564K40511L33225p0122r2542
16820E367868L30306k01473L25293N4347N7162j04012L5864L64432P2863P06127
16810G008777m32843K31537J66530M24236k48102N78547J16126o1244L06213j25807
16800G963970O14856N49658j36287K96826j89327L41513L67471J10698L09589
16791A0228967M99860m833L28939L29954L27887K96266N61946L64629K86355O33615
$$ plain form
16781 13853585 14064579 14445923 14923558 15578326 15747097 16571371 16686226 17293702 17848056
16772 17848056 18769160 19394803 20025202 20588858 21444071 22079151 23271190 23956967 25100601
16763 25100601 26034215 26744824 28003581 29133088 30602375 31683334 33258104 34836731
16755 34836731 36125143 38027534 39531639 41547137 43392179 45977079 48243903 50760513
16747 50760513 53694838 56333654 59330743 62145475 66402362 70214912 73987157 78405675
16739 78405675 82764965 88085128 93155269 98962987 104376998 111002471 117239047 124278471
16731 124278471 130944009 138331554 145450002 152731325 159933889 166360817 172237907 177770076
16723 177770076 181989436 185381987 187260789 187969787 187407168 185683490 182178608 177972300
$$ packed form
16781A3853585K10994L81344M77635O54768J68771Q24274J14855O07476N54354
16772A7848056R21104O25643O30399N63656Q55213O35080J192039O85777J143634
16763B5100601R33614P10609J258757J129507J469287J080959J574770J578627
16755C4836731J288412J902391J504105K015498J845042K584900K266824K516610
16747E0760513K934325K638816K997089K814732M256887L812550L772245M418518
16739G8405675M359290N320163N070141N807718N414011O625473O236576P039424
16731A24278471O665538P387545P118448P281323P202564O426928N877090N532169
16723A77770076M219360L392551J878802P08998n62619j723678l504882m206308
$$ plain form
16715 177972300 172615939 166272872 159470307 152631212 144910592 137269243 130105544 122369892
16707 122369892 115055683 108274190 101707192 95538355 89854681 84222335 79301611 74436823
16699 74436823 70091634 65792479 62095467 58588830 55339162 51993330 49355645 46960141
16691 46960141 44287952 41697724 39636480 38124807 35656929 34208246 32255229 31132731
16683 31132731 29308207 28073114 26830355 26105571 24599673 23633634 22544988 21426644
16675 21426644 20870608 19735667 19263777 18743777 17603665 17084127 16317078 15985282 15205548
16666 15205548 14884832 14118229 13701003 13437146 13041371 12256197 12216008 11865628 11142119
16657 11142119 11222511 10527661 10126510 10247929 9885367 9594668 9576657 8965631 8474519 8559440
$$ packed form
16715A77972300n356361o343067o802565o839095p720620p641349p163699p735652
16707A22369892p314209o781493o566998o168837n683674n632346m920724m864788
16699G4436823m345189m299155l697012l506637l249668l345832k637685k395504
16691D6960141k672189k590228k061244j511673k467878j448683j953017j122498
16683C1132731j824524j235093j242759p24784j505898r66039j088646j118344
16675B1426644n56036j134941m71890n20000j140112n19538p67049l31796p79734
16666A5205548l20716p66603m17226k63857l95775p85174m0189l50380p23509
16657A1142119Q0392o94850m01151J21419l62562k90699j8011o11026m91112Q4921
$$ plain form
16647 8559440 8310395 8059891 7610646 7731350 7176922 7014756 6903756 6856629 6858036 6228188
16637 6228188 6472081 5829944 6370990 6024600 5446196 5627511 5499559 5640217 5408684
16628 5408684 5142050 4948807 4980419 4806025 5005277 4733191 4575233 4583653 4348526 4411638
16618 4411638 4325405 4084359 4378358 3812754 3611513 3612764 3700579 3673502 3648629 3666520 3193221
16607 3193221 3435299 3003897 3357723 3336593 2835152 3102682 2978006 2870443 2814909 2997091
16597 2997091 2725734 2454348 2554251 2823419 2644343 2611139 2190007 2343269 2381533 2423814
16587 2423814 2214721 2286059 2034266 2336359 2357348 1839266 1915508 2058354 1838704 2119478
16577 2119478 2095576 2117210 2178571 2223970 1988678 1849275 2044242 1710279 1784666 1888862
$$ packed form
16647H559440k49045k50504m49245J20704n54428j62166j11000m7127J407o29848
16637F228188K43893o42137N41046l46390n78404J81315j27952J40658k31533
16628E408684k66634j93243L1612j74394J99252k72086j57958Q420k35127O3112
16618D411638q6233k41046K93999n65604k01241J251Q7815k7077k4873J7891m73299
16607C193221K42078m31402L53826k1130n01441K67530j24676j07563n5534J82182
16597B997091k71357k71386R9903K69168j79076l3204m21132J53262L8264M2281
16587B423814k09093P1338k51793L02093K0989n18082P6242J42846k19650K80774
16577B119478k3902K1634O1361M5399k35292j39403J94967l33963P4387J04196
$$ plain form
16567 1888862 1685647 1794372 1758465 1690402 1199021 1684291 1292335 1736142 1642438 1520909
16557 1520909 1567379 1649037 1275235 1309402 1390742 1142351 1290858 1411759 1120296 1294281
16547 1294281 1135079 1587681 1242341 1235144 1220468 1250203 1051265 1489094 953120 1086384
16537 1086384 1088258 1242717 851914 1231156 1419846 1188661 922949 1362412 1289275 1094154
16527 1094154 1116650 1026679 929197 922133 1010926 938756 979534 946209 963468 792587 1006246
16516 1006246 1099327 627445 957817 1010554 1192826 1064212 708721 867041 885091 731196
16506 731196 759759 771193 936078 649816 727516 889357 613321 745488 705042 511984
16496 511984 830629 819416 723435 626254 621342 651658 799338 518251 1035883 323277 466411
$$ packed form
16567A888862k03215J08725l5907o8063m91381M85270l91956M43807r3704j21529
16557A520909M6470Q1658l73802L4167Q1340k48391J48507J20901k91463J73985
16547A294281j59202M52602l45340p197j4676K9735j98938M37829n35974J33264
16537A086384J874J54459l90803L79242J88690k31185k65712M39463p3137j95121
16527A094154K2496q9971r7482p064Q8793p2170M0778l3325J7259j70881K13659
16516A006246R3081m71882L30372N2737J82272j28614l55491J58320J8050j53895
16506G31196K8563J1434J64885k86262P7700J61841k76036J32167m0446j93058
16496E11984L18645j1213r5981r7181m912L0316J47680k81087N17632C23277J43134
$$ plain form
16485 466411 610659 555246 722451 689929 276608 378333 402141 467023 704407 354179
16475 354179 707892 305253 457867 542305 822466 944024 700280 323400 351774 434739
16465 434739 526760 283157 358898 405707 622144 403110 525797 317737 383285 488635
16455 488635 111209 712682 679582 168025 246685 282926 484544 501491 408270 497994 200272
16443 524518 135321 607917 215336 502778 329065 767862 380178 458849 258259 476488
16433 476488 498326 40574 192605 385177 609357 286310 458731 269526 495592 526361
16423 526361 281165 471321 205258 497769 223542 467838 539769 198879 422590 146960
16412 412208 444643 121540 390330 -41222 530129 355240 390898 378408 318241 55738 -148177
$$ packed form
16485D66411J44248n5413J67205l2522B76608J01725K3808O4882K37384l50228
16475C54179L53713C05253J52614Q4438K80161J21558k43744C23400K8374Q2965
16465D34739R2021k43603P5741M6809K16437k19034J22687k08060O5548J05350
16455D88635A11209O01473l3100A68025P8660L6241K01618J6947r3221Q9724B00272
16443E24518A35321M72596B15336K87442j73713M38797C80178P8671k00590K18229
16433D76488K1838D0574J52031J92572K24180B86310J72421j89205K26066L0769
16423E26361k45196J90156B05258K92511B23542K44296P1931A98879K23711A46960
16412D12208L2435A21540K68790d1222E30129j74889L5658j2490o0167E5738a48177
$$ plain form
16400 547739 164076 319401 514875 163506 23677 268939 387100 680951 245702 331434
16390 331434 529938 -72305 521531 244373 276727 326868 -15620 178900 616481 496849
16380 496849 547259 177236 266231 101349 324462 80231 322315 405556 183798 288652
16370 288652 242494 253135 377462 145235 53275 460854 132160 79160 261387 12476
16359 -31676 189169 207514 502980 174811 321471 218792 364131 355011 -137796 126194
16348 124560 -24288 321749 17150 650132 248928 232356 35523 223075 122080 -59384
16337 227919 -17733 -20575 187557 152678 229869 278949 255537 151003 -10502 208802 149796
16326 149796 219468 80737 -231666 -11784 160169 323785 264596 72969 -163424 390052
$$ packed form
16400E47739A64076J55325J95474A63506B3677K45262J18161K93851B45702Q5732
16390C31434J98504g2305E21531B44373L2354N0141a5620A78900M37581j19632
16380D96849N0410A77236Q8995A01349K23113H0231K42084Q3241A83798J04854
16370B88652m6158J0641J24327A45235E3275M07579A32160n3000J82227A2476
16359c1676A89169J8345K95466A74811J46660j02679J45339r120a37796A26194
16348A24560b4288C21749A7150O32982B48928j6572C5523J87552j00995e9384
16337B27919a7733k842A87557l4879P7191M9080k3412j04534a0502B08802n9006
16326A49796O9672H0737b31666a1784A60169J63616n9189G2969a63424C90052
$$ plain form
16315 50487 260982 141346 -59020 85003 353797 29424 -2839 306010 271808 110616 92154
16304 92154 528856 76093 53259 360060 154021 312872 105511 21390 267275 -145697
16293 18623 118363 354881 -188666 34471 58656 52744 194323 -157252 -122842 30486 -100228
16281 -14337 45574 18260 15892 106254 130404 -11345 198060 268991 -14547 128077 325656
16270 325656 160561 -219110 -47453 -111792 239414 29238 257827 -33579 -255947 381671
16259 171784 126769 73877 202888 110929 179117 118584 110165 168386 398309 3838 118401
16248 118401 197734 -42832 -45226 140555 93871 -453934 28197 29010 -183950 118323 146512
16237 146512 -291063 409667 61463 -127772 262422 283731 -93616 -30969 311338 244292
$$ packed form
16315E0487K10495j19636e9020H5003K68794B9424b839C06010l4202A10616j8462
16304I2154M36702G6093k2834L06801A54021J58851A05511B1390K45885a45697
16293A8623R9740K36518a88666C4471K4185n912J41579a57252L4410C0486a00228
16281a4337D5574A8260k368R0362K4150a1345A98060P0931a4547A28077J97579
16270C25656A60561b19110d7453o4339B39414B9238K28589c3579k22368C81671
16259A71784m5015n2892J29011r1959O8188o0533q419N8221K29923C838J14563
16248A18401P9333d2832k394A40555m6684d53934B8197Q13a83950A18323K8189
16237A46512b91063D09667F1463a27772B62422K1309i3616c0969C11338o7046
$$ plain form
16227 244292 256472 234383 89957 50203 16443 68293 71341 41748 50179 160863 -1598 97332
16214 -156073 373684 35858 143725 -222288 293568 202441 -8137 141296 -195752 -46493
16203 53727 -115337 -425677 64461 -4268 -40824 -123467 -7882 -196009 -67065 29976 -55538
16191 140300 807 -156042 215938 -156123 354069 43836 234067 73828 -84818 -57605 -140743
16180 -140743 317249 55679 -43523 35628 78222 15032 75778 -89337 87015 25655 -2860
16168 -141001 -268289 -72175 97582 -234264 65880 410794 115311 325350 345807 44919
16157 -319287 106552 120397 264647 -48908 -138500 40973 -273014 -28662 165562 -93903 -189794
16146 -189794 153947 11226 -26789 61865 146893 37646 135672 -233726 170952 -54017 52401
$$ packed form
16227B44292J2180k2089H9957l9754A6443N1850L048k9593Q431J10684a598I7332
16214a56073C73684C5858J07867b22288B93568r1127h137A41296a95752d6493
16203E3727a15337l10340F4461d268l6556q2643g882j88127f7065B9976e5538
16191A40300H07a56042B15938a56123C54069D3836J90231G3828h4818K7213q3138
16180a40743C17249E5679d3523C5628M2594A5032O0746h9337H7015B5655b860
16168a41001j27288g2175I7582b34264F5880L44914A15311K10039K0457D4919
16157c19287A06552J3845J44250d8908q9592D0973b73014b8662A65562i3903r5891
16146a89794A53947A1226b6789F1865Q5028C7646R8026b33726A70952e4017E2401
$$ plain form
16134 -155270 -27316 403364 88634 -16917 205981 -213175 153 92223 45039 -234494 -50382
16122 -129356 134941 -59334 -7528 -226885 3028 173232 -86217 1907 -26921 -34713 43556 -328698
16109 9240 -145065 -273520 -125132 4927 -151415 97248 -222903 321065 42569 19689 59131
16098 59131 237685 -59455 -29116 36709 -320800 225710 -174004 205420 -299988 -120007
16087 367567 -25434 -4026 -271878 115058 253928 176536 -255199 -171176 -214920 -237105 -166000
16076 -166000 -67542 -203591 -126983 2096 -81627 -125643 -1480 -225954 -154838 43451 107306
16065 107306 174033 147894 246492 83470 -198424 -121551 -223162 -46569 -122400 21272 153696
16054 153696 -150058 26287 262431 195228 8384 167074 -427168 32114 9111 -101416 -21818
$$ packed form
16134a55270b7316D03364H8634a6917B05981b13175A53R2070D5039b34494e0382
16122a29356A34941e9334g528k19357C028J70204h6217A907b6921p792D3556c28698
16109I240a45065j28455a25132D927a51415I7248b22903C21065D2569A9689L9442
16098E9131J78554e9455b9116C6709c20800B25710a74004B05420b99988a20007
16087C67567b5434d026k67852A15058J38870p7392b55199Q4023m3744k2185P1105
16076a66000f7542j36049P6608B096h1627m4016a480k24474P1116D3451O3855
16065A07306O6727k6139R8598H3470a98424P6873j01611d6569p5831B1272J32424
16054A53696a50058B6287K36144o7203H384J58690d27168C2114I111a01416b1818
$$ plain form
16042 -169505 -75894 -47842 -123988 239241 -143637 -74502 -67630 90439 -184001 66417 55399
16031 55399 187443 31401 335936 -285576 -165887 -90202 -74390 85014 -230656 98814 201915
16020 201915 -32440 -71896 -48477 -16320 -79138 192592 -178018 -90978 -253200 138624 -63911
16008 -113702 -11462 -20119 115837 169531 -58375 127292 65853 -107823 -38810 -228572 -83619
15996 -172067 61437 224745 -58853 -42437 -151498 268746 195627 -141558 -100672 -15010 183350
15984 100847 -152380 349432 401436 499089 208833 50476 -113762 -41669 -129900 -1418 102298
15972 -189755 -170049 117720 -45578 -142294 -24091 50715 -177184 173601 -226645 25741 -61124
15960 34066 -78231 -144423 138890 13944 -51489 -366798 2025 -190713 82417 -199876 -304346
$$ packed form
16042a69505g5894K8052p6146B39241a43637O9135O872I0439a84001F6417j1018
16031E5399J32044C1401L04535b85576J19689P5685J5812H5014b30656I8814J03101
16020B01915c2440l9456K3419a6320o2818A92592a78018Q7040j62222A38624f3911
16008a13702a1462q657A15837N3694e8375A27292o1439a07823c8810j89762h3619
15996a72067F1437J63308e8853J6416j09061B68746p3119a41558M0886a5010A83350
15984A00847a52380C49432N2004R7653B08833E0476a13762d1669q8231a418A02298
15972a89755J9706A17720d5578r6716b4091E0715a77184A73601b26645B5741f1124
15960C4066g8231o6192A38890A3944e1489l15309B025a90713H2417a99876j04470
$$ plain form
15949 -304346 -98174 -195790 -269734 -138973 118941 -48041 -67988 -101161 189134 84377 -448791
15937 -234291 -149104 37558 -352735 -85532 55472 -25151 54188 -41563 -65161 -344624 151870
15925 -238672 -396038 -324673 -293212 -125544 -99119 -509084 97158 -275657 -240813 -321930 -292216
15914 -292216 17591 -9463 -485025 -113969 32345 -5403 33439 58386 -93856 -211234 -14107
15902 -276778 176314 -83499 160854 -27503 29008 -308972 52615 -169539 -87106 212346
15891 -219437 259107 38481 113420 119814 156728 62101 148663 -171362 323522 106410 -9376
15879 205214 -24745 301075 -245433 78288 508064 95971 -309297 88930 371 106214 -185675
15867 -296810 -26396 73511 -148081 -323181 -52995 52 -217952 153987 -283053 -106469 37480
$$ packed form
15949c04346i8174r7616p3944J30761A18941d8041j9947l3173A89134H4377d48791
15937b34291Q5187C7558c52735h5532E5472b5151E4188d1563k3598k79463A51870
15925b38672j57366P1365L1461a25544K6425m09965I7158b75657L4844q1117K9714
15914b92216A7591i463m75562a13969C2345e403C3439K4947i3856j17378a4107
15902b76778A76314h3499A60854b7503B9008c08972E2615a69539Q2433B12346
15891b19437B59107C8481P4939O394L6914F2101Q6562a71362C23522A06410i376
15879B05214b4745C01075b45433G8288M29776I5971c09297H8930C71J05843a85675
15867b96810b6396G3511a48081j75100e2995E2b17952A53987b83053a06469C7480
$$ plain form
15855 96478 -94453 -361619 -43573 -139077 250921 -135998 15102 198326 -85997 -194031 -835
15843 187022 100726 -50362 119193 203719 166416 -140425 -55232 -316984 31013 189624 288070
15832 288070 -12559 -64903 180918 35092 -60828 222286 2934 -191805 4938 311124 -107881
15820 103448 469546 82773 -62870 -20709 115583 -204106 128971 287166 -158215 -51518
15809 -97734 -71861 -57641 -112745 -224813 122360 68713 299424 161031 6509 -197845 -56516
15797 -241678 175699 -34231 145493 -41582 -67299 344386 47067 -81133 -83685 -127460 -15143
15785 -102241 135370 -13716 -248314 115333 18535 -61143 -312607 -446044 126842 371521
15775 371521 -53728 -115774 23022 -99057 93103 177819 200942 -245319 -220027 -35944 336559
$$ packed form
15855I6478i4453k67166d3573r5504B50921a35998A5102J83224h5997j08034h35
15843A87022q6296e0362A19193Q4526l7303a40425e5232k61752C1013J58611R8446
15832B88070a2559n2344A80918C5092f0828B22286B934a91805D938L06186a07881
15820A03448L66098H2773f2870b0709A15583b04106A28971J58195a58215e1518
15809i7734K5873J4220n5104j12068A22360n3647K30711j38393F509a97845e6516
15797b41678A75699c4231A45493d1582k5717C44386D7067h1133k552m3775a5143
15785a02241A35370a3716k34598A15333A8535f1143k51464j33437A26842K44679
15775C71521e3728o2046B3022i9057I3103Q4716K3123b45319K5292c5944C36559
$$ plain form
15763 -41284 -64436 -38539 256434 88974 263567 155108 295550 153001 -378763 -457 66660
15751 -54814 -122510 139561 -45182 214073 132100 -295354 262235 259806 -127722 218157 228503
15740 228503 88436 176705 -218614 -143335 473737 47676 -84358 178787 -104178 194822
15729 -329686 -197419 -155648 21120 136346 -293906 -25290 -376286 250117 -299307 14534
15718 -211771 7366 -142272 -367848 -198181 -144089 61825 -9200 -18979 4626 37025 -313715
15706 -224354 108979 -151590 23048 -22328 -220582 -53056 -90098 187959 -232744 154686
15695 46275 113503 -115190 -222607 171322 106971 53286 -65231 117415 78899 -53246 -15259
15683 -423995 -198385 203797 233932 -154616 -171041 -14876 238653 -181873 258395 450860
$$ packed form
15763d1284k3152K5897B56434H8974J74593j08459J40442j42549c78763d57F6660
15751e4814o7696A39561d5182B14073q1973b95354B62235k429a27722B18157J0346
15740B28503H8436Q8269b18614P5279D73737D7676h4358A78787a04178A94822
15729c29686J32267M1771B1120J15226b93906b5290l50996B50117b99307A4534
15718b11771G366a42272k25576J69667N4092F1825i200r779D626L2399c13715
15706b24354A08979a51590B3048b2328j98254e3056l7042A87959b32744A54686
15695D6275O7228a15190j07417A71322o4351E3286f5231A17415l8516e3246a5259
15683d23995a98385B03797L0135a54616j6425a4876B38653a81873B58395J92465
$$ plain form
15673 450860 162394 258135 193005 276287 256064 231848 -67932 -64634 -398570 -57751 -98333
15662 -98333 -98662 -110733 -91131 57239 -311054 104440 -68760 -70344 374698 55484 -13587 -282676
15650 -282676 91575 -147903 -5840 -134846 350628 -144792 177328 56592 244437 258173
15640 258173 62441 -192439 -108131 -13033 269649 -1824 -283116 2117 -147194 70384 -72288
15628 190187 -130729 19817 202215 -121599 -116613 56666 -110818 40807 -71613 51434 80647
15617 80647 461103 -481297 229611 -29242 -100344 -95306 -48144 -60589 66998 338314 -350664
15605 -70453 79041 -118309 -31345 -240516 3015 -30154 -286361 107446 -102012 -311901 -216414
15594 -216414 -146797 -11914 -120247 35787 -21768 6694 122736 81950 108988 151404 58498
$$ packed form
15673D50860A62394R5741o5130Q3282k0223k4216f7932L298l33936e7751m0582
15662i8333l29j2071J9602E7239c11054A04440f8760j584C74698E5484a3587k69089
15650b82676I1575a47903e840j29006C50628a44792A77328E6592J87845J3736
15640B58173F2441a92439Q4308a3033B69649a824k81292B117a47194G0384g2288
15628A90187a30729A9817J82398a21599M986E6666a10818D0807g1613E1434K9213
15617H0647L80456d81297B29611b9242p1102N038M7162j2445F6998K71316c50664
15605g0453G9041a18309c1345k09171C015c0154k56207A07446a02012k09889R5487
15594b16414O9617a1914j08333C5787b1768F694J16042m0786K7038M2416E8498
$$ plain form
15582 -101439 204518 -122552 2917 272283 127792 -74583 -167963 -365402 -148806 -113205
15572 -113205 228575 68947 -62343 -130322 1307 -47367 -157579 -42057 188417 241510 -180238
15560 17099 -151327 187517 -128703 -34591 -446126 -35659 -119568 -278419 -190112 -135968 -44147
15548 4880 -191833 -118627 -10756 -85673 301914 61487 83336 52575 39033 277162 130550
15536 20967 -33493 72077 -74064 126389 -146661 -283167 -58711 286170 -81010 -198846 -239003
15525 -239003 -4359 -80751 -42337 -202146 199028 196676 234770 37697 -161243 68690 103102
15514 103102 -214729 55020 228340 -151301 -61264 162695 30723 104687 170504 11974 -173986
15502 167864 -43520 26037 -130936 -49052 307895 -293238 242670 327150 -167986 -253484
$$ packed form
15582a01439B04518a22552B917K69366A27792g4583r3380j97439a48806L5601
15572a13205B28575F8947f2343o7979A307d7367j10212d2057A88417N3093a80238
15560A7099a51327A87517a28703c4591m11535c5659q3909j58851Q8307N4144d4147
15548D880a91833P3206a0756p4917C01914F1487K1849l0761j3542K38129A30550
15536B0967c3493G2077g4064A26389a46661j36506e8711B86170h1010j17836m0157
15525b39003d359p6392L8414j59809A99028k352L8094C7697a61243F8690L4412
15514A03102b14729E5020J73320a51301f1264A62695C0723P3964O5817A1974a73986
15502A67864d3520B6037a30936d9052C07895b93238B42670Q4480a67986q5498
$$ plain form
15492 -253484 -47738 -102842 -7091 72729 89364 -131534 -87990 -52805 403284 188117 104022
15481 104022 -218081 29388 154419 -243282 -209675 -325426 134584 100663 540478 -143516
15470 97063 50863 -96196 -44386 -145655 -19703 74793 36136 -49764 -409241 314689 -45131
15458 -79838 22426 257776 -109941 59492 134072 -31079 209635 -208221 -73111 -143115 -244956
15447 -244956 -114396 28246 33879 178145 -111726 -69213 -154765 35845 316183 212684 389939
15436 389939 124314 25828 -11059 75344 -104763 -228065 -51540 -24484 40694 -75467 -142113
15425 -142113 -51860 -366711 90450 -39250 116375 -165193 -183551 -127601 269675 215146 -112006
15413 -22614 -109221 -16757 97632 283668 -59015 -142895 -76270 287308 289513 -97647 16108
$$ packed form
15492b53484d7738n5104g091G2729J6635a31534M3544L5185D03284A88117q4095
15481A04022b18081B9388J25031b43282L3607j15751A34584l3921M39815a43516
15470I7063m6200i6196d4386j01269a9703G4793C6136d9764l59477C14689d5131
15458g9838B2426K35350a09941E9492P4580c1079B09635b08221g3111p0004j01841
15447b44956a14396B8246N633J44266a11726M2513q5552C5845K80338j03499J77255
15436C89939A24314B5828a1059G5344a04763j23302e1540b4484D0694g5467o6646
15425a42113e1860l14851I0450c9250A16375a65193j8358N5950B69675n4529a12006
15413b2614q6607a6757I7632J86036e9015q3880O6625B87308K205i7647A6108
$$ plain form
15401 -49496 -135130 -239560 73567 -64341 -23288 -25560 -86364 -113446 -137363 222302 -13285
15389 103881 -230843 -31946 -215023 -43226 8608 -172472 -9717 90047 32542 -32271 78624
15377 159692 195583 -196124 -107427 -64131 269837 181631 -135712 433321 -44392 156318
15366 -132533 50708 -336138 -38179 -96169 163667 -103024 -337915 -94840 -24581 34356 -138575
15354 253836 -5469 138673 59767 -13991 86965 -234329 4444 -308300 -103950 46403 -213085
15342 -143564 232639 -74426 111757 -401596 -15956 -205477 -233802 205024 58834 179846
15332 179846 113474 -126308 243294 -207070 44499 48517 -93962 -413186 -122403 -46909 143609
15320 53549 29335 -148089 32560 52692 -76102 352666 271008 97445 349011 177759 -72142
$$ packed form
15401d9496q5634j04430G3567f4341b3288k272o0804k7082k3917B22302a3285
15389A03881b30843c1946j83077d3226H608a72472i717I0047C2542c2271G8624
15377A59692L5891a96124Q8697M3296B69837q8206a35712D33321d4392A56318
15366a32533E0708c36138c8179n7990A63667a03024k34891i4840b4581C4356a38575
15354B53836e469A38673E9767a3991H6965b34329D444c08300a03950D6403b13085
15342a43564B32639g4426A11757d01596a5956j89521k8325B05024E8834J21012
15332A79846o6372a26308B43294b07070D4499M018i3962l19224a22403d6909A43609
15320E3549k4214a48089C2560K0132g6102C52666q1658I7445K51566j71252g2142
$$ plain form
15308 269865 230384 127576 191026 145667 -72624 359006 -99476 -37029 158507 197712 82347
15296 259082 -395445 -8273 131783 -334670 100965 137373 255365 23761 115507 -27122 440691
15284 -34730 -145977 -8311 -83421 196332 -215114 -9375 -1414 35156 -98730 80089 253727
15273 253727 -40537 117889 65588 -120193 110726 120427 18487 211019 86220 -54558 -33636
15262 -33636 234720 249946 268621 124672 189264 -204414 73457 193201 243326 108923 20720
15250 -9709 1838 208975 811179 1627262 1274923 1461610 1571411 427796 126035 212195
15240 212195 148242 420058 -107944 469025 -59819 197820 -8106 220444 45949 404636
15230 404636 -154098 82999 109308 152660 322012 101285 244341 -84933 351663 -35325
$$ packed form
15308B69865l9481j02808O3450m5359g2624C59006i9476c7029A58507L9205H2347
15296B59082c95445h273A31783c34670A00965L6408J17992B3761R1746b7122D40691
15284c4730j11247h311p5110A96332b15114i375a414C5156i8730H0089J73638
15273B53727d0537A17889n2301a20193A10726R701A8487J92532H6220e4558K0922
15262c3636B34720J5226J8675A24672O4592b04414G3457J19744N0125A08923B0720
15250i709A838K07137O02204Q16083l52339J86687J09801D27796A26035Q6160
15240B12195o3953K71816a07944D69025e9819A97820h106B20444D5949L58687
15230D04636a54098H2999K6309M3352J69352A01285J43056h4933C51663c5325
$$ plain form
15219 29007 382811 334709 -63334 -287989 -93706 102418 -168638 -60971 26624 80248 -126299
15207 103188 120799 -47833 188097 180071 -74721 78359 -208133 215756 -50032 101889 -143835
15195 53042 101601 -1394 129464 -950 29224 -146896 112939 -30844 220532 -335241 335081
15183 347680 126971 182737 106713 -117961 -147353 114064 -98908 142790 -155347 11779
15172 304443 -248984 340070 25583 -13534 124794 -84568 134485 10733 158528 101314
15162 101314 -85193 58686 221972 222159 213799 108479 -114847 -101212 -61132 -37369 242674
15150 479330 -43628 -46059 -9475 -68064 103218 12840 23056 111765 -24748 99215 -36544 -28964
15138 -28964 -223125 18917 116898 17407 205040 -53199 448713 336195 -7201 -34432 223042
$$ packed form
15219B9007L53804m8102f3334k24655i3706A02418a68638f0971B6624N3624a26299
15207A03188J7611d7833A88097q026g4721G8359b08133B15756e0032A01889a43835
15195E3042M8559a394A29464i50B9224a46896A12939c0844B20532c35241C35081
15183C47680A26971N5766p6024a17961k9392A14064i8908A42790a55347A1779
15172C04443b48984C40070B5583a3534A24794h4568A34485A0733J47795n7214
15162A01314h5193E8686J63286J87q360j05320a14847J3635M0080K3763B42674
15150D79330d3628k431i475n8589A03218A2840J0216Q8709b4748I9215c6544P580
15138b8964j94161A8917R7981A7407J87633e3199D48713j12518g201k7231B23042
$$ plain form
15126 207883 7716 -163738 -35120 143238 443013 222015 154404 370502 -32425 339200
15115 137915 275630 129957 441551 100054 -51297 337137 80385 92920 373334 325265
15105 325265 89702 -40050 102978 -41732 16940 -82119 26863 166693 662663 -126145 -26984
15093 -168497 -67304 -42840 361 155764 -227226 164579 343572 -73937 -14352 40171 -224019
15081 90070 263043 54044 82936 -104034 327877 97457 -248254 152457 415796 54411
15070 227209 -178940 193961 268643 407463 -51508 -26946 52788 -243115 -288082 361370
15059 288715 -71408 73446 344282 303618 40442 247640 183620 202832 271593 219878 314097
15048 314097 121430 179900 71586 47957 164326 51412 169567 240147 215674 167606 270645
$$ packed form
15126B07883G716a63738c5120A43238K99775k20998o7611K16098c2425C39200
15115A37915J37715A29957L11594A00054e1297C37137H0385J2535K80414m8069
15105C25265H9702d0050A02978d1732A6940h2119B6863J39830M95970a26145b6984
15093a68497f7304K4464C61J55403b27226A64579J78993g3937a4352D0171b24019
15081I0070J72973E4044K8892a04034C27877I7457b48254A52457K63339E4411
15070B27209a78940A93961P4682J38820e1508K4562E2788b43115m4967C61370
15059B88715g1408G3446K70836m0664D0442K07198o4020J9212O8761n1715R4219
15048C14097A21430N8470G1586k3629J16369E1412J18155P0580k4473m8068J03039
$$ plain form
15037 270645 96970 235494 -25063 214215 271275 574592 223151 375657 378099 267155
15027 267155 289974 135763 119618 325648 252344 311365 -24285 98558 292316 253685 306331
15016 306331 298560 285719 218544 360439 51173 436334 416372 568455 -234883 10919 177193
15005 177193 329225 -132501 430625 4137 210939 157722 153944 -28024 49084 -240795 330880
14993 -69551 112529 330737 320267 329719 468232 73255 -54694 18631 188785 412398 230710
14982 230710 484418 174225 39462 295752 210234 392198 332930 253197 187372 415533
14972 415533 101970 458620 262313 16425 82884 -5613 174536 530928 186561 53493
14961 517697 -49309 322279 148551 286741 230200 193712 388398 167000 55493 237841
$$ packed form
15037B70645I6970J38524b5063B14215N7060L03317B23151J52506K442j10944
15027B67155K2819A35763j6145K06030p3304N9021b4285I8558J93758l8631N2646
15016C06331p771j2841o7175J41895E1173L85161j9962J52083b34883A0919J66274
15005A77193J52032a32501D30625D137K06802n3217l778b8024D9084b40795C30880
14993f9551A12529K18208j0470R452J38513G3255e4694A8631J70154K23613j81688
14982B30710K53708A74225C9462K56290q5518J81964n9268p9733o5825K28161
14972D15533A01970L56650j96307A6425O6459e613A74536L56392A86561E3493
14961E17697d9309C22279A48551J38190n6541l6488J94686A67000E5493J82348
$$ plain form
14951 237841 604280 38849 99075 118114 265403 536379 182427 87097 -16209 81757 508059
14940 508059 279871 401811 667713 365193 162950 167183 519465 464573 126121 138130
14930 138130 408176 68375 38348 154186 248899 456348 407472 397064 258851 215616 238387
14919 238387 203160 368911 220384 125234 424311 179325 500204 651901 637760 315515
14908 180408 513037 333354 469196 154684 424719 99656 124850 352468 289313 403833
14898 403833 229474 279962 490191 206310 141093 533960 501410 485431 436424 383112 426023
14887 426023 407109 262619 473520 383959 -17331 550302 504443 167115 43756 -10181 306071
14875 99090 292094 675334 263406 143670 228664 590490 287591 48859 457352 538092
$$ packed form
14951B37841L66439C8849O0226J9039J47289K70976A82427H7097a6209H1757M26302
14940E08059k28188J21940K65902l02520A62950M233L52282n4892A26121J2009
14930A38130K70046F8375l0027J15838R4713K07449m8876j0408j38213m3235K2771
14919B38387l5227J65751j48527r5150K99077A79325L20879J51697j4141C15515
14908A80408L32629j79683J35842A54684K70035I9656K5194K27618o3155J14520
14898D03833j74359N0488K10229B06310o5217L92867l2550j5979m9007n3312M2911
14887D26023j8914j44490K10901q9561a7331E50302m5859A67115D3756a0181C06071
14875I9090J93004L83240B63406j19736Q4994L61826B87591D8859M08493Q0740
$$ plain form
14865 538092 364004 288565 140018 352711 339046 23466 434817 184239 386018 203889
14855 203889 422462 282059 518600 413080 492437 312498 49686 311745 40866 746527
14845 746527 406261 553487 420332 233915 352034 563337 249852 317868 556156 508704
14835 508704 231458 525684 551365 166224 418323 572939 395242 446159 688704 690340
14825 690340 257742 583498 682764 567389 357948 369985 506672 223558 564179 498202
14815 498202 92585 598748 425680 420364 369637 463759 430484 253221 442322 308342 598525
14804 598525 633439 484886 501253 385547 496315 227002 373400 441608 274577 483755
14794 483755 364635 150624 395746 595468 711692 874464 358003 599168 518163 642714
$$ packed form
14865E38092j74088p5439A40018K12693j3665B3466M11351A84239K01779j82129
14855B03889K18573j40403K36541j05520P9357j79939D9686K62059D0866P05661
14845G46527l40266J47226j33155j86417J18119K11303B49852O8016K38288m7452
14835E08704B31458K94226K5681A66224K52099J54616j77697N0917K42545J636
14825F90340B57742L25756R9266j15375k09441J2037J36687B23558L40621o5977
14815D98202I2585N06163j73068n316n0727R4122l3275j77263J89101j33980K90183
14804E98525L4914j48553J6367j15706J10768B27002J46398O8208j67031K09178
14794D83755j19120A50624K45122J99722J16224J62772C58003K41165q1005J24551
$$ plain form
14784 642714 461774 682381 372967 502273 827593 623643 654418 394585 673494 540740
14774 540740 492364 69746 434611 581061 767489 566780 242363 512728 566360 242532
14763 496183 475136 219115 715943 557338 791578 478679 673512 670346 633880 488134
14753 488134 542834 476608 698787 767902 776868 491915 491512 687001 704016 724148 699428
14742 699428 555049 676074 720304 357639 988424 847771 665675 1012176 805260 1181282
14732 1181282 652829 718472 476409 710718 937763 824464 689350 778915 864728 648645
14722 648645 768960 907559 787626 813703 815320 630076 989387 856185 1299596 576209
14711 772806 824756 963210 550559 779798 936546 1163791 1057116 799919 758604 944606
$$ packed form
14784F42714j80940K20607l09414J29306L25320k03950L0775k59833K78909j32754
14774E40740m8376F9746L64865J46450J86428k00709B42363K70365N3632B42532
14763D96183k1047B19115M96828j58605K34240l12899J94833l166l6466j45746
14753D88134N4700o6226K22179O9115Q966k84953m03J95489J7015K0132k4720
14742F99428j44379J21025M4230C57639O30785j40653j82096L46501k06916L76022
14732A181282n28453O5643k42063K34309K27045j13299j35114Q9565Q5813k16083
14722F48645J20315J38599j19933K6077J617j85244L59311j33202M43411E76209
14711G72806N1950J38454m12651K29239J56748K27245j06675k57197m1315J86002
$$ plain form
14701 944606 605622 1127429 715193 703840 561366 673284 895198 966824 784154 1149077
14691 1149077 714516 966633 837724 757035 855397 732599 874208 945811 1085776 1001458
14681 1001458 957373 742218 1076874 589391 1050381 704586 1106714 1088266 968341 1253977
14671 1253977 1014382 1029081 959387 1116988 969958 717660 1143858 1261322 902200 926482
14661 926482 1262983 1065171 1172211 1093754 1187443 1156770 1169751 757338 856612 1172785
14651 1172785 1005795 1136475 1335845 895591 1023669 1085115 1178010 1118648 1238891 1164118
14641 1164118 1045971 1211580 1241291 1075599 1189419 1128802 1156043 1355584 1240138 1094098
14631 1094098 1052464 1076597 1122953 1187298 1387062 1323076 1151448 1207910 1515392 1602815 1238069
$$ packed form
14701I44606l38984N21807m12236j1353j42474J11918K21914P1626j82670L64923
14691A149077m34561K52117j28909q0689R8362j22798J41609P1603J39965q4318
14681A001458m4085k15155L34656m87483M60990l45795M02128j8448j19925K85636
14671A253977k39595J4699o9694J57601j47030k52298M26198J17464l59122K4282
14661I26482L36501j97812J07040p8457R3689l0673J2981m12413R9274L16173
14651A172785j66990J30680J99370m40254J28078O1446R2895n9362J20243p4773
14641A164118j18147J65609K9711j65692J13820o0617K7241J99541j15446j46040
14631A094098m1634K4133M6356O4345J99764o3986j71628N6462L07482Q7423l64746
$$ plain form
14620 1238069 1447082 1241114 1366803 1497286 1113244 1698630 1302959 1389699 1376144 1304438
14610 1304438 1192922 1692150 1326093 1377440 1653718 1677565 1556725 1589478 1350460 1684046
14600 1684046 1419718 1501130 1621254 1495135 1647085 1543548 1737753 1796771 1665062 1613809
14590 1613809 1656727 1672265 1879466 1716858 1626081 1838532 1626014 2085122 1979043 1958207
14580 1958207 2073289 2138595 1812727 2287418 2155656 1881128 1771225 1946132 1925821 2294693
14570 2294693 2063642 2092245 2161637 2002529 2293863 2265815 2456569 2467587 2602090 2617742
14560 2617742 2752844 2687960 2812405 3123452 2799077 3256740 3883410 3811263 4021578 4319224
14550 4319224 5624735 7740347 11187810 20091966 41499417 44516202 17190409 8361844
$$ packed form
14620A238069K09013k05968J25689J30483l84042N85386l95671Q6740j3555p1706
14610A304438j11516M99228l66057N1347K76278K3847j20840L2753k39018L33586
14600A684046k64328Q1412J20124j26119J51950j03537J94205N9018j31709n1253
14590A613809M2918J5538K07201j62608r0777K12451k12518M59108j06079k0836
14580A958207J15082O5306l25868M74691j31762k74528j09903J74907k0311L68872
14570B294693k31051K8603O9392j59108K91334k8048J90754J1018J34503J5652
14560B617742J35102o4884J24445L11047l24375M57663O26670p2147K10315K97646
14550D319224J305511K115612L447463Q904156K1407451L016785A7190409H361844
$$ plain form
14541 3744149 2512518 1904811 1667558 1751813 2147243 2324164 2095774 2009677 2286900 1757871
14531 1757871 2075488 2066542 2226957 2248205 2059288 2109321 2202537 2147599 1928138 2393265
14521 2393265 2462331 2541510 2544588 2424260 2246669 2303822 2580966 2746621 2553939 2770932
14511 2770932 2873248 2789557 2757746 2704192 2675402 2625966 2993441 2903725 3011039 3038110 3268497
14500 3268497 3236659 2778537 3423530 3219954 3134879 3169713 3044541 3208021 3532060 3384245
14490 3384245 3346008 3597402 3523350 3479420 3517354 3677050 3514294 3461563 3580484 3707270
14480 3707270 3654463 3736171 3705526 3822254 4008521 4110990 3885969 4053288 4364999 3632002
14470 3632002 4102391 4054007 4187375 4022227 4122254 3987407 4208679 4087134 4415976 4298827
$$ packed form
14541C744149j231631o07707k37253Q4255L95430J76921k28390q6097K77223n29029
14531A757871L17617q946J60415K1248j88917N0033R3216n4938k19461M65127
14521B393265O9066P9179L078j20328j77591N7153K77144J65655j92682K16993
14511B770932J02316q3691l1811n3554k8790m9436L67475q9716J07314K7071K30387
14500C268497l1838m58122O44993k03576q5075L4834j25172J63480L24039j47815
14490C384245l8237K51394p4052m3930L7934J59696j62756n2731J18921J26786
14480C707270n2807Q1708l0645J16728J86267J02469k25021J67319L11711p32997
14470C632002M70389m8384J33368j65148J00027j34847K21272j21545L28842j17149
$$ plain form
14460 4298827 4911475 4750765 4689717 4879846 4747895 4931313 4996200 5097146 5091095 5629812
14450 5629812 5363570 5146837 5335596 5530114 5372007 5622841 5617262 5834790 5543882 5663905
14440 5663905 5802834 5968811 6296167 6331106 6016428 6426566 6625636 6152790 6473254 6493642
14430 6493642 6710818 6861503 6935176 6867165 7223422 7000628 7192105 7386306 7544690 7422509
14420 7422509 7802863 7552824 8119987 8303372 8029363 8272938 8241025 8639146 8869064 8702966
14410 8702966 9150838 9047404 9132186 9325243 9558494 9411487 9807052 10145487 10037950 10446005
14400 10446005 10233423 10531167 10822751 10327314 11046842 11351726 11422851 11610158 11762780
14391 11762780 12154512 12198025 12606627 12613848 12385734 13109755 13327674 13228416 13790439 14220594
$$ packed form
14460D298827O12648j60710o1048J90129j31951J83418O4887J00946o051N38717
14450E629812k66242k16733J88759J94518j58107K50834n579K17528k90908J20023
14440E663905J38929J65977L27356L4939l14678M10138J99070m72846L20464K0388
14430F493642K17176J50685P3673o8011L56257k22794J91477J94201J58384j22181
14420G422509L80354k50039N67163J83385k74009K43575l1913L98121K29918j66098
14410H702966M47872j03434Q4782J93057K33251j47007L95565L38435j07537M08055
14400A0446005k12582K97744K91584m95437P19528L04884P1125J87307J52622
14391A1762780L91732M3513M08602P221k28114P24021K17919r9258N62023M30155
$$ plain form
14381 14220594 14136189 14865680 14910499 15182938 15476058 15926518 16050731 16227584 16728905 17267213
14371 17267213 17217569 17373634 18133962 18327036 18498875 18901144 19602038 19778508 20486872
14362 20486872 20509370 21381794 22141777 22153018 22930056 22978472 23717735 24192424 24806101 25142731
14352 25142731 26131102 26894053 27333069 27975328 28657803 29223324 30478762 30799803 31863009
14343 31863009 32627488 33254365 34620917 35238588 36395281 37449894 38267822 39659295 40747821
14334 40747821 42150808 43150869 44558435 45910756 47122737 48649277 50560294 51997608
14326 51997608 53549975 55541260 57655247 58988789 61075321 63396154 65703233 67965992
14318 67965992 70216017 73240706 75951917 79083388 81802879 85377674 88244437 92015278
$$ packed form
14381A4220594q4405P29491M4819K72439K93120M50460J24213J76853N01321N38308
14371A7267213m9644J56065P60328J93074J71839M02269P00894J76470P08364
14362B0486872K2498Q72424P59983J1241P77038M8416P39263M74689O13677L36630
14352B5142731R88371P62951M39016O42259O82475N65521J255438L21041J063206
14343C1863009P64479O26877J366552O17671J156693J054613Q17928J391473J088526
14334D0747821J402987J000061J407566J352321J211981J526540J911017J437314
14326E1997608J552367J991285K113987J333542K086532K320833K307079K262759
14318F7965992K250025L024689K711211L131471K719491L574795K866763L770841
$$ plain form
14310 92015278 96154946 99951950 104124086 108806713 113305048 118127232 123594684 129095038
14302 129095038 135130511 141379662 148042121 155078556 162595307 170561463 179127564 188086605
14294 188086605 197296680 206974149 217626300 229004014 240506719 252604343 265304514
14287 265304514 278543900 291942148 306041366 320188201 334418913 349754755 364186994
14280 364186994 379098762 393280296 406503295 419079058 430354828 440279966 448243784
14273 448243784 452464376 452682439 451294407 449682963 447022353 443314376 436424300 426929724
14265 426929724 414808569 401403551 386427949 370849452 354769322 338670040 322910478
14258 322910478 307415049 291910127 276990487 262650480 250233535 237854868 225041038
$$ packed form
14310I2015278M139668L797004M172136M682627M498335M822184N467452N500354
14302A29095038O035473O249151O662459P036435P516751P966156Q566101Q959041
14294A88086605R210075R677469J0652151J1377714J1502705J2097624J2700171
14287B65304514J3239386J3398248J4099218J4146835J4230712J5335842J4432239
14280C64186994J4911768J4181534J3222999J2575763J1275770R925138P963818
14273D48243784M220592K18063j388032j611444k660610l707977o890076r494576
14265D26929724j2121155j3405018j4975602j5578497j6080130j6099282j5759562
14258C22910478j5495429j5504922j4919640j4340007j2416945j2378667j2813830
$$ plain form
14251 225041038 213662326 202552799 192157244 182259523 173294557 164502975 156567972
14244 156567972 149199384 142184578 135262993 128843200 123258041 117445693 112701716 107850033
14236 107850033 103032475 98423338 94240284 90375849 86725677 84088049 80035404 77104415
14228 77104415 74096539 71131352 68624490 65861338 63655969 61333827 59275419 57465565
14220 57465565 55492474 53806335 51547822 50298049 48212920 46721918 45729959 44662858
14212 44662858 43122040 41718641 40469428 39200347 38457625 37790345 36526796 35119507
14204 35119507 34039042 33269415 32278246 31645833 30962579 30103042 29119754 28316704 27651617
14195 27651617 26943880 26416479 26015292 25378458 24480547 23770547 23227090 23092970 22278236
$$ packed form
14251B25041038j1378712j1109527j0395555r897721q964966q791582p935003
14244A56567972p368588p014806o921585o419793n585159n812348m743977m851683
14236A07850033m817558m609137m183054l864435l650172k637628m052645k930989
14228G7104415l007876k965187k506862k763152k205369k322142k058408j809854
14220E7465565j973091j686139k258513j249773k085129j491002r91959j067101
14212D4662858j540818j403399j249213j269081p42722o67280j263549j407289
14204C5119507j080465p69627r91169o32413o83254q59537r83288q03050o65087
14195B7651617p07737n27401m01187o36834q97911p10000n43457j34120q14734
$$ plain form
14186 22278236 21736248 21314973 20953011 20501982 20036528 19844380 19221417 18668760 18457039
14177 18457039 18060588 17466254 16979709 17131916 16706678 16273892 15865457 15505598 15264012
14168 15264012 14942804 14722820 14456642 13999978 14394174 13710023 13515265 12978414 12780456
14159 12780456 12785470 12362768 12425768 12066129 11786972 11823162 11379871 11233962 11148579 10955937
14149 10955937 10636082 10527564 10813177 10228689 10183481 10053947 9927562 9999087 9349489 9403578
14139 9403578 9416735 9130712 8910948 8629857 8816850 8656295 8251137 8417145 8349236 8036911
14129 8036911 8001302 8050122 7785313 7690457 7378430 7440624 7045559 7185247 7251729 6964687
14119 6964687 6878302 6643353 6823793 6443018 6514368 6657451 6479649 6249577 6295831 6203405
$$ packed form
14186B2278236n41988m21275l61962m51029m65454j92148o22963n52657k11721
14177A8457039l96451n94334m86545J52207m25238m32786m08435l59859k41586
14168A5264012l21208k19984k66178m56664L94196o84151j94758n36851j97958
14159A2780456N014m22702O3000l59639k79157L6190m43291j45909q5383j92642
14149A0955937l19855j08518K85613n84488m5208j29534j26385P1525o49598N4089
14139I403578J3157k86023k19764k81091J86993j60555m05158J66008o7909l12325
14129H036911l5609M8820k64809r4856l12027O2194l95065J39688O6482k87042
14119F964687q6385k34949J80440l80775P1350J43083j77802k30072M6254r2426
$$ plain form
14109 6203405 6118512 5878461 6045576 5902249 5935380 5811707 5361960 5769069 5457804 5555172
14099 5555172 5586638 5281054 5472557 5333975 5086763 5100135 5114202 4993478 4889447 4805483
14089 4805483 4652293 4909019 4642181 4940222 4732311 4621364 4493426 4535159 4376858 4377393
14079 4377393 4427346 4335093 4212416 4210498 4190530 4032159 4111796 3874681 3827593 4112455 3842033
14068 3842033 3574908 3768502 3742609 3895001 3864047 3658017 3974697 3408793 3933152 3735282
14058 3735282 3956140 3517280 3691295 3600930 3209174 3614874 3493009 3476018 3316385 3405289
14048 3405289 3369767 3123778 2707826 3018423 3180092 2976594 3176870 2939055 2636007 2852415
14038 2852415 2851643 3047266 2922167 2979261 2680087 2852097 2936820 3214821 2619543 2591189
$$ packed form
14109F203405q4893k40051J67115j43327L3131j23673m49747M07109l11265R7368
14099E555172L1466l05584J91503j38582k47212J3372J4067j20724j04031q3964
14089D805483j53190K56726k66838K98041k07911j10947j27938M1733j58301N35
14079D377393M9953r2253j22677j918j9968j58371P9637k37115m7088K84862k70422
14068C842033k67125J93594k5893J52392l0954k06030L16680n65904N24359j97870
14058C735282K20858m38860J74015r0365l91756M05700j21865j6991j59633Q8904
14048C405289l5522k45989m15952L10597J61669k03498K00276k37815l03048K16408
14038B852415p72J95623j25099N7094k99174J72010Q4723K78001n95278k8354
$$ plain form
14028 2591189 2605170 2976711 2434987 2557638 2504664 2473844 2667932 2527176 2451624 2566271
14018 2566271 2276978 2201146 2640423 2323759 1832941 2601444 2080194 2055862 2181676 1930334
14008 1930334 2335534 1998281 1964949 2039180 1734927 2057188 2264181 1990330 1814224 2054511
13998 2054511 1706426 1935826 1917698 1760773 2216107 2034483 2183073 2351779 2502739 3270809
13988 3270809 6032936 12752107 33196230 48090838 22487997 9871942 6157397 4556173
13980 4556173 3400387 3523493 3062731 2978111 2590296 2564612 2641117 2230588 2355673 2472171
13970 2472171 2319693 2245201 2287155 2042659 2287449 2276123 2229673 1950590 2090618 1863187
13960 1863187 1943577 1830006 1982882 2130722 1796150 1653683 1645116 1889741 1667112 1738525
$$ packed form
14028B591189J3981L71541n41724J22651n2974l0820J94088j40756p5552J14647
14018B566271k89293p5832M39277l16664m90818P68503n21250k4332J25814k51342
14008A930334M05200l37253l3332P4231l04253L22261K06993k73851j76106K40287
13998B054511l48085K29400j8128j56925M55334j81624J48590J68706J50960P68070
13988C270809K762127O719171K0444123J4894608B2487997I871942l714545j601224
13980D556173j155786J23106m60762q4620l87815k5684P6505m10529J25085J16498
13970B472171j52478p4492M1954k44496K44790j1326m6450k79083J40028k27431
13960A863187Q0390j13571J52876J47840l34572j42467q567K44625k22629P1413
$$ plain form
13950 1738525 1538584 1668295 1923500 1640263 1732906 1744231 1560040 1552617 1356157 1279516
13940 1279516 1625865 1669895 1733125 1620437 1875412 1540554 1421143 1252635 1497553 1434745
13930 1434745 1588385 1295671 1431746 1863712 1508777 1775048 1454596 1493306 1806850 1563074
13920 1563074 1521576 1270013 1518167 1165118 1323430 1274473 1259941 1515730 1392602 1252214
13910 1252214 1623795 1501771 1335143 1329374 1647690 1053045 1041603 1158578 1444906 1123459
13900 1123459 1209653 919891 1213726 1169619 1010709 1579565 1568195 1065268 1264309 1054358
13890 1054358 1305860 1167114 894702 1249608 979871 887562 1106904 1138588 1257787 833779
13880 833779 1328399 1262596 1121428 1168267 1146474 1121797 1030832 1004976 1214798 1146480 996567
$$ packed form
13950A738525j99941J29711K55205k83237R2643J1325j84191p423j96460p6641
13940A279516L46349M4030O3230j12688K54975l34858j19411j68508K44918o2808
13930A434745J53640k92714J36075M31966l54935K66271l20452L8710L13544k43776
13920A563074m1498k51563K48154l53049J58312m8957j4532K55789j23128j40388
13910A252214L71581j22024j66628n769L18316n94645j1442J16975K86328l21447
13900A123459Q6194k89762K93835m4107j58910N68856j1370n02927J99041k09951
13890A054358K51502j38746k72412L54906k69737r2309K19342L1684J19199m24008
13880H33779M94620o5803j41168M6839k1793k4677r0965k5856K09822o8318j49913
$$ plain form
13869 996567 860864 1101247 1035419 1007654 1181469 1113765 1026929 1073321 795561 1062047
13859 1062047 911059 931181 1053446 1059348 1103506 1189838 543314 827556 892369 1087566
13849 1087566 746642 817352 704054 708471 892030 858695 697962 866430 904951 901357 679799
13838 679799 1001506 1205796 891213 586390 644423 770773 854555 762975 785657 713870
13828 713870 557841 1215908 497204 777447 731528 845607 756314 803021 1006190 1190537
13818 1190537 966634 715763 710450 1044812 792066 867478 1039934 949139 833333 813939
13808 813939 732400 650380 992412 737881 545946 773099 882359 600323 917108 692355
13798 692355 640290 645200 581118 802029 587076 589495 700091 558659 747137 687636 491203
$$ packed form
13869I96567j35703K40383o5828k7765J73815o7704q6836M6392k77760K66486
13859A062047j50988K0122J22265N902M4158Q6332E43314K84242O4813J95197
13849A087566l40924P0710j13298M417J83559l3335j60733J68468L8521l594k21558
13838F79799L21707K04290l14583l04823N8033J26350Q3782r1580K2682p1787
13828G13870j56029O58067D97204K80243m5919J14079q9293M6707K03169J84347
13818A190537k23903k50871n313L34362k52746P5412J72456r0795j15806j9394
13808H13939q1539q2020L42032k54531j91935K27153J09260k82036L16785k24753
13798F92355n2065M910o4082K20911k14953K419J10596j41432J88478n9501j96433
$$ plain form
13787 491203 927845 510473 570121 742050 494247 530162 590194 657922 886955 670096
13777 670096 440256 701733 913912 662820 639122 646629 611737 673460 520262 390998
13767 390998 904198 972568 685463 426306 502020 522100 718924 611186 782153 712709
13757 712709 498056 692509 852347 568372 478768 853338 486724 521117 619680 284348
13746 854807 336823 884825 390446 852181 518107 754275 639132 448021 610618 398427
13736 398427 615564 639753 457465 283828 276426 449512 403782 577491 823952 703155
13726 703155 603491 359828 503182 157138 483880 389582 606894 727046 365150 279070
13716 279070 282309 323740 533475 601875 379600 221250 472861 840021 492950 450447
$$ packed form
13787D91203M36642m17372N9648J71929k47803L5915O0032O7728K29033k16859
13777F70096k29840K61477K12179k51092k3698P507l4892O1723j53198j29264
13767C90998N13200O8370k87105k59157P5714K0080J96824j07738J70967o9444
13757G12709k14653J94453J59838k83975q9604L74570l66614L4393R8563B84348
13746H54807C36823N48002C90446M61735l34074K36168j15143j91111J62597k12191
13736C98427K17137K4189j82288j73637p402J73086m5730J73709K46461j20797
13726G03155r9664k43663J43354A57138L26742r4298K17312J20152l61896q6080
13716B79070L239M1431K09735O8400k22275j58350K51611L67160l47071m2503
$$ plain form
13706 450447 387056 448920 382644 812022 163192 377510 241033 564066 338245 396109
13696 396109 293630 404591 773779 650696 456302 339131 278306 234174 350257 344709
13686 344709 350300 231133 717093 433379 338422 425532 347509 235017 487461 192380
13675 347148 189260 292638 684233 421487 584563 129922 234936 332542 388150 441478
13665 441478 616465 363335 398808 483059 590923 194740 540715 335283 487014 387265
13655 387265 271301 517645 616730 305928 343268 376523 265920 186595 699204 507082
13645 507082 320467 306075 328047 339488 372892 381271 556467 576277 212817 158979 406479
13634 406479 625641 561477 134630 172402 284279 267557 82832 439653 394394 366496 500444
$$ packed form
13706D50447o3391O1864o6276M29378A63192K14318j36477L23033k25821N7864
13696C96109j02479J10961L69188j23083j94394j17171o0825m4132J16083n548
13686C44709N591j19167M85960k83714r4957Q7110p8023j12492K52444A92380
13675C47148j57888J03378L91595k62746J63076A29922J05014R7606N5608N3328
13665D41478J74987k53130L5473Q4251J07864A94740L45975k05432J51731r9749
13655C87265j15964K46344R9085C05928L7340L3255j10603p9325N12609j92122
13645E07082j86615j4392K1972J1441L3404Q379J75196J9810B12817n3838K47500
13634D06479K19162o4164A34630L7772J11877j6722H2832L56821m5259k7898J33948
$$ plain form
13623 500444 188368 572475 555316 443034 312714 -19931 374371 361959 446555 329033
13613 329033 399447 145553 55173 105317 278750 448943 154381 138690 31159 194782
13603 194782 318695 303013 133739 188684 216245 -59540 660900 316231 290646 372839 253695
13592 253695 63514 170115 223651 -37293 516191 300026 307654 24182 504833 195396 -327561
13580 406653 -245199 141776 632985 108053 311652 248611 160788 278131 -195563 420510
13569 364205 280598 362921 182598 566127 92393 351953 211058 521812 403043 380153
13559 380153 538503 486100 426105 188766 481560 142663 159302 82081 -118810 361979
13548 167957 407762 545633 212207 321658 475123 391638 416822 -48677 57961 287291
$$ packed form
13623E00444A88368L84107j7159j12282j30320a9931C74371j2412Q4596j17522
13613C29033P0414A45553E5173N0144J73433J70193A54381j5691C1159J63623
13603A94782J23913j5682A33739N4945K7561e9540F60900C16231k5585Q2193j19144
13592B53695F3514J06601N3536c7293E16191k16165P628B4182M80651A95396c27561
13580D06653b45199A41776M91209A08053K03599o3041q7823J17343a95563D20510
13569C64205q3607Q2323j80323L83529I2393K59560j40895L10754j18769k2890
13559C80153J58350n2403n9995A88766K92794A42663J6639p7221a18810C61979
13548A67957K39805J37871B12207J09451J53465q3485K5184d8677E7961K29330
$$ plain form
13538 287291 283910 437693 306575 143030 36635 465480 518261 27805 95496 274101 382444
13527 382444 477990 622823 186951 112665 84708 108623 391094 554039 330322 372429
13517 372429 213757 317172 303059 -39819 158907 409659 412962 367613 254861 133048
13507 133048 340658 455085 241977 569366 376487 348153 195430 519513 27348 442607
13497 442607 28425 443446 -76662 437457 468077 -20472 254266 18142 70052 319081 430514
13486 430514 271379 302096 239648 27596 136448 156425 582993 470977 112339 288175
13476 288175 -4452 449703 277931 220894 14895 208767 244606 -66298 407522 374922 321175
13465 321175 -46573 135750 188204 -4383 500089 90884 286464 -117449 382237 -192782
$$ packed form
13538B87291l381J53783j31118A43030C6635M28845N2781B7805O7691J78605J08343
13527C82444R5546J44833A86951p4286k7957K3915K82471J62945k23717M2107
13517C72429j58672J03415j4113c9819A58907K50752L303m5349j12752j21813
13507A33048K07610J14427k13108L27389j92879k8334j52723L24083B7348M15259
13497D42607B8425M15021g6662D37457L0620b0472B54266A8142N1910K49029J11433
13486D30514j59135L0717o2448B7596J08852J9977M26568j12016A12339J75836
13476B88175d452D49703j71772n7037A4895J93872L5839f6298D07522l2600n3747
13465C21175d6573A35750N2454d383E00089I0884J95580a17449C82237a92782
$$ plain form
13454 2939 147049 307006 186262 194703 320286 138832 387564 430242 170030 56844 153221
13443 153221 23203 457797 176272 178509 218083 78256 92422 101252 98395 551442 69253
13431 427569 207001 367238 403286 -154508 100307 78039 53429 169995 219196 376316
13421 376316 371964 105707 156283 170531 -225423 1729 40436 170245 106545 186277 9129
13409 141005 109157 -56038 243596 152630 -87685 226 57789 24590 231046 90592 -26491
13397 289114 219433 -49439 -23675 115400 124194 328890 -230475 179397 42974 -41459 368012
13385 5360 238327 93659 172737 314954 9540 298909 181791 214291 -149427 95150 178074
13374 178074 138524 516132 84290 448459 130646 316528 278135 62904 521092 180240
$$ packed form
13454B939J44110J59957j20744Q441J25583A38832K48732M2678A70030E6844R6377
13443A53221B3203M34594A76272K237L9574G8256J4166Q830k857M53047F9253
13431D27569B07001J60237L6048a54508A00307k2268k4610J16566M9201J57120
13421C76316m352A05707N0576J4248b25423A729L8707J29809o3700P9732I129
13409A41005l1848e6038B43596r0966h7685B26N7563B4590K06456I0592b6491
13397B89114o9681d9439b3675A15400Q794K04696b30475A79397D2974d1459C68012
13385E360K32967I3659P9078J42217I540K89369j17118L2500a49427I5150Q2924
13374A78074l9550L77608H4290L64169A30646J85882l8393F2904M58188A80240
$$ plain form
13363 681339 269236 305532 37237 221628 130171 251098 152578 360615 -102991 125479
13352 72278 25199 125589 309526 333070 -61832 332271 240651 115306 272523 352162 254243
13341 254243 -79731 512397 268842 335807 200421 143001 264271 -1278 389908 310742 211006
13330 211006 65526 114950 334049 443544 62507 -145931 60232 283596 250036 347335 131508
13318 299695 367986 -66 176676 471510 186916 -43821 194602 196959 -98068 -138163 500589
13306 60564 130648 241426 254911 -4501 -53705 80920 12715 322930 28830 156029 234248
13295 234248 501738 46626 143793 -76711 257322 -60848 218116 65719 -60360 149065 217059
13284 217059 216840 117132 111298 17683 310481 147908 -40730 212294 238913 336847 -237596
$$ packed form
13363F81339B69236L6296C7237J84391r1457J20927r8520K08037a02991A25479
13352G2278B5199J00390J83937K3544f1832C32271r1620A15306J57217P9639r7919
13341B54243g9731E12397k43555O6965j35386n7420J21270a278C89908p9166r9736
13330B11006F5526M9424K19099J09495F2507a45931F0232K23364l3560R7299A31508
13318B99695O8291f6A76676K94834A86916d3821A94602K357i8068m0095E00589
13306F0564P0084J10778J3485d501m9204H0920A2715L10215B8830J27199P8219
13295B34248K67490D6626R7167g6711B57322f0848B18116F5719f0360A49065O7994
13284B17059k19r9708n834A7683K92798A47908d0730B12294K6619R7934b37596
$$ plain form
13272 -174521 183658 122895 242316 49133 103930 -128167 117468 376483 13529 -116629
13261 84340 67122 42686 189171 -241708 104027 -114651 322406 46169 130759 -72467 270777
13249 349124 -31619 -38515 -179719 -128529 1478 296682 -125220 350632 468965 54910 425235
13238 425235 350710 199730 196049 93643 148979 -39333 106921 93290 180091 23804 5921
13226 -141302 170327 254717 53628 -61337 5334 103137 181463 273631 130107 -2820 328762
13214 -16869 -35309 -95057 411692 224778 -29247 -98182 -197487 69497 -163936 -276228 309588
13202 510802 209440 -90511 116166 333428 483906 250936 53043 87080 75573 87111
13192 87111 -55168 145523 154365 158981 345158 178555 220346 113925 40523 85480 517278
$$ packed form
13272a74521A83658o0763J19421D9133N4797a28167A17468K59015A3529a16629
13261H4340j7218k4436J46485b41708A04027a14651C22406D6169Q4590g2467B70777
13249C49124c1619o896j41204N1190A478K95204a25220C50632J18333E4910L70325
13238D25235p4525j50980l681I3643N5336c9333A06921j3631Q6801B3804E921
13226a41302A70327Q4390E3628f1337E334R7803P8326R2168A30107b820C28762
13214a6869j8440n9748D11692j86914b9247o8935r9305F9497a63936j12292C09588
13202E10802B09440i0511A16166K17262J50478k32970E3043L4037j1507J1538
13192H7111e5168A45523Q842M616J86177j66603M1791j06421D0523M4957M31798
$$ plain form
13181 517278 -23436 -54137 204220 -103115 13144 223244 -232096 311114 113755 -120221
13170 -115121 264844 151088 284942 74645 -7646 84187 -81679 152120 189271 -13976 74360
13158 38231 141100 26087 225692 525922 230077 -32019 -95541 -27257 -151892 -143933 -2628
13146 -110153 -19838 -17920 57757 56841 205087 1468 125831 -210752 207607 31804 422130
13135 422130 -167712 194726 -224786 -109794 -11647 -7526 63598 192666 20904 -118974
13124 54440 248331 181630 -26591 60996 -158145 -2998 -29645 -295739 235614 130929 -150260
13112 226309 116498 260181 -38404 99440 -118518 -92822 183544 146220 -59941 177515
13101 -131248 312821 92075 164928 78996 128095 -231040 4083 281906 75524 -342776 152389
$$ packed form
13181E17278b3436l0701B04220a03115A3144K10100b32096C11114A13755a20221
13170a15121B64844j13756J33854G4645g646H4187h1679A52120L7151a3976G4360
13158C8231J02869B6087J99605L00230B30077c2019o3522b7257j24635P959b628
13146a10153a9838J918E7757r16J48246A468J24363b10752B07607C1804L90326
13135D22130a67712A94726b24786a09794a1647M121F3598J29068B0904a18974
13124E4440J93891o6701b6591F0996a58145b998k6647k66094B35614j04685a50260
13112B26309j09811J43683c8404I9440a18518K5696A83544l7324e9941A77515
13101a31248C12821I2075P2853G8996M9099b31040D083K77823G5524c42776A52389
$$ plain form
13089 193476 123162 194555 272907 -258878 -36667 202858 -156990 46755 -67850 20567 73536
13078 73536 -23575 -119364 28946 142751 -112157 112679 48138 124457 -11253 194881 196730
13067 196730 183571 -114721 67639 221726 113876 287064 -230735 110802 -46168 -119124
13057 -119124 111316 243944 105902 -204610 -128683 127973 -47242 107982 -72288 271896
13046 82898 120164 -10745 208515 -36239 19277 34035 191328 -181063 205414 450460 -56464
13034 89654 11595 294968 95751 6597 -419397 -30291 53212 223999 20100 281227 -117643
13022 154580 -37109 86223 48834 403736 340118 72045 -130824 -6583 58191 72607 215470
13011 215470 -36755 185581 370094 56001 -74252 -44194 -145126 119642 153185 102116 156734
$$ packed form
13089A93476p0314P1393P8352b58878c6667B02858a56990D6755f7850B0567N2969
13078G3536b3575r5789B8946J13805a12157A12679D8138P6319a1253A94881J849
13067A96730j3159a14721F7639J54087j07850J73188b30735A10802d6168p2956
13057a19124A11316J32628A05902b04610P5927A27973d7242A07982g2288B71896
13046H2898L7266a0745B08515c6239A9277J4758J57293a81063B05414K45046e6464
13034H9654A1595K83373I5751F597d19397c0291E3212J70787B0100K61127a17643
13022A54580c7109H6223l7389L54902o3618G2045a30824f583E8191J4416J42863
13011B15470c6755A85581J84513E6001g4252L0058j00932A19642L3543n1069N4618
$$ plain form
13000 156734 -58018 -44590 -90243 30623 -91724 -314210 495672 8692 -285442 -207479 47853
12988 90146 254619 74263 -3281 -88758 -108288 228078 201315 -2643 -164764 72136 8988 171312
12976 171312 -290904 340082 -37095 -196280 178107 198544 10392 -84709 586105 -88228
12965 -3548 -184969 96893 1935 -13052 142503 288179 290889 45454 -58213 71064 -267039
12953 -59828 -117288 -27824 206813 -251308 162832 134152 -60222 -9588 -177230 69707 186491
12942 186491 261122 -94002 196964 386905 -342887 43499 -68893 64240 -228175 -38606 92763
12930 89179 4619 65691 -136351 245839 -205147 173678 133692 100374 201054 6878 -111718
12918 70204 -51864 78390 66287 15570 -232816 238799 -125720 -104899 2446 110730 -214412
$$ packed form
13000A56734e8018J3428m5653C0623i1724k22486D95672H692b85442P7963D7853
12988I0146J64473G4263c281q5477j9530B28078k6763b643j62121G2136H988J62324
12976A71312b90904C40082c7095j59185A78107K0437A0392h4709E86105h8228
12965c548j81421I6893A935a3052A42503J45676K710D5454e8213G1064b67039
12953e9828n7460b7824B06813b51308A62832k8680f0222i588j67642F9707J16784
12942A86491P4631i4002A96964J89941c42887D3499f8893F4240b28175c8606I2763
12930H9179D619O1072a36351B45839b05147A73678l9986l3318J00680F878a11718
12918G0204e1864G8390j2103A5570b32816B38799a25720K0821B446J08284b14412
$$ plain form
12906 -67002 170036 209471 -73514 123687 75280 -120744 196125 454103 399924 335685 357950
12895 357950 254084 316379 244338 190038 146189 168992 -21421 -32530 561 -74366 139589
12883 49863 -295793 -76403 -75830 -128435 -93902 113064 26396 356497 196424 -133874 81548
12871 36009 -206111 199399 256468 45018 144048 17394 203501 -90358 98666 -273439 38759
12859 139963 86246 -97691 65265 -69930 55758 72962 -19330 48169 213895 112040 132592
12848 132592 -111862 -64306 -17977 83554 205547 -73681 -40708 112124 -74841 151811 -104388
12836 48543 -61016 65664 -126074 104027 206124 216293 -66043 -192455 116281 70021 74857
12825 74857 76767 -123726 99705 -5212 347401 -243779 163633 -42178 -53906 -37615 -17211
$$ packed form
12906f7002A70036L9435g3514A23687m8407a20744A96125K57978n4179o4239K2265
12895C57950j03866O2295p2041n4300m3849K2803b1421j1109E61g4366A39589
12883D9863b95793g6403N73n2605L4533A13064B6396L30101j60073a33874H1548
12871C6009b06111A99399N7069D5018R9030A7394J86107i0358I8666b73439C8759
12859A39963n3717i7691F5265f9930E5758J7204a9330D8169J65726j01855K0552
12848A32592a11862M7556a7977H3554J21993g3681L2973A12124g4841A51811a04388
12836D8543f1016F5664a26074A04027J02097J0169f6043j26412A16281m6260M836
12825G4857J910a23726I9705e212C47401b43779A63633d2178j1728J6291a7211
$$ plain form
12813 293460 -28942 -159875 -366709 -15945 -107164 262826 -156355 307568 -170086 -93534
12803 -93534 -3806 -18459 -285765 -84678 -40909 47889 -41821 -96173 266548 240040 -14101
12791 70441 -42400 101666 16373 -31935 222868 -39797 -29013 2959 53989 -89175 -22461
12779 -120293 218705 -323170 16680 -66477 -265879 152783 -97205 -10085 525046 122081
12768 157419 -297932 -108937 30015 -9832 166010 -69133 -30559 -5795 309859 -18864 -207331
12757 -207331 146153 -175585 117090 -65916 15159 -164703 -16157 -180211 -84814 -119008
12747 -119008 -122585 -19145 -206579 -120485 -83953 -158596 -92219 50846 381077 195056 160664
12736 160664 135449 -137727 -37881 -200861 535193 162031 89083 624433 83073 -46987
$$ packed form
12813B93460b8942j30933k06834a5945r1219B62826a56355C07568a70086P6552
12803i3534c806j4653k67306h4678d0909D7889d1821n4352B66548k6508a4101
12791G0441d2400A01666A6373c1935B22868c9797J0784B959N1030h9175b2461
12779a20293B18705c23170A6680f6477j99402A52783i7205a0085E25046A22081
12768A57419b97932a08937C0015i832A66010f9133c0559e795C09859a8864j88467
12757b07331A46153a75585A17090f5916A5159a64703a6157j64054h4814l4194
12747a19008l577a9145j87434Q6094L6532p4643O6377E0846L30231j86021l4392
12736A60664k5215a37727c7881j62980E35193A62031p2948N35350H3073d6987
$$ plain form
12725 -148628 -106694 -226249 146033 225389 233004 -3675 -19019 177453 -68377 163428 -188971
12713 122443 153490 -101621 142690 -12772 89881 336236 320559 801 126782 -28678 293281
12701 69793 328256 233181 61779 7882 69647 289096 -14216 -74237 -211056 71873 -114723
12689 -125298 129764 -73817 -296406 170558 216587 247669 -33646 -96242 278168 343840 -179285
12677 -24629 136304 109811 -78253 200443 187074 165622 101591 -59608 -173556 -10540 -42843
12666 -42843 127210 48300 -209203 -82359 12451 435165 205321 125436 -63706 196236 126146
12655 126146 492824 179322 187814 -18537 -11397 55104 228586 12866 101171 -248392 259491
12643 -28357 -219871 206283 -61678 4596 9417 81782 74220 116336 -136111 95433 16329 -20016
$$ packed form
12725a48628M1934j19555A46033P9356P615c675j5344A77453f8377A63428a88971
12713A22443L1047a01621A42690a2772H9881K46355j5677H01J25981b8678B93281
12701F9793K58463r5075F1779G882O1765K19449a4216o0021j36819G1873a14723
12689a25298A29764g3817k22589A70558M6029L1082c3646o2596B78168O5672a79285
12677b4629A36304k6493g8253B00443j3369k1452o4031e9608j13948a0540l2303
12666d2843A27210D8300b09203h2359A2451M22714B05321p9885f3706A96236p0090
12655A26146L66678A79322Q492a8537P140E5104J73482A2866Q8305b48392B59491
12643b8357j91514B06283f1678D596M821P2365p562M2116a36111I5433A6329b0016
$$ plain form
12630 403102 86262 259003 -235217 196996 180670 72916 -60746 207449 69356 338488
12620 338488 9111 99570 -143069 96628 253337 -43210 -69717 164892 175044 297505 80340
12608 267179 23840 263372 76158 180691 -14703 -117304 126885 -62563 14299 179361
12598 179361 259124 208654 115630 25899 302285 -15177 574856 -7160 154654 99536 4798
12586 182733 -232346 333748 80326 74343 -75274 428190 -65538 31919 -40897 -110323 273987
12574 -20661 345805 123539 116446 -42919 28664 30891 -73781 189677 16169 91756 119529
12563 119529 252967 -147653 65068 7638 118484 253800 -215487 -45515 214593 75575
12552 -190387 -100487 -14875 -159337 36337 -78771 172214 244291 72672 -156152 -14870 -36231
$$ packed form
12630D03102H6262J72741b35217A96996j6326G2916f0746B07449F9356K69132
12620C38488I111R0459a43069I6628J56709d3210k6507A64892J0152J22461H0340
12608B67179B3840K39532G6158J04533a4703j02601A26885f2563A4299J65062
12598A79361P9763n0470r3024B5899K76386a5177E74856g160A54654n5118D798
12586A82733b32346C33748H0326n983g5274D28190f5538C1919d0897o9426B73987
12574b0661C45805A23539p093d2919B8664K227g3781A89677A6169P5587K7773
12563A19529J33438a47653F5068G638J10846J35316b15487d5515B14593G5575
12552a90387Q9900a4875j44462C6337g8771A72214P2077G2672a56152a4870k1361
$$ plain form
12541 -36231 117580 -123532 -29792 -472 -69648 61602 -96863 -79702 -170836 91977 -76283 -60874
12529 -60874 106548 -40809 -109664 253224 148607 -133415 72172 -105618 122166 -166110
12518 172179 102108 124113 422944 -12622 166664 -282781 -145076 -296987 50124 -190767
12507 -86734 -2406 121958 179496 253963 70184 39746 86137 67977 -16290 200306 -350525
12495 86202 -134820 -569037 -125844 27522 -212060 -294420 -60505 133272 -216190 163182
12484 -182806 25811 128468 271462 -146100 -53005 25162 -187172 -171251 137199 94599
12474 94599 15616 -266176 -205721 231039 -212386 -109214 -26080 298945 -27838 -55848 333152
12462 -70360 142549 -73803 -356073 -63866 246247 53083 -281862 -105806 -213974 -34381
$$ packed form
12541c6231A17580a23532b9792d72o9176F1602i6863J7161r1134I1977g6283J5409
12529f0874A06548d0809o8855B53224j04617a33415G2172a05618A22166a66110
12518A72179p0071K2005K98831a2622A66664b82781J37705j51911E0124a90767
12507h6734b406A21958N7538P4467G0184l0438M6391j8160a6290B00306c50525
12495H6202a34820m34217a25844B7522b12060q2360f0505A33272b16190A63182
12484a82806B5811J02657J42994a46100e3005B5162a87172J5921A37199m2600
12474I4599A5616b66176O0455B31039b12386J03172b6080B98945b7838k8010C33152
12462g0360A42549g3803k82270f3866B46247E3083b81862a05806j08168c4381
$$ plain form
12451 63544 11861 28597 142624 83729 142576 49876 -170263 -209590 -133174 -7766 -43774
12440 -43774 -176711 -217163 -24116 -125011 -122891 33318 90180 -213938 33509 173870 10794
12428 7410 -212264 -35493 57533 268181 185764 -275276 -16419 -97830 -22623 -212805 -2693
12416 169358 -14252 98382 257658 207019 66981 -87121 317405 105644 -112206 181937
12405 9690 -104209 -59456 -215104 -189380 248114 125975 79432 220194 -95256 100487 44338
12393 168849 -58397 82911 163766 -55993 -60812 -137003 155681 -5879 -74536 -220479 156531
12381 -95124 -21311 34755 -221372 -17892 -163817 -171480 273419 -357409 -168761 -127904 -216221
12370 -216221 35809 110768 -152298 -26110 -133808 -595463 -39276 59240 20547 122092 182319
$$ packed form
12451F3544A1861J6736J14027n8895N8847D9876a70263l9327P6416g766l6008
12440d3774j32937m0452b4116j00895K120C3318N6862b13938C3509J40361A0794
12428G410b12264c5493E7533K10648q2417b75276a6419q1411b2623j90182b693
12416A69358a4252I8382J59276n0639F6981h7121C17405A05644a12206A81937
12405I690a04209M4753j55648K5724B48114j22139m6543J40762i5256A00487D4338
12393A68849e8397H2911Q0855e5993m819p6191A55681e879o8657j45943A56531
12381i5124b1311C4755b21372a7892j45925p663B73419c57409a68761M0857q8317
12370b16221C5809P4959a52298b6110j07698m61655c9276E9240B0547J01545O0227
$$ plain form
12359 182319 196496 -5004 -50357 -13197 -136892 -117137 -87604 -145522 -202576 -251748 18111
12347 -291209 45758 419911 98759 56538 -24991 19847 -41277 211247 102378 169533 161762
12336 161762 100439 -23451 -184793 318871 -154097 26022 197901 -223706 319731 -172305
12325 210937 214659 65682 169859 -171954 -142854 -267013 -57096 -105565 -58902 212734 -15004
12313 99166 16070 128758 -66547 -82255 74525 90506 -183778 57279 209277 7734 -33730
12301 -172665 -248674 35896 -377576 127829 564 -1696 59389 217351 444349 131794 232852
12290 232852 -181277 31657 -101004 143744 120312 -112632 205528 112829 -85510 24225
12279 214793 -136239 176046 191467 53885 164702 214340 -5080 240269 -34657 -94322 72736
$$ packed form
12359A82319J4177e004m5353a3197j23695J9755K9533n7918n7054m9172A8111
12347b91209D5758L74153I8759m2221b4991A9847d1277B11247A02378O7155p771
12336A61762o1323b3451j61342C18871a54097B6022J71879b23706C19731a72305
12325B10937L722F5682J04177a71954K9100j24159e7096m8469M6663B12734a5004
12313I9166A6070J12688f6547j5708G4525J5981a83778E7279J51998G734c3730
12301a72665p6009C5896c77576A27829E64a696E9389J57962K26998A31794J01058
12290B32852a81277C1657a01004A43744k3432a12632B05528r2699h5510B4225
12279B14793a36239A76046J5421E3885J10817M9638e080B40269c4657n9665G2736
$$ plain form
12267 298351 170457 -31005 -23856 -39493 118286 59761 167875 95700 282120 221516 137671
12256 137671 105254 73333 -23126 100538 -137225 -232798 -99898 -132830 197082 -167194 -2575
12244 188655 188808 278806 -119339 151901 274433 195209 349781 263606 240416 -4878 86072
12232 371682 84357 340183 230155 77129 63460 350251 324540 79491 238349 272518 -9953
12220 -53904 165531 329858 230972 42301 275711 304574 -42779 193296 66902 54790 121262
12209 121262 -5113 21449 294947 55152 41365 63637 67894 -59132 -39176 147807 268874
12198 268874 -108319 140240 220851 7983 18173 263530 149458 440330 15845 -10183 499201
12186 -27469 195459 -128273 336294 334322 111871 463688 214720 172093 311816 176148
$$ packed form
12267B98351j27894c1005P149j5637A18286n8525J08114p2175J86420o0604q3845
12256A37671l2417l1921b3126A00538a37225r5573i9898l2932A97082a67194b575
12244A88655J53Q9998a19339A51901J22532p9224J54572q6175k3190d878H6072
12232C71682H4357K55826j10028G7129j3669K86791k5711G9491J58858L4169i953
12220e3904A65531J64327r8886D2301K33410K8863d2779A93296F6902j2112O6472
12209A21262e113B1449K73498E5152j3787K2272M257e9132J9956A47807J21067
12198B68874a08319A40240Q0611G983J0190K45357j14072K90872A5845a0183D99201
12186b7469A95459a28273C36294j972A11871L51817B14720m2627J39723j35668
$$ plain form
12176 176148 138237 228962 -72934 383903 12404 360466 -68608 88366 306754 13031 351433
12165 351433 503619 8495 146755 146877 101942 250189 -170701 -119086 -52951 280381 241498
12154 241498 29005 288971 6349 243860 28233 294065 278244 -33794 58346 2795 218467
12143 218467 77532 123175 257769 -293410 344659 -88298 137140 -175404 86332 294342
12133 294342 -126787 161274 18034 111323 28984 -400971 -36399 22823 -204042 129075
12122 -81650 -25943 -211757 83985 93040 25142 73681 51146 59323 -47100 95922 -188928 397900
12109 87380 144501 5091 -182255 -222674 281793 -121424 -108815 -35485 -29178 84712 -75884
12097 -286158 123378 -31838 -80087 81221 -58074 27367 -133187 248383 -8436 -62917 206681
$$ packed form
12176A76148l7911R0725g2934C83903A2404L48062f8608H8366K18388A3031L38402
12165C51433J52186H495J38260J22m4935J48247a70701N1615e2951B80381l8883
12154B41498B9005K59966F349K37511B8233K65832j5821c3794E8346B795K15672
12143B18467G7532M5643J34594b93410C44659h8298A37140a75404H6332K08010
12133B94342a26787A61274A8034R3289B8984d00971c6399B2823b04042A29075
12122h1650b5943j85814H3985R055B5142M8539k2535Q177d7100I5922a88928C97900
12109H7380N7121E091a82255m0419B81793a21424J2609c5485O307H4712g5884
12097b86158A23378c1838m8249H1221e8074B7367a33187B48383h436n4481B06681
$$ plain form
12085 127625 -129368 106563 -111019 203723 -12876 49988 145684 303947 1945349 1835678
12075 1835678 415746 183176 21893 -269763 45523 -283571 434465 279691 45098 -254213
12064 -52507 10370 -294494 150780 -244055 88830 41201 247814 -83318 -211127 -78173 -43845
12053 -43845 -186341 131895 44541 -76885 -160741 -11246 301827 -202765 -73231 -65469 -431997
12042 -431997 90572 21488 -188964 31976 -148418 -199881 64424 -221287 -159821 167909 12993
12030 181414 224134 -194241 -183170 -152066 -43882 117298 82595 -77172 -179552 227080 119307
12019 119307 -6368 152704 -113365 -6961 297976 321575 -255943 -62849 -6097 -19472 -38618
12008 -38618 -38786 -173024 218655 93000 -218881 -161056 -67551 110408 -180530 -92274 -33383
$$ packed form
12085A27625a29368A06563a11019B03723a2876D9988R5696J58263J641402j09671
12075A835678D15746A83176B1893b69763D5523b83571D34465j54774D5098b54213
12064e2507A0370b94494A50780b44055H8830D1201K06613h3318j27809g8173L4328
12053d3845j42496A31895D4541g6885q3856a1246C01827b02765g3231P762l66528
12042d31997I0572B1488a88964C1976a48418n1463F4424b21287O1466A67909A2993
12030A81414M2720a94241J1071L1104d3882A17298l4703g7172j02380B27080j07773
12019A19307f368A52704a13365f961B97976K3599b55943f2849f097j3375j9146
12008c8618j68j34238B18655I3000b18881N7825f7551A10408a80530Q8256c3383
$$ plain form
11996 88994 -47578 90727 26897 -7358 -171825 -88054 114885 42175 -201337 27898 -6367
11984 -178721 -192400 -99607 9090 -144667 8717 -235061 -411552 272016 -124189 -248008 -51650
11972 23102 208443 12055 -201311 42883 -22167 -13852 317622 -277840 -8815 -95202 -327910
11961 -327910 -97445 -40730 15890 -355254 240277 -167262 3056 -414630 51404 26009 -206728
11949 -7493 200958 -65245 226679 171423 -17327 115229 -99216 28359 115273 29729 -149476
11937 59096 31360 100192 -36664 -250344 89975 -36903 101122 22438 158034 -144442 -36279
11925 -385704 -176527 -51284 193807 112853 -88986 -196673 -110939 -95616 98672 201719 -31880
11913 -47615 -138334 -149738 -25688 167708 5080 178086 154166 -183288 -192615 116645 -61125
$$ packed form
11996H8994d7578I0727B6897g358j64467Q3771A14885D2175b01337B7898f367
11984a78721j3679R2793I090a44667H717b35061j76491B72016a24189j23819e1650
11972B3102J85341A2055b01311D2883b2167Q315C17622b77840h815q6387k32708
11961c27910i7445d0730A5890c55254B40277a67262C056d14630E1404k5395b06728
11949g493B00958f5245B26679n5256a7327A15229i9216B8359Q6914B9729a49476
11937E9096k7736O8832c6664k13680H9975c6903A01122B2438J35596a44442c6279
11925c85704a76527e1284A93807q0954h8986j07687Q5734J5323I8672J03047c1880
11913d7615r0719j1404b5688A67708E080J73006k3920a83288r327A16645f1125
$$ plain form
11901 -12325 -576511 78632 -336406 246185 75201 212106 -54828 -542609 158852 67442
11890 -58504 33724 -70405 -198946 166050 -83851 120342 351799 249608 16004 184186
11880 184186 -121275 136595 -202431 70373 -20514 170699 153467 -20521 257236 70162
11869 285176 -12345 15451 31200 203145 144971 -127248 -264993 -23522 55322 177138 -13804
11857 111747 -163080 -129640 -20553 -213791 -79214 217500 152243 -234261 -243643 99593 141067
11846 141067 142672 54080 67997 221147 -458623 -199381 27975 -130386 -132990 -5583 12768
11834 209156 -343638 -284816 -21503 133401 -71139 338995 -240798 27397 -51289 -41596 -158731
11823 -158731 185954 -98414 -278204 159556 -68650 28140 87483 -74155 85300 111808 -32483
$$ packed form
11901a2325n64186G8632c36406B46185G5201J36905e4828m87781A58852F7442
11890e8504C3724g0405j28541A66050h3851A20342K31457j02191A6004J68182
11880A84186a21275A36595b02431G0373b0514A70699j7232b0521B57236G0162
11869B85176a2345A5451J5749J71945n8174a27248j37745b3522E5322J21816a3804
11857A11747a63080L3440b0553j93238g9214B17500o5257b34261r382I9593M1474
11846A41067J605E4080J3917J53150d58623a99381B7975a30386k604e583A2768
11834B09156c43638N8822b1503A33401g1139C38995b40798B7397e1289R693j17135
11823a58731A85954i8414j79790A59556f8650B8140N9343g4155H5300K6508c2483
$$ plain form
11811 -224177 48111 -81226 -126437 22510 131054 -37925 112777 -430348 925 -306583 -31605
11799 6454 130669 7439 139041 -11703 -190764 -46117 -137933 -11413 -192024 9421 -185407
11787 -195079 -4054 -191048 -76708 -145211 102387 -20368 -250576 -122712 58405 -11447 -89927
11776 -89927 412467 -7484 -359307 -32929 78853 -198609 -72522 63308 -205113 -531895 352555
11764 33865 -235938 -242543 -29274 94750 -75419 -120034 230458 -88853 329116 161497 33567
11752 9716 -14712 -218534 -41715 -38716 -73168 203489 55404 107660 -330797 -54385 -154385
11741 -154385 -85438 21675 -161846 170076 -35078 -146385 264312 -97679 4991 -332930 232114
11729 -23389 23701 -98220 -163869 95255 327573 -86570 55286 324131 44244 -57072 100736
$$ packed form
11811b24177D8111h1226m5211B2510J08544c7925A12777d30348I25c06583c1605
11799F454J24215G439J31602a1703j79061d6117r1816a1413j80611I421a85407
11787a95079d054j86994g6708o8503A02387b0368k30208a22712E8405a1447p8480
11776h9927D12467g484l51823c2929G8853a98609g2522F3308b05113l26782C52555
11764C3865b35938o605b9274I4750g5419m4615B30458h8853C29116A61497C3567
11752I716a4712k03822d1715K999l4452B03489E5404N2256c30797e4385j00000
11741a54385O8947B1675a61846A70076c5078j11307B64312i7679D991c32930B32114
11729b3389B3701i8220o5649I5255K32318h6570E5286K68845D4244e7072A00736
$$ plain form
11717 -316819 208887 -65416 -150193 98080 -80435 82331 -217897 -226665 -7077 33724 -96067
11705 -26878 255822 -230663 80489 -116073 -13858 -46723 24968 194168 127744 61521 131849
11694 131849 89825 204384 -44013 -274479 28636 30276 -83273 -84979 145837 191306 -97409
11682 98074 196397 -15292 -45228 178133 8189 -126782 72976 176710 -26976 -36912 98106
11670 1349 -86486 -257948 357103 -375376 -62145 37623 291098 19287 -238210 160752 -11499
11658 69384 26403 143655 248560 203702 59474 -74571 -26470 14273 -71188 42484 -251884
11646 28735 -67588 59709 64776 125847 96177 92171 -119096 134267 -31226 232641 341785
11635 341785 96387 89638 144856 158988 -180160 221636 -401060 -105705 183593 -34752 96819
$$ packed form
11717c16819B08887f5416q4777I8080h0435H2331b17897q768g077C3724i6067
11705b6878B55822b30663H0489a16073a3858l2865B4968J69200o6424F1521P0328
11694A31849m2024J14559d4013k30466B8636J640h3273j706A45837M5469i7409
11682I8074R8323a5292k9936A78133H189a26782G2976J03734b6976r936I8106
11670A349h6486j71462C57103c75376f2145C7623K53475A9287b38210A60752a1499
11658F9384B6403J17252J04905m4858E9474g4571b6470A4273g1188D2484b51884
11646B8735f7588E9709N067O1071k9670m006a19096A34267c1226B32641J09144
11635C41785I6387o749N5218J4132a80160B21636d01060a05705A83593c4752I6819
$$ plain form
11623 196296 255654 -159377 198604 -92536 -39549 -404489 -260183 -180958 -56216 -167086
11613 -167086 59825 157273 152899 27092 -312307 -123379 104082 -53107 -193024 -67521 114671
11601 344433 -157102 -86910 104404 -171315 114768 149556 -75838 198995 41342 10160
11590 -2881 188189 -267990 204086 121240 -64062 132170 189867 50265 24392 83142 74013
11579 74013 151594 -178805 212376 110964 -134882 148451 199117 10526 145047 -5894 39872
11567 173961 -47405 273677 299502 -3726 80005 190555 -58156 -6541 -51529 -307332 239233
11555 -42609 -120361 92159 -15289 -455676 56170 82257 265040 199143 100951 -176971 59058
11543 150562 30742 244170 80846 228293 -238284 -27705 174393 -38171 -103590 182247
$$ packed form
11623A96296N9358a59377A98604i2536c9549l64940J44306P9225e6216j10870
11613a67086E9825R7448m374B7092c12307a23379A04082e3107j39917f7521A14671
11601C44433a57102P0192A04404a71315A14768L4788g5838A98995D1342A0160
11590b881A88189b67990B04086q2846f4062A32170N7697E0265B4392N8750r129
11579G4013P7581a78805B12376j01412a34882A48451N0666A0526J34521e894C9872
11567A73961d7405B73677K5825c726H0005J10550e8156f541m4988k55803B39233
11555d2609p7752I2159a5289m40387E6170K6087J82783o5897r8192a76971E9058
11543A50562C0742K13428H0846J47447b38284b7705A74393c8171o5419A82247
$$ plain form
11532 65364 -150286 107087 -16467 52021 201863 263226 -127667 185076 250641 -71521 158790
11520 195506 166423 -235394 -51455 53932 -311118 147204 19200 -63710 375933 2377 153713
11509 153713 -27371 246803 238203 -221668 153969 92053 297275 245700 194577 60003 38340
11498 38340 730 181747 399078 20263 145818 127297 -50067 22147 59202 -53095 94281
11486 58611 19353 58211 -33150 -31054 -189690 -74876 62996 320127 1551 89886 175884 43533
11473 48046 142650 117236 25086 67134 31002 -199237 88769 317350 37856 31792 11637
11461 395839 -30600 261085 -87684 -56318 86518 228102 -127294 -311601 218243 223444 -177166
11449 -27929 131678 265397 -164403 275667 108030 149794 149881 305175 81603 138573 82148
$$ packed form
11532F5364a50286A07087a6467E2021J49842O1363a27667A85076O5565g1521A58790
11520A95506k9083b35394e1455E3932c11118A47204A9200f3710C75933B377J51336
11509A53713b7371B46803q600b21668A53969o1916K05222n1575n1123F0003k1663
11498C8340G30J81017K17331B0263J25555j8521e0067B2147L7055e3095I4281
11486E8611A9353L8858c3150K096j58636g4876F2996K57131A551Q8335Q5998D3533
11473D8046R4604k5414B5086M2048C1002a99237H8769K28581C7856o064A1637
11461C95839c0600B61085h7684L1366H6518J41584a27294j84307B18243N201a77166
11449b7929A31678J33719a64403B75667A08030M1764Q7J55294H1603N6970n6425
$$ plain form
11438 82148 -123152 79756 -52693 32008 200606 -44586 3136 -129973 -139904 304851 213597
11427 213597 -118565 -98186 -127552 -253385 171556 24942 159740 117227 -249200 177041
11416 345108 157692 -293054 -4864 -7484 -87358 74291 -296407 321402 171606 149128 156283
11405 156283 -13390 253899 63883 -52210 253739 -208979 197151 158743 -310570 377964
11394 326408 94097 244882 227946 423772 260383 -101656 -139378 -14840 -294682 -213456
11384 -213456 222124 120768 92839 -76120 -38409 52226 -207519 -154226 -29997 -182650 330277
11372 28624 368380 157078 131424 76233 26301 -93534 -246582 178337 -78690 80563 -152976
11360 -270010 68924 -12839 -303068 -165769 335163 -291365 -13322 -66053 -107113 37454 242770
$$ packed form
11438H2148a23152G9756e2693C2008J68598d4586C136a29973r931C04851r1254
11427B13597a18565K0379k9366j25833A71556B4942J34798m2513b49200A77041
11416C45108A57692b93054d864k620p9874G4291b96407C21402j49796k2478P155
11405A56283a3390B53899F3883e2210B53739b08979A97151l8408c10570C77964
11394C26408I4097J50785j6936J95826j63389a01656l7722a4840k79842Q1226
11384b13456B22124j01356k7929g6120L7711E2226b07519N3293b9997j52653C30277
11372B8624L39756A57078k5654n5191B6301i3534j53048A78337g8690H0563a52976
11360b70010F8924a2839k90229J37299C35163b91365a3322n2731m1060C7454K05316
$$ plain form
11349 242770 -592 223163 68890 121657 -2356 -12780 -90267 92434 64434 184423 5063 -139046
11336 -213544 -16833 -241098 339576 91294 233176 -92124 -21284 100212 16943 132195
11326 132195 -257235 -236241 -42369 94749 -30699 147797 -103280 -158574 185708 106563 154454
11315 154454 -20323 178067 220312 -192013 -126609 -64657 -105145 140237 232293 190451 -190808
11303 216779 -381859 144495 316304 30009 34752 -173469 -70842 37237 -345201 184637
11292 188803 -84187 -108714 102285 376884 -94594 234811 -165096 -121076 -51874 -468659
11282 -468659 156188 -235924 79327 51192 35827 -12681 -126980 -107888 -305774 210307
11271 -134752 173127 70310 17438 -189045 6261 -12973 -14107 -193290 186427 101181 57016
$$ packed form
11349B42770e92B23163F8890N2767b356j0424p7487I2434k8000J19989E063a39046
11336b13544a6833k24265C39576I1294J41882i2124b1284A00212A6943J15252
11326A32195b57235K0994d2369I4749c0699A47797a03280n5294A85708p9145M7891
11315A54454b0323A78067M2245a92013O5404O1952m0488A40237R2056m1842a90808
11303B16779c81859A44495J71809C0009M743a73469g0842C7237c45201A84637
11292A88803h4187k4527A02285K74599i4594B34811a65096M4020e1874m16785
11282d68659A56188b35924G9327k8135j5365a2681j14299J9092j97886B10307
11271a34752A73127G0310A7438a89045F261a2973j134j79183A86427q5246m4165
$$ plain form
11260 57016 -71626 -55473 -29652 120289 -83669 -82131 236301 -83471 120593 -104975 -95914
11249 -95914 -299112 154801 -183671 -166327 113540 -121511 120118 -136079 -92849 -128216
11239 -128216 189509 172572 -311480 -254603 177751 46346 -257825 254388 272612 -172882
11228 -231265 -374548 200649 -167304 37671 -247599 -48440 -225597 307726 51115 -215099
11217 266270 -257231 -70012 -63904 294930 -87369 -130046 91330 -405137 -130353 -67044 53176
11205 -27141 -65674 28968 -76434 -51731 -142292 -237465 11548 -392 -317078 224422 267130 -91218
11192 -343639 -93962 223196 38103 119289 134967 -12330 2893 -163736 29571 306254 -226492
11180 -274755 -5368 903 15058 -150597 -57741 108017 -136444 -46034 -76854 63302 -273420
$$ packed form
11260E7016g1626J6153K5821A20289h3669J538B36301h3471A20593a04975R061
11249i5914k03198A54801a83671J7344A13540a21511A20118a36079M3230l5367
11239a28216A89509j6937c11480N6877A77751D6346b57825B54388J8224a72882
11228b31265j43283B00649a67304C7671b47599d8440j77157C07726E1115b15099
11217B66270b57231g0012O108B94930h7369m2677I1330d05137a30353O3309E3176
11205b7141l8533B8968g6434K4703r0561r5173A1548c92l16686B24422M2708i1218
11192c43639i3962B23196C8103Q1186J5678a2330B893a63736B9571K76683b26492
11180b74755e368I03J4155a50597e7741A08017a36444d6034l0820F3302b73420
$$ plain form
11168 -55480 -172547 -116044 166031 -32815 52940 -303309 13289 -282133 -41141 -189451 -19977
11156 168335 -64052 -144675 161116 173248 154219 161015 -14291 211939 335947 -18709 -114799
11145 -114799 369080 -75009 -102719 -68730 43480 -135207 -39010 63062 -183857 75123 -152145
11133 -89896 134050 -232044 -6388 4261 -40618 96836 180005 122833 -94311 99124 -23170 -70441
11121 -70441 200925 27701 273643 -41916 190928 -92887 -269385 -208502 111069 -118557
11110 34506 -29224 -192607 173315 -190377 267723 407400 250788 148057 160262 230795
11100 230795 201648 224907 -279654 332854 76245 129079 207731 306978 -42295 -174626 341239
11088 115315 179810 270527 324693 211393 505320 433997 326738 341344 263152 213672 210542
$$ packed form
11168e5480j17067N6503A66031c2815E2940c03309A3289b82133d1141j48310a9977
11156A68335f4052q0623A61116J2132j9029O796a4291B11939J24008a8709r6090
11145a14799C69080g5009k7710L3989D3480a35207c9010F3062a83857G5123a52145
11133h9896A34050b32044f388D261d0618I6836Q3169n7172i4311I9124b3170m7271
11121g0441B00925B7701K45942d1916A90928i2887j76498O0883A11069a18557
11110C4506b9224j63383A73315a90377B67723J39677j56612j02731J2205P0533
11100B30795k9147K3259b79654C32854G6245N2834P8652R9247d2295j32331C41239
11088A15315O4495R0717N4166j13300K93927p1323j07259J4606p8192m9480l130
$$ plain form
11077 210542 145791 461721 264594 -2895 459798 601837 99359 276484 121999 555607
11067 555607 395919 227094 68333 420959 299137 618023 240929 328554 256066 787190
11057 787190 511167 490597 499052 520985 449932 470481 390003 294765 315432 991082 916295
11046 916295 491595 459797 751298 515028 422489 663810 695299 818289 427330 786839
11036 786839 736055 679959 1083870 577540 503045 561795 602077 551481 895161 592509 702528
11025 702528 633131 724700 532220 768746 910027 650728 540091 851707 458071 675309
11015 675309 857041 366796 588925 365747 475250 804721 762935 368198 720905 292164
11004 543356 739173 708376 629951 503772 736368 662065 653682 877158 466753 806349
$$ packed form
11077B10542o4751L15930j97127b895D59798J42039I9359J77125A21999M33608
11067E55607j59688j68825F8333L52626j21822L18886B40929Q7625p2488N31124
11057G87190k76023k0570Q455K1933p1053K0549q0478r5238K0667O75650p4787
11046I16295m24700l1798K91501k36270r2539K41321L1489J22990l90959L59509
11036G86839n0784n6096M03911n06330p4495N8750M0282n0596L43680l02652J10019
11025G02528o9397R1569j92480K36526J41281k59299j10637L11616l93636K17238
11015F75309J81732C66796K22129k23178J09503L29471m1786C68198L52707B92164
11004E43356J95817l0797p8425j26179K32596p4303q383K23476m10405L39596
$$ plain form
10994 806349 859438 759835 620968 632761 759755 906278 1006656 921614 1150373 794254
10984 794254 1073621 1199653 512997 986758 1355173 1339560 1305393 1586367 1625695 1923958
10974 1923958 2373117 2461313 2910224 2583395 2846246 2647395 2379751 2015204 1780775 1501244
10964 1501244 1565295 1620592 1588369 1650723 1742658 1664327 1966455 1660292 1506920 1448668 1391745
10953 1391745 916666 1370280 906088 513948 612122 194579 180196 501680 331236 443016
10943 443016 357822 516059 370620 365559 362615 173800 585006 -79238 85852 398419 374938
10932 374938 327712 56213 13446 99527 162804 -70264 -64806 198336 103864 -7341 -23053 -31739
10920 -31739 118844 217263 -115282 -146622 -326078 216099 -119558 237019 111453 40978
$$ packed form
10994H06349N3089r9603j38867J1793J26994J46523J00378q5042K28759l56119
10984G94254K79367J26032E12997M73761L68415j5613l4167K80974L9328K98263
10974A923958M49159Q8196M48911l26829K62851j98851k67644l64547k34429k79531
10964A501244O4051N5297l2223O2354R1935p8331L02128l06163j53372n8252n6923
10953A391745m75079M53614m64192l92140R8174A94579j4383L21484j70444J11780
10943D43016q5194J58237j45439n061k944A73800M11206g9238H5852L12567k3481
10932C74938m7226E6213A3446Q6081O3277g0264N458A98336r4472g341j5712q686
10920c1739A18844R8419a15282l1340j79456B16099a19558B37019A11453D0978
$$ plain form
10909 271906 -95836 -88666 120946 -183074 124857 -60035 25397 -289593 -322156 37142 201071
10898 201071 227125 -40473 29127 145181 84093 -24876 -233231 27231 -45155 -33421 149067
10886 -55602 -23632 -192310 96138 -39382 210717 180495 -5437 186837 -21267 232780 157400
10875 157400 -39873 -341489 -194580 76250 -242529 -447294 -37176 -44987 -10290 -52016 -57517
10864 -57517 198214 -167952 -155196 -71487 -213268 -97343 -256693 8346 125394 14620 104975
10853 104975 -49245 -244482 -80585 56195 -2450 -157815 -12613 -407885 75209 -180739 150363
10841 26537 -79831 -255976 60699 73741 -288304 -136106 -128675 -100107 101672 -201268 18514
10829 -74477 25502 74433 3398 -73288 -82664 185520 -213711 71449 127581 135525 -71623 -283834
$$ packed form
10909B71906i5836P170A20946a83074A24857f0035B5397b89593l2563C7142J63929
10898B01071K6054d0473B9127J16054o1088b4876k08355B7231d5155J1734A49067
10886e5602b3632j68678I6138c9382B10717l0222e437A86837b1267B32780p5380
10875A57400c9873l01616J46909G6250b42529k04765c7176p811a0290m1726n501
10864e7517A98214a67952J2756g1487j41781i7343j59350H346J17048A4620R0355
10853A04975d9245j95237h0585E6195b450j55365a2613l95272G5209a80739A50363
10841B6537g9831j76145F0699J3042b88304a36106P431K8568A01672b01268A8514
10829g4477B5502M8931C398g3288r376A85520b13711G1449N6132P944g1623k12211
$$ plain form
10817 -283834 16805 -129107 92891 55665 51857 148840 117470 119136 -127015 -283666 -344826
10806 -344826 -259789 288794 -37465 89705 56956 112938 73439 31620 -219797 335328 97744
10794 162278 192376 -43155 14889 -252055 -120904 -210667 118348 -23600 77652 130925 328954
10783 328954 -226570 7266 289398 107616 -207428 22513 -151006 -307936 -171012 -128551
10773 -128551 -64419 73365 -187116 -176707 -14760 -115316 -225919 -133674 -339680 -142075
10762 262743 96559 44119 -51050 -76686 -197776 -210443 -465720 -64207 -196413 50024 -182974
10750 -18416 -341976 -109794 -37912 -95591 -14881 116483 44522 -400415 106104 175474 -213449
10738 41750 -220970 -194370 -272565 -60316 -128954 -212442 26839 10974 -228694 -16714 -48765
$$ packed form
10817b83834A6805a29107I2891l7226l808R6983l1370J666a27015j56651o1160
10806c44826Q5037B88794c7465H9705l2749N5982l9499C1620b19797C35328I7744
10794A62278L0098d3155A4889b52055a20904q9763A18348b3600G7652N3273J98029
10783C28954b26570G266K82132A07616b07428B2513a51006j56930J36924M2461
10773a28551O4132G3365a87116J0409a4760j00556j10603R2245k06006a42075
10762B62743I6559D4119e1050k5636j21090j2667k55277f4207j32206E0024a82974
10750a8416l23560a09794c7912n7679a4881A16483D4522d00415A06104O9370b13449
10738D1750b20970K6600p8195f0316o8638q3488B6839A0974b28694a6714l2051
$$ plain form
10727 -48765 -108269 17549 -62480 -923 281401 -121980 446240 -72005 -24255 -185760 -90440
10715 -154037 -255801 -73925 -28002 -74313 234977 -120685 -52318 -131561 -143131 -16418 31583
10703 -280724 -10322 -33202 4025 -281298 -84398 -39838 47639 -151435 -7559 -98870 -195570
10692 -195570 -76357 -127619 41565 -103901 -398632 -275310 -263018 -25002 58007 -13197 -132711
10681 -132711 -37235 182757 145193 105738 -43467 -221599 -49181 -44766 -76821 -219253 -36709
10669 217916 26243 -95457 261123 -123397 186695 -181795 -233245 -13426 -10358 -87402 -330958
10658 -330958 -161740 -209039 150768 -16531 225857 -72318 55551 271483 155429 133902
10648 133902 -91931 -174744 188979 365914 211093 -256454 -215237 -45469 153963 -76350
$$ packed form
10727d8765n9504A7549f2480i23B81401a21980D46240g2005b4255j61505i0440
10715a54037j01764g3925b8002m6311B34977a20685e2318p9243j1570a6418C1583
10703b80724a0322k2880D025b81298h4398c9838D7639a51435g559r1311r6700
10692a95570g6357n1262D1565a03901k94731J23322J2292b5002E8007a3197j19514
10681a32711c7235A82757l7564l9455d3467j78132d9181M415l2055j42432c6709
10669B17916B6243i5457B61123a23397A86695a81795n1450a3426L068p7044k43556
10658c30958a61740m7299A50768a6531B25857g2318E5551K15932j16054k1527
10648A33902i1931q2813A88979J76935j54821b56454M1217d5469A53963g6350
$$ plain form
10637 -4153 42327 59952 15954 35804 -321522 158014 -105605 -9258 -57705 -306702 21036
10625 51422 207079 -160247 13883 -85215 119868 143666 23355 -346205 39671 37181 147714
10614 147714 198613 -352563 -208532 -117765 -160591 120718 -161118 91257 -54772 249979
10603 -64950 108963 -78190 -83971 52215 155454 80828 -119597 -7082 -371382 32204 -323963
10591 -18159 -218093 284594 -429930 146837 -195739 -30204 -19441 -101551 48755 -354444
10580 292394 -139183 -142352 263925 -52243 -13186 -209334 -189157 -128935 77764 102380 -120645
10568 -37646 161766 -2148 -150489 91233 30499 420 70519 -104198 -120408 -113821 171515 88537
10556 88537 -144979 231906 -153506 -167697 360260 -25403 -15263 -17223 8128 118576 114676
$$ packed form
10637d153D2327J7625A5954J9850c21522A58014a05605i258m8447k48997B1036
10625E1422J55657a60247A3883h5215A19868K3798B3355c46205C9671k490J10533
10614A47714N0899c52563J44031R0767m2826A20718a61118I1257e4772B49979
10603f4950A08963g8190n781E2215J03239p4626a19597g082l64300C2204c23963
10591a8159j99934B84594d29930A46837a95739c0204J0763q2110D8755c54444
10580B92394a39183l169B63925e2243a3186j96148K0177O0222G7764K4616a20645
10568c7646A61766b148j48341I1233C0499D20P0099a04198j6210O587A71515q2978
10556H8537a44979B31906a53506j4191C60260b5403J0140j960H128J10448l900
$$ plain form
10545 114676 -82618 -111087 -234143 -156486 -152740 23022 298479 -1462 3316 322858 39150
10533 128288 -72646 164105 -39011 -460715 45847 13215 -224380 -181897 -155917 -104575 -194842
10522 -194842 -14175 29475 -138892 -87872 -124319 154995 -287232 -142168 79053 64429 -85013
10510 119362 74959 -234742 187758 -57246 -189139 -155547 232806 -9466 -127265 -171030 -221842
10499 -221842 -75625 -106501 -32818 -101851 69250 -217027 14273 404544 169543 143913 113073
10488 113073 -172556 143810 -3921 -151884 86818 225614 509928 387170 369550 242707
10478 242707 104961 309543 298628 -113779 1736 -206561 118295 -174619 295633 239293
10468 239293 59251 -139195 -132570 92371 -80899 -350138 -11069 -115176 -247523 -65191 -323546
$$ packed form
10545A14676h2618k8469j23056P7657L746B3022K75457a462C316L19542C9150
10533A28288g2646A64105c9011m21704D5847A3215b24380M2483K5980N1342r0267
10522a94842a4175B9475a38892N1020l6447A54995b87232a42168G9053j4624h5013
10510A19362m4403b34742A87758e7246j31893L3592B32806i466j17799m3765n0812
10499b21842g5625l0876c2818o9033F9250b17027A4273L90271A69543k5630l0840
10488A13073a72556A43810c921j47963H6818J38796K84314j22758j7620j26843
10478B42707A04961K04582j0915a13779A736b06561A18295a74619B95633n6340
10468B39293E9251a39195O625I2371h0899k69239a1069j04107j32347f5191k58355
$$ plain form
10457 -323546 -154942 -17277 107013 -207783 -189696 -200584 -7826 -42404 -78171 -50082 -13395
10445 -94102 -13523 -117094 -64508 214210 -200731 90533 -180375 -243779 -60536 -115645 81802
10433 -192244 -3142 -42951 -144834 -280576 -24588 64667 210141 -39381 45048 99457 -111620
10421 -115415 35399 201772 27621 -6057 309519 -260734 -198255 -164007 18986 191235 -103086
10409 77252 65836 -339892 -285939 -85556 -438201 111886 -234603 6362 -225868 371587 -187706
10397 88345 83092 -300939 91143 -80852 172722 60676 182881 172776 394639 72397 -63265
10385 -25449 135657 101329 247953 203140 82979 11961 64943 402995 159420 98437 84187
10374 84187 215442 127995 -69960 765645 199520 259031 334219 53486 490691 141376 348470
$$ packed form
10457c23546a54942a7277A07013b07783J8087j0888g826l4578l5767K8089a3395
10445i4102a3523j03571N2586B14210b00731I0533a80375o3404f0536n5109H1802
10433a92244c142l9809j01883j35742b4588F4667J45474c9381D5048N4409a11620
10421a15415C5399J66373B7621f057C09519b60734O2479L4248A8986J72249a03086
10409G7252j1416c39892N3953h5556l52645A11886b34603F362b25868C71587a87706
10397H8345n253c00939I1143h0852A72722F0676J22205j0105K21863G2397f3265
10385b5449A35657l4328J46624m4813H2979A1961N2982L38052A59420o0983j4250
10374H4187J31255q7447f9960G65645A99520N9511P5188E3486M37205A41376K07094
$$ plain form
10363 348470 284218 322848 149439 285782 79141 235321 63386 417136 19812 -32703 139671
10351 653280 278715 381844 445226 527459 420062 536314 390914 445076 107021 249518
10341 249518 -4050 326689 260402 202870 -62585 435178 49359 355352 172880 245542 -54013
10329 270017 211336 408766 292374 16920 141570 255747 365042 210801 407275 243550
10319 243550 233706 -174066 91122 179156 144350 46026 -183827 333284 124727 80451 -228579
10307 235386 -169822 -92915 -211701 32639 -175388 -100149 83604 -367456 -24732 -100414 33632
10295 126408 -188044 -129295 275519 -84546 -2876 -23695 -169142 123566 -56333 -339858 -142144
10283 85612 -55878 -66026 -210540 14381 -23493 -98061 -170945 272311 -490774 -167095 -142060
$$ packed form
10363C48470o4252L8630A49439J36343G9141J56180F3386L53750A9812c2703A39671
10351F53280B78715J03129O3382Q2233j07397J16252j45400N4162A07021J42497
10341B49518d050C26689o6287n7532f2585D35178D9359L05993A72880P2662e4013
10329B70017n8681J97430j16392A6920J24650J14177J09295j54241J96474j63725
10319B43550r844a74066I1122Q8034l4806D6026a83827C33284A24727m4276b28579
10307B35386a69822P6907j18786C2639a75388P5239H3604c67456b4732p5682C3632
10295A26408a88044N8749B75519h4546b876k0819j45447A23566e6333k83525a42144
10283H5612e5878j0148j44514A4381b3493p4568p2884B72311d90774a67095K5035
$$ plain form
10272 -142060 -79027 87388 -351829 135055 89632 185860 -55523 -193808 217171 -18574 -63415
10261 -63415 176819 377767 65916 128889 363374 -22687 226660 -69433 -159499 -31384 144646
10249 58190 70010 -91350 63281 -142225 153096 -377265 206499 203364 65892 135484 155294
10238 155294 -304502 -192625 -79519 -100319 173561 -77265 298295 -113103 -116510 26720 -297349
10226 -125121 27253 -349103 36843 10421 -205191 -158594 219782 134856 -55890 185981 -147818
10214 29964 33733 -263990 119963 -57780 -193851 228245 234348 131480 -139519 107446 -153182
10202 137207 -54871 195788 12078 -8311 -520510 121647 -134374 -266178 -40712 -215314
10192 -215314 50733 -209575 -79384 143662 -162125 235513 40070 39665 -147318 -391856 -73413
$$ packed form
10272a42060O3033H7388c51829A35055m5423R6228e5523j38285B17171a8574m4841
10261f3415A76819K00948F5916O2973K34485b2687B26660f9433r0066c1384A44646
10249E8190J1820i1350F3281a42225A53096c77265B06499l135F5892O9592J9810
10238A55294c04502J11877g9519k0800A73561g7265B98295a13103l407B6720b97349
10226a25121B7253c49103C6843A0421b05191M6597B19782q4926e5890A85981a47818
10214B9964L769b63990A19963e7780j36071B28245O103j02868a39519A07446a53182
10202A37207e4871A95788A2078h311n12199A21647a34374j31804d0712j74602
10192b15314E0733b09575g9384A43662a62125B35513D0070m05a47318k44538g3413
$$ plain form
10180 142052 -149061 -7699 34706 -350912 157945 -226815 -149241 -312406 13486 130490
10170 130490 -31653 180850 -167126 -107926 257696 152711 -312569 -98837 123518 97999
10160 97999 -44958 -83264 -427474 -6448 161205 95087 -85391 -42348 -207769 78892 -206618
10148 139280 -64868 89384 84393 -410073 184221 217223 -19327 -130782 -276681 -184697 -105060
10137 -105060 123156 -77075 -178164 -52629 185895 -16026 -330134 127365 -77492 -133074
10127 -133074 -86283 -125044 39733 -3670 20751 -217686 -182088 -3941 123614 -138132 283962
10115 184327 11676 256192 -148861 -297592 -164891 129806 273595 -51259 -56 -134283 209225
10103 -270544 40464 -167497 -67705 -31685 -267932 198097 -101614 -252637 168605 69990
$$ packed form
10180A42052a49061g699C4706c50912A57945b26815P7574j63165A3486J17004
10170A30490c1653A80850a67126N9200B57696j04985c12569i8837A23518k5519
10160I7999d4958l8306l44210f448A61205o6118h5391d2348j65421G8892b06618
10148A39280f4868H9384m991d10073A84221L3002a9327j11455j45899R1984P9637
10137a05060A23156g7075j01089e2629A85895a6026l14108A27365g7492n5582
10127a33074M6791l8761C9733c670B0751b17686L5598c941A23614a38132B83962
10115A84327A1676K44516a48861j48731J32701A29806J43789e1259e6j34227B09225
10103b70544D0464a67497f7705c1685k36247A98097a01614j51023A68605F9990
$$ plain form
10092 -143204 156877 65611 39262 -248488 -117328 113876 -132575 -7640 93969 48889 -42426
10080 -62617 -232071 -169580 -61400 -228466 -26596 -138140 27491 -415043 -133339 43599 7832
10068 -218347 81761 -112200 251816 -179457 251344 123674 303595 -151029 -109195 -77373
10058 -77373 137765 24969 -250318 45888 -90669 -81337 -123596 -176841 -535313 -85728 85832
10046 -244310 -85601 -120392 -8121 3190 -169317 131679 37137 -65070 -76708 -308162 -72469
10034 98904 -355436 77643 -65776 -90352 -349571 -279137 130881 18017 311129 32180 -90334
10022 -143292 -213614 -91133 -337837 126443 -74897 -196653 -61677 -160299 247822 -252919
10011 -364440 -34561 -82801 141998 -83160 215783 -178809 121953 -153601 44150 180329
$$ packed form
10092a43204A56877F5611k6349b48488a17328A13876a32575g640I3969m5080d2426
10080f2617j69454O2491f1400j67066b6596j11544B7491d15043a33339D3599G832
10068b18347H1761a12200B51816a79457B51344A23674J79921a51029M1834L1822
10058g7373A37765B4969b50318D5888i0669R332m2259n3245l58472h5728H5832
10046b44310h5601l4791h121C190a69317A31679C7137f5070j1638k31454g2469
10034I8904c55436G7643f5776k4576k59219P0434A30881A8017K93112C2180i0334
10022a43292p0322i1133k46704A26443g4897j21756f1677r8622B47822b52919
10011c64440c4561m8240A41998h3160B15783a78809A21953a53601D4150J36179
$$ plain form
10001 180329 -298605 108800 134104 -267666 14638 -16287 46137 -124761 -279911 15950
9990 35655 -38492 -224563 261996 -178425 -43578 -314390 -306819 -94062 -50134 23068 -137288
9978 -288707 -344629 -247201 40788 95217 -380058 -187213 -10347 -360966 -152571 117326 -239656
9966 232788 18768 138417 54846 -5801 115689 73072 -92204 -181176 -132088 62350 263420
9955 263420 -331395 281260 -342163 126634 -31606 182881 35966 36698 -324438 -58157 132142
9943 250302 -44238 -111627 343721 -25639 120713 -370767 21777 -157024 81133 -65320 -102325
9932 -102325 122918 59998 -275495 -100024 -174703 -228996 37339 -36844 103331 53766 350963
9921 350963 -495991 -131829 112743 86053 -278753 -339527 155244 102013 -345048 -185275
$$ packed form
10001A80329b98605A08800K5304b67666A4638a6287D6137a24761j55150A5950
9990C5655c8492j86071B61996a78425d3578k70812P571i4062M3928B3068a37288
9978b88707n5922R7428D0788N4429c80058a87213a0347l50619a52571A17326b39656
9966B32788A8768J19649E4846e801A15689m2617i2204q8972M9088F2350K01070
9955B63420c31395B81260c42163A26634c1606A82881C5966P32c24438e8157A32142
9943B50302d4238o7389C43721b5639A20713c70767B1777a57024H1133f5320l7005
9932a02325A22918E9998b75495a00024p4679n4293C7339c6844A03331m9565K97197
9921C50963d95991a31829A12743k6690b78753o0774A55244n3231c45048J59773
$$ plain form
9911 -185275 -329314 -149222 316927 -46267 48398 -77195 -102241 -32078 19120 -78294 -77122
9900 -77122 -22715 24260 -187128 135171 -166857 -76945 -77727 -369015 147294 211017 39729
9888 -185235 15723 -177028 21404 -79897 -273042 -94667 -58999 -151172 -39296 -7570 60767
9876 -205855 -210182 -47568 173027 -178437 -315322 -125549 -9231 60965 280775 -108625 39414
9864 -102141 -220821 -38793 104015 -14164 -252041 -225261 76627 31983 -8067 -107677 -31227
9852 -35553 -273868 112416 206406 -184887 -207157 -183012 117238 22549 -229253 170442 95867
9841 95867 -23315 -189975 232994 -19427 -56164 -201327 -3877 -130992 -386158 51682 120611
9830 120611 -252962 -205910 -125492 -215470 -301958 114017 260460 61608 112106 365800 -242791
$$ packed form
9911a85275j44039a49222C16927d6267D8398g7195k5046c2078A9120g8294J172
9900g7122b2715B4260a87128A35171a66857g6945p82k91288A47294O3723C9729
9888a85235A5723a77028B1404g9897j93145i4667L5668r2173c9296g570F0767
9876b05855m327d7568A73027a78437j36885a25549i231F0965K19810a08625C9414
9864a02141j18680c8793A04015a4164k37877K6780G6627C1983h067r9610c1227
9852c5553k38315A12416R3990a84887k2270K4145A17238B2549b29253A70442p4575
9841I5867b3315j66660B32994a9427l6737j45163c877j27115k55166E1682O8929
9830A20611b52962M7052Q0418q9978q6488A14017J46443F1608N0498K53694b42791
$$ plain form
9818 114731 -730026 -189250 92948 -298386 -102623 149459 -169226 -32518 244559 -137060
9807 53838 203423 56697 -90678 41456 -181510 101743 -159732 -10800 -223704 -143467 70706
9795 -208879 -125949 -205078 58399 200973 -425185 -290198 183987 -222592 21301 -359901
9784 -50921 95168 -34942 -124113 102668 -80678 -150704 22729 183617 278543 -210860 -163944
9773 -163944 -280565 267036 -72053 150164 -1506 -126636 245806 -392835 5886 -43124 132343
9761 3243 47539 143615 -262879 -56731 65693 -150951 -513385 136125 -150987 -192220 -111117
9750 -111117 -412248 -402406 90474 -439346 258261 9311 -99140 56110 142179 -13788 198358
9738 -50889 142502 -319876 -58147 -198197 -17849 270926 -57831 94994 87510 -298257 -232350
$$ packed form
9818A14731g30026a89250I2948b98386a02623A49459a69226c2518B44559a37060
9807E3838J49585E6697i0678D1456a81510A01743a59732a0800k12904Q0237G0706
9795b08879Q2930p9129E8399J42574d25185J34987A83987b22592B1301c59901
9784e0921I5168c4942q9171A02668h0678p0026B2729J60888R4926b10860M6916
9773a63944j16621B67036g2053A50164a506j25130B45806c92835E886d3124A32343
9761C243M4296R6076b62879e6731F5693a50951l62434A36125a50987m1233Q1103
9750a11117l01131R842I0474d39346B58261I311i9140E6110Q6069a3788A98358
9738e0889A42502c19876e8147j40050a7849B70926e7831I4994p484b98257O5907
$$ plain form
9727 -232350 -167729 -27379 -87228 -205706 -224006 -1026 -40590 -162943 -148491 -30063 148179
9715 189324 -185328 -240215 -110544 24847 42314 -242584 148484 -256158 188945 -87728
9704 -91220 -244608 -41776 101516 58330 -58393 -77313 -177688 101645 -58789 -39222 -31377
9693 -31377 -159082 19523 230297 261759 -182064 -141284 5966 37805 50477 20681 13982 -26629
9680 -120012 41972 -42705 194030 -26162 -84866 25737 -194782 94330 89162 -103371 -299962
9669 -299962 87837 -22010 -112634 -143996 -78990 -188093 -327901 -317738 -92528 -133513 -185718
9658 -185718 -23631 94209 -129484 -106216 -401968 -251586 -10073 -231530 -398068 163572
9647 -163684 49841 -264419 -212987 189064 -313409 98793 -231776 16878 -76625 -236735 244500
$$ packed form
9727b32350O4621b7379n9849j18478j8300a026l9564j22353J4452c0063A48179
9715A89324a85328n4887a10544B4847J7467b42584A48484b56158A88945h7728
9704i1220j53388d1776A01516m3186e8393j8920j00375A01645e8789J9567P845
9693c1377j27705A9523K10774L1462a82064M0780E966L1839J2672B0681o699b6629
9680a20012D1972d2705A94030b6162n8704B5737a94782I4330n168a03371j96591
9669b99962H7837b2010r0624l1362O5006j09103j39808J0163i2528m0985n2205
9658a85718b3631I4209a29484K3268k95752J50382a0073k21457j66538A63572
9647a63684D9841b64419N1432A89064c13409I8793b31776A6878g6625j60110B44500
$$ plain form
9635 255957 24508 281048 -277590 83512 -189466 114142 -62636 -213182 -14356 -64104 -6459
9623 -229739 89078 245575 115057 120425 -237406 -93529 26028 -40737 -242663 17813 126613
9612 126613 -166881 269 -98784 120268 -200423 -52927 -97371 117319 -35558 16152 -204994
9600 141971 -248345 -354104 -109699 -97091 12658 -316090 30911 -172745 -69240 44280 41600
9589 41600 134897 -89936 -95706 -198320 -305270 -205200 12121 -217600 3489 -396175 -24601
9577 98097 151966 -212225 -65546 -592309 44605 -220756 -189585 -215142 58667 -120213 41451
9565 -191644 -46985 202402 -297997 201871 -352917 -121734 -77301 -319847 41678 99480
9555 99480 -94053 -92286 -43468 -208380 178392 377784 92195 -4080 38985 144688 -133480
$$ packed form
9635B55957B4508K56540b77590H3512a89466A14142f2636j50546a4356m9748f459
9623b29739H9078J56497A15057N368b37406i3529B6028d0737k01926A7813J08800
9612A26613a66881B69i8784A20268b00423e2927m4444A17319c5558A6152b04994
9600A41971b48345j05759a09699J2608A2658c16090C0911a72745f9240D4280k680
9589D1600R3297h9936n770j02614j06950J00070A2121b17600C489c96175b4601
9577I8097N3869b12225f5546n26763D4605b20756L1171k5557E8667a20213D1451
9565a91644d6985B02402b97997B01871c52917a21734M4433k42546D1678N7802
9555I9480i4053J767d3468j64912A78392J99392I2195d080C8985J05703a33480
$$ plain form
9543 -132163 -51186 213693 42873 1816 -257017 -347838 -105825 -2935 -393823 -116368 -5630
9531 -230214 37994 494271 346491 -47622 87172 -247239 6574 182429 15740 -53955 67214
9519 -147230 57295 -114769 445962 39766 -83787 -234974 -230215 184964 -110818 -156549 -208921
9508 -208921 114611 -87304 -2043 10689 -177844 -89378 -188020 -262187 161900 -17858 143086
9496 -268564 -221600 274579 -103503 -99508 -303787 26880 19874 -38127 91919 -121441 -390138
9485 -390138 -53719 137622 106399 -197510 -62659 -233626 -96505 -22018 -365010 -191732 21815
9473 -30648 -118520 167580 -200207 -171676 -65003 -165659 -164593 -175007 303656 190464 113751
9462 113751 87530 69733 -184659 -201057 -182468 277108 -438582 9289 108806 63737 -88362
$$ packed form
9543a32163e1186B13693D2873A816b57017r0821a05825b935l90888a16368e630
9531b30214C7994M56277j47780d7622H7172b47239F574J75855A5740e3955F7214
9519a47230E7295a14769D45962C9766h3787j51187M759A84964a10818m5731n2372
9508b08921A14611h7304b043A0689a77844Q8466r8642p4167A61900a7858A43086
9496b68564M6964B74579a03503L995k04279B6880p006c8127I1919a21441k68697
9485c90138e3719A37622l1223a97510f2659j70967i6505b2018l42992J73278B1815
9473c0648q7872A67580b00207K8531f5003j00656J066j0414C03656j13192p6713
9462A13751k6221j7797a84659j6398J8589B77108d38582I289R9517m5069h8362
$$ plain form
9450 -63524 -70725 -168271 8364 -32862 -207867 106769 -179741 -66589 120164 42554 -216338
9438 116608 -211159 -267600 3282 -98271 9682 -7556 -27943 208835 180992 55325 -65759 -106134
9426 -106134 226362 -173154 13480 47885 -222216 -70306 -85256 -181589 134518 127358 59858
9414 -7401 24577 95106 -120728 -175916 76950 105608 -279254 -272205 39046 -235165 36669 -156467
9401 -105767 -237289 -7390 -59022 15938 38203 44993 -148610 26965 -22685 -103641 108697
9389 -65055 -52181 -164578 -178753 -46599 172671 15204 198405 -176193 -11066 51254 34143
9378 34143 -177625 -272043 -112302 143779 -339615 255178 136791 45370 -260524 16391
9367 -9522 -5179 111578 -149763 189250 -60583 -15163 -191247 255018 -186051 36569 155640
$$ packed form
9450f3524p201r7546H364c2862j75005A06769a79741f6589A20164D2554b16338
9438A16608b11159n6441C282i8271I682g556k0387B08835k7843E5325f5759m0375
9426a06134B26362a73154A3480L4405b22216g0306j4950r6333A34518p160E9858
9414g401B4577P0529a20728n5188G6950K8658b79254P049C9046b35165C6669a56467
9401a05767j31522g390n1632A5938K2265O790a48610B6965b2685q0956A08697
9389f5055J2874j12397j4175d6599A72671A5204J83201a76193a1066E1254j7111
9378C4143a77625r4418a12302A43779c39615B55178j18387D5370b60524A6391
9367i522M343A11578a49763A89250f0583a5163j76084B55018a86051C6569J19071
$$ plain form
9356 155640 -15091 37530 -209288 -127673 -42635 -104651 179453 -229658 -328334 -91816 -83596
9345 -83596 -6744 -245309 140784 -40476 -131030 24176 -126704 -210363 -98740 -221573 -13033
9333 -191381 98946 -14984 -27393 -136401 63404 7693 -24463 107262 120855 -18769 -231074
9322 -231074 51176 -252484 132516 -243974 78580 375 -198915 96570 -58362 134006 55726
9310 121890 169697 -114497 305473 -125022 -15400 -229213 57408 134128 -5422 -358778 -111287
9298 -82129 -173154 12511 -30006 28607 281196 -24808 119483 -79137 -339761 96921 -178410
9286 -233329 -64233 -294078 161224 49645 77194 230778 206331 -341056 -9956 -145131 13289
9274 -48297 193363 -154980 196445 -43229 -388538 -34446 -59319 9733 253083 -128846 93387
$$ packed form
9356A55640a5091C7530b09288Q1615d2635o2016A79453b29658r8676i1816Q220
9345h3596f744k38565A40784d0476r0554B4176a26704q3659i8740j22833a3033
9333a91381I8946a4984j2409j09008F3404G693b4463A07262J3593a8769k12305
9322b31074E1176b52484A32516b43974G8580C75a98915I6570e8362A34006E5726
9310A21890M7807a14497C05473a25022a5400k13813E7408P6720e422l53356a11287
9298h2129r1025A2511c0006B8607K52589b4808A19483g9137k60624I6921a78410
9286b33329f4233k29845A61224D9645K7549J53584k4447c41056i956j35175A3289
9274d8297A93363a54980A96445d3229l45309c4446k4873I733K43350a28846I3387
$$ plain form
9262 -164510 -16962 -61633 -170251 -298691 -179787 -470788 32435 3596 -166333 -141280 -64383
9250 -67875 -15839 -89154 129484 146486 -15929 33153 -223787 -121386 -259704 63764 -156573
9238 -18621 -109283 -38009 -340708 54162 123501 -83637 -211375 21364 -161869 193670 133438
9227 133438 201285 202131 192475 -260823 76716 -76313 127313 -284130 155364 -55920 -390533
9216 -390533 83164 289223 -16913 -50034 -167829 -248948 361933 -115605 63403 -170686 -37075
9204 -275167 -237547 214237 -11100 89670 -22578 -233345 -75762 -65069 -148876 -47128 -165745
9193 -165745 -119411 271306 -344791 83632 99475 -141147 -87304 -377427 -87397 105213 20948
9181 -101494 169231 -101257 -114110 32185 -197868 -23112 -76225 117391 -272363 -261375 -56198
$$ packed form
9262a64510a6962m4671j08618j28440J18904k91001C2435C596a66333K5053f4383
9250f7875a5839p3315A29484J7002a5929C3153b23787J02401j38318F3764a56573
9238a8621r0662c8009l02699E4162O9339h3637j27738B1364a61869A93670o0232
9227A33438O7847Q46r656b60823G6716g6313A27313b84130A55364e5920l34613
9216c90533H3164K06059a6913l3121j17795q1119C61933a15605F3403a70686c7075
9204b75167L7620B14237a1100H9670b2578k10767g5762J0693q3807d7128j18617
9193a65745M6334B71306c44791H3632J5843a41147N3843k90123h7397A05213B0948
9181a01494A69231a01257j2853C2185a97868b3112n3113A17391b72363J0988e6198
$$ plain form
9169 177530 -82722 157109 -227243 -428327 -335648 74512 34811 78316 194103 7167 31228
9158 31228 91208 112995 120031 -78662 97473 -124538 117163 128197 -63357 -381262 -271798
9147 -271798 -192024 238020 -12090 -46397 -124001 35916 -108071 -164651 72361 -277433 -35423
9135 -201895 -200440 -88973 298319 135912 50971 96750 163256 -251969 -52883 -88813 -250510
9124 -250510 -406410 -200317 -153065 -153334 177651 -66389 69 240224 -99251 -159989 -69267 -86296
9112 -86296 -119897 30703 130288 -246049 -230004 -171171 -124386 -311384 -358502 85650 -261216
9100 -187671 109602 -74489 -42400 64823 -302730 45944 1941 -248654 -175110 127259 -179877
9088 89865 -236273 -170834 -211101 -132407 10409 -142338 -137664 -59065 -179326 188675 97220
$$ packed form
9169A77530h2722A57109b27243k01084R2679G4512C4811M3505J15787G167K4061
9158C1228N9980K1787P036g8662I7473a24538A17163J1034f3357l17905J09464
9147b71798P9774B38020a2090l4307p7604C5916a08071n6580G2361b77433c5423
9135b01895J455h8973B98319A35912E0971M5779O6506b51969e2883l5930j61697
9124b50510j55900b00317M7252k69A77651f6389F9K40155i9251o0738f9267j7029
9112h6296l3601C0703R9585b46049J6045N8833M6785j86998m7118H5650b61216
9100a87671A09602g4489L2089F4823c02730D5944A941b48654P3544A27259a79877
9088H9865b36273O5439m0267P8694A0409a42338M674e9065j20261A88675r1455
$$ plain form
9077 97220 -138292 178583 -189885 -233620 -6538 -9581 93480 -56724 -69322 -2562 -48865 -120756
9065 -120756 -205538 -240323 -217583 151808 -96735 -211461 51220 206196 -205530 -70629 94778
9053 -105393 -132604 93854 -9116 -71677 -153343 270968 -9269 -137929 -149415 87375 -45394 40291
9040 3160 65419 -103907 -171619 116469 133048 139718 -50373 -195297 -112086 -288137 253331
9028 95572 63705 36284 -109731 -124052 -45176 -25638 105873 -175047 1475 12788 -195065
9016 177409 -601 -272981 -226188 -191489 -180955 131484 272419 -265639 -291120 -78395 272075
9004 117730 242505 -3761 -41726 -38160 152218 -308819 64053 -67605 -36895 115239 -26711
8992 -176397 -298590 -107939 -119583 68686 -323856 -254705 127525 176888 131494 30677 221314
$$ packed form
9077I7220a38292A78583a89885m3735f538l043I3480e6724j2598b562m6303p1891
9065a20756q4782l4785K2740A51808i6735j14726E1220J54976b05530g0629I4778
9053a05393k7211I3854i116o2561q1666B70968i269j28660j1486H7375d5394D0291
9040C160O2259a03907o7712A16469J6579O670e0373j44924Q3211j76051B53331
9028I5572l1867k7421a09731j4321d5176J9538A05873a75047A475J1313a95065
9016A77409f01k72380M6793L4699J0534A31484J40935b65639k5481g8395B72075
9004A17730J24775c761l7965L566A52218c08819F4053f7605L0710A15239b6711
8992a76397j22193a07939j1644F8686c23856O9151A27525M9363m5394C0677J90637
$$ plain form
8981 221314 27750 -11151 -110482 -325422 -190622 -107514 -193890 -258570 -40739 39616 284531
8970 284531 160829 -25810 161691 -182851 419621 377707 81739 -27827 -122710 -306327 -21382
8958 -103863 270280 -234484 -236049 -17760 -235009 -416092 -111900 -240651 -60585 523714
8947 108551 39906 -80103 -40387 102235 110291 205849 51161 -136172 -36902 108289 36643
8935 -147425 228902 -9066 -269457 32507 427723 22922 212535 -40503 193868 78815 -58207
8923 417221 1108673 4495523 2242364 355871 63404 56561 -285288 -190301 -289613 220108
8912 -138824 -293005 12934 66820 74440 188848 249540 108350 107201 -243462 401660 -345493
8900 -127043 143171 -228035 -261303 -145128 165137 -236706 -129325 -79103 -62508 -107058
$$ packed form
8981B21314B7750a1151r9331k14940J34800Q3108q6376o4680d0739C9616K44915
8970B84531j23702b5810A61691a82851D19621m1914H1739b7827r4883j83617b1382
8958a03863B70280b34484j565a7760k17249j81083a11900j28751f0585E23714
8947A08551C9906h0103L9716A02235Q056R5558E1161a36172c6902A08289C6643
8935a47425B28902i066k60391C2507L95216B2922J89613d0503A93868G8815e8207
8923D17221O91452L386850B242364C55871F3404o843b85288R4987r9312B20108
8912a38824j54181A2934N3886P620J14408O0692A08350j149b43462D01660c45493
8900a27043A43171b28035l3268J16175A65137b36706J07381N0222J6595m4550
$$ plain form
8890 -107058 -59736 40072 23292 -97478 -82269 -164155 -183365 -44581 -465517 -106635 70932
8878 6464 -6038 -32323 1405 36182 -158157 227148 -191841 -185062 7776 -144629 222357 -65805
8865 64985 61089 -195766 -254822 82281 -63917 -96632 13912 -85014 -225515 -112357 -140769
8854 -140769 56537 25531 -137360 -105646 -15844 -323159 -168028 -142382 -242198 -93078 2252
$$ packed form
8890a07058M7322D0072j6780i7478J5209q1886j9210d4581m20936a06635G0932
8878F464f038k6285A405L4777a58157B27148a91841O779G776a44629B22357f5805
8865F4985l896a95766n9056H2281f3917l2715A3912h5014j40501a12357k8412
8854a40769E6537B5531a37360L1714a5844l07315J55131K5646r9816i3078B252
$$ [...]
##END NTUPLES=NMR SPECTRUM
##END=
