##TITLE=AC1759_VAR00031_9319955_LepgiUL7zF
##JCAMPDX= 6.0         $$ Bruker NMR JCAMP-DX V2.0
##DATA TYPE= NMR SPECTRUM
##DATA CLASS= NTUPLES
##ORIGIN= BRUKER
##OWNER= Administrator
$$ 1.72 TOPSPIN		Version 2.1
$$ 2015-08-12 01:33:07.742 -0700  Administrator@X
$$ Compression mode = diff/dup
##.OBSERVE FREQUENCY= 400.02188249412
##.OBSERVE NUCLEUS= ^1H
##.ACQUISITION MODE= SIMULTANEOUS (DQD)
##.ACQUISITION SCHEME= undefined
##.AVERAGES= 64
##.DIGITISER RES= 22
##SPECTROMETER/DATA SYSTEM= spect
##.PULSE SEQUENCE= noesygpps1d.comp
##.SOLVENT NAME= COFFEE_meoh
##.SHIFT REFERENCE= INTERNAL, COFFEE_meoh, 1, 14.96078
##AUDIT TRAIL= $$ (NUMBER, WHEN, WHO, WHERE, PROCESS, VERSION, WHAT)
$$ ##TITLE= Audit trail, TOPSPIN		Version 2.1
$$ ##JCAMPDX= 5.01
$$ ##ORIGIN= Bruker BioSpin GmbH
$$ ##OWNER= Administrator
$$ $$ E:\/data/COFFEE/nmr/AC1759_VAR00031_9319955_LepgiUL7zF/12/pdata/1/auditp.txt
$$ ##AUDIT TRAIL=  $$ (NUMBER, WHEN, WHO, WHERE, PROCESS, VERSION, WHAT)
(   1,<2015-08-12 01:33:02.304 -0700>,<Administrator>,<X>,<go>,<TOPSPIN 2.1>,
      <created by zg
	started at 2015-08-12 01:21:32.914 -0700,
	POWCHK enabled, PULCHK disabled,
       configuration hash MD5:
       21 0F 79 D6 B3 7B B4 F6 88 20 88 DB 03 48 BD 9F
       data hash MD5: 64K
       57 F3 E6 4B 27 2F 16 3A 61 2B 08 C9 A6 FF 01 4C>)
(   2,<2015-08-12 01:33:05.695 -0700>,<Administrator>,<X>,<proc1d>,<TOPSPIN 2.1>,
      <Start of raw data processing
       efp LB = 0.3 FT_mod = 6 PKNL = 1 PHC0 = 0 PHC1 = 0 SI = 128K 
       data hash MD5: 128K
       87 7B 54 C5 38 87 1B 45 3C 2F 72 05 34 E4 CB 10>)
(   3,<2015-08-12 01:33:06.554 -0700>,<Administrator>,<X>,<proc1d>,<TOPSPIN 2.1>,
      <pk PHC0 = 268.9673 PHC1 = 0 
       data hash MD5: 128K
       2F 80 D0 B2 52 D5 6A B7 87 19 22 B6 5C C5 34 08>)
(   4,<2015-08-12 01:33:06.929 -0700>,<Administrator>,<X>,<proc1d>,<TOPSPIN 2.1>,
      <abs ABSG = 1 
       data hash MD5: 128K
       77 8A 83 0D D6 D7 41 2E 89 69 33 81 D1 9D 1E 5B>)
(   5,<2015-08-12 01:33:07.039 -0700>,<Administrator>,<X>,<proc1d>,<TOPSPIN 2.1>,
      <abs ABSG = 2 
       data hash MD5: 128K
       8B CF 21 94 C9 FD AB A8 95 8B 5B CF FD B1 D6 4D>)
(   6,<2015-08-12 01:33:07.132 -0700>,<Administrator>,<X>,<proc1d>,<TOPSPIN 2.1>,
      <abs ABSG = 3 
       data hash MD5: 128K
       BF BA 96 49 06 07 56 35 04 F2 84 F0 31 59 74 6E>)
(   7,<2015-08-12 01:33:07.210 -0700>,<Administrator>,<X>,<proc1d>,<TOPSPIN 2.1>,
      <abs ABSG = 4 
       data hash MD5: 128K
       20 4A E7 C9 29 90 73 97 C5 DE D1 D2 AE FC A0 83>)
(   8,<2015-08-12 01:33:07.335 -0700>,<Administrator>,<X>,<proc1d>,<TOPSPIN 2.1>,
      <abs ABSG = 5 
       data hash MD5: 128K
       5E 07 6A EA E1 66 25 1F 76 72 4C 80 A6 5B 32 BD>)
$$ ##END=
$$ 
$$ $$ hash MD5
$$ $$ A0 79 5C 0E 25 A0 AA EB 8C C5 95 1B 6E 0C C2 4B
##$RELAX= 
##$RELAX= 
##$RELAX= 
##$RELAX= 
##$RELAX= 
##$RELAX= 
##$RELAX= 
##$RELAX= 
$$ Bruker specific parameters
$$ --------------------------
##$DU= <E:\>
##$EXPNO= 12
$$ [...]
##$TP07= 0
##$TPNAME0= <>
##$TPNAME1= <>
##$TPNAME2= <>
##$TPNAME3= <>
##$TPNAME4= <>
##$TPNAME5= <>
##$TPNAME6= <>
##$TPNAME7= <>
##$TPOAL= (0..7)
0.5 0.5 0.5 0.5 0.5 0.5 0.5 0.5
##$TPOFFS= (0..7)
0 0 0 0 0 0 0 0
##$TUNHIN= 0
##$TUNHOUT= 0
##$TUNXOUT= 0
##$USERA1= <user>
##$USERA2= <user>
##$USERA3= <user>
##$USERA4= <user>
##$USERA5= <user>
##$V9= 5
##$VALIST= <valist>
##$VCLIST= <CCCCCCCCCCCCCCC>
##$VD= 0
##$VDLIST= <DDDDDDDDDDDDDDD>
##$VPLIST= <PPPPPPPPPPPPPPP>
##$VTLIST= <TTTTTTTTTTTTTTT>
##$WBST= 2048
##$WBSW= 25
##$XGAIN= (0..3)
0 0 0 0
##$XL= 0
##$YL= 0
##$YMAX_a= 6295605
##$YMIN_a= -11970093
##$ZGOPTNS= <>
##$ZL1= 120
##$ZL2= 120
##$ZL3= 120
##$ZL4= 120
##$ABSF1= 14.96078
##$ABSF2= -5.597402
##$ABSG= 5
##$ABSL= 3
##$ALPHA= 0
##$AQORDER= 0
##$ASSFAC= 0
##$ASSFACI= 0
##$ASSFACX= 0
##$ASSWID= 0
##$AUNMP= <proc_prof1d_extract.lims>
##$AXLEFT= 0
##$AXNAME= <>
##$AXNUC= <1H>
##$AXRIGHT= 0
##$AXTYPE= 0
##$AXUNIT= <>
##$AZFE= 0.1
##$AZFW= 0.1
##$BCFW= 0
##$BC_mod= 0
##$BYTORDP= 0
##$COROFFS= 0
##$CY= 15
##$DATMOD= 1
##$DC= 0
##$DFILT= <>
##$DTYPP= 0
##$F1P= 0
##$F2P= 0
##$FCOR= 0.5
##$FTSIZE= 131072
##$FT_mod= 6
##$GAMMA= 0
##$GB= 0
##$INTBC= 1
##$INTSCL= 1
##$ISEN= 128
##$LB= 0.3
##$LEV0= 0
##$LPBIN= 0
##$MAXI= 10000
##$MC2= 0
##$MEAN= 0
##$ME_mod= 0
##$MI= 0
##$NCOEF= 0
##$NC_proc= -2
##$NLEV= 6
##$NOISF1= 0
##$NOISF2= 0
##$NSP= 0
##$NTH_PI= 0
##$NZP= 0
##$OFFSET= 14.96078
##$PC= 1
##$PHC0= 268.9673
##$PHC1= 0
##$PH_mod= 1
##$PKNL= yes
##$PPARMOD= 0
##$PPDIAG= 0
##$PPIPTYP= 0
##$PPMPNUM= 2147483647
##$PPRESOL= 1
##$PSCAL= 4
##$PSIGN= 0
##$PYNMP= <proc.py>
##$REVERSE= no
##$SF= 400.020009725455
##$SI= 131072
##$SIGF1= 0
##$SIGF2= 0
##$SINO= 400
##$SIOLD= 131072
##$SPECTYP= <>
##$SREGLST= <1H.CDCl3>
##$SSB= 0
##$STSI= 131072
##$STSR= 0
##$SW_p= 8223.68421052631
##$SYMM= 0
##$S_DEV= 0
##$TDeff= 65536
##$TDoff= 0
##$TI= <>
##$TILT= no
##$TM1= 0
##$TM2= 0
##$TOPLEV= 0
##$USERP1= <user>
##$USERP2= <user>
##$USERP3= <user>
##$USERP4= <user>
##$USERP5= <user>
##$WDW= 1
##$XDIM= 131072
##$YMAX_p= 407231903
##$YMIN_p= -12057
##$CURPLOT= <Network HP LaserJet P1505>
##$CURPRIN= <$Network HP LaserJet P1505>
##$DFORMAT= <normdp>
##$LAYOUT= <+/1D_H.xwp>
##$LFORMAT= <normlp>
##$PFORMAT= <normpl>
##$SURQMSG= 1
$$ End of Bruker specific parameters
$$ ---------------------------------
##NTUPLES= NMR SPECTRUM
##VAR_NAME=  FREQUENCY,     SPECTRUM/REAL,   SPECTRUM/IMAG
##SYMBOL=    X,             R,               I
##VAR_TYPE=  INDEPENDENT,   DEPENDENT,       DEPENDENT
##VAR_FORM=  AFFN,          ASDF,            ASDF
##VAR_DIM=   131072,        131072,          131072
##UNITS=     HZ,            ARBITRARY UNITS, ARBITRARY UNITS
##FACTOR=    0.0627417313425164, 1,          1
##FIRST=     8223.62146879497, 1850,         -57462
##LAST=      0,             4681,            -57468
##MIN=       0,             -12057,          0
##MAX=       8223.62146879497, 407231903,    0
$$ Real data points
##PAGE= N=1
##DATA TABLE= (X++(R..R)), XYDATA
$$ [...]
63899A102121m9249m2455l7190l3083k9368k5766k2893k1385k0937k0720k0432
63888G78643k0402k0683k0757k0280j9571j8966j8072j6194j3340j0292p667n357
63876E87062l079j027M60J657L396O094R236J1966J3894J5169J6066J6849J7795
63863F95538J8930J9815J9980J9550J9101J8841J8340J7147J5311J3077J0484
63852H86114P507M386J432j292l912o450q818j1022j3139j5153j7011j8802k0692
63839G83148k2682k4527k5882k6502k6440k6103k5966k6077k5928k4935k2986
63828E05120k0494j8090j6331j5402j4902j4107j2721j1209j0164r556q904q052
63816C45188p306o861o479n875n083m252l411k595j982j630j252n65K03M88P0
$$ plain form
63899 1102121 1052872 1010417 973227 940144 910776 885010 862117 840732 819795 799075 778643
63888 778643 758241 737558 716801 696521 676950 657984 639912 623718 610378 600086 592419 587062
63876 587062 583983 582956 583416 585073 588469 594563 603799 615765 629659 644828 660894 677743 695538
63863 695538 714468 734283 754263 773813 792914 811755 830095 847242 862553 875630 886114
63852 886114 893621 898007 899439 898147 894235 887785 878967 867945 854806 839653 822642 803840 783148
63839 783148 760466 735939 710057 683555 657115 631012 605046 578969 553041 528106 505120
63828 505120 484626 466536 450205 434803 419901 405794 393073 381864 371700 362144 353240 345188
63816 345188 337882 331021 324542 318667 313584 309332 305921 303326 301344 299714 298462 297897 298100 298588 298658
63801B98658p00j425k152l075l966m325m027l554l355l327l083k540j948j550
63787B59631j505j948k749l327l156k467j978j917j782j177l53L55J061J836K117
63772B42641J278l87j819k337k140j610p78L48J295J453P44k83j048j374j358
63757B34625r99k05Q59J669J797J430J178J323J531J412J079R20J003J041Q74
63742B49537O78O77R49J478K184K788K940K630K278K231K339K209J825J601J791
63727B78135K149K360K598L278M354N221N474N369N270M957M022K697J730J315
63713C28929P88l61j616k059j641j318j881k980l492k799j503p29p86q24JJ414
63697C09143K443K754K923L381L809L741L233K586J936J478J578K188K565K101
$$ plain form
63801 298658 297958 296533 294381 291306 287340 283015 278988 275434 272079 268752 265669 263129 261181 259631
63787 259631 258126 256178 253429 250102 246946 244479 242501 240584 238802 237625 237272 237627 238688 240524 242641
63772 242641 243919 243532 241713 239376 237236 235626 234848 235196 236491 237944 238688 238405 237357 235983 234625
63757 234625 233626 233421 234280 235949 237746 239176 240354 241677 243208 244620 245699 246619 247622 248663 249537
63742 249537 250215 250892 251841 253319 255503 258291 261231 263861 266139 268370 270709 272918 274743 276344 278135
63727 278135 280284 282644 285242 288520 292874 298095 303569 308938 314208 319165 323187 325884 327614 328929
63713 328929 329717 329356 327740 325681 324040 322722 320841 317861 314369 311570 310067 309338 308552 307728 307729 309143
63697 309143 311586 314340 317263 320644 324453 328194 331427 334013 335949 337427 339005 341193 343758 345859
63683C45859J120M08J70l8n49j235j776j824j111J87J373J898J959K026K090J884
63667C52441J587J580J637J080k59j787k922l565l838l900m097m684n300n235
63653C22738m368l308k545k050j755j830k190k352k035j430o56M81J890K968L357
63638C06915L470L855M469M930N100N034M754M453M641N617P030Q251Q935R076
63624C86530Q906R011J0002J1701J3088J3577J3894J5212J7725K0658K3313K5540
63612E69157K7441K9199L1043L2933L4488L5541L6327L6623L5354L1798K6688
63601I26592K1169J5204Q172P42n253q939j1092j2447j2676j1701j0772j1279
63589H87720j3282j6013j9142k2562k5633k7638k8662k9123k8796k7224k4804
$$ plain form
63683 345859 346979 347387 347557 347519 346970 345735 343959 342135 341024 341211 342584 344482 346441 348467 350557 352441
63667 352441 354028 355608 357245 358325 358066 356279 353357 349792 345954 342054 337957 333273 327973 322738
63653 322738 318370 315062 312517 310467 308712 306882 304692 302340 300305 298875 298219 298700 300590 303558 306915
63638 306915 310385 314240 318709 323639 328739 333773 338527 342980 347621 353238 360268 368519 377454 386530
63624 386530 395436 404447 414449 426150 439238 452815 466709 481921 499646 520304 543617 569157
63612 569157 596598 625797 656840 689773 724261 759802 796129 832752 868106 899904 926592
63601 926592 947761 962965 971137 971879 966626 957687 946595 934148 921472 909771 898999 887720
63589 887720 874438 858425 839283 816721 791088 763450 734788 705665 676869 649645 624841
63578F24841k2447k0245j7578j4438j1632r451p288m876k879j624k04K270N123
63565E19572O849P143P187P966R139R898J0203J0649J1502J2461J3302J4384J6279
63552F56534J9135K2608K6356L0311L4375L8156M1295M3853M5836M6286M3400
63541A048145L6027K4931J2403P84q492j4891j8466j9612j8847j6767j4227j2342
63529I98646j1920j3021j5337j8773k3225k7993l2065l5032l7138l8366l8144
63518G07632l6295l3666l1275k9142k6590k3444k0378j8023j6261j4528j2540
63507D45490j0570r102q277p625o521m972l762l532l898l831k877j654j055j271
63493C76543j736j818j419q76n20l44j57Q8L23O98J487K507K995K470J486J105
$$ plain form
63578 624841 602394 582149 564571 550133 538501 529050 521762 516886 514007 512383 512179 514449 519572
63565 519572 526421 533564 540751 548717 557856 567754 577957 588606 600108 612569 625871 640255 656534
63552 656534 675669 698277 724633 754944 789319 827475 868770 912623 958459 1004745 1048145
63541 1048145 1084172 1109103 1121506 1122290 1113798 1098907 1080441 1060829 1041982 1025215 1010988 998646
63529 998646 986726 973705 958368 939595 916370 888377 856312 821280 784142 745776 707632
63518 707632 671337 637671 606396 577254 550664 527220 506842 488819 472558 458030 445490
63507 445490 434920 425818 417541 409916 403395 398423 394661 391129 387231 383400 380523 378869 377814 376543
63493 376543 374807 372989 371570 370694 370174 369830 369673 369761 370084 370782 372269 374776 377771 380241 381727 382832
63477C82832J658K442K597J966J019L23Q9O1k51r69j655j933k088k593l194l124
63461C77180k273j480j403j646j344k09J329K591L048K728K499L429N433P143
63447C97025P583P449Q016R349J0451J0861J1093J1529J2014J2742J4501J7565
63435E30178K1120K4368K7477L0730L3211L3334L0586K6034K1159J6793J3302
63424H08292J1181J0922J2533J5503J9265K3529K8202L3044L7473M0708M2114
63413A082766M1370L8311L2865K5264J6287P090j206p769j2173j4497j5311j5358
63401A177639j5222j5304j6005j7693k0511k4345k8896l3610l7647m0260m1291
63390H86855m1103l9990l7912l4915l1523k8427k5857k3420k0547j7017j3133
$$ plain form
63477 382832 384490 386932 389529 391495 392514 392837 392926 392987 392736 391767 390112 388179 386091 383498 380304 377180
63461 377180 374907 373427 372024 370378 369034 368825 370154 372745 375793 378521 381020 384449 389882 397025
63447 397025 404608 412057 420073 429422 439873 450734 461827 473356 485370 498112 512613 530178
63435 530178 551298 575666 603143 633873 667084 700418 731004 757038 778197 794990 808292
63424 808292 819473 830395 842928 858431 877696 901225 929427 962471 999944 1040652 1082766
63413 1082766 1124136 1162447 1195312 1220576 1236863 1243953 1242747 1234978 1222805 1208308 1192997 1177639
63401 1177639 1162417 1147113 1131108 1113415 1092904 1068559 1039663 1006053 968406 928146 886855
63390 886855 845752 805762 767850 732935 701412 672985 647128 623708 603161 586144 573011
63379E73011r479o468m034j789N27K861N119P381R731J1955J3678J4796J5668
63366F32957J6794J8358K0110K1696K3123K4853K7353L0577L3958L6890L9109
63355I25778M0635M1530M1660M0523L7267L1363K3320J4524O175j349p902j2934
63343A180590j5926j7182j7604j7751j7633j7429j7865j9690k3047k7394l1764
63332I57305l5183l7235l8252l8570l7730l4971l0580k6008k2336j9223j5737
63321F21480j1663p596m198k027j740l746p664j2457j6996k0243k1341k0190j7807
63308D73812j5517j3798j2297j0774r314p690n424k761r15p81j779k434j907o71
63294C87750J63j55j565l333m591m935m650m365m458m790m917m564l933l457l283
$$ plain form
63379 573011 563532 557064 553030 551241 551768 554629 559748 567129 576860 588815 602493 617289 632957
63366 632957 649751 668109 688219 709915 733038 757891 785244 815821 849779 886669 925778
63355 925778 966413 1007943 1049603 1090126 1127393 1158756 1182076 1196600 1202775 1201426 1193524 1180590
63343 1180590 1164664 1147482 1129878 1112127 1094494 1077065 1059200 1039510 1016463 989069 957305
63332 957305 922122 884887 846635 808065 770335 735364 704784 678776 656440 637217 621480
63321 621480 609817 602221 598023 595996 594256 590510 582846 570389 553393 533150 511809 491619 473812
63308 473812 458295 444497 432200 421426 412112 404422 398998 396237 395322 394541 392762 390328 388421 387750
63294 387750 387913 387758 386193 382860 378269 373334 368684 364319 359861 355071 350154 345590 341657 338200 334917
63279C34917l117k641j884j053k45M69Q76Q92P87Q19Q14N13J33J57O56J289J868
63262C35250K380K640K504K346K617K978K751K241K606M051N177M799L559K895
63248C78794L205L832M394N041N730O327P244Q950J0923J2030J2099J2140J2856
63235D83565J3856J4749J5994J7987J9997K0893K0623K0199K0389K0961K1261
63224F90474K0950K0139J9168J8496J8572J9526K0920K1926K1882K0879J9701
63213I12633J8971J8392J7074J4583J1279P550L252j771o991j1537j5051j7838
63201I50546k0257k2333k3915k4757k4489k2889k0329j7606j5211j3013j0736
63190G35011q391o064l625r66J659L897N827P872J0191J2414J4125J5372J6505
$$ plain form
63279 334917 331800 329159 327275 326222 325977 326446 327322 328214 329001 329820 330634 331147 331280 331437 332093 333382 335250
63262 335250 337630 340270 342774 345120 347737 350715 353466 355707 358313 362364 367541 372340 375899 378794
63248 378794 381999 385831 390225 395266 400996 407323 414567 423517 434440 446470 458569 470709 483565
63235 483565 497421 512170 528164 546151 566148 587041 607664 627863 648252 669213 690474
63224 690474 711424 731563 750731 769227 787799 807325 828245 850171 872053 892932 912633
63213 912633 931604 949996 967070 981653 992932 1000482 1003734 1001963 994972 983435 968384 950546
63201 950546 930289 907956 884041 859284 834795 811906 791577 773971 758760 745747 735011
63190 735011 726620 720556 716931 715965 717624 721521 727348 735220 745411 757825 771950 787322 803827
63177H03827J7678J8663J9194J9281J9124J8817J8288J7556J6811J6106J5085
63166A000430J3261J0553P296L630o62n501j0076j3655j6639k0128k4341k8132
63154I16036l0404l1302l1535l1108k9608k7378k5439k4060k2356j9641j6530
63143F26675j4150j2799j1917j0950r677q035o239m904m350l925k662o34J101
63130E37534J975K586L584M648N203N538O399P676Q349P894P005O639O786O646
63116F18462N713M291L010K226J899J772J527R99L71J8O8J80o7n76q32o27m81
63099F37953j064k280l243l197k278j219n60l29l08l14k66j90j84k22m2N33J264
63082F24054J760K062K545L213L553L362L295M062N365O225O284O211O668P477
$$ plain form
63177 803827 821505 840168 859362 878643 897767 916584 934872 952428 969239 985345 1000430
63166 1000430 1013691 1024244 1031540 1035170 1034508 1029007 1018931 1005276 988637 968509 944168 916036
63154 916036 885632 854330 822795 791687 762079 734701 709262 685202 662846 643205 626675
63143 626675 612525 599726 587809 576859 567182 559147 552908 548004 543654 539729 537067 536433 537534
63130 537534 539509 542095 545679 550327 555530 561068 567467 575143 583492 591386 598391 605030 611816 618462
63116 618462 624175 628466 631476 633702 635601 637373 638900 639899 640270 640288 640356 640536 640469 639893 639061 638434 637953
63099 637953 636889 634609 631366 628169 625891 624672 624112 623783 623475 623161 622895 622705 622521 622299 622257 622790 624054
63082 624054 625814 627876 630421 633634 637187 640549 643844 647906 653271 659496 665780 671991 678659 686136
63068F86136Q104Q563R300J0351J1175J1436J1581J2456J4411J7038J9747K2422
63056H42720K5310K8386L1245L3623L5794L8092M0358M2285M4095M6316M8792
63045A257016N0556N0943N0393M9824M9530M9110M8200M6971M5930M5503M5613
63034A789589M5588M4751M3188M1499L9575L6235L0575K3121J4993O370l273j3749
63022B098462k3972l3308m2069n0432n7662o2819o5486o5532o2913n8339n3344
63011A522586m8905m4332l8279l0639k2729j5736r682l893K048Q005J3489J7980
62999A349913K1362K4048K6499K8640L0105L0958L1682L2363L2495L1833L1001
62988A670899L0729L0746K9981K7857K4832K1497J7616J2534O160r54q504j6688
$$ plain form
63068 686136 694240 702803 712103 722454 733629 745065 756646 769102 783513 800551 820298 842720
63056 842720 868030 896416 927661 961284 997078 1035170 1075528 1117813 1161908 1208224 1257016
63045 1257016 1307572 1358515 1408908 1458732 1508262 1557372 1605572 1652543 1698473 1743976 1789589
63034 1789589 1835177 1879928 1923116 1964615 2004190 2040425 2071000 2094121 2109114 2115484 2112211 2098462
63022 2098462 2074490 2041182 1999113 1948681 1891019 1828200 1762714 1697182 1634269 1575930 1522586
63011 1522586 1473681 1429349 1391070 1360431 1337702 1321966 1312284 1308391 1310439 1318444 1331933 1349913
62999 1349913 1371275 1395323 1421822 1450462 1480567 1511525 1543207 1575570 1608065 1639898 1670899
62988 1670899 1701628 1732374 1762355 1790212 1815044 1836541 1854157 1866691 1872851 1871897 1863393 1846705
62976A846705k5379l3642m0602m6410n1699n6301n9219n9971n9241n7915n5993
62965A300333n2940m8785m4356m0485l7434l5075l3263l1810l0314k8353k5957
62954H91561k3732k2255k1378k0410j9033j7697j6904j6486j5977j5332j4808
62943F87549j4335j3589j2587j1622j0689r573q441p683p186o456n507m818m335
62930E70728l382j854o03k40l97n60q16j229j409j326j699k703l257k529j452
62915E47272j480k481l172l187l246l523l341k677k483l135l753l558k878k295
62901E06063j756j134q37j071j185n04O12J199Q81J09n51q63r08r22j052j062
62885D97019o22P0L33ok60J82J005J427J168N30p6l17K9O92R12K59p47j270j198
$$ plain form
62976 1846705 1821326 1787684 1747082 1700672 1648973 1592672 1533453 1473482 1414241 1356326 1300333
62965 1300333 1247393 1198608 1154252 1113767 1076333 1041258 1007995 976185 945871 917518 891561
62954 891561 867829 845574 824196 803786 784753 767056 750152 733666 717689 702357 687549
62943 687549 673214 659625 647038 635416 624727 615154 606713 599030 591844 585388 579881 575063 570728
62930 570728 567346 565492 564889 564649 564252 563692 562876 561647 560238 558912 557213 554510 551253 548724 547272
62915 547272 545792 543311 540139 536952 533706 530183 526842 524165 521682 518547 514794 511236 508358 506063
62901 506063 504307 503173 502336 501265 500080 499576 500188 501387 502268 502377 501826 500963 500055 499133 498081 497019
62885 497019 496397 496467 496800 496794 496534 496716 497721 499148 500316 500846 500770 500453 500482 501174 502086 502345 501598 500328 499130
62866D99130j032j010r11o98o96j003j146o19M99J687K551L046L204K928K185
62851E08115J365J117J647K349K418J745R21L74k8m55p15o16m30n98j151j700
62835E14358j884j649j200q26o73n60j95L97Q59J023J144J477J899K141K210K378
62819E20899K877L675M404M478L641K419J733J913K442K790K979L164L202L071
62805E63687L244M042M955N193M735M309M400M839N381O139P262Q579R760J0659
62791F47184J1409J2372J4004J6611K0136K4274K8703L3140L7275M0946M4349
62780I30403M7979N2262N7293O2664O7610P1453P4111P5839P6482P5389P2296
62769A663781O7735O2096N4732M4802L2705J9905P249n650j9176l2569m4552n4490
$$ plain form
62866 499130 498098 497088 496177 495479 494783 493780 492634 492015 492514 494201 496752 499798 503002 505930 508115
62851 508115 509480 510597 512244 514593 517011 518756 519677 520051 520023 519568 518853 518237 517807 517209 516058 514358
62835 514358 512474 510825 509625 508799 508126 507566 507371 507768 508627 509650 510794 512271 514170 516311 518521 520899
62819 520899 523776 527451 531855 536333 539974 542393 544126 546039 548481 551271 554250 557414 560616 563687
62805 563687 566931 570973 575928 581121 585856 590165 594565 599404 604785 610924 618186 626765 636525 647184
62791 647184 658593 670965 684969 701580 721716 745990 774693 807833 845108 886054 930403
62780 930403 978382 1030644 1087937 1150601 1218211 1289664 1363775 1439614 1516096 1591485 1663781
62769 1663781 1731516 1793612 1848344 1893146 1925851 1945756 1953005 1947355 1928179 1895610 1851058 1796568
62757A796568o2436o8467p2649p5365p6997p7247p5454p1760o7398o3468n9869
62746A025458n5857n1390m7223m3730m0260l6005l1107k6425k2549j9494j7183
62735F34235j5602j4372j2776j0562q377p024o468n922m827l444k388j892j545
62722E39036p46O93K339L550M107M396M966N968P114Q095Q995J0226J2089J4450
62708F25278J6932J9417K2141K5275K8609L1872L5113L8522M2067M5597M9116
62697I79939N2647N6022N9104O2050O4886O7144O8364O8652O7956O5175N8995
62686A670934M9720L9151K8462J7219M891p876k0210l2174m3908n4389o2231o7342
62674A522247p0630p2393p2132o9936o6861o3739o0478n6835n3098m9560m5976
$$ plain form
62757 1796568 1734132 1665665 1593016 1517651 1440654 1363407 1287953 1216193 1148795 1085327 1025458
62746 1025458 969601 918211 870988 827258 786998 750993 719886 693461 670912 651418 634235
62735 634235 618633 604261 591485 580923 572546 565522 559054 553132 548305 544861 542473 540581 539036
62722 539036 538290 538983 541322 544872 548979 553375 558341 564309 571423 579518 588513 598739 610828 625278
62708 625278 642210 661627 683768 709043 737652 769524 804637 843159 885226 930823 979939
62697 979939 1032586 1088608 1147712 1209762 1274648 1341792 1410156 1478808 1546764 1611939 1670934
62686 1670934 1720654 1759805 1788267 1805486 1810377 1802501 1782291 1750117 1706209 1651820 1589589 1522247
62674 1522247 1451617 1379224 1307092 1237156 1170295 1106556 1046078 989243 936145 886585 840609
62663H40609m1985l7694l3520k9707k6246k3043k0025j7320j5306j4188j3543
62652E68032j2633j1250r877q997q526q052p279o206n082m322m144m263m129l451
62638D69821k311q86O17J831K346K081J333N10k6j32j64p87k114l273l358k583
62622D62905j905j665j327m75O43J655K524L284L916M633N684O745P129O792O461
62607E06999O499O392N837N614O718Q984J1294J2984J4454J6370J8833K1475K4043
62594F66496K6648K9434L2177L4395L5893L6952L7711L7641L6058L2998K9079
62583A035482K4554J9150J2845O124o96p700j4714k1052k6245l0413l3590l5369
62571I28376l5748l5560l5430l4807l2832k9800k6929k4830k3066k1157j9261
$$ plain form
62663 840609 798624 760930 727410 697703 671457 648414 628389 611069 595763 581575 568032
62652 568032 555399 544149 534272 525275 516749 508697 501418 495212 490130 485808 481664 477401 473272 469821
62638 469821 467510 466624 467241 469072 471418 473499 474832 475342 475316 475184 475020 474233 472119 468846 465488 462905
62622 462905 461000 459335 458008 457533 458176 459831 462355 465639 469555 474188 479872 486617 493746 500538 506999
62607 506999 513498 519890 525727 531341 538059 547043 558337 571321 585775 602145 620978 642453 666496
62594 666496 693144 722578 754755 789150 825043 861995 899706 937347 973405 1006403 1035482
62583 1035482 1060036 1079186 1092031 1098155 1097459 1089759 1075045 1053993 1027748 997335 963745 928376
62571 928376 892628 857068 821638 786831 753999 724199 697270 672440 649374 628217 608956
62560F08956j7663j6152j4285j1970r597p726o677o288o043n523m622l419k126
62547D96865j214j123j602j764j124j81L86N62O16M98K19L58J224K003J684O64
62531D98071L40J110K001K402L009M505O412P996R394J1038J2665J3906J5289
62518E88138J7613K0547K3021K4914K7302L0758L4458L7435L9895M2490M4886
62507I31457M5966M5308M3702M2008M0109L7239L2951K7471K1337J5079R157L993
62495A295777o2k658l473k342N70M867J0097J5795K1545K7176L2855L8749M4599
62482A483495M9851N4150N7381N9071N8078N3173M4043L1699J8089N193o007j6171
62470A892045k7055l9917n4170o7704p8371q5113q8007q7833q5740q2790p9394
$$ plain form
62560 608956 591293 575141 560856 548886 539289 531563 524886 518598 512555 507032 502410 498991 496865
62547 496865 495651 494528 492926 491162 490038 489857 490243 490805 491421 491919 492138 492496 493720 495723 497407 498071
62531 498071 498411 499521 501522 503924 506933 511438 517850 525846 535240 546278 558943 572849 588138
62518 588138 605751 626298 649319 674233 701535 732293 766751 804186 844081 886571 931457
62507 931457 977423 1022731 1066433 1108441 1148550 1185789 1218740 1246211 1267548 1282627 1291784 1295777
62495 1295777 1295715 1293057 1289584 1287242 1287812 1292679 1302776 1318571 1340116 1367292 1400147 1438896 1483495
62482 1483495 1533346 1587496 1644877 1703948 1762026 1815199 1859242 1890941 1909030 1914223 1908216 1892045
62470 1892045 1864990 1825073 1770903 1703199 1624828 1539715 1451708 1363875 1278135 1195345 1115951
62459A115951p5189o9649o2768n5064m7217l9864l3529k8337k3812j9278j4640
62448F46604j0547p657n858m382k633p03R04J936K690L722N247O884P996Q283
62434F52486P949P291O353N095L574J760o28l683o800r142j0561j1576j2297j2094
62420F17727j0724r184q699r207r547r035q074p247o587n992n638n610n592n294
62406E11297m827m282l398k099r68o56j009j283j090o36p8P49J865K846L295L310
62390E03036L281L357L361L167K958L057L509L992M191M230M551N323O214O838
62376E61065P292P937Q874R854J0671J1377J2129J2988J3945J4978J6086J7376
62364G04572J9129K1596K4771K8466L2574L7130M2110M7323N2484N7298O1472
$$ plain form
62459 1115951 1040762 971113 908345 853281 806064 766200 732671 704334 680522 661244 646604
62448 646604 636057 628400 622542 618160 615527 614824 615728 617664 620354 624076 629323 636207 644203 652486
62434 652486 660435 667726 674079 679174 682748 684508 683880 680197 673397 664255 653694 642118 629821 617727
62420 617727 607003 597819 589120 579913 570366 561331 553257 546010 539423 533431 527793 522183 516591 511297
62406 511297 506470 502188 498790 496691 495723 495067 494058 492775 491685 491049 490971 491720 493585 496431 499726 503036
62390 503036 506317 509674 513035 516202 519160 522217 525726 529718 533909 538139 542690 548013 554227 561065
62376 561065 568357 576294 585168 595022 605693 617070 629199 642187 656132 671110 687196 704572
62364 704572 723701 745297 770068 798534 831108 868238 910348 957671 1010155 1067453 1128925
62353A128925O4706O6609O6586O4023N8801N1517M2953L3435K2971J1963J377
62342A613866q000j6144k3452l0008l5523l9941m3718m7234n0105n1343n0402
62331A217996m7782m4487m0992l7143l2936k8904k5493k2564j9953j8136j7765
62320H81841j8601j9572j9995k0196k0656k1067k0691j9395j7822j6531j5340
62309F71975j3655j1263q624o432m846l350j412P46K351L029L250L586L875L558
62295F42788K693K031J996K091J620O88N6J47N70O46J01q62j868k509k385j359
62279F46444J53J345J753J747K143L281M691N834O866Q297J0009J1222J1623J2007
62265G27415J3329J5478J7660J9763K2582K6673L1633L6822M2127M7623N3042
$$ plain form
62353 1128925 1193631 1260240 1326826 1390849 1449650 1501167 1544120 1577555 1600526 1612489 1613866
62342 1613866 1605866 1589722 1566270 1536262 1500739 1460798 1417080 1369846 1319741 1268398 1217996
62331 1217996 1170214 1125727 1084735 1047592 1014656 985752 960259 937695 917742 899606 881841
62320 881841 863240 843668 823673 803477 782821 761754 741063 721668 703846 687315 671975
62309 671975 658320 647057 638433 632001 627155 623805 622393 623139 625490 628519 631769 635355 639230 642788
62295 642788 645481 647512 649508 651599 653219 653907 653963 654110 654680 655326 655427 654565 652697 650188 647803 646444
62279 646444 646597 647942 649695 651442 653585 656866 661557 667391 674257 682554 692563 703785 715408 727415
62265 727415 740744 756222 773882 793645 816227 842900 874533 911355 953482 1001105 1054147
62254A054147N8042O2587O6515O9043O9262O6926O2235N5186M5763L4723K3397
62243A667826J2654K555o989j5892k4343l2821m1367m9344n6156o1654o5593o7313
62231A261563o6457o3584n9609n5004m9964m4849l9909l4909k9752k5173k2055
62220G70298k0166j8254j5543j2479r902q147p179o971p229p221o456n306m447
62207F40998l784k534m32J663K725K752K634K988L645M242M792N419N904N948
62193F76960N690N527N541N493N434N881P196R059J0745J1718J1885J1549J1232
62180G83910J1309J1639J1763J1504J1151J0962J0766J0387J0158J0768J2655
62169I06972J5658J9246K2962K6767L0960L5628M0277M4242M7263M9253M9523
$$ plain form
62254 1054147 1112189 1174776 1241291 1310334 1379596 1446522 1508757 1563943 1609706 1644429 1667826
62243 1667826 1680480 1683035 1676046 1660154 1635811 1602990 1561623 1512279 1456123 1394469 1328876 1261563
62231 1261563 1195106 1131522 1071913 1016909 966945 922096 882187 847278 817526 792353 770298
62220 770298 750132 731878 716335 703856 693954 685807 678628 671657 664428 657207 650751 645445 640998
62207 640998 637214 634680 634248 635911 638636 641388 644022 647010 650655 654897 659689 665108 671012 676960
62193 676960 682650 688177 693718 699211 704645 710526 717722 726781 737526 749244 761129 772678 783910
62180 783910 795219 806858 818621 830125 841276 852238 863004 873391 883549 894317 906972
62169 906972 922630 941876 964838 991605 1022565 1058193 1098470 1142712 1189975 1239228 1288751
62158A288751M7008M1448L3842K5473J6980Q657R06o154j2950j9628k5443k9693
62146A369197l2860l6014l9237m1538m2257m1769m0620l8774l5901l1971k7306
62135I60950k2508j8380j5450j3404j1493r576q250p885q127q507q934r247q938
62122H10251p777o282m974l614j683N89K416L509M359N320N961N536L809J185
62108H18605j687m192n818o321n837m690l195j789j225k144m320o662q180q676
62094G53869q227o537l525k37J738J995J672J862K480L045L703M717N671O124
62080G68350O630Q065J0249J2210J3616J4946J6325J7338J8095J9348K1166K2596
62068I48934K3196K3923K5771K8275L0284L1627L2990L4530L5487L5166L3438
$$ plain form
62158 1288751 1335759 1377207 1411049 1436522 1453502 1462159 1463065 1456911 1443961 1424333 1398890 1369197
62146 1369197 1336337 1300323 1261086 1219548 1177291 1135522 1094902 1056128 1020227 988256 960950
62135 960950 938442 920062 904612 891208 879715 870139 861889 854004 845877 837370 828436 819189 810251
62122 810251 802474 796192 791218 787604 785921 786510 788926 792435 796794 802114 808075 813611 817420 818605
62108 818605 816918 812726 806908 800587 794750 790060 786865 785076 783851 781707 777387 770725 762545 753869
62094 753869 745642 739105 735580 735343 737081 739076 740748 742610 745090 748135 751838 756555 762226 768350
62080 768350 774980 783045 793294 805504 819120 834066 850391 867729 885824 905172 926338 948934
62068 948934 972130 996053 1021824 1050099 1080383 1112010 1145000 1179530 1215017 1250183 1283621
62057A283621L0241K5302J8682J1167L851k526p860j2548j7153k1965k6858l1579
62045A252375l6029m0050m3141m4767m4959m4315m3387m2221m0588l8432l5938
62034G98548l3293l0487k7462k4368k1522j9054j6763j4528j2642j1427j0661
62023E76341r787q708p856p449p155o705o327o245o201n896n485n242m980m327
62009D83978l310k208j036K87J402J786J577J529K026K685L095L421L900M158
61995E03290L637K483J518J228J202P75r7r40j589k466l904n550o754p355p699
61980D77779q028q175p915p232o198m973m003l784m208m484m050l218k661k510
61966D06340k367j971j403p47K4P71J180J111P72N29O34J105J637J761J360R46
$$ plain form
62057 1283621 1313862 1339164 1357846 1369013 1372864 1370338 1362478 1349930 1332777 1310812 1283954 1252375
62045 1252375 1216346 1176296 1133155 1088388 1043429 999114 955727 913506 872918 834486 798548
62034 798548 765255 734768 707306 682938 661416 642362 625599 611071 598429 587002 576341
62023 576341 566554 557846 549990 542541 535386 528681 522354 516109 509908 504012 498527 493285 488305 483978
62009 483978 480668 478460 477424 477711 479113 480899 482476 484005 486031 488716 491811 495232 499132 503290
61995 503290 506927 509410 510928 512156 513358 514133 514036 513096 511507 509041 505137 499587 492833 485478 477779
61980 477779 469751 461576 453661 446429 440231 435258 431255 427471 423263 418779 414729 411511 408850 406340
61966 406340 403973 402002 400599 399852 399876 400647 401827 402938 403710 404239 404873 405978 407615 409376 410736 411682
61950D11682J168K101L241M149M757N199N635O316P394Q560R249R309R197R294
61936D97251R411R211Q820Q644Q677Q401P481O282N484N291N175M443K927J070
61922E88568n80j800k620l104l352l608l995m261m019l255k257j060O69K937N045
61907E63308O362P181Q237R471R937R114P610O179M662K581L66r66j263j497k280
61892F29002k979k856k328k386l148l863m113m177m228l996l492l319l926n017
61878E79174o065p012q019q909r223q771p782o684n891n598n555n160m051k444
61864D88010q44M38J373K166L229M892O817Q105Q321Q171Q761J0376J2356J4022
61850E76193J5258J6276J7177J7880J8150J7716J6593J5197J3914J2635J0949
$$ plain form
61950 411682 412850 414951 418192 422341 427098 432297 437932 444248 451642 460202 469451 478760 487957 497251
61936 497251 506662 515873 524693 533337 542014 550415 557896 564178 569662 574953 580128 584571 587498 588568
61922 588568 587988 586188 583568 580464 577112 573504 569509 565248 561229 557974 555717 554657 555326 558263 563308
61907 563308 569670 576851 585088 594559 604496 613610 621220 627399 632061 634642 635008 634042 632779 631282 629002
61892 629002 626023 623167 620839 618453 615305 611442 607329 603152 598924 594928 591436 588117 584191 579174
61878 579174 573109 566097 558078 549169 539946 531175 523393 516709 510818 505220 499665 494505 490454 488010
61864 488010 487166 487604 488977 491143 494372 499264 506081 514186 522507 530678 539439 549815 562171 576193
61850 576193 591451 607727 624904 642784 660934 678650 695243 710440 724354 736989 747938
61839G47938Q757O273L512K74l248o246p975q376p858o634m691k266L7J774L130
61824G24401M575O133P243P483P123O719O246N036K610p33m187o995q664r161
61810G47829r133r542j0642j1575j1367j0130q903q500q959r894j0837j1247j0770
61797F16330r625q429p521o806o257o047o027n606m464l106k336k382k843l264
61783E41617l465l342k787j900j065o29n83o28n58m59n11o39n51j31L64O03O19
61766E25955P55J287K232L467M815N994O724O933O806O624O598O722O651N838
61752E97401M077J833k10j891l559n354o868p674p867p831p673p144o088m787
61738E36365l857l777m397m911m539l318k023j260r02n01N6O01J072J520J790
$$ plain form
61839 747938 756695 762968 766480 766754 763506 757260 749285 740909 733051 726417 721726 719460 719497 721271 724401
61824 724401 728976 735109 742352 749835 756958 763677 769923 774959 777569 776836 772649 765654 756990 747829
61810 747829 738696 729154 718512 706937 695570 685440 676537 668037 659078 649184 638347 627100 616330
61797 616330 606705 598276 590755 583949 577692 571645 565618 560012 555548 552442 550106 547724 544881 541617
61783 541617 538152 534810 532023 530123 529058 528429 527846 527218 526660 526201 525690 525051 524500 524369 524733 525336 525955
61766 525955 526710 527997 530229 533696 538511 544505 551229 558162 564968 571592 578190 584912 591563 597401
61752 597401 601478 603311 603101 601210 597651 592297 585429 577755 569888 562057 554384 547240 541152 536365
61738 536365 532508 528731 524334 519423 514884 511566 509543 508283 507381 506880 506936 507537 508609 510129 511919
61723E11919J644J218J028J407K125K660K651K081J261O93P29J100J019k7j577
61708E29931k596k562j969j714k150k909l499l843m146m454m525m159l537l093
61694D84775l077l342l594l699l714l671l539l386l447l878m476m706m090k720
61680D33436j346p51r36j138q32m34o72j454j935j676j108o96l10K18N02K33j40
61663D20961K6N48P53O76J059K103L048L333L392L875M578M718L960K684J416
61648D57130M58p9k62m06p53j087r12j00P75R67L88k34j73M41Q83R29J180J973
61630D61118K530J864K52j062j552j984l079m467n368n593n384m766l769k873
61616D25867k614k886l169l212l135l039k951l004l234l329k992k436k196k461
$$ plain form
61723 511919 513563 514781 515809 517216 519341 522001 524652 526733 527994 528687 529416 530516 531535 531508 529931
61708 529931 527335 524773 522804 521090 518940 516031 512532 508689 504543 500089 495564 491405 487868 484775
61694 484775 481698 478356 474762 471063 467349 463678 460139 456753 453306 449428 444952 440246 436156 433436
61680 433436 432090 431339 430403 429265 428433 427999 427327 425873 423938 422262 421154 420458 420148 420366 420868 421101 420961
61663 420961 420987 421535 422288 422964 424023 426126 429174 432507 435899 439774 444352 449070 453030 455714 457130
61648 457130 457588 457509 457247 456841 456088 455001 454089 453989 454764 455731 456119 455885 455712 456153 457036 457965 459145 461118
61630 461118 463648 465512 465764 464702 463150 461166 458087 453620 448252 442659 437275 432509 428740 425867
61616 425867 423253 420367 417198 413986 410851 407812 404861 401857 398623 395294 392302 389866 387670 385209
61602C85209k950l267l179k695k148j997k291k536k365k010j844j839j888k245
61588C51955l037l643l320k272j446j246j167p86l69k78l45k53m6O9J42K93L47
61571C34598Q6l00l80j35n5l92o29p7J067J794J570J086J333K190K655K256J552
61554C48219J206J324J819K601L113K548J083R4M67J366J406M66m95r26r68o11
61538C62712L55J548K139J894J442J379J684K013J981J220k04j528j996j718j318
61523C71603r68n37l74r87j946k166j412n83l29l02j19p1l95o08k26M29O96M52
61505C62157P8j21r5J05L37N04P71J324J920K155K214K703L581M045L710L206
61489C88594L122L049K282J030J80J43N15P98R82J374K125L020L640L732L422
$$ plain form
61602 385209 382259 378992 375813 373118 370970 368973 366682 364146 361781 359771 357927 356088 354200 351955
61588 351955 348918 345275 341955 339683 338237 336991 335824 335038 334669 334391 334046 333793 333747 333816 333958 334251 334598
61571 334598 334684 334384 334004 333869 333814 333422 332793 332716 333783 335577 337147 338233 339566 341756 344411 346667 348219
61554 348219 349425 350749 352568 355169 358282 360830 361913 362007 362474 363840 365246 365712 365217 364291 363323 362712
61538 362712 363067 364615 366754 368648 370090 371469 373153 375166 377147 378367 378163 376635 374639 372921 371603
61523 371603 370635 370098 369724 368737 366791 364625 363213 362630 362301 361999 361880 361809 361414 360806 360580 361009 361705 362157
61505 362157 362235 362114 362019 362124 362461 362965 363736 365060 366980 369135 371349 374052 377633 381678 385388 388594
61489 388594 391716 394765 397047 398077 398257 398400 398915 399713 400695 402069 404194 407214 410854 414586 418008
61474D18008K945K335J592R49N45P5p74j668k031j988k129k455k361j835j729
61459D09479k513l474l646k892j742o94l2J80K41M86O75K97m21o05l0N65P72J075
61441C97721J697J900J222N07P12J429J593J156R95J488K092K246J856J061J72
61426D17847k20K57J144J568J165L64p0M37J822L107L136J934P87N79P46M57l6
61409D35024r2Km94j383j769j440j037r46r56r05q52o64k80j65o70j168p64K78
61391D21719Q39O51N61J033J407J106N25L60P30J405K214K906L210L356L954N048
61375D51024N830N643M761L962L702L965M378M254L115J362j4n83q44j267j647
61360D87641j716j710j870j949j648j136o65q8P50J525J875K059K641L610M305
$$ plain form
61474 418008 420953 423288 424880 425829 426374 426449 425675 424007 421976 419988 417859 415404 413043 411208 409479
61459 409479 406966 403492 399846 396954 395212 394518 394486 394666 394907 395393 396068 396365 395944 395339 395309 395874 396646 397721
61441 397721 399418 401318 402540 403047 403759 405188 406781 407937 408932 410420 412512 414758 416614 417675 417847
61426 417847 417627 417884 419028 420596 421761 422125 422055 422492 424314 427421 430557 432491 433278 433857 434603 435060 435024
61409 435024 434932 434934 434440 433057 431288 429848 428811 427865 426909 426004 425152 424488 424208 424043 423373 422205 421441 421719
61391 421719 422558 423209 423770 424803 426210 427316 427841 428201 428931 430336 432550 435456 438666 442022 445976 451024
61375 451024 456854 462497 467258 471220 474922 478887 483265 487519 490634 491996 491982 491399 490555 489288 487641
61360 487641 485925 484215 482345 480396 478748 477612 476947 476859 477609 479134 481009 483068 485709 489319 493624
61345D93624M194L429K599K177K178K235K009J590J341J413J580J565J234N00
61331E21668n62j483j731j450j387j803j974j213M2P31N63L11Q03K076L626M988
61315E23205N933O437O745P311Q365R626J0599J1240J2082J3555J5257J6217J5958
61302F62530J5069J4422J4038J3057J0823P598M097P07k505n285p134p935q247
61289G11235q824r874j0978j1660j1833j1637j1147j0435r739r255q774p900o588
61276E82591n182l888k561j127J38R62J416J677J781J750J705J565J047K72O5
61261E82211J169L273N248O263O412O307O345O384N910M619K860J357M17k57q91
61246F37627j292j364j459j813k111k030j800j727j629j322j180j510j771j232
$$ plain form
61345 493624 497818 501247 503846 506023 508201 510436 512445 514035 515376 516789 518369 519934 521168 521668
61331 521668 521106 519623 517892 516442 515055 513252 511278 510065 510107 510838 511401 511712 512515 514591 518217 523205
61315 523205 529138 535575 542320 549631 557996 567622 578221 589461 601543 615098 630355 646572 662530
61302 662530 677599 692021 706059 719116 729939 737537 741634 742341 739836 734551 727417 719482 711235
61289 711235 702411 692537 681559 669899 658066 646429 635282 624847 615108 605853 597079 589179 582591
61276 582591 577409 573521 570960 569833 569971 570933 572349 574026 575807 577557 579262 580827 581874 582146 582211
61261 582211 583380 586653 591901 598164 604576 610883 617228 623612 629522 634141 637001 638358 638775 638518 637627
61246 637627 636335 634971 633512 631699 629588 627558 625758 624031 622402 621080 619900 618390 616619 615387
61232F15387j14P71J365K377M010N605O692P573Q607R592J0229J0510J0466J0016
61218G03086R370Q996Q942Q659P836O927O554O748P027O934O286N232M239L792
61204H00628L940M303M569M700M736M785N198O315P986R717J1259J2627J3594
61191H94357J3769J3212J2383J1369R731P287M463J770o14k549l843m720n710
61178I50905o854p566p641p810q778j0177j1016j0931j0536j0637j1448j2527
61166H34984j3240j3379j3350j3634j4143j4407j4242j3827j3187j2185j1032
61155F88358j0159r442q199o187l993k155n49J053K431L320L834L981L347J784
61141F67424j1j188j674j911k100k200k258k158j345N16K799M485N410O315P767
$$ plain form
61232 615387 615273 616044 617409 619786 623796 629401 636093 643666 652273 661865 672094 682604 693070 703086
61218 703086 712456 721452 730394 739053 746889 753816 760370 767118 774145 781079 787365 792597 796836 800628
61204 800628 804568 808871 813440 818140 822876 827661 832859 839174 847160 856877 868136 880763 894357
61191 894357 908126 921338 933721 945090 954821 962108 966571 968341 967727 965178 961335 956615 950905
61178 950905 944051 936485 928844 921034 912256 902079 891063 880132 869596 858959 847511 834984
61166 834984 821744 808365 795015 781381 767238 752831 738589 724762 711575 699390 688358
61155 688358 678199 668757 660558 654371 650378 648223 647674 648727 651158 654478 658312 662293 665640 667424
61141 667424 667413 666225 664551 662640 660540 658340 656082 653924 652579 653095 655894 660379 665789 672104 679871
61126F79871R650J1696J3825J5822J7223J7968J8728K0247K2487K4749K6498K7798
61114I06562K8906K9734K9921K9366K8440K7580K6818K5864K4535K2877K0972
61103A201575J8818J6457J4036J1628R079O047K262k119o343r516j1449j2802
61091A237673j4267j5798j6911j7356j7144j6233j4702j3016j1578j0182q377
61080A082109o211m066j954M24L027N492P767J0159J2697J5100J7289J9362K1112
61067A182307K2182K2697K3162K3781K4446K5264K6334K7144K6990K5969K4752
61056A455028K3484K1834J9987J8544J7344J5508J2902J0406Q524O783M876L300
61044A618520K393J756J131Q65J050J212J305J995L385M599N178N882P402R352
$$ plain form
61126 679871 689521 701217 715042 730864 748087 766055 784783 805030 827517 852266 878764 906562
61114 906562 935468 965202 995123 1024489 1052929 1080509 1107327 1133191 1157726 1180603 1201575
61103 1201575 1220393 1236850 1250886 1262514 1271593 1277640 1279902 1277783 1271440 1261924 1250475 1237673
61091 1237673 1223406 1207608 1190697 1173341 1156197 1139964 1125262 1112246 1100668 1090486 1082109
61080 1082109 1075898 1071832 1069878 1070302 1073329 1078821 1086588 1096747 1109444 1124544 1141833 1161195 1182307
61067 1182307 1204489 1227186 1250348 1274129 1298575 1323839 1350173 1377317 1404307 1430276 1455028
61056 1455028 1478512 1500346 1520333 1538877 1556221 1571729 1584631 1595037 1603561 1610344 1615220 1618520
61044 1618520 1620913 1622669 1623800 1624665 1625715 1626927 1628232 1630227 1633612 1638211 1643389 1649271 1656673 1666025
61030A666025J1268J3482J6225J8910K1194K3641K6496K8867L0147L1118L2606
61019A919979L4305L6174L9753M6511N5725O5640P5955Q7553J00578J14540J30018
61008B706731J48777J72761K04351K46866L02984L73022M56345N53608O66068
60999E831513P94485R41844J115921J323728J560313J802847K011987K132452
60991A7515090K095734J843425J374271P78155K11849j79218l32406k78558j02140
60982B2926202R6177K09654J36959j75816o87654j266003j754904k054469k149422
60973A5280724k080904j904854j671317j421354j184811r76929q00751o54209
60965D585595n34482m37999l60439k98159k48674k09732j79003j54612j35096
$$ plain form
61030 1666025 1677293 1690775 1707000 1725910 1747104 1770745 1797241 1826108 1856255 1887373 1919979
61019 1919979 1954284 1990458 2030211 2076722 2132447 2198087 2274042 2361595 2462173 2576713 2706731
61008 2706731 2855508 3028269 3232620 3479486 3782470 4155492 4611837 5165445 5831513
60999 5831513 6625998 7567842 8683763 10007491 11567804 13370651 15382638 17515090
60991 17515090 19610824 21454249 22828520 23606675 23818524 23639306 23306900 23028342 22926202
60982 22926202 23022379 23232033 23368992 23193176 22505522 21239519 19484615 17430146 15280724
60973 15280724 13199820 11294966 9623649 8202295 7017484 6040555 5239804 4585595
60965 4585595 4051113 3613114 3252675 2954516 2705842 2496110 2317107 2162495 2027399
60956B027399j19017j05326r3815q4314p5756o6887n7656m9166m2326l7247l3767
60945A262122l1835l1238l1500l2094l2488l2181l1090k9715k8569k7539k6164
60934I27709k4367k2551k1029j9716j8395j6969j5528j4233j3180j2266j1354
60923G38121j0445r574q604p441o353n724n495n281m956m677m397l909l389l222
60909F54654l276k946k083j144l98K95P05J36j449l005l664l769m078m627n067
60894F20284n504o226o941p127o901o850p058p039o575o056n906o072o258o337
60880E29434o420o650o945o930o267n066l792k737j895j341j249j404j209m09
60866D77120N77J318J859K330K639K917L688N080O319O637O299O097O123N788
$$ plain form
60956 2027399 1908382 1803056 1709241 1624927 1549171 1482284 1424628 1375462 1333136 1295889 1262122
60945 1262122 1230287 1199049 1167549 1135455 1102967 1070786 1039696 1009981 981412 953873 927709
60934 927709 903342 880791 859762 840046 821651 804682 789154 774921 761741 749475 738121
60923 738121 727676 718102 709498 702057 695704 689980 684485 679204 674248 669571 665174 661265 657876 654654
60909 654654 651378 648432 646349 645205 644807 645102 645807 645943 644494 641489 637825 634056 629978 625351 620284
60894 620284 614780 608554 601613 594486 587585 580735 573677 566638 560063 554007 548101 542029 535771 529434
60880 529434 523014 516364 509419 502489 496222 491156 487364 484627 482732 481391 480142 478738 477529 477120
60866 477120 477697 479015 480874 483204 485843 488760 492448 497528 503847 510484 516783 522880 529003 534791
60852E34791M899M011L613L552L428L123K748K374J970J422N90n69j887l196m508
60837E56361n843o928p349o965o115n424n413o092o765o535n227l749l226l873
60823D76857m916n451n177m391l619l314l614m255m725m711m326l985m003m299
60809D16071m519m352l779l005k357k091k124j934j031L10J185J088M82J32K28
60794C94304M89P31Q82Q87J025J862L289M154L618K453K045K425K477J890J559
60779D24090J912K150J654R22N47J51q07j894k202j550o11p5j27m80o28l96k80
60762D22376p59j399j371q58r03j654j980j264m52o30j564k443l065l382k810
60747C97842j133O78J559J703J789J607O24o44j261j460k257l619m340l844k880
$$ plain form
60852 534791 539690 543701 547314 550866 554294 557417 560165 562539 564509 565931 566521 565952 564065 560869 556361
60837 556361 550518 543590 536241 529276 523161 517737 512324 506232 499467 492932 487705 483956 480730 476857
60823 476857 471941 466490 461313 456922 453303 449989 446375 442120 437395 432684 428358 424373 420370 416071
60809 416071 411552 407200 403421 400416 398059 395968 393844 391910 390879 391189 392374 393462 393944 394076 394304
60794 394304 394793 395524 396406 397293 398318 400180 403469 407623 411241 413694 415739 418164 420641 422531 424090
60779 424090 426002 428152 429806 430728 431275 431426 430619 428725 426523 424973 424362 424287 424160 423680 423052 422656 422376
60762 422376 421617 420218 418847 417989 417086 415432 413452 412188 411736 411106 409542 407099 404034 400652 397842
60747 397842 396709 397387 398946 400649 402438 404045 404669 404025 402764 401304 399047 395428 391088 387244 384364
60732C84364k273k008j816j676j472r46k76J2n8J48Q45J414J325R57J075J845
60716C81460K652K701J836Q99J043K365L631L773L222L026L190K899K103J657
60702D16457J821J797J077K01k75o50j370k178k572k574k496k436k452k729l131
60687C98490l023k053p72M8L51O49J119J463J485J372J369J528J765J966J983
60672D07740J708J200O64K73Kl83j049j831k334k486k638k946k915k048o93K46
60656C92510L68rn34j055j198m46J043K365K982L332L929M412M080L017J940J122
60640D17858P3j507l071l790l538k984k747k748k467j711q73l97k05P7N03O60
60624C93133L06j78j72M34J096J274J004O78M36P8l67m62n2K42k20j020j059j2
$$ plain form
60732 384364 382091 380083 378267 376591 375119 374173 373897 373909 373851 373999 374844 376258 377583 378540 379615 381460
60716 381460 384112 386813 388649 389548 390591 392956 396587 400360 403582 406608 409798 412697 414800 416457
60702 416457 418278 420075 421152 421353 421078 420428 419058 416880 414308 411734 409238 406802 404350 401621 398490
60687 398490 395467 393414 392642 392690 393041 393690 394809 396272 397757 399129 400498 402026 403791 405757 407740
60672 407740 409448 410648 411312 411585 411587 411204 410155 408324 405990 403504 400866 397920 395005 392957 392264 392510
60656 392510 392878 392869 392335 391280 390082 389636 390679 393044 396026 399358 403287 407699 411779 414796 416736 417858
60640 417858 417931 416424 413353 409563 406025 403041 400294 397546 395079 393368 392495 392098 391893 391970 392473 393133
60624 393133 393439 393261 393089 393523 394619 395893 396897 397575 398011 398089 397722 397260 397208 397450 397230 396210 395151 395139
60606C95139J293K024K146J836R96j08n49J58J197J526J307J376J751J711J150
60591D12953P24P08P07O53J050J971K715K797K497K104J388L02n40n95q4M99J042
60574D30891J589K007K366L156M601O203P409Q352R392J0396J1056J1521J2014
60561E20953J2068J0936Q634N945L390R07j447l157l974m367m928n564n630m612
60547E29154k534M5K292L558L979M414N529P108Q556R871J1582J3768J5770J7111
60533F30203J8153J9378K0422K0391J8960J6505J3245R001L973r53n003q150j0543
60520G45582j2001j2480j2581j2851j2913j1959r926p570n436l522j894r17o24
60507F40908m18L60J914M219P256J0801J4364J7708K1184K5236K9742L4063L7699
$$ plain form
60606 395139 396432 398456 400602 402438 403434 403326 402777 402935 404132 405658 406965 408341 410092 411803 412953
60591 412953 413677 414385 415092 415745 416795 418766 421481 424278 426775 428879 430267 430569 430029 429434 429350 429849 430891
60574 430891 432480 434487 436853 440009 444610 450813 458222 466574 475966 486362 497418 508939 520953
60561 520953 533021 543957 552591 558536 561926 562833 561386 558229 554255 549888 544960 539396 533766 529154
60547 529154 526620 526665 528957 532515 536494 540908 546437 553545 562101 571972 583554 597322 613092 630203
60533 630203 648356 667734 688156 708547 727507 744012 757257 766258 770231 769278 764275 756125 745582
60520 745582 733581 721101 708520 695669 682756 670797 660871 653301 647865 644343 642449 641532 640908
60507 640908 640490 640850 642764 646983 654239 665040 679404 697112 718296 743532 773274 807337 845036
60494H45036M0657M3221M5384M6590M6060M3493L9399L4669K9866K4932J9405
60483A258712J2779M846m052j3201k2020l0272l7745m4084m9106n2910n5328n5706
60471I11913n3666m9798m5154m0320l5450l0818k6728k3081j9692j6785j4645
60460E55776j2980j1306r767q752q012o994n919n423n216m279k677j887k760m186
60446D65618m543l685k667k186k128k215k227j872j154o39p60j109r82m40j83
60431D38828n34j119j544j749j667j093j00P42Q27J04q38j216p22J73P07P29Q68
60414D32396J607K516K726J990R25K87L84J099K091K881L043K533J755J268J406
60399D58907K077K844L203K941K252J596J423J930K856L577L611L092K546K243
$$ plain form
60494 845036 885693 928914 974298 1020888 1066948 1110441 1149840 1184509 1214375 1239307 1258712
60483 1258712 1271491 1276337 1272285 1259084 1237064 1206792 1169047 1124963 1075857 1022947 967619 911913
60471 911913 858247 808449 763295 722975 687525 656707 629979 606898 587206 570421 555776
60460 555776 542796 531490 521723 512971 504959 497965 492046 486623 481407 477128 474451 472564 469804 465618
60446 465618 461075 457390 454723 452537 450409 448194 445967 444095 442941 442302 441542 440433 439451 439011 438828
60431 438828 438294 437175 435631 433882 432215 431122 431022 431764 432591 432695 431857 430641 429919 430092 430799 431528 432396
60414 432396 434003 436519 439245 441235 442160 442447 442831 443930 446021 448902 451945 454478 456233 457501 458907
60399 458907 460984 463828 467031 469972 472224 473820 475243 477173 480029 483606 487217 490309 492855 495098
60385D95098K042J829J743J858J994K045K171K457K612K351J885J696J908K142
60371E23831J993J458Q88O43Q68J442K062K397K285J860J503J524J913K475L164
60356E50306M035M898N385N515N840O722P784Q395Q413Q045P296N944L981J625
60342F34184q73l148m668n308n666o289o849o675n852n087m659m233l664l196
60328E68017k881k592k586l240m137m290l452k440j938j779j578j245n55R28L046
60313E39278M912O049O993Q340R894J1181J2138J2741J2687J2034J1537J1743
60301F59527J2148J1864J0610Q571N819K482j005m431q133j2167j5535j7007j6454
60288F36289j4830j2999j1115q981o532m100k351j735j848j834j637k089l486
$$ plain form
60385 495098 497140 498969 500712 502570 504564 506609 508780 511237 513849 516200 518085 519781 521689 523831
60371 523831 525824 527282 528170 528813 529681 531123 533185 535582 537867 539727 541230 542754 544667 547142 550306
60356 550306 554341 559239 564624 570139 575979 582701 590485 598880 607293 615338 622634 628578 632559 634184
60342 634184 633311 630163 625495 620187 614521 608232 601383 594708 588856 583769 579110 574877 571213 568017
60328 568017 565136 562544 559958 556718 552581 548291 544839 542399 540461 538682 537104 535859 535304 536232 539278
60313 539278 544190 550239 557232 565572 575466 586647 598785 611526 624213 636247 647784 659527
60301 659527 671675 683539 694149 702720 708539 711021 710016 705585 697452 685285 669750 652743 636289
60288 636289 621459 608460 597345 588364 581832 577732 575381 573646 571798 569964 568327 566238 562752
60275E62752m893n415n323n181m733l634k660k891m042m695m171l110k289j845
60261E07870j754k115k658k696j951r01j93j9j69k95l3P07J559K055K132K022
60245E03561J829J594J526J737J951J844J504J100M56n05j215j044k63K89L94
60230E14758O16J314K148K631K675K461K295K583L495M610N297N474N625O140
60216E62122O965P797Q329Q414Q354Q717R600J0391J0678J0890J1448J1820J1270
60203F86795J0080R047Q160O841N368M775N210N493M684L097J421k16j789k870
60189G46096l254l442m001m854n692o539p456q150q362q298q197p839o982n954
60175F57076n325n109m755l877k727j941j938k494k875k579j977j870k436k977
$$ plain form
60275 562752 557859 552444 547121 541940 537207 533573 530913 528022 523980 519285 515114 512004 509715 507870
60261 507870 506116 504001 501343 498647 496696 495795 495602 495583 495414 495119 495086 495793 497352 499407 501539 503561
60245 503561 505390 506984 508510 510247 512198 514042 515546 516646 517102 516597 515382 514338 514075 514364 514758
60230 514758 515374 516688 518836 521467 524142 526603 528898 531481 534976 539586 544883 550357 555982 562122
60216 562122 569087 576884 585213 593627 601981 610698 620298 630689 641367 652257 663705 675525 686795
60203 686795 696875 705922 714082 720923 726291 731066 736276 741769 746453 749550 750971 750755 748966 746096
60189 746096 742842 739400 735399 730545 724853 718314 710858 702708 694346 686048 677851 670012 663030 657076
60175 657076 651751 646642 641887 638010 635283 633342 631404 628910 626035 623456 621479 619609 617173 614196
60161F14196k894k349j786j260o46j49q2k68j77L97J113J586J812J949J964J710
60145F15116J340J307J873K776L600M325N176N983O312O314O770P941Q925Q820
60131F86578Q059P820Q343Q639P905O429M980L956L374L111K973K826K912L533
60117G61438M410M796M387L652L085K676K350K322K586K484J442j05j096j168
60103G93259j160k057l744n131n438m965m461m061l330k218j311r74q40m66p0
60088G53033j11n56j030j406j809k313l074m307n696o205n241l651k929l575m911
60073G06219o179p115p631p857q318r300j0177j0104r309q688q384p717o553n542
60059E93345m923m173l128k386k194j970j372q69p46m18O90K281L733M775N265
$$ plain form
60161 614196 611302 608953 607167 605907 605261 605112 605030 604762 604585 604982 606095 607681 609493 611442 613406 615116
60145 615116 616456 617763 619636 622412 626012 630337 635513 641496 647808 654122 660892 668833 677758 686578
60131 686578 694637 702457 710800 719439 727344 733773 738753 742709 746083 749194 752167 754993 757905 761438
60117 761438 765848 770644 775031 778683 781768 784444 786794 789116 791702 794186 795628 795523 794427 793259
60103 793259 792099 790042 786298 781167 775729 770764 766303 762242 758912 756694 755383 754409 753569 753103 753033
60088 753033 752922 752366 751336 749930 748121 745808 742734 738427 732731 726526 721285 717634 714705 711130 706219
60073 706219 700040 692925 685294 677437 669119 659819 649642 639538 630229 621541 613157 605440 598887 593345
60059 593345 588422 584249 581121 578735 576541 574571 573199 572330 571584 571166 571856 574137 577870 582645 587910
60044E87910N133M962N711P284Q313Q014P263P071O985O087M656L618K903J682
60030F67592n6j469k261l013m109n357o697q326r952j0812j0704j0302j0216j0329
60016E73989j0221r669q671p493o739o750o806n715l422j352p07j066j157n91
60002E03630j30m67j332j924j802j169m42K51J087K126L066L575L798M233N059
59987E19559N845O054N645M985M316L606K817K111J575R97L9j402l082m585n477
59972E43003n435m532l369k624k385k178j673j023l53N28J590K240K062J571J614
59957E29036K214K719K874K993L069K580J389J76l61j99L57J036J409R69j33r67
59941E49161r60n99n72p63p46p11j092j514j083K75J596K218K620L569M981O102
$$ plain form
60044 587910 593043 598005 603716 611000 619313 627327 634590 641661 648646 654733 659389 663007 665910 667592
60030 667592 667536 666067 663806 660793 656684 651327 644630 636304 626352 615540 604836 594534 584318 573989
60016 573989 563768 554099 545428 537935 531196 524446 517640 511925 508503 507151 506444 505378 504221 503630
60002 503630 503500 503033 501701 499777 497975 496806 496364 496615 497702 499828 502894 506469 510267 514500 519559
59987 519559 525404 531458 537103 542088 546404 550010 552827 554938 556513 557510 557549 556147 553065 548480 543003
59972 543003 537568 533036 529667 527043 524658 522480 520807 519784 519431 519959 521549 523789 525851 527422 529036
59957 529036 531250 533969 536843 539836 542905 545485 546874 547050 546689 546490 546847 547883 549292 550261 550128 549161
59941 549161 548201 547602 547030 546267 545521 544810 543718 542204 541121 541396 542992 545210 547830 551399 556380 562482
59925E62482O535O519O314N813M871L622K307R81k68j052j063p03p06j071q71
59910E93710M42K097K947K965L044L470L487K507R43m13j291j824k054j923j491
59895F06616q25R5J146K012K569L050L661M285M756N176N792O673P630Q269Q166
59880F69071P303O289N820N919O075N997N771N371M607L562K519J383j38j724
59866G27825k561k438k040j903j835j654j742k324k956l263l514l906l885k887
59852F90917j344j75L81P64J236J728K327L256M357N158N432N280M681L431J574
59837G29003l54j605j632m43J329K842L616L624K907J512k24j789l038m191n182
59822G26375n563n210m594m117l740l476l546l802l593k674j629j073r97j252
$$ plain form
59925 562482 569017 575536 581850 587663 592534 596156 598463 599444 599176 598124 597061 596358 595652 594581 593710
59910 593710 594152 596249 599196 602161 605205 608675 612162 614669 615612 615199 613908 612084 610030 608107 606616
59895 606616 605791 605886 607032 609044 611613 614663 618324 622609 627365 632541 638333 645006 652636 660905 669071
59880 669071 676374 682663 688483 694402 700477 706474 712245 717616 722223 725785 728304 729687 729549 727825
59866 727825 725264 722826 720786 718883 717048 715394 713652 711328 708372 705109 701595 697689 693804 690917
59852 690917 689573 689398 689779 690543 691779 693507 695834 699090 703447 708605 714037 719317 723998 727429 729003
59837 729003 728649 727044 725412 724969 726298 729140 732756 736380 739287 740799 740575 738786 735748 731557 726375
59822 726375 720812 715602 711008 706891 703151 699675 696129 692327 688734 686060 684431 683358 682361 681109
59808F81109j967l045l885m135m119m139m014l750l893m541m882m421l870m014
59794F26434m406m243l726l545l553l159k583k500k736k540j984j893k407k751
59780E84408k488j972j418n69N14J157R79M49L49J126K658M209M779M255L892
59765F02328M836O389O829N844M963N390O571P273P138O606O138O050O524P304
59751F90183P785P786P743P921P958P484O694N973N387M829M261L600K677J523
59737G71804L91n64j283j575j331r39r48j329j617j726j865j781r60K88R53P48
59721G58266N02P25Q12K48l90m67m90j245k298k511j720p83j43N51J349J666J466
59704G55538J690K908M306M809M639M870N756O434O396O224O590P261P539P154
$$ plain form
59808 681109 679142 676097 672212 668077 663958 659819 655805 652055 648162 643621 638739 634318 630448 626434
59794 626434 622028 617785 614059 610514 606961 603802 601219 598719 595983 593443 591459 589566 587159 584408
59780 584408 581920 579948 578530 577961 578475 579632 580611 581060 581409 582535 585193 589402 594181 598436 602328
59765 602328 607164 613553 620382 626226 631189 636579 643150 650423 657561 664167 670305 676355 682879 690183
59751 690183 697968 705754 713497 721418 729376 736860 743554 749527 754914 759743 764004 767604 770281 771804
59737 771804 772195 771631 770348 768773 767442 766503 765555 764226 762609 760883 759018 757237 756277 756565 757518 758266
59721 758266 758768 759493 760305 760553 760163 759696 759206 757961 755663 753152 751432 750649 750506 751057 752406 754072 755538
59704 755538 757228 760136 764442 769251 773890 778760 784516 790950 797346 803570 810160 817421 824960 832114
59690H32114O143M399J995l87k032k987l707m210m339m509n192n909n841n399
59676H00139n916p496q635q443p898q066q387p870o813o007n106l355j309k38
59662G14600j57R1R18J676K147K927M112M976N248N542O123O432O174N779N324
59647G71912M169K168K09j227k986n773q615r899r478q676q425q387p935p080
59633F99977o132n071l776k606k269l001m157m829m829m808n365o346p128p284
59619F32376o778n851n041m955n646o378o373n534m204k604q99N82J705K728L710
59604E86838M084L446K293J356O50j96r92j225q92l43L68J197J633J408J182J599
59588F02406K057J610N79j8k92j216k671l434l239l219l901m352l838k956k401
$$ plain form
59690 832114 838257 842656 844651 844264 842232 839245 835538 831328 826989 822480 817288 811379 805538 800139
59676 800139 794223 786727 778092 769649 761751 753685 745298 737428 730615 724608 719502 716147 714838 714600
59662 714600 714443 714534 715452 717128 719275 722202 726314 731290 736538 742080 748203 754635 760809 766588 771912
59647 771912 776081 778249 778458 777231 774245 768472 759857 749958 740480 731804 723379 714992 707057 699977
59633 699977 693845 688774 684998 682392 680123 677122 672965 668136 663307 658499 653134 646788 639660 632376
59619 632376 625598 619747 614706 609751 604105 597727 591354 585820 581616 579012 578113 578695 580400 583128 586838
59604 586838 590922 594368 596661 598017 598667 598471 597479 596254 595362 595019 595387 596584 598217 599625 600807 602406
59588 602406 604463 606073 606652 606634 606342 605126 602455 599021 595782 592563 588662 584310 580472 577516 575115
59573E75115j889j180r34j592k348k144j095j30J86j40q92j623j791j378q34k51
59557E57080O48J518J474N82J24P33J405J177P15J185K412L304L572L812M315
59542E84056M833N432O645Q696J1181J3566J5650J7463J8790J8595J5304Q469
59530G28680J89o151q938r297q788p457m829j571J034K586L522M053M067L627
59516G00727K688Q86j673l953n153n785o704p658p874p538p530p895p825p083
59502F27630o365o088n766m884l655k665k122j702q73N83K164L014K912K537K474
59487F07194K490K279K258K923L882M387M542N069O016O645O579O354O598P284
59473F74500P860P728O529M394K032K46p12j177j546j910k037j637p82o8J09L96
$$ plain form
59573 575115 573226 572046 571112 569520 567172 565028 563933 563803 563989 563849 562957 561334 559543 558165 557331 557080
59557 557080 557728 559246 560720 561302 561426 562159 563564 564741 565456 566641 569053 572357 575929 579741 584056
59542 584056 588889 594321 600966 609662 620843 634409 650059 667522 686312 704907 720211 728680
59530 728680 728869 722718 713780 704483 695695 688238 683409 681838 682872 685458 688980 693033 697100 700727
59516 700727 703415 704301 702628 698675 693522 687737 681033 673375 665501 657963 650433 642538 634713 627630
59502 627630 621265 615177 609411 604527 600872 598207 596085 594383 593510 594093 596257 599271 602183 604720 607194
59487 607194 609684 611963 614221 617144 621026 625413 629955 635024 641040 647685 654264 660618 667216 674500
59473 674500 682360 690088 696617 701011 703043 703289 702577 701400 699854 697944 695907 694270 693488 693420 693529 693925
59457F93925J924M670P130Q127Q236Q724R803J0702J1029J1058J0814R807P781
59444H03730N149K510P9k397n276q443j1004j1880j0916r101p511o497n966n844
59430G26633n903n739n263m664l732j926O10K991M888O994R685J2332J4557J7031
59416G68494K0189K3216K5322K7128K9523L1983L3092L1896K7634J9262P127n519
59404A039347j4494j8154j7677j4414q802j666N291J0720J3869J3453Q040j691
59392A013822j2385k0586k5141k6738k6156k3837k0382j6663j3467j1203r603
59381H07661p868n699m013l816m520m436l033j600j356j899k052j415m99P7J1
59366G65543n84j097q54J66J377K406L382M350N090N630O388P555Q865J0123J1444
$$ plain form
59457 693925 695849 700519 707649 715776 724012 732736 742539 753241 764270 775328 786142 795949 803730
59444 803730 808879 811389 811468 809071 803795 795352 784348 772468 761552 752451 744940 738443 732477 726633
59430 726633 720730 714991 709728 705064 701332 699406 700016 703007 707895 714889 724574 736906 751463 768494
59416 768494 788683 811899 837221 864349 893872 925855 958947 990843 1018477 1037739 1044866 1039347
59404 1039347 1024853 1006699 989022 974608 965806 964140 969431 980151 994020 1007473 1015513 1013822
59392 1013822 1001437 980851 955710 928972 902816 878979 858597 841934 828467 817264 807661
59381 807661 799793 794094 790081 786265 781745 777309 774276 772676 771320 769421 767369 765954 765455 765532 765543
59366 765543 764959 763862 763008 763174 764551 766957 770339 774689 779779 785409 791797 799352 808217 818340 829784
59351H29784J2846J4101J5127J6088J7045J7957J8946K0003K0566K0081J8876
59340A021420J7666J6290J3851J0208O329K919l78m033p754j1116j4216j7192
59328A033994j9641k1072k1566k1487k0968k0046j8929j7787j6583j5436j4690
59317H25789j4355j3893j2868j1514j0363r658r404r540r745r351p914n738l654
59304F97792k249j485q67J04J597L441N417P404R290J0943J2366J3413J3159J0184
59290G80509M144l248r444j3105j4513j4401j3250j1490r509p284m592j651J013
59277F83179L259N350P294Q789R821J0760J1879J3188J4627J5899J6412J5917
59265H16374J4991J4216J3182J1116Q217N419K976K98k748n378o886p339p150
$$ plain form
59351 829784 842630 856731 871858 887946 904991 922948 941894 961897 982463 1002544 1021420
59340 1021420 1039086 1055376 1069227 1079435 1085764 1088683 1088305 1084272 1076518 1065402 1051186 1033994
59328 1033994 1014353 993281 971715 950228 929260 909214 890285 872498 855915 840479 825789
59317 825789 811434 797541 784673 773159 762796 753138 743734 734194 724449 715098 707184 701446 697792
59304 697792 695543 694058 693191 693295 694892 698333 703750 711154 720444 731387 743753 757166 770325 780509
59290 780509 784653 781405 771961 758856 744343 729942 716692 705202 695693 688409 683817 682166 683179
59277 683179 686438 691788 699082 707871 717692 728452 740331 753519 768146 784045 800457 816374
59265 816374 831365 845581 858763 869879 878096 883515 886491 886789 884041 878663 871777 864438 857288
59252H57288o695o413o472o268n030k922q91N88J694K361K254J723J680K261K601
59237H37759K227J685J490J369R63L63m25j742l500m950n639n985o579p571q916
59222H00549j0490j1765j2152j1921j1890j2046j1467r849q007o547n128l580
59210F85707k547k336k194j496p18m41k99J62N20L80M13J364K664L220L144L463
59194F91006M421N255N586N809N963N347L749K224J994K936L805L713K917K079
59180G46804J307L80l95l51L09K70j270l228l803k693j267o88q69j250j494j196
59164G30566M9J788K809K564J858J643J780J478L19j588l969o325p955q536q432
59149G08049q231q217q382q545q383p768p081o753o626o337o095o260o424n901
$$ plain form
59252 857288 850593 844180 837708 831440 826410 823488 822597 823185 824879 827240 829494 831217 832897 835158 837759
59237 837759 839986 841671 843161 844530 845493 845856 845431 843689 840189 835239 829600 823615 817036 809465 800549
59222 800549 790059 778294 766142 754221 742331 730285 718818 708969 700962 694415 689287 685707
59210 685707 683160 680824 678630 677134 676416 675975 675676 675838 676358 676738 677151 678515 681179 684399 687543 691006
59194 691006 695427 700682 706268 712077 718040 723387 727136 729360 731354 734290 738095 741808 744725 746804
59180 746804 748111 748491 748096 747745 748054 748324 747054 743826 740023 737330 736063 735375 734506 733256 731762 730566
59164 730566 730615 732403 735212 737776 739634 741277 743057 744535 744854 743266 739297 732972 725017 716481 708049
59149 708049 699818 691601 683219 674674 666291 658523 651442 644689 638063 631726 625631 619371 612947 607046
59135F07046n026m767n055m674l082j109M14J539K341K551K443K919M099N032
59121F04671N375O033P479Q721Q935Q797R243R980J0320J0501J0956J1237J0752
59108G23000R851R061Q076O591N343N035M966M019K422J219M77o20k201l563m379
59093G69297m909n084m533l486k645k165j610q87m67o31j195j909k603l148l726
59078G30299m772o080o570n722m654m840o048o649n819m409l601l556l586l067
59064F60926k085j418j767k763l129k220q71k77n84j139j512j564j132m32k39
59049F39794q62j488j292o24k24O9P50J367J082J24n50p51j025j273p25O81K041
59032F37094K773L168L570L979M572N672P005P800P955Q295R461J1158J2719J3768
$$ plain form
59135 607046 602020 597253 592198 587524 584442 583333 583747 585286 587627 590178 592621 595540 599639 604671
59121 604671 610046 616079 623558 632279 641214 650011 659254 669234 679554 690055 701011 712248 723000
59108 723000 732851 741912 749988 756579 761922 766957 771923 775942 778364 779583 780060 779440 777239 773676 769297
59093 769297 764388 759304 754771 751285 748640 746475 744865 743978 743511 742880 741685 739776 737173 734025 730299
59078 730299 725527 719447 712877 707155 702501 697661 691613 684964 679145 674736 671135 667579 663993 660926
59064 660926 658841 657423 655656 652893 649764 647544 646673 646396 645812 644673 643161 641597 640465 640033 639794
59049 639794 638932 637444 636152 635528 635304 635373 636123 637490 638572 638696 638146 637395 636370 635097 634372 635053 637094
59032 637094 639867 643035 646605 650584 655156 660828 667833 675633 683588 691883 701344 712502 725221 738989
59018G38989J4070J3351J1596R191O510L674P94j780l608m448m517m491m879n297
59004G69155m758k936o26J354L043M718O088O751O878O796O395N588M766M174
58990H17386L439K334J338O85k99j949l167k779j344l39m2M63J603L016M658O753
58974H31756Q719R612R718J0418J2238J4169J5213J5432J5217J4555J3475J2411
58962I82933J1645J0911R760P870N096J796j081l008m771p492j0950j3830j5563
58949I73316j6743j7759j8156j7694j6852j5956j4670j2918j1353j0418r594q144
58937H03059o146m213k669j427m22K65O68J045J617K249K481K107J647J758K194
58922H04213J951P30n23r24p47n82k59N69J535K175K887M227N769O686P048P556
$$ plain form
59018 738989 753059 766410 778006 787197 793707 797381 798175 796395 792787 788339 783822 779331 774452 769155
59004 769155 764397 761461 760835 762189 765232 769950 776038 782789 789667 796463 802858 808446 813212 817386
58990 817386 820825 823159 824497 825182 824883 822934 819767 816988 815644 815305 815263 815726 817329 820345 825003 831756
58974 831756 840475 850087 859805 870223 882461 896630 911843 927275 942492 957047 970522 982933
58962 982933 994578 1005489 1015249 1023119 1028215 1030011 1028930 1025922 1021151 1013659 1002709 988879 973316
58949 973316 956573 938814 920658 902964 886112 870156 855486 842568 831215 820797 811203 803059
58937 803059 796913 792700 790031 788604 788182 788447 789115 790160 791777 794026 796507 798614 800261 802019 804213
58922 804213 806164 806894 806371 805447 804700 804118 803859 804428 805963 808138 811025 815252 821021 827707 834755 842311
58906H42311Q394R313J0438J1930J3214J3698J3803J4211J4467J3654J2007J0563
58894I88003R492Q216O983O828P941R506J1184J3333J5667J7098J7259J6933J6696
58881A145139J6205J5037J3107J0200O238K181o23k188l835o150q253r423j0144
58868A167491j1050j1893j2156j1828j1210j0685j0811j1809j2887j3060j2676
58857A037426j2980j4146j5029j5033j4877j5056j5010j4279j3374j2778j2124
58846H82740j1011r759q825q249q140q848j0267j1638j2405j2554j2070j0926
58834G58048r643q879q340p153n319l717k608j502m82j58j20Q97K885M313M549
58819G22771M813N915O790O425N662N714O145N796M718L731K827J396m43j968
$$ plain form
58906 842311 850705 860018 870456 882386 895600 909298 923101 937312 951779 965433 977440 988003
58894 988003 997495 1005711 1012694 1019522 1027463 1036969 1048153 1061486 1077153 1094251 1111510 1128443 1145139
58881 1145139 1161344 1176381 1189488 1199688 1205926 1208107 1207484 1205296 1201461 1195311 1187058 1177635 1167491
58868 1167491 1156441 1144548 1132392 1120564 1109354 1098669 1087858 1076049 1063162 1050102 1037426
58857 1037426 1024446 1010300 995271 980238 965361 950305 935295 921016 907642 894864 882740
58846 882740 871729 861970 853145 844896 836756 827908 817641 806003 793598 781044 768974 758048
58834 758048 748405 739526 731186 724033 718714 714997 712389 710887 710405 710247 710127 711024 713909 718222 722771
58819 722771 727584 733499 740289 746714 752376 758090 764235 770031 774749 778480 781307 782703 782260 780292
58805G80292k987l839m582n015n251n543n819n965o142o392o399o079n838n816
58791G04625n542m805m125l895l704l060j988m90J704M195N714N694N292N908
58777G05523P342Q329Q270P487O125L938J017k028m696o816q222q716q404p787
58763G01362p420p492p623p197o166n228m854m499l453k020r75j53J110K352K285
58748F50029Q30m96o63k06K64J204L044N078O400O992P218P064O573O212O075
58733G05618N590M565L765L776M155M327M478M821M887M320L698L718M201M531
58719G66450M637M867N349O018O845P698Q325Q727R000Q735P299M785J944r34
58705H49745m052p139r495j1231j3197j5415j6868j7224j7441j8144j8669j8336
$$ plain form
58805 780292 777305 773466 768884 763869 758618 753075 747256 741291 735149 728757 722358 716279 710441 704625
58791 704625 699083 694278 690153 686258 682554 679494 677506 677016 678720 682915 688629 694323 699615 705523
58777 705523 712865 721194 729464 736951 743076 747014 748031 746003 741307 734491 726269 717553 709149 701362
58763 701362 693942 686450 678827 671630 665464 660236 655382 650883 647430 645410 644435 644282 645392 647744 650029
58748 650029 650859 650363 649700 649494 649758 650962 654006 659084 665484 672476 679694 686758 693331 699543 705618
58733 705618 711208 715773 719538 723314 727469 731796 736274 741095 745982 750302 754000 757718 761919 766450
58719 766450 771087 775954 781303 787321 794166 801864 810189 818916 827916 836651 843950 848735 850679 849745
58705 849745 845693 838554 829059 817828 804631 789216 772348 755124 737683 719539 700870 682534
58693F82534j7460j6489j5236j3566j1849j0205q366o640n786n569m847l525k879
58680E60117l347l646k873j915j694j622r00k5K48K81P82J727L017M999P364Q825
58664E71338Q959R088J0231J1425J1186R442O847L526k75l458n344o611p816q221
58650F10317p311o156n888o028n742n480n788n710m191k092j030r75o72K41J139
58635E54634J792K339K441J828J168J106J180Q54O96J183J373L05j114j307l49
58620E68129M95Q66J322J868K141K554L726N169N983O328O859P243O737N695N000
58605F30115M458L258J619N60L18L01J94n6q03k080k923k577j752j422j227l21
58589F27662R70J910K966N013P480Q991R466R999J0997J1894J2338J2300J1439
$$ plain form
58693 682534 665074 648585 633349 619783 607934 597729 589363 582723 576937 571368 566521 562996 560117
58680 560117 556770 553124 550251 548336 546642 545020 544120 544095 544343 544624 545406 547133 550150 555149 562513 571338
58664 571338 580297 589385 599616 611041 622227 631669 638516 642042 641767 638309 632965 626354 618538 610317
58650 610317 603006 596850 590962 584934 579192 573712 567924 562214 558023 555931 554901 553926 553254 553495 554634
58635 554634 556426 558765 561206 563034 564202 565308 566488 567342 568038 569221 570594 570899 569785 568478 568129
58620 568129 568624 569490 570812 572680 574821 577375 581101 586270 592253 598581 605440 612683 619420 625115 630115
58605 630115 634573 637831 639450 640010 640328 640629 640823 640767 639964 637884 634961 632384 630632 629210 627983 627662
58589 627662 628632 630542 633508 638521 646001 654992 664458 674457 685454 697348 709686 721986 733425
58576G33425R709Q152P757P931P494O641O574P714R655J2329J5783J9284K1996
58563H74444K4151K6329K8246K9478L0534L1805L2197L0374K6651K2107J6674
58552A172990R872K720k965o750r416j1068j1126r831q191o769n879o408q878
58539A098301j2239j5163j7917k1446k5256k7800k8509k7902k6283k3819k1276
58528H50691j9161j6881j4033j1584j0303r200p185n079m048l396k021q14j234
58515G45752k549l049k938l411l767k404m1J025N36L02Q62R97M71L78O27j80j952
58498G30659k804k001r38p11q42p93p51n12N62K194L526M777O834R304J0876J1465
58482G70845J2207J3548J5165J7285K0087K2258K2357K1154K0376J9631J7031
$$ plain form
58576 733425 743134 751286 759043 766974 774468 781109 787683 795397 805052 817381 833164 852448 874444
58563 874444 898595 924924 953170 982648 1013182 1044987 1077184 1107558 1134209 1156316 1172990
58552 1172990 1182862 1185582 1182617 1175867 1166451 1155383 1144257 1134426 1126235 1119466 1113587 1107179 1098301
58539 1098301 1086062 1070899 1052982 1031536 1006280 978480 949971 922069 895786 871967 850691
58528 850691 831530 814649 800616 789032 778729 769529 762344 757265 753217 749821 747800 746986 745752
58515 745752 743203 740154 737216 733805 730038 727634 727593 728618 729154 729456 730318 731315 731786 732164 732791 732611 730659
58498 730659 727855 725854 724916 724205 723363 722570 721819 721307 721869 724063 727589 732366 739200 748504 759380 770845
58482 770845 783052 796600 811765 829050 849137 871395 893752 914906 935282 954913 971944
58471I71944J2387P282K315l013p945j0777j1535j1780j1736j0196p194m169j461
58458I14122J777N179P348Q488J0241J2718J4315J4470J4054J2954R973N237J67
58445A031043m880j0364j5242j7729j8279j8844j9306j7777j4381j1367r340o716
58433H66818l296r31j10Q08K401L428L904N598Q669J1031J1820J2372J3031J2192
58419I47735R415O334L617J16m026o677p168p346q273q809q420q308q751q307
58405H91132o693n513n267m603l287k741k875j748P31K219K008K202L733M776
58391H74074M395M184M904M985L903L592M894N920N524N254O213P128P171P566
58377I49707Q868R596R038Q456Q390P803O898P413R104R590Q668Q943J0991J2066
$$ plain form
58471 971944 984331 991613 993928 990915 982970 972193 960658 948878 937142 926946 919752 915583 914122
58458 914122 915899 921078 928426 936914 947155 959873 974188 988658 1002712 1015666 1025639 1030876 1031043
58445 1031043 1026163 1015799 1000557 982828 964549 945705 926399 908622 894241 882874 873534 866818
58433 866818 863522 862591 862481 863289 865690 869118 873022 878620 887289 898320 910140 922512 935543 947735
58419 947735 957150 963484 967101 967217 963191 956514 949346 942000 933727 924918 916498 908190 899439 891132
58405 891132 884439 878926 873659 869056 865769 863028 860153 858405 859136 861355 863363 865565 869298 874074
58391 874074 878469 882653 887557 892542 896445 900037 904931 910851 916375 921629 927842 934970 942141 949707
58377 949707 958575 968171 977209 985665 994055 1001858 1008756 1016169 1025273 1034863 1043531 1052474 1063465 1075531
58363A075531J1151J1032J3406J6043J6808J6695J6726J5727J3350J1603J1201
58352A229273R940O761L816K618J780M79L04J753K779K705L635O128P704P551
58338A287226Q349J1250J3650J4184J5252J8126K0248K0078J9970K1444K2245
58327A472022K0936J9613J9214J7009J1953P567O236N481L335K282M181O277O193
58314A602299O136Q181J0165J0236J0673J3148J5086J4769J5017J7632J9390J8086
58302A760818J7221J9791K2671K2415K1462K3070K5013K4104K2453K3300K4974
58291B007292K4713K4370K6612K9450L0066L0105L1794L3045L1811L0964L3362
58280B333584L6468L7354L8360M2148M5891M6358M6028M8176N0673N0769N1075
$$ plain form
58363 1075531 1086682 1097714 1111120 1127163 1143971 1160666 1177392 1193119 1206469 1218072 1229273
58352 1229273 1239213 1245974 1249790 1252408 1254188 1254667 1254971 1256724 1259503 1262208 1265843 1271971 1279675 1287226
58338 1287226 1295575 1306825 1320475 1334659 1349911 1368037 1388285 1408363 1428333 1449777 1472022
58327 1472022 1492958 1512571 1531785 1548794 1560747 1568314 1574550 1580031 1583366 1585648 1589829 1596106 1602299
58314 1602299 1608435 1616616 1626781 1637017 1647690 1660838 1675924 1690693 1705710 1723342 1742732 1760818
58302 1760818 1778039 1797830 1820501 1842916 1864378 1887448 1912461 1936565 1959018 1982318 2007292
58291 2007292 2032005 2056375 2082987 2112437 2142503 2172608 2204402 2237447 2269258 2300222 2333584
58280 2333584 2370052 2407406 2445766 2487914 2533805 2580163 2626191 2674367 2725040 2775809 2826884
58269B826884N4487N8082N8556N8724O2018O5687O6215O6309O9559P3457P4715
58258C534693P6062Q0385Q3783Q2206P9409Q0477Q3056Q2969Q2790Q6483R1368
58247D443681R3825R7049J04673J12856J17450J22414J32059J41976J47248J52442
58237E665673J63270J75752J84229J92496K05818K19848K29294K39500K56951
58228G532831K76596K91600L07220L31034L58191L81010M04531M37116M74474
58219A0794603N09068N46289N94474O48383P00237P57399Q30585R15039J002996
58210A7299073J103644J229895J377530J540219J732584J974450K266830K610460
58202C1134685L033269L570845M236973N046131O046084P290480Q797279J0572110
$$ plain form
58269 2826884 2881371 2939453 2998009 3056733 3118751 3184438 3250653 3316962 3386521 3459978 3534693
58258 3534693 3610755 3691140 3774923 3857129 3936538 4017015 4100071 4183040 4265830 4352313 4443681
58247 4443681 4537506 4634555 4739228 4852084 4969534 5091948 5224007 5365983 5513231 5665673
58237 5665673 5828943 6004695 6188924 6381420 6587238 6807086 7036380 7275880 7532831
58228 7532831 7809427 8101027 8408247 8739281 9097472 9478482 9883013 10320129 10794603
58219 10794603 11303671 11849960 12444434 13092817 13793054 14550453 15381038 16296077 17299073
58210 17299073 18402717 19632612 21010142 22550361 24282945 26257395 28524225 31134685
58202 31134685 34167954 37738799 41975772 47021903 53067987 60358467 69155746 79727856
58194G9727856J2648006J5059787J7816875K0958796K4576914K8650476L2825724
58187B32264434L6382047L8327619L7421985L2326274K2303672Q205872p314574
58180C99917329k0949784l0393562l5120632l5941465l4156917l1046936k7642868
58173A84665165k4531391k1802989j9294405j6898294j4635019j2542139j0626993
58166F4333935q912441p436998o201391n168066m310404l618349l063691k603979
58158B3018616k218634j906711j654448j437322j248966j097570r77601q72144
58150A1605220p78465p05306o48717n94603n41617m98811m63993m25821l84488
58141F563399l50021l22594k93518k63163k39736k22616k04273j86459j77636
$$ plain form
58194 79727856 92375862 107435649 125252524 146211320 170788234 199438710 232264434
58187 232264434 268646481 306974100 344396085 376722359 399026031 407231903 399917329
58180 399917329 378967545 348573983 313453351 277511886 243354969 212308033 184665165
58173 184665165 160133774 138330785 119036380 102138086 87503067 74960928 64333935
58166 64333935 55421494 47984496 41783105 36615039 32304635 28686286 25622595 23018616
58158 23018616 20799982 18893271 17238823 15801501 14552535 13454965 12477364 11605220
58150 11605220 10826755 10121449 9472732 8878129 8336512 7837701 7373708 6947887 6563399
58141 6563399 6213378 5890784 5597266 5334103 5094367 4871751 4667478 4481019 4303383
58132D303383j76147j71959j63526j57662j54387j46918j35483j26852j21097
58123B949352j12323j01497r5269r3045q7948p9844p4977p3461o9331o2507n8878
58112B040272n8732n6466n1686m9588n0347m8727m4421m2439m3062m1407l7213
58101A516184l5482l6912l6919l4595l3692l4378l2701k8632k6322k6038k3959
58090A166554k0095j8418j8926j7569j4230j2962j4160j4168j2828j3707j6536
58079I92955j7122j5213j4977j7130j7845j6108j5048j5390j4492j2497j2564
58068H24569j4378j4149j1645j0555j1307j0350p230n657o566o719n229n113p149
58055G08522q359p781p830q897q462o605o494q286q376n865m077m399m284k727
$$ plain form
58132 4303383 4127236 3955277 3791751 3634089 3479702 3332784 3197301 3070449 2949352
58123 2949352 2837029 2735532 2640263 2547218 2459270 2379426 2304449 2230988 2161657 2099150 2040272
58112 2040272 1981540 1925074 1873388 1823800 1773453 1724726 1680305 1637866 1594804 1553397 1516184
58101 1516184 1480702 1443790 1406871 1372276 1338584 1304206 1271505 1242873 1216551 1190513 1166554
58090 1166554 1146459 1128041 1109115 1091546 1077316 1064354 1050194 1036026 1023198 1009491 992955
58079 992955 975833 960620 945643 928513 910668 894560 879512 864122 849630 837133 824569
58068 824569 810191 796042 784397 773842 762535 752185 744955 739298 732732 726013 720784 715671 708522
58055 708522 700163 692382 684552 675655 667193 660588 654094 645808 637432 631567 627490 623091 618807 616080
58041F16080k164l434m147l536l884n736o587n658n168n751n460m270m736p011
58027E48538q149p364p112p996p607n539m487n129m974l498l364n087n617l828
58013D68787k511l149l504k219j164j305p98J013K039J587J711K793K356K0j007
57998D64649O25K087J510R09J637J586l83j529J94K401K187M05q12j640k926l748
57982D67152l305k759l040l186k635k561l318l306j955r38r43l43J396K222J195
57967D43676M26J440K632K351J462J018L17q85j153k10l8j421k444k160k402m011
57951D38598m704l039j169j139j529n19O38J75p84k75J218K260L168M679N904
57936D43482O028O219P485Q619Q384P771P879P660O041M251L580K808L21k923
$$ plain form
58041 616080 613916 610482 606335 602799 598915 593179 586592 580934 575766 570015 564555 560285 555549 548538
58027 548538 540389 533025 525913 517917 510310 504771 500284 495155 490181 486683 483319 478232 472615 468787
58013 468787 466276 463127 459623 457404 456240 454935 454137 455150 457189 458776 460487 463280 465636 465656 464649
57998 464649 465274 467361 468871 469780 471417 473003 472620 471091 471285 473686 475873 476278 475466 473826 470900 467152
57982 467152 463847 461088 458048 454862 452227 449666 446348 443042 441087 440149 439206 438863 440259 442481 443676
57967 443676 444102 445542 448174 450525 451987 453005 453322 452437 451284 451074 451036 449615 447171 445011 442609 438598
57951 438598 433894 430855 429686 428547 427018 426499 427137 427312 426528 426253 427471 429731 432899 437578 443482
57936 443482 449510 455729 463214 471833 480217 487988 495867 503527 509568 513819 517399 520207 520528 517605
57922E17605n038o238p809r422r923r621r606r778r358q353o988m886k275n30
57908D17780j07O28K977N872P604Q027P571N877K992L14j245k524m187n202m634
57893D41743l259j984m84J260K039J566J484K691L692L266K607L010L535L035
57879D64201K456K908L355K474J192J102J813K026J825J872J738J005O30J232
57865D89829J527L82j061j238o25l58l7J016J825J406R01J818L372L836L328L058
57849E08979K937K230J507J715K239J964J378J566K088J851J106O46K7j357k433
57834E26443j794jJ411K262L179L730L253K602K948L665L423K527K169K228J876
57819E59921J493J850K163J190m64j296j420j973k703k459j666k022l870n874
$$ plain form
57922 517605 512567 506329 498520 489098 479175 469554 459948 450170 440812 432459 425471 420585 418310 417780
57908 417780 417673 418301 421278 427150 434754 442781 450352 456229 459221 459535 458290 455766 451579 446377 441743
57893 441743 438484 436500 436016 437276 439315 440881 442365 445056 448748 452014 454621 457631 461166 464201
57879 464201 466657 469565 472920 475394 476586 477688 479501 481527 483352 485224 486962 487967 488597 489829
57865 489829 491356 491738 490677 489439 488814 488456 488419 489435 491260 492666 493567 495385 498757 502593 505921 508979
57849 508979 511916 514146 515653 517368 519607 521571 522949 524515 526603 528454 529560 530206 530233 528876 526443
57834 526443 524649 524648 526059 528321 531500 535230 538483 541085 544033 547698 551121 553648 555817 558045 559921
57819 559921 561414 563264 565427 566617 566153 564857 563437 561464 558761 556302 554636 552614 548744 542870
57805E42870p097p627p464o526n448m770l846k110o89q74j828j799r59q31j447
57790D89555j385l48N18Q04J195J698J554R70J107K180L249L978M890N843N949
57775E21757N134M374M129L938L550L210K887K332J717J172J77j402k363j674
57761E48938l61j90r94j115r6Q96J261J733K818M012M804N249N468N602O080O958
57745E91063P406O860O112O089O284N784N031N005N292M700L219J842P84l58j217
57730F53896j123n49m15m63R5Q26P90L98P19J423J357P19O43J063J051R37J830
57713F63197L287L729L123K983L643L794K958K183J986J734J471K261M213O020
57699G06582P025P862Q714Q834Q203P749P336N557K171j050k762l602m559n461
$$ plain form
57805 542870 535773 528146 520682 514156 508708 503938 500092 497982 497293 496419 494591 492792 491833 491002 489555
57790 489555 488170 487822 488340 489144 490339 492037 493591 494561 495668 497848 501097 505075 509965 515808 521757
57775 521757 526891 531265 535394 539332 542882 546092 548979 551311 553028 554200 554377 552975 550612 548938
57761 548938 548577 548387 547393 546278 546182 547078 548339 550072 552890 556902 561706 566955 572423 578025 584105 591063
57745 591063 598469 605329 611441 617530 623814 629598 634629 639634 644926 649626 652845 654687 655471 655113 653896
57730 653896 652773 652224 651809 651346 651441 652267 653057 653455 654174 655597 656954 657673 658316 659379 660430 661367 663197
57713 663197 666484 670213 673336 676319 679962 683756 686714 688897 690883 692617 694088 696349 700562 706582
57699 706582 713607 721469 730183 739017 747220 754969 762305 767862 770033 768983 766221 762619 758060 752599
57685G52599n919o219o351n571l744j834l21J598M504P766J0767J3948J7808K1974
57671H01005K6009L0255L5238M1019M7437N3903N8516N8382N1374L7165J6916
57660A257219o655k9003m5443n4021n6013n3652m8560m2160l5774k9648k3286
57649H33004j7130j2522r692p343m697k422j095k62M05O13O66J630L534M915M965
57634G94569M610M668M520L630K854K994L292K694J564R33Q36O39L21L28O66J027
57618H30145J367J705J787J586J610K177K956L534L867L933L703L623M266N309
57604H71568N763N384M843M365L598K872L127M086M214L087K253K775L559L166
57590I24660K006J334J326J483J935K939L874M090M062M573N239N151M448M052
$$ plain form
57685 752599 746680 740461 734110 728539 724795 722961 722640 724238 728742 736508 747275 761223 779031 801005
57671 801005 827014 857269 892507 933526 980963 1034866 1093382 1151764 1203138 1240303 1257219
57660 1257219 1250564 1221561 1176118 1122097 1066084 1012432 963872 921712 885938 856290 833004
57649 833004 815874 803352 793660 786317 781620 779198 778103 777841 778246 778859 779525 781155 784689 789604 794569
57634 794569 799179 803847 808367 811997 814851 817845 821137 823831 825395 826328 827164 827803 828124 828452 829118 830145
57618 830145 831512 833217 835004 836590 838200 840377 843333 846867 850734 854667 858370 861993 866259 871568
57604 871568 877331 882715 887558 891923 895521 898393 901520 905606 909820 912907 915160 917935 921494 924660
57590 924660 926666 928000 929326 930809 932744 935683 939557 943647 947709 952282 957521 962672 967120 971172
57576I71172M161M133L639L002K508K228K320K840L417L717L906M241M488M334
57562A020106L949L686L591L706M320N486O663P325P530P492P198O905P324Q689
57548A103970J0138J0650J0184R385Q611P896P416P321P392P354P343P638Q189
57535A213487Q730R102R229R022Q576Q124P726P286O950P014P458P994Q569R169
57521A328436R398Q930Q320Q463R247R752R753R988J0777J1487J1680J1640J1483
57508A459354J0788R687R132R560J0183J0207R861R679R652R613R623R482Q770
57495A585591P757P366P778Q148Q125Q451R400R980R561R085R591J0567J0929
57482A702329J0733J0713J0870J0746J0560J0852J1416J1629J1482J1329J1050
$$ plain form
57576 971172 975333 979466 983105 986107 988615 990843 993163 996003 999420 1003137 1007043 1011284 1015772 1020106
57562 1020106 1024055 1027741 1031332 1035038 1039358 1044844 1051507 1058832 1066362 1073854 1081052 1087957 1095281 1103970
57548 1103970 1114108 1124758 1134942 1144327 1152938 1160834 1168250 1175571 1182963 1190317 1197660 1205298 1213487
57535 1213487 1222217 1231319 1240548 1249570 1258146 1266270 1273996 1281282 1288232 1295246 1302704 1310698 1319267 1328436
57521 1328436 1337834 1346764 1355084 1363547 1372794 1382546 1392299 1402287 1413064 1424551 1436231 1447871 1459354
57508 1459354 1470142 1479829 1488961 1498521 1508704 1518911 1528772 1538451 1548103 1557716 1567339 1576821 1585591
57495 1585591 1593348 1600714 1608492 1616640 1624765 1633216 1642616 1652596 1662157 1671242 1680833 1691400 1702329
57482 1702329 1713062 1723775 1734645 1745391 1755951 1766803 1778219 1789848 1801330 1812659 1823709
57471A823709J0408R905J0242J1189J1901J2258J2907J4018J4888J4983J4697
57460A961105J4804J5474J6076J5931J5153J4657J5078J5936J6272J5898J5401
57449B131785J5083J4780J4658J5249J6446J7391J7649J7637J7700J7690J7727
57438B313795J8317J9324J9837J9533J9207J9448J9771J9627J9288J9095J8794
57427B526036J8257J8038J8497J9151J9505J9695J9837J9597J9075J9102K0075
57416B736865K1287K1984K2223K2228K1933K1756K2581K4275K5387K5118K4427
57405B990064K4284K4146K3241K2180K1944K2267K2318K2228K2630K3392K4006
57394C242700K4682K5860K7220K8150K8649K8844K8377K7296K6791K7817K9676
$$ plain form
57471 1823709 1834117 1844022 1854264 1865453 1877354 1889612 1902519 1916537 1931425 1946408 1961105
57460 1961105 1975909 1991383 2007459 2023390 2038543 2053200 2068278 2084214 2100486 2116384 2131785
57449 2131785 2146868 2161648 2176306 2191555 2208001 2225392 2243041 2260678 2278378 2296068 2313795
57438 2313795 2332112 2351436 2371273 2390806 2410013 2429461 2449232 2468859 2488147 2507242 2526036
57427 2526036 2544293 2562331 2580828 2599979 2619484 2639179 2659016 2678613 2697688 2716790 2736865
57416 2736865 2758152 2780136 2802359 2824587 2846520 2868276 2890857 2915132 2940519 2965637 2990064
57405 2990064 3014348 3038494 3061735 3083915 3105859 3128126 3150444 3172672 3195302 3218694 3242700
57394 3242700 3267382 3293242 3320462 3348612 3377261 3406105 3434482 3461778 3488569 3516386 3546062
57383C546062L0964L1360L1424L1333L1024L0941L1417L1808L1325L0274K9446
57372C887378K8843K8044K7226K6827K6735K6715K7042K7739K8075K7833K8147
57361D190604K9795L1611L2027L1430L1337L1922L2113L1751L1872L2920L4137
57350D541519L4781L4804L4443L4210L4954L6785L8277L7959L6257L4759L4044
57339D932792L3529L3091L3253L3955L4542L4964L5727L6790L7643L8272L8872
57328E323430L9040L8428L7852L8275L9146L9220L8707L8854L9694M0012L9578
57317E752236L9502M0169M0595M0326M0229M0814M1229M0722L9867L9566L9849
57306F195104M0303M0857M1523M2068M2413M2744M2992M2871M2485M2232M2099
$$ plain form
57383 3546062 3577026 3608386 3639810 3671143 3702167 3733108 3764525 3796333 3827658 3857932 3887378
57372 3887378 3916221 3944265 3971491 3998318 4025053 4051768 4078810 4106549 4134624 4162457 4190604
57361 4190604 4220399 4252010 4284037 4315467 4346804 4378726 4410839 4442590 4474462 4507382 4541519
57350 4541519 4576300 4611104 4645547 4679757 4714711 4751496 4789773 4827732 4863989 4898748 4932792
57339 4932792 4966321 4999412 5032665 5066620 5101162 5136126 5171853 5208643 5246286 5284558 5323430
57328 5323430 5362470 5400898 5438750 5477025 5516171 5555391 5594098 5632952 5672646 5712658 5752236
57317 5752236 5791738 5831907 5872502 5912828 5953057 5993871 6035100 6075822 6115689 6155255 6195104
57306 6195104 6235407 6276264 6317787 6359855 6402268 6445012 6488004 6530875 6573360 6615592 6657691
57295F657691M1814M1640M2142M3199M4179M4984M5952M6757M6603M5573M4719
57284G145253M4636M4936M5248M5666M6051M5892M5198M4576M4335M4270M4382
57273G640443M4859M5280M4934M4033M3634M4134M4735M4634M3925M3140M2615
57262H126366M2419M2283M1695M0618L9758L9396L8667L7027L5691L6087L7395
57251H557402L7562L6377L5597L5966L6259L5708L5293L5769L6296L6025L5587
57240H953841L5831L6376L6441L6093L5552L4311L2017K9449K7559K6136K4341
57229I307947K2042J9757J7658J5482J3179J0997R067P339N871M916M826N813
57217I444894P582R314J0437J1306J2580J4235J5784J7188J8736K0216K1098K1411
$$ plain form
57295 6657691 6699505 6741145 6783287 6826486 6870665 6915649 6961601 7008358 7054961 7100534 7145253
57284 7145253 7189889 7234825 7280073 7325739 7371790 7417682 7462880 7507456 7551791 7596061 7640443
57273 7640443 7685302 7730582 7775516 7819549 7863183 7907317 7952052 7996686 8040611 8083751 8126366
57262 8126366 8168785 8211068 8252763 8293381 8333139 8372535 8411202 8448229 8483920 8520007 8557402
57251 8557402 8594964 8631341 8666938 8702904 8739163 8774871 8810164 8845933 8882229 8918254 8953841
57240 8953841 8989672 9026048 9062489 9098582 9134134 9168445 9200462 9229911 9257470 9283606 9307947
57229 9307947 9329989 9349746 9367404 9382886 9396065 9407062 9416129 9423468 9429339 9434255 9439081 9444894
57217 9444894 9452476 9461790 9472227 9483533 9496113 9510348 9526132 9543320 9562056 9582272 9603370 9624781
57205I624781K1631K1883K1965K1953K1876K1224J9644J7788J6334J4723J2130
57194I835932R133O838M866K011j383l784n240p567j1428j5334j8238k1081k4830
57181I749895k8909l2603l6396m0760m4961m8267n1045n3721n5838n7160n8460
57170I241775o0114o1137o0742n9767n9285n8843n7377n5034n2740n0576m7862
57159H618298m4416m0727l7094l3553l0414k8208k7193k7242k7932k8593k8882
57148H264044k9484l1521l5105l9277m3466m7906n2514n6647o0283o4109o7911
57137G735821p0218p0253o8926o7123o4440o0543n6552n3855n2431n1469n0777
57126G069234n0683n1302n2839n5751n9582o2440o2599o0008n5423m8881m0050
$$ plain form
57205 9624781 9646412 9668295 9690260 9712213 9734089 9755313 9774957 9792745 9809079 9823802 9835932
57194 9835932 9845065 9851903 9856769 9858780 9857397 9853613 9848373 9840806 9829378 9814044 9795806 9774725 9749895
57181 9749895 9720986 9688383 9651987 9611227 9566266 9517999 9466954 9413233 9357395 9300235 9241775
57170 9241775 9181661 9120524 9059782 9000015 8940730 8881887 8824510 8769476 8716736 8666160 8618298
57159 8618298 8573882 8533155 8496061 8462508 8432094 8403886 8376693 8349451 8321519 8292926 8264044
57148 8264044 8234560 8203039 8167934 8128657 8085191 8037285 7984771 7928124 7867841 7803732 7735821
57137 7735821 7665603 7595350 7526424 7459301 7394861 7334318 7277766 7223911 7171480 7120011 7069234
57126 7069234 7018551 6967249 6914410 6858659 6799077 6736637 6674038 6614030 6558607 6509726 6469676
57115F469676k9469j8437p899J911J1326K1264L2944M7131O4245Q5503J12906
57104F791101J47678J89776K39789L00607L76556M71633N89024P31359R00274
57095A0737797J095738J315900J557293J815501K086436K366689K651627K933146
57087B6560127L199773L437925L632691L770481L843586L847688L766510L557836
57079E5616617L163885K545612J711973P21229l38638j371274k290352l037855
57071E6721197l594322l970321m186292m259953m207579m048666l805784l502656
57063B5145624l163671k812201k467065k141047j842481j576246j343349j142120
57055H657444r70675q26997p07144o06030n20415m49130l90307l40667k98006
$$ plain form
57115 6469676 6440207 6421770 6413871 6415782 6427108 6448372 6481316 6528447 6592692 6678195 6791101
57104 6791101 6938779 7128555 7368344 7668951 8045507 8517140 9106164 9837523 10737797
57095 10737797 11833535 13149435 14706728 16522229 18608665 20975354 23626981 26560127
57087 26560127 29759900 33197825 36830516 40600997 44444583 48292271 52058781 55616617
57079 55616617 58780502 61326114 63038087 63759316 63420678 62049404 59759052 56721197
57071 56721197 53126875 49156554 44970262 40710309 36502730 32454064 28648280 25145624
57063 25145624 21981953 19169752 16702687 14561640 12719159 11142913 9799564 8657444
57055 8657444 7686769 6859772 6152628 5546598 5026183 4577053 4186746 3846079 3548073
57046C548073k62040k32159k06359j83144j62629j44965j29368j15436j03667
57037B008306r3948q4969p5924o7412n9972n3074m6141l9297l2507k5211j7263
57026A412588r011j47R988K0313K7644K9133K4063J2964l367k3066m2768n9204
57014A399130p0703p6844p7722p4298o8426o1691n4715m7879m1788l6623l1995
57003G56446k7916k4998k3285k1801j9809j7681j6071j5043j4443j4300j4302
56992E46797j3658j1959r674p426n348l307j167J356M328O981Q044O850L636j047
56978E24406o385j1060j4018j5476j6293j6533j5705j4126j2647j1096q493m908
56966C77666j683N10K427M744P186R637J2665J6290J9400K1017K1073J9394J5177
$$ plain form
57046 3548073 3286033 3053874 2847515 2664371 2501742 2356777 2227409 2111973 2008306
57037 2008306 1914358 1829389 1753465 1686053 1626081 1573007 1526866 1487569 1455062 1429851 1412588
57026 1412588 1403577 1403430 1413418 1433731 1461375 1490508 1514571 1527535 1524168 1501102 1458334 1399130
57014 1399130 1328427 1251583 1173861 1099563 1031137 969446 914731 866852 825064 788441 756446
57003 756446 728530 703532 680247 658446 638637 620956 604885 589842 575399 561099 546797
56992 546797 533139 521180 511506 504080 498732 495425 494258 495614 499942 506923 514967 521817 525453 524406
56978 524406 518021 506961 492943 477467 461174 444641 428936 414810 402163 391067 382574 377666
56966 377666 375983 376493 378920 383664 390850 400487 413152 429442 448842 469859 490932 510326 525503
56953E25503Q255o2q081j4898k0030k2918k3444k2231j9893j6675j3046r681o605
56940C56194l290J37K955N411Q843J3674J8574K2354K5422K8422L0451K9702K5099
56927E63948J6576M791q426k0085k7801l1380l2136l1164k8929k5882k2610j9531
56915C37371j6928j5013j3592j2079j0193q188o303m515k975k009j509j045o41
56902B42381o44p50j46J162K178K444K649L399M384N280O479Q307J0427J2512
56888C00062J4700J6936J8713J9758K0013J8657J4347P077j217q348j3310j5792
56876C91596j5738j3959j1849r715o640k574R86L303N807R941J4999J9626K4138
56863D09921K9644L5718M0776M4209M6341M6446M2414L2729J7941L71j6775l0336
$$ plain form
56953 525503 533758 533696 525615 510717 490687 467769 444325 422094 402201 385526 372480 362799 356194
56940 356194 352904 353041 355996 361407 370250 383924 402498 424852 450274 478696 509147 538849 563948
56927 563948 580524 585315 576889 556804 529003 497623 465487 434323 405394 379512 356902 337371
56915 337371 320443 305430 291838 279759 269566 261378 255075 250560 247585 245576 244067 243022 242381
56902 242381 241737 240987 240841 242003 244181 246625 249274 252673 257057 262337 268816 277123 287550 300062
56888 300062 314762 331698 350411 370169 390182 408839 423186 430263 429046 420698 407388 391596
56876 391596 375858 361899 350050 340335 333695 331121 332107 335410 341217 351158 366157 385783 409921
56863 409921 439565 475283 516059 560268 606609 653055 695469 728198 746139 746510 729735 699399
56851F99399l8436m1168l9707l5183k8702k1679j5037q489j418N959J3029J9916
56839E08484K7265L5293M3826N2838O2141P0746P7086P9225P4402N9616L4381
56828A125303K836k8049n2577o8449p5935p6455p1915o4116n4280m3439l2868
56817E60056k3470j5053o983P07P697J4483K2090L0708L9385M7031N2811N5399
56805G84861N2694M2840K5575K920k1160m2090n6612o3875o4952o1631n5687m8519
56793D94364m0879l3043k5417j8563j2498o627o52N074J0371J5627K0996K5937
56781D34690K9825L2132L1594K6449J6400L545r380k0872l0116l5937l7633l6188
56769D04509l3424l0318k7053k3948k1176j8164j4527j1145r146q225p199n829
$$ plain form
56851 699399 660963 619795 580088 544905 516203 494524 479487 470998 469580 475539 488568 508484
56839 508484 535749 571042 614868 667706 729847 800593 877679 956904 1031306 1090922 1125303
56828 1125303 1128139 1100090 1047513 979064 903129 826674 754759 690643 636363 592924 560056
56817 560056 536586 521533 514550 515257 522954 537437 559527 590235 629620 676651 729462 784861
56805 784861 837555 880395 905970 908890 887730 845640 789028 725153 660201 598570 542883 494364
56793 494364 453485 420442 395025 376462 363964 357337 356685 361759 372130 387757 408753 434690
56781 434690 464515 496647 528241 554690 571090 574635 565255 544383 514267 478330 440697 404509
56769 404509 371085 340767 313714 289766 268590 250426 235899 224754 215608 207383 200184 194355
56757A94355m872m518m120l382k728k404k180j946j739j316m87K72L21j49m57
56742A64650m49m19l13O4K80k62j228j653j225m38L21J004J338J057N17L25L67
56725A63936J09l34l12K86R08J261J505J597J255N91O4j46j32J54O03O41M2l19
56707A71709M43J733K145J481R19J153J562J435R27N11L16L38O47J085J330J384
56691A89118J511J658J533J239J202J512J867K078K185K190K158K296K377J633
56677B14557q9j535j475m47l0o65j367j480j382j423j369j128r89r07m67J56J92
56660B00152n14j146j069n58j17J27J39j54m34j70M69O60R1n19m94j09l8l91p13
56641A95212o56l08n5j66m01j56P37J607J710J209Q02O39K72m27r52q59l19J15
$$ plain form
56757 194355 189483 184965 180845 177463 174735 172331 170151 168205 166466 165150 164663 164935 165256 165107 164650
56742 164650 164201 163782 163469 163533 163813 163551 162323 160670 159445 159007 159328 160332 161670 162727 163244 163569 163936
56725 163936 164045 163711 163399 163685 164593 165854 167359 168956 170211 170802 170866 170720 170588 170742 171345 171986 172028 171709
56707 171709 172152 173885 176030 177511 178430 179583 181145 182580 183507 184018 184334 184672 185319 186404 187734 189118
56691 189118 190629 192287 193820 195059 196261 197773 199640 201718 203903 206093 208251 210547 212924 214557
56677 214557 214468 212933 211458 211011 210981 210316 208949 207469 206087 204664 203295 202167 201178 200271 199804 199960 200152
56660 200152 199638 198492 197423 196865 196748 196875 197014 196860 196426 196256 196725 197385 197476 196957 196463 196354 196316 195925 195212
56641 195212 194556 194248 194193 194027 193626 193470 194207 195814 197524 198733 199535 200174 200446 200019 199067 198208 197889 198004
56623A98004j2p03j437j624j343j217j387j279p23n25j246k165k323j873j537
56608A78610j319q43l73m32p70p58m40k01J64J009J901K172K030K009J871J184
56592A85814M83N00P08J11r17j077k19O12J010J503K093K143J772J815K285K359
56576B00995K011K061K501K382J654J431K072K609K603K951M214N713O939Q456
56562B48592J0559J2399J3367J4143J5426J6552J6315J4319J0923O625K236j102
56550C80354k826l362l329k993k649k666k797k453j874k068l276m525n059n184
56536C35293n366n573n832o395o957o800o079n789o099n963m914l909l718l712
56522B58187l032j945j221j076j393k064k575k261j491j503k509l121k436j426
$$ plain form
56623 198004 197992 197289 195852 194228 192885 191668 190281 189002 188279 187754 186508 184343 182020 180147 178610
56608 178610 177291 176448 176075 175643 174873 174115 173675 173474 173638 174647 176548 178720 180750 182759 184630 185814
56592 185814 186297 186797 187505 187616 186699 185622 185403 186015 187025 188528 190621 192764 194536 196351 198636 200995
56576 200995 203006 205067 207568 209950 211604 213035 215107 217716 220319 223270 227484 233197 240136 248592
56562 248592 259151 271550 284917 299060 314486 331038 347353 361672 372595 379220 381456 380354
56550 380354 377528 374166 370837 367844 365195 362529 359732 357279 355405 353337 350061 345536 340477 335293
56536 335293 329927 324354 318522 312127 305170 298370 292291 286502 280403 274440 269526 265617 261899 258187
56522 258187 255155 253210 251989 250913 249520 247456 244881 242620 241129 239626 237117 233996 231560 230134
56508B30134j327j763j617q84m89p59j133j018l20N86R43K54r02j328p52r9O6
56491B19592K67Q75J257Q89L31L37P79J129J203Q78j17j447k054j384j27Q01J220
56474B24429J270R62N87P00J173J204O20J46Q3j71p23o97J81P87K42p52j088p32
56456B28221j91M85J282J682J386Q55N02K12J11P88K177L321L808M204M522L725
56440B57090J547n58j336j328j534j844j863j985k432k392j352k00K14M13J011
56425B43451J338P35L4K20O70L22l09j3J006J526J299J043R47O88N34R57J468
56408B55916J179K93j74N4L19J95j47m99o94m21K63P28O59O30J115J611J506J037
56390B63570O67L31M7K69R27J097N09K62J060J945J827J142P83O14K82L48J104
$$ plain form
56508 230134 228807 227044 225427 224543 224054 223295 222162 221144 220824 221410 222353 222607 221705 220377 219625 219526 219592
56491 219592 219859 220734 221991 222880 223211 223548 224327 225456 226659 227537 227420 225973 223919 222535 222408 223209 224429
56474 224429 225699 226661 227248 227948 229121 230325 230945 231091 231174 231003 230280 229583 229764 230551 230793 230041 228953 228221
56456 228221 228030 228515 229797 231479 232865 233720 234222 234434 234545 235333 237510 240831 244639 248843 253365 257090
56440 257090 258637 258079 256743 255415 253881 252037 250174 248189 245757 243365 242013 241813 242027 242440 243451
56425 243451 244789 245524 245558 245778 246448 246770 246461 246448 247454 248980 250279 251322 252269 252957 253491 254448 255916
56408 255916 257095 257388 257214 257268 257587 257782 257635 257136 256442 256021 256284 257012 257671 258301 259416 261027 262533 263570
56390 263570 264237 264568 264615 264884 265811 266908 267417 267679 268739 270684 272511 273653 274436 275050 275332 275680 276784
56373B76784J513P69j19P8P77Q03N41J022J801J720J102J187J952K368K310K397
56357B97005K402J683Q37J035J967K228J586J128J279J295P50O0m61p87n83L22
56341C11746J169J220J057J639K566K804K552K769L248K958K054J850K746L827
56327C44205M441M784M924M667M349M417M385L473K074J261J017M17o02j065n41
56312C82206M01J249J934K305K292K399L015L597L622L769M933O646P776Q244
56298D34388Q654Q790P973O461N116M150L464L544M546N325M968M552N565P407
56284E14903Q336Q271Q535R385R907J0072J0773J1925J2542J2559J2790J3283
56272F43281J3534J4036J5657J7781J9046J9759K1497K4481K7333K9456L1662
$$ plain form
56373 276784 278297 279066 278947 279025 279802 280605 281146 282168 283969 285689 286791 287978 289930 292298 294608 297005
56357 297005 299407 301090 301927 302962 304929 307157 308743 309871 311150 312445 313195 313255 312794 312007 311424 311746
56341 311746 312915 314135 315192 316831 319397 322201 324753 327522 330770 333728 335782 337632 340378 344205
56327 344205 348646 353430 358354 363021 367370 371787 376172 379645 381719 382980 383997 384414 383812 382747 382206
56312 382206 382607 383856 385790 388095 390387 392786 395801 399398 403020 406789 411722 418368 426144 434388
56298 434388 443042 451832 459805 466266 471382 475532 478996 482540 487086 492411 497379 501931 507496 514903
56284 514903 523239 531510 540045 549430 559337 569409 580182 592107 604649 617208 629998 643281
56272 643281 656815 670851 686508 704289 723335 743094 764591 789072 816405 845861 877523
56261H77523L4504L7813M1901M7255N3180N8632O4318P1995Q1771R2024J02013
56250A562929J12518J23965J35789J47635J59296J69544J76970J81853J85205
56241B955704J86150J82425J73316J59960J42837J21238R5374O6785L6515M853
56231D125157k7003n7113q4600j09388j30328j45786j55935j62357j65570j65229
56221B921848j62321j58532j53645j46291j37121j28549j21198j13464j04686
56212A696041r6042q8139q0609p4138o9948o6977o2609n6629n1340m7427m2992
56201I59191l7333l2297k8886k5743k2123j9270j7675j5907j3483j1942j1831
56190G22701j1399r670p992p213o099m062k680k914l357k830k279k523k522j492
$$ plain form
56261 877523 912027 949840 991741 1038996 1092176 1150808 1215126 1287121 1368892 1460916 1562929
56250 1562929 1675447 1799412 1935201 2082836 2242132 2411676 2588646 2770499 2955704
56241 2955704 3141854 3324279 3497595 3657555 3800392 3921630 4017004 4083789 4120304 4125157
56231 4125157 4098154 4041041 3956441 3847053 3716725 3570939 3415004 3252647 3087077 2921848
56221 2921848 2759527 2600995 2447350 2301059 2163938 2035389 1914191 1800727 1696041
56212 1696041 1599999 1511860 1431251 1357113 1287165 1220188 1157579 1100950 1049610 1002183 959191
56201 959191 921858 889561 860675 834932 812809 793539 775864 759957 746474 734532 722701
56190 722701 711302 701632 693640 686427 680328 676266 673586 670672 667315 664485 662206 659683 657161 655669
56176F55669m91l58j98P40J689K113K683L433L249K214K121L555M929N401O098
56161F92847P387P789O916O656P973R311R693J0582J3024J5636J7242J8871K1414
56148H45341K3832K5395K7323L0539L4200L7903M2800M9052N4934N9878O5565
56137A296762P2358P7702P9731P9411P7383P2017O2859N2913M5140L9411L5052
56126A990739L3081L3336L2361K7197J8986J0336J698p222j5124k1103k6785l3918
56114B043582m1930m9949n8747o8280p5818p9090p9000p6978p2290o4383n5346
56103A321771m7330l9876l2160k5416k0647j6441j1506p046m263k078M33K082
56091A117523K301K994N274P312P787Q316J0047J1113J0229R423J0380J1379J0875
$$ plain form
56176 655669 655178 654820 654622 655362 657051 659164 661847 665280 668529 670743 672864 676419 681348 686749 692847
56161 692847 700234 708023 714939 721595 729568 738879 748572 759154 772178 787814 805056 823927 845341
56148 845341 869173 894568 921891 952430 986630 1024533 1067333 1116385 1171319 1231197 1296762
56137 1296762 1369120 1446822 1526553 1605964 1683347 1755364 1818223 1871136 1916276 1955687 1990739
56126 1990739 2023820 2057156 2089517 2116714 2135700 2146036 2147734 2140512 2125388 2104285 2077500 2043582
56114 2043582 2001652 1951703 1892956 1824676 1748858 1669768 1590768 1513790 1441500 1377117 1321771
56103 1321771 1274441 1234565 1202405 1176989 1156342 1139901 1128395 1121349 1117086 1115008 1115441 1117523
56091 1117523 1119824 1122818 1128092 1135404 1143191 1151507 1161554 1172667 1182896 1192319 1202699 1214078 1224953
56078A224953J0573J1964J3256J3001J3205J5453J7529J7457J7289J9119K0989
56067A394788K0677J9989K1084K2127K0927J9574K0796K2944K3108K2264K2691
56056A630969K3308K2140K0568K0668K1155K0305J9899K1833K4009K4031K3753
56045A872638K5562K7590K7377K6804K8433L0512L0731L1261L4673L8436L9134
56034B213151L8671M0559M3568M4886M6038M9576N3361N4332N4446N6682N8774
56023B754044N7493N5471N6941O0244O1503O2219O5949P1005P3725P5685Q0221
56012C474500Q5253Q7165Q8292R2829R8871J02341J05057J10788J17131J19967
56002D482194J22094J28698J37948J44988J51238J60599J70671J77294J83559
$$ plain form
56078 1224953 1235526 1247490 1260746 1273747 1286952 1302405 1319934 1337391 1354680 1373799 1394788
56067 1394788 1415465 1435454 1456538 1478665 1499592 1519166 1539962 1562906 1586014 1608278 1630969
56056 1630969 1654277 1676417 1696985 1717653 1738808 1759113 1779012 1800845 1824854 1848885 1872638
56045 1872638 1898200 1925790 1953167 1979971 2008404 2038916 2069647 2100908 2135581 2174017 2213151
56034 2213151 2251822 2292381 2335949 2380835 2426873 2476449 2529810 2584142 2638588 2695270 2754044
56023 2754044 2811537 2867008 2923949 2984193 3045696 3107915 3173864 3244869 3318594 3394279 3474500
56012 3474500 3559753 3646918 3735210 3828039 3926910 4029251 4134308 4245096 4362227 4482194
56002 4482194 4604288 4732986 4870934 5015922 5167160 5327759 5498430 5675724 5859283
55993E859283J94499K07380K17373K27811K44099K62724K77853K93229L15351
55984H099602L40510L61915L83773M14162M49610M81870N14433N56469O05911
55975A2208255O55260P08645P75578Q53440R34818J026480J141541J278949J431820
55966B1014786J609858J831441K101050K419413K808951L303268L920581M677255
55958D3686603N617553O795402Q234444R939929J1936048J4252410J6898844J9910986
55950A37272219K3383860K7341000L1514018L5262244L7636367L7406610L3179773
55943C62996091K4004460J0348773n479813k0203423l1182531l7425576l9381425
55936B63676556l8128011l4804888l0436505k5840518k1527258j7723046j4502153
$$ plain form
55993 5859283 6053782 6261162 6478535 6706346 6950445 7213169 7491022 7784251 8099602
55984 8099602 8440112 8802027 9185800 9599962 10049572 10531442 11045875 11602344 12208255
55975 12208255 12863515 13572160 14347738 15201178 16135996 17162476 18304017 19582966 21014786
55966 21014786 22624644 24456085 26557135 28976548 31785499 35088767 39009348 43686603
55958 43686603 49304156 56099558 64334002 74273931 86209979 100462389 117361233 137272219
55950 137272219 160656079 187997079 219511097 254773341 292409708 329816318 362996091
55943 362996091 387000551 397349324 391869511 371666088 340483557 303057981 263676556
55936 263676556 225548545 190743657 160307152 134466634 112939376 95216330 80714177
55929H0714177j1866752r749029q040078o654353n542297m651856l922596l318011
55921B6969205k826526k428728k093626j806203j569134j376305j209811j062802
55913A2596070r41232q42467p53838o72357o05524n52332n02509m54534m16395
55904F854882l88093l60384l31067l06553k87116k65913k42912k25057k12286
55895D235501j97347j79805j66707j58838j49495j37451j28496j23332j16146
55886B877884j06143r8793r4597q7905p8013p0543o6667o1508n4435n0782n1873
55875B056625n3152n3430n6447o1859o4184o2363o1367o2660o1757n7006n2330
55864A410070m9369m5101l9116l5321l4490l2660k8923k7287k8820k9161k6132
$$ plain form
55929 80714177 68847425 59098396 51058318 44403965 38861668 34209812 30287216 26969205
55921 26969205 24142679 21713951 19620325 17814122 16244988 14868683 13658872 12596070
55913 12596070 11654838 10812371 10058533 9386176 8780652 8228320 7725811 7271277 6854882
55904 6854882 6466789 6106405 5775338 5468785 5181669 4915756 4672844 4447787 4235501
55895 4235501 4038154 3858349 3691642 3532804 3383309 3245858 3117362 2994030 2877884
55886 2877884 2771741 2672948 2578351 2490446 2412433 2341890 2275223 2213715 2159280 2108498 2056625
55875 2056625 2003473 1950043 1893596 1831737 1767553 1705190 1643823 1581163 1519406 1462400 1410070
55864 1410070 1360701 1315600 1276484 1241163 1206673 1174013 1145090 1117803 1088983 1059822 1033690
55853A033690k2961k1777k0426j7923j6798j7842j8385j7700j8437k0995k2145
55842H18301k0869j9975k0406j9633j7164j5971j6736j6286j3549j1586j1867
55831F34259j1832j0050q736r043q827p027n706n869n698m606m646o348p507p502
55817E30862q367j0264j0481q367o704o664o043l991k776l119k461J89K195K094
55803D66103K176M056N921O299O619P768P970O255M380L255J158k534n473o370
55789E07583p214r290j0584r521p912p634p564o330n304o252q404j0103j1193
55776D00278j1872j1430r816q353p557o429m839m009l796k475k45L02j459k784
55762C25516k008j088j898l197l352l023l127k851j818j526k634l358k513j642
$$ plain form
55853 1033690 1010729 988952 968526 950603 933805 915963 897578 879878 861441 840446 818301
55842 818301 797432 777457 757051 737418 720254 704283 687547 671261 657712 646126 634259
55831 634259 622427 612377 603641 594598 585771 578744 573038 567169 561471 556865 552219 545871 538364 530862
55817 530862 522495 512231 501750 493383 486679 480015 473972 469981 467205 464086 461625 461814 464009 466103
55803 466103 468279 472335 478256 484555 491174 498942 506912 513167 517547 520802 521960 519426 513953 507583
55789 507583 500369 491079 480495 470974 463062 455428 447864 441534 436230 429978 421574 411471 400278
55776 400278 388406 376976 367160 358807 351250 344821 339982 335973 332177 329702 329457 329759 328300 325516
55762 325516 323508 322420 320522 317325 313973 310950 307823 304972 303154 301628 298994 295636 293123 291481
55748B91481k196l165l363l607m618n260m819m697n850o826o274n152m612m011
55734B27031k845k275k821k876j503l49q14j652j520j476k656l732l151j989k016
55719A95356k730k671k068j859j616o94K5l30p26K7J037R27L05N75J496J937J905
55702A90896J964J707O82k89l97l51j025j729j538j116j523k252k128j226l84
55687A81291K71R39J343J496K141L280L522K123L00o66j186j889k054j045J42
55672A90008L71J40L33N36J57p0P64K204L452M648N832O013M707L031J934P44
55656B24804j062k319k041j295j396j685r80K4p8j072j810k286l131l919l866
55641A97888l450l694m437m821m733m532m120l557l552m179m267l205k099j870
$$ plain form
55748 291481 289285 286120 282757 279150 274532 269272 264453 259756 253906 247080 240806 235654 231042 227031
55734 227031 224186 221911 219090 216214 214711 214362 213548 211896 210376 208900 206244 202512 199361 197372 195356
55719 195356 192626 189955 187887 186028 184412 183718 183743 183413 182687 182714 183751 184678 184983 185558 187054 188991 190896
55702 190896 192860 194567 195249 194960 194563 194212 193187 191458 189920 188804 187281 185029 182901 181675 181291
55687 181291 181562 182501 183844 185340 187481 190761 194283 196406 196706 196040 194854 192965 190911 189866 190008
55672 190008 190379 190519 190852 191388 191545 191475 192239 194443 197895 202543 208375 214388 219095 222126 224060 224804
55656 224804 223742 221423 219382 218087 216691 215006 214026 214050 213972 212900 211090 208804 205673 201754 197888
55641 197888 194438 190744 186307 181486 176753 172221 168101 164544 160992 156813 152546 149341 147242 145372
55627A45372j715q86l00p00q88K47J483J200J42J1M65Qj131j511j137j255j931
55610A37474k083j678j757k427k724k291j694j236r23j093j716j700l52J184J464
55595A18448R02P31P41p1j261j434n36K21L71M00L74N1j9P78J718J721J282J674
55577A26091K798L595M123N300O927P933Q437R599J1495J2939J3356J3145J2167
55564B37905R662N807J872j357l987n930o886p326q131r236r886j0019j0093r869
55550A72526q768p192o051n289m268l268l020l091k359r64r9o1q9Pk75p34o04
55533A26401p3o1n18n50k00m20j211j499j065r02j375j607j117n82n59p76j052
55516A12834j664k472k829k711k736k907k493j390m51k15l61n35o98o07J5P28
$$ plain form
55627 145372 143657 142771 142471 141771 140883 141130 142613 143813 143955 143966 144431 144439 143308 141797 140660 139405 137474
55610 137474 135391 133713 131956 129529 126805 124514 122820 121584 120661 119568 117852 116152 115800 116984 118448
55595 118448 119350 120081 120822 120751 119490 118056 117520 117741 118112 118512 118886 118937 118918 119696 121414 123135 124417 126091
55577 126091 128889 132484 136607 141907 148834 156767 165204 174803 186298 199237 212593 225738 237905
55564 237905 247567 253374 255246 253889 249902 243972 237086 229760 221629 212393 202507 192488 182395 172526
55550 172526 163758 156566 150515 145226 140958 137690 134670 131579 129220 128256 128157 128096 128007 128014 127739 127005 126401
55533 126401 126328 126267 125749 125199 124999 124579 123368 121869 120804 119902 118527 116920 115803 115221 114662 113886 112834
55516 112834 111170 108698 105869 103158 100422 97515 95022 93632 93181 92966 92605 92070 91372 90765 90780 91508
55500I1508Q50N61N29N76M0p85r09k55L16N11P88J036O22k31n31j82r6n62q42
55481I2944n88k94j20L31R35J031P29Q44J372J420Q17L90L84O0p73j312j256j359
55463I5555k030k656k767k638k376j632n74P1K69P26J418J467P96M26P43R62P28
55446H8488P40J157J023P7m53K21J064Q82J62P5O26R85R61J009J278J476J313
55429A01084N65p84k116k491j833j098r06q32l81K33O71R73J042O07N9L46J528
55412I6667K420K195J394P84L02k15l67p4j60j106k012j806p84j04k18o95j091
55395I5130j231r55l76m5k57m80l5R73J866K255K215J922J522J181Q82L83m36
55378A04514j356j987j999j291k87J34m31j307j593j383j328j334p99M9L04n6
$$ plain form
55500 91508 92358 92919 93448 94024 94064 93279 92370 92115 92431 92942 93730 94766 95388 95157 94626 94444 94348 93786 92944
55481 92944 92356 92062 91942 92273 93208 94239 94968 95812 97184 98604 99421 99811 100195 100255 99482 98170 96914 95555
55463 95555 93525 90869 88102 85464 83088 81456 80882 80953 81222 81948 83366 84833 85629 86055 86798 87760 88488
55446 88488 89228 90385 91408 91485 91032 91253 92317 93199 93361 93436 94062 95047 96008 97017 98295 99771 101084
55429 101084 101649 100865 98749 96258 94425 93327 92421 91589 91208 91441 92112 93085 94127 94734 94793 95139 96667
55412 96667 99087 101282 102676 103460 103762 103547 103180 103106 102946 101840 99828 98022 97238 97134 96916 96221 95130
55395 95130 93899 92944 92568 92523 92266 91786 91751 92724 94590 96845 99060 100982 102504 103685 104567 104950 104514
55378 104514 103158 101171 99172 97881 97594 97728 97297 95990 94397 93014 91686 90352 89553 89602 89906 89850
55362H9850J1R26J787J749J131O34M01K62J72j0m34p11k84N57Q52L70k00n08r26
55343I5629j467j505r28l97j08M51J164J048l4q00m05L69N43L48L06J17n22r91
55325I2818p19j69J01M53J203J569Q08l40o58l44n81j534k074j518n59k13n35
55308H7708o65J03J460K274J809O63N5L23Q00J049J236J253O67k14m13J71N32
55291I8811L71O69J699J934K86j844k271r99O0j58q88j091p08k37q7m35j031j187
55273I2894n05M88R44O75J56j65j86n0j14n46p97q0J268J798Q33n16q65l24J34
55254I5042K56M72Q35R65P72M83K22J46N16J137J217M77k43j80K10O1n45r52j082
55235I9809j265j392j117o57m71m18j6O75J120J077P01J64k73k56J35K91j9k42
$$ plain form
55362 89850 89861 90787 92574 94323 95454 96088 96489 96751 96923 96913 96479 95768 95484 96041 96893 97263 97063 96555 95629
55343 95629 94162 92657 91729 91332 91224 91675 92839 93887 93853 93053 92648 93017 93560 93908 94214 94331 93809 92818
55325 92818 92099 91930 92031 92484 93687 95256 96064 95724 95066 94722 94141 92607 90533 89015 88456 88243 87708
55308 87708 87043 87146 88606 90880 92689 93352 93407 93730 94530 95579 96815 98068 98735 98521 98108 98279 98811
55291 98811 99182 99851 101550 103484 103770 101926 99655 98656 98716 98558 97670 96579 95871 95634 95547 95112 94081 92894
55273 92894 92389 92877 93821 94496 94652 94487 94301 94251 94137 93591 92794 92714 93982 95780 96613 96097 95232 94908 95042
55254 95042 95298 95770 96605 97570 98342 98825 99047 99193 99709 100846 102063 102540 102297 102117 102327 102388 101843 100891 99809
55235 99809 98544 97152 96035 95378 94907 94489 94473 95148 96268 97345 98046 98210 97937 97681 97816 98107 98088 97846
55217I7846n5k0n45r85o53KJ59m0LJ75L3j13K96Q84P98R6l82l04k7K91O87P63
55195I8909R0q35j059n53j62k97n59o29o00m08J76R08J230J090Q98P59M26oj12
55176I9266J09K40J16o0k23m09l62J72Q62J190J236J426J653J372N47k69p10q55
55158A05301p56l89K0J66J87M21P56P66L35k49p17q53m62K30N17N8n92q06p54
55139A03179p83n86J86R83J053P13Q33J362J350M16q59j797k065j421l0J096R86
55122A04616L9l97J75R33J073P35M21L16L82N41O22N56N16N20J93n05q06j35Q61
55103A10656J175Q64O91O70K27n11p35k41M15R17J338J394P92J45L47J017Q79
55086A20040k10r67o81p6K09O02J399J814J120j54r80j107r50p48n31m11l88j83
$$ plain form
55217 97846 97791 97771 97226 96241 95588 95590 95749 95709 95712 95887 95920 95807 96103 96987 97785 97881 97499 97195 97168 97459 98146 98909
55195 98909 98999 98164 97105 96552 96390 96093 95534 94905 94305 93897 94073 94981 96211 97301 98199 98958 99384 99378 99266
55176 99266 99375 99615 99731 99671 99448 99039 98677 98849 99711 100901 102137 103563 105216 106588 107135 106866 106156 105301
55158 105301 104545 104156 104176 104342 104529 104950 105706 106472 106807 106558 105841 104988 104526 104756 105273 105331 104739 103933 103179
55139 103179 102396 101810 101996 102979 104032 104745 105578 106940 108290 108706 107847 106050 103985 102564 102534 103630 104616
55122 104616 104655 104258 104433 105366 106439 107174 107595 107911 108293 108834 109456 110012 110528 111048 111241 110736 109930 109795 110656
55103 110656 111831 112695 113386 114056 114283 113772 113037 112796 113211 114128 115466 116860 117652 117797 118144 119161 120040
55086 120040 119830 118863 118182 118106 118315 118917 120316 122130 123250 123096 122116 121009 120059 119311 118780 118369 117981 117798
55068A17798K66N64L91n2l86m33k10J18J81k41q13j033r37q59o95j32N12M92j97
55049A14334p34o17j83J05K04J94Q7L0O3j20n96o56K36J252J074j59j004p55r8
55030A12657K93N38O34K10n21p60m52l40m80m7R07J117J65o73n13k51p26j058
55012A10700k13R72J055L78M57J466K111J758J150R11P14K13l19o07p54p29j79
54995A19084Q79J758J771Q71m32j484j723j017R4P66N79j57q50j189j289j367
54979A16294j321p91K15J025J030N38L60N97N72M6l12L4P21J113J131R55N80J37
54961A22924J34P34J266J044L22j19pL22N82P26O68L30j16l86l68q5L61O11K41
54942A29184n79j043p61l91p10j430j531o29N91J284J292J058J044J313J543J456
$$ plain form
55068 117798 118064 118628 119019 118967 118581 118148 117938 118056 118237 117996 117183 116150 115213 114354 113659 113527 114039 114531 114334
55049 114334 113600 112983 112800 112905 113109 113303 113390 113420 113483 113363 112767 112111 112347 113599 114673 114514 113510 112755 112657
55030 112657 112950 113488 114122 114332 113811 113051 112599 112259 111779 111732 112639 113756 113921 113248 112735 112484 111758 110700
55012 110700 110487 111459 112514 112892 113349 114815 116926 118684 119834 120745 121459 121672 121353 120746 119992 119263 119084
54995 119084 119963 121721 123492 124363 123931 122447 120724 119707 119801 120567 121146 120989 120139 118950 117661 116294
54979 116294 114973 114182 114397 115422 116452 116990 117350 117947 118519 118565 118253 118287 119008 120121 121252 122207 122787 122924
54961 122924 123058 123792 125058 126102 126424 126305 126298 126620 127202 127928 128596 128926 128810 128424 128056 127971 128332 128943 129184
54942 129184 128605 127562 126801 126410 125700 124270 122739 122110 122701 123985 125277 126335 127379 128692 130235 131691
54926A31691J278J603K709M155N252N709N767N800N922N849N149L783K242R44
54912A87853k99j817l298m040l974l799m043m513m801m728m244l392k554k213
54898A40138k302k278j864j258o52j35K9k23k68N16J600J834J222R74J655K418
54882A41406K546K545L069L878M553N247N998O179N532M878M844M708L468J377
54868B00228n84k175l768n231o028o149n997n584m726l760l230l026k608j970
54854A45392j613j696j938k136k263k153j742j376j364j435j233r63r77j059p98
54839A22646l99l75p23j039j200j264r72j23Q05J157J065J165J529J626J236O65
54823A25799J29l62n96l36J35K57m6l79m88l23K38J022J257M81m87m47M15P49
$$ plain form
54926 131691 132969 134572 137281 141436 146688 152397 158164 163964 169886 175735 180884 184667 186909 187853
54912 187853 187554 185737 182439 178399 174425 170626 166583 162070 157269 152541 148297 144905 142351 140138
54898 140138 137836 135558 133694 132436 131784 131649 131678 131455 131187 131703 133303 135137 136359 137333 138988 141406
54882 141406 143952 146497 149566 153444 157997 163244 169242 175421 180953 185831 190675 195383 198851 200228
54868 200228 199644 197469 193701 188470 182442 176293 170296 164712 159986 156226 152996 149970 147362 145392
54854 145392 143779 142083 140145 138009 135746 133593 131851 130475 129111 127676 126443 125480 124503 123444 122646
54839 122646 122247 121872 121149 120110 118910 117646 116674 116551 117356 118513 119578 120743 122272 123898 125134 125799
54823 125799 125928 125566 124970 124634 124769 125026 124980 124601 124113 123790 124028 125050 126307 126788 126301 125854 126269 127018
54805A27018J49j95O67J948K210J229L3n09l44K01Q39J201Q95%p68p77k48ql57
54786A33184o80m09K9p6l86Q0J255J833J192M19O84J570J976J930K289L177L943
54769A52010M456N224O235O783O662O476O552O406N630M530L440K127L29j598
54755B15262l092m110n052o091o950p242o838o000n178m623m186l570k683j671
54741A47976p36j01P0j29l80n27n81l51M30J368J519O65j02K79J440K303K690
54724A55833L254M158M856N156N446N700N239L852K338J459Q92k78k288m390n662
54709A85565n867n475n057m703m208l669l543l873l954l127j672n17k41o29j008
54694A38022p36K71J263J264K96n46n61l42o52j132r93m11j95m00l80pK01J35
$$ plain form
54805 127018 127167 126972 127639 129587 131797 133026 133059 132550 132206 132407 133246 134447 135342 135342 134574 133797 133549 133541 133184
54786 133184 132504 132095 132124 132048 131662 131742 132997 134830 136022 136441 137125 138695 140671 142601 144890 148067 152010
54769 152010 156466 161690 167925 174708 181370 187846 194398 200804 206434 210964 214404 216531 216860 215262
54755 215262 212170 208060 203008 196917 189967 182725 175887 169887 164709 160086 155900 152330 149647 147976
54741 147976 147240 147139 147209 147080 146700 146173 145592 145241 145671 147039 148558 149223 149121 149400 150840 153143 155833
54724 155833 159087 163245 168101 173257 178703 184403 189642 193494 195832 197291 198183 197905 195617 191227 185565
54709 185565 179698 174223 169166 164463 160255 156586 153043 149170 145216 142089 140417 139900 139659 139030 138022
54694 138022 137286 137557 138820 140084 140380 139834 139273 138931 138279 137147 136154 135743 135548 135148 134768 134761 134962 135097
54676A35097K05L63qr64j669j546j025p72p97p09m33k34k88n05o48n88m34l30
54658A24715q1O36J545J772J012J04r3J67J94J03M34R66R18K03m77o92n77k65
54640A30584J42J54n95j512j562o39M06R74J125R42M34j0k0J4m29q57l85O34R23
54621A30323K72j50L23R55R55M85r3p80j263q45L75J285J242Q12N10n3j108j925
54603A31320j890j472j299j040j37J073J828K026K020J819J209L76k54m74l07
54588A34798J30M44K10l45n66m54o35j051p03O60J722J308O0o01l89n0N7J83L50
54569A35128L74M76J004J614J569P53j74o42o03k46J91M36L90K30M9k98p62r54
54551A38535p49n81p21q15m48K31R15J576K055J834Q29j19j91L83Q30R43R68Q77
$$ plain form
54676 135097 135302 135665 135657 134693 133024 131478 130453 129681 128884 128175 127742 127508 127220 126715 126067 125479 125045 124715
54658 124715 124634 125270 126815 128587 129599 129703 129610 129777 129971 130074 130508 131474 132392 132595 132118 131426 130849 130584
54640 130584 130726 130880 130285 128773 127211 126572 126978 127952 129077 130019 130453 130443 130423 130437 130008 129151 128766 129400 130323
54621 130323 130595 130445 130768 131723 132678 133163 133070 132290 131027 130182 130557 131842 133084 133896 134406 134353 133245 131320
54603 131320 129430 127958 126659 125619 125482 126555 128383 130409 132429 134248 135457 135833 135579 135105 134798
54588 134798 134928 135372 135582 135237 134671 134217 133582 132531 131828 132488 134210 135518 135578 134977 134588 134538 134595 134778 135128
54569 135128 135502 135978 136982 138596 140165 140918 140744 140102 139499 139253 139444 139880 140270 140500 140549 140251 139489 138535
54551 138535 137786 137205 136484 135669 135221 135452 136367 137943 139998 141832 142661 142542 142351 142734 143564 144507 145475 146352
54533A46352M69p0l61l97m24m57m16l99m70m85m86q20j421j570r27k59m53j245
54515A36161j603j012K03J416K020J606M62m82o38k82J97Q39J370R78l75j346
54499A39514r57j20j63o93l60Q30J617J618J581J625R18n42j415q65L41J106J275
54482A45310J090M89l29n91P3R71J319J249J250J247R48O36R43J932K945L285
54466A62767K805J946J374J311J244N81m25r07n67j02k75j068j969k561k649k203
54450A59302j478q50m40j95k34n92p33r5Q11P76l63j257q63R5K41n09j057q09
54432A51750l09j87l16k47Q8L65L45J18k9P5K76K50p3l89l91p0M40J059J605J749
54412A56109J373Q25M99L40O7k84m32l32j95o8K52P37J019Q84O08N30N74M60K09
$$ plain form
54533 146352 146821 146751 146390 145993 145569 145112 144696 144297 143827 143342 142856 142036 140615 139045 138118 137859 137406 136161
54515 136161 134558 133546 133749 135165 137185 138791 139253 138771 138133 137851 138048 138887 140257 141235 140860 139514
54499 139514 138557 138437 138274 137581 137221 138051 139668 141286 142867 144492 145410 144868 143453 142588 142929 144035 145310
54482 145310 146400 146889 146560 145969 146042 147013 148332 149581 150831 152078 153026 153662 154605 156537 159482 162767
54466 162767 165572 167518 168892 170203 171447 172028 171603 170696 170129 170027 169752 168684 166715 164154 161505 159302
54450 159302 157824 156974 156534 156339 156105 155513 154780 154685 155496 156272 155909 154652 153789 153884 154125 153616 152559 151750
54432 151750 151441 151254 150938 150691 150779 151144 151489 151607 151578 151653 151929 152179 152106 151717 151326 151256 151696 152755 154360 156109
54412 156109 157482 158307 158806 159146 159213 158929 158497 158165 157970 157902 158154 158891 159910 160794 161402 161932 162506 162966 163175
54393A63175J12K92N94Q98J172J204P22r1n72l29K59N73N38M58M04K31L0O6K60
54374A69996K57R6K89J124K338L487M297M565M239L693L399L226K641J676R87
54359B06310P29J18j341k957l753l750l639l694l659l417k997k226j098k07j08
54344A74311n11p49q77j439k239k360j493m87j86m17m68j06L17M45K70P2J26L90
54326A64599M65O2n43p56l09N16J253J535J191M23k31m34m16n18n81l15m3l58
54308A65540j065j240n21L13L71k80r73j410j718j811j279q1J085J361O44l17
54292A58619p50n88k29J97Q41J501J611J096O92R60J426J284N69J6q1j23m36p86
54274A65819q50o20k31K67Q06J275J637J892J949J710J292R42Q08Q94J099J160
$$ plain form
54393 163175 163287 163579 164173 165071 166243 167447 168169 168078 167506 167177 167436 168009 168547 169005 169409 169640 169670 169736 169996
54374 169996 170253 170349 170638 171762 174100 177587 181884 186449 190688 194381 197780 201006 203647 205323 206310
54359 206310 207039 207157 205816 202859 199106 195356 191717 188023 184364 180947 177950 175724 174626 174419 174311
54344 174311 173800 173051 172174 170735 168496 166136 164643 164156 163970 163553 163085 162979 163296 163741 164011 164083 164209 164599
54326 164599 165064 165126 164583 163827 163518 164034 165287 166822 168013 168436 168205 167771 167355 166837 166256 165941 165898 165540
54308 165540 164475 163235 162714 163027 163398 163118 162145 160735 159017 157206 155927 155846 156931 158292 158936 158619
54292 158619 157869 157281 157052 157249 158090 159591 161202 162298 162990 163950 165376 166660 167229 167245 167164 167041 166605 165819
54274 165819 164969 164349 164118 164385 165191 166466 168103 169995 171944 173654 174946 175888 176696 177590 178689 179849
54258A79849Q54M11L60P24P99Q1j008j702j794j463p98m5J75l59q53n04K99N69
54240A75595K27j8Rk03p08r20o70m95o77q37p27n30k15N45J550J958J389L98l82
54221A75289q62j029o42J49O05L36k03m72n61p36q76p92o02m36j98M6j8l46m07
54202A68245M5N66P58Q22R81R03J96q58j538j410n62N41J292J337R24N29J23n91
54184A72303j265j050J59J397J863J668J112J50r18j215m34N33Q06O40N88L73
54168A76710m63j437j696j309r84r27q64r17j342j653j062J68Q84O48K05K06L51
54151A66518J57k24m20m41m11j83L12P19O91M51M94Q70J141R70N72M44P75J204
54133A73639J192O39M1q9J81L08m2o28r95r44o15k13K00O60J204J862K644L372
$$ plain form
54258 179849 180703 181114 181474 182198 182997 183078 182070 180368 178574 177111 176313 176268 176443 176084 175231 174727 175026 175595
54240 175595 175822 175804 175813 175610 174902 173982 173312 172817 172140 171303 170576 170046 169831 170376 171926 173884 175273 175671 175289
54221 175289 174427 173398 172756 172905 173510 173846 173643 173171 172610 171874 170998 170206 169604 169168 168970 169016 168998 168652 168245
54202 168245 168290 168856 169614 170436 171417 172320 172516 171658 170120 168710 168148 168689 169981 171318 172242 172771 172894 172303
54184 172303 171038 169988 170147 171544 173407 175075 176187 176337 175419 174204 173770 174303 175109 175749 176337 176710
54168 176710 176247 174810 173114 171805 170821 169894 169030 168113 166771 165118 164056 164224 165108 165756 165961 166167 166518
54151 166518 166675 166451 166031 165590 165179 164996 165308 166027 166718 167169 167663 168533 169674 170644 171216 171660 172435 173639
54133 173639 174831 175470 175511 175422 175603 175911 175869 175241 174246 173302 172687 172474 172674 173334 174538 176400 179044 182416
54115A82416L607L043K031J383J450J694J548J268J528K368L201L663L814L570
54101B16584K694J434M31j31p07j482k031k077j880j607j025j94K38o6n99q47
54085B08735j033j481j829j592r81n53l95l10m04p96j128j026p12n38k19O92J877
54068A98307K489K230J477N95k29n87j53O61R91N99K5l04n31q18r60p33k04M91
54050B03346J276J979K372K542K848L425M009M310M337M285M265M276M273M344
54036B51887M753N599O491O896O915P192P835Q048P300O234N774N737N238M120
54022C40019L120K647K252J438L46o07j311j918k502k950l058k840k776l432m595
54007C23833n319n193n018n549o129n580m048k897k816l142l202l242l590l802
$$ plain form
54115 182416 186023 189066 191097 192480 193930 195624 197172 198440 199968 202336 205537 209200 213014 216584
54101 216584 219278 220712 221143 221012 220305 218823 216792 214715 212835 211228 210203 210009 210247 210181 209582 208735
54085 208735 207702 206221 204392 202800 201819 201266 200871 200561 200157 199361 198233 197207 196495 195957 195738 196430 198307
54068 198307 200796 203026 204503 205098 204869 204282 204129 204790 205781 206380 206405 206101 205570 204752 203792 203059 202855 203346
54050 203346 204622 206601 208973 211515 214363 217788 221797 226107 230444 234729 238994 243270 247543 251887
54036 251887 256640 262239 268730 275626 282541 289733 297568 305616 312916 319150 324924 330661 335899 340019
54022 340019 343139 345786 348038 349476 349822 349215 347904 345986 343484 340534 337476 334636 331860 328428 323833
54007 323833 318514 313321 308303 302754 296625 291045 286997 284100 281284 278142 274940 271698 268108 264306
53993B64306l297k308j672j893k709l367l227k356j556j426j613j383p92m74m18
53978B35815R9J152J825J629J350J853K801L332L447L884M957O328P736R189J0403
53963B95800J0704R605P132L581o11m659p542q627q170p056o041n228m232k805
53949B71851j249n9O88J319K024K639L050L434L842L971L559K866K368K217K283
53934C04803K505K855L004K497J435O13P19J572K461L173M227N877P306P411O300
53919C56758N365N674O811P731Q162Q609R252R703R723R510R126Q321P138O093
53905D67976N408M550K949Q79q10j658j960k252k788l503m237m929n597o228o722
53890D41078p043p352p793q232q434q448q597r015r410r330q531p124n625m753
$$ plain form
53993 264306 261009 258701 257029 255136 252427 249060 245833 243477 241921 240495 238882 237499 236707 236233 235815
53978 235815 235914 237066 238891 240520 241870 243723 246524 249856 253303 257187 262144 268472 276208 285397 295800
53963 295800 306504 316109 323241 326822 326211 321552 314010 305383 297213 290157 284116 278888 274656 271851
53949 271851 270602 270543 271231 272550 274574 277213 280263 283697 287539 291510 295069 297935 300303 302520 304803
53934 304803 307308 310163 313167 315664 317099 317712 318431 320003 322464 325637 329864 335741 343047 350458 356758
53919 356758 362123 367797 374608 382339 390501 399110 408362 418065 427788 437298 446424 454745 461883 467976
53905 467976 473384 477934 480883 481762 480952 479294 477334 475082 472294 468791 464554 459625 454028 447800 441078
53890 441078 434035 426683 418890 410658 402224 393776 385179 376164 366754 357424 348893 341769 336144 331391
53876C31391m872n521n835n473m865m500m369m266m254m483m741m611m027l405
53862B66169l145l141k924k228j310o66n00o55q86j101j224j157j023j137j555
53847B43517j859j686j220q63o05j39M80P69M05l59r77j074o94k07K7L8Q7J18
53829B35758k31q56r69j55P98Q36Q5m15k56QL2K30Q70J416J351R74R54J466K212
53810B44108K947L551L881L951M047M377M738M864M834M973N467O192O842P095
53796C11867O890O579O559O673O319N255L961L057K658K482K240J751R16j04r28
53781C66175j340j560j955k698l741m931n977o540o522o189n951o048o377o523
53767B99823o083n187m442m152l881l211k548k542k937k847k156j733k095k688
$$ plain form
53876 331391 326519 320998 315163 309690 304825 300325 295956 291690 287436 282953 278212 273601 269574 266169
53862 266169 263024 259883 256959 254731 253421 252755 252255 251600 250714 249613 248389 247232 246209 245072 243517
53847 243517 241658 239972 238752 237889 237284 237145 237625 238394 238799 238440 237463 236389 235695 235488 235515 235553 235640 235758
53829 235758 235527 234671 233702 233547 234345 235181 235266 234851 234595 234603 234635 234865 235735 237151 238502 239476 240430 241896 244108
53810 244108 247055 250606 254487 258438 262485 266862 271600 276464 281298 286271 291738 297930 304772 311867
53796 311867 318757 325336 331895 338568 344887 350142 354103 357160 359818 362300 364540 366291 367207 367103 366175
53781 366175 364835 363275 361320 358622 354881 349950 343973 337433 330911 324722 318771 312723 306346 299823
53767 299823 293740 288553 284111 279959 276078 272867 270319 267777 264840 261993 259837 258104 256009 253321
53753B53321k854k700k556k229j447n86k74m86o00k13M47Q30N58k46r78j097o97
53736B38193l03j00J30L89L57R5J29N82R11Q75J040J759K361K123J474J407J984
53719B53406K301J885J274J167J576J971J858J146K82J1P17J985L080L687L945
53704B80291L948L632L106K685K525K555K685K946L361L854M227M189L630K932
53690C26566K731L112L333K570P73j380l068l761l465k816k576k741k542j620
53676C15116p11o29j034q85P3J009J104L89n41j176j255p49J05Q22Q88J04j068
53659C11562j611q59N29J078K35r59j257p23k49j61q1J60L35M49P87J359J899
53642C12493K338K749K939K748K594K973L499L283K344J781K244L086L416L327
$$ plain form
53753 253321 250467 247767 245211 242982 241535 240949 240675 240189 239589 239376 239823 240653 241211 240965 239987 238890 238193
53736 238193 237890 237790 237920 238309 238666 238761 238890 239472 240383 241258 242298 244057 246418 248541 250015 251422 253406
53719 253406 255707 257592 258866 260033 261609 263580 265438 266584 266866 266877 267594 269579 272659 276346 280291
53704 280291 284239 287871 290977 293662 296187 298742 301427 304373 307734 311588 315815 320004 323634 326566
53690 326566 329297 332409 335742 338312 339085 337705 334637 330876 327411 324595 322019 319278 316736 315116
53676 315116 314405 313776 312742 311857 311930 312939 314043 314432 313891 312715 311460 310711 310816 311638 312526 312630 311562
53659 311562 309951 309092 309621 310699 310934 309975 308718 307995 307746 307585 307504 307664 307999 308448 309235 310594 312493
53642 312493 314831 317580 320519 323267 325861 328834 332333 335616 337960 339741 341985 345071 348487 351814
53628C51814L446L826L912L394K583K023K007K428K902L144L270L492L576L068
53614C94885K187J941K915M323M857M258L504L413L671L482K773K254K428K931
53600D39822L030K466J597Q22K18k63n25m54j93n0k52q09j532k097k220j925j531
53583D36104j295j227j267j531k137k937l561l725l486l206l214l352l006j903
53569D00257p00l28p61j093q99p93j276j783j523o95j16N3M12J273K199K648K498
53552C99373J905J107M98M44Q89J416J748K006K438L107L828M275M294M218M579
53537D36125N366N964O012N931O185O584O821P249Q365R887J1074J1778J2385
53524E39726J2919J3041J2899J3072J3637J4081J4364J5198J6953J8972K0386
$$ plain form
53628 351814 355260 359086 362998 366392 368975 370998 373005 375433 378335 381479 384749 388241 391817 394885
53614 394885 397072 399013 401928 406251 411108 415366 418870 422283 425954 429436 432209 434463 436891 439822
53600 439822 442852 445318 446915 447737 447955 447692 447167 446713 446520 446470 446218 445409 443877 441780 439560 437635 436104
53583 436104 434809 433582 432315 430784 428647 425710 422149 418424 414938 411732 408518 405166 402160 400257
53569 400257 399557 399229 398468 397375 396476 395683 394407 392624 391101 390406 390290 390343 390755 392028 394227 396875 399373
53552 399373 401278 402385 402883 403327 404216 405632 407380 409386 411824 414931 418759 423034 427328 431546 436125
53537 436125 441491 447455 453467 459398 465583 472167 478988 486237 494602 504489 515563 527341 539726
53524 539726 552645 565686 578585 591657 605294 619375 633739 648937 665890 684862 705248
53513G05248K1108K1644K2378K3385K4619K5882K6817K7180K6999K6457K5786
53502I77503K5248K4842K4154K2857K1272K0027J9227J8525J7875J7555J7472
53491A206557J7200J6806J6873J7497J8050J8176J8295J8658J8697J7898J6743
53480A401450J6099J6041J5858J4936J3109J0501P569N069L340J729p42m163p586
53467A493210j0061j1478j2442j3555j4958j6295j7084j7221j7098j7252j7945
53456A327821j9028k0071k0663k0833k1104k1773k2312k1941k0758j9653j9023
53445A100662j8343j7206j6057j5297j4395j2636j0270q088o244m301k334j000
53433I74491m39J15J266K719L939N009O323P809R054J0058J1278J2866J4379J5510
$$ plain form
53513 705248 726356 748000 770378 793763 818382 844264 871081 898261 925260 951717 977503
53502 977503 1002751 1027593 1051747 1074604 1095876 1115903 1135130 1153655 1171530 1189085 1206557
53491 1206557 1223757 1240563 1257436 1274933 1292983 1311159 1329454 1348112 1366809 1384707 1401450
53480 1401450 1417549 1433590 1449448 1464384 1477493 1487994 1495563 1500632 1503972 1505701 1504959 1500796 1493210
53467 1493210 1483149 1471671 1459229 1445674 1430716 1414421 1397337 1380116 1363018 1345766 1327821
53456 1327821 1308793 1288722 1268059 1247226 1226122 1204349 1182037 1160096 1139338 1119685 1100662
53445 1100662 1082319 1065113 1049056 1033759 1019364 1006728 996458 988370 982126 977825 975491 974491
53433 974491 974052 974167 975433 978152 982091 987100 993423 1001232 1010286 1020344 1031622 1044488 1058867 1074377
53419A074377J6697J8612K1186K3567K5073K5846K6509K7524K9024L0895L2778
53408A352088L4204L5083L5846L6868L8121L9572M1501M3965M6346M8077M9506
53397A801177N1335N3416N4945N5777N6574N7587N8221N8078N7495N6658N5101
53386B416364N2688N0323M8819M7640M5582M2368L8753L5270L1635K7409K2625
53375B859476J7603J2568P477K064l888j0116j5905k0884k5618l1030l7367m3930
53363B710450m9666n3815n6221n7403n8133n8629n8436n7318n5926n5084n4638
53352B095181n3620n1473m8639m5951m3889m2443m1370m0460l9733l9338l9159
53341A609106l8672l7471l5669l3526l0899k7590k4044k1167j9384j8266j7182
$$ plain form
53419 1074377 1091074 1109686 1130872 1154439 1179512 1205358 1231867 1259391 1288415 1319310 1352088
53408 1352088 1386292 1421375 1457221 1494089 1532210 1571782 1613283 1657248 1703594 1751671 1801177
53397 1801177 1852512 1905928 1960873 2016650 2073224 2130811 2189032 2247110 2304605 2361263 2416364
53386 2416364 2469052 2519375 2568194 2615834 2661416 2703784 2742537 2777807 2809442 2836851 2859476
53375 2859476 2877079 2889647 2897124 2899188 2895300 2885184 2869279 2848395 2822777 2791747 2754380 2710450
53363 2710450 2660784 2606969 2550748 2493345 2435212 2376583 2318147 2260829 2204903 2149819 2095181
53352 2095181 2041561 1990088 1941449 1895498 1851609 1809166 1767796 1727336 1687603 1648265 1609106
53341 1609106 1570434 1532963 1497294 1463768 1432869 1405279 1381235 1360068 1340684 1322418 1305236
53330A305236j5930j4696j3690j2959j2407j1882j1376j1071j1039j1061j0865
53319A168260j0390r626q449o950n643m870m220l027j307L54J787L449N472P236
53305A132076Q224Q822R807J1332J2896J4169J5385J6964J9006K1210K3118K4418
53293A317427K5226K6026K7178K8481K9325K9316K8543K7285K5599K3344K0513
53282A608263J7388J4351J1616R100O420L164o57m444p586j0160j2774j5628j8161
53269A600892j9852k1053k2514k4391k6149k7348k7997k8249k8216k8160k8433
53258A318530k9117k9990l0835l1454l1524l0940l0160k9682k9272k8323k6913
53247I90320k5785k5267k4969k4600k4235k3644k2361k0753j9937k0115j9990
$$ plain form
53330 1305236 1289306 1274610 1260920 1247961 1235554 1223672 1212296 1201225 1190186 1179125 1168260
53319 1168260 1157870 1148244 1139795 1132845 1127202 1122332 1118112 1115085 1113778 1114132 1115919 1119368 1124840 1132076
53305 1132076 1140300 1149122 1158929 1170261 1183157 1197326 1212711 1229675 1248681 1269891 1293009 1317427
53293 1317427 1342653 1368679 1395857 1424338 1453663 1482979 1511522 1538807 1564406 1587750 1608263
53282 1608263 1625651 1640002 1651618 1660718 1667138 1670302 1669645 1665201 1657615 1647455 1634681 1619053 1600892
53269 1600892 1581040 1559987 1537473 1513082 1486933 1459585 1431588 1403339 1375123 1346963 1318530
53258 1318530 1289413 1259423 1228588 1197134 1165610 1134670 1104510 1074828 1045556 1017233 990320
53247 990320 964535 939268 914299 889699 865464 841820 819459 798706 778769 758654 738664
53236G38664j8581j6593j5141j4072j2643j1068j0029r222p825o188n638o507
53224F05157p661q254q716r656j0781j1524j1934j2333j2639j2569j2136j1554
53212D75400j0901j0123r169q017o856o151o166o522o627o429o164n664m734m066
53198C77811m710o392p464o985n935n702o206o315n557m433l426k582k037k097
53184C07970k669l166l176k874k612k413k022j324n43j07k63q49j458j851k073
53169B80570k173k023j480o12L10R36R64L43n84j370j864k161k223j897j277p04
53153B64755l37o1J36R8j38k98l44n45r01r31l13O06J271J557J671J618J224N24
53135B69592j44m92n06l74k39K4O54J525J968J493N00j91m38p47j117p87N39K004
$$ plain form
53236 738664 720083 703490 688349 674277 661634 650566 640537 631315 623490 617302 611664 605157
53224 605157 597496 589242 580526 570870 560089 548565 536631 524298 511659 499090 486954 475400
53212 475400 464499 454376 445207 437190 430334 424183 418017 411495 404868 398439 392275 386611 381877 377811
53198 377811 373101 366709 359245 352260 346325 340623 334417 328102 322545 318112 314686 312104 310067 307970
53184 307970 305301 302135 298959 296085 293473 291060 289038 287714 287171 287064 286801 285952 284494 282643 280570
53169 280570 278397 276374 274894 274282 274592 275528 276492 276835 276251 274881 273017 270856 268633 266736 265459 264755
53153 264755 264418 264357 264493 264591 264453 264155 263811 263266 262365 261434 261121 261727 262998 264555 266226 267844 269068 269592
53135 269592 269448 268956 268450 268076 267837 267861 268515 270040 272008 273501 274001 273810 273372 272625 271508 270721 271260 273264
53117B73264K678K665K556K394J987J694K004K510K274J154m4p93j405k188k824
53102B87926k968k844k816k754k267j313k71M34N70J54n16j059j352j532j669
53087B67723j742j906k418l118l445l163k628k086j200K24J476J627Q15J38K33
53072B50530O28O48L03o6m03p96j078j080j000j035r61n67k38m31p75m72M26R99
53054B44632R01R24J665K490K515J982J664J471O78n69j203q21l36o15j332j692
53038B52354j521j085m08M54R72P51K97L96Q43O92k57j088j139q38p68o42M5Q79
53020B49937R70L14j57N0L35O7m51n56k14J45L80N81N56M5n72n56J90R66J227
53001B53257J066O10k39j131j159k0J252J453O52j39l70k45N0N75J173J569J910
$$ plain form
53117 273264 275942 278607 281163 283557 285544 287238 289242 291752 294026 295180 295136 294343 292938 290750 287926
53102 287926 284958 282114 279298 276544 274277 272964 272693 273127 273697 273851 273335 272276 270924 269392 267723
53087 267723 265981 264075 261657 258539 255094 251931 249303 247217 246017 246241 247717 249344 250159 250297 250530
53072 250530 251158 251806 252109 252043 251640 250844 249766 248686 247686 246651 245690 245123 244885 244454 243679 243207 243633 244632
53054 244632 245533 246457 248122 250612 253127 255109 256773 258244 258922 258353 257150 256329 255993 255378 254046 252354
53038 252354 250833 249748 249340 249794 250766 251517 251814 252210 253053 253745 253488 252400 251261 250423 249655 249013 249058 249937
53020 249937 250907 251221 251064 251114 251449 251516 251065 250509 250295 250440 250820 251401 251957 252002 251430 250874 251064 252030 253257
53001 253257 254323 254933 254694 253563 252404 252384 253636 255089 255741 255602 255232 254987 255037 255612 256785 258354 260264
52984B60264K523L106K996K237J636J521J282M51m81p88m54N5M45O02M09M0L6
52967B75880O44J345J495J121O59K14l77r65j142q51n51o68j153j610j740j634
52951B70667j696k093k376j947r08k9K55L23N42N64k5q51j103o10N7L70K84Mk64
52932B61164l78m52q22j479j779j203j80M15M52N60R90J158O07k15n19j49L19
52915B58489L33j01n15m71K4N44P60Q05R35R72M89m79j321j545j252q05l60O0
52897B56562L54M12K39j11n00n54J11J297K137J915Q39k47p66q29q37j018j271
52880B57733j310r03j62M74O71N95P07J199J840K355K748L172L652M029M072L592
52864B84464K622J568R58Q86Q11J20j166k455l187l186k571j739j383k003l173
$$ plain form
52984 260264 262787 265893 268889 271126 272762 274283 275565 276016 275535 274747 274293 274348 274793 275395 275804 275844 275880
52967 275880 276524 277869 279364 280485 281144 281358 280981 280016 278874 278023 277472 276804 275651 274041 272301 270667
52951 270667 268971 266878 264502 262555 261647 261618 261873 262196 262738 263302 263277 262426 261323 260713 260770 261140 261424 261428 261164
52932 261164 260786 260334 259512 258033 256254 255051 254871 255286 255738 256298 257288 258446 259053 258838 258319 258170 258489
52915 258489 258822 258721 258206 257735 257759 258303 259063 259868 260803 261775 262264 261785 260464 258919 257667 256862 256502 256562
52897 256562 256916 257328 257567 257456 256956 256402 256513 257810 259947 261862 262701 262454 261688 260859 260022 259004 257733
52880 257733 256423 255520 255358 255832 256503 257098 257805 259004 260844 263199 265947 269119 272771 276800 280872 284464
52864 284464 287086 288654 289612 290498 291309 291429 290263 287808 284621 281435 278864 277125 275742 273739 270566
52849B70566l784l296k415k135k490k740k510k143k006k049k064j917j416m44
52835B39157O93J429J561J324R10L36j37p9M51Q43P49M29J16l52r38j116o52j37
52817B44587j88n19m42J41P95J294J662J716J302Q10P99J150J175N22n05j493
52801B52806k184k327j871j317j282j643j674j128o04o27r17q70l99k1k25r40
52785B34777j447r65M29J597J503M51l56l28R6M74R08J339J151N8j181j555r69
52768B35982j08M87P22O38L02n1k28l18m30l99j04J66J55K14Q79J918K410J957
52750B44192J232J056J362J457J099P70R09J333J542J381J109R98J092J313J524
52735B62369J541J306J066J079J122P07j20o58n53l66o91j117q83k82m62j749
$$ plain form
52849 270566 266782 263486 261071 258936 256446 253706 251196 249053 247047 244998 242934 241017 239601 239157
52835 239157 239850 241279 242840 244164 245074 245410 245273 245194 245645 246488 247237 247666 247782 247430 246492 245376 244724 244587
52817 244587 244399 243880 243438 243579 244374 245668 247330 249046 250348 251158 251957 253107 254282 254804 254299 252806
52801 252806 250622 248295 246424 245107 243825 242182 240508 239380 238776 238149 237232 236362 235963 235942 235717 234777
52785 234777 233330 232365 232794 234391 235894 236345 235989 235661 235757 236231 237139 238478 239629 239687 238506 236951 235982
52768 235982 235874 236361 237083 237721 238023 237972 237744 237426 236996 236597 236493 236659 236814 237028 237907 239825 242235 244192
52750 244192 245424 246480 247842 249299 250398 251168 252077 253410 254952 256333 257442 258440 259532 260845 262369
52735 262369 263910 265216 266282 267361 268483 269190 269070 268412 267859 267493 266802 265685 264802 264520 264058 262309
52719B62309l027l162k344j510j039n97O6P54J141J045N00j39k80L19J192J658
52703B56886J546J177Q18M96K20pl45q79j285j088l48K64K76k6j6M22P68N58r
52684B59428l31j49J95K82J83K36M46L66l06j308k023j989j183o3O93Q05O85Q91
52666B56858J273J226P28N88J327K388K849K485J749J092Q06J126J907K443K230
52651B81075J640J275R32oj327k023j679j010p94j000j272j522j669j392o68p6
52635B70484m3k25m8M65J012J603K314K738K502K035K039K282J766K07j438k188
52619B85505k082j723j369j027q79j041j195r21k66M22R80J353J294O91j3j93
52603B79536J56N44O77O13L07l34r27q26m5O68Q49Q09Q80Q18L79o0l3L28O20Q05
$$ plain form
52719 262309 259282 256120 253776 252266 251227 250630 250696 251450 252591 253636 254136 253997 253717 254036 255228 256886
52703 256886 258432 259609 260427 260923 261143 261136 260791 259912 258627 257539 257191 257455 257731 257705 257689 258111 258879 259437 259428
52684 259428 259097 258948 259143 259425 259608 259844 260290 260656 260350 259042 257019 255030 253847 253784 254477 255282 255967 256858
52666 256858 258131 259357 260085 260673 262000 264388 267237 269722 271471 272563 273369 274495 276402 278845 281075
52651 281075 282715 283990 284922 284916 283589 281566 279887 278877 278083 277083 275811 274289 272620 271228 270560 270484
52635 270484 270441 270216 270168 270633 271645 273248 275562 278300 280802 282837 284876 287158 288924 289131 287693 285505
52619 285505 283423 281700 280331 279304 278425 277384 276189 275268 275002 275424 276404 277757 279051 279742 279729 279536
52603 279536 279692 280236 280913 281526 281833 281499 280572 279746 279701 280369 281218 282027 282907 283725 284104 284044 284011 284339 284959 285764
52583B85764R59Q58M50L47J055J962J977J030Q9k94m95q21r21n82k25k09k77j57
52565B90510j9O1M35J066J148K08r35j214q19p52j206j383q60j72J12L6k16o61
52547B85339j072r00p9O25N48k1l44k30q5j53k53j30K22O01P42M75n9m24k81L10
52527B84831J000J445J425R43L37J23M53R07R42N42J33R2M99J278K299L351M203
52510C04803M703M781M463L954L561L256K532R49j178k969l870m087m077l954
52496C12867l566k950k424k202k106j793j206p24p23j056j150p53l13l96q64j008
52480B89633m36N04J257J637J735J594J310J167J339J562J459J153J149J654K309
52465C09026K722K898L002L039L056L318L818L757K231m61k698l219k566k326
$$ plain form
52583 285764 286723 287581 288031 288378 289433 291395 293372 294402 294491 294197 293702 292881 291960 291378 291153 290944 290667 290510
52565 290510 290491 290552 290987 292053 293201 293409 292474 291260 290441 289689 288483 287100 286240 286068 286180 286216 286000 285339
52547 285339 284267 283367 283288 283913 284461 284440 284096 283866 283781 283628 283375 283245 283467 284068 284810 285285 285226 284802 284521 284831
52527 284831 285831 287276 288701 289644 289981 290104 290557 291464 292406 292948 293081 293173 293672 294950 297249 300600 304803
52510 304803 309506 314287 318750 322704 326265 329521 332053 333002 331824 328855 324985 320898 316821 312867
52496 312867 309301 306351 303927 301725 299619 297826 296620 295896 295173 294117 292967 292214 291901 291505 290641 289633
52480 289633 289197 289701 290958 292595 294330 295924 297234 298401 299740 301302 302761 303914 305063 306717 309026
52465 309026 311748 314646 317648 320687 323743 327061 330879 334636 336867 336406 333708 330489 327923 325597
52451C25597l195m349m758m403l909l546l113k508j878j289p60n43q61j399j510
52436B87576j003l52K9K44N19P87R22R57Q10K55n66r78n66L14J165K029K956L273
52418B98371K253M12p96o04M00J350K061K678L154L543M234N442O821P950Q871
52403C46140R678R973R091O769L333m22l446m976n313n588o350o890o397n267
52389C40335m486m057l082j317L06Q80N67J20qL01J106K221L027K962K163J403
52373C42441J392K267L609M837N589N818N497M444K660P22n27p65m73l43o71j297
52357C75200j880k092j776j071k62M39R00R76O56K74K70O88J163J426J539J592
52341C78042J545J522J959L166M746N704N340M074L244L862N603P349Q590R789
$$ plain form
52451 325597 322402 318053 313295 308892 304983 301437 298324 295816 293938 292649 291889 291346 290485 289086 287576
52436 287576 286573 286221 286250 286494 287013 287800 288722 289679 290489 290744 290178 289200 288634 288948 290113 292142 295098 298371
52418 298371 300624 301036 300240 299636 300036 301386 303447 306125 309279 312822 317056 322498 329319 337269 346140
52403 346140 355818 365791 374882 381651 384984 384562 381116 376140 370827 365239 358889 351999 345602 340335
52389 340335 335849 331792 328710 327393 327699 328579 329146 329266 329258 329559 330665 332886 335913 338875 341038 342441
52373 342441 343833 346100 349709 354546 360135 365953 371450 375894 378554 379276 378749 377984 377511 377168 376497 375200
52357 375200 373320 371228 369452 368381 368119 368558 369458 370434 371090 371364 371634 372322 373485 374911 376450 378042
52341 378042 379587 381109 383068 386234 390980 396684 402024 406098 409342 413204 418807 426156 434746 444535
52327D44535J1243J2369J2672J2673J3130J3842J4155J4175J4442J4649J3952
52316E91837J2556J1717J1949J2447J2707J3397J4995J6672J7472J7663J7942
52305G51354J8171J7853J7271J6993J6806J6194J5422J5053J4652J3182J0570
52294I23521P759N276K843M55j376k672m211o210p746q005p344o566n899n252
52280H84573m901n087n326m792l280j377J83J111J682K536M096N901O933O828
52266H89080O399O602P416Q182Q690R272J0062J0809J1442J2224J3215J4089J4632
52253A022114J5053J5546J5862J5579J4603J3083J1020Q227M807J404j206k779
52241A133313l785m855o162p398q283q918r558j0199j0526j0304r685r158r141
$$ plain form
52327 444535 455778 468147 480819 493492 506622 520464 534619 548794 563236 577885 591837
52316 591837 604393 616110 628059 640506 653213 666610 681605 698277 715749 733412 751354
52305 751354 769525 787378 804649 821642 838448 854642 870064 885117 899769 912951 923521
52294 923521 931280 936556 939399 939854 938478 935806 931595 925385 917639 909634 902290 895724 889825 884573
52280 884573 879672 874585 869259 864467 861187 859810 859993 861104 862786 865322 869418 875319 882252 889080
52266 889080 895479 902081 909497 917679 926369 935641 945703 956512 967954 980178 993393 1007482 1022114
52253 1022114 1037167 1052713 1068575 1084154 1098757 1111840 1122860 1131087 1135894 1137298 1136092 1133313
52241 1133313 1129528 1124673 1118511 1111113 1102830 1093912 1084354 1074155 1063629 1053325 1043640 1034482 1025341
52228A025341r617j0079r923q996p741o757o238n882n324m525l700k995k345j573
52214I39646n47P19J934K617K550K202K393L291M104L982L056K185J938K268L022
52199I75360M122N163N565N371N329N832O369O439O420O865P397P169O153N169
52185A058723M608L873K293k0k498m768o706q218r273r949j0280j0190r687q894
52171I89014p919o890n994n175l970k058K7J411K002K492L183L616L605L744M321
52156I81409M462L240J158l30o25m15m53o31m69J92J186K182K694K337J388O27
$$ plain form
52228 1025341 1015724 1005645 995722 986726 978985 972228 965990 960108 954784 950259 946559 943564 941219 939646
52214 939646 939099 939818 941752 944369 946919 949121 951514 954805 958909 962891 965947 968132 970070 972338 975360
52199 975360 979482 984645 990210 995581 1000910 1006742 1013111 1019550 1025970 1032835 1040232 1047401 1053554 1058723
52185 1058723 1063331 1067204 1069497 1069477 1066979 1062211 1055505 1047287 1038014 1028065 1017785 1007595 997908 989014
52171 989014 981095 974205 968211 963036 959066 957008 957035 958446 960448 962940 966123 969739 973344 977088 981409
52156 981409 985871 989111 990269 989939 989314 988899 988446 987815 987346 987538 988724 990906 993600 995937 997325 997952
$$ [...]
##END NTUPLES=NMR SPECTRUM
##END=
