##TITLE=AC1760_VAR00032_9320049_fEDgkB0HtX
##JCAMPDX= 6.0         $$ Bruker NMR JCAMP-DX V2.0
##DATA TYPE= NMR SPECTRUM
##DATA CLASS= NTUPLES
##ORIGIN= BRUKER
##OWNER= Administrator
$$ 1.72 TOPSPIN		Version 2.1
$$ 2015-08-11 23:07:53.273 -0700  Administrator@X
$$ Compression mode = diff/dup
##.OBSERVE FREQUENCY= 400.02188249412
##.OBSERVE NUCLEUS= ^1H
##.ACQUISITION MODE= SIMULTANEOUS (DQD)
##.ACQUISITION SCHEME= undefined
##.AVERAGES= 64
##.DIGITISER RES= 22
##SPECTROMETER/DATA SYSTEM= spect
##.PULSE SEQUENCE= noesygpps1d.comp
##.SOLVENT NAME= COFFEE_meoh
##.SHIFT REFERENCE= INTERNAL, COFFEE_meoh, 1, 14.96081
##AUDIT TRAIL= $$ (NUMBER, WHEN, WHO, WHERE, PROCESS, VERSION, WHAT)
$$ ##TITLE= Audit trail, TOPSPIN		Version 2.1
$$ ##JCAMPDX= 5.01
$$ ##ORIGIN= Bruker BioSpin GmbH
$$ ##OWNER= Administrator
$$ $$ E:\/data/COFFEE/nmr/AC1760_VAR00032_9320049_fEDgkB0HtX/12/pdata/1/auditp.txt
$$ ##AUDIT TRAIL=  $$ (NUMBER, WHEN, WHO, WHERE, PROCESS, VERSION, WHAT)
(   1,<2015-08-11 23:07:48.070 -0700>,<Administrator>,<X>,<go>,<TOPSPIN 2.1>,
      <created by zg
	started at 2015-08-11 22:56:18.257 -0700,
	POWCHK enabled, PULCHK disabled,
       configuration hash MD5:
       21 0F 79 D6 B3 7B B4 F6 88 20 88 DB 03 48 BD 9F
       data hash MD5: 64K
       E8 38 D2 AA F0 56 BD E7 64 44 4E 51 47 67 55 A0>)
(   2,<2015-08-11 23:07:51.132 -0700>,<Administrator>,<X>,<proc1d>,<TOPSPIN 2.1>,
      <Start of raw data processing
       efp LB = 0.3 FT_mod = 6 PKNL = 1 PHC0 = 0 PHC1 = 0 SI = 128K 
       data hash MD5: 128K
       D3 B7 78 82 45 DA E3 8F 20 5B B7 03 96 1E 98 42>)
(   3,<2015-08-11 23:07:52.039 -0700>,<Administrator>,<X>,<proc1d>,<TOPSPIN 2.1>,
      <pk PHC0 = 269.176 PHC1 = 0 
       data hash MD5: 128K
       D4 99 5A DC C1 10 ED D8 EF 48 E4 36 07 04 83 3C>)
(   4,<2015-08-11 23:07:52.445 -0700>,<Administrator>,<X>,<proc1d>,<TOPSPIN 2.1>,
      <abs ABSG = 1 
       data hash MD5: 128K
       A5 15 B1 7D 6B F8 87 FB DD 42 13 9E EB 03 3A 01>)
(   5,<2015-08-11 23:07:52.554 -0700>,<Administrator>,<X>,<proc1d>,<TOPSPIN 2.1>,
      <abs ABSG = 2 
       data hash MD5: 128K
       18 87 D6 FA 42 4A 4E 19 02 00 17 D4 AC CB 59 EC>)
(   6,<2015-08-11 23:07:52.632 -0700>,<Administrator>,<X>,<proc1d>,<TOPSPIN 2.1>,
      <abs ABSG = 3 
       data hash MD5: 128K
       6C A0 1C 7E D2 A2 8D C2 BD 8A 20 26 DF 95 6D 93>)
(   7,<2015-08-11 23:07:52.742 -0700>,<Administrator>,<X>,<proc1d>,<TOPSPIN 2.1>,
      <abs ABSG = 4 
       data hash MD5: 128K
       FA F0 5A 6D F8 93 24 89 E2 9D A2 C9 B4 13 41 09>)
(   8,<2015-08-11 23:07:52.820 -0700>,<Administrator>,<X>,<proc1d>,<TOPSPIN 2.1>,
      <abs ABSG = 5 
       data hash MD5: 128K
       11 34 F6 2F CC 31 20 FE 2E DA 50 20 1A C7 78 87>)
$$ ##END=
$$ 
$$ $$ hash MD5
$$ $$ 45 36 D4 66 29 4F D3 74 A7 32 49 19 C4 74 96 BF
##$RELAX= 
##$RELAX= 
##$RELAX= 
##$RELAX= 
##$RELAX= 
##$RELAX= 
##$RELAX= 
##$RELAX= 
$$ Bruker specific parameters
$$ --------------------------
##$DU= <E:\>
##$EXPNO= 12
$$ [...]
150 150 150 150 150 150 150 150
##$TP07= 0
##$TPNAME0= <>
##$TPNAME1= <>
##$TPNAME2= <>
##$TPNAME3= <>
##$TPNAME4= <>
##$TPNAME5= <>
##$TPNAME6= <>
##$TPNAME7= <>
##$TPOAL= (0..7)
0.5 0.5 0.5 0.5 0.5 0.5 0.5 0.5
##$TPOFFS= (0..7)
0 0 0 0 0 0 0 0
##$TUNHIN= 0
##$TUNHOUT= 0
##$TUNXOUT= 0
##$USERA1= <user>
##$USERA2= <user>
##$USERA3= <user>
##$USERA4= <user>
##$USERA5= <user>
##$V9= 5
##$VALIST= <valist>
##$VCLIST= <CCCCCCCCCCCCCCC>
##$VD= 0
##$VDLIST= <DDDDDDDDDDDDDDD>
##$VPLIST= <PPPPPPPPPPPPPPP>
##$VTLIST= <TTTTTTTTTTTTTTT>
##$WBST= 2048
##$WBSW= 25
##$XGAIN= (0..3)
0 0 0 0
##$XL= 0
##$YL= 0
##$YMAX_a= 5942561
##$YMIN_a= -11389635
##$ZGOPTNS= <>
##$ZL1= 120
##$ZL2= 120
##$ZL3= 120
##$ZL4= 120
##$ABSF1= 14.96081
##$ABSF2= -5.597372
##$ABSG= 5
##$ABSL= 3
##$ALPHA= 0
##$AQORDER= 0
##$ASSFAC= 0
##$ASSFACI= 0
##$ASSFACX= 0
##$ASSWID= 0
##$AUNMP= <proc_prof1d_extract.lims>
##$AXLEFT= 0
##$AXNAME= <>
##$AXNUC= <1H>
##$AXRIGHT= 0
##$AXTYPE= 0
##$AXUNIT= <>
##$AZFE= 0.1
##$AZFW= 0.1
##$BCFW= 0
##$BC_mod= 0
##$BYTORDP= 0
##$COROFFS= 0
##$CY= 15
##$DATMOD= 1
##$DC= 0
##$DFILT= <>
##$DTYPP= 0
##$F1P= 0
##$F2P= 0
##$FCOR= 0.5
##$FTSIZE= 131072
##$FT_mod= 6
##$GAMMA= 0
##$GB= 0
##$INTBC= 1
##$INTSCL= 1
##$ISEN= 128
##$LB= 0.3
##$LEV0= 0
##$LPBIN= 0
##$MAXI= 10000
##$MC2= 0
##$MEAN= 0
##$ME_mod= 0
##$MI= 0
##$NCOEF= 0
##$NC_proc= -2
##$NLEV= 6
##$NOISF1= 0
##$NOISF2= 0
##$NSP= 0
##$NTH_PI= 0
##$NZP= 0
##$OFFSET= 14.96081
##$PC= 1
##$PHC0= 269.176
##$PHC1= 0
##$PH_mod= 1
##$PKNL= yes
##$PPARMOD= 0
##$PPDIAG= 0
##$PPIPTYP= 0
##$PPMPNUM= 2147483647
##$PPRESOL= 1
##$PSCAL= 4
##$PSIGN= 0
##$PYNMP= <proc.py>
##$REVERSE= no
##$SF= 400.02000971271
##$SI= 131072
##$SIGF1= 0
##$SIGF2= 0
##$SINO= 400
##$SIOLD= 131072
##$SPECTYP= <>
##$SREGLST= <1H.CDCl3>
##$SSB= 0
##$STSI= 131072
##$STSR= 0
##$SW_p= 8223.68421052631
##$SYMM= 0
##$S_DEV= 0
##$TDeff= 65536
##$TDoff= 0
##$TI= <>
##$TILT= no
##$TM1= 0
##$TM2= 0
##$TOPLEV= 0
##$USERP1= <user>
##$USERP2= <user>
##$USERP3= <user>
##$USERP4= <user>
##$USERP5= <user>
##$WDW= 1
##$XDIM= 131072
##$YMAX_p= 423773681
##$YMIN_p= -12130
##$CURPLOT= <Network HP LaserJet P1505>
##$CURPRIN= <$Network HP LaserJet P1505>
##$DFORMAT= <normdp>
##$LAYOUT= <+/1D_H.xwp>
##$LFORMAT= <normlp>
##$PFORMAT= <normpl>
##$SURQMSG= 1
$$ End of Bruker specific parameters
$$ ---------------------------------
##NTUPLES= NMR SPECTRUM
##VAR_NAME=  FREQUENCY,     SPECTRUM/REAL,   SPECTRUM/IMAG
##SYMBOL=    X,             R,               I
##VAR_TYPE=  INDEPENDENT,   DEPENDENT,       DEPENDENT
##VAR_FORM=  AFFN,          ASDF,            ASDF
##VAR_DIM=   131072,        131072,          131072
##UNITS=     HZ,            ARBITRARY UNITS, ARBITRARY UNITS
##FACTOR=    0.0627417313425164, 1,          1
##FIRST=     8223.62146879497, 1265,         -53879
##LAST=      0,             2885,            -53551
##MIN=       0,             -12130,          0
##MAX=       8223.62146879497, 423773681,    0
$$ Real data points
##PAGE= N=1
##DATA TABLE= (X++(R..R)), XYDATA
$$ [...]
63916C918724k70397k67809k60955k50356k36547k20310k02626j84293j65784
63907A859647j47538j30227j14404j00019q6658p4344o3741n5280m8399m2035
63897I97002l5931l0919k7765k6052k4613k2880k1360k0750k0994k1429k1558
63886G22751k1370k0993k0395j9410j7968j6215j4468j2923j1398r465o978m321
63874E46847k005n8J906M115O315Q101R356J0298J1182J2065J2899J3771J4847
63861F49639J5971J6512J5926J4511J3170J2353J1531J0062Q119O362M895L212
63849G82263J034j294l473n651q004j0266j2100j3676j5518j7861k0371k2439
63837F52644k3616k3847k3462k2879k2221k1391k0520j9972j9717j9001j7159
$$ y = [3918724, 3648327, 3380518, 3119563, 2869207, 2632660, 2412350, 2209724, 2025431, 1859647, 1712109, 1581882, 1467478, 1367459, 1280801, 1206457, 1142716, 1087436, 1039037, 997002, 961071, 930152, 902387, 876335, 851722, 828842, 807482, 786732, 765738, 744309, 722751, 701381, 680388, 659993, 640583, 622615, 606400, 591932, 579009, 567611, 558146, 551168, 546847, 544842, 544784, 546690, 550805, 557120, 565221, 574577, 584875, 596057, 608122, 621021, 634792, 649639, 665610, 682122, 698048, 712559, 725729, 738082, 749613, 759675, 767794, 774156, 779051, 782263, 783297, 782003, 778530, 772879, 764875, 754609, 742509, 728833, 713315, 695454, 675083, 652644, 629028, 605181, 581719, 558840, 536619, 515228, 494708, 474736, 455019, 436018, 418859]
63826D18859j4587j2406j1160j0338r365q448q062p960p377o150n032m642m665
63813C08667m363l613k853k263j567p14k11m29r47r94m24J15o2r60j958k392k129
63796B82903j661j642k187k800l054l117l292l401l096k638k667l116l082k163
63782B44987j206j152j587j334k73L72k18j272j493p05J55L57nn64j120j429j179
63765B32334m84Pj24n24n80l12k62o15q59m80L45R22P85J08m98m80K69J370K254
63746B33176K545K284J868J750K109K693L039K919K546K267K218K315K466K612
63732B66807K660K527K223J775J273J052J572K774L781L772L040K691L232M031
63718C03210M238L735K894J902Q14r8n84q58j362k068k467k279j847j637j580
$$ y = [418859, 404272, 391866, 380706, 370368, 361003, 352555, 344493, 336533, 329156, 323006, 317974, 313332, 308667, 304304, 300691, 297838, 295575, 294008, 293294, 293083, 292654, 291707, 290713, 290289, 290404, 290342, 289382, 287424, 285032, 282903, 281242, 279600, 277413, 274613, 271559, 268442, 265150, 261749, 258653, 256015, 253348, 250232, 247150, 244987, 243781, 242629, 241042, 239708, 239435, 239807, 239589, 238317, 236824, 236119, 236274, 236631, 236626, 236062, 234942, 233513, 232334, 231850, 231857, 231733, 231209, 230629, 230317, 230055, 229440, 228581, 228101, 228446, 229368, 230153, 230261, 229763, 229283, 229552, 230922, 233176, 235721, 238005, 239873, 241623, 243732, 246425, 249464, 252383, 254929, 257196, 259414, 261729, 264195, 266807, 269467, 271994, 274217, 275992, 277265, 278317, 279889, 282663, 286444, 290216, 293256, 295947, 299179, 303210, 307448, 311183, 314077, 315979, 316793, 316695, 316111, 315253, 313891, 311823, 309356, 307077, 305230, 303593, 302013]
63703C02013j165k01Q01J126O70M5j83k9K50P01J513K458L028L092K983K955K919
63686C22976K756K470J995J321P67O28N62J4p20o49M38J545J888J848J943J787
63670C41569R65J69L38J122J348P11l5m62q86j420j686j701k117l200m403n183
63654C25129n564n618n127m127l135k474j901j220o41k46K64R43J336J214J054
63639B99887J350K013K811L828M917N375M824L958L743M213M775N310O160P254
63625C60418Q105Q673R410J0413J1219J1663J2306J3697J5673J7656J9373K1079
63613E19685K3236K6081K9236L1813L3245L3981L4905L6037L6331L4848L1512
63602H70910K6535J9927J2072M316j881o148q977j0564j0687r687q666q411q885
$$ y = [302013, 300848, 300647, 301448, 302574, 303244, 303289, 303106, 303077, 303327, 304028, 305541, 307999, 311027, 314119, 317102, 320057, 322976, 325732, 328202, 330197, 331518, 332285, 332913, 333475, 333489, 332769, 332120, 332558, 334103, 335991, 337839, 339782, 341569, 342534, 342703, 343041, 344163, 345511, 346222, 346187, 345725, 344839, 343419, 341733, 340032, 337915, 334715, 330312, 325129, 319565, 313947, 308820, 304693, 301558, 299084, 297183, 295963, 295322, 295076, 295340, 296283, 297619, 298833, 299887, 301237, 303250, 306061, 309889, 314806, 320181, 325005, 328963, 332706, 336919, 341694, 347004, 353164, 360418, 368523, 377196, 386606, 397019, 408238, 419901, 432207, 445904, 461577, 479233, 498606, 519685, 542921, 569002, 598238, 630051, 663296, 697277, 732182, 768219, 804550, 839398, 870910, 897445, 917372, 929444, 933760, 931879, 925731, 916754, 906190, 895503, 885816, 877150, 868739, 859854]
63589H59854j0100j2748j7201k2412k6610k8951k9799k9597k8346k6261k4015
63578F03814k1951j9640j6728j3666j1157r204p259n019k643l21J864L738N058
63565E06886N792O070O048N997O381P456Q974J0522J1970J3332J4501J5594J7232
63552F36755J9903K3266K6623K9967L3809L8062M1811M4198M4874M3331L8670
63541A021269L0481J9694Q199k134r986j4761j6639j6322j4492j1759r086p729
63529I76735q451j1099j5097j9925k4969k9403l2704l4946l6315l6683l5922l4331
63517F56890l2298k9855k6968k4054k1684j9868j8024j5725j3179j0903r211q064
63505D27057p270o695o285n941n529n036m596m227l709l015k548k611k765k280
$$ y = [859854, 849754, 837006, 819805, 797393, 770783, 741832, 712033, 682436, 654090, 627829, 603814, 581863, 562223, 545495, 531829, 520672, 511468, 504209, 499190, 496547, 496226, 498090, 501828, 506886, 512678, 518748, 524796, 530793, 537174, 544630, 553604, 564126, 576096, 589428, 603929, 619523, 636755, 656658, 679924, 706547, 736514, 770323, 808385, 850196, 894394, 939268, 982599, 1021269, 1051750, 1071444, 1079643, 1077509, 1067523, 1052762, 1036123, 1019801, 1005309, 993550, 984464, 976735, 968284, 957185, 942088, 922163, 897194, 867791, 835087, 800141, 763826, 727143, 691221, 656890, 624592, 594737, 567769, 543715, 522031, 502163, 484139, 468414, 455235, 444332, 435121, 427057, 419787, 413092, 406807, 400866, 395337, 390301, 385705, 381478, 377769, 374754, 372206, 369595, 366830, 364550]
63491C64550j195l58l05o36p02m04k1K55L65L13M17J190K688M228N070N115M703
63474C85273M066L253K301J205j05j532k809l812m544m770m169l027k196k088
63460C67046k192j937j454j044n08M21J435K103K650L652N135O520P338P589P567
63445D04321P675Q256R201J0026J0640J1600J3204J4876J6064J7319J9681K3237
63433E66100K6948K9660L0581K9114K5260K0246J5904J3166J1741J1235J1882
63422G91837J3997J7422K1789K6763L1737L5864L8746M0669M1784M1389L8390
63411A140387L2384K4099J4902O048j728q030j2510j4917j5529j5201j4781j4706
63399A120418j5391j7486k1242k5922l0402l4193l7331l9548m0304l9641l8245
$$ y = [364550, 363355, 362997, 362692, 362056, 361354, 360950, 360929, 361184, 361549, 361862, 362279, 363469, 366157, 370385, 375455, 380570, 385273, 389339, 392592, 394893, 396098, 395993, 394461, 391652, 387840, 383296, 378526, 374357, 371330, 369134, 367046, 364854, 362917, 361463, 360419, 359911, 360332, 361767, 363870, 366520, 370172, 375307, 381827, 389165, 396754, 404321, 411996, 420252, 429453, 439479, 450119, 461719, 474923, 489799, 505863, 523182, 542863, 566100, 593048, 622708, 653289, 682403, 707663, 727909, 743813, 756979, 768720, 779955, 791837, 805834, 823256, 845045, 871808, 903545, 939409, 978155, 1018824, 1060608, 1101997, 1140387, 1172771, 1196870, 1211772, 1217820, 1216092, 1208062, 1195552, 1180635, 1165106, 1149905, 1135124, 1120418, 1105027, 1087541, 1066299, 1040377, 1009975, 975782, 938451, 898903, 858599, 818958, 780713]
63388G80713l6513l4174l0988k7319k3759k0605j7848j5337j2793j0031p195m522
63376E39629j927P36L160M887O174P896J0414J3055J5005J6144J6848J7409J8117
63363F67547J9479K1887K5156K8634L1734L4317L6655L9052M1291M2568M2107
63352A030427L9726L5532K9439K1526J2709M377k624q152j2094j4261j4994j5077
63340A106534j4943j4710j5048j7014k0711k4921k8627l2034l5517l8329l9215
63329H25465l7880l5070l1581k7842k4221k0892j7524j3702r628n910k905q83
63317E97427o61l198q219j3800j7793j9467j9562j8982j7835j5815j3101j0546
63305D38448q900q159p723o950n409l094p64L13l36j669k327k369k842l881m463
$$ y = [780713, 744200, 710026, 679038, 651719, 627960, 607355, 589507, 574170, 561377, 551346, 544151, 539629, 537702, 538438, 541598, 546485, 552659, 560555, 570969, 584024, 599029, 615173, 632021, 649430, 667547, 687026, 708913, 734069, 762703, 794437, 828754, 865409, 904461, 945752, 988320, 1030427, 1070153, 1105685, 1135124, 1156650, 1169359, 1173736, 1171112, 1162960, 1150866, 1136605, 1121611, 1106534, 1091591, 1076881, 1061833, 1044819, 1024108, 999187, 970560, 938526, 903009, 864680, 825465, 787585, 752515, 720934, 693092, 668871, 647979, 630455, 616753, 607125, 601215, 598310, 597427, 596766, 593568, 585349, 571549, 553756, 534289, 514727, 495745, 477910, 462095, 448994, 438448, 429548, 421389, 413666, 406716, 401307, 398213, 397449, 397762, 397426, 395757, 393430, 391061, 388219, 384338, 379875]
63290C79875m236m221n062n792n300m119l640m104m520m163l125j752m63Q5k97
63275C29166o96j19R82J279N23j75j05K11K00J25L61P27J105J829K869L387K830
63258C44499J858J539K041K773L333L717L950M109M461N016N363N342N475O123
63244C99599O746O745O637P478R261J0903J1761J2290J3126J4352J5951J8029
63232E32878K0231K1640K1855K1653K2048K3092K3971K3967K2974K1492K0427
63221G76228K0464K1275K1790K1620K1568K2241K2848K2310K0920J9808J8926
63210A009998J6882J2904P865K963j688o583j1740j6724k1247k5090k7799k8988
63198I10753k8790k7641k5873k3791k1735j9748j7476j4729j1834r114o501l948
$$ y = [379875, 375639, 371418, 366356, 360564, 355264, 351145, 347505, 343401, 338881, 334718, 331593, 329841, 329378, 329463, 329166, 328470, 328351, 329333, 330612, 331135, 330960, 330855, 331066, 331266, 331391, 331752, 332479, 333584, 335413, 338282, 341669, 344499, 346357, 347896, 349937, 352710, 356043, 359760, 363710, 367819, 372280, 377296, 382659, 388001, 393476, 399599, 406345, 413090, 419727, 427205, 436466, 447369, 459130, 471420, 484546, 498898, 514849, 532878, 553109, 574749, 596604, 618257, 640305, 663397, 687368, 711335, 734309, 755801, 776228, 796692, 817967, 839757, 861377, 882945, 905186, 928034, 950344, 971264, 991072, 1009998, 1026880, 1039784, 1047649, 1050612, 1048924, 1042341, 1030601, 1013877, 992630, 967540, 939741, 910753, 881963, 854322, 828449, 804658, 782923, 763175, 745699, 730970, 719136, 710022, 703521, 699573]
63186F99573j719K08K473N422Q291J0051J0737J1258J2135J3211J4338J5464J6128
63173H17570J5806J4834J4171J4071J3830J2948J1728J0422Q660O213L569J086
63161I44908j796n765j0434j4694j8054k0866k3333k5023k5586k5364k4958k4491
63149G24544k3625k2161k0285j8272j6255j4379j2867j1740j0637r242p775o626
63137E50680n623m206k471j325j267j578j263l18O22J414K442L751N013O202P493
63122E59566Q523Q557P554O319N431M730L949L202K568J902J298J148J448J638
63108F17833J400J077J056J266J503J682J522N99r43k306k965l165l228k961k153
63093F10217j093j88M55Q15Q26P02Q07R89P54L00N15J555K388K350K140K571L296
$$ y = [699573, 697854, 698062, 700535, 705957, 714248, 724299, 735036, 746294, 758429, 771640, 785978, 801442, 817570, 833376, 848210, 862381, 876452, 890282, 903230, 914958, 925380, 934040, 940253, 943822, 944908, 943112, 937347, 926913, 912219, 894165, 873299, 849966, 824943, 799357, 773993, 749035, 724544, 700919, 678758, 658473, 640201, 623946, 609567, 596700, 584960, 574323, 565081, 557306, 550680, 545057, 540851, 538380, 537055, 535788, 534210, 532947, 532629, 533251, 534665, 537107, 540858, 545871, 552073, 559566, 568089, 576646, 584200, 590519, 595950, 600680, 604629, 607831, 610399, 612301, 613599, 614747, 616195, 617833, 619233, 620310, 621366, 622632, 624135, 625817, 627339, 627938, 626995, 624689, 621724, 618559, 615331, 612370, 610217, 609124, 608936, 609391, 610206, 611032, 611734, 612541, 613530, 614284, 614584, 615099, 616654, 619042, 621392, 623532, 626103, 629399]
63076F29399L706M174N288O553P102P187P656Q353Q363P749P682Q771J0364J1749
63062G34096J3023J4532J6370J8678K1628K4868K7687K9997L2446L5362L8327
63051A007014M0998M3632M6424M8996N0971N2508N3898N4988N5442N5197N4446
63040A564514N3379N2115N0741M9340M8237M7999M8738M9474M8866M6550M3197
63029B103150L9235L4191K7471J9056R226j777j3417k4853l5646m5966n5635o3535
63017A991500o8574p0848p1310p0545o8430o4819n9935n4108m7537m0458l3228
63006A341708k6154j9347j2868o811j275L750Q316J2377J5735J8254K0094K1569
62994A375348K2714K3286K3307K3290K3591K3863K3619K3033K2580K2019K0501
$$ y = [629399, 633105, 637279, 642567, 649120, 656222, 663409, 671065, 679418, 687781, 695530, 703212, 711983, 722347, 734096, 747119, 761651, 778021, 796699, 818327, 843195, 870882, 900879, 933325, 968687, 1007014, 1048012, 1091644, 1138068, 1187064, 1238035, 1290543, 1344441, 1399429, 1454871, 1510068, 1564514, 1617893, 1670008, 1720749, 1770089, 1818326, 1866325, 1915063, 1964537, 2013403, 2059953, 2103150, 2142385, 2176576, 2204047, 2223103, 2232329, 2230552, 2217135, 2192282, 2156636, 2110670, 2055035, 1991500, 1922926, 1852078, 1780768, 1710223, 1641793, 1576974, 1517039, 1462931, 1415394, 1374936, 1341708, 1315554, 1296207, 1283339, 1276528, 1275253, 1279003, 1287319, 1299696, 1315431, 1333685, 1353779, 1375348, 1398062, 1421348, 1444655, 1467945, 1491536, 1515399, 1539018, 1562051, 1584631, 1606650, 1627151]
62983A627151J7676J4058J0030N229p07p333j3833j9915k5833l1700l7200m1892
62971A495731m5470m7813m8968m9094m8291m6570m4035m1010l7909l5057l2690
62960A018824l0869k9359k7768k5909k3935k2196k1002k0410k0049j9347j8125
62949G59855j6827j5930j5418j5116j5114j5283j4826j3170j1133j0170j0369
62938F06499j0248q802o752n307m657m343m296m540m494l539j995o63L23J321
62924E48507K062J720K11j435k308k580k885l334l545l257k552j725j211j391
62910E26277k139k811k955k852l031l434l519l103k545k045j278j02Q13P00j71
62895D97805o99m00M2j06n47n83k87l46q93j285j128q61j029j512j766j498q03
$$ y = [1627151, 1644827, 1658885, 1668915, 1674144, 1673437, 1666104, 1652271, 1632356, 1606523, 1574823, 1537623, 1495731, 1450261, 1402448, 1353480, 1304386, 1256095, 1209525, 1165490, 1124480, 1086571, 1051514, 1018824, 987955, 958596, 930828, 904919, 880984, 858788, 837786, 817376, 797327, 777980, 759855, 743028, 727098, 711680, 696564, 681450, 666167, 651341, 638171, 627038, 616868, 606499, 596251, 587449, 580697, 575390, 570733, 566390, 562094, 557554, 553060, 549521, 547526, 546863, 547186, 548507, 550569, 552289, 552500, 551065, 548757, 546177, 543292, 539958, 536413, 533156, 530604, 528879, 527668, 526277, 524138, 521327, 518372, 515520, 512489, 509055, 505536, 502433, 499888, 497843, 496565, 496463, 497276, 497976, 497805, 497106, 496706, 496748, 496642, 496095, 495512, 495225, 494879, 493986, 492701, 491573, 490712, 489683, 488171, 486405, 484907, 484104]
62878D84104J23J060J711J826J393O20j97p37q14n30j93m7j65m96p86o30N1O64
62860D86957M97l09q06l78O10J432J837K064K387K912L515L769L228J995P66O8
62844E10544k17l74l29L6M05K78l73j083j447j425j256j254j532j760j393l76
62828D98444O15R16O16L47M83R76J700K550L261L551L502L462L526L431K987K407
62812E32774K074K154K516K901L130L236L426L859M403M734M694M598N020O271
62798E85790P974R279R594R065Q393Q330R363J1575J4478J7286J9725K2417K6020
62785G59289L0235L4219L7946M2340M7953N4162O0039O5390P0491P5316P9543
62774A356923Q2982Q5515Q6814Q6504Q4394Q0216P3474O3956N2175L8970K4797
$$ y = [484104, 484227, 485287, 486998, 488824, 490217, 490837, 490640, 489903, 489089, 488559, 488366, 488319, 488154, 487658, 486872, 486242, 486293, 486957, 487454, 487145, 486339, 485961, 486571, 488003, 489840, 491904, 494291, 497203, 500718, 504487, 507715, 509710, 510476, 510544, 510327, 509953, 509624, 509660, 510065, 510343, 509970, 508887, 507440, 506015, 504759, 503505, 501973, 500213, 498820, 498444, 499059, 499975, 500591, 500938, 501421, 502397, 504097, 506647, 509908, 513459, 516961, 520423, 523949, 527380, 530367, 532774, 534848, 537002, 539518, 542419, 545549, 548785, 552211, 556070, 560473, 565207, 569901, 574499, 579519, 585790, 593764, 603043, 612637, 621702, 630095, 638425, 647788, 659363, 673841, 691127, 710852, 733269, 759289, 789524, 823743, 861689, 904029, 951982, 1006144, 1066183, 1131573, 1202064, 1277380, 1356923, 1439905, 1525420, 1612234, 1698738, 1783132, 1863348, 1936822, 2000778, 2052953, 2091923, 2116720]
62763B116720R853n360k0020l3479m5524n6209o5637p3678p9732q3057q3663q2559
62751A497655q0825p8713p5953p2478o8385o3619n8324n3197m8901m5233m1446
62740H10581l7300l3176k9342k5716k2356j9540j7348j5590j4134j2834j1253
62729E71992r145p098n922n401m445k726j288j067j568j602p96K92J232K120L118
62714E37696M169N294O765Q775J1141J3362J4980J6019J7138J9149K2230K5787
62702G02505K9185L2344L5432L8316M0726M2789M5011M7752N0991N4428N7493
62691A176972N9326N9288N7550N4811N1246M6134L8716K9205J8589P685l275j4202
62679A582045k4726l4360m2812m9945n5595n9519o1512o1579o0152n8058n5928
$$ y = [2116720, 2126573, 2121213, 2101193, 2067714, 2022190, 1965981, 1900344, 1826666, 1746934, 1663877, 1580214, 1497655, 1416830, 1338117, 1262164, 1189686, 1121301, 1057682, 999358, 946161, 897260, 852027, 810581, 773281, 740105, 710763, 685047, 662691, 643151, 625803, 610213, 596079, 583245, 571992, 562847, 555749, 549827, 544426, 539981, 537255, 535967, 534900, 533332, 531730, 530934, 531226, 532458, 534578, 537696, 541865, 547159, 553924, 562699, 573840, 587202, 602182, 618201, 635339, 654488, 676718, 702505, 731690, 764034, 799466, 837782, 878508, 921297, 966308, 1014060, 1065051, 1119479, 1176972, 1236298, 1295586, 1353136, 1407947, 1459193, 1505327, 1544043, 1573248, 1591837, 1599522, 1596247, 1582045, 1557319, 1522959, 1480147, 1430202, 1374607, 1315088, 1253576, 1191997, 1131845, 1073787, 1017859]
62668A017859n3568n0304m6146m2123l9049l6407l3095k9010k5174k2267j9950
62657F20766j7786j5954j4560j3036j0960q970q030q073q139p749p284o983o463
62644D86779n466m439l886l647l228k552j885j267m56O14J609K119J895R22n68
62629D66544k071l044l248k826k081j241m55J11L49L63N22J181K335L582M491
62614D64512M978N197N235N089M938N128N748O464O937P276P885Q919J0179J1572
62600E60057J3323J5584J8068K0366K2553K5128K8326L1798L5014L7739L9944
62589H47900M1608M2746M3372M3082M0987L6485L0038K2773J5392P863J20p468
62577A164898j4472k0696k6024l0297l3639l6441l8772m0079l9860l8370l6355
$$ y = [1017859, 964291, 913987, 867841, 825718, 786669, 750262, 717167, 688157, 662983, 640716, 620766, 602980, 587026, 572466, 559430, 548470, 539500, 531470, 523397, 515258, 507509, 500225, 493242, 486779, 481313, 476874, 472988, 469341, 466113, 463561, 461676, 460409, 459953, 460567, 462176, 464295, 466190, 467112, 466544, 464473, 461429, 458181, 455355, 453274, 452033, 451578, 451689, 452038, 452401, 452923, 454104, 456439, 460021, 464512, 469490, 474687, 479922, 485011, 489949, 495077, 500825, 507289, 514226, 521502, 529387, 538306, 548485, 560057, 573380, 588964, 607032, 627398, 649951, 675079, 703405, 735203, 770217, 807956, 847900, 889508, 932254, 975626, 1018708, 1059695, 1096180, 1126218, 1148991, 1164383, 1172246, 1172366, 1164898, 1150426, 1129730, 1103706, 1073409, 1039770, 1003329, 964557, 924478, 884618, 846248, 809893]
62566H09893l4291l2215l0102k8054k6058k3893k1351j8533j5809j3564j1858
62555E54165j0399q925p543o508n832n366n148n171m895l678j791m35l29q92j146
62540D86107r11n33l7O82J164P75k09p25l21K13k8p92r86rJ632L155M491O206
62522D99874Q469J0616J1994J2935J4362J6616J9213K1787K4580K7740L0805L3255
62510G32246L5110L6647L7995L9340M0894M2207M2069L9707L5718L1232K6651
62499A139816K1821J6912J2376Q371N102L332L739N983R209J3267J8494K4506
62487A282928L0237L5271M0108M5110N0040N4808N9547O3471O4469O0429N0844
62476A837262L7195K2337R244q95r852k0809l5050n0640o4502p4980q2043q6097
$$ y = [809893, 775602, 743387, 713285, 685231, 659173, 635280, 613929, 595396, 579587, 566023, 554165, 543766, 534841, 527298, 520790, 514958, 509592, 504444, 499273, 494378, 490700, 488909, 488474, 488145, 487253, 486107, 485196, 484663, 484626, 485308, 486472, 487247, 487038, 486313, 485992, 486205, 486177, 485385, 484399, 484390, 486022, 489177, 493668, 499874, 508343, 518959, 530953, 543888, 558250, 574866, 594079, 615866, 640446, 668186, 698991, 732246, 767356, 804003, 841998, 881338, 922232, 964439, 1006508, 1046215, 1081933, 1113165, 1139816, 1161637, 1178549, 1190925, 1199296, 1204398, 1207730, 1211469, 1217452, 1226661, 1239928, 1258422, 1282928, 1313165, 1348436, 1388544, 1433654, 1483694, 1538502, 1598049, 1661520, 1725989, 1786418, 1837262, 1874457, 1896794, 1906038, 1905143, 1895291, 1874482, 1839432, 1788792, 1724290, 1649310, 1567267, 1481170]
62464A481170q7523q6868q4615q0878p5760o9712o3160n6179m8918m1975l5880
62453G49702l0618k5969k1996j8718j5685j2369q765n305k406l53P95J519K649
62440F12481M468O372P718Q504Q900Q692P773O686N983N352M045J929n27l005
62426F85371n475p741r506j0808j1821j2379j2224j1603j1026j0521r741q737
62414E63789q029p839p780p404o666n817n230n217n621n654m670l049j795j284
62400D87734j031o41l22k70j93K23Q35J364J779K122K277K196K042J915J736J630
62384E03396K008K995M094M767N102N587O427P380Q138Q558Q651Q572Q587Q850
62370E93112R309R904J0722J1864J3325J5163J7530K0380K3439K6630L0313L4787
$$ y = [1481170, 1393647, 1306779, 1222164, 1141286, 1065526, 995814, 932654, 876475, 827557, 785582, 749702, 719084, 693115, 671119, 652401, 636716, 624347, 615582, 610277, 607871, 607518, 608313, 609832, 612481, 616949, 623321, 631039, 639543, 648443, 657135, 664908, 671594, 677577, 682929, 686974, 688903, 688376, 685371, 679896, 672155, 662649, 651841, 640020, 627641, 615417, 603814, 592788, 582267, 572526, 563789, 555760, 547921, 540141, 532737, 526071, 520254, 515024, 509807, 504186, 498532, 493862, 490813, 489018, 487734, 486703, 486062, 485740, 485470, 485277, 485500, 486335, 487699, 489478, 491600, 493877, 496073, 498115, 500030, 501766, 503396, 505404, 508399, 512493, 517260, 522362, 527949, 534376, 541756, 549894, 558452, 567103, 575675, 584262, 593112, 602421, 612325, 623047, 634911, 648236, 663399, 680929, 701309, 724748, 751378, 781691, 816478]
62358H16478L9786M4792M9669N4571N9314O3219O5584O6026O4354O0414N4173
62347A438380M5749L5477K4226J3427M258l377j0645j8303k5821l2149l6996m0985
62335A393241m4698m7958m9958m9910m7664m3905l9646l5482l1452k7546k3953
62324I51069k0690j7505j4551j2664j2427j3243j3976j4271j4575j5035j5215
62313G86917j4927j4533j4204j3582j2495j1370j0593j0045r639r654j0106j0324
62301F45445r822r085q883r081q835p749o287n147m671m694m554l464j363P94
62287E62604K060K452K472K177J478J020J706L369M798N215M976M723M714N125
62273F08889O161P452Q103P865P628Q274R624J0989J2298J4048J6539J9704K3466
$$ y = [816478, 856264, 901056, 950725, 1005296, 1064610, 1127829, 1193413, 1259439, 1323793, 1384207, 1438380, 1484129, 1519606, 1543832, 1557259, 1561517, 1558140, 1547495, 1529192, 1503371, 1471222, 1434226, 1393241, 1348543, 1300585, 1250627, 1200717, 1153053, 1109148, 1069502, 1034020, 1002568, 975022, 951069, 930379, 912874, 898323, 885659, 873232, 859989, 846013, 831742, 817167, 802132, 786917, 771990, 757457, 743253, 729671, 717176, 705806, 695213, 685168, 675529, 665875, 655769, 645445, 635623, 626538, 617655, 608574, 599739, 591990, 585703, 580556, 575885, 571191, 566637, 563173, 561810, 562604, 564664, 567116, 569588, 571765, 573243, 574263, 575969, 579338, 584136, 589351, 594327, 599050, 603764, 608889, 615050, 622502, 630605, 638470, 646098, 654372, 663996, 674985, 687283, 701331, 717870, 737574, 761040]
62260G61040K7714L2070L6279M0693M5928N1973N8054O3356O7522P0294P1030
62249A325953O8936O3778N6205M7207L7374K6863J6084N944k917j0915j9045k7674
62237A587793l6243m4111n1156n7364o2257o5019o5093o2616n8497n3956m9665
62226I81816m5266m0180l4766l0182k6991k4491k1728j8674j6049j4284j3070
62215F96135j1816j0333q989q228p847p070n528l869k856k160q89Q59J943J886
62201F31238J665K377L926N554O904P917Q331Q002P409P153P239P353P476P741
62187G20285Q024Q269Q835R926J0973J1250J0861J0503J0469J0507J0445J0295
62175H40642R770Q494O776N661O008P912J1038J5071J9708K4578K9441L4219L8792
$$ y = [761040, 788754, 820824, 857103, 897796, 943724, 995697, 1053751, 1117107, 1184629, 1254923, 1325953, 1394889, 1458667, 1514872, 1562079, 1599453, 1626316, 1642400, 1648344, 1645427, 1634512, 1615467, 1587793, 1551550, 1507439, 1456283, 1398919, 1336662, 1271643, 1206550, 1143934, 1085437, 1031481, 981816, 936550, 896370, 861604, 831422, 804431, 779940, 758212, 739538, 723489, 709205, 696135, 684319, 673986, 664997, 656769, 648922, 641852, 636324, 632455, 629599, 627439, 626550, 627409, 629352, 631238, 632903, 635280, 639206, 644760, 651664, 659581, 667912, 675914, 683323, 690476, 697715, 705068, 712544, 720285, 728309, 736578, 745413, 755339, 766312, 777562, 788423, 798926, 809395, 819902, 830347, 840642, 850412, 858906, 865682, 871343, 877351, 885263, 896301, 911372, 931080, 955658, 985099, 1019318, 1058110]
62162A058110M2916M6293M8536M9042M7168M2658L5874K7692J9180J1150L786
62151A432405l157r718j5586k0647k5356l0133l4675l8246m0472m1540m1592m0396
62139A090887l7703l3844k9689k5921k2376j8408j4103j0689r235r191r023q181
62127H62524p552p832q458q566q124p453o383m648k584p35Q56K362L649M543N152
62112H16751N326M324J810j305l722n033n464m952l459j935j787l423n960q337
62098G82834r989j0687j0545j0113r708q807o870m497k890k266j773r34k20RJ79
62083G03723R09K335M242O287Q015R207J0233J1543J3016J4361J5902J8004K0085
62070H37862K1230K1706K2670K4307K5596K6139K7032K9310L2547L5571L7634
$$ y = [1058110, 1101026, 1147319, 1195855, 1244897, 1292065, 1334723, 1370597, 1398289, 1417469, 1428619, 1432405, 1429248, 1419530, 1403944, 1383297, 1357941, 1327808, 1293133, 1254887, 1214415, 1172875, 1131283, 1090887, 1053184, 1019340, 989651, 963730, 941354, 922946, 908843, 898154, 888919, 879728, 870705, 862524, 854972, 847140, 838682, 830116, 821992, 814539, 808156, 803508, 800924, 800189, 801045, 803407, 807056, 811599, 816751, 822077, 826401, 828211, 826906, 823184, 818151, 812687, 807735, 804276, 802341, 800554, 797131, 791171, 782834, 772845, 762158, 751613, 741500, 731792, 722985, 716115, 711618, 708728, 706462, 704689, 703755, 703535, 703544, 703723, 704632, 706967, 711209, 717496, 725511, 734718, 744951, 756494, 769510, 783871, 799773, 817777, 837862, 859092, 880798, 903468, 927775, 953371, 979510, 1006542, 1035852, 1068399, 1103970, 1141604]
62059A141604L8356L7398L4822L1065K6085J9329J1080K992l506q643j3481j8418
62047A298683k3273k8171l3318l8266m2246m5044m6852m7623m7183m5695m3402
62036H57610m0236l6358l2642k9845k7545k4762k1426j8422j6216j4387j2600
62025E83171j1202j0535j0260r781q935p940o960o010n154m563m393m624n010
62012D87804n192n034m714m353l659k296n42O97P65k9o26j73J216K598L099K737
61996D72298K263K257K586K788K753K747K862K707J757p8k254m040n128n812o508
61981D71198p282p889q130p960p375o424n247l976k666j497p89n74m36j53j14
61966D10686o67j321j299o94l29n10p63p99q79r76n52M04R15K67q23j085k29R22
$$ y = [1141604, 1179960, 1217358, 1252180, 1283245, 1309330, 1328659, 1339739, 1342731, 1339225, 1330582, 1317101, 1298683, 1275410, 1247239, 1213921, 1175655, 1133409, 1088365, 1041513, 993890, 946707, 901012, 857610, 817374, 781016, 748374, 718529, 690984, 666222, 644796, 626374, 610158, 595771, 583171, 571969, 561434, 551174, 541393, 532458, 524518, 517558, 511548, 506394, 501831, 497438, 492814, 487804, 482612, 477578, 472864, 468511, 464852, 462556, 462014, 462711, 463476, 463447, 462821, 462648, 463864, 466462, 469561, 472298, 474561, 476818, 479404, 482192, 484945, 487692, 490554, 493261, 495018, 494940, 492686, 488646, 483518, 477706, 471198, 463916, 456027, 447897, 439937, 432562, 426138, 420891, 416915, 414249, 412752, 411963, 411389, 410953, 410800, 410686, 410019, 408698, 407399, 406705, 406376, 405866, 405103, 404304, 403425, 402449, 401897, 402301, 403216, 403483, 402660, 401575, 401346, 402268]
61948D02268J581J644J445J454K116L489N076O349P284Q077Q631Q758Q740R082
61934D75994R790J0261J0043R356Q813Q742Q858Q489P196N252L363J876N09j029
61920E67513k512l535m098m513m821m675l809k372p66P50K242L897N657P218Q459
61905E64635R635J0814J1421J0808R180P326N568L614J488k83j635l216n162o480
61891F17713o375n571n389n953o216n597m650m004l547k962k511k802l994n610
61877E52532p068q127q850r243r171q625p891p213o453n355m022k749j494k7J390
61862D67634K134K216K471L530N113O634P998R382J0736J1964J3163J4309J5136
61849E72420J5615J6150J6900J7435J7449J7211J6867J5958J4228J2270J0541
$$ y = [402268, 403849, 405493, 406938, 408392, 410508, 413997, 419073, 425422, 432706, 440783, 449414, 458172, 466912, 475994, 485784, 496045, 506088, 515444, 524257, 532999, 541857, 550346, 557542, 562794, 566157, 568033, 568542, 567513, 565001, 561466, 557368, 552855, 548034, 543359, 539550, 537178, 536412, 537162, 539404, 543301, 548958, 556176, 564635, 574270, 585084, 596505, 607313, 616493, 623819, 629387, 633001, 634489, 634206, 632571, 629355, 624193, 617713, 611338, 605767, 600378, 594425, 588209, 582612, 577962, 573958, 570411, 567449, 564938, 562136, 558142, 552532, 545464, 537337, 528487, 519244, 510073, 501448, 493557, 486344, 479891, 474536, 470514, 467765, 466271, 466244, 467634, 469768, 471984, 474455, 477985, 483098, 489732, 497730, 507112, 517848, 529812, 542975, 557284, 572420, 588035, 604185, 621085, 638520, 655969, 673180, 690047, 706005, 720233, 732503, 743044]
61838G43044Q346M825N34k996n085o284p107p376o922n929m404k098Q00L581N827
61823G18756P648R002R476R043Q239P228N346K081j919n341p508q809j0025j1457
61809G31760j2666j2933j2099j0864j0086r832r574r141q919r071r136q660p816
61796F00963p100o726o561o378o050n617n255m947m353l337k480k485l122l418
61782E33134k967k355k065j760j136p09j040j690j771j196o33l63o3L39M19J23
61766E16267J21Q85J995K765L196L694M295M702M981N498O102O034M891L200J730
61751E70356N95n08j593k400l008l755m573m931m670m371m654n381n887n765n118
61736E14337m236l319k384j336j21J006J572J405Q68M67L70M93P89J233J622J758
$$ y = [743044, 751390, 756215, 756749, 753753, 748668, 742384, 735277, 727901, 720979, 715050, 710646, 708548, 709348, 712929, 718756, 726404, 735406, 744882, 753925, 762164, 769392, 774738, 776819, 774900, 769559, 762051, 753242, 743217, 731760, 719094, 706161, 694062, 683198, 673112, 663280, 653706, 644565, 635646, 626575, 617439, 608779, 600963, 593863, 587137, 580576, 574198, 568148, 562531, 557276, 552329, 547976, 544639, 542159, 539674, 536552, 533134, 530167, 527812, 525747, 523987, 522851, 522142, 521102, 519412, 517641, 516445, 515812, 515449, 515386, 515725, 516144, 516267, 516388, 517273, 519268, 522033, 525229, 528923, 533218, 537920, 542901, 548399, 554501, 560535, 565426, 568626, 570356, 570951, 570443, 568850, 566450, 563442, 559687, 555114, 550183, 545513, 541142, 536488, 531107, 525220, 519455, 514337, 510101, 506782, 504398, 503062, 502941, 503947, 505519, 506924, 507792, 508259, 508629, 509122, 509911, 511144, 512766, 514524]
61720E14524J723J759J910J990J888J702J537J295Q01Q8n39p72o76o79j064j645
61704E23842k126k628l503m696n616n733n078m130l503l577m140m404l835k874
61690D67999k378k456k498k333k513l239l813l630l040k714k686k564k270j998
61676D29867j803j623j464j248q16l91m66j017j378j235j045j021n15Q53K255
61661D18953K674K369K326K756L101L203L445L796L742L121K345J735J265Q73
61647D55704M76j38q83j194q37m86p08r16k38R95J728J767J719J636J071L58L73
61630D60427R34Q51j84j127j385j727k755l819m175m159m322m415m050l556l263
61615D23275k684j448l96o50j948k959l056k878l157l745l983l583k937k740l239
$$ y = [514524, 516247, 518006, 519916, 521906, 523794, 525496, 527033, 528328, 529129, 529217, 528678, 527906, 527230, 526551, 525487, 523842, 521716, 519088, 515585, 510889, 505273, 499540, 494462, 490332, 486829, 483252, 479112, 474708, 470873, 467999, 465621, 463165, 460667, 458334, 455821, 452582, 448769, 445139, 442099, 439385, 436699, 434135, 431865, 429867, 428064, 426441, 424977, 423729, 422913, 422522, 422056, 421039, 419661, 418426, 417381, 416360, 415845, 416698, 418953, 421627, 423996, 426322, 429078, 432179, 435382, 438827, 442623, 446365, 449486, 451831, 453566, 454831, 455704, 456180, 456042, 455159, 453965, 453128, 452642, 451934, 451018, 450780, 451775, 453503, 455270, 456989, 458625, 459696, 460054, 460427, 461361, 462212, 462028, 460901, 459516, 457789, 455034, 451215, 447040, 442881, 438559, 434144, 430094, 426538, 423275, 420591, 419143, 418747, 418097, 416149, 413190, 410134, 407256, 404099, 400354, 396371, 392788, 389851, 387111, 383872]
61600C83872l757l364k101j120j270k032k371k147k062k488l005l068k667k196
61586C50224j917j701j271p07n42j116j932k143j617j031q69r47r79r40o88L4
61570C31858R44J314J013P08O84L73l69n00O95K126K112O91m86l32N85J214J254
61553C43884J039R81J345K032K416J943R47L41L95M59J0o49r79r29o81j60P20
61536C53114J628K078K069K055K278K438K047J019k49j232j676j626j279q49n63
61521C61252n48p23r12j104j400j762j962j846j389n61N45J404J317L00o75o42
61505C51294L16J288J552J060K08m57m34M11J604K545L117L578L903L719K928
61490C76632J973J326R85P99Q54J242J598J365O05R2M40J352K045K175J976J689
$$ y = [383872, 380115, 376751, 374650, 373530, 372260, 370228, 367857, 365710, 363648, 361160, 358155, 355087, 352420, 350224, 348307, 346606, 345335, 344628, 344086, 342970, 341038, 338895, 337278, 336247, 335378, 334431, 333452, 332512, 331824, 331858, 332802, 334116, 335129, 335837, 336521, 336894, 336525, 336025, 336720, 338846, 340958, 341649, 341163, 340831, 341416, 342630, 343884, 344923, 345904, 347249, 349281, 351697, 353640, 354587, 354928, 355323, 355782, 355792, 355143, 354164, 353235, 352554, 352394, 353114, 354742, 356820, 358889, 360944, 363222, 365660, 367707, 368726, 368477, 367245, 365569, 363943, 362664, 361815, 361252, 360704, 359981, 359069, 357965, 356565, 354803, 352841, 350995, 349606, 349045, 349590, 350994, 352311, 352611, 351936, 351294, 351610, 352898, 354450, 355510, 355718, 355261, 354827, 355238, 356842, 359387, 362504, 366082, 369985, 373704, 376632, 378605, 379931, 380916, 381715, 382569, 383811, 385409, 386774, 387379, 387471, 387911, 389263, 391308, 393483, 395459, 397148]
61474C97148J320R40P06M09m45j758k632k444j749j512j826k038j879j720j765
61459C80755j806j826k089k470k371j606o67Q2Q77J795K264J845J073Q32J206
61444C77894J502J297Q98P67R54J217J486J963K794L644L830L035J790R64Q10
61429D04845Q87Q69R25J242J663J947K017J825J381J062J363K114K453J821O30
61414D27044l25o47l51L13P56L21q47j712j583r60o90q09q47q19j069j350r34
61397D15491L07J595K241K349K395K514K471K155J778J695K073K697L094K907
61383D45762K118R71j24o27j64J012J997J968R09m43j247j171n28K1O3k64n77
61366D49676p05o53m12j52l99j356k254k040q07K31L83K64P01J563K236K600L003
$$ y = [397148, 398468, 399408, 400114, 400523, 400078, 398320, 395688, 393244, 391495, 389983, 388157, 386119, 384240, 382520, 380755, 378949, 377123, 375034, 372564, 370193, 368587, 367920, 368002, 368879, 370674, 372938, 374783, 375856, 376688, 377894, 379396, 380693, 381591, 382358, 383312, 384529, 386015, 387978, 390772, 394416, 398246, 401281, 403071, 404035, 404845, 405732, 406601, 407526, 408768, 410431, 412378, 414395, 416220, 417601, 418663, 420026, 422140, 424593, 426414, 427044, 426719, 426072, 425721, 426034, 426790, 427111, 426264, 424552, 422969, 422009, 421319, 420510, 419663, 418844, 417775, 416425, 415491, 415798, 417393, 419634, 421983, 424378, 426892, 429363, 431518, 433296, 434991, 437064, 439761, 442855, 445762, 447880, 448851, 448727, 448100, 447936, 448948, 450945, 452913, 453822, 453379, 452132, 450961, 450433, 450454, 450517, 450253, 449676, 448971, 448318, 447906, 447754, 447355, 445999, 443745, 441705, 440898, 441129, 441512, 441776, 442477, 444040, 446276, 448876, 451879]
61349D51879L632M474N465O348O615O028M852L473K129J221J211J929K577K772
61335E04605K890L026K471R31n36p49l7K68l26j070j216p99j56N84J408K292L200
61318E16786L994M483M837N506O475P062O950O826P378Q238Q732R154J0269J1874
61304F18564J2910J2945J2573J2254J1674J0443Q667O557M116J461j039l137m883
61291G03105o280p218p811q392r099r733j0115j0260j0280j0285j0258r811q456
61278E85107o424m776m188m025l300k169j600j780j804j044L2P02Q62Q08P11P24
61262E57836J209K433M114N537O114N913N611N753O012N529M111K571J557P02
61248F15002m99j509j403l69K49m84k207l841m506l916k435q22M38J413K139K195
$$ y = [451879, 455511, 459985, 465450, 471798, 478413, 484441, 489293, 492766, 494895, 496116, 497327, 499256, 501833, 504605, 507495, 510521, 512992, 513923, 513387, 512638, 512601, 512869, 512543, 511473, 510257, 509458, 509302, 509886, 511294, 513586, 516786, 520780, 525263, 530100, 535606, 542081, 549143, 556093, 562919, 570297, 578535, 587267, 596421, 606690, 618564, 631474, 644419, 656992, 669246, 680920, 691363, 700030, 706587, 710703, 712164, 711125, 707988, 703105, 696825, 689607, 681796, 673404, 664305, 654572, 644457, 634197, 623917, 613632, 603374, 593563, 585107, 578683, 573907, 569719, 565694, 562394, 560225, 558625, 556845, 555041, 553997, 554029, 554731, 555593, 556401, 557112, 557836, 559045, 561478, 565592, 571129, 577243, 583156, 588767, 594520, 600532, 606061, 610172, 612743, 614300, 615002, 614503, 612994, 611591, 611222, 611471, 610987, 608780, 604939, 600433, 596517, 594082, 593260, 593698, 595111, 597250, 599445]
61232E99445J471P76R52J729K329K835M018N976P926R328J0229J0613J0347R855
61218F77829R843J0237J0264R717R245R228R235Q816P943O548M521K480J617K275
61204G79798L434M022M070M195M607N114N631O258P211Q840J1213J3599J4912
61191H72904J4840J3935J2562J0516P825N067K589J75k140l685m112m024m185
61178I22267m624n024n456o278p552q978j0094j0437j0018r675j0337j1834j3063
61165H08897j3513j3694j3912j3630j2580j1548j1277j1361j0946r975q854p520
61153F70087n718l840k551j741n93J321L504N074N406M425K672Q73p58k499m119
61138F71543m531l069o55J084J710K196L364M843N845O346P098Q678J0801J2703
$$ y = [599445, 600916, 601692, 602644, 604373, 606702, 609537, 613555, 619531, 627457, 636785, 647014, 657627, 667974, 677829, 687672, 697909, 708173, 717890, 727135, 736363, 745598, 754414, 762357, 768905, 773426, 775906, 777523, 779798, 783232, 787254, 791324, 795519, 800126, 805240, 810871, 817129, 824340, 833180, 844393, 857992, 872904, 887744, 901679, 914241, 924757, 932582, 937649, 940238, 940413, 938273, 934588, 930476, 926452, 922267, 917643, 912619, 907163, 900885, 893333, 884355, 874261, 863824, 853806, 844131, 833794, 821960, 808897, 795384, 781690, 767778, 754148, 741568, 730020, 718743, 707382, 696436, 686461, 677607, 670087, 664369, 660529, 657978, 656237, 655644, 656965, 660469, 665543, 670949, 675374, 678046, 678919, 678161, 675662, 671543, 667012, 663943, 663288, 664372, 666082, 668278, 671642, 676485, 682330, 688676, 695774, 704452, 715253, 727956]
61124G27956J4027J5233J6977J9274K1544K3448K5206K7087K8992L0716L2163
61113I82623L3133L3378L3139L3126L3555L3676L2709L0897K9103K7628K6036
61102A329003K4003K1744J9534J7275J4732J1900Q980O160L595J475j11j433k972
61089A453885m762o004n832m485l242k870k744j987r21n11p99r54q05j228k730
61074A414011m616o008o947p947r041r865j0315j0646j1156j2115j3660j5473
61062A296222j6791j7061j6431j5484j4716j4289j3991j3341j2044j0333q560
61051A143181o675m579k778j879j478l85J840M313O087P231Q359R726J1220J2763
61037A186946J4294J5628J6679J7557J8430J9532K1131K3147K5004K6438K8115
$$ y = [727956, 741983, 757216, 774193, 793467, 815011, 838459, 863665, 890752, 919744, 950460, 982623, 1015756, 1049134, 1082273, 1115399, 1148954, 1182630, 1215339, 1246236, 1275339, 1302967, 1329003, 1353006, 1374750, 1394284, 1411559, 1426291, 1438191, 1447171, 1453331, 1456926, 1458401, 1458290, 1456857, 1453885, 1449123, 1443119, 1437287, 1432802, 1429560, 1426690, 1423946, 1421959, 1421038, 1420527, 1419728, 1418774, 1417969, 1416741, 1414011, 1409395, 1403387, 1396440, 1388493, 1379452, 1369587, 1359272, 1348626, 1337470, 1325355, 1311695, 1296222, 1279431, 1262370, 1245939, 1230455, 1215739, 1201450, 1187459, 1174118, 1162074, 1151741, 1143181, 1136506, 1131927, 1129149, 1127270, 1125792, 1125407, 1127247, 1131560, 1137647, 1144878, 1153237, 1162963, 1174183, 1186946, 1201240, 1216868, 1233547, 1251104, 1269534, 1289066, 1310197, 1333344, 1358348, 1384786, 1412901]
61026A412901L0676L3471L5257L5939L6526L7532L8729M0466M3831M9297N6420
61015A851045O5039P5246Q6039R5796J04760J15550J30679J51191J78337K14712
61005C068394K62909L24908M03590N02358O21814P59307R13734J088837J290222
60996I236073J520841J775969K028218K205763K197867J916153J377563P26331
60988B2984778J57278j95231l03952k12735Q959K63433M09699L06095r6685p03259
60978B2618380j326225j800050k056188k113978k027913j850637j625902j390108
60970H427379j168822r74016q07737o67983n51781m56137l78382l15782k65255
60961B841484k24376j92188j67800j48697j31891j16379j02905r1535q1007p0561
$$ y = [1412901, 1443577, 1477048, 1512305, 1548244, 1584770, 1622302, 1661031, 1701497, 1745328, 1794625, 1851045, 1916084, 1991330, 2077369, 2173165, 2277925, 2393475, 2524154, 2675345, 2853682, 3068394, 3331303, 3656211, 4059801, 4562159, 5183973, 5943280, 6857014, 7945851, 9236073, 10756914, 12532883, 14561101, 16766864, 18964731, 20880884, 22258447, 22984778, 23142056, 22946825, 22642873, 22430138, 22439097, 22702530, 23112229, 23418324, 23321639, 22618380, 21292155, 19492105, 17435917, 15321939, 13294026, 11443389, 9817487, 8427379, 7258557, 6284541, 5476804, 4808821, 4257040, 3800903, 3422521, 3106739, 2841484, 2617108, 2424920, 2257120, 2108423, 1976532, 1860153, 1757248, 1665713, 1584706, 1514145]
60951A514145o0794n2357m5123l9051l4755l2596l1968l1874l1720l1369l0922
60940A091616l0489k9844k8469k6365k4418k3352k2772k1987k1159k0716k0111
60929H21934j8411j5835j3528j1985j0832r993r834j0158j0211r783r241q553
60917F83570p340n924n083m768m212l473l524m546n321m865l622k562k041j985
60903F24304k323k729k696k265k095k538l264l981m778n580o045o209o406o458
60889E66937n844m871m564n141n583n236m804n102n728n722m975m210m022m416
60875D96719m934m836l625j741l23J5k50l36L6Q07J910L094L958M407M637M661
60859E04199M413M310M850N593N438M162K742J892J296O75M77Q69J037M08k94
$$ y = [1514145, 1453351, 1400994, 1355871, 1316820, 1282065, 1249469, 1217501, 1185627, 1153907, 1122538, 1091616, 1061127, 1031283, 1002814, 976449, 952031, 928679, 905907, 883920, 862761, 842045, 821934, 803523, 787688, 774160, 762175, 751343, 741350, 731516, 721358, 711147, 701364, 692123, 683570, 676230, 670306, 665223, 660455, 656243, 652770, 649246, 644700, 639379, 634514, 630892, 628330, 626289, 624304, 621981, 619252, 616556, 614291, 612196, 609658, 606394, 602413, 597635, 592055, 586010, 579801, 573395, 566937, 561093, 556222, 551658, 546517, 540934, 535698, 530894, 525792, 520064, 514342, 509367, 505157, 501135, 496719, 491785, 486949, 483324, 481583, 481260, 481275, 481025, 480689, 480725, 481532, 483442, 486536, 490494, 494901, 499538, 504199, 508612, 512922, 517772, 523365, 528803, 532965, 535707, 537599, 538895, 539570, 540047, 540916, 541953, 542361, 542067]
60844E42067j42M94M90m20j558k590l891n679p454q506q553p871p042o509o197
60829D76639n676m804l958l546l628m059m559m582l769k681k466l383m285m027
60815D21216k899k098k220k829l257l279l068k856k651k180j249k13K69L2m43
60800C92275p22q46r39q64n10J4O70J601K721L592L889L647K995K119J483J517
60784D12642J929J920J217L51k43o93j137j459j763k344k912k696j700r56j074
60769D01082j324q97j90p5m97p34n61l11j08J38K01j92o93o27j3L76l2r59j623
60750C92961j464n69M07Q34P65P81J138J442J372J124Q22K2j643l595m728m591
60734C85078l731k955k536k117j210J42J202J270N82N0J44N04P69J140J801K417
$$ y = [542067, 541925, 542419, 542909, 542489, 540931, 538341, 534450, 528771, 521317, 512811, 504258, 496387, 489345, 482836, 476639, 470963, 466159, 462201, 458655, 455027, 450968, 446409, 441827, 438058, 435377, 432911, 429528, 425243, 421216, 418317, 416219, 413999, 411170, 407913, 404634, 401566, 398710, 396059, 393879, 392630, 392417, 392686, 392718, 392275, 391553, 390707, 389768, 388904, 388394, 388408, 389078, 390679, 393400, 396992, 400881, 404528, 407523, 409642, 411125, 412642, 414571, 416491, 417708, 418059, 417816, 417123, 415986, 414527, 412764, 410420, 407508, 404812, 403112, 402156, 401082, 399758, 398861, 398671, 398596, 398099, 397365, 396804, 396493, 396385, 396523, 396724, 396532, 395839, 395212, 395199, 395575, 395543, 394584, 392961, 391497, 390928, 391335, 392169, 392934, 393715, 394853, 396295, 397667, 398791, 399613, 399635, 397992, 394397, 389669, 385078, 381347, 378392, 375856, 373739, 372529, 372671, 373873, 375143, 375725, 375775, 375919, 376423, 377192, 378332, 380133, 382550]
60718C82550K574K286J747J068N36O03J236J787J848J713J677J496R57M07J25
60703D02610k27r78j735j970j846j883k144k357k453k442k133j564j311j712k125
60688C75730j692n05O60J407J831J848J346Q82J219K139K554K055J528J841K600
60673C95443K820K443K390L133L786L006O26j980l292l090k347j969k083k366
60659C96520k561k508k112j444o42K64J195J786J843J853K427L251L340K463J478
60644D07153J055Q46L40l26r38j828l157m177m014k908j945j731j870j681r64
60629C83855r3M41N13M96P29J049J160J225J536J737J263L93j3N4j90p73p36J24
60611C92770O13J5o64l09N70Q53O27O64Q52N05k04m60j55J27K75P09J395J778
$$ y = [382550, 385124, 387410, 389157, 390225, 390761, 391364, 392600, 394387, 396235, 397948, 399625, 401121, 402078, 402485, 402610, 402383, 401405, 399670, 397700, 395854, 393971, 391827, 389470, 387017, 384575, 382442, 380878, 379567, 377855, 375730, 374038, 373533, 374193, 375600, 377431, 379279, 380625, 381507, 382726, 384865, 387419, 389474, 391002, 392843, 395443, 398263, 400706, 403096, 406229, 410015, 413021, 413647, 411667, 408375, 405285, 402938, 400969, 398886, 396520, 393959, 391451, 389339, 387895, 387253, 387517, 388712, 390498, 392341, 394194, 396621, 399872, 403212, 405675, 407153, 408208, 409054, 409394, 409068, 408130, 406302, 403145, 398968, 394954, 392046, 390101, 388370, 386500, 384819, 383855, 383762, 384203, 384716, 385212, 385941, 386990, 388150, 389375, 390911, 392648, 393911, 394304, 394291, 394345, 394155, 393382, 392646, 392770, 393383, 393398, 392734, 392425, 392995, 393848, 394475, 395139, 395991, 396496, 396292, 395832, 395677, 395804, 396079, 396788, 398183, 399961]
60593C99961J678J401J057N53J45K13O19Q96R20P72L14l66n34K90J340J492Q67
60576D11618O09J210K058K614L042L642M471N629P180Q729R734J0222J0591J0795
60562D92144J0456R635Q745P753O181L890J235j463l963n788o560o591o416n872
60548E03386m372j959N55K518L811M498M816N417O825Q788J0775J2851J5266J7523
60534E90698J8862J9523K0374K1296K0993J8611J4626R947N061K43m136p873j0833
60521G17392j2542j2639j1726j0952j0590r888q470o991o148n794n320m271k416
60508F09645RK042K819K945M140P240J1281J4962J8112K1304K4808K8542L2507
60495G80356L6527M0051M2638M4358M5330M5249M3756M0896L6836L1478K4747
$$ y = [399961, 401639, 403040, 404097, 404650, 404795, 405008, 405627, 406523, 407443, 408215, 408529, 408163, 407629, 407919, 409259, 410751, 411618, 412227, 413437, 415495, 418109, 421151, 424793, 429264, 434893, 442073, 450802, 460536, 470758, 481349, 492144, 502600, 512235, 520980, 528733, 534914, 538804, 540039, 538576, 534613, 528825, 522265, 515674, 509258, 503386, 499014, 497055, 497610, 500128, 503939, 508437, 513253, 518670, 525495, 534283, 545058, 557909, 573175, 590698, 609560, 629083, 649457, 670753, 691746, 710357, 724983, 734930, 739991, 740234, 736098, 728225, 717392, 704850, 692211, 680485, 669533, 658943, 649055, 640585, 633594, 627446, 621652, 616332, 612061, 609645, 609654, 611696, 614515, 617460, 621600, 628840, 640121, 655083, 673195, 694499, 719307, 747849, 780356, 816883, 856934, 899572, 943930, 989260, 1034509, 1078265, 1119161, 1155997, 1187475, 1212222]
60484A212222J7046Q975P45p914j7269k7087l6506m4412n0092n3478n4672n3569
60472H93989n0365m6060m1877l8195l4522l0457k6245k2487j9703j8008j6828
60461E49242j5149j2564r803p792o594n836n638o144o594n989m563l528l375l439
60447D52234l134k573j902j116o38j051k021k447j929j174p21l35N6r2r75j941
60431D30241k417k531k402j783p70n3R0J46L56K53l00n57j7P55J134J411K001
60414D25557K480K266J651J295J177Q99N79O60J094J495J839K353K884K959K417
60399D51605J590R17P09J009J507J818K010K467L110L354L026K675K661K575K080
60384D83113J601J591J716J453J068J203J789K109J863J542J719K314K723K469
$$ y = [1212222, 1229268, 1238243, 1238988, 1231074, 1213805, 1186718, 1150212, 1105800, 1055708, 1002230, 947558, 893989, 843624, 797564, 755687, 717492, 682970, 652513, 626268, 603781, 584078, 566070, 549242, 534093, 521529, 511726, 503934, 497340, 491504, 485866, 479722, 473128, 467139, 462576, 459048, 455673, 452234, 449100, 446527, 444625, 443509, 442871, 441820, 439799, 437352, 435423, 434249, 433528, 433193, 433249, 433157, 432182, 430241, 427824, 425293, 422891, 421108, 420338, 420285, 420375, 420521, 420877, 421130, 420830, 420273, 420256, 421011, 422145, 423556, 425557, 428037, 430303, 431954, 433249, 434426, 435325, 435904, 436564, 437658, 439153, 440992, 443345, 446229, 449188, 451605, 453195, 454112, 454821, 455830, 457337, 459155, 461165, 463632, 466742, 470096, 473122, 475797, 478458, 481033, 483113, 484714, 486305, 488021, 489474, 490542, 491745, 493534, 495643, 497506, 499048, 500767, 503081, 505804, 508273]
60370E08273J807J590K353L574M202L852K993K067J165O48J154K605L935M324
60356E44542M150M268M925N790O542O956O910O719O921P378P160N688L372P78
60342F22099j973m477n676n183m224m294n246n675m906l629k779k643l087l837
60328E64470m414m402l932l481l273l163l021k783k273j353k54P02J525K426L384
60313E40158M235N087O233P725R252J0498J1339J1797J1964J1958J1848J1688
60301F53782J1554J1322J0454Q433N481K336p28m150q147j2038j4827j6036j5771
60288F31665j4382j2348j0131p943n867m249l456l301l267l332l827m508m688
60275E50366m414m489n000m956l958l164l693m963n515m802l329j690m21j82j062
$$ y = [508273, 510080, 511670, 514023, 517597, 521799, 525651, 528644, 530711, 531876, 532524, 533678, 536283, 540218, 544542, 548692, 552960, 557885, 563675, 570217, 577173, 584083, 590802, 597723, 605101, 612261, 617949, 621321, 622099, 620126, 615649, 609973, 604790, 600566, 596272, 591026, 585351, 580445, 576816, 574037, 571394, 568307, 564470, 560056, 555654, 551722, 548241, 544968, 541805, 538784, 536001, 533728, 532375, 532121, 532823, 534348, 536774, 540158, 544393, 549480, 555713, 563438, 572690, 583188, 594527, 606324, 618288, 630246, 642094, 653782, 665336, 676658, 687112, 695545, 701026, 703362, 702634, 698484, 690337, 678299, 663472, 647436, 631665, 617283, 604935, 594804, 586861, 580994, 576745, 573289, 569988, 566721, 563389, 559562, 555054, 550366, 545952, 541463, 536463, 531507, 527549, 524385, 520692, 515729, 510214, 505412, 502083, 500393, 499972, 499790, 498728]
60260D98728k082k288j949j838j802j075K53J206J292J048J150J746K610L346
60246E00345L401K593J495Q16M56j74j072j567j253m73J48K23k33p22m85O32J811
60229E05941K185J948J956K503L131L555M006M645N228N522N571N494N391N480
60215E62556N990O886P914Q837R467R649R528R536R830R990R642R034Q593Q229
60201F85681P605O865O481O456O209N250L715K165J052L00p02k433m490n895o271
60186G11988o220o435o999p787q826r861j0204r612q714q071p426o432n393m608
60172F05400l700k388j311j127j339j054m94n95j410k071k188k235k393k076r10
60157E80109N38J368J238M71k99n70l01J03M00P24J094J135Q14Q62J889L451M747
$$ y = [498728, 496646, 494358, 492409, 490571, 488769, 487694, 487947, 489153, 490445, 491493, 492643, 494389, 496999, 500345, 503746, 506339, 507834, 508650, 509106, 508932, 507860, 506293, 505040, 504567, 504715, 504938, 504705, 503983, 503498, 504130, 505941, 508126, 510074, 512030, 514533, 517664, 521219, 525225, 529870, 535098, 540620, 546191, 551685, 557076, 562556, 568546, 575432, 583346, 592183, 601650, 611299, 620827, 630363, 640193, 650183, 659825, 668859, 677452, 685681, 693286, 700151, 706632, 713088, 719297, 724547, 728262, 730427, 731479, 731779, 731077, 728644, 724154, 718259, 711988, 705768, 699333, 692334, 684547, 675721, 665860, 655656, 646044, 637330, 629259, 621833, 615401, 610008, 605400, 601700, 599312, 598001, 596874, 595535, 594481, 593987, 593392, 591982, 589911, 587723, 585488, 583095, 581019, 580109, 580647, 582015, 583253, 583724, 583425, 582855, 582554, 582657, 583057, 583781, 584875, 586010, 586824, 587686, 589575, 593026, 597773]
60140E97773N694O616P284P252O835O811P276P730Q090Q662R199Q980P909O609
60126G02720N386L995K621K080K630L330L202K539K527L679N093N389M258K888
60112G52337K533K912K585J009o66j266j151j409k247l111l851m676n341n343
60098G32315m770m126l544k957k698k983l173k566j604j246j402j184o20p13j713
60083F97016k578k546k120k045k233k237k100k168k582l322m398n760p265q722
60069F46940r718r706q744p809p654p698o910n477m615m763n052m709l907l078
60055E57100k248j364n71J53J014J911K506K821L204L717M225M947O191P594Q398
60040E99598Q506Q441Q360P875O857N573M071K286O83j09k75o20j416k419l808
$$ y = [597773, 603467, 610083, 617367, 624619, 631454, 638265, 645541, 653271, 661361, 670023, 679222, 688202, 696111, 702720, 708106, 712101, 714722, 716802, 719432, 722762, 725964, 728503, 731030, 734709, 739802, 745191, 749449, 752337, 754870, 757782, 760367, 761376, 760710, 759444, 758293, 756884, 754637, 751526, 747675, 742999, 737658, 732315, 727545, 723419, 719875, 716918, 714220, 711237, 708064, 705498, 703894, 702648, 701246, 700062, 699442, 698729, 697016, 694438, 691892, 689772, 687727, 685494, 683257, 681157, 678989, 676407, 673085, 668687, 662927, 655662, 646940, 637222, 627516, 618772, 610963, 603309, 595611, 588701, 583224, 578609, 573846, 568794, 564085, 560178, 557100, 554852, 553488, 552917, 553070, 554084, 555995, 558501, 561322, 564526, 568243, 572468, 577415, 583606, 591200, 599598, 608104, 616545, 624905, 632780, 639637, 645210, 649281, 651567, 652250, 652141, 651866, 651246, 649830, 647411, 643603]
60025F43603n991q453j0039j0562j0979j1794j2376j2149j1342j0234q758p195
60013E23731o223n853n261m058k834k090j619j277j377j895k178j882j369q85
59999D84930k42M33N87K43J22M88Q81J283K326L943N072N271N365N873O050N257
59983E27882M059L096J989M10r14j317j423k121l081l435l261l184l190k903k613
59968E09994k855l296l135k345j579r97j02J310K819L952M547M592M172L410K242
59953E22729O11r04j307m30O95J208J411J837K128J710R23M74K35m29j389j806
59937E27696j328m34L28P80R57J077J605K771M199N350O086O346N810M419K836
59922E68498J693P03p49k464l596l734l145k148r35J27P28J070J538K058K307
$$ y = [643603, 637612, 629159, 619120, 608558, 597579, 585785, 573409, 561260, 549918, 539684, 530926, 523731, 517508, 511655, 506394, 502336, 499502, 497412, 495793, 494516, 493139, 491244, 489066, 487184, 485815, 484930, 484688, 485121, 485708, 485951, 486073, 486561, 487442, 488725, 491051, 494994, 500066, 505337, 510702, 516575, 522625, 527882, 531941, 535037, 537026, 537436, 536522, 535205, 533782, 531661, 528580, 525145, 521884, 518700, 515510, 512607, 509994, 507139, 503843, 500708, 498363, 496784, 495787, 495685, 496995, 499814, 503766, 508313, 512905, 517077, 520487, 522729, 523340, 522436, 521129, 520699, 521394, 522602, 524013, 525850, 527978, 529688, 530611, 531085, 531320, 530891, 529502, 527696, 526368, 525934, 526262, 527042, 527999, 529076, 530681, 533452, 537651, 543001, 549087, 555433, 561243, 565662, 568498, 570191, 570894, 570145, 567681, 564085, 560351, 557206, 555058, 554123, 554250, 554978, 556048, 557586, 559644, 561951]
59907E61951K414K752L123K912K095J431J372J344M91j122k422k437j298k0O24
59892E73210Q62J413K534L793M697N087N074M974N195N737N971N445M766M908
59878F33666N796O444O425O116N479L848J378n94j314j600k314k870k360j259
59864F56841q13j226j570j244n08J93O28O55M46O21J488K358K359J762J770K977
59848F66737M704N944O485O918P800Q829Q903P167M035Q20j547k967l390k557
59834G17881p60R77J953K330K188R31j649m462o140o469o164n807n680o137p186
59819F75806q086q103p406o599n731m471k929j607o97j4N16P69O59J40o37j023
59803F30587l06J170K041J555N07k8j79p28j753k717l427m068m605m834m774m507
$$ y = [561951, 564365, 567117, 570240, 573152, 575247, 576678, 578050, 579394, 579885, 578763, 576341, 573904, 572606, 572586, 573210, 574072, 575485, 578019, 581812, 586509, 591596, 596670, 601644, 606839, 612576, 618547, 623992, 628758, 633666, 639462, 645906, 652331, 658447, 663926, 667774, 669152, 668558, 667244, 665644, 663330, 660460, 658100, 656841, 656028, 654802, 653232, 651988, 651480, 651673, 652301, 652956, 653402, 654023, 655511, 657869, 660228, 661990, 663760, 666737, 671441, 677385, 683870, 690788, 698588, 707417, 716320, 723487, 727522, 728342, 726795, 723828, 720438, 717881, 717121, 718098, 720051, 722381, 724569, 725500, 723851, 719389, 713249, 706780, 700616, 694809, 689129, 682992, 675806, 667720, 659617, 652211, 645612, 639881, 635410, 632481, 630874, 630177, 630163, 630679, 631448, 632107, 632247, 631610, 630587, 630281, 631451, 633492, 635047, 635554, 635526, 635347, 634619, 632866, 630149, 626722, 622654, 618049, 613215, 608441, 603934]
59787F03934l996l518l664m341m485l409j892j212j646k535l233l294k405q95
59773E63409K91O98Q28R58N69k93k91J338L266L847L507L789M798N390N447O057
59757F03608P500Q722R054R022R198R473R682R885R880R401Q793Q572Q368P400
59743G28558N887M817M368L750K667J684R95O5j200j979j701q16j24q6q77k267
59727G43741l278k887j330N8M09j0o26j172j428j265j172j757k720l100k602j764
59711G19097q26M25J636J960J521J581K720L940M188L824L845M402M927N186N507
59696G63933O242P461Q938J0064J0071Q691O397L874J516n63k405m073n311n513
59682H09322m514l302l179m320n729o631p132p509p699p725p879q121p912o943
$$ y = [603934, 599938, 596420, 592756, 588415, 583930, 580521, 578629, 577417, 575771, 573236, 570003, 566709, 564304, 563409, 563700, 564398, 565226, 566184, 566753, 566460, 566169, 567507, 570773, 574620, 578127, 581916, 586714, 592104, 597551, 603608, 611108, 619830, 628884, 637906, 647104, 656577, 666259, 676144, 686024, 695425, 704218, 712790, 721158, 728558, 734445, 739262, 743630, 747380, 750047, 751731, 752726, 752791, 751591, 749612, 747911, 747095, 746971, 746885, 746008, 743741, 740463, 737576, 736246, 736304, 736713, 736703, 736077, 734905, 733477, 732212, 731040, 729283, 726563, 723463, 720861, 719097, 718271, 718696, 720332, 722292, 723813, 725394, 728114, 732054, 736242, 740066, 743911, 748313, 753240, 758426, 763933, 770175, 777636, 786574, 796638, 806709, 815400, 821797, 825671, 827187, 826624, 824219, 820146, 814835, 809322, 804808, 801506, 798327, 794007, 788278, 781647, 774515, 767006, 759307, 751582, 743703, 735582, 727670, 720727]
59668G20727n673m808m585m669m538l865k771j650n63P77K242L021K767K384K917
59653G01713M047M689M695M887N533N868N245L794J833n49l095n346p108q392
59639G17814q974q708q157q030q066p300n470l388j860j057r72j632k755l871
59625F47574m830n634n992n733n386n491n645n201m586m746n518n788n189m324
59611E73511l377j867j6J106J174J115J550J934J713J287J223J416J565J663J676
59596E85673J441J197J412J915K030J722J598J670J205P7q45j101j275j815k239
59581E92665k118j850j936k263k581k868k870k143r71l43o02r70q48o34q39j226
59565E67603j363j234q52r1P19Q76L26j92l15n01r10r64m47p6l00m62J80J302
$$ y = [720727, 715054, 710246, 705661, 700992, 696454, 692589, 689818, 688168, 687605, 688382, 690624, 693645, 696412, 698796, 701713, 705760, 710449, 715144, 720031, 725564, 731432, 736677, 740471, 742304, 741755, 738660, 733314, 726206, 717814, 708840, 700132, 691975, 683945, 675879, 668579, 663109, 659721, 657861, 656804, 655832, 654200, 651445, 647574, 642744, 637110, 631118, 625385, 619999, 614508, 608863, 603662, 599076, 594330, 588812, 583024, 577835, 573511, 570134, 568267, 568251, 569357, 570531, 571646, 573196, 575130, 576843, 578130, 579353, 580769, 582334, 583997, 585673, 587114, 588311, 589723, 591638, 593668, 595390, 596988, 598658, 599863, 599940, 599095, 597994, 596719, 594904, 592665, 590547, 588697, 586761, 584498, 581917, 579049, 576179, 574036, 573065, 572722, 572120, 571150, 570302, 569668, 568829, 567603, 566240, 565006, 564154, 564063, 564782, 565658, 565984, 565792, 565477, 564976, 564066, 563102, 562655, 562579, 562279, 561817, 561997, 563299]
59547E63299J993J854J223Q56J639L897O710Q676R539J0435J2447J5607J9083
59534F57258K1185J9581J3171M136l467p553r142r541q451n593k270M7J340K165
59520F72866K379J914J559J739J485j15k328l822m472n037n780o450o970p214
59506F39754o792n859n386n811o286n961n148m358l314j878r07r89j306q32J73
59491E85100R82J687K519K835K162J446J838K917L479L458L647M149M429M594
59477F25242N123N761N913N868O324O925O592N135L439K174J311P33L53k31j186
59462F79476j805j310j07O94Q17J032K035L827N954P668Q231P794P523Q120Q770
59447G38719Q358P015N555M045K026l63k670n001p463r198r266q126p051o341
$$ y = [563299, 565292, 567146, 568369, 569225, 570864, 574761, 581471, 590147, 599686, 610121, 622568, 638175, 657258, 678443, 698024, 711195, 715331, 711864, 704311, 695169, 685628, 677177, 671584, 669314, 669361, 670701, 672866, 675245, 677159, 678718, 680457, 681942, 681827, 679499, 675677, 671205, 666168, 660388, 653938, 646968, 639754, 632962, 627103, 621717, 615906, 609620, 603659, 598511, 594153, 590839, 588961, 588054, 587065, 585759, 584927, 585100, 586082, 587769, 590288, 593123, 595285, 596731, 598569, 601486, 604965, 608423, 612070, 616219, 620648, 625242, 630365, 636126, 642039, 647907, 654231, 661156, 667748, 672883, 676322, 678496, 679807, 680540, 680893, 680662, 679476, 677671, 676361, 676254, 676948, 677765, 678797, 680832, 684659, 690613, 698281, 706512, 714306, 721829, 729949, 738719, 747077, 754092, 759647, 763692, 765718, 765355, 762685, 757684, 750221, 741023, 731757, 723631, 716580, 710239]
59433G10239n434m442m135m380m064k804j539r93n51Q01L081N373P043Q491J0704
59418G17390J4003J7453J9944K1643K3591K6022K8260L0267L2437L3234K9211
59407I93455J9050O122m692j1474j4988j5541j2752p568j754M354J1069J6285
59395I81566J5966Q548k949j3983k1964k6327k7233k5547k2777j9855j6696j3420
59383H15329j0924r625q698p321n789m715l994l249k627k460k613k700k537k077
59369G46000j341o87n86r02r13k36Q06J819K767L673M502N417O572P619Q099Q268
59353G90877Q854R973J1120J2237J3816J5788J7210J7452J6995J6667J6715J6920
59341I64624J7016J6603J5222J2761R578N959J938k294o216r414j1854j3716j5193
$$ y = [710239, 704805, 700363, 696228, 691848, 687784, 684980, 683441, 682448, 681897, 682698, 685779, 691152, 698195, 706686, 717390, 731393, 748846, 768790, 790433, 814024, 840046, 868306, 898573, 931010, 964244, 993455, 1012505, 1018627, 1013935, 1002461, 987473, 971932, 959180, 951612, 949858, 954212, 965281, 981566, 997532, 1006080, 1003131, 989148, 967184, 940857, 913624, 888077, 865300, 845445, 828749, 815329, 804405, 794780, 786082, 778761, 772972, 768257, 764263, 761014, 758387, 755927, 753314, 750614, 748077, 746000, 744659, 743972, 743386, 742484, 741571, 741335, 742141, 743960, 746727, 750400, 754902, 760319, 766891, 774510, 782609, 790877, 799731, 809704, 820824, 833061, 846877, 862665, 879875, 897327, 914322, 930989, 947704, 964624, 981640, 998243, 1013465, 1026226, 1035804, 1041763, 1043701, 1041407, 1035191, 1025777, 1013923, 1000207, 985014]
59328I85014j6518j7769j8784j9437j9832j9947j9450j8259j6868j5649j4329
59317G88172j2709j1328j0663j0207r227q000p263o848n978m696l854l737l723
59304F89939l338k608j361Q04L661O356Q463J0319J2157J3629J4071J2695Q700
59291G73487K186n083j0768j3942j5298j5529j4529j2248r378o772m726l033j283
59278F63084Q75L270N173O201P002Q394J0205J1656J2584J3412J4210J4675J4760
59265G85501J4516J3563J1681R472P564N589L028N17r54j761l087m849n781n492
59251H29507m929m688m279l392k489j829j086j92M61Q87J466J951J733J095Q78
59236H15094Q30j86k078l158k506j259q99j520k500l720n237o666p654q364q947
$$ y = [985014, 968496, 950727, 931943, 912506, 892674, 872727, 853277, 835018, 818150, 802501, 788172, 775463, 764135, 753472, 743265, 734038, 726038, 718775, 711927, 705949, 701253, 697399, 693662, 689939, 686601, 683993, 682632, 683436, 687097, 693453, 701916, 712235, 724392, 738021, 752092, 764787, 773487, 775673, 770590, 759822, 745880, 730582, 715053, 700524, 688276, 678898, 672126, 667400, 664367, 663084, 663959, 667229, 672402, 678603, 685605, 693999, 704204, 715860, 728444, 741856, 756066, 770741, 785501, 800017, 813580, 825261, 834733, 842297, 847886, 850914, 851431, 850477, 848716, 845629, 840780, 834999, 829507, 824578, 819890, 815611, 812219, 809730, 807901, 806815, 806623, 807084, 807971, 809437, 811388, 813121, 814216, 815094, 815924, 815738, 813660, 810502, 807996, 806737, 805838, 804318, 801818, 798098, 792861, 786195, 778541, 770177, 761230]
59221G61230r204r167r221r325q909p878o932o480o127n528m915m444l775k723
59207F66602j561n55K08N13L04K75J091K174K355J774J771K821L939M383M521
59192F90615M634M259L344K696K680K670K326K198K447K268J353O68R09J225M78
59177G24770j113k462l032k983k606k244k199k214j689o80R4M54R55J640J783
59162G08474J290J088J572J868J353N94qj214l537n963p219p501p805q253q270
59147F66469p836p459p234o867o406o207o344o552o527o025n065m234m208m773
59133E80732m945m268l257k386j537o66m8M73J515L049M275M897N574O676P672
59118E97756Q244Q902R959J0910J1385J1738J2135J2118J1550J0971J0496R527
$$ y = [761230, 752026, 742859, 733638, 724313, 715404, 707526, 700594, 694114, 687987, 682459, 677544, 673100, 669325, 666602, 665041, 664486, 664694, 665207, 665511, 665786, 666877, 669051, 671406, 673180, 674951, 677772, 681711, 686094, 690615, 695249, 699508, 702852, 705548, 708228, 710898, 713224, 715422, 717869, 720137, 721490, 722158, 723067, 724292, 724770, 723657, 721195, 718163, 715180, 712574, 710330, 708131, 705917, 704228, 703548, 703642, 704096, 705051, 706691, 708474, 709764, 710852, 712424, 714292, 715645, 716239, 716231, 715017, 711480, 705517, 698298, 690797, 682992, 674739, 666469, 658633, 651174, 643940, 637073, 630667, 624460, 618116, 611564, 605037, 599012, 593947, 589713, 585505, 580732, 575787, 571519, 568262, 565876, 564339, 563673, 563625, 564098, 565613, 568662, 572937, 577834, 583408, 590084, 597756, 606000, 614902, 624861, 635771, 647156, 658894, 671029, 683147, 694697, 705668, 716164, 725691]
59106G25691Q102P306P604P964P396O211N023L642J835P9j329k868m649n749n610
59091G60648m994m659m137k831j288l18J92N88N21k63j125j570k196l611n267
59076G29690o324o807o956o445n331m763n432o224n668m100l040l116l703m148
59062F57633m163l457k066p21n4J27J74o4n87q03n43n39j102j316n46L30K88k29
59044F42362l01j71n65j192j299r99q22n14M13J513K055K247K756L553M342N426
59028F58804O997Q293Q678Q865R832J1149J1707J1501J1368J1474J1312J0719
59016G80699R698P806M938K093J43j585m042o491p298o271m712l399j998l28J242
59001G70495K630M129N606O600P041P092O614N587M613M064L369K023O51k7n20
$$ y = [725691, 733793, 741099, 748703, 756667, 764063, 770274, 775297, 778939, 780774, 780853, 779524, 776656, 772007, 766258, 760648, 755654, 750995, 746858, 744027, 742739, 742421, 742613, 743201, 743722, 743459, 742334, 740764, 738568, 734957, 729690, 723366, 716559, 709603, 703158, 697827, 693064, 687632, 681408, 675740, 671640, 668600, 665484, 661781, 657633, 653470, 650013, 647947, 647226, 647172, 647299, 647473, 647409, 646822, 646019, 645476, 644937, 643835, 642519, 641973, 642303, 642591, 642362, 642061, 641890, 641325, 640133, 638834, 637835, 637013, 636499, 636912, 638425, 640480, 642727, 645483, 649036, 653378, 658804, 665801, 674094, 682772, 691637, 701469, 712618, 724325, 735826, 747194, 758668, 769980, 780699, 790397, 798203, 803141, 805234, 805377, 803792, 799750, 793259, 785961, 779690, 774978, 771579, 769581, 769253, 770495, 773125, 777254, 782860, 789460, 796501, 803593, 810207, 815794, 820407, 824471, 827840, 829863, 830514, 830487, 829967]
58986H29967j597k759l018k611k480k583k138j066J94J898M449P101Q692R425
58972H43474J0415J1771J2602J2772J3063J3625J3668J2858J1763J0878J0213
58961I77102R774R423Q487O496M061J967j81l260o984j0272j2804j4933j6381
58948I52495j6501j5589j4652j3922j2908j1646j0588r495p801n901m755m281
58936H24456l479k146j139r51j141j180q46P1J436K412K364J848J664J564R89
58921H25922M51P57J424J438J063J342K223K810L132L950N149N996O784Q381J0351
58906H81173J1353J1348J1583J2336J2593J2043J1603J1629J1391J0634J0000
58895A007686R550Q500O870N845O035O839P876R605J2114J4608J6545J7936J8342
$$ y = [829967, 828370, 825611, 822593, 819982, 817502, 814919, 812781, 811715, 811909, 813807, 818256, 825357, 834049, 843474, 853889, 865660, 878262, 891034, 904097, 917722, 931390, 944248, 956011, 966889, 977102, 986876, 996299, 1004786, 1011282, 1015343, 1017310, 1017129, 1013869, 1006885, 996613, 983809, 968876, 952495, 935994, 920405, 905753, 891831, 878923, 867277, 856689, 847194, 839393, 833492, 828737, 824456, 820977, 818831, 817692, 816741, 815600, 814420, 813574, 813645, 815081, 817493, 819857, 821705, 823369, 824933, 825922, 826373, 827130, 828554, 829992, 831055, 832397, 834620, 837430, 840562, 844512, 849661, 855657, 862441, 870822, 881173, 892526, 903874, 915457, 927793, 940386, 952429, 964032, 975661, 987052, 997686, 1007686, 1017236, 1025736, 1032606, 1038451, 1044486, 1051325, 1059201, 1068806, 1080920, 1095528, 1112073, 1130009, 1148351]
58882A148351J6961J4159J1458R563P641M950J878r97l625n794o893o967o918
58869A183767p319p878q344q927r601j0011j0232j0698j1369j1948j2768j4279
58857A060393j5867j6424j6062j5905j6194j6082j5285j4502j3984j3155j1870
58846H95063j0747j0123r792r853j0524j1259j1315j1054j1272j1576j1048j0170
58834G66330j0179j0646r808p433n162l785k412q22k76j044j271M32K940M341
58820G21205M385M086M166M859O216P686Q294P834P042O192M690K466M88n90j262
58805G87757k156l244m373n475o138o041n858o480p366p204o190n866o655p328
58791G07383p172o803o440n397l727k463j596J51K855M773N043N009N834O651
$$ y = [1148351, 1165312, 1179471, 1190929, 1200492, 1208133, 1213083, 1214961, 1213964, 1210339, 1204545, 1197652, 1190685, 1183767, 1176448, 1168570, 1160226, 1151299, 1141698, 1131687, 1121455, 1110757, 1099388, 1087440, 1074672, 1060393, 1044526, 1028102, 1012040, 996135, 979941, 963859, 948574, 934072, 920088, 906933, 895063, 884316, 874193, 864401, 854548, 844024, 832765, 821450, 810396, 799124, 787548, 776500, 766330, 756151, 745505, 735697, 728264, 723102, 719317, 716905, 716083, 715807, 714763, 713492, 713924, 716864, 721205, 725590, 729676, 733842, 738701, 744917, 752603, 760897, 768731, 775773, 781965, 786655, 789121, 789609, 789019, 787757, 785601, 782357, 777984, 772509, 766371, 760330, 754472, 747992, 740626, 733422, 727232, 721366, 714711, 707383, 700211, 693408, 686968, 681571, 677844, 675381, 673785, 673936, 676791, 681564, 686607, 691616, 697450, 704101]
58777G04101O410N762N760O005N404L691J180j857m669o168o380o634p516q085
58763F97004p689p078o877o572n871n563n932n834m509k905k069j586p54m5j68
58748F33552p29r63q28m23O35K313L663M122M342M943N549N747N928O404O796
58733F81051O969P385P928P644O370N245M989N025M960N438O609P333O826N854
58719G69626N379N372N706O795Q405R347R205Q960R056Q393O269L723J809l1k689
58704H55325n803q599j1073j3323j4921j5882j7060j8717j9940k0165j9823j8903
58692F71116j6672j3582j1509j1037j0422q439o306n473n404n136n167o088o870
58679E59011o338m996l858k758j316k13L2K55J161K063K460L371N548P855R101
$$ y = [704101, 710511, 716273, 722033, 728038, 733442, 737133, 738313, 736456, 731787, 725619, 719239, 712605, 705089, 697004, 689315, 682237, 675360, 668788, 662917, 657354, 651422, 645588, 641079, 638174, 636105, 634519, 633765, 633720, 633552, 632823, 631860, 631032, 630609, 631244, 633557, 637220, 641342, 645684, 650627, 656176, 661923, 667851, 674255, 681051, 688020, 695405, 703333, 710977, 717347, 722592, 727581, 732606, 737566, 743004, 749613, 756946, 763772, 769626, 775005, 780377, 786083, 792878, 801283, 810630, 819835, 828795, 837851, 846244, 852513, 856236, 858045, 858014, 855325, 849522, 840923, 829850, 816527, 801606, 785724, 768664, 749947, 730007, 709842, 690019, 671116, 654444, 640862, 629353, 618316, 607894, 599455, 593149, 587676, 582272, 577136, 571969, 565881, 559011, 552673, 547677, 543819, 541061, 539745, 539532, 539564, 539819, 540980, 543043, 545503, 548874, 554422, 562277, 571378]
58664E71378J0037J1721J3231J2919J0828Q108N055J457k045m564o208p375p766
58651F16776p317p003p457p863p392o524n798m742l269k522k868k728j005R60
58637E51248J569J437J804K179J730J512K846M578M401K283L36k38j52l37r79
58622E74217j880k492k033o23M46N62Q25K224M036N258O161P127P385O414N163
58607F12790M405L390J617K62K33M51j10m70K89Q31k90j950k364k161k977m214
58591F09732l927k043j60J230K882M822O392P840R789J1629J2272J1934J1555
58578F83947J1205J0587J0191J0312J0028Q750P665P952Q842R208R720J1590J4532
58565H14529J7792K1685K6229K9819L1391L2340L4078L5320L4095L0800K6831
$$ y = [571378, 581415, 593136, 606367, 619286, 630114, 638222, 643277, 644734, 642689, 638125, 631917, 624542, 616776, 609459, 602456, 594999, 587136, 579744, 573220, 567422, 562680, 559411, 556889, 554021, 551293, 550288, 551248, 552817, 554254, 556058, 558237, 559967, 561479, 564325, 568903, 573304, 575587, 575923, 575685, 575533, 575196, 574217, 572337, 569845, 567812, 567189, 567635, 568197, 569022, 571246, 575282, 580540, 586701, 593828, 601213, 607627, 612790, 617195, 620585, 622202, 622464, 622697, 623148, 623038, 622568, 622857, 623688, 623398, 621448, 619084, 616923, 613946, 609732, 605805, 603762, 603602, 604832, 607714, 612536, 618928, 626768, 636557, 648186, 660458, 672392, 683947, 695152, 705739, 715930, 726242, 736270, 745020, 752685, 760637, 769479, 778687, 788407, 799997, 814529, 832321, 854006, 880235, 910054, 941445, 973785, 1007863, 1043183, 1077278, 1108078, 1134909]
58554A134909K1808J4887P357J184l706q044j0650j0138p916o545o232n751n575
58541A115588p087r816j2479j5697k0568k5678k8612k9547l0107k9780k6908k2452
58529H56857j9177j7538j5665j3066j1019r631p773n785n124n420m902l605l211
58516G34941l845l902k995k285k090j716j404j792k013r09L98M9j245j320l31
58501G09541j72p27j35J504K089J084K0m97j199j734r07P76J765K397M225O781
58485G24811Q225Q905J0946J4364J6945J8040J9266K1237K2753K3375K3864K3898
58473I36629K2198J8862J4980J0214L711l117p820j0455j2763j4418j3553j0564
58461I33904p813n852l402p30P12J619M083P605R686J0218J1402J3262J3246J0447
$$ y = [1134909, 1156717, 1171604, 1178961, 1180145, 1176439, 1168395, 1157745, 1147607, 1139691, 1133146, 1126914, 1121163, 1115588, 1108501, 1098685, 1086206, 1070509, 1049941, 1024263, 995651, 966104, 935997, 906217, 879309, 856857, 837680, 820142, 804477, 791411, 780392, 770761, 762988, 757203, 752079, 746659, 741757, 738152, 734941, 731096, 727194, 724199, 721914, 719824, 718108, 716704, 714912, 712899, 711990, 712388, 712437, 711192, 709872, 709541, 709369, 708642, 708507, 710011, 712100, 713184, 713204, 712707, 711508, 709774, 708867, 709643, 711408, 713805, 718030, 724811, 733036, 741941, 752887, 767251, 784196, 802236, 821502, 842739, 865492, 888867, 912731, 936629, 958827, 977689, 992669, 1002883, 1006594, 1003477, 995657, 985202, 972439, 958021, 944468, 933904, 926091, 920239, 916837, 916107, 916819, 918438, 922521, 930126, 939812, 950030, 961432, 974694, 987940, 998387]
58447I98387O468J944l917j0147j4310j6282j8078j9776j9434j7188j5415j4526
58435H57726j2497q924n686l370q79J352J807J568L339O658Q374Q091Q566J0503
58421H76628J1495J0587R295P587L700j449m515n182o515r168j0266r037q367
58408H64793r421r705q075o764o792o158m261l406m103l548o48J909K470K908
58394H09199M444N387M883M669N441N553M910N729Q037Q949P951Q172J0713J2476
58380I06513J1484R645Q429O503L628K139K531K199M68J24K110L559L069L030
58366I65431M647N695N336O080Q847J1015J1603J3117J6145J7362J5326J2948
58354A093552J1813R471M908J183m7j202l371l791j501J53m66m41J690K982K194
$$ y = [998387, 1004855, 1006799, 1002882, 992735, 978425, 962143, 944065, 924289, 904855, 887667, 872252, 857726, 845229, 836305, 830619, 827249, 826370, 827722, 829529, 831097, 834436, 841094, 849468, 857559, 866125, 876628, 888123, 898710, 908005, 915592, 919292, 917843, 913328, 908146, 901631, 892463, 882197, 873160, 864793, 855372, 845667, 837592, 830828, 824036, 817878, 813617, 810211, 806108, 802560, 801912, 803821, 806291, 809199, 813643, 819030, 823913, 828582, 834023, 839576, 844486, 850215, 858252, 867201, 875152, 883324, 894037, 906513, 917997, 927642, 936071, 942574, 946202, 948341, 950872, 953071, 953539, 953663, 955773, 959332, 962401, 965431, 970078, 975773, 981109, 987189, 996036, 1007051, 1018654, 1031771, 1047916, 1065278, 1080604, 1093552, 1105365, 1114836, 1119744, 1120927, 1120880, 1119678, 1116307, 1112516, 1111015, 1111168, 1110702, 1110261, 1111951, 1114933, 1117127]
58339A117127K809O546R817J0190J0494J2915J4874J4662J5148J7888J9375J7284
58327A269129J4747J4274J3212R437N862M930M215J787K95J487K411J364J644
58314A344794N028P589O622N661P775J0053R667R376J1841J4383J4419J4369J6200
58301A477777J7117J5533J5030J7553J9106J7269J6092J8357K0079J8352J7347
58290A669612K0453K3649K3165K2474K5071K7439K6234K5390K8877L3096L3794
58279A959254L3772L6587L9319L8800L8293M0783M2549M0532L8891M1030M2683
58268B392493M0355L8746M2040M5809M5692M5814N0273N4721N5073N5902O1117
58257B928035O5268O3458O0921O3085O5469O3459O2411O7361P2619P2732P3720
$$ y = [1117127, 1119936, 1126482, 1136299, 1146489, 1156983, 1169898, 1184772, 1199434, 1214582, 1232470, 1251845, 1269129, 1283876, 1298150, 1311362, 1320799, 1326661, 1331591, 1335806, 1337593, 1337888, 1339375, 1341786, 1343150, 1344794, 1349822, 1357411, 1364033, 1369694, 1377469, 1387522, 1397189, 1406565, 1418406, 1432789, 1447208, 1461577, 1477777, 1494894, 1510427, 1525457, 1543010, 1562116, 1579385, 1595477, 1613834, 1633913, 1652265, 1669612, 1690065, 1713714, 1736879, 1759353, 1784424, 1811863, 1838097, 1863487, 1892364, 1925460, 1959254, 1993026, 2029613, 2068932, 2107732, 2146025, 2186808, 2229357, 2269889, 2308780, 2349810, 2392493, 2432848, 2471594, 2513634, 2559443, 2605135, 2650949, 2701222, 2755943, 2811016, 2866918, 2928035, 2993303, 3056761, 3117682, 3180767, 3246236, 3309695, 3372106, 3439467, 3512086, 3584818, 3658538]
58246C658538Q1730R0771R3995R6780J05745J15354J18943J22437J32946J44394
58236D761633J49151J53267J65024J79158J88055J97517K15191K34649K47665
58227F491310K60708K82043L04824L20956L38732L67780M00118M26132M54953
58218I647556M97623N45098N85902O30077O91428P62414Q32472R13972J022259
58209A6128801J148094J279590J432340J626431J855110K111092K421276K818155
58201C0820889L302962L880554M605243N549071O758975Q294369J0256891J2705407
58193H6174361J5579852J8794111K2368571K6382238L0828799L5550226M0058262
58186B75736420M3060977M2279473L5450955K2203798N042058j1815577k4818864
$$ y = [3658538, 3740268, 3831039, 3925034, 4021814, 4127559, 4242913, 4361856, 4484293, 4617239, 4761633, 4910784, 5064051, 5229075, 5408233, 5596288, 5793805, 6008996, 6243645, 6491310, 6752018, 7034061, 7338885, 7659841, 7998573, 8366353, 8766471, 9192603, 9647556, 10145179, 10690277, 11276179, 11906256, 12597684, 13360098, 14192570, 15106542, 16128801, 17276895, 18556485, 19988825, 21615256, 23470366, 25581458, 28002734, 30820889, 34123851, 38004405, 42609648, 48158719, 54917694, 63212063, 73468954, 86174361, 101754213, 120548324, 142916895, 169299133, 200127932, 235678158, 275736420, 318797397, 361076870, 396527825, 418731623, 423773681, 411958104, 387139240]
58179C87139240l2606702l5770415l5737311l3915212l1334847k8537680k5660104
58172A63576969k2713777j9805166j7089258j4630230j2415538j0456583q785533
58165E7680884p385267o201657n208725m402382l749353l199000k732733k354541
58157B2447226k046354j776752j541510j354265j206774j075365r57101q64529
58149A1624576p92551p23040o55115o00652n56169n07424m55868m14027l80132
58140F539598l42393l03095k74476k55413k34920k14176k03295k00254j93805
58131D317771j83573j77677j74240j64423j50298j41356j36498j27003j14139
58122B948564j06597j03529r6794q7228q2521q1613p6929o9571o6974o7842o4474
$$ y = [387139240, 354532538, 318762123, 283024812, 249109600, 217774753, 189237073, 163576969, 140863192, 121058026, 103968768, 89338538, 76923000, 66466417, 57680884, 50295617, 44093960, 38885235, 34482853, 30733500, 27534500, 24801767, 22447226, 20400872, 18624120, 17082610, 15728345, 14521571, 13446206, 12489105, 11624576, 10832025, 10108985, 9453870, 8853218, 8297049, 7789625, 7333757, 6919730, 6539598, 6197205, 5894110, 5619634, 5364221, 5129301, 4915125, 4711830, 4511576, 4317771, 4134198, 3956521, 3782281, 3617858, 3467560, 3326204, 3189706, 3062703, 2948564, 2841967, 2738438, 2641644, 2554416, 2471895, 2390282, 2313353, 2243782, 2176808, 2108966, 2044492]
58111B044492n7797n5421n6734n4364m8662m6629m8031m6305m1898m1236m3633
58100A503782m2391l7910l6821l8959l7725l2774k9993k9455k5531j8691j5255
58089A158277j5456j3369q701p345r869j0638q875r800j4041j6338j5675j6596
58077A011574j9565j9860j7087j6316j8556j9170j6897j5676j6359j5269j2056
58066H24763j0781j1982j1641r017p796q620q090n911n581p306p633o557p636
58053G16212j0603j1346r657r457j0908r941o303m443n418n460l559l144m968
58040F21005n584m260m421o755p682o162n443o574o643n033n079p830j0072j0142
58026E29325j0052j0564r794p823p175p639o261l221k035l200l533k524l148n441
$$ y = [2044492, 1986695, 1931274, 1874540, 1820176, 1771514, 1724885, 1676854, 1630549, 1588651, 1547415, 1503782, 1461391, 1423481, 1386660, 1347701, 1309976, 1277202, 1247209, 1217754, 1192223, 1173532, 1158277, 1142821, 1129452, 1120751, 1113406, 1103537, 1092899, 1084024, 1074224, 1060183, 1043845, 1028170, 1011574, 992009, 972149, 955062, 938746, 920190, 901020, 884123, 868447, 852088, 836819, 824763, 813982, 802000, 790359, 781342, 773546, 764926, 756836, 750925, 745344, 738038, 730405, 723848, 716212, 705609, 694263, 684606, 675149, 664241, 654300, 647997, 643554, 638136, 632676, 629117, 625973, 621005, 615421, 611161, 606740, 599985, 592303, 586141, 580698, 574124, 567481, 562448, 557369, 549539, 539467, 529325, 519273, 508709, 498915, 491092, 483917, 476278, 470017, 466796, 464761, 461561, 458028, 455504, 452356, 446915]
58012D46915n637k976j254k063k499j204o50j691j624L81J483O90O83K322K679
57997D35555O21r67n90o87k633m115l665l219m035m493l778l449l661k255P82
57982C99411K425J719J316K327K319K37j323o80L49L07M06J236J236J11k41M13
57966D11568j6j497j226J185K479J311L98J320J849M90q35q20j190k805l505k191
57950D06515j130j908k835k466k070k492k307r42r7k13O56K841L892L179L399
57935D04022N605P049O206N596O993Q107O802M728L815K803K82k259l282l999
57921D52468n589o693o301o023p013p665o845o234o988p282n722m053l798l402
57907C68860j434M55O31N92J964L127J878r51l270m813n903n609l744k356k769
$$ y = [446915, 441278, 438302, 437048, 434985, 432486, 431282, 430632, 428941, 427317, 427698, 429181, 429871, 430554, 432876, 435555, 436176, 435209, 434619, 433932, 431299, 427184, 423519, 420300, 416265, 411772, 407994, 404545, 400884, 398629, 399411, 401836, 403555, 404871, 407198, 409517, 409754, 408431, 407751, 408100, 408407, 408813, 410049, 411285, 411396, 411155, 411568, 411552, 410055, 408829, 410014, 412493, 413804, 414202, 415522, 417371, 417861, 417026, 416206, 415016, 412211, 408706, 406515, 405385, 403477, 400642, 398176, 396106, 393614, 391307, 390365, 390268, 390055, 390711, 393552, 397444, 400623, 404022, 409627, 416676, 422882, 428478, 435471, 443578, 450380, 455108, 458923, 461726, 462008, 459749, 456467, 452468, 446879, 440186, 433885, 427862, 420849, 413184, 406339, 400105, 393117, 385835, 380113, 376060, 372262, 368860, 367426, 367881, 368512, 369104, 371068, 374195, 376073, 375122, 371852, 367039, 361136, 355527, 351783, 349427, 346658]
57892C46658l345k465j149n26N97L079N084M998M231M434M520L162J746J918K480
57877C75422J700N15N88J148P22J34R71K703L921M823N950O252M837L059K483
57862D15228K452J858J469K200K949K484J784K143K681K070J039Q93J185J036
57848D41471J043J739J936O89p42r98q76j583k597l177l960n092n042l280j852
57833D17679k057k127n32J051P93J49J139K613K490J628J997K879K420J382J802
57818D33306L181L381K279J376Q09j60p39J42J121J3k662m653n592o678p601o919
57802D10604n000l641l134k366j446j532k432k850k682k779k949k478k038k668
57788C72609l448k648o99M08K34Q1M84Q41J233K254L286L069J851J018Q48N52
$$ y = [346658, 343313, 340848, 339699, 339173, 339770, 342849, 347933, 352931, 357162, 361596, 366116, 369278, 371024, 372942, 375422, 377122, 377637, 378225, 379373, 380095, 380229, 381200, 383903, 387824, 392647, 398597, 404849, 409686, 412745, 415228, 417680, 419538, 421007, 423207, 426156, 428640, 430424, 432567, 435248, 437318, 438357, 439250, 440435, 441471, 442514, 444253, 446189, 446878, 446136, 445138, 444262, 442679, 440082, 436905, 432945, 427853, 422811, 419531, 417679, 415622, 413495, 412963, 414014, 414807, 414956, 416095, 418708, 421198, 422826, 424823, 427702, 430122, 431504, 433306, 436487, 439868, 442147, 443523, 444332, 444172, 443433, 443575, 444696, 444709, 442047, 437394, 431802, 425124, 417523, 410604, 405604, 401963, 398829, 396463, 395017, 393485, 391053, 388203, 385521, 382742, 379793, 377315, 375277, 372609, 369161, 366513, 365814, 366222, 366456, 366537, 367021, 367862, 369095, 371349, 374635, 377704, 379555, 380573, 381421, 381973]
57772C81973J04J11K19m41j502j836j424j185j362j651k286l432m184l758k879
57757C56467k545k269j223J3N16P87J701K798L384M096N511O473N892M878N017
57742C91496N800N950N854O352O545N400M224M710N728N025L020J856J559M17
57728D53936j461k271j928k166l236l504k511j643j554j398r38r43j360j285q43
57713D26895r57j332q45K23M72k45q80j315k154k806k142p86k92k92R84L544N553
57696D23625O358O966P497O849N083L514K204j17l270n316n484n040m865m484
57682D33520l875l813l931k755l29J480J960K741N256Q958J2852J6996K1719K6864
57668E17643L2340L8109M3347M6839M7865M5253L6333J9520k085k2134l6478m5267
$$ y = [381973, 382077, 382188, 382407, 381966, 380464, 378628, 377204, 376019, 374657, 373006, 370720, 367288, 363104, 359346, 356467, 353922, 351653, 350430, 350443, 350959, 351746, 353447, 356245, 359629, 363725, 369236, 375709, 381601, 386479, 391496, 397296, 403246, 409100, 415452, 421997, 427397, 431621, 436331, 442059, 447084, 450104, 451960, 453519, 453936, 452475, 450204, 448276, 446110, 442874, 439370, 436859, 435216, 433662, 432264, 431326, 430383, 429023, 427738, 426895, 425938, 424606, 423761, 423984, 424456, 424211, 423331, 422016, 419862, 417056, 414914, 414128, 413836, 413544, 414528, 418072, 423625, 429983, 436949, 444446, 451295, 456378, 459892, 462096, 461979, 458709, 453393, 447909, 442869, 438004, 433520, 429645, 425832, 421901, 419146, 418817, 420297, 422257, 424998, 430254, 439212, 452064, 469060, 490779, 517643, 549983, 588092, 631439, 678278, 726143, 771396, 807729, 827249, 825164, 803030, 766552, 721285]
57656G21285m9819n0260m6934m1551l5720k9946k4652k0458j6999j3284r607p351
57644C74704o630n985m720l605k968k132j095p53j019p25K83Q69P22P76J184R54
57628C49860Rn43n21r62j861j862p23N0l08q53r94j401k212k453j945j760k086
57611C29435j775o84k78j135j904j627j083j024r90p11p70j151j033o17j124k419
57595C11110k893k293k303l462m097l297k502k824l224k748k263k437k162o82
57581B73923O99O73o1l65n28j070j403j151j153j811k068j396r71j552k030j556
57565B58180j214j871k313j351j16k21j139j347p85k51L86J453K056J381M38P68
57549B54054K189L424M070M397M050K643R77J28jl4K02J017J735J498N87k35q94
$$ y = [721285, 671466, 621206, 574272, 532721, 497001, 467055, 442403, 421945, 404946, 391662, 382055, 374704, 368074, 362089, 357369, 353764, 350796, 348664, 347569, 346816, 345797, 345072, 345355, 346224, 346946, 347722, 348906, 349860, 349869, 349326, 348805, 347843, 345982, 344120, 343397, 343447, 343139, 342286, 341292, 339891, 337679, 335226, 333281, 331521, 329435, 327660, 326976, 326698, 325563, 323659, 322032, 320949, 319925, 318935, 318224, 317454, 316303, 315270, 314653, 313529, 311110, 308217, 305924, 303621, 300159, 296062, 292765, 290263, 287439, 284215, 281467, 279204, 276767, 274605, 273923, 274622, 275295, 275234, 274869, 274341, 273271, 271868, 270717, 269564, 267753, 265685, 264289, 263318, 261766, 259736, 258180, 256966, 255095, 252782, 251431, 251315, 251094, 249955, 248608, 247823, 247572, 247958, 249411, 251467, 252848, 253286, 254054, 256243, 259667, 263737, 268134, 272184, 274827, 275804, 275932, 275931, 275897, 276099, 277116, 278851, 280349, 280936, 280701, 279807]
57532B79807j482j526q69l57n24n88J66J030J052N86M46N92P32J222K100K342
57516B84729J360K87M48J525K430K945L289L064K030J047R06J043O60J40K03N67
57500C06673O11M64K47o76k427l711l458k383j675j216m57J54O0p2M93J046O20
57483B94293k11k59L86Q62J065J243Q85l44j391j104j06J05o41j378j728j958
57467B89719j913j316o65n76p29o14n96j088j497j228q48r42p39N50J984K053
57451B81555R45Q6L8K79N19P90P93M32M17J108J616J198O00O76Q17K92o3P67J912
57432B94777J922J215J207J764J642Q98P58J430J958K001J958J717J046P41J571
57417C16605K499J896J69p74l93J85M63J178K475L433L552L174K404J123o9m42
$$ y = [279807, 278325, 276799, 275930, 275573, 275049, 274461, 274627, 275657, 276709, 277295, 277741, 278333, 279065, 280287, 282387, 284729, 286089, 286376, 286824, 288349, 290779, 293724, 297013, 300077, 302107, 303154, 304060, 305103, 305763, 305903, 306106, 306673, 307284, 307748, 307995, 307319, 304892, 301181, 297723, 295340, 293665, 292449, 291992, 292146, 292206, 292134, 292627, 293673, 294293, 294082, 293823, 294209, 295071, 296136, 297379, 298264, 297920, 296529, 295425, 295319, 295424, 294783, 293405, 291677, 289719, 287806, 286490, 285825, 285249, 284520, 283906, 283310, 282222, 280725, 279497, 278649, 277707, 276968, 277518, 279502, 281555, 282500, 282586, 282624, 282903, 283422, 284212, 285005, 285437, 285854, 286962, 288578, 289776, 290376, 291052, 291869, 292161, 292098, 292865, 294777, 296699, 297914, 299121, 300885, 302527, 303425, 304183, 305613, 307571, 309572, 311530, 313247, 314293, 315034, 316605, 319104, 321000, 321169, 320395, 320002, 320187, 320650, 321828, 324303, 327736, 331288, 334462, 336866, 337989, 337920, 337478]
57401C37478m55r37j355o24P44J241Q72J072K196L126L377L638M073M018L580
57386C62044L703M398M721M696N322O473O720N668M632M451M415L898L395L301
57372D27837L237L133L489L979L418J750N27O85J244R51l3q79j343j473j106l84
57356D45032O4nr7J52N53R98J597K073J959J514J441J685J535R34M93K73k17p45
57338D59239n02M54J165J404J875K702L100K757K246J837J303J066J961L559M266
57323D88432L578K762K866L490M009M555N072M832L696K703K718L421M210M986
57309E41330N582N511M861M454M625M802M656M622M885M932M557M365M847N812
57295F09841O897P733P639O363N029N088O259P041P174P870R414J0487J0403J0179
$$ y = [337478, 337023, 336086, 334731, 334107, 334851, 336092, 336964, 338036, 340232, 343358, 346735, 350373, 354446, 358464, 362044, 365747, 370145, 374866, 379562, 384884, 391357, 398077, 403745, 408377, 412828, 417243, 421141, 424536, 427837, 431074, 434207, 437696, 441675, 445093, 446843, 447370, 448055, 449299, 450250, 450217, 449338, 447995, 446522, 445416, 445032, 445096, 445091, 444994, 445146, 445699, 446697, 448294, 450367, 452326, 453840, 455281, 456966, 458501, 459435, 459928, 460201, 459984, 459239, 458737, 459191, 460356, 461760, 463635, 466337, 469437, 472194, 474440, 476277, 477580, 478646, 480607, 484166, 488432, 492010, 494772, 497638, 501128, 505137, 509692, 514764, 519596, 523292, 525995, 528713, 532134, 536344, 541330, 546912, 552423, 557284, 561738, 566363, 571165, 575821, 580443, 585328, 590260, 594817, 599182, 604029, 609841, 616738, 624471, 632110, 638473, 643502, 648590, 654849, 661890, 669064, 676934, 686348, 696835, 707238, 717417]
57281G17417J0551J0777J0283R917J0416J1083J1075J0810J1032J1497J1656J1660
57269H48174J1860J2131J2387J2810J3031J2221J0652R837J0453J1335J1378J1105
57257I87374J1452J2195J2712J3201J3998J4593J4419J3903J3751J3855J3800
57246A135253J3747J4059J4600J5110J5694J6386J6902J7224J7661J8097J8092
57235A312825J7932J8441J9444J9768J9232J9154K0230K1378K1604K1581K2380
57224A533969K3817K5145K6235K7057K7131K6567K6611K8051K9912L0786L0565
57213A835846K9918K9083K8186K7900K8673K9968L1161L2424L4013L5506L6624
57202B179302L7884L9634M1325M2476M3479M4664M5594M6007M6357M6690M6128
$$ y = [717417, 727968, 738745, 749028, 758945, 769361, 780444, 791519, 802329, 813361, 824858, 836514, 848174, 860034, 872165, 884552, 897362, 910393, 922614, 933266, 943103, 953556, 964891, 976269, 987374, 998826, 1011021, 1023733, 1036934, 1050932, 1065525, 1079944, 1093847, 1107598, 1121453, 1135253, 1149000, 1163059, 1177659, 1192769, 1208463, 1224849, 1241751, 1258975, 1276636, 1294733, 1312825, 1330757, 1349198, 1368642, 1388410, 1407642, 1426796, 1447026, 1468404, 1490008, 1511589, 1533969, 1557786, 1582931, 1609166, 1636223, 1663354, 1689921, 1716532, 1744583, 1774495, 1805281, 1835846, 1865764, 1894847, 1923033, 1950933, 1979606, 2009574, 2040735, 2073159, 2107172, 2142678, 2179302, 2217186, 2256820, 2298145, 2340621, 2384100, 2428764, 2474358, 2520365, 2566722, 2613412, 2659540]
57191B659540M4338M2329M0891L9491L7645L5970L4876L3570L1631L0254L0465
57180C061000L1368L1658L1750L2865L4937L7043L9020M1163M3068M4265M5287
57169C473424M6827M8470M9500N0118N0635N0411M8959M7147M5847M4410M2006
57158C997754L9454L7978L7103L5483L3081L0642K7777K3559J8485J3938J0017
57147D305271N722J028k973n827p924r241r375q611p429n312j545L155P387J1100
57133D275426J5274J9958K4270K8077L1882L5298L7366L8276L9166M0256M0805
57122D626054M0873M1538M3463M6642N1240N7247O3602O9287P5017Q2234R0978
57111E288175J00432J11090J24400J40687J59517J81687K08721K41022K79238
$$ y = [2659540, 2703878, 2746207, 2787098, 2826589, 2864234, 2900204, 2935080, 2968650, 3000281, 3030535, 3061000, 3092368, 3124026, 3155776, 3188641, 3223578, 3260621, 3299641, 3340804, 3383872, 3428137, 3473424, 3520251, 3568721, 3618221, 3668339, 3718974, 3769385, 3818344, 3865491, 3911338, 3955748, 3997754, 4037208, 4075186, 4112289, 4147772, 4180853, 4211495, 4239272, 4262831, 4281316, 4295254, 4305271, 4310993, 4312021, 4309048, 4303221, 4295297, 4286056, 4276681, 4268070, 4260641, 4255329, 4253784, 4256939, 4264326, 4275426, 4290700, 4310658, 4334928, 4363005, 4394887, 4430185, 4467551, 4505827, 4544993, 4585249, 4626054, 4666927, 4708465, 4751928, 4798570, 4849810, 4907057, 4970659, 5039946, 5114963, 5197197, 5288175, 5388607, 5499697, 5624097, 5764784, 5924301, 6105988, 6314709, 6555731, 6834969]
57102F834969L27396L92118M78536N89423P28077Q99091J105955J350400J633550
57093A4339515J953314K299143K652528K994373L310362L590254L826792M016033
57085C8982314M153345M227041M220673M121362L914856L565812L016847K230395
57077F8432645J240630J55619r00221j846996k660204l339763l882030m276801
57069E2922879m516127m599628m536725m348664m066218l722212l346340k966234
57061B0820731k607936k289766k015351j775501j558187j356782j170705j001824
57053G044679q51900p21969o12041n20835m46070l85050l35042k93593k58854
57044B619325k29428k03909j80974j60059j41510j25758j12497j00813q9856p9311
$$ y = [6834969, 7162365, 7554483, 8033019, 8622442, 9350519, 10249610, 11355565, 12705965, 14339515, 16292829, 18591972, 21244500, 24238873, 27549235, 31139489, 34966281, 38982314, 43135659, 47362700, 51583373, 55704735, 59619591, 63185403, 66202250, 68432645, 69673275, 69828894, 68928673, 67081677, 64421473, 61081710, 57199680, 52922879, 48406752, 43807124, 39270399, 34921735, 30855517, 27133305, 23786965, 20820731, 18212795, 15923029, 13907678, 12132177, 10573990, 9217208, 8046503, 7044679, 6192779, 5470810, 4858769, 4337934, 3891864, 3506814, 3171772, 2878179, 2619325, 2389897, 2185988, 2005014, 1844955, 1703445, 1577687, 1465190, 1364377, 1274521, 1195210]
57034A195210o9381o0440n2414m4581l6220k7326j8349r370N5J0445K2134L4561
57022I44324M4675M6751L6067J3670j3615l8472n7450p0212p6857p7661p4135
57011F77085o8345o1415n3747m6078l9155l2965k7405k3145k0621j8829j6472
57000B68908j3848j2190j1543j0695r098p387o010m658l121j602m4J862L973N972
56986B00519Q177J1163J4654J7719J9736K0046J7252J0536J652o062j0894j3689
56974B90809j5481j5904j4482j1946r362o970m658k670j150K96K120M387P178
56961B22167J0610J4302J7566K0375K3163K5282K4734K0010J1619J472q489j6692
56949C66119k1997k4245k4293k3034k0717j7377j3429r480n935k886l0L298P405
$$ y = [1195210, 1125829, 1065389, 1012975, 968394, 932174, 904848, 886499, 877129, 877184, 887629, 909763, 944324, 988999, 1035750, 1071817, 1085487, 1071872, 1033400, 975950, 905738, 828881, 751220, 677085, 608740, 547325, 493578, 447500, 408345, 375380, 347975, 324830, 304209, 285380, 268908, 255060, 242870, 231327, 220632, 211534, 204147, 198137, 193479, 190358, 188756, 188712, 190574, 194547, 200519, 208696, 219859, 234513, 252232, 271968, 292014, 309266, 319802, 321454, 315392, 304498, 290809, 275328, 259424, 244942, 232996, 223634, 216664, 212006, 209336, 208186, 208482, 210602, 214989, 222167, 232777, 247079, 264645, 285020, 308183, 333465, 358199, 378209, 389828, 391300, 382811, 366119, 344122, 319877, 295584, 272550, 251833, 234456, 221027, 211547, 205612, 202726, 202696, 205994, 213399]
56936B13399J1635J5101J7997K1463K6178L1563L6099L7531L3309K2351O786r057
56924D64355k1653k9757l3437l3317l0958k8402k6514k4670k2339j9888j7475
56913A75945j4546j1148q560p700p771p326n970m326k949j986j413j014n33j15
56899A00588o2J7J016L027N017O231P033Q004R134J0376J2150J4645J7319J9610
56885B14105K1384K2110K0447J5501Q113K87o309j0982j3673j4590j4003j2134
56873B30256r447o808m751k671N20M946R725J4373J9250K4537K9761L4626L9497
56860C83814M4576M9128N1388M8744L8735K1471J117j6566k8539l5427l8575l8166
56848D81700l4574k9385k3931j8060j1308m011L489J1436J9646K7212L4150M2035
$$ y = [213399, 225034, 240135, 258132, 279595, 305773, 337336, 373435, 410966, 444275, 466626, 473412, 464355, 442702, 412945, 379508, 346191, 315233, 286831, 260317, 235647, 213308, 193420, 175945, 161399, 150251, 141691, 133991, 126220, 118894, 112924, 108598, 105649, 103663, 102250, 101236, 100703, 100588, 100526, 100543, 101559, 104586, 109603, 115834, 122867, 130871, 140005, 150381, 162531, 177176, 194495, 214105, 235489, 257599, 278046, 293547, 301660, 301947, 295638, 284656, 270983, 256393, 242390, 230256, 220809, 214001, 209250, 206579, 207099, 212045, 221770, 236143, 255393, 279930, 309691, 344317, 383814, 428390, 477518, 528906, 577650, 616385, 637856, 638973, 622407, 593868, 558441, 519866, 481700, 447126, 417741, 393810, 375750, 364442, 360431, 363920, 375356, 395002, 422214, 456364, 498399]
56836D98399N2013O3278P4230Q3463Q8318Q4162O7425L9395N980k5807n0747o6373
56824I13736p3125p3439o9662o2863n3871m4268l5388k7137j8889j0745k984M838
56812D46203J3142K1423K9194L7081M5752N4062N9183N8126M8738L0550O073j9355
56800H30172m0455n4758o2295o3816o0516n4461m7548m0281l2532k5002j8747
56789C29761j3717q930l761J785P589J3375J8741K3898K9438L4346L5408L0060
56777D97993J9176N865p534j9801k9382l4870l6692l6501l4933l1596k7028k2880
56765B41817j9858j7231j4544j2381j1051r935q644p661p292o983o208n177m247
56752A10605l374k501j841j489j308j349j796k389k477j828r01k39J1o4l37o44
$$ y = [498399, 550412, 613690, 687920, 771383, 859701, 943863, 1011288, 1050683, 1056663, 1030856, 980109, 913736, 840611, 767172, 697510, 634647, 580776, 536508, 501120, 473983, 455094, 444349, 441365, 446203, 459345, 480768, 509962, 547043, 592795, 646857, 706040, 764166, 812904, 843454, 849527, 830172, 789717, 734959, 672664, 608848, 548332, 493871, 446323, 406042, 373510, 348508, 329761, 316044, 307114, 303353, 305138, 312727, 326102, 344843, 368741, 398179, 432525, 467933, 497993, 517169, 523034, 515500, 495699, 466317, 431447, 394755, 358254, 323321, 291725, 264697, 241817, 221959, 204728, 190184, 177803, 166752, 156817, 148173, 140512, 133220, 126237, 120029, 114852, 110605, 107231, 104730, 102889, 101400, 100092, 98743, 96947, 94558, 92081, 90253, 89352, 89113, 89124, 89060, 88723, 88079]
56736H8079q40q21l93N03J374J455P66K27M11Q53J000J023J160J080O39L91O75
56719I7582R76R19R70J313J175K98m3J115K561K464J043R5L59J004J387J638J764
56702A16620J551J385J799K363K188J364P49O09O43R24J590J955J400P34J238
56687A37112K557L141K490J471N87l99j147q78OJ48o14r59l16J91l77j360j755
56670A39898j703j908k423k702k327j275N5R17Q92M41J89Nn23j032q54k27J17
56653A27540K45P21J252J006J65k15J01L88M31P16J114Q40l3m80k77l63j142j722
56635A30287j397o46j18K56O42P76N40K48N8j04j3N43R60L86q43j489j214q82
56617A27990j061j410j650j798j431j55J126R40n16j431j040m75n45m58M49J318
$$ y = [88079, 87239, 86418, 86025, 86528, 87902, 89357, 90123, 90350, 90761, 91614, 92614, 93637, 94797, 95877, 96516, 96907, 97582, 98558, 99477, 100447, 101760, 102935, 103233, 103190, 104305, 106866, 109330, 110373, 110468, 110827, 111831, 113218, 114856, 116620, 118171, 119556, 121355, 123718, 125906, 127270, 128019, 128628, 129271, 130195, 131785, 133740, 135140, 135874, 137112, 139669, 142810, 145300, 146771, 147358, 146959, 145812, 144934, 144940, 145088, 144474, 143515, 143199, 143390, 143013, 141653, 139898, 138195, 136287, 133864, 131162, 128835, 127560, 127615, 128532, 129424, 129865, 130054, 130059, 129536, 128504, 127650, 127423, 127540, 127785, 128506, 129758, 130764, 130929, 130714, 130815, 131203, 131634, 132350, 133464, 134304, 134271, 133791, 133514, 133151, 132009, 130287, 128890, 128244, 128126, 128382, 129024, 129800, 130340, 130588, 130646, 130542, 130529, 131072, 132032, 132418, 131575, 130086, 128872, 127990, 126929, 125519, 123869, 122071, 120640, 120485, 121611, 122551, 122035, 120604, 119564, 119089, 118544, 118086, 118535, 119853]
56601A19853J245P33N99N80J59k05J14O72N96k0l11P1O11O38lp81p93L09J705
56582A25772K241J836J347J188J008P63R47J628K150K106J719J275R85J383K773
56567A49121M355N024M983N378O414P273P883R211J1507J3673J4770J4761J3499
56554B67852J0496O236K291l96k230l622m319m391m481m601m129l310l215l826
56540B48355l791k763k211l071m201m230l492l103l304l754m381m913m666l584
56526A96891k573k130j680q96m31o87j083j256j689k413k488j614r52j388k192
56511A73419k318j898j483j023m76l32n83l26O92J301N93o87j370j376j174p78
56495A62181k33m5k64j88L48N52J12j82J5n7o00n26N44J247N88l72l52R2j12n40
$$ y = [119853, 121098, 121831, 122430, 123010, 123169, 122964, 123078, 123750, 124346, 124326, 124015, 124086, 124697, 125335, 125332, 124551, 123758, 124067, 125772, 128013, 129849, 131196, 132384, 133392, 134155, 135102, 136730, 138880, 140986, 142705, 143980, 144965, 146348, 149121, 153476, 158500, 163483, 168861, 175275, 182548, 190431, 199642, 211149, 224822, 239592, 254353, 267852, 278348, 284584, 286875, 286479, 284249, 280627, 276308, 271917, 267436, 262835, 258706, 255396, 252181, 248355, 244564, 241801, 239590, 236519, 232318, 228088, 224596, 221493, 218189, 214435, 210054, 205141, 200475, 196891, 194318, 192188, 190508, 189612, 189181, 188494, 187411, 186155, 184466, 182053, 179565, 177951, 176999, 175611, 173419, 171101, 169203, 167720, 166697, 166221, 165889, 165306, 164980, 165672, 166973, 167566, 166879, 165509, 164133, 162959, 162181, 161948, 161903, 161639, 161451, 161799, 162351, 162463, 162281, 162296, 162239, 161639, 161113, 161657, 162904, 163492, 163120, 162768, 162860, 162748, 162208]
56475A62208k24M41M19j66m35k85j23K00R15J437J156N56N22J098J812K410K509
56458A74450J493l53j544j205k13K74L31M67N13M07Q15J875K401J609M70K38O29
56441A82657O79L08j76j002k134k578j738n08Q3K44M78M46p4l81j19j02p23r61
56423A74399j92N07K60N6R25J909J653O93L77O83Q20R03J296J423Q83N85J081
56406A88261J115l13j758j328K47Q39K47k5M43P34O64R52J540J634J260J085J038
56389A96635N66r6l27k82l55j86N51J143R56O25Q11Q72K32j32P28J813J611M65
56371B05630k64l45k90Q0R03J241O31M66J871L485L392K085J335J300J069Q67
56355B23456J371J854J377P75J169J612P39m74k66O89M82n85p09J12M38L66J106
$$ y = [162208, 161984, 162425, 162844, 162678, 162243, 161958, 161835, 162035, 162950, 164387, 165543, 166099, 166621, 167719, 169531, 171941, 174450, 175943, 175590, 174046, 172841, 172628, 172902, 173233, 173700, 174213, 174620, 175435, 177310, 179711, 181320, 181790, 182028, 182657, 183336, 183644, 183468, 182466, 180332, 177754, 176016, 175508, 175591, 175835, 176313, 176759, 176685, 176304, 176185, 176083, 175360, 174399, 174207, 174714, 174974, 175030, 175955, 177864, 179517, 180210, 180587, 181270, 182090, 182993, 184289, 185712, 186595, 187180, 188261, 189376, 189063, 187305, 185977, 186224, 187063, 187310, 187285, 187728, 188462, 189126, 190078, 191618, 193252, 194512, 195597, 196635, 197201, 197105, 196778, 196496, 196141, 195955, 196506, 197649, 198605, 199230, 200041, 200913, 201145, 201013, 201741, 203554, 205165, 205630, 205366, 205021, 204731, 204811, 205714, 206955, 207586, 208052, 209923, 213408, 216800, 218885, 220220, 221520, 222589, 223456, 224827, 226681, 228058, 228833, 230002, 231614, 232353, 231879, 231613, 232302, 232784, 232199, 231490, 231602, 232040, 232406, 233512]
56338B33512K167K083J422K025L585M103L441L370M208M563M342M894O063O166
56324B85944N077M415M438L698K046J031R88N48n39r74o34r14j845j731k27R65
56308C02286J112J470K660L578L704M024M926N487N547O155P382P901P247O390
56294C69869N672M462L130K956L755M013L621M008N283N993O028P022R250J0918
56280D45980J1170J1175J1545J1340J0452J0350J1537J2718J3293J4286J6077
56269E79923J7602J8530J9819K1475K2277K2484K4245K8387L3184L7165M0854
56258H65945M5019M9546N4830O1931P0602P9423Q8371R8987J11488J24292J36716
56247A787150J49521J62293J73153J81640J88931J94575J96033J92293J84893
$$ y = [233512, 235679, 237762, 239184, 241209, 244794, 248897, 252338, 255708, 259916, 264479, 268821, 273715, 279778, 285944, 291021, 295436, 299874, 303572, 305618, 306649, 307637, 308185, 307646, 306672, 306038, 305124, 303279, 301548, 301321, 302286, 303398, 304868, 307528, 311106, 314810, 318834, 323760, 329247, 334794, 340949, 348331, 356232, 363479, 369869, 375541, 380003, 383133, 386089, 389844, 393857, 397478, 401486, 406769, 412762, 418790, 425812, 435062, 445980, 457150, 468325, 479870, 491210, 501662, 512012, 523549, 536267, 549560, 563846, 579923, 597525, 616055, 635874, 657349, 679626, 702110, 726355, 754742, 787926, 825091, 865945, 910964, 960510, 1015340, 1077271, 1147873, 1227296, 1315667, 1414654, 1526142, 1650434, 1787150, 1936671, 2098964, 2272117, 2453757, 2642688, 2837263, 3033296, 3225589, 3410482]
56238C410482J74379J58816J37071J10686Q1370M9395J5739j7064m7505p6044
56228C997325j02409j24578j41635j54895j65040j70818j71830j69945j66698
56219B629477j61730j54876j47296j39477j30617j20948j12049j04156r5796q6806
56209A375726p8859p2341o5824n9227n4244n0903m7141m2620l9342l7583l5043
56198G92599l1103k7993k6414k4084k0187j7101j5943j4550j1830r925r845r169
56186E74455o589m665n266o161n113l668l791m221l329k359k676k838j423R8K70
56171E22724M59J903K903J934O82J093K198K648L456N399O641N937N288O527Q177
56156E77969Q577R073J1088J3085J3667J4605J7523K0546K1714K2802K6257L1023
$$ y = [3410482, 3584861, 3743677, 3880748, 3991434, 4072804, 4122199, 4137938, 4120874, 4073369, 3997325, 3894916, 3770338, 3628703, 3473808, 3308768, 3137950, 2966120, 2796175, 2629477, 2467747, 2312871, 2165575, 2026098, 1895481, 1774533, 1662484, 1558328, 1462532, 1375726, 1296867, 1224526, 1158702, 1099475, 1045231, 994328, 947187, 904567, 865225, 827642, 792599, 761496, 733503, 707089, 683005, 662818, 645717, 629774, 615224, 603394, 593469, 583624, 574455, 567866, 563201, 557935, 551774, 546661, 542993, 539202, 534981, 531652, 529293, 526617, 523779, 522356, 522454, 522724, 523183, 525086, 527989, 529923, 530605, 531698, 533896, 536544, 540000, 545399, 552040, 557977, 563265, 569792, 577969, 586546, 595619, 606707, 619792, 633459, 648064, 665587, 686133, 707847, 730649, 756906, 787929]
56144G87929L4976L8991M4917N1888N7984O3408O8921P3340P5524P6441P6455
56133A450774P3330O5883N6931M9687M4150L9731L8011L9399M0237L6962L0491
56122A965586K3211J4823M632n209j2686j9364k7422l6126m4520n4281o6148p6783
56110A665713q2952q5741q6964q4973p8140o9025o0779n2669m3292l4821k9528
56099I56829k5483k0213j5340j3093j1571q225m701l428k789n48J359N64n93J066
56085H53834L806M431M162N644P352O631N303O523Q899R324Q761R713J0922J0195
56071I55500R481J1413J3920J3923J3194J4723J6717J6199J5119J6584J8496J7439
56059A132708J5443J6176J7879J6965J5184J6059J7683J6372J4217J5397J8160
$$ y = [787929, 822905, 861896, 906813, 958701, 1016685, 1080093, 1149014, 1222354, 1297878, 1374319, 1450774, 1524104, 1589987, 1646918, 1696605, 1740755, 1780486, 1818497, 1857896, 1898133, 1935095, 1965586, 1988797, 2003620, 2008252, 2003043, 1990357, 1970993, 1943571, 1907445, 1862925, 1808644, 1742496, 1665713, 1582761, 1497020, 1410056, 1325083, 1246943, 1177918, 1117139, 1064470, 1021178, 986357, 956829, 931346, 911133, 895793, 882700, 871129, 862904, 858203, 854775, 851986, 851438, 852797, 853361, 852768, 853834, 857640, 862071, 866233, 871877, 879229, 885860, 891163, 897686, 906585, 915909, 924670, 934383, 945305, 955500, 964981, 976394, 990314, 1004237, 1017431, 1032154, 1048871, 1065070, 1080189, 1096773, 1115269, 1132708, 1148151, 1164327, 1182206, 1199171, 1214355, 1230414, 1248097, 1264469, 1278686, 1294083, 1312243]
56048A312243J8170J6679J7642J9793J9547J8758K1446K5768K7376K7745L0820
56037A555987L4462L3898L0801L0281L1715L1181L0057L2222L5763L6518L6615
56026A919500M0248M4443M3784M0876M1975M5587M5971M4586M7063N1958N3735
56015B419726N3956N8009O3765O5288O4842O9132P6494Q0166Q1333Q6206R3154
56004C212071R5930R6740J02541J11260J15597J17564J24795J35526J42121J46388
55994D400533J55966J68803J77309J84483J99008K17828K31352K42304K60689
55985F238275K83786L01066L15524L39054L69876L96605M21612M57191N01451
55976I624440N42435N83397O38487P06328P74801Q48943R45242J061657J184422
$$ y = [1312243, 1330413, 1347092, 1364734, 1384527, 1404074, 1422832, 1444278, 1470046, 1497422, 1525167, 1555987, 1590449, 1624347, 1655148, 1685429, 1717144, 1748325, 1778382, 1810604, 1846367, 1882885, 1919500, 1959748, 2004191, 2047975, 2088851, 2130826, 2176413, 2222384, 2266970, 2314033, 2365991, 2419726, 2473682, 2531691, 2595456, 2660744, 2725586, 2794718, 2871212, 2951378, 3032711, 3118917, 3212071, 3308001, 3404741, 3507282, 3618542, 3734139, 3851703, 3976498, 4112024, 4254145, 4400533, 4556499, 4725302, 4902611, 5087094, 5286102, 5503930, 5735282, 5977586, 6238275, 6522061, 6823127, 7138651, 7477705, 7847581, 8244186, 8665798, 9122989, 9624440, 10166875, 10750272, 11388759, 12095087, 12869888, 13718831, 14664073, 15725730, 16910152]
55967A6910152J321253J494645J706220J944481K224595K581424L028219L567241
55959C4778230M238479N111907O239713P669862R489803J1777038J4506128J7588516
55951A11399676K1010999K4848950K9136273L3773122L8394673M1957880M2395154
55944C42916727L7255687K5464118Q731298r005873k3816621l3664411l8554066
55937C09326859l9500918l7669000l4133804k9839048k5469713k1403669j7821914
55930A03488793j4802713j2322408j0282312q595208p216364o095988n164478
55923C9009322m377982l729327l202776k760032k378442k062224j806876j588115
55915A7103548j393504j231487j101571r85895q76983p85321p12995o46480n81252
$$ y = [16910152, 18231405, 19726050, 21432270, 23376751, 25601346, 28182770, 31210989, 34778230, 39016709, 44128616, 50368329, 58038191, 67527994, 79305032, 93811160, 111399676, 132410675, 157259625, 186395898, 220169020, 258563693, 300521573, 342916727, 380172414, 405636532, 414367830, 405361957, 381545336, 347880925, 309326859, 269825941, 232156941, 198023137, 168184089, 142714376, 121310707, 103488793, 88686080, 76363672, 66081360, 57486152, 50269788, 44173800, 39009322, 34631340, 30902013, 27699237, 24939205, 22560763, 20498539, 18691663, 17103548, 15710044, 14478557, 13376986, 12391091, 11514108, 10728787, 10015792, 9369312, 8788060]
55906H788060n28159m89327m51685m10180l74881l49396l23659k93785k68840
55897E298148k52180k35129k14547j98620j90007j80369j66570j55825j50164
55888C554737j41762j28336j17746j12795j06187r4997q5701q0638p3589o3313
55878B549673n7781o0252o3931o4706o6736p1382p3009p0137o8820p0734o9576
55867A812609o3267n8214n7256n4774m8180m3204m2945m2308l8166l4973l5460
55856A293862l5296l1817k8868k8417k6240k0565j6394j6792j7996j7360j7971
55845A036146k1231k2975k1211k0053k1763k2434j9659j7101j7357j7404j5122
55834H19836j3401j3898j3539j0923r541j0915j1223q412o053o553p092n942o191
$$ y = [8788060, 8259901, 7770574, 7318889, 6908709, 6533828, 6184432, 5860773, 5566988, 5298148, 5045968, 4810839, 4596292, 4397672, 4207665, 4027296, 3860726, 3704901, 3554737, 3412975, 3284639, 3166893, 3054098, 2947911, 2852914, 2767213, 2686575, 2612986, 2549673, 2491892, 2431640, 2367709, 2303003, 2236267, 2164885, 2091876, 2021739, 1952919, 1882185, 1812609, 1749342, 1691128, 1633872, 1579098, 1530918, 1487714, 1444769, 1402461, 1364295, 1329322, 1293862, 1258566, 1226749, 1197881, 1169464, 1143224, 1122659, 1106265, 1089473, 1071477, 1054117, 1036146, 1014915, 991940, 970729, 950676, 928913, 906479, 886820, 869719, 852362, 834958, 819836, 806435, 792537, 778998, 768075, 758534, 747619, 736396, 727984, 721931, 715378, 708286, 702344, 696153]
55821F96153r365j1784j1123j0437j1888j2635j0792r329j0088r924o841m179
55809E77768m475m728k113R27J544J520L213N108N406N620O938P252N321L535
55795F12836L271J986j827n364o556p707j0652j2897j2187j0572j0274r774p652
55782E22631o171p341r261r955j0966j3646j5604j4490j1899j0123q485o022m327
55769C94341m542m765l523k457k886l145k135j831l382m499l627l045m648o409
55755C43447o169n387n929o573n988n717o986p770o281m185l322k503n51Q10K05
55740B77101n85q0M6j400k250r88n1j570l300k557q84r15j706j247p03k070m066
55723B52775m430m004m675n477m524k764k162k079r39L41J19o47j45R40R74N54
$$ y = [696153, 686788, 675004, 663881, 653444, 641556, 628921, 618129, 608800, 598712, 588788, 581947, 577768, 573293, 568565, 566452, 567379, 568923, 570443, 573656, 578764, 584170, 589790, 596728, 603980, 609301, 612836, 616107, 618093, 616266, 610902, 604346, 596639, 585987, 573090, 560903, 550331, 540057, 530283, 522631, 516460, 509119, 499858, 489903, 478937, 465291, 449687, 435197, 423298, 413175, 404690, 398668, 394341, 389799, 385034, 381511, 379054, 376168, 373023, 370888, 369057, 365675, 361176, 357549, 354504, 349856, 343447, 337278, 331891, 325962, 319389, 313401, 307684, 300698, 292928, 286647, 282462, 279140, 276637, 276086, 276896, 277101, 276516, 276436, 276482, 275082, 272832, 271844, 271793, 270223, 266923, 264366, 263482, 262567, 260861, 259614, 258911, 256841, 252775, 248345, 244341, 239666, 234189, 229665, 226901, 224739, 222660, 221721, 222062, 222181, 221534, 221389, 222329, 223303, 223857]
55707B23857J037J710J353Q48J341J692N77q61j188j419k730l704k837j592j870
55692B16214k610k031j064j296j649n29P69K94q31l84J005J388J254K231L603
55677B16364L561K632K388K211O69j221j511p94q93j376p69R1n49j774j325L04
55661B18008O51n33j262r38q15j172j045m37j70Q9J177K405K573K201K416K519
55645B25667J222p11j625j838k726l873l873l138l228m088m483m439m720m754
55631A83393l562k005j620k022j796j114j042j258q70n34j242k042j459j64J72
55616A62835l44o55j055k128k727j831r78j914l204k420m31J1j066j231m6N99
55600A43415J06l22n48j526k610k103m69J33m94n11M47P88J18j74K67K38m04m32
$$ y = [223857, 224894, 226604, 227957, 228805, 230146, 231838, 232415, 231554, 230366, 228947, 226217, 222513, 219676, 218084, 216214, 213604, 211573, 210509, 209213, 207564, 207035, 207804, 208098, 207267, 206883, 207888, 209276, 210530, 212761, 216364, 219925, 222557, 224945, 227156, 227825, 226604, 225093, 224299, 223406, 222030, 221261, 221352, 220803, 219029, 217704, 218008, 218659, 218126, 216864, 215926, 215111, 213939, 212894, 212457, 212287, 212376, 213553, 215958, 218531, 220732, 223148, 225667, 226889, 226178, 224553, 222715, 219989, 216116, 212243, 209105, 205877, 201789, 197306, 192867, 188147, 183393, 179831, 177826, 176206, 174184, 172388, 171274, 170232, 168974, 168104, 167570, 166328, 164286, 162827, 162663, 162835, 162491, 161836, 160781, 158653, 155926, 154095, 153117, 151203, 147999, 145579, 145148, 145159, 144093, 142862, 142816, 143415, 143521, 143199, 142651, 141125, 138515, 136412, 135943, 136076, 135582, 135071, 135518, 136306, 136424, 136250, 136517, 136755, 136351, 135919]
55582A35919K83O26P30J926L938M889M373M016M659N446N995O952Q190Q809R128
55567B05879J0251J1553J1055Q516N606K956l78m217o804p584q043r138j0102
55554B09550j0287j0081r528q127o383n522n446m886l676k763k089p93N43L43
55540A40855j030j421k78O36L95J87P97J186M73p17j614k220k302j432l98o41
55524A32476j938k569k051j661k009k278k197k461k820k034l19M46m18j413j352
55509A07402p73k62M15R26K51j256j733n47Q17J220J211J233O25p38j696j657
55493A05438j434j433q61M78J410J253P75N40K9q62j141l76M95P18O62O05K32
55476A06528k35l2O21O41P4J07P67O61m69j129o68l63j062j800j737j478j466
$$ y = [135919, 136202, 136828, 137558, 139484, 143422, 148311, 152684, 156700, 161359, 166805, 172800, 179752, 187942, 196751, 205879, 216130, 227683, 238738, 247254, 252860, 255816, 255438, 251221, 244417, 236833, 228790, 219652, 209550, 199263, 189182, 179654, 171527, 165144, 159622, 154176, 149290, 145614, 142851, 140762, 139969, 140512, 140855, 139825, 138404, 138126, 138762, 139157, 139344, 140141, 141327, 141800, 141083, 139469, 137249, 134947, 133515, 133117, 132476, 130538, 127969, 125918, 124257, 122248, 119970, 117773, 115312, 112492, 110458, 110139, 110585, 110167, 108754, 107402, 106629, 106367, 106782, 107708, 107959, 106703, 104970, 104423, 105240, 106460, 107671, 108904, 109529, 108791, 107095, 105438, 104004, 102571, 101710, 102188, 103598, 104851, 105626, 106166, 106195, 105333, 104192, 103816, 104311, 105029, 105691, 106296, 106528, 106293, 106261, 106882, 107523, 107597, 107704, 108471, 109132, 108663, 107534, 106866, 106503, 105441, 103641, 101904, 100426, 98960]
55459I8960r70K20R00L71l71l60k1J46N33J147J080J79l13J81N02k27j100j028
55441I9829k99M14J200K032K139J220O4p35j324j446m32J071J310J14n92J46Q34
55424A05545K12o97o30k43n78j120j003p15q70o88O44K196K490J556M17m78j087
55407A04951j057m31j14n25p70k19K95n7n84l20K93K67l72r97j434j570r18L64
55389I6802J014M14k82J05R93J196Q85R55J369J425J098Q61P05L84R6L6j76q24
55371A07056j396j344r25o03l15J41O26J015J303J087o0j509k020j529j170j264
55355I9093r15l4J02r45j803j485q31o84l89N85J204N96l19l76m2j88l75J02O09
55336I3905K80l04j60K87M8o06p19l14j07j64j59l13p78q89j63O52P24N24Q31
$$ y = [98960, 97990, 98210, 99110, 99481, 99110, 98750, 98729, 98875, 99408, 100555, 101635, 101814, 101501, 101682, 102184, 101957, 100857, 99829, 99530, 99944, 101144, 103176, 105315, 106535, 106599, 105864, 104540, 103094, 102662, 103733, 105043, 105157, 104565, 104711, 105545, 105757, 105060, 104430, 104187, 103609, 102489, 101486, 100771, 99901, 99213, 99857, 102053, 104543, 106099, 106516, 106038, 104951, 103894, 103463, 103349, 102824, 102054, 101835, 102130, 102073, 101489, 101169, 101462, 101729, 101357, 100360, 98926, 97356, 96438, 96802, 97816, 98230, 97948, 98053, 99046, 100242, 101127, 102082, 103451, 104876, 105974, 106835, 107540, 107924, 108020, 108056, 107880, 107056, 105660, 104316, 103391, 102788, 102473, 102614, 103240, 104255, 105558, 106645, 106585, 105076, 103056, 101527, 100357, 99093, 98178, 98144, 98246, 97301, 95498, 94013, 93182, 92498, 92109, 92694, 93898, 94494, 94175, 93799, 93757, 93569, 93194, 93296, 93905, 94185, 93881, 93721, 94008, 94056, 93450, 92731, 92417, 92310, 92146, 91987, 91674, 90896, 90007, 89844, 90496, 91220, 91744, 92575]
55317I2575J271J080N76N07O93N40K52K70K25l48q93p10k51l69q87j047p66l77
55299I2341K14J004J287O20k47m60k94l35l38L9K96k3l07K2L93K25J93R75J684
55280I7289J074m54j453j475j110o73j51J10l9M3P35J243Q87M26Q01J436J280
55263I9969O31M59O01K30m73o63l46q6J76O94Q89K11o07n79j34k88q20q19m22
55244I8623l39l19K35O78mj157j211j43N98M53K31K65p4q28j109o24j03J2J12
55225I5296L82M30J77M5J68K48K25K50J87p0j10L02N43Q6m14j44L92K18l73l61
55205I7477J60J95l89p89p50p49q42p22o51j034j246l24J310K148J677Q19L93
55188I6683L19K85J21l80j010q84L11J341R80m3j17P16J035M45k0J70M45M94O53
$$ y = [92575, 93846, 94926, 95502, 96009, 96702, 97242, 97494, 97764, 97989, 97641, 96748, 96038, 95787, 95418, 94531, 93484, 92718, 92341, 92555, 93559, 94846, 95466, 95219, 94759, 94465, 94130, 93792, 93831, 94127, 94104, 93797, 93819, 94212, 94437, 94630, 95605, 97289, 98363, 97909, 96456, 94981, 93871, 93198, 93047, 93157, 93118, 93161, 93896, 95139, 96026, 96452, 97253, 98689, 99969, 100600, 101059, 101660, 101890, 101417, 100754, 100408, 100322, 100498, 101192, 102081, 102292, 101685, 101106, 100972, 100684, 99864, 99045, 98623, 98284, 97965, 98200, 98878, 98874, 97717, 96506, 96363, 96961, 97414, 97645, 97910, 97836, 97008, 95899, 95275, 95172, 95184, 95296, 95678, 96108, 96285, 96330, 96498, 96746, 96971, 97221, 97408, 97338, 97228, 97530, 98073, 98159, 97745, 97601, 97993, 98211, 97838, 97477, 97637, 97832, 97443, 96654, 95904, 95155, 94313, 93591, 92940, 91906, 90660, 90336, 91646, 93794, 95471, 96290, 96683, 97002, 97287, 97408, 97028, 96018, 95134, 95445, 96786, 97766, 97723, 97606, 98322, 99357, 99802, 99782, 99952, 100397, 100891, 101544]
55169A01544Q69P11M82Q72J569J598J017P96J047Q85R6n73q78j349j967k063j566
55152A03090j047m67N91J513J067n82j838j909j528j298r09k77J9o5J65P93J038
55135I8356O90M93P60R09O15K08k26q62j161l88P83P71m91j292p17J73K97O4K12
55116I9194N21O23P62J028Q40L8n41k29N59J147J409J387R39K75j4K31N68P40
55098A09477P75M17n04j206p25M61R18L43k25l02m33o00L1J356J981J235R0n39
55080A12550r01j223r49N2R03J043R44R17N78J8J13R68J484J190J005J463J625
55063A21780P65l16p04p99j255j659j426r29p26n78k18j42o96j298j388j250j151
55046A08010o78K30O95K72j70J63O89N48k0l71n68q06o94n8L60L1m19l34j47l87
$$ y = [101544, 102413, 103124, 103606, 104478, 106047, 107645, 108662, 109458, 110505, 111390, 111486, 110913, 110035, 108686, 106719, 104656, 103090, 102043, 101576, 102167, 103680, 104747, 104165, 102327, 100418, 98890, 97592, 96683, 96406, 96425, 96360, 96525, 97318, 98356, 99046, 99539, 100299, 101208, 101823, 102031, 101805, 100943, 99782, 99394, 100177, 100948, 100457, 99165, 98448, 98621, 98918, 98982, 99194, 99715, 100338, 101100, 102128, 102968, 103006, 102465, 102236, 102795, 103942, 105351, 106738, 107677, 107952, 107938, 108169, 108737, 109477, 110252, 110669, 110165, 108959, 108234, 108695, 109613, 109956, 109731, 109429, 108996, 108396, 108427, 109783, 111764, 112999, 113089, 112550, 111649, 110426, 109477, 109529, 110432, 111475, 112419, 113336, 113914, 113932, 114045, 115013, 116497, 117687, 118692, 120155, 121780, 122545, 122229, 121525, 120726, 119471, 117812, 116386, 115457, 114731, 114153, 113935, 113793, 113097, 111799, 110411, 109161, 108010, 107332, 107562, 108257, 108529, 108359, 108522, 109211, 109759, 109739, 109368, 108800, 107994, 107300, 107242, 107602, 107633, 107214, 106880, 106733, 106346]
55026A06346n66j46K95K7m91m05J40N21Q07J256J314M36o39p46n6K32k71p25m53
55007A06876K27O17M72J59L11J146J960J806P70l3K1M43P39J021J151M73q70j590
54989A15699j031k26k06m32L1P82P74j9p90j146j113n91K45O31L17J67P41J146
54971A14979M75n18n09K94O82M52M64R41J239J153J142J272J083N45J62J09J15
54954A24080J27K71K88j82r31j443j675j790j522o01M12O40R6l48j39N01J086
54937A18870J314J139Q76R17J080P00k40p98m00L75Q74J387K263K985L106L227
54921A37675L940M622M528M293M913N772N321L420J544O40J90n45j601k782m095
54906A67835n395o353o815o668n596l658j787q77p27p00q81j625k306j888m68
$$ y = [106346, 105780, 105634, 105929, 105956, 105465, 105060, 105200, 105721, 106528, 107784, 109098, 109534, 108895, 108149, 108093, 108325, 108054, 107329, 106876, 107103, 107720, 108192, 108351, 108662, 109808, 111768, 113574, 114344, 114311, 114332, 114775, 115514, 116535, 117686, 118159, 117289, 115699, 114668, 114442, 114236, 113804, 113835, 114617, 115391, 115372, 114582, 113436, 112323, 111732, 111977, 112608, 112925, 113092, 113833, 114979, 115454, 114936, 114427, 114721, 115403, 115855, 116319, 117260, 118499, 119652, 120794, 122066, 123149, 123694, 123856, 123965, 124080, 124207, 124478, 124766, 124584, 123653, 122210, 120535, 118745, 117223, 116622, 117034, 117674, 117770, 117422, 117283, 117784, 118870, 120184, 121323, 122199, 123116, 124196, 124896, 124656, 123858, 123458, 123833, 124707, 126094, 128357, 131342, 134448, 137675, 141615, 146237, 150765, 155058, 159971, 165743, 171064, 174484, 176028, 176668, 176858, 176313, 174712, 171930, 167835, 162440, 156087, 149272, 142604, 137008, 133350, 131563, 130686, 129959, 129259, 128378, 126753, 124447, 122559, 122091]
54891A22091Q21J418J719J990J998J739J519J323J007J002J817K929L285K900
54877A47558K887L812N055N884O133N692M364K484P65o64k268m008n129n237m798
54862A62530m358m025l811l702l248j968l85K50m96j645k101j819j395j133r56
54847A31738p90o72p26j066j542j689j383j254j833k568k456j536q22p91q50m40
54831A11320J97O65J054J484J691J386O67j65q64j224j166q95n96r4P16J305J050
54814A16531L06J19Q42J707J944J594J010K92m44p58l99K15M15N6l33j72N08J035
54796A24468P80o4o15l53L37P91Q49O91L59j14m48m78m66o58q43p88o80p02n65
54777A21501k7O21J091J624K387K914K870K766L170L754L977M160M891N827O196
$$ y = [122091, 122912, 124330, 126049, 128039, 130037, 131776, 133295, 134618, 135625, 136627, 138444, 141373, 144658, 147558, 150445, 154257, 159312, 165196, 171329, 177021, 181385, 183869, 184634, 183970, 181702, 177694, 172565, 167328, 162530, 158172, 154147, 150336, 146634, 143386, 141418, 141033, 141283, 140787, 139142, 137041, 135222, 133827, 132694, 131738, 130948, 130276, 129550, 128484, 126942, 125253, 123870, 122616, 120783, 118215, 115759, 114223, 113401, 112610, 111760, 111320, 111517, 112182, 113236, 114720, 116411, 117797, 118464, 118299, 117435, 116211, 115045, 114150, 113554, 113460, 114176, 115481, 116531, 116837, 116956, 117798, 119505, 121449, 123043, 124053, 124345, 123901, 123143, 122744, 122959, 123374, 123430, 123097, 122925, 123433, 124468, 125248, 125184, 124569, 124216, 124553, 125344, 126193, 126884, 127243, 127129, 126681, 126203, 125737, 125079, 124236, 123448, 122768, 122066, 121501, 121474, 122095, 123186, 124810, 127197, 130111, 132981, 135747, 138917, 142671, 146648, 150808, 155699, 161526, 167722]
54762A67722O043N903N571M441K769J413L80j128l209n020o035o491o496n825
54748A60038m702l819l384l036k755k807k841k109p72J70L83N30Q73P65p7q56
54732A35601q33k10N66J535K659L351L238K803K802L376M110M538M389L789L276
54717A74990L117K719J418l32j477k064l223n215o689o414m855l353k545k240
54703A43837k215k403k572k405j769p74J90N10p1r48j285j124j189j635j808j359
54687A22980p81n34l84N7P10J190J130K94j046j903j484k88L91J05m42n94l68
54670A19033J41Q98J390R97Q0l36j54l36j191j781j471q46m84J0R64J667J378
54653A19959N06K1K14P92J491J993J810R51J06k83n87j150j581j430r01l16L97
$$ y = [167722, 173765, 179668, 185239, 189680, 192449, 193862, 194242, 193114, 189905, 184885, 178850, 172359, 165863, 160038, 155336, 151517, 148133, 145097, 142342, 139535, 136694, 134585, 133813, 133983, 134366, 134896, 135769, 136534, 136457, 135601, 134768, 134558, 135124, 136659, 139318, 142669, 145907, 148710, 151512, 154888, 158998, 163536, 167925, 171714, 174990, 178107, 180826, 182244, 181912, 180435, 178371, 175148, 169933, 163244, 156830, 151975, 148622, 146077, 143837, 141622, 139219, 136647, 134242, 132473, 131699, 131889, 132399, 132328, 131380, 130095, 128971, 127782, 126147, 124339, 122980, 122199, 121665, 121281, 121338, 122048, 123238, 124368, 124662, 123616, 121713, 120229, 119941, 120332, 120437, 119995, 119401, 119033, 119174, 120072, 121462, 122459, 122539, 122203, 122049, 121713, 120522, 118741, 117270, 116424, 115940, 115950, 116914, 118581, 119959, 120465, 120486, 120700, 121492, 122983, 124976, 126786, 127737, 127843, 127560, 126973, 125823, 124242, 122812, 121911, 121595, 121992]
54636A21992J115J145J80r57j247p31j49R5P8p6j50J63P21Q54K98l08l64j51k01
54617A22307m60o50q24r46n41N14J370J205L66j44K4M59P98Q80M64m45j201j121
54599A22055l53L59N68L58q7n36o26j80M80Q94R49P80N10L72O50J168J232N21
54581A29114m20q67p02j65N90J271J295M54n91r99o83j92Jk25o44p07J7J121J603
54562A29271J118M03J31P8j50k96NM99P74Q77Q75M05n98j319r82L1P52R40J096
54543A33910J449J715J649J278O91R7j60q5j40n24p21l13K32J73n24j375k107
54526A35245k605k502j609m38K55K87m1n46j130j486j325o93J92J076J487J062
54510A27229L19L28J160J607R75K07L49R38R84O79Q14J173R71L80K38M34J30n64
$$ y = [121992, 123107, 124252, 124432, 123475, 122228, 121497, 121348, 121443, 121521, 121445, 121295, 121458, 122179, 123033, 123331, 123023, 122659, 122508, 122307, 121847, 121197, 120373, 119427, 118886, 119400, 120770, 121975, 122341, 122197, 122221, 122680, 123478, 124358, 124822, 124377, 123176, 122055, 121702, 122061, 122629, 122987, 122900, 122364, 121738, 121558, 122038, 122932, 123881, 124661, 125171, 125543, 126193, 127361, 128593, 129114, 128694, 127827, 127125, 126960, 127550, 128821, 130116, 130570, 129979, 128980, 128297, 128105, 128106, 127881, 127237, 126530, 126547, 127668, 129271, 130389, 130792, 130923, 131001, 130851, 130555, 130560, 131059, 131833, 132710, 133585, 133990, 133392, 132073, 131091, 131122, 131874, 132814, 133910, 135359, 137074, 138723, 140001, 140692, 140789, 140629, 140544, 140404, 139880, 139159, 138846, 139078, 139251, 138727, 137352, 135245, 132640, 130138, 128529, 128091, 128346, 128633, 128592, 128046, 126916, 125430, 124105, 123412, 123604, 124680, 126167, 127229, 127548, 127876, 129036, 130643, 131618, 131825, 132174, 133112, 134096, 134775, 135589, 136762, 137733, 138113, 138351, 138785, 138915, 138351]
54492A38351n36M28J158Q36N3k98j96lL06Q03J094P75L0n38m80K18J134J632J405
54473A46172Q10L86K33K16M73J104J607J333N00kJ83N46P02R04J311J436P67l83
54455A58298j140j093p59r45j755k395k203j594j490j848j569j18J527K105J519
54440A46540M98m57j033q25K8M64j67r17n53M77O47l12j162j139q19p41n89j12
54422A39828K95N04J007J856K165J380J96m50n36n22l77J00O12P00M95M01L36
54405A47990p6p13r30l52P45J764K227J961J187M63K70O00J053J253J082O11L4
54388A59169l13j19N72J260J408J089R58J369J701J097k15r69m92L98N77J73K58
54371A67921J284K548L193L138K933L047L375L318K402R30k70q72j346k010k379
$$ y = [138351, 137815, 138243, 139401, 140237, 140290, 139992, 139796, 139793, 140099, 140902, 141996, 142771, 142801, 142263, 141783, 142001, 143135, 144767, 146172, 146982, 147368, 147601, 147817, 148290, 149394, 151001, 152334, 152834, 152832, 153015, 153561, 154263, 155167, 156478, 157914, 158681, 158298, 157158, 156065, 155306, 154361, 152606, 150211, 148008, 146414, 144924, 143076, 141507, 141389, 142916, 145021, 146540, 147038, 146581, 145548, 144723, 144751, 145215, 145048, 144131, 143578, 144055, 144702, 144390, 143228, 142089, 141270, 140529, 139940, 139828, 140123, 140627, 141634, 143490, 145655, 147035, 147231, 146781, 146245, 145723, 145346, 145446, 146058, 146758, 147253, 147654, 147990, 147914, 147201, 146271, 145919, 146664, 148428, 150655, 152616, 153803, 154266, 154536, 155136, 156189, 157442, 158524, 159135, 159169, 158856, 158737, 159309, 160569, 161977, 163066, 164024, 165393, 167094, 168191, 167976, 167007, 166515, 166913, 167490, 167663, 167921, 169205, 171753, 174946, 178084, 181017, 184064, 187439, 190757, 193159, 194089, 193819, 192947, 191601, 189591, 187212]
54356A87212k017j435j371j628j433p49l68p51j557k316k858l018k610j855j298
54341A61948j179j284j375j358j069m59J05J77j66n30q22j127j176o24K60Q59
54325A52180J101J359J552J108Mr11r49l53J80L17K05J29K11K21j91q79j049k74
54307A53961O91P47mm46j04K74m9p50j056p89m03l00m17l84J20R36J449J251O38
54288A55365J80M3R7L90R67J434J362R33O27M29l8p45j212j147o03K82J113J202
54270A60679M48j29L89J359J435N77j0J61L41J05R9P39J380J453J388J750K144
54253A74308J813P24n19j394j659j246m41K23M95N33L81j41q89j321j205q81o48
54236A68133m43k58k73l79j86K75M67K26Q6M29Q37O97L2n27m36K39P79M65m42
$$ y = [187212, 185195, 183760, 182389, 180761, 179328, 178579, 178211, 177460, 175903, 173587, 170729, 167711, 165101, 163246, 161948, 160769, 159485, 158110, 156752, 155683, 155224, 155329, 155506, 155340, 154810, 153988, 152861, 151685, 151061, 151321, 152180, 153281, 154640, 156192, 157300, 157304, 156393, 155444, 155091, 155271, 155588, 155793, 155922, 156133, 156354, 156163, 155284, 154235, 153961, 154652, 155399, 155395, 154949, 154845, 155119, 155070, 154320, 153264, 152475, 152072, 151772, 151355, 150971, 151091, 152027, 153476, 154727, 155365, 155545, 155588, 155685, 156075, 157042, 158476, 159838, 160771, 161398, 161827, 161789, 161044, 159832, 158685, 158082, 158364, 159477, 160679, 161127, 160998, 161387, 162746, 164181, 164758, 164748, 164909, 165250, 165355, 165454, 166193, 167573, 169026, 170414, 172164, 174308, 176121, 176845, 176326, 174932, 173273, 172027, 171586, 171809, 172304, 172837, 173218, 173077, 172188, 170867, 169662, 168781, 168133, 167690, 167432, 167159, 166780, 166594, 166869, 167336, 167562, 167648, 168077, 168914, 169611, 169643, 169116, 168680, 168919, 169698, 170163, 169721]
54217A69721p86j3R28Q69L8n82r34j576k134j686o13l47j077j374o22j8m89j189
54199A58116j040l81J3L32R89J473J138L48k03n21p95o27J69P45L40m53n15J98
54181A59326Q56J072J035Q08M35L11O93J173J345J430J565J181l7j238j448r33
54165A67574o47p94r53j079j369j553j310r86r45p92j62K71k15r34o49N32J436
54148A57425J726K020K315J812M73n89o22L0Q32J559J754Q87n61j285q71l36m96
54131A66073q79p83m42l96m71j56N60J332J943K143J572M46j99M03J785K982L787
54114A79700M530M996M526L290K540L119M303M644L690K267J130O7j439l149m301
54099B09913m650m615m486m081l339k624k186j856j520j350j278q37oM40j4o47
$$ y = [169721, 168935, 168922, 169850, 170719, 170757, 170175, 169241, 167665, 165531, 163845, 163232, 162885, 161808, 160434, 159812, 159794, 159305, 158116, 157076, 156695, 156708, 157040, 158029, 159502, 160640, 160988, 160785, 160264, 159469, 158842, 159011, 159756, 160096, 159643, 159128, 159326, 160182, 161254, 162289, 163097, 163532, 163843, 164536, 165709, 167054, 168484, 170049, 171230, 171193, 169955, 168507, 167574, 166927, 166133, 165180, 164101, 162732, 161179, 159869, 158883, 157938, 157146, 156984, 157255, 157040, 156106, 155457, 155989, 157425, 159151, 161171, 163486, 165298, 165771, 165182, 164560, 164590, 165422, 166981, 168735, 169622, 169061, 167776, 166905, 166569, 166073, 165194, 164411, 163969, 163573, 163102, 162946, 163506, 164838, 166781, 168924, 170496, 170942, 170743, 171146, 172931, 175913, 179700, 184230, 189226, 193752, 197042, 199582, 202701, 207004, 211648, 215338, 217605, 218735, 218802, 217363, 214214, 209913, 205263, 200648, 196162, 192081, 188742, 186118, 183932, 182076, 180556, 179206, 177928, 177091, 177085, 177525, 177511, 176864]
54083A76864m17O04J394J382R48O25N40O26Q09R43R83J172J571J661R90J9l51
54066A90363k6K66J83J62M54N66O4o59r61q46q36j082j099m23P73J872K508K883
54048A94162L272L489L165K509K300K946L998M767N043M913M497M187M611N815
54034B49674O941P287P213P377P594P252O450N753N069L843K331J616K057K679
54020C23136K514J764J197R27N10k20r33j375j736k404l517m828n967o828p511
54005B94729p871p419n995m265l205l104l402l409k896k092j433j231j441j741
53991B45225j970k224k455k387k009j662j400q36J0L61j57p29m32M50J105J640
53975B32530K780M453N864O827P769Q395P606N130K177q9j852l842n952p306p373
$$ y = [176864, 176447, 177051, 178445, 179827, 180775, 181400, 181940, 182566, 183375, 184318, 185301, 186473, 188044, 189705, 190695, 190714, 190363, 190337, 190603, 190786, 190948, 191402, 191968, 192032, 191373, 190412, 189566, 188730, 187648, 186549, 186126, 186899, 188771, 191279, 194162, 197434, 200923, 204088, 206597, 208897, 211843, 215841, 220608, 225651, 230564, 235061, 239248, 243859, 249674, 256615, 263902, 271115, 278492, 286086, 293338, 299788, 305541, 310610, 314453, 316784, 318400, 320457, 323136, 325650, 327414, 328611, 329538, 330048, 329828, 328895, 327520, 325784, 323380, 319863, 315035, 309068, 302240, 294729, 286858, 279439, 273444, 269179, 265974, 262870, 259468, 256059, 253163, 251071, 249638, 248407, 246966, 245225, 243255, 241031, 238576, 236189, 234180, 232518, 231118, 230282, 230292, 230653, 230496, 229767, 229335, 229785, 230890, 232530, 235310, 239763, 245627, 252454, 260223, 268618, 276224, 281354, 283531, 283442, 281590, 277748, 271796, 264490, 257117]
53960B57117o480n415m664l939k483k14J701K030J060K58M03R36J246J530J990
53945B45076K189J844J535J910K694L141L121L101L350L712M014M158L911L099
53931B86855J999J225J130J526J985K327K801L769N248O785P833Q093P558O537
53917C45671N802O218P742R240R757R599R544R423Q478O888N789N618N468M438
53903D49675K808J430O16J03m09j099j980k750l131l489m551o290p742q198p961
53888D07032p654p467p502q085r139r809r341q019o680n728n110m827m851m816
53874C08004m408l944l933m278m350l871l281l149l606m298m698m495l839l244
53860B52610l115l432l796l689k804j432m63n48j293j699j425j034r53r97r94
$$ y = [257117, 250637, 245222, 240558, 236619, 234136, 233922, 235623, 237653, 238713, 238971, 239374, 240310, 241556, 243086, 245076, 247265, 249109, 250644, 252554, 255248, 258389, 261510, 264611, 267961, 271673, 275687, 279845, 283756, 286855, 288854, 290079, 291209, 292735, 294720, 297047, 299848, 303617, 308865, 315650, 323483, 331576, 339134, 345671, 351473, 357691, 365433, 374673, 384430, 394029, 403573, 412996, 421474, 428362, 434151, 439769, 445237, 449675, 452483, 453913, 454529, 454632, 454223, 453124, 451144, 448394, 445263, 441774, 437223, 430933, 423191, 414993, 407032, 399378, 391911, 384409, 376324, 367185, 357376, 348035, 340016, 333336, 327608, 322498, 317671, 312820, 308004, 303596, 299652, 295719, 291441, 287091, 283220, 279939, 276790, 273184, 268886, 264188, 259693, 255854, 252610, 249495, 246063, 242267, 238578, 235774, 234342, 233879, 233331, 232038, 230339, 228914, 227880, 226927, 225930, 224936]
53845B24936j173j500j352m95K82J29o97j271j187o51K10J310K052J721M95n92
53829B22217q73o95o21n72j21P07J312J169L49n79j041q49k04N61J235J801K393
53812B26189L142L877M157L687K756K041K063K900M271N613O243N888N053M540
53798B82420M675N281O138O989P292O711N793N432N575N289M251L222K686J988
53784C53742N24j025j570j234j153j891k948l745m298m816n278n654n998o136
53770C08520n700m786m246m864o243o910n807l542j823j607k207k491k358k462
53756B53474k881k955k459j977j882j810j517j387j642j725j162m37k02k14J55
53741B31379P00O44K4j77N33J367J313M55j94K5P20J010N19l43r79j192j045m94
$$ y = [224936, 223763, 222263, 220911, 220416, 220698, 220827, 220130, 218859, 217672, 217021, 217231, 218541, 220593, 222314, 222809, 222217, 221344, 220649, 220028, 219456, 219335, 220042, 221354, 222523, 222872, 222293, 221252, 220403, 220199, 220760, 221995, 223796, 226189, 229331, 233208, 237365, 241052, 243808, 245849, 247912, 250812, 255083, 260696, 266939, 272827, 277880, 282420, 287095, 292376, 298514, 305503, 312795, 319506, 325299, 330731, 336306, 341595, 345846, 349068, 351754, 353742, 354266, 353241, 351671, 350437, 349284, 347393, 344445, 340700, 336402, 331586, 326308, 320654, 314656, 308520, 302820, 298034, 293788, 288924, 282681, 275771, 269964, 266422, 264599, 262992, 260785, 258294, 255936, 253474, 250593, 247638, 245179, 243202, 241320, 239510, 237993, 236606, 234964, 233239, 232077, 231640, 231438, 231224, 231379, 232079, 232723, 232747, 232570, 233103, 234470, 235783, 236238, 236044, 236069, 236789, 237799, 238318, 237975, 236996, 235804, 234759, 234265]
53723B34265M85J455J803J547J380J782K495L003L037K467J274m0n91o9Q96J639
53707B56828K241K916L357L232K937L022L293L222L033L459M464N083M769M186
53693C06042M248M863M999L876J823o3r87j192j524k379l271l518l007k098j129
53678C06683l05J62J91q9n16j021j384j252o44p0Q9Ro0k07m51m13J05N72L94k11
53658C01582n30l15J10M79P39P31L06k61m78j72M80J274J925J984J381P77Q89
53641C10901J546K009K002J885J924K016K061K053J882J614J788K784M034M554
53627C43053M230L791L563L103K238J562J504J652J487J213J363J907K350K459
53613C75475K453K601K953L421L888M272M546M693M613M220L605K935K300J798
$$ y = [234265, 234750, 236205, 238008, 239555, 240935, 242717, 245212, 248215, 251252, 253719, 254993, 254953, 254362, 254293, 255189, 256828, 259069, 261985, 265342, 268574, 271511, 274533, 277826, 281048, 284081, 287540, 292004, 297087, 301856, 306042, 310290, 315153, 320152, 324028, 325851, 325788, 324801, 323609, 322085, 319706, 316435, 312917, 309910, 307812, 306683, 306378, 306540, 306731, 306642, 306126, 305105, 303721, 302469, 301825, 301755, 301844, 301853, 301793, 301586, 301135, 300722, 300827, 301399, 301793, 301582, 301052, 300737, 300847, 301326, 302065, 302796, 303102, 302841, 302363, 302191, 302671, 303945, 305870, 307854, 309235, 310012, 310901, 312447, 314456, 316458, 318343, 320267, 322283, 324344, 326397, 328279, 329893, 331681, 334465, 338499, 343053, 347283, 351074, 354637, 357740, 359978, 361540, 363044, 364696, 366183, 367396, 368759, 370666, 373016, 375475, 377928, 380529, 383482, 386903, 390791, 395063, 399609, 404302, 408915, 413135, 416740, 419675, 421975, 423773]
53599D23773J656J934K267K243J891J430P20n11j906k624k352j700j402j633k255
53584D21531l150l975m121l373k315j728j754k001k184k270k186j803j254r12
53570C88505r86j310j582j640j498j222q62m39J7L79M19k6p69j209p70M42J557
53553C79006J744J082M38M57R73J486J801K002K072J893J571J409J633K224K961
53538D02752L589M046M609N551O649P359P560P692Q019Q266Q276Q525R445J0697
53524E03035J1588J1965J2209J2593J3137J3846J4675J5424J6083J6977J8257
53513F59789J9587K0753K2076K3695K4985K5443K5588K6149K6760K6502K5424
53502I26751K4414K3746K2874K1627K0396J9119J7328J5468J4821J5665J6630
$$ y = [423773, 425429, 427363, 429630, 431873, 433764, 435194, 435914, 435403, 433497, 430873, 428521, 426821, 425419, 423786, 421531, 418381, 414406, 410285, 406912, 404597, 402869, 401115, 399114, 396930, 394660, 392474, 390671, 389417, 388505, 387519, 386209, 384627, 382987, 381489, 380267, 379405, 378966, 378983, 379362, 379781, 379755, 378986, 377777, 377007, 377449, 379006, 380750, 381832, 382270, 382727, 383700, 385186, 386987, 388989, 391061, 392954, 394525, 395934, 397567, 399791, 402752, 406341, 410387, 414996, 420547, 427196, 434555, 442115, 449807, 457826, 466092, 474368, 482893, 492338, 503035, 514623, 526588, 538797, 551390, 564527, 578373, 593048, 608472, 624555, 641532, 659789, 679376, 700129, 722205, 745900, 770885, 796328, 821916, 848065, 874825, 901327, 926751, 951165, 974911, 997785, 1019412, 1039808, 1058927, 1076255, 1091723, 1106544, 1122209, 1138839]
53491A138839J6600J6147J6367J7260J8105J8635J8893J8602J7653J6778J6720
53480A330599J7134J7060J6300J5396J4526J3231J1212Q623N656K500l04k226
53468A449707l581n286p722j0314j2387j3941j5344j6736j7987j8855j9097j8713
53456A289744j8243j8405j9298k0256k0753k1015k1439k1767k1333k0031j8585
53445A068619j7748j7494j7170j6238j4672j2742j0636q403o131m109k656j782
53433I38838j027J50J794L342M285M757N327O310P589R003J0511J1916J2983J3945
53419A029723J5447J7658J9870K1393K2433K3590K4936K6131K7236K8570K9951
53408A286938L0835L1300L2110L3585L5201L6586L8211M0558M3213M5459M7373
$$ y = [1138839, 1155439, 1171586, 1187953, 1205213, 1223318, 1241953, 1260846, 1279448, 1297101, 1313879, 1330599, 1347733, 1364793, 1381093, 1396489, 1411015, 1424246, 1435458, 1444081, 1449737, 1452237, 1451933, 1449707, 1446126, 1440840, 1433118, 1422804, 1410417, 1396476, 1381132, 1364396, 1346409, 1327554, 1308457, 1289744, 1271501, 1253096, 1233798, 1213542, 1192789, 1171774, 1150335, 1128568, 1107235, 1087204, 1068619, 1050871, 1033377, 1016207, 999969, 985297, 972555, 961919, 953516, 947385, 943276, 940620, 938838, 937811, 937961, 939755, 943097, 947382, 952139, 957466, 963776, 971365, 980368, 990879, 1002795, 1015778, 1029723, 1045170, 1062828, 1082698, 1104091, 1126524, 1150114, 1175050, 1201181, 1228417, 1256987, 1286938, 1317773, 1349073, 1381183, 1414768, 1449969, 1486555, 1524766, 1565324, 1608537, 1653996, 1701369]
53397A701369M9577N2036N3829N4311N3977N3928N4709N5876N6553N6186N4883
53386B297234N3211N1722N0487M9038M6810M3761M0466L7404L4353L0683K6254
53375B761423K1516J6734J1667O190P35m370r544j5406k1889k8439l4769m0707
53363B663141m5620m8869n0867n2791n5089n6968n7597n7124n6143n4853n3143
53352B074077n1093m8883m6612m4526m3138m2623m2417m1799m0717l9691l9012
53341A593566l8318l6989l4742l1915k9196k6951k4881k2537k0054j7951j6245
53330A293787j4327j2024j0165r631j0192j0803j0925j1006j1611j2509j2887
53319A167707j2260j0949r582q380p168n982n206m855m185k446P7K302L574M244
$$ y = [1701369, 1750946, 1802982, 1856811, 1911122, 1965099, 2019027, 2073736, 2129612, 2186165, 2242351, 2297234, 2350445, 2402167, 2452654, 2501692, 2548502, 2592263, 2632729, 2670133, 2704486, 2735169, 2761423, 2782939, 2799673, 2811340, 2817530, 2818265, 2813895, 2804351, 2788945, 2767056, 2738617, 2703848, 2663141, 2617521, 2568652, 2517785, 2464994, 2409905, 2352937, 2295340, 2238216, 2182073, 2127220, 2074077, 2022984, 1974101, 1927489, 1882963, 1839825, 1797202, 1754785, 1712986, 1672269, 1632578, 1593566, 1555248, 1518259, 1483517, 1451602, 1422406, 1395455, 1370574, 1348037, 1327983, 1310032, 1293787, 1279460, 1267436, 1257271, 1247640, 1237448, 1226645, 1215720, 1204714, 1193103, 1180594, 1167707, 1155447, 1144498, 1134916, 1126536, 1119368, 1113386, 1108180, 1103325, 1099140, 1096694, 1096771, 1099073, 1102647, 1106891]
53305A106891N052O329P913R533J1156J3026J5333J7701J9381K0206K0951K2256
53293A275728K3669K4452K4916K5948K7433K8209K7722K6615K5427K3801K1417
53282A555337J8791J6481J4184J1272P723M049O72k226m691p176j0154j3280j5631
53269A575351j7079j8677k1129k3673k5191k5794k6468k7628k8789k9392k9264
53258A302267k8557k7866k8073k9357l0641l0643k9401k8082k7499k7350k6922
53247I87876k5999k5028k4627k4919k5195k4555k2919k1053j9520j8234j7196
53236G38631j6737j6574j5609j3461j1337j0416j0097q996p155n897n785o129
53224F10438o502p399q997j0392j0723j0297j0093j0578j1411j1964j1892j1383
$$ y = [1106891, 1111943, 1118272, 1126185, 1135718, 1146874, 1159900, 1175233, 1192934, 1212315, 1232521, 1253472, 1275728, 1299397, 1323849, 1348765, 1374713, 1402146, 1430355, 1458077, 1484692, 1510119, 1533920, 1555337, 1574128, 1590609, 1604793, 1616065, 1623788, 1627837, 1628509, 1626283, 1621592, 1614416, 1604262, 1590982, 1575351, 1558272, 1539595, 1518466, 1494793, 1469602, 1443808, 1417340, 1389712, 1360923, 1331531, 1302267, 1273710, 1245844, 1217771, 1188414, 1157773, 1127130, 1097729, 1069647, 1042148, 1014798, 987876, 961877, 936849, 912222, 887303, 862108, 837553, 814634, 793581, 774061, 755827, 738631, 721894, 705320, 689711, 676250, 664913, 654497, 644400, 635404, 628249, 622352, 616567, 610438, 603936, 596537, 587540, 577148, 566425, 556128, 546035, 535457, 524046, 512082, 500190, 488807]
53212D88807j1003j1055j1183j0827r884q630p251n938n094m873m799m453m229
53199C89588m677n444n780n835o446p678q596q604q000p079n737m213l232l007
53185C05260k925k706k874l673m314m029l158k515k237j919j436r74o19m58p27
53170B70696j318j581j112l92r5j59j58j57m79q82p67j75J28l14j129j693j793
53153B58620j549j151q31p79r28j023r20o89l66MJ62j92q62j191p85nN37P47J002
53134B49801J435J698J461R02M11P0k74n45m44M9N33P05P06P33P21P22J219K482
53116B62385L784L925K678J169O01J013J545J580J244R37P76N24m8q41j455j614
53100B78203j490j502j826k312k739k978k913k499j922j432j044o43l23k67k92
$$ y = [488807, 477804, 466749, 455566, 444739, 434855, 426225, 418974, 413036, 407942, 403069, 398270, 393817, 389588, 384911, 379467, 373687, 367852, 361406, 353728, 345132, 336528, 328528, 321449, 315712, 311499, 308267, 305260, 302335, 299629, 296755, 293082, 288768, 284739, 281581, 279066, 276829, 274910, 273474, 272500, 271881, 271423, 270696, 269378, 267797, 266685, 266293, 266198, 266039, 265881, 265724, 265245, 264363, 263596, 263421, 263549, 263235, 262106, 260413, 258620, 257071, 255920, 255089, 254310, 253382, 252359, 251439, 250750, 250384, 250388, 250550, 250358, 249496, 248305, 247520, 247515, 248052, 248799, 249801, 251236, 252934, 254395, 255297, 255708, 255778, 255504, 254959, 254515, 254564, 255097, 255802, 256508, 257241, 257962, 258684, 259903, 262385, 266169, 270094, 272772, 273941, 274542, 275555, 277100, 278680, 279924, 280861, 281637, 282161, 282113, 281272, 279817, 278203, 276713, 275211, 273385, 271073, 268334, 265356, 262443, 259944, 258022, 256590, 255546, 254903, 254580, 254313, 254021]
53085B54021LN45O85J12n79o12p4K38j34q55j390j625j696j564j094m79k02m27
53067B44873p29o88n35p93j296j201k46O34M63m13q48n23j85k71k01O19J772K398
53049B42830K185J383K81q13j323r05l0M76M11K39J85j26r18j703j819j265o15
53032B38473k17J21N97R62Q02J87l32m13l62o20j057j091n38J28M60O46J031J391
53014B40168J198N57K77P93J481J491Q66L52K37J00k33k12N32J357J327M52m54
52997B50289r80j361j579j072K37J422J617J107P89R26J113J176J417J946K424
52982B59471K548K362J992J444P34m6p90j316j298o48J32M02J40j32r0J43N14
52965B65562J199K129K775K736K195J601J120O42R0n04j093j640k110k538k970
$$ y = [254021, 254024, 254569, 255254, 255366, 254787, 254175, 254101, 254339, 254205, 253350, 251960, 250335, 248639, 247075, 245981, 245502, 245300, 244873, 244144, 243456, 242921, 242128, 240832, 239631, 239385, 240019, 240482, 240069, 239221, 238698, 238513, 238242, 238041, 238660, 240432, 242830, 245015, 246398, 246679, 245866, 244543, 243638, 243608, 244084, 244495, 244734, 244919, 244793, 243875, 242172, 240353, 239088, 238473, 238256, 238377, 238974, 239936, 240738, 240925, 240593, 240180, 239818, 239198, 238141, 237050, 236512, 236640, 237100, 237746, 238777, 240168, 241366, 241923, 242200, 242993, 244474, 245965, 246831, 247183, 247420, 247520, 247287, 247075, 247607, 248964, 250291, 250743, 250289, 249309, 247948, 246369, 245297, 245534, 246956, 248573, 249680, 250469, 251395, 252508, 253684, 255101, 257047, 259471, 262019, 264381, 266373, 267817, 268551, 268505, 267715, 266399, 265101, 264453, 264585, 264987, 265127, 264995, 264905, 265048, 265562, 266761, 268890, 271665, 274401, 276596, 278197, 279317, 279959, 280049, 279545, 278452, 276812, 274702, 272164, 269194]
52950B69194l309l342k940k180j282n63k96m06m41j35J11l13j317k085j946r74
52934B47776K95J332J754J440P08J11p5NJ14J00j98p97j230r36j10K88k83j140
52916B49154j139m3J266J772J265L36k67k63N4K00ml50m92k30L70R64J138Q25
52898B54556L85P6k89q60j215r14l17j91m72k66P42J608J364L43l56l06o8k37
52880B53583p17r98p58q8P32J507K236K895L267L186K861K707K780K742K425K082
52864B80442J928J750J188K30q53j830k600l066l064k533j686j111j329k169k821
52849B62476k847k782l213l687l326k322j816k205k563k133j409j156j197q21
52835B30999J05J108J762J793J043o3n36J03J091J445J194R08N07m42j553j831
$$ y = [269194, 265885, 262543, 259603, 257423, 256141, 255578, 255282, 254876, 254435, 254300, 254411, 254098, 252781, 250696, 248750, 247776, 248071, 249403, 251157, 252597, 253305, 253416, 253341, 253346, 253460, 253560, 253362, 252565, 251335, 250399, 250289, 250577, 250294, 249154, 248015, 247972, 249238, 251010, 252275, 252611, 252344, 252081, 252135, 252335, 252331, 251981, 251489, 251259, 251629, 252593, 253731, 254556, 254941, 255017, 254728, 253868, 252653, 251739, 251422, 251231, 250759, 250493, 251235, 252843, 254207, 254550, 254194, 253888, 253820, 253583, 252866, 251868, 251110, 251022, 251754, 253261, 255497, 258392, 261659, 264845, 267706, 270413, 273193, 275935, 278360, 280442, 282370, 284120, 285308, 285538, 284685, 282855, 280255, 277189, 274125, 271592, 269906, 268795, 267466, 265297, 262476, 259629, 256847, 253634, 249947, 246621, 244299, 242483, 240278, 237715, 235582, 234173, 233017, 231820, 230999, 231104, 232212, 233974, 235767, 236810, 236747, 236211, 236314, 237405, 238850, 240044, 240952, 241459, 241017, 239464, 237633]
52819B37633j160n73q13j419j546j026k01O97J580K220K423K243J829J235N47
52804B43669q3o77j408k165k404j802q36m03q30j560j830j500j064r59j040q63
52788B24245l40J16J73ll6J40L27M35N26N23K40k17l88J9O92J005O95Q2l28l45
52768B27561j40nj40n85j109j213m97Q12J905K160J703J106P24O03P29J004J147
52751B35765J025R68J256J491J058J83j81K69P17M09k78m85n3N14Q82J099J162
52734B45801R44N29K05J49L43P62J313J732J728J228L54o52j399j556j302j210
52718B48969j481j637j337j011j176j466j027K15J357J610J085L59j96m36k40
52703B43588L56R57J068N85m4k48J14O38Q70Q18Q08R18Q40L74k62p08q34o92m31
$$ y = [237633, 236473, 235900, 235087, 233668, 232122, 231096, 230895, 231592, 233172, 235392, 237815, 240058, 241887, 243122, 243669, 243586, 242909, 241501, 239336, 236932, 235130, 234294, 233891, 233061, 231501, 229671, 228171, 227107, 226148, 225108, 224245, 223905, 224021, 224194, 224191, 224155, 224295, 224622, 225057, 225583, 226106, 226346, 226129, 225741, 225760, 226452, 227457, 228152, 228234, 227906, 227561, 227421, 227416, 227276, 226691, 225582, 224369, 223872, 224684, 226589, 228749, 230452, 231558, 232282, 232885, 233614, 234618, 235765, 236790, 237758, 239014, 240505, 241563, 241746, 241565, 241834, 242551, 242960, 242682, 242197, 242144, 242658, 243540, 244639, 245801, 246745, 247274, 247479, 247628, 247971, 248733, 250046, 251778, 253506, 254734, 255088, 254436, 253037, 251481, 250179, 248969, 247488, 245851, 244514, 243503, 242327, 240861, 239834, 240049, 241406, 243016, 244101, 244460, 244264, 243828, 243588, 243944, 244901, 245969, 246554, 246510, 246262, 246376, 247014, 247884, 248702, 249510, 250428, 251268, 251642, 251380, 250672, 249838, 249146, 248715]
52684B48715k54k07N2Q13J545J191l94j867j873p36J1l41q81l80J140K464K514
52667B51512J430K78j12Q6J51j62m25k54K84J032J937K738K954K549K108K018
52651B68124J978J673J385J396J297N09q30k070k838l132k970k496k099j919j503
52636B56505n15N57J048J068J136J313J436J778K511K874K031N53r4L06M04o67
52620B72244k058k569k202j707j378j098r03q13m61L68J173J339J088J132J573
52605B65728J707J031q3q43q49l26K27M23J54l93q53r22n91j33K38O53J285J862
52587B68315J913J549J473J907K169J722J114J110J402J095K19k70o9L8m88j043
52571B82156q92k95k4k70o53r50j226j373j125n13L2R1l53r64j376j512j522j415
$$ y = [248715, 248461, 248254, 248306, 249119, 250664, 251855, 251461, 249594, 247721, 246985, 246996, 246655, 245774, 245394, 246534, 248998, 251512, 252942, 253220, 253108, 253194, 253345, 253183, 252758, 252504, 252788, 253820, 255757, 258495, 261449, 263998, 266106, 268124, 270102, 271775, 273160, 274556, 275853, 276362, 275532, 273462, 270624, 267492, 264522, 262026, 259927, 258008, 256505, 255990, 256547, 257595, 258663, 259799, 261112, 262548, 264326, 266837, 269711, 271742, 272295, 272201, 272507, 272911, 272244, 270186, 267617, 265415, 263708, 262330, 261232, 260329, 259516, 259055, 259423, 260596, 261935, 263023, 264155, 265728, 267435, 268466, 268383, 267540, 266691, 266365, 266592, 267015, 267169, 266776, 265923, 265001, 264410, 264277, 264515, 265168, 266453, 268315, 270228, 271777, 273250, 275157, 277326, 279048, 280162, 281272, 282674, 283769, 283988, 283718, 283649, 283687, 283199, 282156, 281264, 280969, 280945, 280675, 280022, 279072, 277846, 276473, 275348, 274835, 274867, 274958, 274605, 273641, 272265, 270753, 269231, 267816]
52553B67816r18J5Q02P47q4r09j176r94o62k28K85O79Q10P38N34J82k26n21o89
52534B66201p59m82M14J614K309K126J503J062R41R67J050J147J140J007Q63P14
52518B81817M36J34K62J108K410L565M090L921L427L127L146L067K597K095J948
52503C17150J697N07j498l169l776l781l924m170m017l306k349j531j113j121
52489B85599j255j150q67p10n66J6R49J489J183M23k66q25j249j234o51J33Q64
52472B81883J778K898L516L030J941J355J716K492L013L164L323L835M491M462
52458C22897L134R99p92j837k725l692m023l380k743l101l918l924l049k357k288
52443B89201k134j398n81k92l58l19k35m95j104j633j686j250o24j82j05k88m51
$$ y = [267816, 266898, 266913, 267715, 268462, 268378, 267469, 266293, 265299, 264637, 264409, 264694, 265373, 266183, 266921, 267455, 267637, 267411, 266890, 266201, 265442, 264960, 265374, 266988, 269297, 271423, 272926, 273988, 274929, 275896, 276946, 278093, 279233, 280240, 281103, 281817, 282253, 282387, 282649, 283757, 286167, 289732, 293822, 297743, 301170, 304297, 307443, 310510, 313107, 315202, 317150, 318847, 319354, 317856, 314687, 310911, 307130, 303206, 299036, 295019, 291713, 289364, 287833, 286720, 285599, 284344, 283194, 282327, 281617, 281051, 281067, 282016, 283505, 284688, 285111, 284845, 284020, 282771, 281537, 280886, 281019, 281883, 283661, 286559, 290075, 293105, 295046, 296401, 298117, 300609, 303622, 306786, 310109, 313944, 318435, 322897, 326031, 327030, 326238, 324401, 321676, 317984, 313961, 310581, 307838, 304737, 300819, 296895, 293846, 291489, 289201, 287067, 285669, 285088, 284796, 284438, 284119, 283884, 283389, 282285, 280652, 278966, 277716, 277092, 276910, 276805, 276517, 276066]
52426B76066l53N6N75P90M84Nl1M50R07J060J334K087K856K952K552K561L507
52409B97858N036O468P445Q003Q416Q911R319R020P469M720J285k248n259p127
52395C59316p683p455p068o571n709m604l696l100k549j864j111l88K02M86N24
52380C08730P62J467K215K438K262K276K603K899L172L839M841N456N267M716
52366C52943M307L813K687R91o07j585j983k140k277k363k229j781j140m99Q3
52351C48220N95Q98Q62O59O34Q69J096J147J206J482J914K361K841L380L747L691
52335C75602L432L597M548N905O965P539Q075Q986J0111J1002J1539J2014J2697
52322D82012J3589J4517J5200J5370J5094J4826J4845J4825J4404J3985J4281
$$ y = [276066, 275713, 275769, 276344, 277134, 277618, 277623, 277592, 278042, 278949, 280009, 281343, 283430, 286286, 289238, 291790, 294351, 297858, 302894, 309362, 316807, 324810, 333226, 342137, 351456, 360476, 367945, 372665, 373950, 371702, 366443, 359316, 351633, 344178, 337110, 330539, 324830, 320226, 316530, 313430, 310881, 309017, 307906, 307518, 307720, 308206, 308730, 309492, 310959, 313174, 315612, 317874, 320150, 322753, 325652, 328824, 332663, 337504, 342960, 348227, 352943, 357250, 361063, 363750, 364741, 364134, 362549, 360566, 358426, 356149, 353786, 351557, 349776, 348636, 348137, 348220, 348815, 349713, 350575, 351234, 351868, 352737, 353833, 354980, 356186, 357668, 359582, 361943, 364784, 368164, 371911, 375602, 379034, 382631, 387179, 393084, 400049, 407588, 415663, 424649, 434760, 445762, 457301, 469315, 482012, 495601, 510118, 525318, 540688, 555782, 570608, 585453, 600278, 614682, 628667, 642948]
52311F42948J5193J5853J5883J5841J6147J6435J6336J6218J6509J6923J7004
52300H21290J6915J6954J6744J5688J3920J2027J0000P318M032J008j055k348
52288I32493l566n140o883q102q148p158o127n895o286o529o236n492m351k892
52274H49688j519n82K54J627L538N320O490P123P396P437P516P858Q283Q579R139
52259I28147J0531J2507J4168J5160J5939J6725J6976J6261J5011J3943J3173
52248A088541J2170J0325P413L829M72k018l949o015q114r416r738r935j0594
52235A062971j1221j1327j1554j2735j4319j4820j3831j2584j2261j2510j2167
52224I23642j0937r651q970q528p622o253n054m313l631k622j520q54p32o98j46
$$ y = [642948, 658141, 673994, 689877, 705718, 721865, 738300, 754636, 770854, 787363, 804286, 821290, 838205, 855159, 871903, 887591, 901511, 913538, 923538, 930856, 934888, 935896, 934841, 932493, 928927, 923787, 916904, 908802, 900654, 893496, 887369, 881474, 875188, 868659, 862423, 856931, 852580, 849688, 848169, 847587, 847841, 849468, 853006, 858326, 864816, 871939, 879335, 886772, 894288, 902146, 910429, 919008, 928147, 938678, 951185, 965353, 980513, 996452, 1013177, 1030153, 1046414, 1061425, 1075368, 1088541, 1100711, 1111036, 1118449, 1122278, 1122750, 1120732, 1116783, 1110768, 1102654, 1093238, 1083500, 1073565, 1062971, 1051750, 1040423, 1028869, 1016134, 1001815, 986995, 973164, 960580, 948319, 935809, 923642, 912705, 903054, 894084, 885556, 877934, 871681, 866627, 862314, 858683, 856061, 854541, 853687, 852955, 852257, 852111]
52209H52111J172K798L722L339K365K240L315M275L860K514J645J745K197K602
52195H89900L299M537O000P312Q343Q912Q809Q129P062N460L211R80m08j245k721
52180I57580n130p310q215q235q440r175r907r999r141p514n829m782m185l223
52166H56495j722m05L74J308K975M791N839O084N984N421M020K116N73l26r47
52151H92580j405j351p36j06P5k8P6O78J617K378K434J786J020O46N54M45M58
52134I01121R41J798K654L551M892O677Q415R894J1533J3683J6043J8184K0236
52121A019622K2585K4978K6548K6837K6418K6184K6251K5971K4926K3429K1924
52110A295673K0376J8586J6661J4764J2742J0520Q636P736P594P311O545N803
$$ y = [852111, 853283, 856081, 859803, 863142, 865507, 867747, 871062, 875337, 879197, 881711, 883356, 885101, 887298, 889900, 893199, 897736, 903736, 911048, 919391, 928303, 937112, 945241, 952303, 957763, 960974, 961954, 961546, 960301, 957580, 952450, 945140, 936925, 928690, 920250, 911075, 901168, 891169, 882028, 874514, 868685, 863903, 859718, 856495, 854773, 854368, 854742, 856050, 859025, 863816, 869655, 875739, 881723, 887144, 891164, 893280, 893853, 893527, 892580, 891175, 889824, 889088, 888982, 889057, 889029, 889105, 889783, 891400, 893778, 896212, 897998, 899018, 899664, 900218, 900663, 901121, 902062, 903860, 906514, 910065, 914957, 921634, 930049, 939943, 951476, 965159, 981202, 999386, 1019622, 1042207, 1067185, 1093733, 1120570, 1146988, 1173172, 1199423, 1225394, 1250320, 1273749, 1295673, 1316049, 1334635, 1351296, 1366060, 1378802, 1389322, 1397958, 1405694, 1413288, 1420599, 1427144, 1432947]
52098A432947N367M662L084Q79j257l197n447q449j2085j5777j8803k0710k1537
52085A339677k1584k0993j9759j8099j6333j4522j2639j1062j0228r762q646o515
$$ y = [1432947, 1438314, 1442976, 1446060, 1446939, 1445682, 1442485, 1437038, 1428589, 1416504, 1400727, 1381924, 1361214, 1339677, 1318093, 1297100, 1277341, 1259242, 1242909, 1228387, 1215748, 1204686, 1194458, 1184696, 1176050, 1169535]
$$ [...]
##END NTUPLES=NMR SPECTRUM
##END=
