##TITLE=AC1767_ROS_6_9683651_yFpQTs1wg7
##JCAMPDX= 6.0         $$ Bruker NMR JCAMP-DX V2.0
##DATA TYPE= NMR SPECTRUM
##DATA CLASS= NTUPLES
##ORIGIN= BRUKER
##OWNER= Administrator
$$ 1.72 TOPSPIN		Version 2.1
$$ 2016-04-16 18:08:41.423 -0700  Administrator@X
$$ Compression mode = diff/dup
##.OBSERVE FREQUENCY= 400.02188249412
##.OBSERVE NUCLEUS= ^1H
##.ACQUISITION MODE= SIMULTANEOUS (DQD)
##.ACQUISITION SCHEME= undefined
##.AVERAGES= 8
##.DIGITISER RES= 22
##SPECTROMETER/DATA SYSTEM= spect
##.PULSE SEQUENCE= zg30
##.SOLVENT NAME= COFFEE_meoh
##.SHIFT REFERENCE= INTERNAL, COFFEE_meoh, 1, 14.98509
##AUDIT TRAIL= $$ (NUMBER, WHEN, WHO, WHERE, PROCESS, VERSION, WHAT)
$$ ##TITLE= Audit trail, TOPSPIN		Version 2.1
$$ ##JCAMPDX= 5.01
$$ ##ORIGIN= Bruker BioSpin GmbH
$$ ##OWNER= Administrator
$$ $$ E:\/data/COFFEE/nmr/AC1767_ROS_6_9683651_yFpQTs1wg7/10/pdata/1/auditp.txt
$$ ##AUDIT TRAIL=  $$ (NUMBER, WHEN, WHO, WHERE, PROCESS, VERSION, WHAT)
(   1,<2016-04-16 18:08:34.033 -0700>,<Administrator>,<X>,<go>,<TOPSPIN 2.1>,
      <created by zg
	started at 2016-04-16 18:07:27.861 -0700,
	POWCHK enabled, PULCHK disabled,
       configuration hash MD5:
       21 0F 79 D6 B3 7B B4 F6 88 20 88 DB 03 48 BD 9F
       data hash MD5: 64K
       CA 79 A9 E0 33 C5 CC 62 74 4E 1C DC 05 59 87 4A>)
(   2,<2016-04-16 18:08:37.142 -0700>,<Administrator>,<X>,<proc1d>,<TOPSPIN 2.1>,
      <Start of raw data processing
       efp LB = 0 FT_mod = 6 PKNL = 1 PHC0 = 0 PHC1 = 0 SI = 32K 
       data hash MD5: 32K
       33 34 DA F1 10 62 E2 70 C4 48 3C 17 B4 0A 50 1D>)
(   3,<2016-04-16 18:08:37.439 -0700>,<Administrator>,<X>,<proc1d>,<TOPSPIN 2.1>,
      <pk PHC0 = 87.76978 PHC1 = 0 
       data hash MD5: 32K
       32 7B 81 12 52 65 3A 16 C4 DD 74 A3 AC 66 3A 20>)
(   4,<2016-04-16 18:08:37.548 -0700>,<Administrator>,<X>,<proc1d>,<TOPSPIN 2.1>,
      <abs ABSG = 1 
       data hash MD5: 32K
       5A 39 DA 1C DB E6 C8 95 07 78 C2 54 64 CA AD 8C>)
(   5,<2016-04-16 18:08:37.611 -0700>,<Administrator>,<X>,<proc1d>,<TOPSPIN 2.1>,
      <abs ABSG = 2 
       data hash MD5: 32K
       6C D4 26 87 2C 62 29 98 70 46 52 07 98 5B 89 67>)
(   6,<2016-04-16 18:08:37.673 -0700>,<Administrator>,<X>,<proc1d>,<TOPSPIN 2.1>,
      <abs ABSG = 3 
       data hash MD5: 32K
       E7 A0 AD E7 A2 B5 31 DE A7 53 CE 10 BE 20 ED A8>)
(   7,<2016-04-16 18:08:37.736 -0700>,<Administrator>,<X>,<proc1d>,<TOPSPIN 2.1>,
      <abs ABSG = 4 
       data hash MD5: 32K
       52 E3 DE D0 6B AE C1 AB FF 02 A4 1F AE 60 EB FA>)
(   8,<2016-04-16 18:08:37.814 -0700>,<Administrator>,<X>,<proc1d>,<TOPSPIN 2.1>,
      <abs ABSG = 5 
       data hash MD5: 32K
       F2 6A 6C 53 93 E4 DB 19 2F 67 C5 DC AF 80 43 FE>)
$$ ##END=
$$ 
$$ $$ hash MD5
$$ $$ 79 EA B0 1D E3 9E E0 AB F4 04 9E D4 D1 EC CF 30
##$RELAX= 
##$RELAX= 
##$RELAX= 
##$RELAX= 
##$RELAX= 
##$RELAX= 
##$RELAX= 
$$ Bruker specific parameters
$$ --------------------------
##$DU= <E:\>
##$EXPNO= 10
##$NAME= <AC1767_ROS_6_9683651_yFpQTs1wg7>
##$PROCNO= 1
$$ [...]
150 150 150 150 150 150 150 150
##$TP07= 0
##$TPNAME0= <>
##$TPNAME1= <>
##$TPNAME2= <>
##$TPNAME3= <>
##$TPNAME4= <>
##$TPNAME5= <>
##$TPNAME6= <>
##$TPNAME7= <>
##$TPOAL= (0..7)
0.5 0.5 0.5 0.5 0.5 0.5 0.5 0.5
##$TPOFFS= (0..7)
0 0 0 0 0 0 0 0
##$TUNHIN= 0
##$TUNHOUT= 0
##$TUNXOUT= 0
##$USERA1= <user>
##$USERA2= <user>
##$USERA3= <user>
##$USERA4= <user>
##$USERA5= <user>
##$V9= 5
##$VALIST= <valist>
##$VCLIST= <CCCCCCCCCCCCCCC>
##$VD= 0
##$VDLIST= <DDDDDDDDDDDDDDD>
##$VPLIST= <PPPPPPPPPPPPPPP>
##$VTLIST= <TTTTTTTTTTTTTTT>
##$WBST= 2048
##$WBSW= 25
##$XGAIN= (0..3)
0 0 0 0
##$XL= 0
##$YL= 0
##$YMAX_a= 554814
##$YMIN_a= -489140
##$ZGOPTNS= <>
##$ZL1= 120
##$ZL2= 120
##$ZL3= 120
##$ZL4= 120
##$ABSF1= 14.98509
##$ABSF2= -5.573092
##$ABSG= 5
##$ABSL= 3
##$ALPHA= 0
##$AQORDER= 0
##$ASSFAC= 0
##$ASSFACI= 0
##$ASSFACX= 0
##$ASSWID= 0
##$AUNMP= <proc_prof1d_extract_pilot.lims>
##$AXLEFT= 0
##$AXNAME= <>
##$AXNUC= <1H>
##$AXRIGHT= 0
##$AXTYPE= 0
##$AXUNIT= <>
##$AZFE= 0.1
##$AZFW= 0.1
##$BCFW= 0
##$BC_mod= 0
##$BYTORDP= 0
##$COROFFS= 0
##$CY= 15
##$DATMOD= 1
##$DC= 0
##$DFILT= <>
##$DTYPP= 0
##$F1P= 0
##$F2P= 0
##$FCOR= 0.5
##$FTSIZE= 32768
##$FT_mod= 6
##$GAMMA= 0
##$GB= 0
##$INTBC= 1
##$INTSCL= 1
##$ISEN= 128
##$LB= 0
##$LEV0= 0
##$LPBIN= 0
##$MAXI= 10000
##$MC2= 0
##$MEAN= 0
##$ME_mod= 0
##$MI= 0
##$NCOEF= 0
##$NC_proc= -8
##$NLEV= 6
##$NOISF1= 0
##$NOISF2= 0
##$NSP= 0
##$NTH_PI= 0
##$NZP= 0
##$OFFSET= 14.98509
##$PC= 1
##$PHC0= 87.76978
##$PHC1= 0
##$PH_mod= 1
##$PKNL= yes
##$PPARMOD= 0
##$PPDIAG= 0
##$PPIPTYP= 0
##$PPMPNUM= 2147483647
##$PPRESOL= 1
##$PSCAL= 4
##$PSIGN= 0
##$PYNMP= <proc.py>
##$REVERSE= no
##$SF= 400.02
##$SI= 32768
##$SIGF1= 0
##$SIGF2= 0
##$SINO= 400
##$SIOLD= 32768
##$SPECTYP= <>
##$SREGLST= <1H.CDCl3>
##$SSB= 0
##$STSI= 32768
##$STSR= 0
##$SW_p= 8223.68421052631
##$SYMM= 0
##$S_DEV= 0
##$TDeff= 65536
##$TDoff= 0
##$TI= <>
##$TILT= no
##$TM1= 0
##$TM2= 0
##$TOPLEV= 0
##$USERP1= <user>
##$USERP2= <user>
##$USERP3= <user>
##$USERP4= <user>
##$USERP5= <user>
##$WDW= 1
##$XDIM= 32768
##$YMAX_p= 447281681
##$YMIN_p= -716980
##$CURPLOT= <Network HP LaserJet P1505>
##$CURPRIN= <$Network HP LaserJet P1505>
##$DFORMAT= <normdp>
##$LAYOUT= <+/1D_H.xwp>
##$LFORMAT= <normlp>
##$PFORMAT= <normpl>
##$SURQMSG= 1
$$ End of Bruker specific parameters
$$ ---------------------------------
##NTUPLES= NMR SPECTRUM
##VAR_NAME=  FREQUENCY,     SPECTRUM/REAL,   SPECTRUM/IMAG
##SYMBOL=    X,             R,               I
##VAR_TYPE=  INDEPENDENT,   DEPENDENT,       DEPENDENT
##VAR_FORM=  AFFN,          ASDF,            ASDF
##VAR_DIM=   32768,         32768,           32768
##UNITS=     HZ,            ARBITRARY UNITS, ARBITRARY UNITS
##FACTOR=    0.250966925370066, 1,           1
##FIRST=     8223.43324360094, -23440,       77557
##LAST=      0,             -33196,          -159048
##MIN=       0,             -716980,         0
##MAX=       8223.43324360094, 447281681,    0
$$ Real data points
##PAGE= N=1
##DATA TABLE= (X++(R..R)), XYDATA
$$ [...]
19574b19022E8110a71596A35308A2442b33959d5189j0430l36555A45847A9630
$$ -219022 58110 -171596 135308 12442 -233959 -45189 -55619 -392174 145847 19630
19563b09530Q8608F9583P7070K91684b3247B2793K9936c79385a27805l58651b17805
$$ -209530 -120922 69583 146653 438337 -23247 22793 52729 -379385 -127805 -486456 -217805
19551a87530A31526J16653b90059F7545a09239C6727d60562i9345D1424a352j62358
$$ -187530 131526 248179 -290059 67545 -109239 36727 -460562 -99345 41424 -1352 -163710
19540a63710b3492j71955c5069n4829C15885a49591C22145d0668H3099b3484Q23
$$ -163710 -23492 -195447 -35069 -89898 315885 -149591 322145 -40668 83099 -23484 -22661
19529b2661B4847a50260p9048e8403A87933q6824b00424C7659c475j96619O9362
$$ -22661 24847 -150260 -229308 -58403 187933 101109 -200424 37659 -3475 -200094 -130732
19518a30732A81852a26079F2072R4295g9296k4273L5376C4318b41755C1506a69539
$$ -130732 181852 -126079 62072 156367 -79296 -103569 -68193 34318 -241755 31506 -169539
19506H4345C542M8366c11238A07069q334l4143J45755I8919c303A8135O0091i0189
$$ 84345 3542 51908 -311238 107069 98735 64592 210347 98919 -3303 18135 78226 -90189
19493h8875p5303G6415J31965B2912i3159M2943A90372a2122l99133f9580j96613
$$ -88875 -164178 76415 208380 22912 -93159 -50216 190372 -12122 -411255 -69580 -266193
19482b66193A29289a21937m2623E4120i538k70849B11145g1682b7420i656o7794
$$ -266193 129289 -121937 -164560 54120 -9538 -280387 211145 -71682 -27420 -9656 -77450
19471g7450K2082n2595j02946A2641K38049c87740E2048J4480J28590j2278b04787
$$ -77450 -55368 -107963 -210909 12641 250690 -387740 52048 66528 195118 182840 -204787
19459h2375E014K00177b91662A20556D5578J43953C3961a61200o1918O8539I2990
$$ -82375 5014 205191 -291662 120556 45578 189531 33961 -161200 -223118 -154579 92990
19447A25012l8464h828j58520L2337A56471c38495e5909A1627J98336M6714a24661
$$ 125012 86548 -8828 -167348 -135011 156471 -338495 -55909 11627 209963 256677 -124661
19435G5300c9207G1255a95864i1350J3982B06062I5425C8062i7763a8435A85010
$$ 75300 -39207 71255 -195864 -91350 -77368 206062 95425 38062 -97763 -18435 185010
19423f9496E6047c25441G8904h8621m6064N8158b365m24117J79283G5365C757
$$ -69496 56047 -325441 78904 -88621 -134685 -76527 -2365 -426482 -247199 75365 3757
19411g8167A71526d2455m0151k79392B3363K04585O2239A44545b35815b6602j61792
$$ -78167 171526 -42455 -82606 -361998 23363 227948 290187 144545 -235815 -26602 -188394
19400a88394B48473c21466K8943R2932i7237l2855b6145A20490e2365F346b60698
$$ -188394 248473 -321466 -292523 -199591 -97237 -130092 -26145 120490 -52365 6346 -260698
19388A1996P088b118k1988j83695r8123a22242j5433A21662a85035K2409L9695
$$ 11996 19084 -2118 -24106 -207801 -305924 -122242 -137675 121662 -185035 -162626 -122931
19377a22931j66814Q1046L7013A98685m2749J88657C5522b59955E7647J5348e5723
$$ -122931 -289745 -208699 -171686 198685 155936 344593 35522 -259955 57647 72995 -55723
19365b04496H7638A8905c60872a1267G7252J67712c1493j71893j6287J2814A83441
$$ -204496 87638 18905 -360872 -11267 77252 244964 -31493 -203386 -219673 -206859 183441
19353e6937h173k46872A3516d3785k49100p8597h6096j1536j49203I0197b24882
$$ -56937 -8173 -255045 13516 -43785 -292885 -371482 -86096 -97632 -246835 90197 -224882
19341a65460A7341b87662A60712b7455l39713a17725L7496j08645f9555A28472
$$ -165460 17341 -287662 160712 -27455 -367168 -117725 -80229 -188874 -69555 128472
19330C91841b11813e2394P543j19078g2583J8171p2009G4426a63775m5402j2799
$$ 391841 -211813 -52394 -44851 -163929 -72583 -54412 -126421 74426 -163775 -209177 -221976
19319b21976h2177I064c592A50782b02905P7445L8267H7021i7809A2979J08070
$$ -221976 -82177 9064 -3592 150782 -202905 -125460 -87193 87021 -97809 12979 121049
19308A21049a81796p7155N7370B0223a99972P1325E9506a73437E0032a18406M5
$$ 121049 -181796 -258951 -201581 20223 -199972 -128647 59506 -173437 50032 -118406 -118361
19297a18361F55i1860r3019m167A03432e14750A16060b42369B85282A24002c44839
$$ -118361 655 -91860 -184879 -189046 103432 -514750 116060 -242369 285282 124002 -344839
19285b41449a4720k38921A09243C5505a62885j31966F8670d5943k57570c4179
$$ -241449 -14720 -253641 109243 35505 -162885 -294851 68670 -45943 -303513 -34179
19274A4170b57470C60601C5844g8427q7180N5933r4815j14218N8683f8525A41886
$$ 14170 -257470 360601 35844 -78427 -165607 -109674 -204489 -318707 -260024 -68525 141886
19262a74610j23149Q1015f298j6579A41354l3259a99523g8521F6494h3668m2037
$$ -174610 -297759 -216744 -6298 -22877 141354 108095 -199523 -78521 66494 -83668 -125705
19251a25705a338j82468D6852K54454a94268A11942c17389e3081A56785b64471
$$ -125705 -1338 -183806 46852 301306 -194268 111942 -317389 -53081 156785 -264471
19240c2300A30879m2058b10896c5480n5767l2169A32619b70798C66861b41163
$$ -32300 130879 88821 -210896 -35480 -91247 -123416 132619 -270798 366861 -241163
19229b06009C92669m6032a26425C7058a40881A41914c30783e6624l2636F8246
$$ -206009 392669 346637 -126425 37058 -140881 141914 -330783 -56624 -89260 68246
19218A00214g2993G3275a77385a0496C8875i6301A40778d5152g955n13214a5298
$$ 100214 -72993 73275 -177385 -10496 38875 -96301 140778 -45152 -7955 -521169 -15298
19206A19272h1237B02176C357b19541B18577a58583B98933b31676c410k6057l8448
$$ 119272 -81237 202176 3357 -219541 218577 -158583 298933 -231676 -3410 -29467 -67915
19195f7915j83146D0803b62744j11961c4712A4988b2236A05012a36949d5274l9459
$$ -67915 -251061 40803 -262744 -374705 -34712 14988 -22236 105012 -136949 -45274 -84733
19184h4733q7478n9601J07082j69667A28887d1250A27496J3518i9193B65369L6635
$$ -84733 -172211 -231812 -124730 -294397 128887 -41250 127496 141014 -99193 265369 302004
19173C02004d0412C34421A53097a39076A21244b33659P8392F9275b13984e0404
$$ 302004 -40412 334421 153097 -139076 121244 -233659 -155267 69275 -213984 -50404
19162E5888J27669e8985o4887j34962i8921q0244P7394E6337L6652D1010J31406
$$ 55888 183557 -58985 -123872 -258834 -98921 -179165 -101771 56337 92989 41010 172416
19151A72416H3843a94922B6128i6478l95122c4362n9542B6178K25893e9426K2390
$$ 172416 83843 -194922 26128 -96478 -491600 -34362 -93904 26178 252071 -59426 -37036
19140c7036j23683e0970I941a25125l3233A32663a77714M7231a7163E8808b78969
$$ -37036 -160719 -50970 9941 -125125 -158358 132663 -177714 -130483 -17163 58808 -278969
19128a32937B6921b9986A41588k2314a63093j21443a32897J2550f260D0250a54537
$$ -132937 26921 -29986 141588 119274 -163093 -284536 -132897 -120347 -6260 40250 -154537
19116E7858L5906a63873d2483k20723g4067j04557o4640D56180c52280A6958a24060
$$ 57858 93764 -163873 -42483 -263206 -74067 -178624 -243264 456180 -352280 16958 -124060
19104h1662c1378q6135M5572N395B27288A188c60444A88543J4672a34941d8324
$$ -81662 -31378 -117513 -71941 -66546 227288 1188 -360444 188543 203215 -134941 -48324
19092e98464b43243P6324C29043A54219F9377h7623A15176f9822q2032B62057
$$ -598464 -243243 -166919 329043 154219 69377 -87623 115176 -69822 -151854 262057
19081c6448E9172d1781k9175j33362A2447a89817a3260H251J70579B8166J19573
$$ -36448 59172 -41781 -70956 -204318 12447 -189817 -13260 8251 178830 28166 147739
19070A47739l8032b47723R2915L65F5343b62615b4071j58335J867B54162a15337
$$ 147739 109707 -247723 -154808 -154443 65343 -262615 -24071 -182406 -180539 254162 -115337
19058b50576k9029P6571A76175a35126D0928c18280a18865G6223g3983j54958
$$ -250576 -279605 -203034 176175 -135126 40928 -318280 -118865 76223 -73983 -228941
19048b28941l2977P8017A12598c75540H8696R3206d6506m137k21586b7250A30589
$$ -228941 -261918 -183901 112598 -375540 88696 181902 -46506 -50643 -272229 -27250 130589
19036a6213D6133K82676I1314a59583g9553C1066a71426J5769g4843A63584a42502
$$ -16213 46133 328809 91314 -159583 -79553 31066 -171426 -155657 -74843 163584 -142502
19024a22380A28605N725M7810K30163b14067C211L1725r686K29979r574a08246
$$ -122380 128605 134330 182140 412303 -214067 3211 34936 25250 255229 245655 -108246
19012I1951A6049J15267b16258B41708a22071B65018c26257e0825k4430e699A21481
$$ 91951 16049 131316 -216258 241708 -122071 265018 -326257 -50825 -75255 -5699 121481
19000a09207A64492a69342j21098K1846i4386j23728j64427a48771A68758n7340
$$ -109207 164492 -169342 -290440 -268594 -94386 -218114 -382541 -148771 168758 111418
18990A11418J3244J88512a73142g2209K4430C5135a67597j98233g9137k11103
$$ 111418 124662 313174 -173142 -72209 -47779 35135 -167597 -365830 -79137 -290240
18980b90240B19194F6280f384A82663b44790I7556c38484C89908A45393B0035
$$ -290240 219194 66280 -6384 182663 -244790 97556 -338484 389908 145393 20035
18969E7282c21252A44350a88805f5361C907O0358e4151p3361A74469c1559A970
$$ 57282 -321252 144350 -188805 -65361 3907 64265 -54151 -127512 174469 -31559 1970
18957b87621A83439a17709k1318G4475e233B53203a87131C21749g2363j7340C04411
$$ -287621 183439 -117709 -139027 74475 -5233 253203 -187131 321749 -72363 -89703 304411
18945B72345I0608c45785B19790a04876k574L8190l0767A19967b49107a1672C70966
$$ 272345 90608 -345785 219790 -104876 -107450 -69260 -100027 119967 -249107 -11672 370966
18933B10804Q1987n0583q7831a23947j7444A19695B8221L4154N4802b20327B34398
$$ 210804 292791 242208 154377 -123947 -141391 119695 28221 62375 117177 -220327 234398
18921D8598l212L9054a71988J0603j51230A40437B4641d23996h1351j33068B227
$$ 48598 45386 84440 -171988 -161385 -312615 140437 24641 -423996 -81351 -214419 2227
18909a5847j88052c9941p2155D1765a12525L1980D3516c42813A61329b50544E3614
$$ -15847 -203899 -39941 -112096 41765 -112525 -80545 43516 -342813 161329 -250544 53614
18897A23515i7566B1549a90315A82308c9554j7946j9565E9258A161e2442k99700
$$ 123515 -97566 21549 -190315 182308 -39554 -57500 -77065 59258 1161 -52442 -352142
18886c52142a42458b931j15283d512D4761N4727B5879P602b12398I5443R7446
$$ -352142 -142458 -2931 -118214 -4512 44761 99488 25879 33481 -212398 95443 192889
18875A92889f7933j5844j49940I2624b35519d2420k06378a10341g490I4718k3424
$$ 192889 -67933 -83777 -233717 92624 -235519 -42420 -248798 -110341 -7490 94718 71294
18864G1294c92462a05976G4039c29479a16855k03132C0661n33L2088f3131J6270
$$ 71294 -392462 -105976 74039 -329479 -116855 -319987 30661 30128 62216 -63131 -46861
18853d6861k9355E9976f861A2012N2981b28876d0225A45911m4495J2479b11473
$$ -46861 -76216 59976 -6861 12012 64993 -228876 -40225 145911 101416 113895 -211473
18841B45644b32498a4275m52669e472B24424C7323a71698a7125r9070r3559a8396
$$ 245644 -232498 -14275 -466944 -5472 224424 37323 -171698 -17125 -116195 -209754 -18396
18829e5331A93903q7661E2510K477a70341P4521j33882P4936D64592k26704e9569
$$ -55331 193903 106242 52510 54987 -170341 -95820 -229702 -154766 464592 237888 -59569
18817e2924c834A92635b8028A01221C2167O4224K8393O4969M4697Q7708a05858
$$ -52924 -3834 192635 -28028 101221 32167 96391 124784 189753 234450 322158 -105858
18805g5685J8877B8814a16785j66253c603A47115b08172B6699a20981q5917B14249
$$ -75685 -56808 28814 -116785 -283038 -3603 147115 -208172 26699 -120981 -206898 214249
18793C8860h2761J3900K631n3311L3227b4522j64263A28937d238k45189K8887
$$ 38860 -82761 -68861 -66230 -119541 -86314 -24522 -188785 128937 -4238 -249427 -220540
18782b20540R1080K1154l1015B10169p1740b58769g1267k20845R1119H0115J88042
$$ -220540 -129460 -108306 -139321 210169 138429 -258769 -71267 -292112 -200993 80115 268157
18771B68157a67877g028j2597A6372b54790B17750e0869e484j17295A16147n134
$$ 268157 -167877 -7028 -19625 16372 -254790 217750 -50869 -5484 -122779 116147 111013
18760A11013a16220C41649A09315b90877a5054k39480d8602C7838c40311A48453
$$ 111013 -116220 341649 109315 -290877 -15054 -254534 -48602 37838 -340311 148453
18749a39207o8986K0812g9889b7472E090a1777l16173G5010c55809c5026A32601
$$ -139207 -208193 -187381 -79889 -27472 5090 -11777 -327950 75010 -355809 -35026 132601
18737E5500j9542a66832O3277A705b30579a06714m9684G1265f2027r8303l3676
$$ 55500 35958 -166832 -103555 1705 -230579 -106714 -156398 71265 -62027 -160330 -194006
18726a94006m7169A58173J49338a2467k26286B03126a46825F3550L5926a3505
$$ -194006 -241175 158173 307511 -12467 -238753 203126 -146825 63550 99476 -13505
18715B9390d4876k28662A5278g0434j49930B49563b5829C3751N163L4675a09665
$$ 29390 -44876 -273538 15278 -70434 -220364 249563 -25829 33751 38914 73589 -109665
18703a18845E4378a3763r6214A70234a09323B20838a21708j25737K9631N1346
$$ -118845 54378 -13763 -109977 170234 -109323 220838 -121708 -247445 -217814 -166468
18693a66468G1168b83679p6168J79855a531C1894a58136B09898d276p4641L9234
$$ -166468 71168 -283679 -359847 -179992 -1531 31894 -158136 209898 -4276 -78917 -39683
18682c9683B0455a43625M4001j93716g5200j9631k44026J16474B56114A08616
$$ -39683 20455 -143625 -99624 -293340 -75200 -94831 -338857 -222383 256114 108616
18671B38667a64535f659n4822B21409C2593a66535E3954L75448h0842j44875G1882
$$ 238667 -164535 -6659 -61481 221409 32593 -166535 53954 429402 -80842 -225717 71882
18659c92330i5992o3148A24149b35589J08366J9859d157j60681O9757a3609A03035
$$ -392330 -95992 -159140 124149 -235589 -127223 -107364 -4157 -164838 -95081 -13609 103035
18647a91456c0806A67060p5735A7938J91074c43272a19948c8757m03965C4870
$$ -191456 -30806 167060 91325 17938 209012 -343272 -119948 -38757 -442722 34870
18636c6793k40937J5454G3421N6155b30990f3637A29331b60321Q1368C0208O0140
$$ -36793 -277730 -262276 73421 129576 -230990 -63637 129331 -260321 -178953 30208 90348
18625I0348c51587J13787e2875j05789j06324l3308A55296A852a1261C5523a0372
$$ 90348 -351587 -237800 -52875 -158664 -264988 -298296 155296 1852 -11261 35523 -10372
18613c00103A45032a34431F607b33247A22639d9613G0051c03142a34635B34026
$$ -300103 145032 -134431 6607 -233247 122639 -49613 70051 -303142 -134635 234026
18602a47106B04285o7481b6065B89926A11508L4685K6697d6032l16119a24535
$$ -147106 204285 136804 -26065 289926 111508 146193 172890 -46032 -362151 -124535
18591i4433I5639a99532m8903B011b37831A5956O2889L3777b51478J18470B86060
$$ -94433 95639 -199532 -248435 2011 -237831 15956 78845 112622 -251478 -133008 286060
18579a20162p0938C8689a20309K9871B14844d41092h1962k23390c8906k63648
$$ -120162 -191100 38689 -120309 -90438 214844 -441092 -81962 -305352 -38906 -302554
18569c02554D373d4209B8513A415e6215a8201r2869A61839j5242D720c06141R9441
$$ -302554 4373 -44209 28513 1415 -56215 -18201 -111070 161839 146597 4720 -306141 -206700
18557b06700j39522A36616b28716A64420e9175A64265E8406R1674a6821o2219
$$ -206700 -346222 136616 -228716 164420 -59175 164265 58406 150080 -16821 -79040
18547g9040l7690C09114C4361O2003a32104j54635J34711l6359A08076a66955
$$ -79040 -116730 309114 34361 96364 -132104 -286739 -152028 -188387 108076 -166955
18536i3538A25911d4432C26972c6774a1616k40246A76299g7558A87592k2667g0610
$$ -93538 125911 -44432 326972 -36774 -11616 -251862 176299 -77558 187592 164925 -70610
18524b43237A2556a16173D87611C4909a94981A529a78567f4446k09083k91808
$$ -243237 12556 -116173 487611 34909 -194981 1529 -178567 -64446 -273529 -565337
18514e65337A43985C1731K6412g0184j53110E4838c7228A59947a93269c4704G4477
$$ -565337 143985 31731 58143 -70184 -223294 54838 -37228 159947 -193269 -34704 74477
18502h188a17C9230a8336A6172K28208d4231k52034a20839l38716I8819g5112
$$ -8188 -117 39230 -18336 16172 244380 -44231 -296265 -120839 -459555 98819 -75112
18490b50656A11296i0468f333r9283i515E484b09768g51A17943c93089c2487D6377
$$ -250656 111296 -90468 -6333 -105616 -9515 5484 -209768 -751 117943 -393089 -32487 46377
18477c8087j56508r4556F6723b26273a05684A51405M336c30400J32398h1892k06576
$$ -38087 -194595 -289151 66723 -226273 -105684 151405 155741 -330400 -198002 -81892 -288468
18466b88468B12864a68851L6853k19712f1198i197C6449A4023L9774b55280k5443
$$ -288468 212864 -168851 -131998 -351710 -61198 -9197 36449 14023 53797 -255280 -280723
18455b80723N9703M3293A72610H0370j6493h1955A03963k2356k8757m176a29255
$$ -280723 -221020 -177727 172610 80370 63877 -81955 103963 81607 52850 48674 -129255
18443A29630J52118E5177b72703F073J23115b33171J3247i1057J3359A22490b28758
$$ 129630 281748 55177 -272703 6073 129188 -233171 -219924 -91057 -77698 122490 -228758
18431a79682h4631j70707a09182r9292A11151f6149D8866B3563a39719A37946
$$ -179682 -84631 -255338 -109182 -208474 111151 -66149 48866 23563 -139719 137946
18420i6361E4928J45167a30738o9391B29171A07808g7693A79725p3459J12261
$$ -96361 54928 200095 -130738 -200129 229171 107808 -77693 179725 106266 218527
18410B18527c22554H4652P1314n9551A1608e206C58284a42754a3015B44728e2038
$$ 218527 -322554 84652 155966 96415 11608 -5206 358284 -142754 -13015 244728 -52038
18398b0901l04345b2000B50942A00146b29560N4607a0805r4286N1390m7589j6803
$$ -20901 -325246 -22000 250942 100146 -229560 -174953 -10805 -105091 -53701 -101290 -118093
18387a18093A59916C9567c43155n491C6992b43068J6641h9746d369a363j27351
$$ -118093 159916 39567 -343155 -348646 36992 -243068 -226427 -89746 -4369 -1363 -128714
18376a28714J0512N3238K664O551j87220j3632J14350A76952a89172N0298B2432
$$ -128714 -118202 -64964 -62300 -55749 -242969 -256601 -142251 176952 -189172 -138874 22432
18364I8137c1102B3531a24872D096a71488j13967a25454b7927F2264M6914B8961
$$ 98137 -31102 23531 -124872 4096 -171488 -285455 -125454 -27927 62264 109178 28961
18352A24754J05052b32632A46279C2632a02979K7832C43756c92916A38877c67813
$$ 124754 229806 -232632 146279 32632 -102979 -75147 343756 -392916 138877 -367813
18341F9524a46773r1505p8001D1406o979h0211j61519A3902J04999a31208A27533
$$ 69524 -146773 -238278 -316279 41406 34427 -80211 -241730 13902 118901 -131208 127533
18329a20061D3376E654a2304l4880k57944b279C65O7475b06894E7301J23567c16406
$$ -120061 43376 5654 -12304 -47184 -305128 -2279 365 67840 -206894 57301 180868 -316406
18316c365B33180a12696k12713J13139A34754C5104K26922g3757K9245m09217
$$ -3365 233180 -112696 -325409 -212270 134754 35104 262026 -73757 -44512 -453729
18306d53729J30200A17110f1066E0639a14886F5746b19837E1570g2858k74825
$$ -453729 -323529 117110 -61066 50639 -114886 65746 -219837 51570 -72858 -347683
18296c47683B35358n2038c1638p6835A70638b37573g7521B4299a49391k20298
$$ -347683 235358 183320 -31638 -108473 170638 -237573 -77521 24299 -149391 -369689
18286c69689f20E75N7284e2700A14603a03498E9966C667a7909D7022e1870I2355
$$ -369689 -620 575 57859 -52700 114603 -103498 59966 3667 -17909 47022 -51870 92355
18273A88883I3303a66767M7423k3840O0609j82397O7696B32735g6905I5284k8391
$$ 188883 93303 -166767 -119344 -143184 -82575 -264972 -197276 232735 -76905 95284 66893
18262F6893d9647n869H8428b49763D6186J13602a6142B02301D0158d2838j77344
$$ 66893 -49647 -55516 88428 -249763 46186 159788 -16142 202301 40158 -42838 -220182
18251b20182N3459M8512e3362j16476A04269O1751H0689N973A6673d5463A68794
$$ -220182 -166723 -118211 -53362 -169838 104269 166020 80689 86662 16673 -45463 168794
18239c742j19978A27162a12868H8763D1863c5509k56330G5031h1257M0507l47193
$$ -3742 -123720 127162 -112868 88763 41863 -35509 -291839 75031 -81257 -40750 -387943
18228c87943D9301a37421F4631D876K0358J38743b51292O0421m2800r1764A29240
$$ -387943 49301 -137421 64631 4876 25234 163977 -251292 -190871 -233671 -325435 129240
18216c17584J33467B75326a94441m6501b0401A7210J79715E8930b01191A93875
$$ -317584 -184117 275326 -194441 -240942 -20401 17210 196925 58930 -201191 193875
18205c7748r7117e649C07160c7330j73450B0546a98595B77334b79692a06756j14970
$$ -37748 -134865 -5649 307160 -37330 -210780 20546 -198595 277334 -279692 -106756 -221726
18194b21726H3126L2001c4122l3539j17722h6029K2415k990e480l7876j92724
$$ -221726 83126 115127 -34122 -67661 -185383 -86029 -63614 -66604 -5480 -43356 -236080
18183b36080m50087A20567K17745G2288a13352A4094g2521j63045B4351d8281
$$ -236080 -686167 120567 338312 72288 -113352 14094 -72521 -235566 24351 -48281
18172C23023j57199a79729f4232a5000B94717A34613F1684N2437h1846B5182K53078
$$ 323023 165824 -179729 -64232 -15000 294717 134613 61684 114121 -81846 25182 278260
18161B78260A06367a19173k9610F3225k9601b07699g3312l6142o2315A83168C9456
$$ 278260 106367 -119173 -148783 63225 33624 -207699 -73312 -109454 -171769 183168 39456
18149B95183a40923E5191K3812J78619H886J12039a51995A83899J20065j46542
$$ 295183 -140923 55191 79003 257622 8886 120925 -151995 183899 303964 157422
18139A57422g5368k6679C43142a95665A55348M5879h5277n8215c6762d342k28035
$$ 157422 -75368 -102047 343142 -195665 155348 201227 -85277 -143492 -36762 -4342 -232377
18128b32377J04264j64082c845k06569C18K32895j11338g8176L7637a4967A17058
$$ -232377 -128113 -292195 -3845 -210414 318 233213 121875 -78176 -40539 -14967 117058
18116b17648G7055d3334A41145F4045a12907c5252A27629l6962b89169M9035e2638
$$ -217648 77055 -43334 141145 64045 -112907 -35252 127629 90667 -289169 -240134 -52638
18104b69239a26592N550j78378J27857A37382g3857B35422a27519c1661j99670
$$ -269239 -126592 -121042 -299420 -171563 137382 -73857 235422 -127519 -31661 -231331
18094b31331Q9261E1966b23644a00285o1422A67248l5329h2622m1256D2741J86230
$$ -231331 -142070 51966 -223644 -100285 -161707 167248 131919 -82622 -123878 42741 228971
18083B28971b55327q843K5862I5710B7777K54195b97397i2513A05143K49679h899
$$ 228971 -255327 -264170 -238308 95710 27777 281972 -297397 -92513 105143 354822 -8899
18071c94515d9533C5487P0461b8745A77148R803G644b46748J0528J13377C17280
$$ -394515 -49533 35487 105948 -28745 177148 186951 7644 -246748 -236220 -122843 317280
18059A55635h4740J9231A3429N761b51024A59617a89783A69829d9573B88667i9547
$$ 155635 -84740 -65509 13429 19190 -251024 159617 -189783 169829 -49573 288667 -99547
18047A56913k0546P6417c89875a06997F0629e0053k13748a28291C75285a269k3565
$$ 156913 136367 212784 -389875 -106997 60629 -50053 -263801 -128291 375285 -1269 -24834
18036b4834q9717p3384B28078G0712a79068A43177a32517G7093c76733H1729O376
$$ -24834 -114551 -187935 228078 70712 -179068 143177 -132517 77093 -376733 81729 88105
18025H8105J06074o052E0421b86075R7361k48916h0949g985E1959c80390D3500
$$ 88105 194179 188127 50421 -286075 -188714 -437630 -80949 -7985 51959 -380390 43500
18013a57358J507A97976F0797a51833A56424F7876d0795m6139M3329A30760a43897
$$ -157358 -155851 197976 60797 -151833 156424 67876 -40795 -86934 -43605 130760 -143897
18001B41428a71864c0306k72336A64540P4847a73166H6155b79q6175A89059h614
$$ 241428 -171864 -30306 -302642 164540 239387 -173166 86155 -279 -86454 189059 -8614
17989G377b24813n8301a791p0288A3361k696a66351f7306j7405F7768K14121F3324
$$ 7377 -224813 -283114 -1791 -72079 13361 10665 -166351 -67306 -84711 67768 281889 63324
17976f0768A2366J75016j8959b46596b1097j44509e4554j57936f3992a1147k2628
$$ -60768 12366 187382 168423 -246596 -21097 -165606 -54554 -212490 -63992 -11147 -33775
17965c3775C5147f8607A21726N596l4819b9566r9866q525K6371r7505c5826G1860
$$ -33775 35147 -68607 121726 127322 92503 -29566 -129432 -137957 -111586 -209091 -35826 71860
17952b72291B8224J56777a4675C49473p6069A34074c49125J48957A81220c26963
$$ -272291 28224 185001 -14675 349473 273404 134074 -349125 -200168 181220 -326963
17941A29732b13173P2165j2592d8582D989b1945A05071c4382A7474l143g6137
$$ 129732 -213173 -141008 -153600 -48582 4989 -21945 105071 -34382 17474 14331 -76137
17929a07677A38159j7303e4488A03898J39363G2920a13078I4976B6138a29755
$$ -107677 138159 120856 -54488 103898 243261 72920 -113078 94976 26138 -129755
17918a70199D6388a33153e7341j85046A8804L4649c5580j6914j7121g780I3944
$$ -170199 46388 -133153 -57341 -242387 18804 53453 -35580 -52494 -69615 -7780 93944
17906c3276G5994a30439I5836C198b71618E992a61517eA23614M7837a03391j9699
$$ -33276 75994 -130439 95836 3198 -271618 5992 -161517 -5 123614 171451 -103391 -123090
17894a23090D7215L9087O5088d1911O713j16708B570J92236K6642f2197A9932
$$ -123090 47215 86302 151390 -41911 -35198 -151906 2570 194806 221448 -62197 19932
17882A93597J17106a88989N3061c945G174c73360C3011L4549e4449r702L0299
$$ 193597 310703 -188989 -135928 -3945 7174 -373360 33011 67560 -54449 -64151 -33852
17871c3852D8921g777j65788q0638A11980C5280Q2984q766c00270b0550F6302
$$ -33852 48921 -7777 -173565 -254203 111980 35280 118264 109498 -300270 -20550 66302
17859d625G7908a90561R4272E5221J1558P044J19759a50647H4140L7936d6013
$$ -4625 77908 -190561 -96289 55221 66779 73823 193582 -150647 84140 122076 -46013
17847D4553K61487a423j38535b3570k33641D7282K5650a63826n0486B55297R769
$$ 44553 306040 -1423 -139958 -23570 -257211 47282 72932 -163826 -214312 255297 265066
17836B65066e65960h7240j15151c1044j80431D4823P1108L5163c31997h6849J4626
$$ 265066 -565960 -87240 -202391 -31044 -211475 44823 115931 151094 -331997 -86849 -72223
17825g2223p0224G4386a20043j52409H4993b02740D2120H411L7424J13534a5923
$$ -72223 -142447 74386 -120043 -272452 84993 -202740 42120 8411 45835 159369 -15923
17813b9747B05457a6090A59501E2884b8790A25332C783a94421P2850F2373b34297
$$ -29747 205457 -16090 159501 52884 -28790 125332 3783 -194421 -121571 62373 -234297
17801D2030J21806o2315j9651l188B6894O252O6909Q4895q9213b00712G2318B6324
$$ 42030 163836 101521 81870 78682 26894 33146 100055 184950 95737 -200712 72318 26324
17788d8032b543j9564I1426K55370h0863q5800H7922e6537o9666B35460a64868
$$ -48032 -2543 -22107 91426 346796 -80863 -166663 87922 -56537 -126203 235460 -164868
17776c5753j25286n8526A21492g8914B7576J07842K0686o5293M5980n925c2617
$$ -35753 -161039 -219565 121492 -78914 27576 135418 156104 90811 136791 130866 -32617
17764f2366k98592A41534J06589A3410i0602L126A43360d8056m8785E7584j1483
$$ -62366 -360958 141534 248123 13410 -90602 -87476 143360 -48056 -96841 57584 46101
17753D6101a19072e0269b3335j07122e2438A38578O4898f0417l2775b3608B42709
$$ 46101 -119072 -50269 -23335 -130457 -52438 138578 203476 -60417 -93192 -23608 242709
17741a75430o9067f4260m2903r327A01917g881A7068M95391G4662A2127M7695
$$ -175430 -244497 -64260 -107163 -116490 101917 -7881 17068 512459 74662 12127 59822
17730E9822A5961J32049k7207h8517G3120O2560l3518J43410a57541g6334A6194
$$ 59822 15961 148010 120803 -88517 73120 135680 102162 245572 -157541 -76334 16194
17718F7402c5843G756b44343C93788a52724B10247q8781b09176N6211P2755j28815
$$ 67402 -35843 7756 -244343 393788 -152724 210247 121466 -209176 -152965 -80210 -209025
17707b09025a2417l6690m399I6621c4359B18207a42577A91338Q1502a87320M2209
$$ -209025 -12417 -49107 -53506 96621 -34359 218207 -142577 191338 272840 -187320 -145111
17696a45111A39274h3078A41498a19802C04777j34615C7231c0376C78838j58260
$$ -145111 139274 -83078 141498 -119802 304777 170162 37231 -30376 378838 220578
17686B20578p3200c00106C04726A44265G729L7333k1220P9312J79121a0424B28959
$$ 220578 147378 -300106 304726 144265 7729 45062 23842 103154 282275 -10424 228959
17674a10266k16578A5404a31064O1112j14052j2282B695J4037P3578b17921A3536
$$ -110266 -326844 15404 -131064 -69952 -184004 -196286 2695 16732 90310 -217921 13536
17662g1599B5450a1298A26669b7830A23853c01058h1313C9977a05306k7268A60898
$$ -71599 25450 -11298 126669 -27830 123853 -301058 -81313 39977 -105306 -132574 160898
17650b3967C5684b6231k18310c2812j66874B63137A07425l1611a48722n9269B37920
$$ -23967 35684 -26231 -244541 -32812 -199686 263137 107425 75814 -148722 -207991 237920
17638A23375k443A0557J74482e9202A02794a95662Q151B94620C2766K99397c08504
$$ 123375 120932 10557 185039 -59202 102794 -195662 -187511 294620 32766 332163 -308504
17626I5030h25F9879a7501B36997e0085b0445n7044B33698D9790K15264G1394
$$ 95030 -825 69879 -17501 236997 -50085 -20445 -77489 233698 49790 265054 71394
17614A58418a26882j88268a00492j95342B25337b04443R352A74716m4345K4017
$$ 158418 -126882 -315150 -100492 -295834 225337 -204443 -195091 174716 130371 154388
17604A54388C7056J73709B2661J26151a22230A03971K9458D6824A055N834d3989
$$ 154388 37056 210765 22661 148812 -122230 103971 133429 46824 1055 6889 -43989
17592F4964e2062j83146J01823A54722J300F3795J00478a04959C04086G707a51079
$$ 64964 -52062 -235208 -133385 154722 156022 63795 164273 -104959 304086 7707 -151079
17580G3104R0108b41420R6082B92592a25780k1257E2929J29997J15408d7650G4252
$$ 73104 163212 -241420 -145338 292592 -125780 -147037 52929 182926 298334 -47650 74252
17568a59685D24308a15348n5000A5809K75303a85720C07920b4601j6300l55203
$$ -159685 424308 -115348 -170348 15809 291112 -185720 307920 -24601 -40901 -396104
17558c96104h4078A84273J14569B3421L76121A61313a44155B0763N8938R7333
$$ -396104 -84078 184273 298842 23421 399542 161313 -144155 20763 79701 177034
17548A77034f20A0960a94558A00353m3728a64514A783b0344r8781p830K8168B06576
$$ 177034 -620 10960 -194558 100353 56625 -164514 1783 -20344 -119125 -126955 -98787 206576
17535c84j36197A44233R8065J1530L02202A02382A1779d8392F8000B3892J95045
$$ -384 -136581 144233 242298 253828 556030 102382 11779 -48392 68000 23892 218937
17524B18937O1812B2691J51941N2032n6627j3740c245o6240B1384J33707F5276
$$ 218937 280749 22691 174632 226664 170037 156297 -3245 -69485 21384 155091 65276
17512E6794O3662l9675B022K75592j13604e5919A36648a72282c5035n00051A64239
$$ 56794 120456 80781 2022 277614 164010 -55919 136648 -172282 -35035 -535086 164239
17500C33165m8707O2576E1181K4607O2376b07423A84737O3209K31303A38259i2310
$$ 333165 284458 347034 51181 75788 138164 -207423 184737 247946 479249 138259 -92310
17488B3565c4998j33488A07812d0174A43536e3977A71050K7377F7925L33105H7779
$$ 23565 -34998 -168486 107812 -40174 143536 -53977 171050 198427 67925 401030 87779
17476C2146L8277K00709m7713e9825n6729A34459l400o38f6411B15874C9066P1820
$$ 32146 70423 271132 223419 -59825 -116554 134459 131059 130421 -66411 215874 39066 110886
17464A10886K8305E9210J41454H857K04375C4046n031J00555a03045A17257j0446
$$ 110886 139191 59210 200664 8857 213232 34046 29015 129570 -103045 117257 106811
17453A06811L07065F3065J03644J01046G030K78099K9354J41192j57419A41407
$$ 106811 413876 63065 166709 267755 7030 285129 314483 455675 298256 141407
17442b1191E2767K4780P9551P0724r6282L72940j00840K85822G4676J17960J70872
$$ -21191 52767 77547 157098 227822 131540 504480 403640 689462 74676 192636 363508
17431C63508J12483j32098l1765c14472A20560Q7996K10853A78206K29787F9262
$$ 363508 475991 343893 312128 -314472 120560 208556 419409 178206 407993 69262
17420B64729d2145E8692L18974H0984L42961E117L09618j49500A2517f613l7002
$$ 264729 -42145 58692 377666 80984 423945 5117 314735 165235 12517 -6613 -43615
17409d3615i554B18612D0583J94386a38638o6893g3613A67703o9481M0777K8162
$$ -43615 -9554 218612 40583 234969 -138638 -205531 -73613 167703 98222 138999 167161
17398A67161K17947j27305j12109a54627B58409q2398E4742k5075M2910M5022
$$ 167161 385108 257803 145694 -154627 258409 176011 54742 29667 72577 117599
17388A17599E8158k2991g0734G7726e4844A29509j085e1642B80624A31183e368
$$ 117599 58158 35167 -70734 77726 -54844 129509 128424 -51642 280624 131183 -5368
17376C48864j59450K94544b3879p8312B96810A30113l4215K71892E6241g5185
$$ 348864 189414 483958 -23879 -102191 296810 130113 95898 367790 56241 -75185
17365A51932J8434g8037A84009G7922i8528B06946p1397a22508A20491L4393P3353
$$ 151932 170366 -78037 184009 77922 -98528 206946 135549 -122508 120491 154884 228237
17354B28237J9100a67490c8008B92422F0065K13852a90916b3861D981g3246F31012
$$ 228237 247337 -167490 -38008 292422 60065 273917 -190916 -23861 4981 -73246 631012
17342a9871M481B00301c9374E1777R0869J30a69371B34558I4862K56130o0555
$$ -19871 -15390 200301 -39374 51777 142646 142776 -169371 234558 94862 350992 290437
17331B90437j34357C2589M69448c0385B96195g3816E3238R4979C7210J95977A06245
$$ 290437 156080 32589 502037 -30385 296195 -73816 53238 148217 37210 233187 106245
17319C99520i7346C55019g9394C83310L6267a31693A09198L58911C3079a69801
$$ 399520 -97346 355019 -79394 383310 419577 -131693 109198 468109 33079 -169801
17308c5669A8211e9820L970A56800R0853h1285A35029i1856B04487E3354J01883
$$ -35669 18211 -59820 -55850 156800 247653 -81285 135029 -91856 204487 53354 155237
17297A55237F8477o695R5233L16082A92443d7475j76684E6620a22239m6664B40253
$$ 155237 68477 61782 157015 473097 192443 -47475 -224159 56620 -122239 -168903 240253
17285D8540i4518D68694A59730K72052j26125I7410L86313A59927o300C8327j6786
$$ 48540 -94518 468694 159730 431782 305657 97410 483723 159927 153627 38327 21541
17274B1541I358J59226L7658I7567K3880P9658g0709A13645a39353A35627R4229
$$ 21541 9358 168584 206242 97567 121447 201105 -70709 113645 -139353 135627 229856
17263B29856O4432L6282F7820K11355b10989B89147g1906B17284C3813L51157
$$ 229856 294288 330570 67820 279175 -210989 289147 -71906 217284 33813 384970
17253C84970r6512m2908A22432K19868I9384J83943N694D0966L20300A07930L92536
$$ 384970 288458 245550 122432 342300 99384 283327 289021 40966 361266 107930 500466
17242E00466j5056j00903j1023A0577P3423P9592a42400A4120L45759e0179A6244
$$ 500466 485410 384507 373484 10577 84000 163592 -142400 14120 359879 -50179 16244
17230B81161Q4390C1205K89785J85434I0915N1652o578N1505C6414L7891a18026
$$ 281161 365551 31205 320990 506424 90915 142567 135989 187494 36414 74305 -118026
17218B35735J12461j11561J1625H8804L74541H8140K97786j57602a03228r3308
$$ 235735 348196 236635 248260 88804 463345 88140 385926 228324 -103228 -196536
17208a96536B26937i3950g289j69832A50651K73733j56006n3639G3036Q1417L36356
$$ -196536 226937 -93950 -7289 -177121 150651 424384 268378 214739 73036 154453 490809
17197D90809j91199L8377D9600L70096C0406J32476O2910O1503n9359J52320m0661
$$ 490809 299610 337987 49600 419696 30406 162882 225792 287295 227936 380256 339595
17186C39595A55289a38537B09526K55629k08942E5522O9621a85064C5255Q8508
$$ 339595 155289 -138537 209526 465155 256213 55522 125143 -185064 35255 123763
17176A23763Q1365A00615L16079A91874k3491o027J58381A32028P3174R9076O0491
$$ 123763 205128 100615 416694 191874 168383 162356 320737 132028 205202 304278 364769
17165C64769Q5442k4538I6761A9953K64596L3863n1883j06309J3250G79M20585
$$ 364769 450211 425673 96761 19953 284549 318412 266529 160220 173470 779 421364
17154D21364j28728A14196J05221J32344j40440L25265D6929J38266o0226O4071
$$ 421364 292636 114196 219417 351761 211321 536586 46929 185195 124969 189040
17144A89040L61607j32098J4098a58985C65316M258E8497J27367K35567K40959
$$ 189040 550647 418549 432647 -158985 365316 369574 58497 185864 421431 662390
17134F62390B7129L10820H1090K44916b4985B28302i8412C13069A8793L98807
$$ 662390 27129 337949 81090 326006 -24985 228302 -98412 313069 18793 417600
17124D17600Q372A63556K10831A72593O930K01868Q0504I2792K66738j59458C5659
$$ 417600 425972 163556 374387 172593 179523 381391 461895 92792 359530 200072 35659
17112C31143P3079p0224j58843k9303K61999A60436l6250L04944j96273L16417
$$ 331143 404222 333998 175155 145852 407851 160436 124186 429130 232857 549274
17102E49274B58536M490J65334B13294K99454k19925J72193A35669K32008K08688
$$ 549274 258536 263026 428360 213294 512748 292823 465016 135669 367677 576365
17092E76365A21824M80130k76734r766K68146o7337j6918r6027j0416p9119Q4169
$$ 576365 121824 601954 325220 315454 583600 516263 499345 403318 392902 313783 397952
17081C97952j20551R3840P6855R9761A23444k5489K70826N1910J99330k8675k79445
$$ 397952 277401 371241 448096 547857 123444 97955 368781 420691 620021 591346 311901
17070C11901j49210L24877J17694j38637j71022K04301j96726P8230J05700J48979
$$ 311901 162691 487568 605262 466625 295603 499904 303178 381408 487108 636087
17060F36087k55372K13638j92441L0235n6562K14899j92649j42987L73363j31170
$$ 636087 380715 594353 401912 432147 375585 590484 397835 254848 628211 497041
17050D97041k021K90024A03966N01930j17857J29306m9270j02948K82875j77124
$$ 497041 495020 785044 103966 605896 488039 617345 568075 465127 748002 570878
17040E70878r8071j12983M30854O2739j81357r5353n2782j35484K43701j97157
$$ 570878 472807 359824 790678 853417 672060 576707 523925 388441 632142 434985
17030D34985k08273O9113M39270k0475k78841j47183M81018C61832P0944j261
$$ 434985 226712 295825 735095 714620 435779 288596 769614 361832 432776 431515
17020D31515J99550J74474C33778k8468M95848B46326L75601k5986k48462J56334
$$ 431515 631065 805539 333778 305310 801158 246326 621927 595941 347479 503813
17010E03813J95158j71121L9195J32214M4065j66288m2507K63909k35974p0961
$$ 503813 698971 527850 567045 699259 743324 577036 534529 798438 562464 491503
17000D91503j55593J89564J47312j06321j04714K75626l13465L79806l70523L49186
$$ 491503 335910 525474 672786 566465 461751 737377 423912 803718 433195 782381
16990G82381j001j6843k29572L51996j71848o765M4581K65915k72495J85794l86530
$$ 782381 781380 764537 534965 886961 715113 708348 752929 1018844 746349 932143 545613
16979E45613j92135K77255K38279l32059k09771K73787m4176L83260j97263n8568
$$ 545613 353478 630733 869012 536953 327182 600969 556793 940053 742790 684222
16969F84222J9395j55030L36525j81556m6499j05188K02219K43308m51302L60038
$$ 684222 703617 548587 885112 703556 657057 551869 754088 997396 546094 906132
16959I06132R0449j99096k7081K52307Q964r8924J38879L6237j62724p2201l9333
$$ 906132 996581 797485 770404 1022711 1031675 932751 1071630 1107867 945143 872942 833609
16948H33609J03850J27167m13029K94727l1043Q4913j53360L05876m8415Q3999
$$ 833609 937459 1064626 651597 946324 915281 1000194 846834 1152710 1104295 1188294
16938A188294m72308L36594r3137Q2157R7421q3519n476o814J61008o4815Q9851
$$ 1188294 715986 1052580 959443 1041600 1139021 1055502 1050026 1043212 1204220 1139405 1229256
16927A229256p0688j65648K23501j89199L93930j12989j4785j9197L65371l75681
$$ 1229256 1158568 992920 1216421 1027222 1421152 1308163 1293378 1274181 1639552 1263871
16917A263871r2900k9878k07063M45719k78957K00742L77839l90976R7746O1168
$$ 1263871 1170971 1141093 934030 1379749 1100792 1301534 1679373 1288397 1386143 1447311
16907A447311q3083j66012L18884Q6785l2905k7022j03676K1820k6857L7976o6617
$$ 1447311 1364228 1198216 1517100 1603885 1570980 1543958 1440282 1462102 1435245 1473221 1406604
16896A406604O7372L72829k58892j04865J87039K52616k81264P3613j54232K40913
$$ 1406604 1473976 1846805 1587913 1483048 1670087 1922703 1641439 1715052 1560820 1801733
16886A801733j66371Q1007q8855M51327k15567l55789J92344m3671N4923K90003
$$ 1801733 1635362 1716369 1627514 2078841 1863274 1507485 1699829 1656158 1711081 2001084
16876B001084j16927P4683L17223j27403r7079R6114J96167m12333M12306j20986
$$ 2001084 1884157 1958840 2276063 2148660 2051581 2147695 2343862 1931529 2343835 2222849
16866B222849n3618K14324l80141J56306K44322Q0598j78413j82624j71614L59189
$$ 2222849 2169231 2383555 2003414 2159720 2404042 2484640 2306227 2123603 1951989 2311178
16856B311178K06423j0718J37801J12186K95194l21948L63792K9668m30852L29849
$$ 2311178 2517601 2506883 2644684 2756870 3052064 2730116 3093908 3123576 2692724 3022573
16846C022573p5495j26904K01801J17977J18504l31365L21527q2696P7885N8576
$$ 3022573 2947078 2820174 3021975 3139952 3258456 2927091 3248618 3165922 3243807 3302383
16836C302383J00285k5933M3472M4936p0071J67032M25741j43956K17377J26945
$$ 3302383 3402668 3376735 3420207 3465143 3395072 3562104 3987845 3843889 4061266 4188211
16826D188211k25124K58372J77584k573K98239k64959Q9792J35830O0523J20113
$$ 4188211 3963087 4221459 4399043 4396470 4694709 4429750 4519542 4655372 4715895 4836008
16816D836008k0244L80445k05614L22416P958K38518Q119J6691j3471L06995L7475
$$ 4836008 4815764 5196209 4990595 5313011 5320969 5559487 5567606 5584297 5570826 5877821 5915296
16805E915296L91753k74165J52964J56601K36963M1886K77208N737L22111L11512
$$ 5915296 6307049 6032884 6185848 6342449 6579412 6621298 6898506 6904243 7226354 7537866
16795G537866P2590K24187n9197L59601Q7008M60596o5423M56875K46106O2707
$$ 7537866 7610456 7834643 7775446 8135047 8222055 8682651 8617228 9074103 9320209 9382916
16785I382916L00157M48332J66358K57566K39594O58376K61635N29150K27863
$$ 9382916 9683073 10131405 10297763 10555329 10794923 11453299 11714934 12244084 12471947
16776A2471947J40983Q9673O48358O11094L16344M71363M43495O43301L30871
$$ 12471947 12612930 12702603 13350961 13962055 14278399 14749762 15193257 15836558 16167429
16767A6167429M08471M60371J090777P87899O54243P31867P01053Q90500Q72334
$$ 16167429 16575900 17036271 18127048 18914947 19569190 20301057 21002110 21892610 22764944
16758B2764944Q60935P10404J196632J110617J123383J638726Q55547J531823
$$ 22764944 23625879 24336283 25532915 26643532 27766915 29405641 30261188 31793011
16750C1793011J602757J657144J509411J990307J929260K369240K348655K567651
$$ 31793011 33395768 35052912 36562323 38552630 40481890 42851130 45199785 47767436
16742D7767436K533374K958931L287351L048275L549249L764329L938413M393460
$$ 47767436 50300810 53259741 56547092 59595367 63144616 66908945 70847358 75240818
16734G5240818M757055N297999N460535N753358O272651O183999O391180P329186
$$ 75240818 79997873 85295872 90756407 96509765 102782416 108966415 115357595 122686781
16726A22686781O895298O991125P306125P160893O597467O604023N116118M798415
$$ 122686781 129582079 136573204 143879329 151040222 157637689 164241712 169357830 174156245
16718A74156245L389569K609833R45889k03707j683384k395733m283957m701544
$$ 174156245 177545814 180155647 181101536 180897829 179214445 176818712 172534755 167833211
16710A67833211n766027o612218o771583p379639p575064p056753p035067p304486
$$ 167833211 162067184 155454966 148683383 141303744 133728680 126671927 119636860 112332374
16702A12332374o699404o545348o068444n745259n415790m960388m363472m427815
$$ 112332374 105632970 99087622 93019178 87273919 81858129 76897741 72534269 68106454
16694F8106454l864674l645924l732970l448744k549826l151422k708478k230638
$$ 68106454 64241780 60595856 56862886 53414142 50864316 47712894 45004416 42773778
16686D2773778j960099k307883k016440j773053j686747j440666j945571j134399
$$ 42773778 40813679 38505796 36489356 34716303 33029556 31588890 29643319 28508920
16678B8508920j106459j119576j302614r15656j498400r18321n52589j054341
$$ 28508920 27402461 26282885 24980271 24064615 22566215 21647894 21095305 20040964
16670B0040964r30965p86202l47668r79924n57270p63333n03881n80460p92249
$$ 20040964 19109999 18323797 17976129 16996205 16438935 15675602 15171721 14591261 13799012
16661A3799012L846q79093k54907m5079o08198n46716j81499p23555K8323j01265
$$ 13799012 13802858 12923765 12668858 12623779 12015581 11468865 11287366 10563811 10592134 10490869
16651A0490869o59580l09962m3546k77860p11006J25030m68852o0315k68648l24212
$$ 10490869 9831289 9521327 9477781 9199921 8488915 8613945 8145093 8084778 7816130 7491918
16641G491918p6774l82078j44033J99431l92267r0702j62430o15027j05946J73625
$$ 7491918 7415144 7033066 6889033 7088464 6696197 6605495 6443065 5828038 5722092 5895717
16631E895717j97274o8434l816j20606l39994q9232k35669M1374j64694m77145
$$ 5895717 5698443 5630009 5626193 5505587 5165593 5076361 4840692 4882066 4717372 4240227
16621D240227J91636K88422o56949K51533l65268L82375k12174k62637k16288
$$ 4240227 4431863 4720285 4063336 4314869 3949601 4331976 4119802 3857165 3640877
16612C640877Q1182k68622K12536j20876m76879M98928r4650k05166m10450N4535
$$ 3640877 3722059 3453437 3665973 3545097 3068218 3567146 3472496 3267330 2856880 2911415
16602B911415J26566r3104J06531l14976Q8010j07960K9286j23173K56356k57109
$$ 2911415 3037981 2944877 3051408 2736432 2824442 2716482 2745768 2622595 2878951 2621842
16592B621842R973j43625M0502j63064P1368K1463l8863Q3957j47097J71567j81818
$$ 2621842 2631815 2488190 2528692 2365628 2436996 2458459 2419596 2503553 2356456 2528023 2346205
16581B346205j51249k95905N9670j97148K44715J00360L1246l80780L11853m51321
$$ 2346205 2194956 1899051 1958721 1761573 2006288 2106648 2137894 1757114 2068967 1617646
16571A617646L89286m00793M7360K33326n9917k73815N9299K06513j30923j24958
$$ 1617646 2006932 1606139 1653499 1886825 1826908 1553093 1612392 1818905 1687982 1563024
16561A563024K46071o9821j85269K1374j09944j93762M7153l5158J48247L27630
$$ 1563024 1809095 1739274 1554005 1575379 1465435 1271673 1318826 1283668 1431915 1759545
16551A759545n64482J81394O6612o370l66037J90109K61550l16015L70039j65278
$$ 1759545 1195063 1376457 1443069 1436699 1070662 1260771 1522321 1206306 1576345 1411067
16541A411067n68468K27240o2512j26650Q3963J73826j3648q1377n520J14368
$$ 1411067 842599 1069839 1007327 880677 964640 1138466 1124818 1043441 1037921 1152289
16531A152289K65541k49308l29221K81781p2028k43043P1750Q2782M6555M612
$$ 1152289 1417830 1168522 839301 1121082 1049054 806011 877761 960543 1007098 1011710
16521A011710q8770K7743j0245o5893J36497l63869P7159K3531q2378J12228L4305
$$ 1011710 922940 950683 940438 874545 1011042 647173 724332 747863 665485 777713 812018
16510H12018o2909J24685j74033o1527L27768l67823j39639L72362j05623P3190
$$ 812018 749109 873794 699761 638234 966002 598179 458540 830902 725279 798469
16500G98469q3934o3629L00879l56098J69366K03598l36564r1239l130J65630
$$ 798469 714535 650906 951785 595687 765053 968651 632087 540848 537718 703348
16490G03348j2133k59365p0610K13664r3603J35041j12870J36544O634k40403
$$ 703348 691215 431850 361240 574904 481301 616342 503472 640016 646650 406247
16480D06247J70018O2866j41518o8438J15194j4483N3467J11428r1332J05081
$$ 406247 576265 639131 497613 429175 544369 529886 583353 694781 603449 708530
16470G08530j21544L1848J794J64837j52314n0613B04867M68230C30929J14821
$$ 708530 586986 618834 620628 785465 633151 582538 204867 673097 330929 445750
16460D45750K25546p5511k4501L2486B74186J47250j80322a6455A89202q7321
$$ 445750 671296 595785 571284 603770 274186 421436 241114 -16455 189202 101881
16450A01881N37196B67162R6929j0738J35234k09001J12153J71903B70982J3206
$$ 101881 639077 267162 364091 353353 488587 279586 391739 563642 270982 284188
16440B84188M11788B89894J17280q4851P4257J25516O4589B17930L99518j6581
$$ 284188 695976 289894 407174 322323 396580 522096 586685 217930 617448 600867
16430F00867A56667L04037K2840L8171R6097B67621A30236K77659j7144I7727
$$ 600867 156667 460704 483544 521715 617812 267621 130236 407895 390751 97727
16419C21230k7609j38199J28880M8727H6328K94097a61272A45466l1827K89479
$$ 321230 293621 155422 284302 333029 86328 380425 -161272 145466 113639 403118
16409D03118J20200p4671b2441A29358K59216A55057K60464A43514K28972B5766
$$ 403118 523318 448647 -22441 129358 388574 155057 415521 143514 372486 25766
16398C3603J41225J25673R0743a39215D20314A42726J37989J27232I0503K05703
$$ 33603 174828 300501 391244 -139215 420314 142726 280715 407947 90503 296206
16388B96206L1007q7167e923C09021J5311Q4279e6684D48589m6649j41695A20776
$$ 296206 327213 240046 -5923 309021 324332 408611 -56684 448589 401940 260245 120776
16376B19975j7098K31003j26963a4785C51127j10098K45583k13441l9735C6783
$$ 219975 202877 433880 306917 -14785 351127 241029 486612 273171 233436 36783
16365a2071B78782A18828L50420A32511J00440Q9008J06211r4990A18842P1803
$$ -12071 278782 118828 469248 132511 232951 321959 428170 333180 118842 190645
16355A90645J81535D1854p232N57705j48745B18203K50238N6251B51573A24209
$$ 190645 372180 41854 34622 592327 443582 218203 468441 524692 251573 124209
16344g9822H0771l3788J65687l3179K86029B32180H3684K61079b32359A56263
$$ -79822 80771 46983 212670 179491 465520 232180 83684 344763 -232359 156263
16333a61183B73300M911a3961A98131j1147k0666c6036B1497K09508K1792a31030
$$ -161183 273300 278211 -13961 198131 186984 166318 -36036 21497 231005 252797 -131030
16321B43898J46731b7081f488A01796M26494k51177O6896A52594d37454a9123
$$ 243898 390629 -27081 -6488 101796 528290 277113 344009 152594 -437454 -19123
16310B68336H6742K55523K2699r4631r7816n8988a01751B1390b1037m3705B95790
$$ 268336 86742 342265 364964 270333 172517 113529 -101751 21390 -21037 -64742 295790
16298B51552A01356Q7630o6502f0589B7633b3699A31495L6347p7655h3193B14875
$$ 251552 101356 188986 122484 -60589 27633 -23699 131495 167842 90187 -83193 214875
16286A91968G4639K61811j9090h708C19611R7269k07121m6907J0611n4091J80622
$$ 191968 74639 336450 317360 -8708 319611 416880 209759 162852 173463 119372 299994
16275B99994b22344C2649a37770n1612c1474j0357o3913A54982O2831d4754C51864
$$ 299994 -222344 32649 -137770 -189382 -31474 -41831 -105744 154982 217813 -44754 351864
16263A92851a71377J6225J8950D9763J1687J70846A09286K24978F0315f7844D8972
$$ 192851 -171377 -155152 -136202 49763 61450 232296 109286 334264 60315 -67844 48972
16251f5087J6122k35570B17488L1116a29090N8419g015j83791L1993B14486k3114
$$ -65087 -48965 -284535 217488 248604 -129090 -70671 -7015 -190806 -158813 214486 191372
16240A91372a2966j09074b3648j24328L8270J6240a2895A9275J15837F2789O1555
$$ 191372 -12966 -122040 -23648 -147976 -109706 -93466 -12895 19275 135112 62789 124344
16229A24344J81663a59675B0891c2003a4905B2579b11817e3127r5597F5047g4973
$$ 124344 306007 -159675 20891 -32003 -14905 22579 -211817 -53127 -148724 65047 -74973
16217H5843C3197b29343a9810j53931A16394K47715g8001B07050A6776J38137
$$ 85843 33197 -229343 -19810 -173741 116394 364109 -78001 207050 16776 154913
16207A54913c6862k9592A7776K5045J90864r0152L03442F322b151k48266A04255
$$ 154913 -36862 -66454 17776 42821 233685 143533 446975 6322 -2151 -250417 104255
16195A63302c0626A62935J02964A03554k7136A9143J32425a89903B39137c46896
$$ 163302 -30626 162935 265899 103554 76418 19143 151568 -189903 239137 -346896
16184H8383L9933h6475A96436D9724a33881D5531A2397N0877B5197L14705b69880
$$ 88383 128316 -86475 196436 49724 -133881 45531 12397 63274 25197 339902 -269880
16172A01964e0883B08954A2165c8383m644j5349B83335c83125a54824q6456G5490
$$ 101964 -50883 208954 12165 -38383 -43027 -58376 283335 -383125 -154824 -241280 75490
16160C3504K41024A01022a0730H74g384D3649a5896j2923A67138a40106D35509
$$ 33504 274528 101022 -10730 874 -7384 43649 -15896 -28819 167138 -140106 435509
16148A21515A9901L3284h2384j30788g9054C09727h4277B93093A30543i7345R141
$$ 121515 19901 53185 -82384 -213172 -79054 309727 -84277 293093 130543 -97345 -88204
16137h8204d244C47366A36786c76937b8482k0657j09723C2338b22910E5571R7872
$$ -88204 -4244 347366 136786 -376937 -28482 -49139 -158862 32338 -222910 55571 153443
16126A53443i0627k47938a16945G4940J50971B2596a88678B46360f5807O684B87106
$$ 153443 -90627 -338565 -116945 74940 225911 22596 -188678 246360 -65807 -59123 287106
16114C2310N1543J06141J6809b52531a00771a8271A61581i2963F4972d2724B09897
$$ 32310 83853 189994 206803 -252531 -100771 -18271 161581 -92963 64972 -42724 209897
16102A3321K62126j22760l1384a16343H7413a27661o2879C7148M4268K9475k28
$$ 13321 275447 152687 121303 -116343 87413 -127661 -190540 37148 81416 110891 110663
16091A10663l9986J01837J73234E1064b18534B72895k1012g1825H141N64837F933
$$ 110663 70677 172514 345748 51064 -218534 272895 251883 -71825 8141 572978 6933
16079a6065A87553r1833f327q6698C14679F371L06260G034b84905A65902E5563
$$ -16065 187553 95720 -6327 -93025 314679 6371 312631 7034 -284905 165902 55563
16067e3220h661I3514J78119a33021a84A57708b97923A1637j755M2285b30837
$$ -53220 -8661 93514 271633 -133021 -184 157708 -297923 11637 9882 52167 -230837
16055A50183B0004J6632c07866p6525J09414D45559A0562N1979R1768c1491E4017
$$ 150183 20004 36636 -307866 -384391 -274977 445559 10562 62541 154309 -31491 54017
16043B30977c57020d2383E8739P677j5377a87139L1510j10168E960b73003a18709
$$ 230977 -357020 -42383 58739 66416 51039 -187139 -155629 -265797 5960 -273003 -118709
16031a01608a8433j76k12288A26465g0041r1939C7043R9498a88145j0233D4452
$$ -101608 -18433 -18609 -230897 126465 -70041 -161980 37043 136541 -188145 -198378 44452
16019b09374g3565D4558J01132a13990l48001a33879g761l42883A0924a58062
$$ -209374 -73565 44558 145690 -113990 -461991 -133879 -7761 -350644 10924 -158062
16008E0381a02167k79405J43192B97599E028a78933k50068a65300A56299Q5661
$$ 50381 -102167 -381572 -238380 297599 5028 -178933 -429001 -165300 156299 241960
15998B41960a4055k32845n8411k38559a6110G9740a58220q470A613N3210b90038
$$ 241960 -14055 -246900 -305311 -543870 -16110 79740 -158220 -166690 1613 54823 -290038
15986b02986A33238K33157B2577L13753r947O8647j34020q4106O0926a43823B77401
$$ -202986 133238 366395 22577 336330 326383 395030 261010 176904 237830 -143823 277401
15974d6244j61532m0119e8250l65591h7799j76012B95385b55229L4531G1476J14919
$$ -46244 -207776 -247895 -58250 -423841 -87799 -263811 295385 -255229 -220698 71476 186395
15963A86395D1506E667b07033e3106m1581C65591C1495a3353A91085d0006o0627
$$ 186395 41506 5667 -207033 -53106 -94687 365591 31495 -13353 191085 -40006 -100633
15952a00633j18476o5957a17746A34551P8405a90937d6647B7429l829a6470I0204
$$ -100633 -219109 -285066 -117746 134551 212956 -190937 -46647 27429 23600 -16470 90204
15940g9069F5425j517M8897C1644j5713Q3291a2767k84486g1612A10527d9615
$$ -79069 65425 63908 112805 31644 15931 99222 -12767 -297253 -71612 110527 -49615
15928a02974A6891K23661a70836m418F0212a5553j30445C13806A2794L94851a26509
$$ -102974 16891 240552 -170836 -175254 60212 -15553 -145998 313806 12794 407645 -126509
15916e5821A46641d5467n8478j3026e5175G278a03525b9131G354b39713k62310
$$ -55821 146641 -45467 -103945 -116971 -55175 7278 -103525 -29131 7354 -239713 -502023
15905e02023K33852d5400F5042e3607k5441r2811E3955a2168A11396i2196c5957
$$ -502023 -268171 -45400 65042 -53607 -79048 -171859 53955 -12168 111396 -92196 -35957
15893B89073b4041A00327a63515C5710c449A86024d50355E9703L7393d4444h053
$$ 289073 -24041 100327 -163515 35710 -3449 186024 -450355 59703 97096 -44444 -8053
15881a05545A98428B3397a53359A28523E5305K09973A5534c06547i9621C47983
$$ -105545 198428 23397 -153359 128523 55305 265278 15534 -306547 -99621 347983
15870i0301r9958A27769a26334j84227H1263a06509d7503G4492J99859e7083J112
$$ -90301 -190259 127769 -126334 -310561 81263 -106509 -47503 74492 274351 -57083 -55971
15859e5971F211a96440g7672j68016h7786B538e1369A11333i2848B55783Q336
$$ -55971 6211 -196440 -77672 -245688 -87786 2538 -51369 111333 -92848 255783 264119
15848B64119H666e819o5812j43986R1238A54400f7621G0297b18604B5076b9917
$$ 264119 8666 -5819 -71631 -215617 -124379 154400 -67621 70297 -218604 25076 -29917
15836e6867C4277l464J2535a8028B57788a19754K3266D42584F0703N3045b73685
$$ -56867 34277 30813 43348 -18028 257788 -119754 -96488 442584 60703 113748 -273685
15824c09697a03260b7178n1863j3890H8783C5463e9448B46597G8533l2917a21144
$$ -309697 -103260 -27178 -79041 -92931 88783 35463 -59448 246597 78533 45616 -121144
15812b32092a15942B82784e2476B08872c976A44894b3495k7735I940J6674J95963
$$ -232092 -115942 282784 -52476 208872 -3976 144894 -23495 -51230 9940 26614 222577
15801B22577a22226q7041c9226A89172b99393O2223B17223a29372k17389J44557
$$ 222577 -122226 -209267 -39226 189172 -299393 -237170 217223 -129372 -346761 -202204
15791b02204J4570r953h5461A18366d9855k4157A17263a55351e3022j37970M6395
$$ -202204 -187634 -197587 -85461 118366 -49855 -74012 117263 -155351 -53022 -190992 -144597
15780a44597J6034B02946d9797D5166a51918j8240a2695N08J588k36273I090a05657
$$ -144597 -128563 202946 -49797 45166 -151918 -170158 -12695 -12187 -10599 -246872 9090 -105657
15767a05945c0380j46152j71962d91j08406A85377P5017a68495A36738M701b07852
$$ -105945 -30380 -176532 -348494 -491 -108897 185377 260394 -168495 136738 141439 -207852
15755c1129B11931a25200r412A04947a13156k9465C0724Q0772C4327L46113a28343
$$ -31129 211931 -125200 -134612 104947 -113156 -142621 30724 111496 34327 380440 -128343
15743a52282a2505q844A00631A8379b20448A80979e2540p9935B63601a38652A27897
$$ -152282 -12505 -21349 100631 18379 -220448 180979 -52540 -132475 263601 -138652 127897
15731a89903P2651A395h3323k20453E7153O7462B4559c12529F6538K9417M6161
$$ -189903 -117252 1395 -83323 -303776 57153 124615 24559 -312529 66538 95955 142116
15720A42116J56890a26307M307F6137F377J31570a52374B92728p8089O0522c51338
$$ 142116 299006 -126307 -122000 66137 6377 137947 -152374 292728 214639 275161 -351338
15708A03267a80153M2585M8209a3124C2646h3644m5418k84531J27885c3192f195
$$ 103267 -180153 -137568 -89359 -13124 32646 -83644 -129062 -413593 -285708 -33192 -6195
15696B32236k4544I312h9702A63145m9422K94455a45030C09802e1456j87191E0210
$$ 232236 207692 9312 -89702 163145 113723 408178 -145030 309802 -51456 -238647 50210
15684a09738A09693O7331C9255J84676M3115E7682a21577D2507N8104D9842N3844
$$ -109738 109693 177024 39255 223931 267046 57682 -121577 42507 100611 49842 103686
15673A03686M22043A42266Q8468b85719c6702m9756m3787m44181a37503a4031
$$ 103686 525729 142266 230734 -285719 -36702 -86458 -130245 -574426 -137503 -14031
15662A63960k1835m9481a23127f1461J2343l89415e8194j09134B47296I9727g0896
$$ 163960 142125 92644 -123127 -61461 -49118 -438533 -58194 -167328 247296 99727 -70896
15650G2390L16967a09141B66958d30256b844l95761b8234E2702o528c96196a2017
$$ 72390 389357 -109141 266958 -430256 -2844 -398605 -28234 52702 46174 -396196 -12017
15638d7725m16703b5900j17361c2461p4412l3314f7704l53443a45872A21906b54567
$$ -47725 -464428 -25900 -143261 -32461 -106873 -140187 -67704 -421147 -145872 121906 -254567
15626C16241j17905a52484A29259e4333A20042a609C6667L43088a35595k08832
$$ 316241 198336 -152484 129259 -54333 120042 -1609 36667 379755 -135595 -344427
15616c44427d2513r4977B65138d52n7144q9936A31735F1826a41286M803I2479
$$ -344427 -42513 -137490 265138 -452 -57596 -147532 131735 61826 -141286 -136483 92479
15604C29024b99556a17554J0039f288k14887l4784h0668p8103B032f7209A78168
$$ 329024 -299556 -117554 -107515 -6288 -221175 -255959 -80668 -158771 2032 -67209 178168
15592e5556B7453I907c83966A44512B9327a56454A98532K218h0581K5484n3868
$$ -55556 27453 9907 -383966 144512 29327 -156454 198532 200750 -80581 -55097 -108965
15581a08965D0384M7309j8844d9308N264A32672c67328a45613B1561P0550a25602
$$ -108965 40384 87693 68849 -49308 -44044 132672 -367328 -145613 21561 92111 -125602
15569B4880d3858C6989h2641B8198J05932K2974l1147b36834g2480m0955b7612
$$ 24880 -43858 36989 -82641 28198 134130 157104 125957 -236834 -72480 -113435 -27612
15557c06570A14791b19869B28211a656j38023j66202i5712A3141c8934j27472
$$ -306570 114791 -219869 228211 -1656 -139679 -305881 -95712 13141 -38934 -166406
15547a66406N6267A2036b00539R6710j03824F745h3505C1339J55925b1685C00966
$$ -166406 -110139 12036 -200539 -103829 -207653 6745 -83505 31339 187264 -21685 300966
15535e6464B95783A7353b02826C48700a40615d3584A5806i4695q8166B20616I5793
$$ -56464 295783 17353 -202826 348700 -140615 -43584 15806 -94695 -182861 220616 95793
15523h9926G7402c5086k93524B91588h4577A04179O042C0970c70198C00521A39462
$$ -89926 77402 -35086 -328610 291588 -84577 104179 110221 30970 -370198 300521 139462
15511A10092O2581A4221D911K6082a82183A7130h4450j34592A75167n5137E9401
$$ 110092 172673 14221 4911 30993 -182183 17130 -84450 -219042 175167 120030 59401
15499A04090r389f0698B14915a9862p0697J4694A72280K75874a05128A16139a6158
$$ 104090 94701 -60698 214915 -19862 -90559 -75865 172280 448154 -105128 116139 -16158
15487c69011G8780A8798G197K59340G8011a93882E2260a08209E4628a47528A13578
$$ -369011 78780 18798 7197 266537 78011 -193882 52260 -108209 54628 -147528 113578
15475d3383p7795j20621G3733f5773c0913k2853p1361B93527D2734A6695f5926
$$ -43383 -121178 -241799 73733 -65773 -30913 -53766 -125127 293527 42734 16695 -65926
15463d9966K864l8995j45027A71088c5340A67159a8553P925j72123f3019l10275
$$ -49966 -47102 -86097 -231124 171088 -35340 167159 -18553 -10628 -182751 -63019 -373294
15452c73294D1720a84850j12358R6382b6064N898A6264a11283A87955m8230l2922
$$ -373294 41720 -184850 -297208 -200826 -26064 -20166 16264 -111283 187955 139725 106803
15441A06803a34318A59002O780c18884M8638a5894l1166n9989C6739a22208k73164
$$ 106803 -134318 159002 165782 -318884 -270246 -15894 -47060 -107049 36739 -122208 -395372
15430c95372B8074J66167m7921J6648D1828a01885A29906a20025l05911B57494
$$ -395372 28074 194241 146320 162968 41828 -101885 129906 -120025 -425936 257494
15419a79312c5658J5053q5690N1265j33120I2878b7771C16024C9048Q0433J09900
$$ -179312 -35658 -20605 -106295 -55030 -188150 92878 -27771 316024 39048 119481 229381
15408B29381a30624C40892A08716a60678o3785B05701j00437K44443M9936j36033
$$ 229381 -130624 340892 108716 -160678 -224463 205701 105264 349707 399643 263610
15398B63610n7413a45526c0473f528E1372e9452I4349c74520J75063g9715A7466
$$ 263610 206197 -145526 -30473 -6528 51372 -59452 94349 -374520 -199457 -79715 17466
15386g5306n5381B8822a06769d9554H8196A9853J20094N146J6661N8193A07275
$$ -75306 -130687 28822 -106769 -49554 88196 19853 139947 145093 161754 219947 107275
15374a7264k08184B1693c13605M4880e4362j66887B43718a18061d9730j31344
$$ -17264 -225448 21693 -313605 -268725 -54362 -221249 243718 -118061 -49730 -181074
15364a81074C18800b4868k9418k63691G734a40404n8404G6491L2961A2575b09787
$$ -181074 318800 -24868 -54286 -317977 7734 -140404 -198808 76491 109452 12575 -209787
15352A11674A9319a0384C8667K14004h7288K2224F3764c7798J4563A80805e5582
$$ 111674 19319 -10384 38667 252671 -87288 -65064 63764 -37798 -23235 180805 -55582
15340A04920i1214B25398K7868I8744K8777A8357a46979k0225B34770f2407K5973
$$ 104920 -91214 225398 253266 98744 127521 18357 -146979 -167204 234770 -62407 -36434
15329c6434G5930e0654B44841a15466j6557o5804C5124a63629B148f8645A48229
$$ -36434 75930 -50654 244841 -115466 -132023 -197827 35124 -163629 2148 -68645 148229
15317A55862F8447f5881j47277f9232D7170a99795O7742A24281e184A07951e0192
$$ 155862 68447 -65881 -213158 -69232 47170 -199795 -132053 124281 -5184 107951 -50192
15305A13130k5851a06069A33520h7062F221a5480j8885A31161j935E2218J83353
$$ 113130 87279 -106069 133520 -87062 6221 -15480 -34365 131161 129226 52218 235571
15294B35571a62907L9035c1122b22o5590A62153p3141a69509o9548B83102a3083
$$ 235571 -162907 -123872 -31122 -222 -65812 162153 89012 -169509 -239057 283102 -13083
15282C8805K04003j16801P2975a07072A3366L22536A00334b56375A15115K40166
$$ 38805 242808 126007 198982 -107072 13366 335902 100334 -256375 115115 355281
15272C55281G1314O9708O5006H2320C1113a15637r5839m8709A44775D0396c0432
$$ 355281 71314 141022 206028 82320 31113 -115637 -211476 -260185 144775 40396 -30432
15260h8973B31668a12774D4482J95071A12405e8660B43493b31092N5482A62142
$$ -88973 231668 -112774 44482 239553 112405 -58660 243493 -231092 -175610 162142
15249b1753n1855G24355L19086J19191j91014j46544B58781a47537A77254N1787
$$ -21753 -73608 724355 1043441 1162632 971618 825074 258781 -147537 177254 229041
15239B29041L0998E3929b02674k10933B54888J28429E8827d01349f5850n6453
$$ 229041 260039 53929 -202674 -413607 254888 383317 58827 -401349 -65850 -122303
15229a22303C34592H279K48053a88022h676E3633d3743o0107k6498B63387A27926
$$ -122303 334592 8279 256332 -188022 -8676 53633 -43743 -103850 -130348 263387 127926
15217a60604M1491j34744A32815K1142F2342l0150Q2511a10409A45254a82816
$$ -160604 -119113 -253857 132815 153957 62342 32192 114703 -110409 145254 -182816
15206a01178I5415J54032e4683j52398D87988j29615p8424j0095l4876N3185r6576
$$ -101178 95415 249447 -54683 -207081 487988 358373 279949 269854 234978 288163 191587
15195A91587J21399b6648k92554a08953A14741J32969b1984m8273P462B04616
$$ 191587 312986 -26648 -319202 -108953 114741 247710 -21984 -70257 -62795 204616
15184E0058K15847j2898a28747B13712c11019A31491a34231C3051k934b24334
$$ 50058 265905 253007 -128747 213712 -311019 131491 -134231 33051 30117 -224334
15173d7849l60898B43155j08114O0893b13330C6727g8685l7069a759C6092g8359
$$ -47849 -408747 243155 135041 195934 -213330 36727 -78685 -115754 -1759 36092 -78359
15161C07122i5370A66480o3148J60306o5958J61743a53142A19909c6908B10652
$$ 307122 -95370 166480 103332 263638 197680 359423 -153142 119909 -36908 210652
15150b04531A20042n2600J80685b42397R7113j54767A2853f4136l4704B85003
$$ -204531 120042 67442 248127 -242397 -145284 -300051 12853 -64136 -98840 285003
15139G630K44086a0953C6144R7315l1526l139D4465d2136G0319R9223J29892j05521
$$ 7630 251716 -10953 36144 133459 101933 98794 44465 -42136 70319 169542 299434 193913
15127A93913R1883H094g669A89149J50704E3797P7555j7531K519e1646A90539
$$ 193913 285796 8094 -7669 189149 339853 53797 131352 113821 116340 -51646 190539
15115B30501b04717H17K61571j9633j03583r754a28402B26426A4857J97227A2138
$$ 230501 -204717 817 262388 242755 139172 129418 -128402 226426 14857 212084 12138
15103B58632D8420L71689j34981B783J20061e8245B1939P5809g4589A37473J31477
$$ 258632 48420 420109 285128 2783 122844 -58245 21939 97748 -74589 137473 268950
15092B68950b58983A71880a08825B61785J38263b06036h0927B96538L9235A50085
$$ 268950 -258983 171880 -108825 261785 400048 -206036 -80927 296538 335773 150085
15081d9112m4421F2934L26828C9060K47404E212e5687I3464J90071F5942Q9936
$$ -49112 -93533 62934 389762 39060 286464 5212 -55687 93464 283535 65942 155878
15070A55878E8577J46621B496K9586M519J00561o200n62F2930J30108L7594m0039
$$ 155878 58577 205198 2496 32082 36601 137162 130962 130400 62930 193038 230632 190593
15058A90593c2052A97438a19288M2206j68264C06552L2351q1528B3805J41309
$$ 190593 -32052 197438 -119288 -77082 -245346 306552 338903 257375 23805 165114
15048A65114a76529j11141F4550J37564E7012K15258R5573I9558J16590P8896
$$ 165114 -176529 -287670 64550 202114 57012 272270 367843 99558 216148 295044
15038B95044D3201L32196Q893A83595J45633j3853I1021J57614a17716B06112
$$ 295044 43201 375397 384290 183595 329228 315375 91021 248635 -117716 206112
15027a93737A10785J50860j09146L19765E999K29232a253B62349J10384H0243
$$ -193737 110785 261645 152499 472264 5999 235231 -1253 262349 372733 80243
15016E09869E4592N3923R388l1157K7621J58517p2452H5229K6838K03110j51201
$$ 509869 54592 108515 117903 86746 114367 272884 200432 85229 112067 315177 163976
15005A63976E3476R1433j3811M15357A05061a15747A35169D1744L02022j69802
$$ 163976 53476 144909 131098 546455 105061 -115747 135169 41744 343766 173964
14995A73964a2146B1328K18989A08510d6354C5526J62438O1255M6313H9719N57269
$$ 173964 -12146 21328 240317 108510 -46354 35526 197964 259219 305532 89719 646988
14984F46988E3992K09132r1505K10706g5825B84593j26970N6035J23280C3563
$$ 646988 53992 263124 171619 382325 -75825 284593 157623 213658 336938 33563
14973A95405b3775C07010J97139c5446C08996A04611g1299B51991b25544D09141
$$ 195405 -23775 307010 504149 -35446 308996 104611 -71299 251991 -225544 409141
14962B29717o9869P6826A12831M8718L09126A27454K04086A29766J59957R9953
$$ 229717 159848 236674 112831 161549 470675 127454 331540 129766 289723 389676
14952C89676j30337A00602L0878J97142j45385b01097C82237j89423J12856p459
$$ 389676 259339 100602 131480 328622 183237 -201097 382237 192814 305670 298211
14942B98211a63125A43120K7311N0934K39110b8373B6864R329O6855B7914L09419
$$ 298211 -163125 143120 170431 221365 460475 -28373 26864 36193 103048 27914 337333
14931C37333H2932J28165l8263G1377J8177K97466A13448J92729O1265O5913a41160
$$ 337333 82932 211097 172834 71377 89554 387020 113448 306177 367442 433355 -141160
14919C57418Q8549A19378N11277B30247M8776k6608J98411p2961J24025c9789
$$ 357418 445967 119378 630655 230247 279023 252415 450826 377865 501890 -39789
14908C32115I786M02913A02136M67459C6571Q9047K90956A95219O8610j02506
$$ 332115 9786 412699 102136 569595 36571 125618 416574 195219 263829 161323
14898A61323M94030j07310B72400Q2174b5142A8813L74492N8121j34488K56891
$$ 161323 655353 548043 272400 354574 -25142 18813 393305 451426 316938 573829
14888E73829B46611N7047M4273j64629J52292K226l3900p7358E7367H386L64587
$$ 573829 246611 303658 347931 183302 335594 337820 303920 226562 57367 8386 372973
14877C72973A21760J62443p4846J67749j24259K74200I6856j6516P7894K27116
$$ 372973 121760 284203 209357 377106 252847 527047 96856 80340 158234 385350
14867C85350j58116L0297L00986A51835K74584k12661r2997J91762r2917K49324
$$ 385350 227234 257531 558517 151835 426419 213758 120761 312523 219606 468930
14857D68930l4209A25153M4003J15473j31054K26465A18508J81994J74473q8905
$$ 468930 434721 125153 169156 284629 153575 380040 118508 300502 474975 386070
14847C86070A0876J1592L07784N9875J14319A84300M28529k40357j50521q4718
$$ 386070 10876 22468 330252 390127 504446 184300 612829 372472 221951 137233
14837A37233E176M00674J32313k17523K5126P0420R2273B01227K51156M3263j50737
$$ 137233 5176 405850 538163 320640 345766 416186 508459 201227 452383 495646 344909
14826C44909K01579k20687p099M72710C71470p7843p9835J46832j11340J31715
$$ 344909 546488 325801 318702 791412 371470 293627 213792 360624 249284 380999
14816C80999L9616l5621J52767B49263K54060r7795O1063k20708J89667q1606
$$ 380999 420615 384994 537761 249263 503323 405528 466591 245883 435550 353944
14806C53944K26554j82053K33566A68654N0225L70085k53814J57268L9463j62186
$$ 353944 580498 398445 632011 168654 218879 588964 335150 492418 531881 369695
14796C69695P0132L7685K0675m008D1518K37573L93719B24260K22983k03668K53313
$$ 369695 439827 477512 498187 494179 41518 279091 672810 224260 447243 243575 496888
14785D96888o0877p1554A51986J84506J00251K07016k05314O5864m9562k6414
$$ 496888 436011 364457 151986 336492 436743 643759 438445 504309 454747 428333
14775D28333K39185j99243m6223R5493j7144k39120L13182k18253L99392B09089
$$ 428333 667518 468275 422052 517545 500401 261281 574463 356210 755602 209089
14764C84823L00763j95140N6069j56398J33812r8625J18404j4566o7807R5934
$$ 384823 685586 490446 546515 390117 523929 425304 543708 529142 461335 557269
14754E57269B72252J50848K40849J0472k33648J74002p2523P8713K01843l26994
$$ 557269 272252 423100 663949 674421 440773 614775 542252 620965 822808 495814
14744D95814q7987p0634J00266L59047l67788j74744M14411A64037L64106J43058
$$ 495814 407827 337193 437459 796506 428718 253974 668385 164037 528143 671201
14734F71201q307j61923Q3621k00180L05652j89988L87749m16099R4651J1315
$$ 671201 662894 500971 584592 384412 690064 500076 887825 471726 566377 577692
14724E77692J71442M372j28156K87867m27864N195N18213j42027j27505P0364
$$ 577692 749134 753506 625350 913217 485353 490548 1008761 866734 739229 809593
14714H09593p3457j22028k0606J61325k04077L71005j33552r0881Q0294n6648
$$ 809593 736136 614108 593502 754827 550750 921755 788203 697322 777616 720968
14704G20968k98538K45591J8009j66657J31934p5274L83411j36888m08383N40356
$$ 720968 422430 668021 686030 519373 651307 576033 959444 822556 414173 954529
14694I54529l09120K56718J1625k11070k33779P952J78349J92288j14507L34805
$$ 954529 645409 902127 913752 702682 468903 476855 655204 847492 732985 1067790
14684A067790l49439L8497K07681r7892J68571m02962K38964J53379P5211n31730
$$ 1067790 718351 756848 964529 866637 1035208 632246 871210 1024589 1099800 568070
14674E68070L0830m0947L28741j03072J75668p6882l04851O26133C53722P53599
$$ 568070 598900 557953 886694 783622 959290 882408 577557 1203690 353722 1107321
14664A107321j84782p3410M2379n6949O3436J77325l06329J1790M78707j65970
$$ 1107321 922539 849129 891508 834559 897995 1075320 768991 780781 1259488 1093518
14654A093518L4793m03464m3709J37986J46432k93700J95607J67885N1805j58117
$$ 1093518 1128311 724847 681138 819124 965556 671856 867463 1035348 1087153 929036
14644I29036J4453j21483J1234L89935k66352L9979m3202J70510j92728J42439
$$ 929036 943489 822006 833240 1223175 956823 996802 953600 1124110 931382 1073821
14634A073821p5465J18779l0600p5092k589j73124K98516J03465N56435o88299
$$ 1073821 998356 1117135 1086535 1011443 1008854 835730 1134246 1237711 1794146 1105847
14624A105847J79226l82403O5251J80665J77705J35566j79019m27020L31644m1236
$$ 1105847 1285073 902670 967921 1148586 1326291 1461857 1282838 855818 1187462 1146226
14614A146226N5093k931L182L33964j70128j98571r819L2018R5565p8091j9280
$$ 1146226 1201319 1198388 1201570 1535534 1365406 1166835 1157016 1189034 1284599 1206508 1187228
14603A187228P9269k89487L59437J48370l08859N2941O6115k04691L63139l30884
$$ 1187228 1266497 977010 1336447 1484817 1175958 1228899 1295014 1090323 1453462 1122578
14593A122578N4742J86234l4667K00083j66091J59470R5914N8926l57381K76559
$$ 1122578 1177320 1363554 1328887 1528970 1362879 1522349 1618263 1677189 1319808 1596367
14583A596367j81926N35025k92933P4274k09593k27773J99333K07771M8519R7209
$$ 1596367 1414441 1949466 1656533 1730807 1521214 1293441 1492774 1700545 1749064 1846273
14573A846273k37534K68991K66398l31479j68549K48519P8789j78121o5561J72106
$$ 1846273 1608739 1877730 2144128 1812649 1644100 1892619 1971408 1793287 1727726 1899832
14563A899832j45105M34479R9651j89739L40229M0704j07445N3470L06695K05556
$$ 1899832 1754727 2189206 2288857 2099118 2439347 2480051 2372606 2426076 2732771 2938327
14553B938327J20967K05172J57383R56727J271264L148648R290319J5430345P924859
$$ 2938327 3059294 3264466 3421849 4378576 5649840 8798488 18088807 33519152 41444011
14544D1444011j6976457I580985D490452j780806o67355l50668M6157k01543J42208
$$ 41444011 24467554 9580985 4490452 2709646 2042291 1691623 1737780 1536237 1678445
14535A678445k6381L75727l60614J46915J02834l51468K36192M7570K35218N1066
$$ 1678445 1652064 2027791 1667177 1814092 1916926 1565458 1801650 1849220 2084438 2135504
14525B135504j70380j4443K34661l97477L12020k22058L55628m42491L07268K19048
$$ 2135504 1965124 1950681 2185342 1787865 2099885 1877827 2233455 1790964 2098232 2317280
14515B317280q4824l84511L56895M32084m06537o4214J32959j34394J66887j72190
$$ 2317280 2232456 1847945 2204840 2636924 2230387 2166173 2299132 2164738 2331625 2159435
14505B159435M61116l80165K60098Q6460l24048K31221L68849n55407J90483k5296
$$ 2159435 2620551 2240386 2500484 2586944 2262896 2494117 2862966 2307559 2498042 2472746
14495B472746K80344j71012M08801k10078J60701p1669J45057m64638N01989r1592
$$ 2472746 2753090 2582078 2990879 2780801 2941502 2869833 3014890 2550252 3052241 2960649
14485B960649L62394j58626j0274J10525p9098k65134K28859m2015j27003J83591
$$ 2960649 3323043 3164417 3154143 3264668 3185570 2920436 3149295 3107280 2980277 3163868
14475C163868K7294L1724K44835m15617L54841L3405K24758K0503o603K87893
$$ 3163868 3191162 3222886 3467721 3052104 3406945 3440350 3665108 3685611 3679008 3966901
14465C966901k17789K03705m9674J23316j49156R6158o1784K90084k90922J26002
$$ 3966901 3749112 3952817 3903143 4026459 3877303 3973461 3911677 4201761 3910839 4036841
14455D036841P8418P1294P8328M33471k05476J24331j23014j73489O09896q1403
$$ 4036841 4115259 4186553 4264881 4698352 4492876 4617207 4494193 4320704 4930600 4849197
14445D849197k2385J24791j00136L0644r8373R1282O9742j19433K60275L72863
$$ 4849197 4826812 4951603 4851467 4882111 4783738 4875020 4944762 4825329 5085604 5458467
14435E458467m05015N39035j10400q6226m809M15406k76075P5875K85163r8937
$$ 5458467 5053452 5592487 5482087 5395861 5391052 5806458 5530383 5606258 5891421 5792484
14425E792484L62652j9676K25078j87892J41910K45956L150L81292k84548N72443
$$ 5792484 6155136 6135460 6360538 6172646 6314556 6560512 6563662 6944954 6660406 7232849
14415G232849l33741J85897j78208L96270j31151O01038k56245K24914L29605
$$ 7232849 6899108 7085005 6906797 7303067 7171916 7772954 7516709 7741623 8071228
14406H071228k48197M56461K91317m62121K26521L35862O2684o6823N20427J11448
$$ 8071228 7823031 8279492 8570809 8108688 8335209 8671071 8733755 8666932 9187359 9298807
14396I298807k7823L26129k0660j9616N34431n7906K51837R0793M01210J86195
$$ 9298807 9270984 9597113 9576453 9556837 10091268 10033362 10285199 10375992 10777202 10963397
14386A0963397K52993k08538M87005P4616N31229J61565K37388k27491N68659
$$ 10963397 11216390 11007852 11494857 11569473 12100702 12262267 12499655 12272164 12840823
14377A2840823J25999L93315K11145K15856J16936K11306M09702N72815L63038
$$ 12840823 12966822 13360137 13571282 13787138 13904074 14115380 14525082 15097897 15460935
14368A5460935J3282J75676L80381N43062L61198j17549P36339j1078N97282L70237
$$ 15460935 15474217 15649893 16030274 16573336 16934534 16816985 17553324 17542246 18139528 18509765
14358A8509765M75813N92759L96714J18972N78532O98200L83428R39471K54081
$$ 18509765 18985578 19578337 19975051 20094023 20672555 21370755 21754183 22693654 22947735
14349B2947735O37199L69117O14102R18167O89680M89417Q29617O74860O14787
$$ 22947735 23584934 23954051 24568153 25486320 26176000 26665417 27495034 28169894 28784681
14340B8784681N23885J115937J066709R17153R01014J229532Q37469R21965J184931
$$ 28784681 29308566 30424503 31491212 32408365 33309379 34538911 35376380 36298345 37483276
14331C7483276J315092Q65685J417144J275908J492889J538034J412457J649840
$$ 37483276 38798368 39664053 41081197 42357105 43849994 45388028 46800485 48450325
14323D8450325J685235J602475J864962K330625J825879J781933K654557K416679
$$ 48450325 50135560 51738035 53602997 55933622 57759501 59541434 62195991 64612670
14315F4612670K440713K483311K876916L277543L324938K981121L928107L591741
$$ 64612670 67053383 69536694 72413610 75691153 79016091 81997212 85925319 89517060
14307H9517060L802991M499884M560685N307318M802575N627158N951471O211459
$$ 89517060 93320051 97819935 102380620 107687938 112490513 118117671 124069142 130280601
14299A30280601O795070O906952P966393Q079606Q605783R182765R833426J0391493
$$ 130280601 137075671 143982623 151949016 160028622 168634405 177817170 187650596 198042089
14291A98042089J1224891J1793043J2344318J3152990J3846002J4035937J5271472
$$ 198042089 209266980 221060023 233404341 246557331 260403333 274439270 289710742
14284B89710742J5264860J5532095J5831549J6085090J5330401J4971511J4328525
$$ 289710742 304975602 320507697 336339246 352424336 367754737 382726248 397054773
14277C97054773J3256537J1991296J0100519Q423786N507725R47045m267706m557862
$$ 397054773 410311310 422302606 432403125 440826911 446334636 447281681 443013975 438456113
14269D38456113k715846n777620m235147p832270j0841649j2737100j3832890
$$ 438456113 435740267 429962647 425727500 417895230 407053581 394316481 380483591
14262C80483591j4762025j5556457j6231399j5729445j6066659j5376552j4879649
$$ 380483591 365721566 350165109 333933710 318204265 302137606 286761054 271881405
14255B71881405j4096051j3113041j3474850j2511300j1424113j0945836j0398828
$$ 271881405 257785354 244672313 231197463 218686163 207262050 196316214 185917386
14248A85917386r613817r216386q704196p766000p415550o826496o873821o638598
$$ 185917386 176303569 167087183 158382987 150616987 143201437 136374941 129501120 122862522
14240A22862522n603356n302350m768720m714452m456890m634557m338823l117539
$$ 122862522 117259166 111956816 107188096 102473644 98016754 93382197 89043374 85925835
14232H5925835l566583l443458k976672k967927l238910k581159k357864k627199
$$ 85925835 82359252 78915794 75939122 72971195 69732285 67151126 64793262 62166063
14224F2166063k574919k080619k116715k001217j568257j794250j902035j447297
$$ 62166063 59591144 57510525 55393810 53392593 51824336 50030086 48128051 46680754
14216D6680754j649034j312043j336871j018225j318015j509196j104125j083034
$$ 46680754 45031720 43719677 42382806 41364581 40046566 38537370 37433245 36350211
14208C6350211q30964p84002j089641j282878r36917p11403j124973m41471r57155
$$ 36350211 35519247 34735245 33645604 32362726 31425809 30714406 29589433 29147962 28190807
14199B8190807p83404n56673q39747o97273m52785m19855o23231n82022r09072
$$ 28190807 27407403 26850730 26010983 25313710 24860925 24441070 23817839 23235817 22326745
14190B2326745l58162p04111r4350n87842o7278j021529l09596m05304k47221
$$ 22326745 21968583 21264472 21170122 20582280 20515002 19493473 19183877 18778573 18531352
14181A8531352o78803k61629k58763m64171n20578o8124m91421k11309m01571
$$ 18531352 17852549 17590920 17332157 16867986 16347408 16279284 15787863 15576554 15174983
14172A5174983m38733k27498p0749k39297o47828k12940j67809l03567j46929
$$ 15174983 14736250 14508752 14438003 14198706 13550878 13337938 13170129 12866562 12719633
14163A2719633j73329k3000o91885j45269N3502k95900m03122j95277k64109L08262
$$ 12719633 12546304 12523304 11831419 11686150 11739652 11443752 11040630 10845353 10581244 10889506
14153A0889506p20579Q8657k98133N9269l26449J90020k22571m70802N2622j51644
$$ 10889506 10168927 10257584 9959451 10018720 9692271 9882291 9659720 9188918 9241540 9089896
14143I089896L4324n92118M6193k99309J48135l4870l89261K42841l32668p313
$$ 9089896 9124220 8532102 8578295 8278986 8427121 8392251 8002990 8245831 7913163 7905850
14133G905850k09837L69168m86893k13154K17113q43902K94684k00389J95115
$$ 7905850 7696013 8065181 7578288 7365134 7582247 6738345 7033029 6832640 7027755
14124G027755k58237N4036l91389L27303l77879j00791J34365k28142j33147P1494
$$ 7027755 6769518 6823554 6432165 6759468 6381589 6280798 6415163 6187021 6053874 6125368
14114F125368l7310l24440L27857k64471j87512k01450J96938k47538K3496M7267
$$ 6125368 6088058 5763618 6091475 5827004 5639492 5438042 5634980 5387442 5410938 5458205
14104E458205j8238j96826j98530q58k88869p1762K99595j53650k64473K12100
$$ 5458205 5439967 5243141 5044611 5043753 4754884 4683122 4982717 4829067 4564594 4776694
14094D776694k88144o678o2336M3940l6840n86429K21136L36528l38178K52648
$$ 4776694 4488550 4481872 4419536 4463476 4426636 3840207 4061343 4397871 4059693 4312341
14084D312341k07642P4250l5425K44586l19797Q9164l46976k927O2523N4927k61268
$$ 4312341 4104699 4178949 4143524 4388110 4068313 4157477 3810501 3807574 3870097 3925024 3663756
14073C663756n0671M865j9183J60537l00880K09669j28066j52977j21595k0763
$$ 3663756 3613085 3617950 3598767 3759304 3458424 3668093 3540027 3387050 3265455 3244692
14063C244692K64713o7941j16588K96275m29177L66035m56773M32484p8251k62817
$$ 3244692 3509405 3441464 3324876 3621151 3191974 3558009 3101236 3533720 3455469 3192652
14053C192652N641k33157J64584m31526J15053J38705l00936R5307O9523P1014
$$ 3192652 3198293 2965136 3129720 2698194 2813247 2951952 2651016 2746323 2815846 2886860
14043B886860k93945M4668K82389k20610p0561J37207j57117j12087J31317O5383
$$ 2886860 2592915 2637583 2919972 2699362 2628801 2766008 2608891 2496804 2628121 2693504
14033B693504k40516Q8670K89179P6717k68642R4823j92592l09715K60462K4646
$$ 2693504 2452988 2541658 2830837 2907554 2638912 2733735 2541143 2231428 2491890 2516536
14023B516536Q55l42993p7011Q9167l2655J8171j30983J27349J57912l54699K58601
$$ 2516536 2517391 2174398 2097387 2186554 2153899 2172070 2041087 2168436 2326348 1971649 2230250
14012B230250l81331l3313J99109k69667K09204J96609m45933J38525J9900r9785
$$ 2230250 1848919 1815606 2014715 1745048 1954252 2150861 1704928 1843453 1863353 1763568
14002A763568L3568j60821o1249J53789m4651N630K32250j30656m63214M44808
$$ 1763568 1797136 1636315 1575066 1728855 1684204 1689834 1922084 1791428 1328214 1773022
13992A773022j74116K05713J41794L15739K076381P189026J5547459J3620390
$$ 1773022 1598906 1804619 1946413 2262152 4338533 11527559 27075018 40695408
13984D0695408j2070219A2925736n470812j944509j124284r36773k81985l82373
$$ 40695408 28625189 12925736 7454924 5510415 4386131 3449358 3167373 2785000
13976B785000k56641j59781L29361l43290p326j16564k0695k49435j17185L13250
$$ 2785000 2528359 2368578 2697939 2354649 2347323 2230759 2210064 1960629 1843444 2156694
13966B156694j47601N5093q1589l00910K58820j41727n3947O4518O5897J0313
$$ 2156694 2009093 2064186 1982597 1681687 1940507 1798780 1744833 1809351 1875248 1885561
13956A885561O4005j87787j06378j7269j94959j85239O13111n18217J90260K66761
$$ 1885561 1949566 1761779 1655401 1638132 1443173 1257934 1871045 1352828 1543088 1809849
13946A809849q9993j04917j79345L7701J28144M717k72632L16418k19818j08401
$$ 1809849 1719856 1614939 1435594 1473295 1601439 1606156 1333524 1649942 1430124 1321723
13936A321723l9150J79223N5947L3924L7461j91494K4028P9165j62134J45083
$$ 1321723 1282573 1461796 1517743 1551667 1589128 1397634 1421662 1500827 1338693 1483776
13926A483776j8628k19301m0908r4705J06410J95793k1124J04080j03599k82063
$$ 1483776 1465148 1245847 1204939 1110234 1216644 1412437 1391313 1495393 1391794 1109731
13916A109731m8513J54283k2713K11363l36178L16304j02740k38417J82024j59242
$$ 1109731 1061218 1215501 1192788 1404151 1067973 1384277 1281537 1043120 1225144 1065902
13906A065902K67595m40431K71313J60709j55008J50598j43554o4790m2651J7575
$$ 1065902 1333497 893066 1164379 1325088 1170080 1320678 1177124 1112334 1069683 1087258
13896A087258j82547K95439l68733M40244j00079l314j15904R0162p7675k47595
$$ 1087258 904711 1200150 831417 1271661 1171582 1168268 1052364 1142526 1064851 817256
13886H17256L50665Kj55295K68190j95966K32258k95532r7283J01831J47920l54125
$$ 817256 1167921 1167923 1012628 1280818 1084852 1317110 1021578 924295 1026126 1174046 819921
13875H19921L57628m38336P6129L61625j15498r1942J2710J35036m83547K49254
$$ 819921 1177549 739213 815342 1176967 1061469 969527 982237 1117273 633726 882980
13865H82980K53800j10545K0059J8321l13183J34986k62484L04885R4656j96363
$$ 882980 1136780 1026235 1046294 1064615 751432 886418 623934 928819 1023475 827112
13855H27112j2348k1485J21958j63870J17908K7136j35289q1961K05498q8424
$$ 827112 814764 793279 915237 751367 869275 896411 761122 679161 884659 796235
13845G96235K0248k59392K65572J8151N2423P4061P9663l33272Q6661k7992P9068
$$ 796235 816483 557091 822663 840814 893237 967298 1046961 713689 800350 772358 851426
13834H51426K6030J24352C64859L40295J62656j0225l49473l7405K60452J72320
$$ 851426 877456 1001808 364859 705154 867810 857585 508112 470707 731159 903479
13824I03479k86385J96417N3785k19544R9728K7975K6443J513J64739k99509K5733
$$ 903479 617094 813511 867296 647752 747480 775455 801898 803411 968150 668641 694374
13813F94374J90726K9812k4262j12695r5937J13946j29469n0864L01068L6699
$$ 694374 885100 914912 890650 777955 682018 795964 666495 615631 916699 953398
13803I53398j71833k52833L20258l06782J41723J27335j60843m9330O7279q9048
$$ 953398 781565 528732 848990 542208 683931 811266 650423 601093 668372 579324
13793E79324Q1742K16241k66906k44304M64093C04369N69206R755j11660C47397
$$ 579324 661066 877307 610401 366097 830190 304369 873575 883330 771670 347397
13782C56234K97019K1080k6865N391K01701K31082n16618J5250j2970j07404P3570
$$ 356234 653253 674333 647468 652859 854560 1085642 569024 584274 571304 463900 537470
13771E37470j41623K35384k91989K99929j06990K48601j0284k20961m88l7005
$$ 537470 395847 631231 339242 639171 532181 780782 770498 549537 549049 512044
13761E12044Q7809k36348N55391l35760j5533k1577L3476K77421D01523N8951
$$ 512044 599853 363505 918896 583136 567603 546026 579502 856923 401523 460474
13751D60474Q5750B68850L59073l06959K17370J98860k89412j8932j13532M14760
$$ 460474 546224 268850 627923 320964 538334 737194 447782 428850 315318 730078
13741G30078k91446J46091J0677n4124j94040K61871A34602J84977M4358K1706
$$ 730078 438632 584723 595400 541276 347236 609107 134602 319579 363937 385643
13731C85643q2154J57187R0768j93680k2823H4436L57342j4308l2839j1196K61225
$$ 385643 303489 460676 551444 357764 334941 84436 441778 427470 394631 383435 644660
13720F44660j33056B44772P7710P8933K1845J24337q1024B02766J45880j21985
$$ 644660 511604 244772 322482 401415 423260 547597 466573 202766 348646 226661
13710B26661K86922L72227A03076M99887k48788g846E99915A75073M47359k57797
$$ 226661 513583 885810 103076 602963 354175 -7846 599915 175073 622432 364635
13700C64635O1703L4721q01j91044L64572L6664B56110K14967k20511A19108L83388
$$ 364635 426338 461059 460258 269214 633786 670450 256110 471077 250566 119108 502496
13689E02496j299l3774m1205j06352j20647J46639K42527p4992Q1229B17786M63845
$$ 502496 501197 467423 426218 319866 199219 345858 588385 513393 594622 217786 681631
13678F81631B37661J27321N43450A61901L29716n9224J88952B66258N37959A63033
$$ 681631 237661 364982 908432 161901 491617 432393 621345 266258 804217 163033
13667C20421J54127p6931L3625j54411A32765l8605M93247j33835l9805M6245
$$ 320421 474548 397617 431242 276831 132765 94160 587407 453572 413767 460012
13657D60012A24835M01275B09248n6389M37752l8423N5324B06986J82339K34139
$$ 460012 124835 526110 209248 152859 590611 552188 607512 206986 389325 623464
13647F23464j22920j54005j07867J43508j15952K41033D8679L58562j25377o4652
$$ 623464 500544 346539 238672 382180 266228 507261 48679 407241 281864 217212
13637B17212J4870K15723j68215l9934p3977L64681A77871K40691J87j96795n7955
$$ 217212 232082 447805 279590 239656 165679 530360 177871 418562 418749 221954 163999
13626A63999P590Q8960K46319K0890q2809j26430P4582P5941j39633P7745H0567
$$ 163999 171589 260549 506868 527758 444949 318519 393101 469042 329409 407154 80567
13614C35916n5346K58833o1312B09300L35104k13118p4524K31097A90057l9578
$$ 335916 280570 539403 478091 209300 544404 331286 256762 487859 190057 150479
13604A50479L35878B7738O0559L12890J0981j18738G2139J11480K03316J18962
$$ 150479 486357 27738 88297 401187 412168 293430 72139 183619 386935 505897
13594E05897k24958O5475n9889j3771N6924A17454J82660K00730F4084L48119
$$ 505897 280939 346414 286525 272754 329678 117454 300114 500844 64084 412203
13584D12203A67402J1607p7734L89665G3755J68148K22651H2737C176M62649j56551
$$ 412203 167402 179009 101275 490940 73755 241903 464554 82737 3176 465825 309274
13573C09274m0555k6052p3541a2315C20324j23359P0017J06867j81938L8338J08766
$$ 309274 268719 242667 169126 -12315 320324 196965 266982 373849 191911 230249 339015
13562C39015j68332K4176J57536m7060A19282J26741O0595K24979j02885H1001
$$ 339015 170683 194859 352395 305335 119282 246023 306618 531597 428712 81001
13551A13236L82754j22045o6004N3109J80328M114A91611J81342R0242a22166
$$ 113236 495990 373945 307941 361050 541378 545492 191611 372953 463195 -122166
13540A76889J03252I5167J85554q5824J65073D1305J54857B3712R4354L09Q0702
$$ 176889 280141 95167 280721 194897 359970 41305 196162 23712 118066 118375 199077
13529A99077J93044n352J13027k22363M8830K5713j1077P2391j26514e5958D70958
$$ 199077 392121 386769 499796 277433 326263 351976 340899 413290 286776 -55958 470958
13517C94947p6684P311A03040J7530J99321D6709M54762J377F7700L37230j41807
$$ 394947 318263 325574 103040 120570 319891 46709 501471 502848 67700 404930 263123
13506B63123C9672h0750C46351G9024K91348e4073j2753F1410J49367p5181b23124
$$ 263123 39672 -80750 346351 79024 370372 -54073 -66826 61410 210777 135596 -223124
13494C79186N4691A10310J05182k9599a26751D10362C662K71441D3297K20089
$$ 379186 433877 110310 215492 185893 -126751 410362 3662 275103 43297 263386
13484B63386L7119A36404f8672k4184C06844A30780K7242L14813j82639A5877
$$ 263386 300505 136404 -68672 -92856 306844 130780 158022 472835 290196 15877
13473E2872K01318D1867K03897E6087K76281G0667L36049k02720m7884C5733J95442
$$ 52872 254190 41867 245764 56087 332368 70667 406716 203996 156112 35733 231175
13462B31175P1615m7070m8633J49988l3658p6850R8080I3783J15925C3138f4730
$$ 231175 302790 255720 207087 357075 323417 246567 344647 93783 209708 33138 -64730
13450A50032L4078K24780j37240j4438K8662j6628O238A17540c3110D94683G3294
$$ 150032 184110 408890 271650 257212 285874 269246 275484 117540 -33110 494683 73294
13438a16597A01502J03875N7291n2172j03391M54962B58371p8911G6080J15050
$$ -116597 101502 205377 262668 210496 107105 562067 258371 179460 76080 191130
13428A91130a40811B13216p4916P4468b2331A59761o7294n492K38069H9810L44017
$$ 191130 -140811 213216 138300 212768 -22331 159761 92467 86975 325044 89810 433827
13417D33827B15934G6335a27506C9927K92282O1988A55470J02380G0747K30601
$$ 433827 215934 76335 -127506 39927 332209 394197 155470 257850 70747 301348
13407C01348j30986M0926q1229J1978c3579A27253J17947b06553D1258L91549
$$ 301348 170362 211288 130059 142037 -33579 127253 245200 -206553 41258 432807
13397D32807g4623C09502E3251J34169E7517B2582L30854d5709B16718a23956
$$ 432807 -74623 309502 53251 187420 57517 22582 353436 -45709 216718 -123956
13386I1009K96846j32068b7525D08535j81174a27780B72596e8186A09844b0651
$$ 91009 387855 255787 -27525 408535 227361 -127780 272596 -58186 109844 -20651
13375a25556j0077E5220K12813E5024P4252J33701a07538C88457p5486j08247
$$ -125556 -135633 55220 268033 55024 129276 262977 -107538 388457 312971 204724
13365B04724J97562f1060F0071a6681B95683d9823E1143K19891O864k225j00049
$$ 204724 402286 -61060 60071 -16681 295683 -49823 51143 271034 277898 275673 175624
13354A75624j3936i2269j5204E7280d3013D8994N22907k60400B5404J36743J46730
$$ 175624 161688 -92269 -107473 57280 -43013 48994 571901 311501 25404 162147 308877
13343C08877L0451J77402j55101A06287K43990G4020b13425B26382n9396L9373
$$ 308877 339328 516730 361629 106287 350277 74020 -213425 226382 166986 206359
13333B06359J53883Q8415A37297R0887n1082E8673J56296k9089F1246h8128B562
$$ 206359 360242 448657 137297 228184 177102 58673 214969 185880 61246 -88128 2562
13321A93626A4313K33894n7177P7939J38593a82213C17585p2737C330M48455j53994
$$ 193626 14313 248207 191030 268969 407562 -182213 317585 244848 3330 451785 297791
13310B97791n1642l57D4202c9444H3150K22597F2768K6592J59560j05246a72255
$$ 297791 246149 245792 44202 -39444 83150 305747 62768 89360 248920 143674 -172255
13298A49087R8651j20040K32843A1864J82207P6001F1688J02878N0761b0564R386
$$ 149087 247738 127698 360541 11864 194071 270072 61688 164566 215327 -20564 -11178
13287a1178A30134L0243j0990B1161K9494K83248d36647C10497A25585K57590
$$ -11178 130134 160377 149387 21161 50655 333903 -436647 310497 125585 383175
13277C83175a09203C77480n1079o7380a43410A46533b9336B07699p3034A2193
$$ 383175 -109203 377480 326401 259021 -143410 146533 -29336 207699 134665 12193
13266a33962A81292h6330A73278K10280A82108q9170e9500G5292b03798E7300
$$ -133962 181292 -86330 173278 383558 182108 92938 -59500 75292 -203798 57300
13255b52840h5304j30109A33462a02230J8897A22189J22593o5544a76967B29509
$$ -252840 -85304 -215413 133462 -102230 -83333 122189 244782 179238 -176967 229509
13244B65980G7278b58907a2765A98818B1569i9102C5389i3125P570C19725j6657
$$ 265980 77278 -258907 -12765 198818 21569 -99102 35389 -93125 -85555 319725 303068
13233C03068N7080j52403d8700r8117b3017B32364l0286B2702L6213K12969p7077
$$ 303068 360148 207745 -48700 -146817 -23017 232364 202078 22702 58915 271884 194807
13222A94807J21011F6144J79388g3109A27689n4764J28433J10928A20059J31985
$$ 194807 315818 66144 245532 -73109 127689 72925 201358 312286 120059 252044
13212B52044O8671A16709M7930B2476f9617C5390R2594b4474C97431E8335a16609
$$ 252044 320715 116709 164639 22476 -69617 35390 127984 -24474 397431 58335 -116609
13200B25702a68610o3396d2783A24194F1588N2880C2994J16931b10621b7211j96257
$$ 225702 -168610 -232006 -42783 124194 61588 114468 32994 149925 -210621 -27211 -223468
13189b23468a2147A39139J6348F5455i6619A84052N337R6139H8909L46487j34076
$$ -223468 -12147 139139 155487 65455 -96619 184052 189389 285528 88909 435396 301320
13178C01320g2941A67747A3982J96504p5764c46A31134a28120i436G0178J45902
$$ 301320 -72941 167747 13982 210486 134722 -346 131134 -128120 -9436 70178 216080
13167B16080H4775P3558e3208H7404b5160A25152K5754L03441A90917Q9823j9121
$$ 216080 84775 158333 -53208 87404 -25160 125152 150906 454347 190917 280740 261619
13156B61619c190A22372m4785k7510a47010J6005C21150B6454J64723b21411A77805
$$ 261619 -3190 122372 77587 50077 -147010 -131005 321150 26454 191177 -221411 177805
13144H67g320j54653K832f8014B61730g7158c4978l4011H4885F816J49292J4403
$$ 867 -7320 -161973 -159141 -68014 261730 -77158 -34978 -68989 84885 6816 156108 170511
13132A70511K5266r1782C439K72762e7180k0956j0068A98093i9830B38100i1078
$$ 170511 195777 103995 3439 276201 -57180 -78136 -88204 198093 -99830 238100 -91078
13120d4279J1931I8334k1079a3033E3695Q989g3799A41008B1828a99829B2632
$$ -44279 -32348 98334 77255 -13033 53695 62684 -73799 141008 21828 -199829 22632
13108B87651j27905J11183E7133L12812d4148p6134B18792F2544J65292h9235
$$ 287651 159746 270929 57133 369945 -44148 -120282 218792 62544 227836 -89235
13097B5592B775e8343B23491I0873b9783k98610A49077G0350J53119M0650a0610
$$ 25592 2775 -58343 223491 90873 -29783 -328393 149077 70350 223469 264119 -10610
13085b71201C6680J92360G5452g6330n5905K9147A07444O9109C6652d82161a25064
$$ -271201 36680 229040 75452 -76330 -132235 -103088 107444 176553 36652 -482161 -125064
13073D35307j81589j13838J81424A1715N1078a69314C37272i5914i948A53173
$$ 435307 253718 139880 321304 11715 62793 -169314 337272 -95914 -9948 153173
13062a52605E8753J49163H4529K2166n1494A9717b3010I8276J27086a08533I07
$$ -152605 58753 207916 84529 106695 55201 19717 -23010 98276 225362 -108533 907
13050A73970k6702J56491H6299J08152G37N03327B18725F1084H751O2566c73986
$$ 173970 147268 303759 86299 194451 737 504064 218725 61084 8751 71317 -373986
13038A06483C3491K45734j32395L42850A16281K13879j27147a38530A22132K870
$$ 106483 33491 279225 146830 489680 116281 330160 203013 -138530 122132 125002
13028A25002a56483G9267J75056i5419q4193C0713b06247A29807F2895j8858a50869
$$ 125002 -156483 79267 254323 -95419 -179612 30713 -206247 129807 62895 44037 -150869
13016B02542G8255h6490b1616B08651J15039j02212E8549J08704B7259b14383
$$ 202542 78255 -86490 -21616 208651 323690 221478 58549 167253 27259 -214383
13005F2720K47081g1392H4270i0851A95474o299K86536c03244I6357c0327A48062
$$ 62720 309801 -71392 84270 -90851 195474 189175 475711 -303244 96357 -30327 148062
12993H8662J13543q7103K8731c28313c8375B30022a59292b4743l45201Q5294I2446
$$ 88662 202205 115102 143833 -328313 -38375 230022 -159292 -24743 -369944 -284650 92446
12981b11384f2064B30307k440a52053A28927h9201I5605a26362A26579e0710o5614
$$ -211384 -62064 230307 227867 -152053 128927 -89201 95605 -126362 126579 -50710 -116324
12970a16324j24703B3583a30190J0624A26176L47932B15762I428O8761a08061
$$ -116324 -241027 23583 -130190 -119566 126176 474108 215762 9428 78189 -108061
12959B20238f2947j19395e7807c213m06073i9242A92230c2590J3676H8735L2962
$$ 220238 -62947 -182342 -57807 -3213 -409286 -99242 192230 -32590 -18914 88735 121697
12948A21697J35645d339B12655N3679j04258a3986A04682a68698j9939E9527L5802
$$ 121697 257342 -4339 212655 266334 162076 -13986 104682 -168698 -188637 59527 95329
12937I5329K76823B6658J42613q2281h9624k5166D3465J2921c0615B00605D4478
$$ 95329 372152 26658 169271 86990 -89624 -114790 43465 56386 -30615 200605 44478
12925A35476a94085B50126a12646e4228D23564p7226a0639k9232A723L41375G7571
$$ 135476 -194085 250126 -112646 -54228 423564 346338 -10639 -39871 1723 343098 77571
12913a39091A96288j2813Q9410a57593I1154a21175I0478J9439C7311A5372a70762
$$ -139091 196288 183475 272885 -157593 91154 -121175 90478 109917 37311 15372 -170762
12901a8279l9668j83475A89724b76578C9586O2178q279J00700a34346B57852q6370
$$ -18279 -57947 -241422 189724 -276578 39586 101764 93485 194185 -134346 257852 171482
12890A71482i7185A01374a42689A37718b37229a17703j5772N5366B6299J23908
$$ 171482 -97185 101374 -142689 137718 -237229 -117703 -133475 -78109 26299 150207
12880A50207i1397A50423b7193A50988d28944C13182d7020B34427g5323j7300
$$ 150207 -91397 150423 -27193 150988 -428944 313182 -47020 234427 -75323 -92623
12870i2623l4698O3077k0262D11179A84845a97822C670a03041c6648H0489i330
$$ -92623 -127321 -64244 -84506 411179 184845 -197822 3670 -103041 -36648 80489 -9330
12858A27232a3048R44j64617G2811J58195D1654h7573B39706i0399L1175H9550
$$ 127232 -13048 -12104 -176721 72811 231006 41654 -87573 239706 -90399 -59224 89550
12846a83133b6214j95343J00575d3584A44160J30370L5005q9726A07252f4157
$$ -183133 -26214 -221557 -120982 -43584 144160 274530 309535 219809 107252 -64157
12835a6398j56351A2742a95287B01448q0294L4725a12478A10518k7923a04352
$$ -16398 -172749 12742 -195287 201448 121154 155879 -112478 110518 82595 -104352
12824b2985j97176D9230a46296B9259a84215A70866l2862c5093j64879F7072a29595
$$ -22985 -220161 49230 -146296 29259 -184215 170866 138004 -35093 -199972 67072 -129595
12812C74659c07973B7257O5521N53K72707j47591J40016m6237A5282J70087A0330
$$ 374659 -307973 27257 92778 93331 366038 218447 358463 312226 15282 185369 10330
12800c84254C8860K28380r399F3039L5378B962J94665H1861a69027g9193l16496
$$ -384254 38860 267240 257841 63039 98417 2962 197627 81861 -169027 -79193 -395689
12789c95689A22896L09122b06573B14510o1718a86958J7259j26664F551a46794
$$ -395689 122896 432018 -206573 214510 152792 -186958 -169699 -296363 6551 -146794
12778A03540k8300c8430J4666o6418B56222a8472H7783K3736a19986g490I037
$$ 103540 75240 -38430 -23764 -90182 256222 -18472 87783 111519 -119986 -7490 9037
12766a77055e9882J2090B11127J6315b4179E0966a48414A78855K9032J24099a9990
$$ -177055 -59882 -47792 211127 227442 -24179 50966 -148414 178855 207887 331986 -19990
12754A20454K67a12664M1435k750a8882B67989P1034G9996K3255d1074A44520
$$ 120454 120721 -112664 -71229 -73979 -18882 267989 339023 79996 103251 -41074 144520
12742A15085j7237J0297q371b01251E5906L546J18583D9019B1886J5001K08706
$$ 115085 97848 108145 99774 -201251 55906 59452 178035 49019 21886 36887 245593
12731B45593i0983C1412a99728m6407A0681h360I9198c20833B29144i7031A59596
$$ 245593 -90983 31412 -199728 -246135 10681 -8360 99198 -320833 229144 -97031 159596
12719i2176A86728B7405j3625L27628e7358j77127G31a6100H2978L17031A33518
$$ -92176 186728 27405 13780 341408 -57358 -234485 731 -16100 82978 400009 133518
12707G2405J3079C3470J72441J8238M7351i8981o9373j5207B55539j19654i0375
$$ 72405 85484 33470 205911 224149 271500 -98981 -168354 -183561 255539 135885 -90375
12695a66274A06151J7843h0260A50833D0813b3525l36717a65041G486a43137o8943
$$ -166274 106151 123994 -80260 150833 40813 -23525 -360242 -165041 7486 -143137 -212080
12684b12080B8555a72044b0077j45806A52240O1782C7197K20749M5661j25506
$$ -212080 28555 -172044 -20077 -165883 152240 214022 37197 257946 303607 178101
12674A78101g0223e541B65878a2828o5627A89990H0652b30079h1287A33703L3713
$$ 178101 -70223 -5541 265878 -12828 -78455 189990 80652 -230079 -81287 133703 167416
12663A67416b4921A26410Q7094A302K03615L8972A5232K25950C5094J14419J68702
$$ 167416 -24921 126410 213504 1302 204917 243889 15232 241182 35094 149513 318215
12652C18215D891J87292Q3746a13797k55996B48789a03183K6936A91065a39356
$$ 318215 4891 192183 275929 -113797 -369793 248789 -103183 -76247 191065 -139356
12641I9331a44376c6743I6804a41886A5556g3068B55430R1566h750B32666a35117
$$ 99331 -144376 -36743 96804 -141886 15556 -73068 255430 346996 -8750 232666 -135117
12629A68501J30714K6135A01934A9287K05837A8469a76623c847j17545D53998
$$ 168501 299215 325350 101934 19287 225124 18469 -176623 -3847 -121392 453998
12618i4363l7958G2124f2021F9424a8727I9711f6646A80061k2315j6540n584E717
$$ -94363 -132321 72124 -62021 69424 -18727 99711 -66646 180061 157746 141206 135622 5717
12605C63386j05681a0726D33035A54103a21450k1113r913A42471f9546D07508
$$ 363386 257705 -10726 433035 154103 -121450 -142563 -152476 142471 -69546 407508
12594B17238R7979r1954c4150J6848C2023K44541j28740b10927A38155j4617C1061
$$ 217238 315217 223263 -34150 -17302 32023 276564 147824 -210927 138155 123538 31061
12582E5161c28896A23462L5581a38351j7068E1806J90526c068C67836h2666h294
$$ 55161 -328896 123462 159043 -138351 -155419 51806 242332 -3068 367836 -82666 -8294
12570B47203g4782B47862q9894c24052A22813j3177J39207a76188C40158G2265
$$ 247203 -74782 247862 157968 -324052 122813 109636 248843 -176188 340158 72265
12559b45302n0103A2882M7776a0587A99603b35760f1763C01000g6011A408e689
$$ -245302 -295405 12882 60658 -10587 199603 -235760 -61763 301000 -76011 1408 -5689
12547A29683a41261F7736B6849a15368A05076J75543b71367C970a09815l2882
$$ 129683 -141261 67736 26849 -115368 105076 280619 -271367 3970 -109815 -142697
12537a42697B9205i8221A45508J09565j04349N4425d2095C6923j7263K4539N8228
$$ -142697 29205 -98221 145508 255073 150724 205149 -42095 36923 19660 44199 102427
12526A02427a31030E5799b56287C06152p6998m1241J21882C006J2120P9234H958
$$ 102427 -131030 55799 -256287 306152 229154 187913 309795 3006 15126 94360 8958
12514b1429A15601O7480g3758k5410B81125i1945J5616n4506l297j49537J37395
$$ -21429 115601 183081 -73758 -99168 281125 -91945 -76329 -130835 -134132 -283669 -146274
12503a46274a1608F5454L59241B7147b41282B9685J28905h7018B06366a43793
$$ -146274 -11608 65454 424695 27147 -241282 29685 158590 -87018 206366 -143793
12492i4629k63087a72507D2469J7874M4605k1935O0150a70651B4505J08668d2743
$$ -94629 -357716 -172507 42469 60343 104948 83013 143163 -170651 24505 133173 -42743
12480H0524a33572K6890j92869R4668g9222b463q8464j4131r6318N9569D9450
$$ 80524 -133572 -106682 -299551 -204883 -79222 -2463 -90927 -105058 -201376 -141807 49450
12468B62466j22248e59093a12769N4402j11086D2368J9565b462B77418G1660i6535
$$ 262466 140218 -559093 -112769 -58367 -169453 42368 61933 -2462 277418 71660 -96535
12456g4409l0702L345l1731c7670k2536j11539B76534a63014a2260o7595A66210
$$ -74409 -105111 -101766 -133497 -37670 -60206 -171745 276534 -163014 -12260 -79855 166210
12444a63188f8427K5879D1545d2920I8526b60327f2572k44028B5044f8214A02418
$$ -163188 -68427 -42548 41545 -42920 98526 -260327 -62572 -306600 25044 -68214 102418
12432d3305A14482c7805E7705j0445a75196A5022J85623A6798a7252H233c81685
$$ -43305 114482 -37805 57705 47260 -175196 15022 200645 16798 -17252 8233 -381685
12420e5853b2042E9396J80838o5784a2534q8154E6231b58396B21934D2941a8395
$$ -55853 -22042 59396 240234 174450 -12534 -100688 56231 -258396 221934 42941 -18395
12408H3921a2284l3664j11296B55037M3087Q6933a48373l7807p5417Q0437B02799
$$ 83921 -12284 -45948 -157244 255037 298124 385057 -148373 -186180 -261597 -181160 202799
12396a71751O6248B50409b55563C2894f227k20350A6928R7403d06443f1038B2389
$$ -171751 -105503 250409 -255563 32894 -6227 -226577 16928 114331 -406443 -61038 22389
12384e024C58483e7838C4181J034J6752L2638N1976m5029f9934A6192a61414m6442
$$ -5024 358483 -57838 34181 35215 51967 84605 136581 91552 -69934 16192 -161414 -207856
12372b07856a0816A47465L4343c25754C07778b528q0701o4464H0621M14241a03784
$$ -207856 -10816 147465 181808 -325754 307778 -2528 -83229 -147693 80621 494862 -103784
12360a00019A08636d5772j34134N995f0810k77740O4574H0724K3222n1377d0550
$$ -100019 108636 -45772 -179906 -173911 -60810 -338550 -273976 80724 103946 52569 -40550
12348i8336I7527H215d4170A73342p0866a71092F4182c0292A35673J54492e289
$$ -98336 97527 8215 -44170 173342 102476 -171092 64182 -30292 135673 290165 -5289
12336A08535c587j04486A41051o1334J07273a39215B21609J05405a31314A41442
$$ 108535 -3587 -108073 141051 79717 186990 -139215 221609 327014 -131314 141442
12325B78707A37076K0756A5639J55108b23404H5313c0271A3815a00631H8598g2800
$$ 278707 137076 157832 15639 170747 -223404 85313 -30271 13815 -100631 88598 -72800
12313f286k86495a04362m4771A19903b83580A4352a26222j95622P9207i6047G0564
$$ -6286 -292781 -104362 -149133 119903 -283580 14352 -126222 -321844 -242637 -96047 70564
12301a46852A67859c16605D77512b45610I9342a0851C49196e0417D3679E926P3093
$$ -146852 167859 -316605 477512 -245610 99342 -10851 349196 -50417 43679 5926 79019
12290G9019d3761B51590I2776C5713K61709a06125K7458A60994Q125A1482J48216
$$ 79019 -43761 251590 92776 35713 297422 -106125 -78667 160994 169119 11482 159698
12279A59698r575C8833E254R2773j5850K26968D7101K18249j30289B5172M7430
$$ 159698 150123 38833 5254 98027 82177 309145 47101 265350 135061 25172 72602
12268G2602J16854M3916a05082a4772B9674K03924E2346g1936A51192D7483P0514
$$ 72602 189456 233372 -105082 -14772 29674 233598 52346 -71936 151192 47483 117997
12257A17997i0676J1199o1791B92346B9463R955a67704K3150A83367K20052k2080
$$ 117997 -90676 -79477 -141268 292346 29463 39418 -167704 -144554 183367 403419 381339
12246C81339E6714f0791o4981A08813M41235a53267O4428B21621C8793f9935B20877
$$ 381339 56714 -60791 -125772 108813 550048 -153267 -88839 221621 38793 -69935 220877
12234H5351b35592L9913i3800D1321a43962F8039a97897A48467j7017a84886A23602
$$ 85351 -235592 -195679 -93800 41321 -143962 68039 -197897 148467 131450 -184886 123602
12222B39281i5096a3401C98156K6529k06177A318K44401l4836F2082M4714N2533
$$ 239281 -95096 -13401 398156 424685 218508 1318 245719 210883 62082 106796 159329
12211A59329J43409a09141A60239G97M70051H5393N4675J82507C5520A7135J321
$$ 159329 302738 -109141 160239 797 470848 85393 140068 322575 35520 17135 18456
12200A8456K53402J88871a99231f8072C02501I7236J02304R9453q5641J42734
$$ 18456 271858 460729 -199231 -68072 302501 97236 199540 298993 213352 356086
12190C56086j75094J19479f3742j29444C33535a38299M0406A65489B5146b1855
$$ 356086 180992 300471 -63742 -193186 333535 -138299 -97893 165489 25146 -21855
12179I2945d44411B88831I6100J85524a85145A17079d1746B89674B751K23366
$$ 92945 -444411 288831 96100 281624 -185145 117079 -41746 289674 2751 226117
12169B26117J0945N7182A33987a43471B48824H7945K72361b24055A09938d62893
$$ 226117 237062 294244 133987 -143471 248824 87945 360306 -224055 109938 -462893
12158B63692b2349I1798i7673B37700b24753g2428G1000J95617E8530B0275a58838
$$ 263692 -22349 91798 -97673 237700 -224753 -72428 71000 266617 58530 20275 -158838
12146A99565B2343g2166B04473G3522J02140G9068c8820o5559l38498a478B1872
$$ 199565 22343 -72166 204473 73522 175662 79068 -38820 -104379 -442877 -1478 21872
12134E5205h1327C7642K27786D0020G808a67469d2361k38166f0322k21728B09056
$$ 55205 -81327 37642 265428 40020 7808 -167469 -42361 -280527 -60322 -282050 209056
12122F5477f0946h029k06580Q8375C47711K92413A79175a0057B43674e3071k38739
$$ 65477 -60946 -8029 -214609 -126234 347711 640124 179175 -10057 243674 -53071 -291810
12111b91810i75F0801d0199j02187n6636l3211G8124J26846b75912m1677A74781
$$ -291810 -975 60801 -40199 -142386 -199022 -232233 78124 204970 -275912 -317589 174781
12099C88959A02022d5915e454k00411A07332b44300j6178f553j37043A38085A7604
$$ 388959 102022 -45915 -5454 -205865 107332 -244300 -260478 -6553 -143596 138085 17604
12087C3161a05717A3655L07758a13500d4419I9680K00815N03309P43713J37572
$$ 33161 -105717 13655 321413 -113500 -44419 99680 300495 803804 1547517 1685089
12077A685089F41929l15151c49A63259C9538M2229a9612q0545d9448A69326a62781
$$ 1685089 641929 326778 -349 163259 39538 81767 -19612 -100157 -49448 169326 -162781
12065i0456A16617m7962k7581J9007J43658d5634C21710b9925j63309i6548n6851
$$ -90456 116617 68655 41074 60081 203739 -45634 321710 -29925 -193234 -96548 -153399
12054a53399O6853B13425b86677C06069A13245b84377B37898i2040D32063B14112
$$ -153399 -86546 213425 -286677 306069 113245 -284377 237898 -92040 432063 214112
12043A73773C7534J51950a99732B526b85G4184b1452C00036I4441b2837j59263
$$ 173773 37534 189484 -199732 2526 -285 74184 -21452 300036 94441 -22837 -182100
12032a82100k186g9307D5334h8268j41604P2355A57746b30196B17508C0687a75394
$$ -182100 -184286 -79307 45334 -88268 -229872 -157517 157746 -230196 217508 30687 -175394
12020F2530q875c14094A8938J0636n220Q6878g5678m5079e4649A0853g9783b2972
$$ 62530 53655 -314094 18938 29574 24354 111232 -75678 -120757 -54649 10853 -79783 -22972
12007A9458d2751A79048a25904M2270A71679i1037j08896k21445B04106b90113
$$ 19458 -42751 179048 -125904 -83634 171679 -91037 -199933 -421378 204106 -290113
11996I972h3608n1417b2496B56746E614b39969A74210f4429H9669a14624A26459
$$ 9972 -83608 -135025 -22496 256746 5614 -239969 174210 -64429 89669 -114624 126459
11984a91550c1487k7234A44180g5281j5834L8231A26418A0913I45d83945A28786
$$ -191550 -31487 -58721 144180 -75281 -91115 -52884 126418 10913 945 -483945 128786
11972B64676j09358a19740L4935c3563C4062L77023a05517k09233B33374Q9536
$$ 264676 155318 -119740 -84805 -33563 34062 411085 -105517 -314750 233374 322910
11962C22910A20806J43862C930J34481f9013a7233E8298r836J10589c60495a54872
$$ 322910 120806 264668 3930 138411 -69013 -17233 58298 48462 159051 -360495 -154872
11950a97101A26681b76308i5707B4034b86145B3013a08218Q861d449k87222K1414
$$ -197101 126681 -276308 -95707 24034 -286145 23013 -108218 -99357 -4449 -291671 -270257
11939b70257c2120B22318a02873r9595a2514A97235H1620J42478D9250A5035J67051
$$ -270257 -32120 222318 -102873 -202468 -12514 197235 81620 224098 49250 15035 182086
11928A82086a25650q7071j6147B89727c9305p9737G7782f8527l8315G2522g166
$$ 182086 -125650 -212721 -228868 289727 -39305 -119042 77782 -68527 -106842 72522 -7166
11916e5320E5562J27216L9969b33858E1911K4969K3225A8096P7854a96029c5589
$$ -55320 55562 182778 222747 -233858 51911 76880 100105 18096 95950 -196029 -35589
11904A48004a90541M5184A99396n9200K20805b07816k2833F6486J79752H7396
$$ 148004 -190541 -145357 199396 140196 361001 -207816 -230649 66486 246238 87396
11893C3126d58055i4914e616l4747j33426k11187a02914c983E8689c0144H9795
$$ 33126 -458055 -94914 -5616 -40363 -173789 -384976 -102914 -3983 58689 -30144 89795
11881a13486r178p1932C5468Q8692m3825J46132r2947a81290J8599j55403a29771
$$ -113486 -122664 -194596 35468 124160 80335 226467 133520 -181290 -162691 -318094 -129771
11869g5793g416n13827G4923Q1280F601a4866D825f9134l3252J5147B16508a09279
$$ -75793 -7416 -521243 74923 156203 6601 -14866 4825 -69134 -102386 -87239 216508 -109279
11856a5857k86164i5022D4909h0919F4008k160J17916a48806j38934R2604Q7168
$$ -15857 -302021 -95022 44909 -80919 64008 61848 179764 -148806 -287740 -195136 -107968
11845a07968J843j47449c204D7935L63844b0891j14369A81782c60439A00449c9728
$$ -107968 -106125 -253574 -3204 47935 411779 -20891 -135260 181782 -360439 100449 -39728
11833A45428c3453p3700A14038b08358A32188Q2797i9842j330A35495e3997B3922
$$ 145428 -33453 -107153 114038 -208358 132188 214985 -99842 -101172 135495 -53997 23922
11821B1396R0009C4575e0795j57038B72162a61066H1752b16330j13725f386F2591
$$ 21396 111405 34575 -50795 -207833 272162 -161066 81752 -216330 -330055 -6386 62591
11809a19865H5829a03869B20360F622c1348m537q3071B88346G3758a00075p2947
$$ -119865 85829 -103869 220360 6622 -31348 -35885 -118956 288346 73758 -100075 -173022
11798a73022a0979l52010H8616B3693P5932c75600A15926M1461K1370p1822h5461
$$ -173022 -10979 -362989 88616 23693 99625 -375600 115926 157387 178757 106935 -85461
11786a64210m1716m3837A58392a24361F1595a1281j41230p41H711J53544F5349
$$ -164210 -205926 -249763 158392 -124361 61595 -11281 -152511 -153252 8711 162255 65349
11774a88496j41570a05963A16891b02023k4493H179c05414B33737d4754B75456
$$ -188496 -330066 -105963 116891 -202023 -226516 8179 -305414 233737 -44754 275456
11763a31203f20H6068b2925E4647F920a363j35164A89385d16673G6670J7558J00962
$$ -131203 -620 86068 -22925 54647 6920 -1363 -136527 189385 -416673 76670 94228 195190
11751A95190C8857j0736M16531c1508j40641E6656b4934N37J776J0422l67024
$$ 195190 38857 28121 444652 -31508 -172149 56656 -24934 -24397 -22621 -12199 -379223
11740c79223f4581A17098l3675i3846B54768o9363i0263H9592b5102A20125a99195
$$ -379223 -64581 117098 83423 -93846 254768 185405 -90263 89592 -25102 120125 -199195
11728C19976a24666B4262J58319a42515p8615A52189l8476l8304J43188a01512
$$ 319976 -124666 24262 182581 -142515 -221130 152189 113713 75409 218597 -101512
11717H9393J6527B6995i7079b8150j30647a01l09574A58157c2491k3408B41117
$$ 89393 105920 26995 -97079 -28150 -158797 -101 -309675 158157 -32491 -55899 241117
11705B31449A14035J19740A0107l839N1444j6663a00864D15300O0287C349a86105
$$ 231449 114035 233775 10107 6268 57712 41049 -100864 415300 475587 3349 -186105
11693D9394f26047f5193r0400A05622a41034B53798a67573A41685a17225D8474
$$ 49394 -626047 -65193 -155593 105622 -141034 253798 -167573 141685 -117225 48474
11682E6416b82680f4776E08355a69694f5835j18521N0077F4960a70866D385M9669
$$ 56416 -282680 -64776 508355 -169694 -65835 -184356 -134279 64960 -170866 4385 54054
11671E4054k157d3931E4209a45823I0581L5156p060I947a92800D9133a67270D6472
$$ 54054 51897 -43931 54209 -145823 90581 125737 118677 9947 -192800 49133 -167270 46472
11658F6110a21928m5443K0594C2593j4395d7597A25186n8219J31995a7034A42973
$$ 66110 -121928 -167371 -146777 32593 18198 -47597 125186 66967 198962 -17034 142973
11646e8650j72875A3928J44295J72250a05693D05603c04847A53853a07702A43570
$$ -58650 -231525 13928 158223 330473 -105693 405603 -304847 153853 -107702 143570
11635G0991J01132Q9925e6340B4123b7519M165p5113K7530B2857b41539A04916
$$ 70991 172123 262048 -56340 24123 -27519 -23354 -98467 -70937 22857 -241539 104916
11623a36471A16909a7093I76h2836B78085H5634b58084B25744j08075J93067j06727
$$ -136471 116909 -17093 976 -82836 278085 85634 -258084 225744 117669 310736 204009
11612B04009G7462A5672c8838A5193c05911A79288a41749r8073F3425K04178n9970
$$ 204009 77462 15672 -38838 15193 -305911 179288 -141749 -239822 63425 267603 207633
11601B07633d3076C01244e610G7096h1400A69254b2993B5377L36816a7149A52524
$$ 207633 -43076 301244 -5610 77096 -81400 169254 -22993 25377 362193 -17149 152524
11589b16023B59449j8425i1053B16660A06083D309M07282B04291c3769j44071
$$ -216023 259449 241024 -91053 216660 106083 4309 411591 204291 -33769 -177840
11579a77840f3181B54349e8876G1605i0580n0281e6534A503J9215e2858k33900
$$ -177840 -63181 254349 -58876 71605 -90580 -140861 -56534 1503 20718 -52858 -286758
11568b86758D72425D5754c8342C54172G8469K16433D879a44930A45353a26655
$$ -286758 472425 45754 -38342 354172 78469 294902 4879 -144930 145353 -126655
11557A65682a15228B8818K7402e2246E433J38320K1040K29834g8344J7901A85921
$$ 165682 -115228 28818 56220 -52246 5433 143753 164793 394627 -78344 -60443 185921
11545B14944b27221E45251D7253a10686N1294A44341d7421a1171I4094J3011i2662
$$ 214944 -227221 545251 47253 -110686 -59392 144341 -47421 -11171 94094 107105 -92662
11533B09516A1010Q2423Q1633J33013l2530C4158J50729C3887L41630b30092M8452
$$ 209516 11010 93433 175066 308079 275549 34158 184887 33887 375517 -230092 -181640
11522a81640A51265b86806e5660n1463A14162a80716E0908L4844a15930F3057
$$ -181640 151265 -286806 -55660 -107123 114162 -180716 50908 85752 -115930 63057
11511B7439a0398A45793b3060C7774O5044C6880L2637J37336b1252A12850P7553
$$ 27439 -10398 145793 -23060 37774 102818 36880 69517 206853 -21252 112850 190403
11500A90403p0492i0746D60840A05293I796K12218h1288H8302L51205A36271J37592
$$ 190403 119911 -90746 460840 105293 9796 222014 -81288 88302 439507 136271 273863
11489B73863a75085L9532C7893h903j69075I3759M9172l6816R054K65487A33041
$$ 273863 -175085 -135553 37893 -8903 -177978 93759 142931 106115 115169 380656 133041
11477d2458A11677K04981n8138A13498c3705G7529k8813c21676C14231r420a45607
$$ -42458 111677 316658 258520 113498 -33705 77529 48716 -321676 314231 304811 -145607
11465b76692g7942b539C0067d266B05531G1917f9047E0208I101J97870a92196
$$ -276692 -77942 -2539 30067 -4266 205531 71917 -69047 50208 9101 206971 -192196
11453a66091A49540a62424N2371p8931e2558B32070e3486B45407J7847o9113K05520
$$ -166091 149540 -162424 -110053 -188984 -52558 232070 -53486 245407 263254 194141 399661
11442C99661j21383J3695a36589F3368B2623R2226K17554a27844n7992a1682j0207
$$ 399661 278278 291973 -136589 63368 22623 114849 332403 -127844 -185836 -11682 -21889
11431b1889j11657G1180J08969b36187d1054r6121M0479a7197j34520L6402o9281
$$ -21889 -133546 71180 180149 -236187 -41054 -137175 -96696 -17197 -151717 -115315 -184596
11420a84596B03030a14029j67227a04536D3210P1822b25539b7872A78716c9086
$$ -184596 203030 -114029 -281256 -104536 43210 115032 -225539 -27872 178716 -39086
11409D8525a167A07260a14523k1109j2216B36529I7526J394R362b80802A15906
$$ 48525 -1167 107260 -114523 -135632 -147848 236529 97526 98920 108282 -280802 115906
11397A3281b7487A12943i9729A45651C6971a13898q763C09a92773A73097B2069
$$ 13281 -27487 112943 -99729 145651 36971 -113898 -122661 309 -192773 173097 22069
11385d2751D9483i7760C7842J10667k8359a14045A03229g6492o4904A18903r715
$$ -42751 49483 -97760 37842 148509 120150 -114045 103229 -76492 -141396 118903 109188
11374A09188l3588a52573A05314a01351k6016B78471a29535E2901N5774e8537
$$ 109188 75600 -152573 105314 -101351 -127367 278471 -129535 52901 108675 -58537
11363A63509a49327A75674F8924H900g5671A17295J41234b42943B4507P9668b7001
$$ 163509 -149327 175674 68924 8900 -75671 117295 258529 -242943 24507 104175 -27001
11351D9101J49190p4825K2691k8121P1386F780M64149B26671n6465n8263b38103
$$ 49101 198291 123466 146157 118036 189422 6780 470929 226671 170206 111943 -238103
11339C2581b22604b3486q1991C7205b69674A28420b27440D9945J04041b25598
$$ 32581 -222604 -23486 -105477 37205 -269674 128420 -227440 49945 153986 -225598
11328a54699D51269d7505j44030O0156N8159k4467j93339I2237g2734B02181g5224
$$ -154699 451269 -47505 -191535 -131379 -73220 -97687 -291026 92237 -72734 202181 -75224
11316H5912a19953C19579L8909a8385j4092l11794A95790b95005B87456a25498
$$ 85912 -119953 319579 358488 -18385 -32477 -344271 195790 -295005 287456 -125498
11305a81691A19425h2635K9299j97588A39581k0624g1441B07844b46222A01358
$$ -181691 119425 -82635 -53336 -250924 139581 118957 -71441 207844 -246222 101358
11294a71440O0052j21370B17408a89731c5502B26406a9732A5005a63172G6842
$$ -171440 -111388 -232758 217408 -189731 -35502 226406 -19732 15005 -163172 76842
11283A801J23440l783L4586b9282a1632j22411A1581O4255j1671L5831m52h8319
$$ 1801 125241 121458 156044 -29282 -11632 -134043 11581 75836 64165 99996 99544 -88319
11270b14825I8654a03614H7848b42671e4126B807K15776o6687f3809E03Q144b29209
$$ -214825 98654 -103614 87848 -242671 -54126 2807 218583 151896 -63809 503 8647 -229209
11257A61782c4107k85588C2087A5041K4893a99133d058j53224A17149g2004j75679
$$ 161782 -34107 -319695 32087 15041 39934 -199133 -4058 -157282 117149 -72004 -247683
11246b47683j18785I6844b81213p4459A39243l5127J90874a05957A47535b80927
$$ -247683 -366468 96844 -281213 -355672 139243 104116 294990 -105957 147535 -280927
11235A95547N962H724L0315a74716o2324n985A3371c88481A10788L9891B0121
$$ 195547 201509 8724 39039 -174716 -237040 -243025 13371 -388481 110788 150679 20121
11223g0527H5211J31114M0928a99785I389a3823A58159i8331A08839a44320F4194
$$ -70527 85211 216325 257253 -199785 9389 -13823 158159 -98331 108839 -144320 64194
11211d9250l66909C1258b0513k75036A5432b83713H8489e6309K5615j41620C5133
$$ -49250 -416159 31258 -20513 -295549 15432 -283713 88489 -56309 -30694 -172314 35133
11199b8850A11718b30661c2366B1671K6216e2299A16909E2374g7283k68254B11417
$$ -28850 111718 -230661 -32366 21671 47887 -52299 116909 52374 -77283 -345537 211417
11187A6232a49891o7670g6252n3916H3723C0237g3873E0949J55642e56524b04395
$$ 16232 -149891 -217561 -76252 -130168 83723 30237 -73873 50949 206591 -556524 -204395
11175c49416M2935J02123P4503A14810i3561d1104l9712A8452a36449B7780a14276
$$ -349416 -306481 -204358 -129855 114810 -93561 -41104 -80816 18452 -136449 27780 -114276
11163B01458G4552h5894H7773L22185H0209P5336e1559n8548b936l67977G4363
$$ 201458 74552 -85894 87773 409958 80209 155545 -51559 -110107 -2936 -370913 74363
11151a02533M4102D79871A83104a61525J9211A7703J61233E8848e2337k58312
$$ -102533 -58431 479871 183104 -161525 -142314 17703 178936 58848 -52337 -310649
11141c10649A49939a34800A30000n7105h5695G8099b44804A921K90853F0471K86101
$$ -310649 149939 -134800 130000 72895 -85695 78099 -244804 1921 292774 60471 346572
11130C46572A43388m0975a42365j79753a08287C39824b2213k06075A58631f4909
$$ 346572 143388 102413 -142365 -322118 -108287 339824 -22213 -228288 158631 -64909
11119a23368E7963K79886c1205j92250g098A81h4053k12212A56081b79672A51670
$$ -123368 57963 337849 -31205 -223455 -7098 181 -84053 -296265 156081 -279672 151670
11107E6998a0909l1325A42149a34945C01935j08162I0717A7334P5745D1162O6513
$$ 56998 -10909 -42234 142149 -134945 301935 193773 90717 17334 93079 41162 107675
11096A07675N8022K14003d168A88005E4757P2395F1920J25657q889K45431a22281
$$ 107675 165697 379700 -4168 188005 54757 127152 61920 187577 178688 424119 -122281
11084A86658Q0528O6845A53101g9233B87886j3673P441j2065K7834m6817A01085
$$ 186658 267186 334031 153101 -79233 287886 274213 281654 269589 297423 250606 101085
11072a57300D62804A01536J32207e7015B55478n0661a43815D63565A63701J07297
$$ -157300 462804 101536 233743 -57015 255478 204817 -143815 463565 163701 270998
11062B70998J44479j95341K08630j92785K59263A01323K11516L07760B50895N8980
$$ 270998 415477 220136 428766 235981 495244 101323 312839 620599 250895 309875
11052C09875M5169R7717J15370k4715o023N4219k21025K44001m4619j00703j66002
$$ 309875 355044 452761 568131 543416 537393 591612 370587 614588 569969 469266 303264
11041C03264N52714k64823j46596J82809J02999l19106N0964J30958B53185K48406
$$ 303264 855978 591155 444559 627368 730367 411261 462225 593183 253185 501591
11031E01591k6442r3611N3155R569J17009N4592j36679n7672q5243J46334K8347
$$ 501591 475149 381538 434693 444262 561271 615863 479184 421512 336269 482603 510950
11020E10950J5746A82231J12937K40591n7292K6147j9151k33689K48295j09543
$$ 510950 526696 182231 295168 535759 478467 504614 485463 251774 500069 390526
11010C90526l9195K96067l7580n7629r803k25932Q5357Q4052k23676M48430k46244
$$ 390526 351331 647398 609818 552189 542386 316454 401811 485863 262187 710617 464373
10999D64373K99527N1899j21256B28633K78752k0694J30503B30179M11510Q4699
$$ 464373 763900 815799 694543 228633 507385 486691 617194 230179 641689 726388
10989G26388k29140Q3031M74728j31024l73296m0333L10574J4995K29689j39204
$$ 726388 497248 580279 1055007 923983 550687 510354 820928 835923 1065612 926408
10979I26408J74173L6310j27573M25418O1338K86881J44450M46646K8834n33749
$$ 926408 1100581 1136891 1009318 1434736 1496074 1782955 1927405 2374051 2402885 1869136
10969A869136N3563L8105n72568L04884l58735q2861N2777J40965j6763r9341
$$ 1869136 1922699 1960804 1388236 1693120 1334385 1251524 1304301 1445266 1428503 1329162
10959A329162k06122K58548K65945L9695J16892m42006L25050p12759j49262Q7520
$$ 1329162 1123040 1381588 1647533 1687228 1804120 1362114 1687164 974405 825143 912663
10949I12663k39075j80930K34822l02977B07706n3500K44468L7739B06921J40830
$$ 912663 673588 492658 727480 424503 207706 154206 398674 436413 206921 347751
10939C47751G4599J29224n9871d2107B39250e3806A32892h0585A36644E727O21
$$ 347751 74599 203823 143952 -42107 239250 -53806 132892 -80585 136644 5727 6348
10928F348L67338C8993J0814P3068a15164H9941A270b33419b0933B65940a41373
$$ 6348 373686 38993 49807 122875 -115164 89941 1270 -233419 -20933 265940 -141373
10916b16785A13858f093j72702A02922D9786b67785K3948A91766h3582D5554K30195
$$ -216785 113858 -6093 -178795 102922 49786 -267785 -243837 191766 -83582 45554 275749
10905B75749b41282A28114e0916k0309m2653a7908A59866b02456D40965a59999
$$ 275749 -241282 128114 -50916 -71225 -113878 -17908 159866 -202456 440965 -159999
10894A07668d9611B38745A3889J69133O1529A20957c02324H0094P5444d1083D5809
$$ 107668 -49611 238745 13889 183022 244551 120957 -302324 80094 155538 -41083 45809
10882H7451g8239m21A07821J03200a20605b4806A45406B3754a20550F932Q9527
$$ 87451 -78239 -78660 107821 211021 -120605 -24806 145406 23754 -120550 6932 96459
10871I6459B6880J52748d1199H6721a40541D5382a66594j15052A42632C4835a77345
$$ 96459 26880 179628 -41199 86721 -140541 45382 -166594 -281646 142632 34835 -177345
10859B67482b84975f1680j23556k670B04832a54913c8820A37558a97845F6223
$$ 267482 -284975 -61680 -185236 -187906 204832 -154913 -38820 137558 -197845 66223
10848a000F0792c8754b922A03264F347a92116K4007A63370h4709I7915K0069J19438
$$ -1000 60792 -38754 -2922 103264 6347 -192116 -168109 163370 -84709 97915 117984 237422
10836B37422e9580j44750G3446j1917H441f9604n9089p1379B19690a75924a4929
$$ 237422 -59580 -204330 73446 61529 8441 -69604 -128693 -200072 219690 -175924 -14929
10824c41879f0684o3910B92537e4437j81581b0877I2401l3986Q15b05452m5457
$$ -341879 -60684 -124594 292537 -54437 -236018 -20877 92401 58415 59230 -205452 -250909
10813b50909g614p6388B4835a81314b5881p9517k78909f3687b8418j7890a2406
$$ -250909 -7614 -84002 24835 -181314 -25881 -105398 -384307 -63687 -28418 -46308 -12406
10801B84634a36009A96006B9646J038Q0566l7412a44262D4919N1665f5546j00467
$$ 284634 -136009 196006 29646 30684 111250 73838 -144262 44919 96584 -65546 -166013
10790a66013A98582g3421E1877b69417a23232a3386p164A67606b48751B33286
$$ -166013 198582 -73421 51877 -269417 -123232 -13386 -20550 167606 -248751 233286
10779D4239b39298B94496G0835A8720a27729l6403n0080K5681f6811P697H2569
$$ 44239 -239298 294496 70835 18720 -127729 -164132 -214212 -188531 -66811 -59114 82569
10767H9244Q226l1438c4057D3483b407E6966K8567a94974j43927A84915k3597
$$ 89244 97470 66032 -34057 43483 -2407 56966 85533 -194974 -338901 184915 161318
10756A61318d5081p0123B80581H6967m2627b46524f2678A880J84477b58479f1186
$$ 161318 -45081 -115204 280581 86967 44340 -246524 -62678 1880 186357 -258479 -61186
10744E7938d1953B00760e1318C449a748o1769p0097d4901F844R5458c80473j25414
$$ 57938 -41953 200760 -51318 3449 -1748 -63517 -133614 -44901 6844 102302 -380473 -505887
10732e05887A4798P647d00331a75594C15198a81346A78065j9833a41568f4933
$$ -505887 14798 22445 -400331 -175594 315198 -181346 178065 158232 -141568 -64933
10721c34742G474a11408A89810f781o7986C2981c1642O466j77186I8249K1643
$$ -334742 7474 -111408 189810 -6781 -74767 32981 -31642 -25176 -202362 98249 119892
10710A19892K43518I2473m0107a43161k10386J36201I4181N2084n8573f5467K5178
$$ 119892 363410 92473 52366 -143161 -353547 -217346 94181 146265 87692 -65467 -40289
10699d0289k8638q6610G6359h4386A53613a44393q8067i1143A36645e5838C0151
$$ -40289 -68927 -155537 76359 -84386 153613 -144393 -232460 -91143 136645 -55838 30151
10687E2714B5345i3556k1110N0611l04739J25537e710H9099h7203B47839c16074
$$ 52714 25345 -93556 -114666 -64055 -368794 -243257 -5710 89099 -87203 247839 -316074
10675C7025a11928M3319j62320i8584H5394b02634A23890e2663j03778B21653
$$ 37025 -111928 -68609 -230929 -98584 85394 -202634 123890 -52663 -156441 221653
10664B31764d20502a92869M6805I1932c0479C77822I0340K04508a73832j4576
$$ 231764 -420502 -192869 -146064 91932 -30479 377822 90340 294848 -173832 -188408
10654a88408f0980K4410r2793a3244j16575j14281j8615i0426C32541e151j72670
$$ -188408 -60980 -36570 -129363 -13244 -129819 -244100 -262715 -90426 332541 -5151 -177821
10643a77821A20555b07750I5247J32599j02874a08152C41093c12909b8737D01524
$$ -177821 120555 -207750 95247 227846 124972 -108152 341093 -312909 -28737 401524
10632A01269b09536b161j63240i608A06012a52145B2732O4759i3293b120m6450
$$ 101269 -209536 -2161 -165401 -9608 106012 -152145 22732 87491 -93293 -2120 -48570
10621d8570j61051D055J19654C7148f4856K024p1028k8144A5893a34407C89367
$$ -48570 -209621 4055 123709 37148 -64856 -62832 -133860 -162004 15893 -134407 389367
10609a90648N2972j22543a18482E9759J44573c2796E6277J71421a35870A15745
$$ -190648 -137676 -260219 -118482 59759 204332 -32796 56277 227698 -135870 115745
10598A34313c16404B3607J65814b14086B9547h3491K8212j18221k7422A64666
$$ 134313 -316404 23607 189421 -214086 29547 -83491 -55279 -173500 -200922 164666
10587a67304P088F822g9297n0996B25811n6955E32a90237K787a9735C01682a05320
$$ -167304 -160216 6822 -79297 -130293 225811 168856 532 -190237 -187450 -19735 301682 -105320
10574A12554i8119L9381o798j56791l2896l6363q2663E1680a41423N6301a0682
$$ 112554 -98119 -58738 -65536 -222327 -255223 -291586 -374249 51680 -141423 -85122 -10682
10562b21043g9859h484p2206j32803i3446j33687d0507A29899M7896d2072f955
$$ -221043 -79859 -8484 -80690 -213493 -93446 -227133 -40507 129899 177795 -42072 -6955
10550c19999A82798j3230c5016l01597H3425N2356D1430a50350A57593a4620l6925
$$ -319999 182798 169568 -35016 -336613 83425 135781 41430 -150350 157593 -14620 -51545
10539e1545k33212J05715A48295n5438a35909B48441A08113C1637j4729d08805
$$ -51545 -284757 -179042 148295 92857 -135909 248441 108113 31637 16908 -408805
10528e2070j921k50283A02347M024J55797a43548B12942a79433I1882a60266f5753
$$ -52070 -53991 -304274 102347 106371 262168 -143548 212942 -179433 91882 -160266 -65753
10516A17125B597J67619b51197q9870A41504h881j78599Q3780B3477J33399d74519
$$ 117125 2597 170216 -251197 -341067 141504 -8881 -187480 -103700 23477 156876 -474519
10504a72879e355G8899a23447d077l30025B138c0158A14744d33020d7689B0767
$$ -172879 -5355 78899 -123447 -4077 -334102 2138 -30158 114744 -433020 -47689 20767
10492A33151P9222c05446i7913j2629B44597G4245e6432j52227A19762b1968m2231
$$ 133151 212373 -305446 -97913 -110542 244597 74245 -56432 -208659 119762 -21968 -64199
10481f4199A36325k783k2853J20561J58014F5273J148j184Q1606a5642j92507
$$ -64199 136325 133542 110689 231250 389264 65273 66421 65237 146843 -15642 -208149
10470b08149D7896K10224A00365b69421a20684C09926h2336A32799a19338B22118
$$ -208149 47896 258120 100365 -269421 -120684 309926 -82336 132799 -119338 222118
10459a89664P4643k8288N6629B9509c525j51835g7525l3409M0015D674M9677b04422
$$ -189664 -115021 -143309 -86680 29509 -3525 -155360 -77525 -110934 -70919 4674 54351 -204422
10446h082B5309R0690a11895K3808j04455h3763B64768C0619g8513B9523K31457
$$ -8082 25309 115999 -111895 -88087 -192542 -83763 264768 30619 -78513 29523 260980
10435B60980C7121J10842k0761a80689A78451g6174r5451p35l6460L9304l73172
$$ 260980 37121 147963 127202 -180689 178451 -76174 -171625 -172360 -208820 -169516 -542688
10424e42688f2238j80453a15235b150l462k70417P9788A2220Q9604F234g1391
$$ -542688 -62238 -242691 -115235 -2150 -5612 -276029 -196241 12220 101824 6234 -71391
10412d4665k06325g0623H8824b61616f8003B15186f1403j45639i1871A4589a6732
$$ -44665 -250990 -70623 88824 -261616 -68003 215186 -61403 -207042 -91871 14589 -16732
10400b7750q8664N6964A1689i8465b3939k00748C6303b8929A32771a04758H2719
$$ -27750 -116414 -59450 11689 -98465 -23939 -224687 36303 -28929 132771 -104758 82719
10388c3143k926B10436a98992A67477b2851A35275F2825a26632A81346L2277a2258
$$ -33143 -36069 210436 -198992 167477 -22851 135275 62825 -126632 181346 213623 -12258
10376B79041j1231j05704O478a62433H6168O9355K6147p132N1803N1840K3844
$$ 279041 267810 162106 168584 -162433 86168 155523 181670 174538 226341 278181 302025
10365C02025K06837B49237A19077J83640A38819K65077j43160I8225b214E25621
$$ 302025 508862 249237 119077 302717 138819 403896 260736 98225 -2214 525621
10354B54362c9234B02569J20589J23627J09292n7764j32347K21015B48713E1097
$$ 254362 -39234 202569 323158 446785 556077 498313 365966 586981 248713 51097
10343B43482L42378k71249N328a77668A53575m964o3181j813M12233b3572n2046
$$ 243482 585860 314611 319939 -177668 153575 148611 85430 83617 495850 -23572 -75618
10332g5618q027C14561b42632H3062J60589c08883B61450A4810f540A74497g1928
$$ -75618 -83645 314561 -242632 83062 243651 -308883 261450 14810 -6540 174497 -71928
10320C79688I1476M01693j83338H0648h1219l303C33519e1486C48331e0831A02535
$$ 379688 91476 493169 309831 80648 -81219 -84522 333519 -51486 348331 -50831 102535
10308i3879I5734h4262j59319J11588A53224g7728B41633o2850F1128c7010k51826
$$ -93879 95734 -84262 -243581 -131993 153224 -77728 241633 178783 61128 -37010 -288836
10297b88836J42472A96077a3980G3154a18770e0078A82567J66240H5504a7006
$$ -288836 -146364 196077 -13980 73154 -118770 -50078 182567 348807 85504 -17006
10286C47979A05188a10377I8048a75056Q1908K7752E13088A8884b43836l05930
$$ 347979 105188 -110377 98048 -175056 -93148 -65396 513088 18884 -243836 -549766
10276e49766A13125e7112F1807J0313c43663a4248B273O4656K1992a68299f2248
$$ -549766 113125 -57112 61807 72120 -343663 -14248 2273 66929 88921 -168299 -62248
10264A5797a96543A86094J46232D024J45882m9230K38135j69101j3555J88539
$$ 15797 -196543 186094 332326 4024 149906 100676 338811 169710 156155 344694
10254C44694j39928n1505P1376J9891B3607M6483A3425a96418h2839m53621e2644
$$ 344694 204766 153261 224637 244528 23607 70090 13425 -196418 -82839 -536460 -52644
10242A2775a51555G6403c083r2547M3897b2814q5714F2736J18819a75179c6757
$$ 12775 -151555 76403 -3083 -95630 -51733 -22814 -108528 62736 181555 -175179 -36757
10230a1173A42621a84378f1028m1983L473l09040H6970I465M1764J22278e3691
$$ -11173 142621 -184378 -61028 -103011 -99538 -408578 86970 9465 51229 173507 -53691
10218c40589a30910A1721c50155F4428L9472f364j10392A49821a64366L005P9421
$$ -340589 -130910 11721 -350155 64428 103900 -6364 -116756 149821 -164366 -161361 -81940
10207h1940A14544C0154a37371N8618M180m5208J0576C2301c70761a60623M991
$$ -81940 114544 30154 -137371 -78753 -74573 -119781 -109205 32301 -370761 -160623 -155632
10196a55632O2019B68a84971j43840A84357a75464P2202k58902a71005A61056
$$ -155632 -93613 268 -184971 -328811 184357 -175464 -103262 -362164 -171005 161056
10185A64814f1693n0225l04472f9928p6840A30749a06790m1012q4067B18096r6614
$$ 164814 -61693 -111918 -416390 -69928 -146768 130749 -106790 -147802 -231869 218096 121482
10174A21482e4970k77192B46414A4882a36389G6975d5685l0136k31480a32609
$$ 121482 -54970 -332162 246414 14882 -136389 76975 -45685 -75821 -307301 -132609
10163e8317B9894a29717j42232d7698G8441b7449B47504m5590c92479B88931B1203
$$ -58317 29894 -129717 -271949 -47698 78441 -27449 247504 201914 -392479 288931 21203
10151i5920A24660K17532I4961b1252A63284n3321B1352c0321l32119J69085A04966
$$ -95920 124660 342192 94961 -21252 163284 109963 21352 -30321 -362440 -193355 104966
10139d34594e195D6457d4211j34652A0304J5055a2905q7791J6282a866j33138
$$ -434594 -5195 46457 -44211 -178863 10304 25359 -12905 -100696 -84414 -1866 -135004
10128a35004n6817Q9921A4010b26496A32727b48588A4550R7466m8450c3755E2171
$$ -135004 -191821 -101900 14010 -226496 132727 -248588 14550 112016 63566 -33755 52171
10116a69516Q2225l4804n5392h3966L1076j9043K6169A53217a58677D9398Q002
$$ -169516 -87291 -122095 -177487 -83966 -52890 -71933 -45764 153217 -158677 49398 57400
10105E7400k5617m403j3562L5411P4607N1812a00755A24178J74215a46148H1577
$$ 57400 31783 27380 13818 49229 123836 175648 -100755 124178 298393 -146148 81577
10093E9721a6332n0380h15j61597j14821n4840a01275P768B0468a73180d5125
$$ 59721 -16332 -66712 -815 -162412 -277233 -332073 -101275 -93507 20468 -173180 -45125
10081C29661q0064f8430I0976g8738m0610A13729a47963F9650L9757j1280b30097
$$ 329661 249597 -68430 90976 -78738 -119348 113729 -147963 69650 109407 98127 -230097
10069b00172C14230I4791J54964f0555r4343A05153D2303p782b22190E8071Q184
$$ -200172 314230 94791 249755 -60555 -154898 105153 42303 34521 -222190 58071 66255
10058F6255c7301C2732i3064A6239b97051B73511h8265e034l89421a52421g0663
$$ 66255 -37301 32732 -93064 16239 -297051 273511 -88265 -5034 -394455 -152421 -70663
10046a52938j60899B6393i6891I8587j0595c35803o5531E3378a42372A66285a44556
$$ -152938 -313837 26393 -96891 98587 87992 -335803 -401334 53378 -142372 166285 -144556
10034B1379a05831o7353K7183k69173g7178j31905c1567k38750e5299A7396a45285
$$ 21379 -105831 -173184 -146001 -415174 -77178 -209083 -31567 -270317 -55299 17396 -145285
10022c97991F0415q625c11620A5805e44301i0051A19931d7684k04934a07630j94269
$$ -397991 60415 51790 -311620 15805 -544301 -90051 119931 -47684 -252618 -107630 -301899
10011c01899A9958a45144I1726a56598f0479j91182f9148A09662P3534H1453a26995
$$ -301899 19958 -145144 91726 -156598 -60479 -251661 -69148 109662 183196 81453 -126995
9999c34939B28010j01031a93729h3137j47334f0063I352i5508A90050E9439b20089
$$ -334939 228010 126979 -193729 -83137 -230471 -60063 9352 -95508 190050 59439 -220089
9987C06873E1546j1697i3791j38264N3554K7632m0167k45804f5307l8608j76049
$$ 306873 51546 39849 -93791 -232055 -178501 -150869 -191036 -436840 -65307 -103915 -279964
9976b79964P6382f1593k66987a44608q8797Q7488c1004k12171B3857i6105j16474
$$ -279964 -203582 -61593 -328580 -144608 -233405 -145917 -31004 -243175 23857 -96105 -212579
9965b12579A8487h688j40328b6453F3657g6191j31036j62482g469k20423G4015
$$ -212579 18487 -8688 -149016 -26453 63657 -76191 -207227 -369709 -7469 -227892 74015
9953F3282a05058A721a10699k3293H1063K4595p299A5603g2273D0665b90870A24395
$$ 63282 -105058 1721 -110699 -133992 81063 105658 98359 15603 -72273 40665 -290870 124395
9940C0492J15189a12120b7264I1427a43907I1200d9928j60400i4730M5904j397
$$ 30492 145681 -112120 -27264 91427 -143907 91200 -49928 -210328 -94730 -48826 -50223
9929e0223A83855a65846A47503L54700a74602C7954b4176A3007g1398n5619l25627
$$ -50223 183855 -165846 147503 502203 -174602 37954 -24176 13007 -71398 -127017 -452644
9918d52644G2193i3672B66457p613i0677j66825C3423a15681b2746j6635G9248
$$ -452644 72193 -93672 266457 258844 -90677 -257502 33423 -115681 -22746 -39381 79248
9906i2226G6549f0734j0371F9938i1738A28460g4460j39959F7705a41462b922
$$ -92226 76549 -60734 -71105 69938 -91738 128460 -74460 -214419 67705 -141462 -2922
9894E6488d3933A66197O8807d6723B34005m0319b6133A36008g5744A55527D0638
$$ 56488 -43933 166197 235004 -46723 234005 193686 -26133 136008 -75744 155527 40638
9882a37590b6810A06776a64530l1184B71910d8409j12571H1275c38491B25044
$$ -137590 -26810 106776 -164530 -195714 271910 -48409 -160980 81275 -338491 225044
9871a77653N0263J3942j42291g9373p3430J5344m9117Q7804k80013J19137i7814
$$ -177653 -127390 -113448 -255739 -79373 -152803 -137459 -186576 -98772 -378785 -259648 -97814
9859b6631j6741j55959C3695a40961g728A03517h5690L287c6534j22562f2256
$$ -26631 -43372 -199331 33695 -140961 -7728 103517 -85690 -82403 -36534 -159096 -62256
9847G1478Q2342b05235c8331B4876f3633E0718L1972J29977A7154b3471o8412
$$ 71478 153820 -205235 -38331 24876 -63633 50718 82690 212667 17154 -23471 -91883
9836i1883k03599Q6697C81014E2828Q0268d9862j6962F5448b12304o6058L6415
$$ -91883 -295482 -208785 381014 52828 133096 -49862 -66824 65448 -212304 -278362 -241947
9825b41947p994L349P129F87L0265J16173A9961O8213l5319a53849E341a50224
$$ -241947 -249941 -246592 -239463 687 30952 147125 19961 88174 52855 -153849 5341 -150224
9812i3410r5469I9400a16021k7193K2825i96j30409r911j24628j19419a15038
$$ -93410 -188879 99400 -116021 -143214 -120389 -996 -131405 -141316 -265944 -385363 -115038
9800A51592f8275p7991k956H5602h516A04253b68981A28494A7035b09674C130
$$ 151592 -68275 -146266 -149222 85602 -8516 104253 -268981 128494 17035 -209674 3130
9788A7630i1611D7980c1063l16505a36563m7132a8629k62064k6470f145q5204
$$ 17630 -91611 47980 -31063 -347568 -136563 -183695 -18629 -280693 -307163 -6145 -91349
9777i1349d3093q4625C50797b33724C01717e2759K4225k62974K2936a17979C757
$$ -91349 -43093 -127718 350797 -233724 301717 -52759 -28534 -291508 -268572 -117979 3757
9765b7840C4563b07553j09048A712a0160A8292L3935a41855L415A62616G458b11313
$$ -27840 34563 -207553 -316601 1712 -10160 18292 52227 -141855 -138440 162616 7458 -211313
9752c06411P0850O9399L9826A03012L8864a4349B77766d3307A57812D3255a91029
$$ -306411 -235561 -166162 -126336 103012 141876 -14349 277766 -43307 157812 43255 -191029
9740B434c67261e7278J6134G325a55079i073C40374a43821B07677J24815e1328
$$ 2434 -367261 -57278 -41144 7325 -155079 -9073 340374 -143821 207677 332492 -51328
9728a06984l22671J59038Q5586k8842h7152o6905K2062K1035e1476A01162a31250
$$ -106984 -429655 -270617 -185031 -213873 -87152 -154057 -131995 -110960 -51476 101162 -131250
9716A15023k0005g2402A01544f3088B37453I4024L06164c38746l4078A72454F1452
$$ 115023 95018 -72402 101544 -63088 237453 94024 400188 -338746 -372824 172454 61452
9704a35347A51794a90200k54537K03256f0262d830l8245B21971i2968j17879b5550
$$ -135347 151794 -190200 -444737 -241481 -60262 -4830 -43075 221971 -92968 -210847 -25550
9692c77879b2108B08015p9054a73275E9730R7130B1302a25127J1479A37215E3440
$$ -377879 -22108 208015 128961 -173275 59730 156860 21302 -125127 -113648 137215 53440
9680b71471g2772j06545H7460a46435M2628j63890j13932F0451e8877q2663C8754
$$ -271471 -72772 -179317 87460 -146435 -103807 -267697 -381629 60451 -58877 -141540 38754
9668e4564C56379a25446A6340o132a27974n287j81625A77902p4913a83710p4682
$$ -54564 356379 -125446 16340 10208 -127974 -133261 -314886 177902 102989 -183710 -258392
9657b58392J05445A14227b174E524b05048j66098B12753p4348b32166q5593J52802
$$ -258392 -152947 114227 -2174 5524 -205048 -371146 212753 138405 -232166 -317759 -164957
9646a64957E6146a53566b2444k51412L6842R5568a2030A24097a49440d6623j09308
$$ -164957 56146 -153566 -22444 -273856 -237014 -141446 -12030 124097 -149440 -46623 -155931
9635a55931N3695b677k85147f5563F3736b3829m8020o9319j61315D6469a26158
$$ -155931 -102236 -2677 -287824 -65563 63736 -23829 -71849 -141168 -302483 46469 -126158
9623a98128P5974c7098j24776L5733n9550e3726A03633e4534A59146a71150e9114
$$ -198128 -122154 -37098 -161874 -126141 -185691 -53726 103633 -54534 159146 -171150 -59114
9611H0903h3065j0470c9586j75790j29106h080p1058b5823N331A9334b19395c7909
$$ 80903 -83065 -93535 -39586 -215376 -344482 -8080 -79138 -25823 -20492 19334 -219395 -37909
9598E5496a21978M778A09745R5903G7307l6605J68485b22293m6369a08576o4122
$$ 55496 -121978 -117200 109745 205648 77307 40702 209187 -222293 -268662 -108576 -172698
9587a72698h2233m7302E9748a25582B04428c2725o0704B51697a68155L0652j84378
$$ -172698 -82233 -129535 59748 -125582 204428 -32725 -93429 251697 -168155 -137503 -321881
9576c21881A19890b6310A7786d28503A08599a82696k12302h0930F5804a58166
$$ -321881 119890 -26310 17786 -428503 108599 -182696 -394998 -80930 65804 -158166
9565A96866c1878G7801a01744j785b0384M18D6325g4697j33090Q8067B08167a01769
$$ 196866 -31878 77801 -101744 -103529 -20384 -19966 46325 -74697 -207787 -119720 208167 -101769
9552b7873j65101p7939h1245j19384O6349A17977O938i4770I6421J87536e1825
$$ -27873 -192974 -270913 -81245 -200629 -134280 117977 124915 -94770 96421 283957 -51825
9540g0736K3589k48706i2291H37b89640d5981q4659f4068p7399B2495g3334l07934
$$ -70736 -47147 -295853 -92291 837 -289640 -45981 -130640 -64068 -141467 22495 -73334 -381268
9528c81268c0132k44899B75869b82044m8914F8537L7563D4888b11892j22472N8558
$$ -381268 -30132 -275031 275869 -282044 -330958 68537 106100 44888 -211892 -334364 -275806
9517b75806C36188D0243J16255a33071M2108A21518i4635L8871A80942F9555d7282
$$ -275806 336188 40243 156498 -133071 -90963 121518 -94635 -55764 180942 69555 -47282
9505b99844J04384c8701k81380i9762C33883A48287a61383e795B3807L827c22447
$$ -299844 -195460 -38701 -320081 -99762 333883 148287 -161383 -5795 23807 27634 -322447
9493d2481a091l3169C96706D4174b28606c2151l21114a43266j2675e0899H8342
$$ -42481 -1091 -34260 396706 44174 -228606 -32151 -353265 -143266 -155941 -50899 88342
9481a2705A24365C0729i6103A13997f3172j82734a0534A87485d4942n35503F0515
$$ -12705 124365 30729 -96103 113997 -63172 -245906 -10534 187485 -44942 -580445 60515
9469B55348c95839c1080A21106b00607d4480M151p9213G2596a45355A44906e9222
$$ 255348 -395839 -31080 121106 -200607 -44480 -40329 -119542 72596 -145355 144906 -59222
9457c8811k28455B63948A20308c27514L5569a24023N4301D8415d11836A6806c38922
$$ -38811 -267266 263948 120308 -327514 -291945 -124023 -69722 48415 -411836 16806 -338922
9445a67841c3384B25957a54390E1967b4498l5431q3702C84978f0646B31346e8926
$$ -167841 -33384 225957 -154390 51967 -24498 -59929 -143631 384978 -60646 231346 -58926
9433b22883O5812B7664K6129c08374a7225A53492k4552j1370J123D5283b28458
$$ -222883 -157071 27664 53793 -308374 -17225 153492 128940 117570 118693 45283 -228458
9421f1292o0622J5893A28241d59259a6702q7229I6202b2310o8968E2658a10387
$$ -61292 -121914 -106021 128241 -459259 -16702 -103931 96202 -22310 -91278 52658 -110387
9409B56846b17608h6411J0480n9652p0497C40429a78814A06147g4838j85500B6788
$$ 256846 -217608 -86411 -75931 -135583 -206080 340429 -178814 106147 -74838 -260338 26788
9397b92526J06537j75990h8918j9885k27201F3102a17752j7936a3696q4559K3170
$$ -292526 -185989 -361979 -88918 -108803 -336004 63102 -117752 -135688 -13696 -98255 -75085
9386g5085B47960p606C4650g7610A80898a18681c1281k731b755q3442G2781N1179
$$ -75085 247960 240354 34650 -77610 180898 -118681 -31281 -34012 -2755 -86197 72781 123960
9374A23960K609a63314J2574P0850J9282A3301O302J48648h9258j74475g0686
$$ 123960 126569 -163314 -150740 -79890 -60608 13301 19603 168251 -89258 -263733 -70686
9362E9370a72395n5848o2848I6036b99050j55880H4961B6857P9474c14970J19659
$$ 59370 -172395 -228243 -291091 96036 -299050 -454930 84961 26857 106331 -314970 -195311
9351a95311b1852j07324a067F6468a56336m1584C7691R165J15264G4252a29533
$$ -195311 -21852 -129176 -1067 66468 -156336 -197920 37691 46856 162120 74252 -129533
9339B82405c6121K061A24098a86179A53817a05042A55589h5683C57389b12922
$$ 282405 -36121 -34060 124098 -186179 153817 -105042 155589 -85683 357389 -212922
9328a70427H2540K90005G1309J2743O4287n7228d28400H2411k2677a57253j55225
$$ -170427 82540 372545 71309 84052 148339 91111 -428400 82411 59734 -157253 -312478
9317c12478L3087f8401B87952g9556b0776A6536a95697A33475b36926B6067L2295
$$ -312478 -279391 -68401 287952 -79556 -20776 16536 -195697 133475 -236926 26067 58362
9306E8362d7262m78839A81090f35057a32439A8251b61324E9490e8225k61574A71396
$$ 58362 -47262 -526101 181090 -635057 -132439 18251 -261324 59490 -58225 -319799 171396
9294c1862j47430j608E2784a9031A0762J37709M4907a17101H3683J564Q7384c17790
$$ -31862 -179292 -180900 52784 -19031 10762 148471 193378 -117101 83683 85247 172631 -317790
9281a64515c8072B61600q0745b46933Q9014g713j86259M1600B63569a62124o7888
$$ -164515 -38072 261600 180855 -246933 -157919 -7713 -193972 -152372 263569 -162124 -230012
9270b30012A39514a74134j13404a5632j91744Q9675m18756a61949O6436b367j21909
$$ -230012 139514 -174134 -287538 -15632 -207376 -117701 -536457 -161949 -95513 -2367 -124276
9259a24276K6985E2230c05084a06353B0262J00323E3167K83380d2127I4075a08496
$$ -124276 -97291 52230 -305084 -106353 20262 120585 53167 336547 -42127 94075 -108496
9247a18881G4126J35642g6523k21113b3202o443j3l62564B1490b51195D8927c42227
$$ -118881 74126 209768 -76523 -297636 -23202 -29645 -29658 -392222 21490 -251195 48927 -342227
9234f8341A36253c17934P1551f7466A350Q3913i0187r5667A46285a58660J4183
$$ -68341 136253 -317934 -246383 -67466 1350 85263 -90187 -185854 146285 -158660 -144477
9223a44477j19369A34998R6995I6489a33525A1075N308N4366c63763J51917J7359
$$ -144477 -263846 134998 231993 96489 -133525 11075 16383 70749 -363763 -211846 -194487
9212a94487q6644f4392K4445r7327A21272a43924j74205J39837D0884J9421O0117
$$ -194487 -281131 -64392 -39947 -137274 121272 -143924 -318129 -178292 40884 60305 120422
9201A20422f0782J8261o99j71809P9389L9007B2876e133E0368g2680J0672F0539
$$ 120422 -60782 -42521 -43220 -215029 -135640 -96633 22876 -5133 50368 -72680 -62008 60539
9188a90844l0727A03859j1639c06456a07095E0108b40259g3605F1438J48310d3347
$$ -190844 -221571 103859 92220 -306456 -107095 50108 -240259 -73605 61438 209748 -43347
9176B52171j23319E3505j2835K285f198A40015P2353a33464K2336J3464L3134
$$ 252171 128852 53505 40670 42955 -6198 140015 212368 -133464 -111128 -97664 -64530
9165f4530j94645a23824b0519j05254M9584A79510D3697Q4421a65433j16235g4754
$$ -64530 -259175 -123824 -20519 -125773 -76189 179510 43697 128118 -165433 -281668 -74754
9153b6780B75144a71621J8905B57839a92196G2919b19354B20131d50j0179j43592
$$ -26780 275144 -171621 -152716 257839 -192196 72919 -219354 220131 -450 -10629 -154221
9142a54221j76035I9332J08056a87363A6248J51302a74919c857E658a9136o8843
$$ -154221 -330256 99332 207388 -187363 16248 167550 -174919 -3857 5658 -19136 -87979
9131h7979K4460A34429d0883n8488A5279J1121a93715A40537b62414M1549A32412
$$ -87979 -63519 134429 -40883 -99371 15279 26400 -193715 140537 -262414 -220865 132412
9119a52282k5115g1704j87192j25691H2242h5688B06736a01205A51437A059M0699
$$ -152282 -177397 -71704 -258896 -384587 82242 -85688 206736 -101205 151437 1059 41758
9108D1758L02767h8240k10304a38126N6406p3234C8705c03004Q2123R9462k31177
$$ 41758 344525 -88240 -298544 -138126 -81720 -154954 38705 -303004 -220881 -121419 -352596
9097c52596f1458p9872a4524B39746D3532a15757F2931a15176e369n8291E9116
$$ -352596 -61458 -141330 -14524 239746 43532 -115757 62931 -115176 -5369 -63660 59116
9085A5511N9272b46470q9890A69877a78412D2761b26999E8364e1901p1805E7271
$$ 15511 74783 -246470 -336360 169877 -178412 42761 -226999 58364 -51901 -123706 57271
9073B85457a65898A10406g7344l07928c4328m1338A45329c24197r9108a24801
$$ 285457 -165898 110406 -77344 -385272 -34328 -75666 145329 -324197 -423305 -124801
9062B03676b18941R198I2786J26383a16449c850A2677P8924D531a08682F8563
$$ 203676 -218941 -209743 92786 219169 -116449 -3850 12677 91601 4531 -108682 68563
9050D32478c02501R9499L5027B74696A06558a86996j64854J46081A18916j3631
$$ 432478 -302501 -203002 -167975 274696 106558 -186996 -351850 -205769 118916 105285
9040A05285l705a20822K2147k6556j7947g1530k64544P9326J9204d3040H6488
$$ 105285 101580 -120822 -98675 -125231 -143178 -71530 -336074 -256748 -237544 -43040 86488
9028b06897b2819r1799G66c64543a50435k20636C05278A20302Q4736l5656K7201
$$ -206897 -22819 -114618 766 -364543 -150435 -371071 305278 120302 205038 169382 196583
9017A96583h0840b7404B40494A05362b8964k4270j99379A44322a1231k0067j01009
$$ 196583 -80840 -27404 240494 105362 -28964 -53234 -252613 144322 -11231 -31298 -132307
9006a32307o4574K3107A48903d0872B33164c1942G3967a5872m1608A96064r2368
$$ -132307 -196881 -173774 148903 -40872 233164 -31942 73967 -15872 -57480 196064 103696
8995A03696c20056g9119l15138B65625j08777o6237K3870H114d6304A78099M6238
$$ 103696 -320056 -79119 -394257 265625 156848 90611 114481 8114 -46304 178099 224337
8984B24337A1095Q9975b18307B10737H2441a64128B60867C2656h8593G9076c53794
$$ 224337 11095 101070 -218307 210737 82441 -164128 260867 32656 -88593 79076 -353794
8972b68081a07550p5087C5236f9603e573A56716a81937f913q7818k05551N3490
$$ -268081 -107550 -182637 35236 -69603 -5573 156716 -181937 -6913 -94731 -300282 -246792
8961b46792O5882j2288Q8657d8215I4673b81575A48526o0053b82166j12853J72767
$$ -246792 -180910 -193198 -104541 -48215 94673 -281575 148526 88473 -282166 -395019 -222252
8950b22252F3888a28673A25016b93559b8884B44843o8717g5058A9546b06741R7315
$$ -222252 63888 -128673 125016 -293559 -28884 244843 176126 -75058 19546 -206741 -109426
8939a09426c0002A78618c4731l26043D95307j67194M5153B6627J13260a63968
$$ -109426 -30002 178618 -34731 -360774 495307 328113 373266 26627 139887 -163968
8928A05430J28804b8766A63715K3456N90048J958282N990081Q279918q054052
$$ 105430 234234 -28766 163715 187171 777219 2735501 8725582 17005500 8951448
8919H951448B442492G84992l4538R219B32251a47964C02216A7842a29312p6368
$$ 8951448 2442492 784992 750454 759673 232251 -147964 302216 17842 -129312 -205680
8909b05680B18684C4499O3554l726J0141D4022L70076I3737b06217N564A2681
$$ -205680 218684 34499 98053 94327 104468 44022 414098 93737 -206217 -200653 12681
8897a63216K8838a8430G1340h3585j91543a25042B54396d40967A92526r6063M1854
$$ -163216 -134378 -18430 71340 -83585 -275128 -125042 254396 -440967 192526 96463 138317
8886A38317c43697e6008C21249J85394g3013B44167I177J83783d0372j39146b63
$$ 138317 -343697 -56008 321249 506643 -73013 244167 9177 192960 -40372 -179518 -263
8874F1559B2000a70171B7336b43603N7998Q326A78480j1752G7431b61203A60708
$$ 61559 22000 -170171 27336 -243603 -185605 -177279 178480 166728 77431 -261203 160708
8862b85566B12512a67469J6992A41492a06777I1519a05632K194A24572f9398j00843
$$ -285566 212512 -167469 -150477 141492 -106777 91519 -105632 -103438 124572 -69398 -170241
8851a70241a8623A48473a43734A33923J4591a55578R958g1029j89945B34094c70427
$$ -170241 -18623 148473 -143734 133923 148514 -155578 -145620 -71029 -260974 234094 -370427
8839E0564c0538k07498i3099a4964l37168A43637N1132a83361e3990A54833E2744
$$ 50564 -30538 -238036 -93099 -14964 -352132 143637 194769 -183361 -53990 154833 52744
8827b01564F4171c1337j300D1517b01384O6275d2314E9447b53097k8595J31548
$$ -201564 64171 -31337 -32637 41517 -201384 -135109 -42314 59447 -253097 -281692 -150144
$$ [...]
##END NTUPLES=NMR SPECTRUM
##END=
