##TITLE=AC1768_ROS_9_9683739_JfU564xkGN
##JCAMPDX= 6.0         $$ Bruker NMR JCAMP-DX V2.0
##DATA TYPE= NMR SPECTRUM
##DATA CLASS= NTUPLES
##ORIGIN= BRUKER
##OWNER= Administrator
$$ 1.72 TOPSPIN		Version 2.1
$$ 2016-04-16 18:54:05.470 -0700  Administrator@X
$$ Compression mode = diff/dup
##.OBSERVE FREQUENCY= 400.02188249412
##.OBSERVE NUCLEUS= ^1H
##.ACQUISITION MODE= SIMULTANEOUS (DQD)
##.ACQUISITION SCHEME= undefined
##.AVERAGES= 64
##.DIGITISER RES= 22
##SPECTROMETER/DATA SYSTEM= spect
##.PULSE SEQUENCE= noesygpps1d.comp
##.SOLVENT NAME= COFFEE_meoh
##.SHIFT REFERENCE= INTERNAL, COFFEE_meoh, 1, 14.96082
##AUDIT TRAIL= $$ (NUMBER, WHEN, WHO, WHERE, PROCESS, VERSION, WHAT)
$$ ##TITLE= Audit trail, TOPSPIN		Version 2.1
$$ ##JCAMPDX= 5.01
$$ ##ORIGIN= Bruker BioSpin GmbH
$$ ##OWNER= Administrator
$$ $$ E:\/data/COFFEE/nmr/AC1768_ROS_9_9683739_JfU564xkGN/12/pdata/1/auditp.txt
$$ ##AUDIT TRAIL=  $$ (NUMBER, WHEN, WHO, WHERE, PROCESS, VERSION, WHAT)
(   1,<2016-04-16 18:54:00.236 -0700>,<Administrator>,<X>,<go>,<TOPSPIN 2.1>,
      <created by zg
	started at 2016-04-16 18:42:30.579 -0700,
	POWCHK enabled, PULCHK disabled,
       configuration hash MD5:
       21 0F 79 D6 B3 7B B4 F6 88 20 88 DB 03 48 BD 9F
       data hash MD5: 64K
       5E BF FC 6D 22 BE 8B 5B 53 3E 3E EE 99 4E 58 4E>)
(   2,<2016-04-16 18:54:03.408 -0700>,<Administrator>,<X>,<proc1d>,<TOPSPIN 2.1>,
      <Start of raw data processing
       efp LB = 0.3 FT_mod = 6 PKNL = 1 PHC0 = 0 PHC1 = 0 SI = 128K 
       data hash MD5: 128K
       DA 45 4B 6B 62 50 60 8A 33 0A F6 84 FE 13 83 B7>)
(   3,<2016-04-16 18:54:04.283 -0700>,<Administrator>,<X>,<proc1d>,<TOPSPIN 2.1>,
      <pk PHC0 = 268.4894 PHC1 = 0 
       data hash MD5: 128K
       D1 2E F5 4E E5 3D 26 A0 7F D5 E6 04 DF 82 E5 80>)
(   4,<2016-04-16 18:54:04.658 -0700>,<Administrator>,<X>,<proc1d>,<TOPSPIN 2.1>,
      <abs ABSG = 1 
       data hash MD5: 128K
       81 31 B6 B3 72 D3 2E E2 14 AC CB D2 FB 3A BE 6C>)
(   5,<2016-04-16 18:54:04.751 -0700>,<Administrator>,<X>,<proc1d>,<TOPSPIN 2.1>,
      <abs ABSG = 2 
       data hash MD5: 128K
       2C 60 F4 C2 0E 1A 1A 84 42 44 81 71 6E F5 48 28>)
(   6,<2016-04-16 18:54:04.845 -0700>,<Administrator>,<X>,<proc1d>,<TOPSPIN 2.1>,
      <abs ABSG = 3 
       data hash MD5: 128K
       7A 30 A4 60 8E 4E 67 64 2D 37 B4 C0 32 D5 8D D4>)
(   7,<2016-04-16 18:54:04.939 -0700>,<Administrator>,<X>,<proc1d>,<TOPSPIN 2.1>,
      <abs ABSG = 4 
       data hash MD5: 128K
       85 66 13 23 B5 5B 22 8E 38 C6 79 C1 6D 2A 79 50>)
(   8,<2016-04-16 18:54:05.079 -0700>,<Administrator>,<X>,<proc1d>,<TOPSPIN 2.1>,
      <abs ABSG = 5 
       data hash MD5: 128K
       31 B0 E9 6C 2B 17 2B 28 80 A3 67 0B 17 F4 E9 04>)
$$ ##END=
$$ 
$$ $$ hash MD5
$$ $$ C4 F7 AF 7E 49 AF 29 50 A0 3E 62 E6 6B D3 0A 42
##$RELAX= 
##$RELAX= 
##$RELAX= 
##$RELAX= 
##$RELAX= 
##$RELAX= 
##$RELAX= 
##$RELAX= 
$$ Bruker specific parameters
$$ --------------------------
##$DU= <E:\>
##$EXPNO= 12
$$ [...]
##$TP07= 0
##$TPNAME0= <>
##$TPNAME1= <>
##$TPNAME2= <>
##$TPNAME3= <>
##$TPNAME4= <>
##$TPNAME5= <>
##$TPNAME6= <>
##$TPNAME7= <>
##$TPOAL= (0..7)
0.5 0.5 0.5 0.5 0.5 0.5 0.5 0.5
##$TPOFFS= (0..7)
0 0 0 0 0 0 0 0
##$TUNHIN= 0
##$TUNHOUT= 0
##$TUNXOUT= 0
##$USERA1= <user>
##$USERA2= <user>
##$USERA3= <user>
##$USERA4= <user>
##$USERA5= <user>
##$V9= 5
##$VALIST= <valist>
##$VCLIST= <CCCCCCCCCCCCCCC>
##$VD= 0
##$VDLIST= <DDDDDDDDDDDDDDD>
##$VPLIST= <PPPPPPPPPPPPPPP>
##$VTLIST= <TTTTTTTTTTTTTTT>
##$WBST= 2048
##$WBSW= 25
##$XGAIN= (0..3)
0 0 0 0
##$XL= 0
##$YL= 0
##$YMAX_a= 5962581
##$YMIN_a= -10747750
##$ZGOPTNS= <>
##$ZL1= 120
##$ZL2= 120
##$ZL3= 120
##$ZL4= 120
##$ABSF1= 14.96082
##$ABSF2= -5.597362
##$ABSG= 5
##$ABSL= 3
##$ALPHA= 0
##$AQORDER= 0
##$ASSFAC= 0
##$ASSFACI= 0
##$ASSFACX= 0
##$ASSWID= 0
##$AUNMP= <proc_prof1d_extract.lims>
##$AXLEFT= 0
##$AXNAME= <>
##$AXNUC= <1H>
##$AXRIGHT= 0
##$AXTYPE= 0
##$AXUNIT= <>
##$AZFE= 0.1
##$AZFW= 0.1
##$BCFW= 0
##$BC_mod= 0
##$BYTORDP= 0
##$COROFFS= 0
##$CY= 15
##$DATMOD= 1
##$DC= 0
##$DFILT= <>
##$DTYPP= 0
##$F1P= 0
##$F2P= 0
##$FCOR= 0.5
##$FTSIZE= 131072
##$FT_mod= 6
##$GAMMA= 0
##$GB= 0
##$INTBC= 1
##$INTSCL= 1
##$ISEN= 128
##$LB= 0.3
##$LEV0= 0
##$LPBIN= 0
##$MAXI= 10000
##$MC2= 0
##$MEAN= 0
##$ME_mod= 0
##$MI= 0
##$NCOEF= 0
##$NC_proc= -2
##$NLEV= 6
##$NOISF1= 0
##$NOISF2= 0
##$NSP= 0
##$NTH_PI= 0
##$NZP= 0
##$OFFSET= 14.96082
##$PC= 1
##$PHC0= 268.4894
##$PHC1= 0
##$PH_mod= 1
##$PKNL= yes
##$PPARMOD= 0
##$PPDIAG= 0
##$PPIPTYP= 0
##$PPMPNUM= 2147483647
##$PPRESOL= 1
##$PSCAL= 4
##$PSIGN= 0
##$PYNMP= <proc.py>
##$REVERSE= no
##$SF= 400.020009707318
##$SI= 131072
##$SIGF1= 0
##$SIGF2= 0
##$SINO= 400
##$SIOLD= 131072
##$SPECTYP= <>
##$SREGLST= <1H.CDCl3>
##$SSB= 0
##$STSI= 131072
##$STSR= 0
##$SW_p= 8223.68421052631
##$SYMM= 0
##$S_DEV= 0
##$TDeff= 65536
##$TDoff= 0
##$TI= <>
##$TILT= no
##$TM1= 0
##$TM2= 0
##$TOPLEV= 0
##$USERP1= <user>
##$USERP2= <user>
##$USERP3= <user>
##$USERP4= <user>
##$USERP5= <user>
##$WDW= 1
##$XDIM= 131072
##$YMAX_p= 384439655
##$YMIN_p= -113390
##$CURPLOT= <Network HP LaserJet P1505>
##$CURPRIN= <$Network HP LaserJet P1505>
##$DFORMAT= <normdp>
##$LAYOUT= <+/1D_H.xwp>
##$LFORMAT= <normlp>
##$PFORMAT= <normpl>
##$SURQMSG= 1
$$ End of Bruker specific parameters
$$ ---------------------------------
##NTUPLES= NMR SPECTRUM
##VAR_NAME=  FREQUENCY,     SPECTRUM/REAL,   SPECTRUM/IMAG
##SYMBOL=    X,             R,               I
##VAR_TYPE=  INDEPENDENT,   DEPENDENT,       DEPENDENT
##VAR_FORM=  AFFN,          ASDF,            ASDF
##VAR_DIM=   131072,        131072,          131072
##UNITS=     HZ,            ARBITRARY UNITS, ARBITRARY UNITS
##FACTOR=    0.0627417313425164, 1,          1
##FIRST=     8223.62146879497, 740,          -61108
##LAST=      0,             2207,            -60871
##MIN=       0,             -113390,         0
##MAX=       8223.62146879497, 384439655,    0
$$ Real data points
##PAGE= N=1
##DATA TABLE= (X++(R..R)), XYDATA
$$ [...]
61720D64400K498J876J361J208J245J226J104R44P89O55M65N3n64j084j308j508
61704D73360k088k908l386l281l013l051l331l483l378l202l078k828k206j283
61690D32844n97p20j615k550k867k680k533k576k475k165k039k262k334j817j051
61675D02563p28r39j224j425j860k547k857k321j375q37q53p94j49Q58J625J794
61659C88931J498J206J415K243L178L544L298L070L226L253K509J300O69J048
61645D20388J709J737J141O35O55J001J309J465J444J179P26L77L16L41J79k3
61629D34579K25J029J775J729P66o40k029l290m397n198n502n223m411l328k541
61614D03544k553l224l825l810l336k896k788l101l873m872n532n476m922m330
$$ plain form
61720 464400 466898 468774 470135 471343 472588 473814 474918 475862 476651 477306 477771 477824 477260 476176 474868 473360
61704 473360 471272 468364 464978 461697 458684 455633 452302 448819 445441 442239 439161 436333 434127 432844
61690 432844 432247 431527 429912 427362 424495 421815 419282 416706 414231 412066 410027 407765 405431 403614 402563
61675 402563 401835 400896 399672 398247 396387 393840 390983 388662 387287 386450 385597 384803 384654 385512 387137 388931
61659 388931 390429 391635 393050 395293 398471 402015 405313 408383 411609 414862 417371 418671 419340 420388
61645 420388 422097 423834 424975 425610 426265 427266 428575 430040 431484 432663 433389 433766 434082 434423 434602 434579
61629 434579 434804 435833 437608 439337 440103 439463 437434 434144 429747 424549 419047 413824 409413 406085 403544
61614 403544 400991 397767 393942 390132 386796 383900 381112 378011 374138 369266 363734 358258 353336 349006
61600C49006l812l254k729k389k163j958j961k321k768l072l527m347m898m343
61586C05464k993k036j889j786j226p55q15q56l14K59O2n46n53J20N21J18n86
61569B92189r28q21m25J39N77N07P2p4L13O77N59L44O40J235J387R48O36R97J647
61550C00619J779J206N25L23N39P10O60O97J103J690J996J865J592J501J599J759
61534C20163K065K678L355L469K688J452M97K0m04j090j851k404k776l031k952
61519C21879k399j736j455j483j345r58p25p94p19j40O18R52P63M94N16P37P86
61502C14991M37j31m24q2Q10J878K760L126K695J667R74J437K618L149K410J271
61486C39586P77P92N04j79n23n4R30J949K818L453L693L566L374L295L101K470
$$ plain form
61600 349006 345194 341940 339211 336822 334659 332701 330740 328419 325651 322579 319052 314705 309807 305464
61586 305464 302471 300435 298546 296760 295534 294779 293964 293108 292794 293053 293115 292569 292016 292136 292657 292775 292189
61569 292189 291261 290440 290015 290154 290731 291238 291310 291236 291549 292226 292785 293129 293769 295004 296391 297339 297975 298972 300619
61550 300619 302398 303604 304129 304452 304991 305701 306361 307058 308161 309851 311847 313712 315304 316805 318404 320163
61534 320163 322228 324906 328261 331730 334418 335870 336367 336387 335983 334893 333042 330638 327862 324831 321879
61519 321879 319480 317744 316289 314806 313461 312503 311778 310984 310265 310125 310743 311695 312458 312952 313468 314205 314991
61502 314991 315428 315297 314873 314791 315601 317479 320239 323365 326060 327727 328701 330138 332756 335905 338315 339586
61486 339586 340363 341155 341659 341480 340957 340903 341833 343782 346600 350053 353746 357312 360686 363981 367082 369552
61470C69552J450M40k83q52j516k120k141j439o93o87j261j533j211r80j311j575
61454C53840r82J61R11J116J426J983K048J227K94J82O67P45J20l52J43J294K103
61437C66926K183K021K060K063J722J355J386J472R29p4n84k55J59R8M5N36J149
61420C83191J225J018J117J300R47K93J56N41O17J22k88k36j48l42n29o22j047
61403C87315j776j981j297o29q82j575j573p36J06M40M47K91p1l49m3P22J170
61386C79579Q85L14K9Q0L62J069K313L590M155L875L337L089L037K739K113J652
61370D12218J895K751L488L490K859K183J780J476J092Q81J172J812K246K225
61356D41568K132K414L009L552M070M941O175P185P561P612P721P468O090L748
$$ plain form
61470 369552 371002 371442 371159 370307 368791 366671 364530 363091 362398 361711 360450 358917 357706 356726 355415 353840
61454 353840 352858 353019 353930 355046 356472 358455 360503 361730 362024 362206 362873 363618 363738 363386 363529 364823 366926
61437 366926 369109 371130 373190 375253 376975 378330 379716 381188 382117 382043 381459 381204 381363 381461 381506 382042 383191
61420 383191 384416 385434 386551 387851 388798 389091 389247 389788 390405 390527 390239 390003 389855 389513 388984 388362 387315
61403 387315 385539 383558 382261 381632 380750 379175 377602 376866 376972 377412 377859 378150 378079 377730 377687 378409 379579
61386 379579 380464 380778 380807 380887 381249 382318 384631 388221 392376 396251 399588 402677 405714 408453 410566 412218
61370 412218 414113 416864 420352 423842 426701 428884 430664 432140 433232 434113 435285 437097 439343 441568
61356 441568 443700 446114 449123 452675 456745 461686 467861 475046 482607 490219 497940 505408 511498 515246
61342E15246J649P11N98M57J21J4J65l0r17k013k569k507k407k713l244l626l881
61325D95054m291m709m523l472k179j493j491j544j232o57J45J474L328M963N633
61310D85006N540N613O394P569Q600R451J0486J1832J3052J3400J2394J0142P169
61297F06648L996R54j701l741n165o239p103p564p429o957o653o652o642o375
61283E39377n939n426m648l477k241j410r40l14O80J595J992K183K872M147N308
61268E33759N764N647N317M783L962L298L455M524N926P101P925Q441Q702Q852
61254F17456Q894Q266O274L137J32j694k517l074l524l529l197l165l753m637
61240F15069n453o222o937p138o339m688l030k244k563l421l886l327j795J69
$$ plain form
61342 515246 516895 517606 518204 518661 518782 518796 518961 518931 518014 516001 513432 510925 508518 505805 502561 498935 495054
61325 495054 490763 486054 481531 478059 475880 474387 472896 471352 470120 469463 469608 471082 474410 479373 485006
61310 485006 490546 496159 502553 510122 518722 528173 538659 550491 563543 576943 589337 599479 606648
61297 606648 610644 611598 609897 606156 600991 594752 587649 580085 572656 565699 559046 552394 545752 539377
61283 539377 533438 528012 523364 519887 517646 516236 515296 514982 515662 517257 519249 521432 524304 528451 533759
61268 533759 539523 545170 550487 555270 559232 562530 565985 570509 576435 583536 591461 599902 608604 617456
61254 617456 626350 634616 640890 644027 644159 642465 639948 636874 633350 629821 626624 623459 619706 615069
61240 615069 609616 603394 596457 589319 582980 578292 575262 573018 570455 567034 563148 559821 558026 558195
61226E58195J964L174L611L411K961K576K255J937J815K142K730L016K700K127
61212E94614J943K432L205L423K465O53p98r27nR12J361J858K891M184N310O432
61196F29953P962R829J1661J3452J5364J6964J7288J5847J3139J0004O889L930
61184G72282J323o98k058k779k904k677k588k989l821m898o244p886r474j0511
61170G14078j0937j1101j1133j0767r958r270r254r675r788r432r333j0100j1155
61157E82175j1190r609p183n089l677k473j090L40J607K805M061N165N638N049
61143E66529L180J65l316o273q165r211r773r703q639o797m909l406k088o62Q05
61128D97737K125L330M573N938P422Q925J0157J0894J1363J2141J3454J4844J5785
$$ plain form
61226 558195 560159 563333 566944 570355 573316 575892 578147 580084 581899 584041 586771 589787 592487 594614
61212 594614 596557 598989 602194 605617 608082 608735 607937 607010 607005 607917 609278 611136 614027 618211 623521 629953
61196 629953 637915 647744 659405 672857 688221 705185 722473 738320 751459 761463 768352 772282
61184 772282 773605 772907 770849 768070 765166 762489 759901 756912 753091 748193 741949 734063 724589 714078
61170 714078 703141 692040 680907 670140 660182 650912 641658 631983 622195 612763 603430 593330 582175
61157 582175 570985 561376 554193 549104 545427 542954 541864 542204 543811 546616 550677 555842 561480 566529
61143 566529 569709 569874 566558 560285 552120 542909 533136 523433 514794 507997 503088 499682 497594 496932 497737
61128 497737 499862 503192 507765 513703 521125 530050 540207 551101 562464 574605 588059 602903 618688
61115F18688J6345J7014J7972J8814J9000J8400J7426J6643J6213J5783J5017
61104H07315J4097J3368J2590J1058Q547N602K670n46m437q629j2244j4731j6076
61091H18584j6484j6442j6649j7300j7559j6504j4538j3116j3025j3543j3507
61080F49917j2486j0707q510o394n017m564m354l650k606j912j697j347l86R92
61066E87279K374L573M519N099N390N726O335P121Q021R257J0936J2658J3943
61053F82231J4836J5649J6348J6696J7023J8091K0019K1924K3048K3696K4615
61042H94176K5956K7415K8969L0676L2040L2374L1861L1461L1729L2444L3410
61031A232511L4826L6628L8267L9603M1285M3728M6253M7746M7880M7260M6788
$$ plain form
61115 618688 635033 652047 670019 688833 707833 726233 743659 760302 776515 792298 807315
61104 807315 821412 834780 847370 858428 866975 872577 875247 874701 870264 861635 849391 834660 818584
61091 818584 802100 785658 769009 751709 734150 717646 703108 689992 676967 663424 649917
61080 649917 637431 626724 618214 611820 606803 602239 597885 594235 591629 589717 588020 586673 586287 587279
61066 587279 589653 593226 597745 602844 608234 613960 620295 627416 635437 644694 655630 668288 682231
61053 682231 697067 712716 729064 745760 762783 780874 800893 822817 845865 869561 894176
61042 894176 920132 947547 976516 1007192 1039232 1071606 1103467 1134928 1166657 1199101 1232511
61031 1232511 1267337 1303965 1342232 1381835 1423120 1466848 1513101 1560847 1608727 1655987 1702775
61020A702775M7239M9061N2162N6229O1432O8295P6732Q5944R5755J07358J22449
61009B525431J42302J68088K00917K40676K85902L35760L91517M55579N30724
61000E276896O21409P33722Q71892J036368J225704J431450J617740J705659J599115
60991A6119955J254486P37516K04277j87632l60730l28551j53161Q5897K87474
60982A7659531L32364J34334k92317q21736j286828j573354j661652j599901j453496
60973I436945j274523j096129r35284p96088o75617n70468m78962l99665l31095
60964B879114k73081k26373j90426j62865j41140j23718j09521r7451q6742p7088
60954A390709o8292o0288n3363m7616m2385l6959l1818k8343k7248k7824k8769
$$ plain form
61020 1702775 1750014 1799075 1851237 1907466 1968898 2037193 2113925 2199869 2295624 2402982 2525431
61009 2525431 2667733 2835821 3036738 3277414 3563316 3899076 4290593 4746172 5276896
61000 5276896 5898305 6632027 7503919 8540287 9765991 11197441 12815181 14520840 16119955
60991 16119955 17374441 18111957 18316234 18128602 17767872 17439321 17286160 17372057 17659531
60982 17659531 17991895 18126229 17833912 17012176 15725348 14151994 12490342 10890441 9436945
60973 9436945 8162422 7066293 6131009 5334921 4659304 4088836 3609874 3210209 2879114
60964 2879114 2606033 2379660 2189234 2026369 1885229 1761511 1651990 1554539 1467797 1390709
60954 1390709 1322417 1262129 1208766 1161150 1118765 1081806 1049988 1021645 994397 966573 937804
60943I37804k9154k8633k7307k5606k4001k2709k1794k1249k0756j9788j8267
60932F78540j6734j5529j4394j3212j2440j2100j1233r300p381o790o997o410
60920E46020m889l905m079m246l442k344j975k051j637o58J80N16N57N21M78N67
60904E19613P36N60j99j018j088l11N89R31O32p4j111k510m019m994m963m290
60888D98484l952m473n303n612n419n430n904o331o254n881n669n719n826n775
60874D20936n442m877m283l697k834j585m89j24j65K44J128J617J367J221J951
60859D04968L099L733L773L856M237M489M176L263K021J000R05J931L231L583
60845D48265K630J176J92j06j65m34r59j505j882k147k510l025l468l532l115
$$ plain form
60943 937804 908650 880017 852710 827104 803103 780394 758600 737351 716595 696807 678540
60932 678540 661806 646277 631883 618671 606231 594131 582898 573598 566217 559427 552430 546020
60920 546020 541131 537226 533147 528901 525459 523115 521140 519089 517452 516794 516974 517490 518047 518568 519046 519613
60904 519613 520349 520909 520710 519692 518604 518293 518882 519813 520445 520371 519260 516750 512731 507737 502774 498484
60888 498484 494532 490059 484756 479144 473725 468295 462391 456060 449806 443925 438256 432537 426711 420936
60874 420936 415494 410617 406334 402637 399803 398218 397729 397605 397440 397684 398812 400429 401796 403017 404968
60859 404968 408067 411800 415573 419429 423666 428155 432331 435594 437615 438615 439520 441451 444682 448265
60845 448265 450895 452071 452263 452157 451992 451558 450599 449094 447212 445065 442555 439530 436062 432530 429415
60830D29415k434j924j918k314k557k246j625j261j320j493j619j873k340k850
60816D01641l344l877m178l809l022k779l482m280m182l430k994l137l237k936
60802C52954k593k570k639k398j772j018n88r84k250l522l624k328o22M77Q81
60787C27404J034J089R41P23O69O82M54j7l86l97m5O15J452K149K430K468K671
60770C43936K992K903K203J461J385J948K468K384J710Q86L02o1n76j391j946
60755C60604j556n16q2q39j753j506l01N46N36M14O96Q88N51P9j95p23j892l079
60737C51872l497l456l855m715n109m530l497k722k304j942j430p52n7M22N76
60722C15004N73N55L88ql01j08M31Q59R74Q42M90J23L14J333K456K633J789Q41
$$ plain form
60830 429415 426981 425057 423139 420825 418268 416022 414397 413136 411816 410323 408704 406831 404491 401641
60816 401641 398297 394420 390242 386433 383411 380632 377150 372870 368688 365258 362264 359127 355890 352954
60802 352954 350361 347791 345152 342754 340982 339964 339376 338392 336142 332620 328996 326668 326046 326523 327404
60787 327404 328438 329527 330468 331191 331860 332542 332996 332979 332593 332196 332151 332766 334218 336367 338797 341265 343936
60770 343936 346928 349831 352034 353495 354880 356828 359296 361680 363390 364276 364578 364517 363941 362550 360604
60755 360604 359048 358532 358450 357611 355858 354352 354051 354597 355133 355547 356243 357131 357682 357761 357566 356843 354951 351872
60737 351872 348375 344919 341064 336349 331240 326710 323213 320491 318187 316245 314815 314063 314006 314428 315004
60722 315004 315577 316132 316520 316512 316211 316103 316534 317393 318367 319209 319699 319822 320136 321469 323925 326558 328347 329188
60704C29188N10P75J438K351L019K825J901J117R14Q25M43J52M50J080J361J079
60688C49428O05L73N09P95Q61N76K70K38J91l06r34r08k18K56J04PN80J348J455
60669C55230P92j61j091j832k089j838j686k147k845k980k365j514r18p82j167
60654C32607j837k067j228M45K068L010L253L054K683K446K485K546K219J363
60640C53047J54j128k109k402k111j996k687l815m319l656k305j121m82k05M6
60625C24911L33M59K85m6l34o51j082j281p23M63J490J889J937J901J541P47N7
60608C31896q9l6k51m11O6R28J357J145Q74Q92Q82N21J1k24M7P39J439J584J092
60589C42462O05P37J225J392J189J109J235J135P49N73P67Q35M95K73P54J762
$$ plain form
60704 329188 329698 330473 331911 334262 337281 340106 342007 343124 344038 344863 345306 345458 345908 346988 348349 349428
60688 349428 350033 350406 350915 351710 352571 353147 353417 353655 353846 353540 352606 351698 351480 351736 351840 351847 352427 353775 355230
60669 355230 356022 355861 354770 352938 350849 349011 347325 345178 342333 339353 336988 335474 334556 333774 332607
60654 332607 330770 328703 327475 327920 329988 332998 336251 339305 341988 344434 346919 349465 351684 353047
60640 353047 353201 352073 349964 347562 345451 343455 340768 336953 332634 328978 326673 325552 325070 324865 324911
60625 324911 325244 325703 325988 325942 325608 324957 323875 322594 321871 322334 323824 325713 327650 329551 331092 331839 331896
60608 331896 331807 331771 331520 331109 331175 332103 333460 334605 335479 336371 337253 337774 337785 337561 337608 338347 339786 341370 342462
60589 342462 343067 343804 345029 346421 347610 348719 349954 351089 351838 352411 353178 354013 354508 354781 355535 357297
60573C57297K748L608M691O082P372Q136Q441Q772R452J0139J0125R224Q104P399
60559D61590O729N138K402o28k990m398m971m775l940k783j499lJ659L111M123
60544D58765M993O113P416Q550R554J0876J2748J4793J6426J7449J8050J8160
60532F03893J7117J4264R899N332J683j105l816o715r150j0389j0381r660q821
60519E92151q205p790p251o318n162m200l508k712j599m24N65J591L017M751O375
60504E61281P851R740J2527J6033J9671K3225K7028L1310L5621L9118M1402M2790
60492H67597M3700M4009M3137M0644L6654L1670K6004J9399J1258J398r574k0660
60480A135236l1036l9973m6582n0357n1890n2289n1722m9290m4698l9318l4904
$$ plain form
60573 357297 360045 363653 368344 374426 381798 389934 398375 407147 416599 426738 436863 446087 454191 461590
60559 461590 468319 473457 475859 475231 472241 467843 462872 458097 454157 451374 449875 449872 451531 454642 458765
60544 458765 463758 469871 477287 485837 495391 506267 519015 533808 550234 567683 585733 603893
60532 603893 621010 635274 645173 650505 652188 651083 647267 640552 631402 621013 610632 600972 592151
60519 592151 583946 576156 568905 562587 557425 553225 549717 547005 545406 544982 545547 547138 550155 554906 561281
60504 561281 569132 578872 591399 607432 627103 650328 677356 708666 744287 783405 824807 867597
60492 867597 911297 955306 998443 1039087 1075741 1107411 1133415 1152814 1164072 1165470 1155896 1135236
60480 1135236 1104200 1064227 1017645 967288 915398 863109 811387 762097 717399 678081 643177
60469F43177l1771k8899k5544k1994j8841j6280j4178j2405j0946r926r449r232
60457D33712q618p303n783m709m074l483k937k767k873k776k367k090k217k426
60443C79289k274j694r24j98L43O16N09j26j259k400k882k631k269k174j906j019
60427C59001Q1O44N97L51L6l55m29J62R46J211J183J694K680L085K411J389Q69
60410C75556Q43R41J084J246J224J040J040J266J284R09N59O30J014J453J855
60395C91944K090K019J891K142K617K687K261J967K104K264K245K487L079L302
60381D25099K791K356K800L643L836L237K474J742P98o9j11P57J669J853J425
60366D54300R43O79N71N41O33Q45R86Q57O91J197K719M390M871M165L899N294
$$ plain form
60469 643177 611406 582507 556963 534969 516128 499848 485670 473265 462319 452393 442944 433712
60457 433712 425094 417791 412008 407299 403225 399742 396805 394038 391165 388389 386022 383932 381715 379289
60443 379289 377015 375321 374397 374199 374542 375158 375667 375541 374282 371882 369000 366369 364100 361926 360020 359001
60427 359001 359082 359726 360323 360674 360710 360355 359926 360088 361034 362245 363428 365122 367802 370887 373298 374687 375556
60410 375556 376399 377340 378424 379670 380894 381934 382974 384240 385524 386433 386992 387622 388636 390089 391944
60395 391944 394034 396053 397944 400086 402703 405390 407651 409618 411722 413986 416231 418718 421797 425099
60381 425099 427890 430246 433046 436689 440525 443762 446236 447978 448776 448707 448596 449353 451022 452875 454300
60366 454300 455243 455922 456493 457034 457667 458512 459498 460355 461046 462243 464962 469352 474223 478388 482287 487581
60350D87581P482Q637Q264P400O757N777L779J243o99j641k213l136m360n258
60336E19613n422n042m547m146l877l818l997m213m261m217m188l973l391k716
60322D61805k291j893j170n22o27j084n98J184K995L671L605L920M969O399Q014
60307D88377R694J0955J1453J1522J1546J1235J0163Q608P067N363L087M55k128
60294E87397m951q350j1458j2846j2367j1290j0432r300p405n339l964l275k713
60281D83707k085j668j706k210k951l487l578l650m383n575o094n294l914l075
60267D34037k872k641k221k161k648l046k727j887j132o71l22p9j34l32j67M62
60251D11459R68Q65M65K99K31j52n59j99R21J764J681J234J148J161O24k62o24
$$ plain form
60350 487581 495063 503700 511964 519364 526121 531898 535677 536920 536221 534580 532367 529231 524871 519613
60336 519613 514191 509149 504602 500456 496579 492761 488764 484551 480290 476073 471885 467912 464521 461805
60322 461805 459514 457621 456451 455929 455302 454218 453620 454804 457799 461470 465075 468995 473964 480363 488377
60307 488377 498071 509026 520479 532001 543547 554782 564945 573553 580620 585983 589070 589525 587397
60294 587397 582446 574096 562638 549792 537425 526135 515703 506403 498998 493659 489695 486420 483707
60281 483707 481622 479954 478248 476038 473087 469600 466022 462372 457989 452414 446320 441026 437112 434037
60267 434037 431165 428524 426303 424142 421494 418448 415721 413834 412702 412031 411709 411630 411496 411164 410997 411459
60251 411459 412427 413292 413757 414056 414287 414135 413576 413377 414298 416062 417743 418977 420125 421286 421910 421648 421024
60234D21024r1Q67J678K118K173J964J864K245L047L871M457M775M836M737M706
60219D64271M828M897M815M912N504O404P168P606P707P457P156P437Q424R268
60205E57854R100Q168P352O893O373N705N287N220N119M775M327L750K780J446
60191F34149J31r39j746k161k095j939k234l002l950n047o254o905o347n106m430
60176E82125m614m730m163l405l055l046l195l538l731l077j727r01j248j853
60162E39842j665j060j024j475j552j136r28j106r96k65M77N90L19L42Q50J422
60146E32635J660J630J673J930K180K188K135K497L433M515N186N388N539O053
60132E78642O914P660P780P214O393N658M905M038L431L402L462K836J680J033
$$ plain form
60234 421024 420933 421800 423478 425596 427769 429733 431597 433842 436889 440760 445217 449992 454828 459565 464271
60219 464271 469099 473996 478811 483723 489227 495631 502799 510405 518112 525569 532725 540162 548586 557854
60205 557854 566954 575122 582474 589367 595740 601445 606732 611952 617071 621846 626173 629923 632703 634149
60191 634149 634280 633341 631595 629434 627339 625400 623166 620164 616214 611167 604913 598008 591661 586555 582125
60176 582125 577511 572781 568618 565213 562158 559112 555917 552379 548648 545571 543844 542943 541695 539842
60162 539842 538177 537117 536093 534618 533066 531930 531002 529896 528900 528635 529112 529702 530021 530363 531213 532635
60146 532635 534295 535925 537598 539528 541708 543896 546031 548528 551961 556476 561662 567050 572589 578642
60132 578642 585556 593216 600996 608210 614603 620261 625166 629204 632635 636037 639499 642335 644015 645048
60118F45048J423K315L140L934M622M586L571K284J348M14r23j954j759q93r31
60103F66225k350l946m537m333m204m431m715m838m726m165l024j626n20M0J06
60088F18956k81j092k014k515k345j823j469j475j657j769j742j604j397j244
60074E96529j379j935k863m070n517o994q021q247p864p398p094o780o283n640
60060E16444m952m287l750l360k905k214j539j295j413j367q99k57L89J246K411
60045D92252L486M074M302M606N169N862O493O822O530N491M066K941K580K786
60031E57460K730J630l77k183k896k856l074l848m591m934n189n603n989o403
60017E13877p331q752r749r650q940q351p710o440m753l457k792k321j874j809
$$ plain form
60118 645048 646471 648786 651926 655860 660482 665068 668639 670923 672271 672685 671762 669808 668049 667156 666225
60103 666225 663875 659929 655392 651059 646855 642424 637709 632871 628145 623980 620956 619330 618810 618850 618956
60088 618956 618675 617583 615569 613054 610709 608886 607417 605942 604285 602516 600774 599170 597773 596529
60074 596529 595150 593215 590352 586282 580765 573771 565750 557503 549639 542241 535147 528367 522084 516444
60060 516444 511492 507205 503455 500095 497190 494976 493437 492142 490729 489362 488463 488206 488595 489841 492252
60045 492252 495738 499812 504114 508720 513889 519751 526244 533066 539596 545087 549153 552094 554674 557460
60031 557460 560190 561820 561443 559260 556364 553508 550434 546586 541995 537061 531872 526269 520280 513877
60017 513877 506546 497794 488045 478395 469455 461104 453394 446954 442201 438744 435952 433631 431757 429948
60003D29948k231k603k295j173M27J923K706K533J788J146R90J363K183L198L909
59988D43812M026L907M144M814N452N631N204M176K772J513P60K18o49j795k623
59973D81362k823k749k855l104l084k501j549p87n53m34L07J590K402K209J913
59958D69344K643M015M573L772K525J640Q15m34j639j936j272m71k01m18p20r20
59942D81316j160j577j979j978j505j062j158j632j820j278j35J150K083K380
59928D71645K311K621L721N125O130O793P551Q102P586N934M229L365L115K798
59914E41026K274J809J551J597K092K860L324L167K749K454K109J420N39k04q17
59899E67950j379j678j591j489j718j967j702r46k1J173K852M497N153M734M264
$$ plain form
60003 429948 427717 425114 422819 421646 422073 423996 426702 429235 431023 432169 433159 434522 436705 439903 443812
59988 443812 447838 451745 455889 460703 466155 471786 476990 481166 483938 485451 486211 486429 485780 483985 481362
59973 481362 478539 475790 472935 469831 466747 464246 462697 461910 461357 460923 461230 462820 465222 467431 469344
59958 469344 471987 476002 480575 484347 486872 488512 489327 488893 487254 485318 484046 483575 483374 482956 482236 481316
59942 481316 480156 478579 476600 474622 473117 472055 470897 469265 467445 466167 466032 467182 469265 471645
59928 471645 473956 476577 480298 485423 491553 498346 505897 513999 521585 527519 531748 535113 538228 541026
59914 541026 543300 545109 546660 548257 550349 553209 556533 559700 562449 564903 567012 568432 568971 568767 567950
59899 567950 566571 564893 563302 561813 560095 558128 556426 555480 555459 556632 559484 563981 569134 573868 578132
59884E78132M592N412N953O030O039O246O538O747O858O909O850O486N562M047
59870F62401K338R61k0r92k152l173l744m090m583n135n351n192n028n010m814
59855F16416m170l343k830k724k582j908o39Q02J921K683L528M773N939O025M581
59840F28472K240L0j481k179j843k63K053L866M138K838P57j172k341k659k546
59825F29910k511k616k520k159k012k456l275m018m584n035n184m828m226l863
59811E80623l785l616l206k871k947l405l971m330m253l753l123k542j901j207
59797E35713r50j457k115j946r26l3J87K67P66J330J333Q73M51J70j62m20l78
59780E32703k69m58o67k93N95J302J581J902K432K616K170J850K505L810M665
$$ plain form
59884 578132 582724 588136 594089 600119 606158 612404 618942 625689 632547 639456 646306 652792 658354 662401
59870 662401 664739 665700 665680 664688 662536 659363 655619 651529 646946 641811 636460 631268 626240 621230 616416
59855 616416 612246 608903 606073 603349 600767 598859 598220 599022 600943 603626 607154 611927 617866 623891 628472
59840 628472 630712 630742 629261 627082 625239 624976 627029 630895 635033 637871 638628 637456 635115 632456 629910
59825 629910 627399 624783 622263 620104 618092 615636 612361 608343 603759 598724 593540 588712 584486 580623
59811 580623 576838 573222 570016 567145 564198 560793 556822 552492 548239 544486 541363 538821 536920 535713
59797 535713 534763 533306 531191 529245 528319 528286 528473 528740 529506 530836 532169 533042 533493 533663 533501 533081 532703
59780 532703 532434 531976 531309 531016 531611 532913 534494 536396 538828 541444 543614 545464 547969 551779 556444
59765E56444M673M469M601M730M252L239K397K323L089M411N921P342Q586R715
59751F26192J0663J1110J0763R816Q849Q272P918P303O171M752L551K886K618
59738G20864K281J581O97J7m26r82j795k435k369j676j020r00j152j334j348j462
59722G08541j814k132k096j837j874k479l262l586l364l179l492l894l507k119
59708F69906n67K35M80J206K874M654N460N299N105N379N685N607N497N812O233
59693G28865O166N732N521N465M786L152J227j87r39j253j264j258j783k971m162
59678G47097m712m909n500o553p325p229o475n755n582n892o043n330l755k034
59664F70003p40K50J159J729J805J976K855M025M588M598N011O162P275P682P588
$$ plain form
59765 556444 561117 565586 570187 574917 579169 582408 584805 587128 590217 594628 600549 607891 616477 626192
59751 626192 636855 647965 658728 668544 677393 685665 693583 700886 707057 711809 715360 718246 720864
59738 720864 723145 724726 725423 725440 725014 724032 722237 719802 717433 715757 714737 713837 712685 711351 710003 708541
59722 708541 706727 704595 702499 700662 698788 696309 693047 689461 686097 682918 679426 675532 672025 669906
59708 669906 669339 669574 670054 671260 674134 678788 684248 689547 694652 700031 705716 711323 716820 722632 728865
59693 728865 735031 740763 746284 751749 756535 759687 760914 760727 759788 758535 757271 756013 754230 751259 747097
59678 747097 742385 737476 731976 725423 718098 710869 704394 698639 693057 687165 681122 675792 672037 670003
59664 670003 669263 669513 670672 672401 674206 676182 679037 683062 687650 692248 697259 703421 710696 718378 725966
59649G25966P237O197M091J376j232l593n832p674q842r743j0974j2290j2797
59636F71890j2194j1092j0047q895p356n791m885m794n036n185n362n867o555
59623E78831o964p042p329q102q653q025o420n207n241n787n608m597l639l123
59609D93094k440j096L81J133J058Q11Q63J058J026O81J78l28p21q65o76k32L21
59592D94246R38J592K082K082J468M95m10r10q94n01j90m79j412k452l063l225
59576D89367l203l055k767k649l024l551l459k634j927k065k658k749k049j165
59562D52412p11o36n55l42k34m43q10q59k62P34J485J637J524J758K547L573M435
59545D65253M937N047M848M676N080O363Q284J0397J2693J5559J8839K1107K0373
$$ plain form
59649 725966 733203 739400 743491 744867 743635 740042 734210 726536 717694 707951 696977 684687 671890
59636 671890 659696 648604 638557 629662 622306 616515 611630 606836 601800 596615 591253 585386 578831
59623 578831 571867 564825 557496 549394 540741 532716 526296 521089 515848 510061 504453 499856 496217 493094
59609 493094 490654 489558 489939 491072 492130 492941 493804 494862 495888 496569 496747 496419 495698 494833 494157 493925 494246
59592 494246 495184 496776 498858 500940 502408 502903 502493 501583 500689 500188 499998 499519 498107 495655 492592 489367
59576 489367 486164 483109 480342 477693 474669 471118 467659 465025 463098 461033 458375 455626 453577 452412
59562 452412 451701 451065 450510 450168 449934 449491 448681 447822 447560 448294 449779 451416 452940 454698 457245 460818 465253
59545 465253 470190 475237 480085 484761 489841 496204 504488 514885 527578 543137 561976 583083 603456
59532F03456J5770Q447P56n275q627r186p582n077k910j495m83L33O55K69m68
59517E88583j091j680k665m191n968p592q722r033q399p172o031n456n388n421
59503E09774n177m567l739k839j838p18J95M07r2o03m79J61P45J075J452K052
59487D95809K719L400M193M828M630L493K444K595L735M582M431L914L896M307
59473E48976M472M132L528K735J577K03q76j403j596j630j430j061q60q32m50
59458E55485O40K085L387M556N711O446O299N618N233N260M956L862K417J192
59444F13147P2j325k850l957m505m972n738o495o549n651m363l434l034k748k291
59429E55307j836j547j205m94N99J929L423M929O219P421Q985J0910J2463J3254
$$ plain form
59532 603456 619226 627673 628429 623154 614527 605341 597759 592682 589772 588277 587794 588127 588782 589051 588583
59517 588583 587492 585812 583147 578956 572988 565396 556674 547641 539242 532070 526039 520583 515195 509774
59503 509774 504597 500030 496291 493452 491614 490896 491091 491498 491406 490803 490324 490485 491230 492305 493757 495809
59487 495809 498528 501928 506121 510949 515579 519072 521516 524111 527846 532428 536859 540773 544669 548976
59473 548976 553448 557580 561108 563843 565420 565623 564747 563344 561748 560118 558688 557627 556767 555935 555485
59458 555485 556125 558210 561597 566153 571864 578310 584609 590227 595460 600720 605676 609538 611955 613147
59444 613147 613219 611894 609044 605087 600582 595610 589872 583377 576828 571177 566814 563380 560346 557598 555307
59429 555307 553471 551924 550719 550225 550824 552753 556176 561105 567324 574745 583730 594640 607103 620357
59415F20357J3907J4974J5897J6164J6871J9482K2828K3076J7463P226l740j2083
59403G72422j6335j6394j3140q191k856K699Q523J3299J4544J0648K429p266j5208
59390G45174j9392j9789j7883j5325j2936j0776q743o782m883l171j730k67J662
59377F25159L919N713O600O983P285P334P019O911P378P602O584M794L783M087
59363G11151M586M222L426L292L962M569M525M223M408N255O313P176P922Q778
59349G83808R634J0220J0608J1150J1883J2417J2527J2388J2075J1380J0275R020
59337I17385P533N304K430l9j418k481m356o863q832r799j0265j0449r917q634
59323H59599p406o873o851o929p072p265p188o723o307o336o583o600o339o066
$$ plain form
59415 620357 634264 649238 665135 681299 698170 717652 740480 763556 781019 788245 784505 772422
59403 772422 756087 739693 726553 718362 715506 718205 726728 740027 754571 765219 767648 760382 745174
59390 745174 725782 705993 688110 672785 659849 649073 640330 633548 628665 625494 623764 623497 625159
59377 625159 629078 634791 641391 648374 655659 662993 670012 676923 684301 691903 698487 703281 707064 711151
59363 711151 715737 719959 723385 726677 730639 735208 739733 743956 748364 753619 759932 767108 775030 783808
59349 783808 793442 803662 814270 825420 837303 849720 862247 874635 886710 898090 908365 917385
59337 917385 924918 930222 932652 932613 931195 928714 924358 917495 908663 898864 888599 878150 868233 859599
59323 859599 852193 845320 838469 831540 824468 817203 810015 803292 796985 790649 784066 777466 771127 765061
59309G65061n891n757n685n733n795n610m926l595j725K62J952L339M617N413
59295G35927M646J453l805r570j4087j6406j6697j5800j4442j2841j0936q800
59283F18642o603m416k349o60N22J500K631L838M867N927P459R311J0679J1093
59269F62441J0986J1014J1136J0700R277P189N217L838K702J012j427l804n240
59256G25041n833o358p062p450p246o817o451n850m736l485k656k184j553o07
59242F56753K40N72N16N94J241K434L691M454M494M015L369K767K175J444N09
59227F89268m90j355k084k797l390l609l533l580l761l468k451j498j491k047
59213F53714j962r16R5J18o60j497k094k611l067l189k751j920j249j286j936
$$ plain form
59309 765061 759170 753413 747728 741995 736200 730590 725664 722069 720344 720606 722558 725897 730514 735927
59295 735927 740573 742026 738221 728651 714564 698158 681461 665661 651219 638378 627442 618642
59283 618642 612039 607623 605274 604614 605136 606636 609267 613105 617972 623899 631358 640669 651348 662441
59269 662441 673427 684441 695577 706277 715554 722743 727960 731798 734500 735512 734085 730281 725041
59256 725041 719208 712850 705788 698338 691092 684275 677824 671974 667238 663753 661097 658913 657360 656753
59242 656753 656993 657565 658081 658675 659916 662350 666041 670495 674989 679004 682373 685140 687315 688759 689268
59227 689268 688778 687423 685339 682542 679152 675543 672010 668430 664669 661201 658750 657252 655761 653714
59213 653714 651752 650836 650931 651049 650389 648892 646798 644187 641120 637931 635180 633260 632011 630725 628789
59198F28789k356j873q31j06Q1L04R54J775K450L042L681M382N228O264P101P199
59182F66084O669O159N929N668N327N239N216M519L185K425K995M002M198L766
59168G31381L782M414M795M476L872L275K423J315M87L8q59k933n709q037r408
59153G33312j0264j1056j1636j1706j1466j1340j1252j0666r457q328p982q213
59141F09946q254p868p492p406p272o710n800m777l665k493j513r21n98l32j7
59126E44828N41J613L129M562N454N871O163O652P566Q870R972J0151R532R106
59112F34010R397R749R359Q442P647O927N784M377L390K875K101O99p81j673j969
59097G00334k057k217k656l520m510m822l931k290q91l60o16j278j999k427k352
$$ plain form
59198 628789 626433 624560 623729 623623 623704 624008 624962 626737 629187 632229 635910 640292 645520 651784 658885 666084
59182 666084 672753 678912 684841 690509 695836 701075 706291 710810 713995 716420 719415 723417 727615 731381
59168 731381 735163 739577 744372 748848 752720 755995 758418 759733 760220 760258 759399 756466 750757 742720 733312
59153 733312 723048 711992 700356 688650 677184 665844 654592 643926 634469 626141 618159 609946
59141 609946 601692 593824 586332 578926 571654 564944 559144 554367 550702 548209 546696 545775 545177 544845 544828
59126 544828 545369 546982 550111 554673 560127 565998 572161 578813 586379 595249 605221 615372 624904 634010
59112 634010 643407 653156 662515 670957 678604 685531 691315 695692 699082 701957 704058 704757 703976 702303 700334
59097 700334 698277 696060 693404 689884 685374 680552 676621 674331 673440 673080 672464 671186 669187 666760 664408
59082F64408k053k252l377m930n986o275o381o727o859o164m928m109m118m443
59068E95806m530m447m500m673m750m615m273l835l614l813m059l767l071k792
59054E39067l150l330k747k067k200k855k968k265j471j036o19J3M68M72M73J005
59038E16790J827K218J898J256P40M99O25J377K882M752O324P333Q114R062J0112
59023E75809J1036J1932J3005J3978J4234J3535J2153J0228P530M073M96k485
59011F85524m624n969o504o307n707m959m096l234k688k481k166j419m01P31K084
58996F37784L429L891K935J180l26j321k133k712k781k684l141m079m545m020
58982F21477l064k379j826q30P18K376L749M751N483O138P034Q404J0067J1372
$$ plain form
59082 664408 662355 660103 656726 651796 645810 639535 633154 626427 619568 613404 608476 604367 600249 595806
59068 595806 591276 586829 582329 577656 572906 568291 564018 560183 556569 552756 548697 544930 541859 539067
59054 539067 535917 532587 529840 527773 525573 522718 519750 517485 516014 514978 514359 514372 514840 515312 515785 516790
59038 516790 518617 520835 522733 523989 524729 525228 525853 527230 530112 534864 541188 548521 556635 565697 575809
59023 575809 586845 598777 611782 625760 639994 653529 665682 675910 683440 687513 688009 685524
59011 685524 680900 674931 668427 662120 656413 651454 647358 644124 641436 638955 636789 635370 634969 635700 637784
58996 637784 641213 645104 648039 649219 648893 647572 645439 642727 639946 637262 634121 630042 625497 621477
58982 621477 618413 616034 614208 613378 614096 616472 620221 624972 630455 636593 643627 652031 662098 673470
58968F73470J1665J0922R762Q773P993P243O698O598O541N722L926J701o01l111
58954G57302n608p264p827q268r482j1015j1899j2085j2084j1672j0229q160o745
58941F34964o430o327n589m401l257k228j351j032j454k024j959j141j60L87L88
58926E98386J87J47J93j18q49j380j277j037j390k065k142j488r38r12p91j1J080
58909E85595J841K249K679L379M525O262Q276R811J0587J1163J2011J2726J2734
58896F83838J2241J1814J1373J0479R341Q724Q849R196R559J0495J2288J4134
58884H12331J4915J4487J3539J2397J0700Q315N912M173K888J341o47k652m371
58871H93328n857p006p515p516p544p672p248o028m948n163o612q182r016r184
$$ plain form
58968 673470 685135 696057 705819 714592 722585 729828 736526 743124 749665 755387 759313 761014 760413 757302
58954 757302 751694 744430 736603 728335 718853 707838 695939 683854 671770 660098 649869 641709 634964
58941 634964 628534 622207 616618 612217 608960 606732 605381 604349 602895 600871 598912 597771 597611 597998 598386
58926 598386 598573 598720 598913 598795 597946 596566 595289 594252 592862 590797 588655 587167 586229 585317 584526 584515 585595
58909 585595 587436 589685 592364 595743 600268 606530 614806 624617 635204 646367 658378 671104 683838
58896 683838 696079 707893 719266 729745 739086 747810 756659 765855 775414 785909 798197 812331
58884 812331 827246 841733 855272 867669 878369 886684 892596 896769 899657 900998 900351 897699 893328
58871 893328 887471 880465 872950 865434 857890 850218 842970 836942 831994 826831 820219 812037 803021 793837
58857G93837r197r421r879j0213r962r134q327p906p488o674n891n856o539p345
58843F80005q078q964r911j0573j1048j1690j2165j1577r808p940p053p100p203
58830E56895o616n190l439k233j992k091j489k0J486K345K664K798K831K858L139
58815E51946L652L914L560K785K046J663J764K190K404J944J004J87k87o45r34
58800E77193r81r12j064j356j412j299j399j638j641j652k207k837k284l93J432
58785E57550K198K655L833N354O205O468P053Q121Q813Q502P383N931M374K713
58771F37153Q03j535m119o305p611q204q451q325p667o643n575m604l869l680
58757E61368m006m112l246j566kO35J97q78j838k093j699j124m58O67K222L469
$$ plain form
58857 793837 784640 775219 765340 755127 745165 736031 727704 719798 712310 705636 699745 693889 687350 680005
58843 680005 671927 662963 653052 642479 631431 619741 607576 595999 586191 578251 571198 564098 556895
58830 556895 550279 545089 541650 539417 537425 535334 533845 533825 535311 537656 540320 543118 545949 548807 551946
58815 551946 555598 559512 563072 565857 567903 569566 571330 573520 575924 577868 578872 579059 578772 578127 577193
58800 577193 576212 575300 574236 572880 571468 570169 568770 567132 565491 563839 561632 558795 556511 556118 557550
58785 557550 559748 562403 566236 571590 577795 584263 591316 599437 608250 616752 624135 630066 634440 637153
58771 637153 637956 636421 632302 625997 618386 610182 601731 593406 585739 579096 573521 568917 565048 561368
58757 561368 557362 553250 550004 548438 548436 549071 549268 548390 546552 544459 542760 541636 541178 541845 544067 547536
58741E47536L887L852L912M077M221M581N174N361M777M196M570N571N918N072
58727F12705L682K528J776J330J166J155J060Q50P14Q17J343K531M196N475N630
58712F46958M994M501M412M030K674L61k420n062o950p843q278r151j0759j2639
58698F04828j4300j5568j6123j5423j3481j1299r995r618r183p897o041m506l722
58685D67672l358l046k976l404l902l701k786j966j726j611j094m73l81p68r39
58670D35541l78Q48K344L687M646N403O343P423Q044P802O913N587L535O82k093
58655D96327l686m044m074m319m500m344m193m529n237n720n511m686l690k836
58641D34958k053j230o42o42r43p85N3R33J308J444J753K030J836J262O92K66
$$ plain form
58741 547536 551423 555275 559187 563264 567485 572066 577240 582601 587378 591574 596144 601715 607633 612705
58727 612705 616387 618915 620691 622021 623187 624342 625402 626252 626966 627783 629126 631657 635853 641328 646958
58712 646958 651952 656453 660865 664895 667569 667930 665510 660448 653498 645655 637377 628226 617467 604828
58698 604828 590528 574960 558837 543414 529933 518634 508639 499021 489838 481941 475900 471394 467672
58685 467672 464314 461268 458292 454888 450986 447285 444499 442533 440807 439196 438102 437629 437248 436480 435541
58670 435541 435163 436011 438355 442042 446688 452091 458434 465857 473901 481703 488616 494203 497738 498420 496327
58655 496327 492641 488597 484523 480204 475704 471360 467167 462638 457401 451681 446170 441484 437794 434958
58641 434958 432905 431675 431033 430391 429448 428663 428716 429649 430957 432401 434154 436184 438020 439282 439974 440240
58625D40240jP9M34M32k53q72n12N36J149J023J061J948L186L858L765L414L278
58608D62765L438L821M408N156N695N372L911K021R08R59J326J113M90J53K09
58593E01745J71q3m2P21K035L392M463N383O577Q211R812J0706J0840J0720J0548
58578E85199J0042R274Q838Q895Q779Q075P354P268P649Q167R181J1154J3797
58565G03672J6553J9342K2090K4173K5170K5630K6147K6231K4998K2460J9173
58554I55639J5164J0281N168P37k901n930p826q063p368o894o573n830n532p361
58540I22711j1275j5336j8377k1071k3866k5642k5394k3825k2255k0908j9257
58529F95505j7190j4925j2461r920p928o932o564o201n667n016m205l457l376
$$ plain form
58625 440240 440239 440318 440752 441184 440931 440059 439547 440083 441232 442255 443316 445264 448450 452308 456073 459487 462765
58608 462765 466203 470024 474432 479588 485283 490655 494566 496587 497495 498454 499780 500893 501383 501536 501745
58593 501745 501916 501833 501791 502512 504547 507939 512402 517785 524362 532573 542385 553091 563931 574651 585199
58578 585199 595241 604515 613353 622248 631027 639102 646456 653724 661373 669540 678721 689875 703672
58565 703672 720225 739567 761657 785830 811000 836630 862777 889008 914006 936466 955639
58554 955639 970803 981084 986252 986989 984088 978158 970332 962269 954901 948007 941434 935604 930072 922711
58540 922711 911436 896100 877723 856652 832786 807144 781750 757925 735670 714762 695505
58529 695505 678315 663390 650929 641009 633081 626149 619585 613384 607717 602701 598496 595039 591663
58516E91663m054m637m271l145k116j694j778k032k125j813j202o64m13l04j43
58501E61272J32N78J110J362J080O26N00O11O37Q89J941L527M789N678O957Q720
58485F00409J0024J0433J0793J1886J3310J4341J5108J6066J7035J7478J7262
58474G54145J6490J4907J2061P854K649k690o749q340p814o958p033p428o825
58461G54269n014k912j222J39J640L689O406R290J1374J2147J2016J1375R778
58448H22975O605K271k010n547q467j0849j2318j2815j2982j3246j2935j1051
58436G29631p793m700k997k361j654m29R02K074L309M690O008P348Q996J0538
58422G53562J1020J0275R142P887N511J482k954o196q174r728j0918j1253j0949
$$ plain form
58516 591663 587609 582972 578701 575556 573440 571746 569968 567936 565811 563998 562796 562132 561719 561415 561272
58501 561272 561404 561982 563092 564454 565534 566160 566660 567271 567908 568797 570738 574265 579054 584732 591689 600409
58485 600409 610433 620866 631659 643545 656855 671196 686304 702370 719405 736883 754145
58474 754145 770635 785542 797603 805457 808106 805416 798667 790327 782513 775555 768522 761094 754269
58461 754269 749255 746343 745121 745260 746900 750589 756995 766285 777659 789806 801822 813197 822975
58448 822975 829580 831851 829841 824294 815827 804978 792660 779845 766863 753617 740682 729631
58436 729631 721838 717138 714141 711780 710126 709697 710599 712673 715982 720672 726680 734028 743024 753562
58422 753562 764582 774857 783999 791886 797397 798879 795925 789729 781555 771827 760909 749656 738707
58409G38707j0569r920q562p011o067n385m104k483j424o74P85K725L743L451
58395F93212L058L505M469N292N645N182L839K461J867J449K21j138j108M4O07
58380G28605M04J037K814L956L679L646N101O755O996O427O540P378Q039Q375
58366G99752Q739R027R166R669J0692J1536J1856J2326J3176J3412J2345J0659
58354I32355Q926O534L258N47k29K45M29K33P36K284M168N741O829P485Q068R064
58338I96673J0327J1140J1379J1702J2290J2611J2689J3284J4303J4609J3915
58327A134922J3219J2742J1243Q312N504M039L165J953R95R83J285J347J918L534
58313A205161N218O132O977Q438R864J0794J2066J3918J4914J4374J4012J5259
$$ plain form
58409 738707 728138 718218 709656 702645 696578 691193 687089 684606 683182 682508 683293 686018 689761 693212
58395 693212 696270 699775 704244 709536 715181 720363 724202 726663 728530 729979 730200 729062 727954 727998 728605
58380 728605 729009 730046 732860 736816 740495 744141 749242 755997 762993 769420 775960 783338 791377 799752
58366 799752 808491 817518 826684 836353 847045 858581 870437 882763 895939 909351 921696 932355
58354 932355 941281 947815 951073 951620 951391 951636 952065 952298 953034 955318 959486 965227 972056 979541 987609 996673
58338 996673 1007000 1018140 1029519 1041221 1053511 1066122 1078811 1092095 1106398 1121007 1134922
58327 1134922 1148141 1160883 1172126 1180438 1185942 1189981 1193146 1195099 1196094 1197077 1198362 1199709 1201627 1205161
58313 1205161 1210379 1216511 1223488 1231926 1241790 1252584 1264650 1278568 1293482 1307856 1321868 1337127
58301A337127J6829J6962J6348J6475J6758J5852J4491J4502J5890J7269J8292
58290A516795J9445K0296K0164J9893K0824K2670K4160K5133K6296K7633K8780
58279A772089L0118L1812L2685L1661K9539K7865K7058K7003K8179L0764L3823
58268B102596L6737M0059M3774M6615M8437N1101N5355N9125O0773O1672O3419
58257B669663O5013O5139O4769O5019O4897O3841O3921O6660P0213P2641P5320
58246C407096P9968Q5120Q8965R2987R9162J06255J12595J19673J29012J38419
58236D459252J45625J52725J62558J73615J83321J93382K06727K21992K36400
58227F135597K51396K69879K90607L11002L32853L59428L89731M21508M56834
$$ plain form
58301 1337127 1353956 1370918 1387266 1403741 1420499 1436351 1450842 1465344 1481234 1498503 1516795
58290 1516795 1536240 1556536 1576700 1596593 1617417 1640087 1664247 1689380 1715676 1743309 1772089
58279 1772089 1802207 1834019 1866704 1898365 1927904 1955769 1982827 2009830 2038009 2068773 2102596
58268 2102596 2139333 2179392 2223166 2269781 2318218 2369319 2424674 2483799 2544572 2606244 2669663
58257 2669663 2734676 2799815 2864584 2929603 2994500 3058341 3122262 3188922 3259135 3331776 3407096
58246 3407096 3487064 3572184 3661149 3754136 3853298 3959553 4072148 4191821 4320833 4459252
58236 4459252 4604877 4757602 4920160 5093775 5277096 5470478 5677205 5899197 6135597
58227 6135597 6386993 6656872 6947479 7258481 7591334 7950762 8340493 8762001 9218835
58218I218835M98586N44786N93077O47256P12331P86953Q68405R61171J072656
58209A5904056J204838J359057J544884J775681K060836K412352K853028L406822
58201C2521554M085861M894667N835223O894993Q046251R282377J0651046J2237826
58193I4449798J4130670J6413296J9159513K2395109K6075801L0072873L3981327
58186B56678387L6703012L6296177L0752676J9520625M488778j0712025k2698097
58179C51029533k9966859l2996058l3169377l1723718k9401895k6607292k3602194
58172A43562140k0582693j7694970j5043087j2688178j0650563q924012p486041
58165E0492596o298396n315103m498913l824676l268126k803217k411857k085508
$$ plain form
58218 9218835 9717421 10262207 10855284 11502540 12214871 13001824 13870229 14831400 15904056
58209 15904056 17108894 18467951 20012835 21788516 23849352 26261704 29114732 32521554
58201 32521554 36607415 41502082 47337305 54232298 62278549 71560926 82211972 94449798
58193 94449798 108580468 124993764 144153277 166548386 192624187 222697060 256678387
58186 256678387 293381399 329677576 360430252 379950877 384439655 373727630 351029533
58179 351029533 321062674 288066616 254897239 223173521 193771626 167164334 143562140
58172 143562140 122979447 105284477 90241390 77553212 66902649 57978637 50492596
58165 50492596 44194200 38879097 34380184 30555508 27287382 24484165 22072308 19986800
58157A9986800j815035j587661j394664j232908j097298r79914q77301p90528
58149A0211491p16946o49584n85713n28694m80102m36752l96621l61113l30119
58140E725847l00868k73081k49929k32648k18967k07395j98169j89612j78785
58131C676393j66297j55663j47396j38587j28684j20542j14936j09044j01572
58122B493672r4721q9799q5159p9816p5164p1730o7870o2966n8560n5227n1643
58111A701017m7635m4915m3842m2585m0432l8828l8248l7062l4540l2184l1185
58100A269561l1053l1428l2624l3845l3553l2112l1403l1423l0065k6718k3231
58089I32106k0674j8087j5125j3078j2350j1684j0739j0871j2397j3644j3685
$$ plain form
58157 19986800 18171765 16584104 15189440 13956532 12859234 11879320 11002019 10211491
58149 10211491 9494545 8844961 8259248 7730554 7250452 6813700 6417079 6055966 5725847
58140 5725847 5424979 5151898 4901969 4669321 4450354 4242959 4044790 3855178 3676393
58131 3676393 3510096 3354433 3207037 3068450 2939766 2819224 2704288 2595244 2493672
58122 2493672 2398951 2309152 2223993 2144177 2069013 1997283 1929413 1866447 1807887 1752660 1701017
58111 1701017 1653382 1608467 1564625 1522040 1481608 1442780 1404532 1367470 1332930 1300746 1269561
58100 1269561 1238508 1207080 1174456 1140611 1107058 1074946 1043543 1012120 982055 955337 932106
58089 932106 911432 893345 878220 865142 852792 841108 830369 819498 807101 793457 779772
58078G79772j3636j4351j5159j5721j6672j7624j7016j4920j3477j3541j3350
58067F14305j1727j0074r659r344p772n922n568o590p518p720p651p753q164q822
58053E00021r244q954q410q416q589p808o223n182n010m639l765l419l969m402
58039D11991m269m444n288n815n436m881m734m618m473m963o037o709o790p114
58025C36420p609p081n546m716n358o122n889n339n170m747l683k910k995k994
58011B66261k251j594j618j466o26k18j064k068j959j236q56l99P77J862J753
57996B55298R46P04J128J441J385J111M61n01j064r81j093j893k591k513k273
57981B49565k380k127j131n73j380k374k013q80n73j032r08J7P58J067J607K317
$$ plain form
58078 779772 766136 751785 736626 720905 704233 686609 669593 654673 641196 627655 614305
58067 614305 602578 592504 582845 573501 565729 559807 554239 547649 540131 532411 524760 517007 508843 500021
58053 500021 490777 481823 473413 464997 456408 448600 442377 437195 432185 427546 423781 420362 416393 411991
58039 411991 407722 403278 397990 392175 386739 381858 377124 372506 368033 363070 357033 350324 343534 336420
58025 336420 328811 321730 316184 311468 306110 299988 294099 288760 283590 278843 275160 272250 269255 266261
58011 266261 264010 262416 260798 259332 258706 258488 257424 255356 253397 252161 251305 250906 251683 253545 255298
57996 255298 256244 256948 258076 259517 260902 262013 262474 261973 260909 259928 258835 256942 254351 251838 249565
57981 249565 247185 245058 243927 243354 241974 239600 237587 236707 236134 235102 234194 234211 234969 236036 237643 239960
57965B39960K297J354L21k73o41q52o75l31m38j178k214l256m055m215l782l449
57949B18573l448k903j305K03K63n39m62Q90K269K900L337M150N047N732O483
57934B41190P526Q570R249R483R229Q448P325O054M454K331L3j941l669n528p387
57919B95367q672r131q956q350p596p266p694q328q237p210n827m593l489k290
57905A97728q39Q20K284K996K929K702K732K752K495K256K291K245J840J522J812
57890B28565K533L305M272N520O388O162N074L831K642J423M52m6m91j310k098
57875B66222k363k598l566m936n609n258m456l569k528j531j013q81o66l09k9
57860B26910L57J116J874K157K456L667N535O761O752O210N855N565N028M362
$$ plain form
57965 239960 242257 243611 243932 243659 243018 242166 241491 241160 240722 239544 237330 234074 230019 225804 222022 218573
57949 218573 215125 212222 210917 211120 211383 210844 210382 211272 213541 216441 219778 223928 228975 234707 241190
57934 241190 248716 257286 266535 276018 285247 293695 301020 307074 311528 313859 313892 311951 308282 302754 295367
57919 295367 286695 277564 268608 260258 252662 245396 237702 229374 221137 213927 208100 203507 200018 197728
57905 197728 196889 197709 199993 202989 205918 208620 211352 214104 216599 218855 221146 223391 225231 226753 228565
57890 228565 231098 234403 238675 244195 250583 256745 261819 265650 268292 269715 270167 270121 269630 268320 266222
57875 266222 263859 261261 257695 252759 247150 241892 237436 233867 231339 229808 228795 227914 227248 226939 226910
57860 226910 227267 228383 230257 232414 234870 238537 244072 250833 257585 263795 269650 275215 280243 284605
57846B84605L745L107K431J842J264N24k02o43j039j808k699l036k854k875l302
57831B79060l434k752j628p60m62p01j248j627j469j036r36j301j743k042k240
57816B55681k123j425o00o00j733l393n048o724q328r298r325q847q401p979p344
57801A74513o493n528m478l542l034k867k408j206M50J850K538K493K000J510
57787A55798J386J645K049K461K902L342L726M156M800N652O538P308P777P771
57773B17311P419P134O968O419N197L802K754J780L71j211k278k803l314l921
57759B45628m207m095l961l903l532k617j410l73L8m36j345j610p29M26P74M75
57743B19123L68M75K16k90m37m15q86j488j170q0M45P4M3R81J784J499Q87J023
$$ plain form
57846 284605 288350 291457 293888 295730 296994 297518 297316 296673 295634 293826 291127 288091 285237 282362 279060
57831 279060 275626 272874 271246 270486 270024 269323 268075 266448 264979 263943 263007 261706 259963 257921 255681
57816 255681 253558 252133 251533 250933 249200 245807 240759 234035 225707 216409 207084 198237 189836 181857 174513
57801 174513 168020 162492 158014 154472 151438 148571 146163 144957 145407 147257 149795 152288 154288 155798
57787 155798 157184 158829 160878 163339 166241 169583 173309 177465 182265 187917 194455 201763 209540 217311
57773 217311 224730 231864 238832 245251 250448 254250 257004 258784 259155 257944 255666 252863 249549 245628
57759 245628 241421 237326 233365 229462 225930 223313 221903 221530 221568 221132 219787 218177 217448 217874 218648 219123
57743 219123 219491 219966 220182 219892 219455 219040 218154 216666 215496 215416 215861 215935 215978 216959 218743 220242 221129 222152
57725B22152J526J397P86O60J243J870K046J840J475J237J398J724J469M08p27
57710B40504j296j639k231k682k507k227k724l807m395l963k966k043j545j625
57696B04854k060k117j445r23j721l577m867m600l505k847k841k803k312j620
57682A67616r78j30J370L549N954Q257J0641J3412J6423J9328K2357K6290L1463
57669C25552L7379M3609N0528N8185O4453O4933N5457L5195P821k0153m2662n6613
57657F23684o2085o0889n5332m7891m0773l5012l0233k5697k1387j7740j4804
57646B11841j2168r603p307n491m141l168k553k230j995j607r88l45L1J25K93
57631A60694P14R94O36k02r12j309j729k263k557k534k622k950l031k641k386
$$ plain form
57725 222152 223678 225075 225861 226521 227764 229634 231680 233520 234995 236232 237630 239354 240823 241231 240504
57710 240504 239208 237569 235338 232656 230149 227922 225198 221391 216996 213033 210067 208024 206479 204854
57696 204854 202794 200677 199232 198309 196588 193011 188144 183544 180039 177192 174351 171548 169236 167616
57682 167616 166638 166508 167878 171427 177381 185638 196279 209691 226114 245442 267799 294089 325552
57669 325552 362931 406540 457068 515253 579706 644639 700096 735291 743112 722959 680297 623684
57657 623684 561599 500710 445378 397487 356714 321702 291469 265772 244385 226645 211841
57646 211841 199673 190070 182763 177272 173131 169963 167410 165180 163185 161578 160590 160245 160276 160401 160694
57631 160694 161408 162402 163038 162836 161924 160615 158886 156623 154066 151532 148910 145960 142929 140288 137902
57616A37902k757l249l081k401k008k105k158j924j817k076k206j588k88J023
57602A11267J727J658R97k1j186k236k850k901k646k533k773l253l823m414m854
57587H2159m854m240l082j669n20k32q62j605j573q76m23o74j264j838k510l224
57571E2713l432k899k233k134k569l044l294l294l024k573k093j433l37P77J015
57556B2146K92l15j00K45o6m18K85J758K696K709K630K764K179K76j903k699j765
57539C0714k91M26K44j2L05Q94R25J37p74r85m69J96O03P37P00P07J099J857K222
57520C9235J408k66j507j403k69R56J723K117K371K470K226J604R04M86L14O1
57504E2430m05q79j341k110l153l744l267k153j432j582k240k896l323l379k953
$$ plain form
57616 137902 135145 131896 128815 126414 124406 122301 120143 118219 116402 114326 112120 110532 110244 111267
57602 111267 112994 114652 115649 115628 114442 112206 109356 106455 103809 101276 98503 95250 91427 87013 82159
57587 82159 77305 73065 69983 68314 67794 67562 66700 65095 63522 62646 62223 61549 60285 58447 55937 52713
57571 52713 49281 46382 44149 42015 39446 36402 33108 29814 26790 24217 22124 20691 20354 21131 22146
57556 22146 22438 22123 22023 22268 22202 21784 22069 23827 26523 29232 31862 34626 36805 37081 35178 32479 30714
57539 30714 30423 30849 31093 31081 31386 32280 33205 33342 32568 31583 31114 31310 31913 32650 33350 34057 35156 37013 39235
57520 39235 40643 40377 38870 37467 37198 38154 39877 41994 44365 46835 49061 50665 51569 52055 52369 52430
57504 52430 52025 51146 49805 47695 44542 40798 37531 35378 33946 32364 30124 27228 23905 20526 17573
57489A7573k206j515j076q48q09r53j117j103r73r02q48o28k76j3L1j90p83A668
57470h23k747k593k517k666k731k458j939j382r24o27m45k01J22J81l12j077j562
57453b4701j616j534j496j373j133r69r35p84l68J9m9n61r40n63N09J428J389
57436c3677O29J90N80J093P77l09j229j301o25L65J303J859J720Q60l23j232j427
57419c0747r98n83p77j408j747j526j227j162q12L43J802K538K266J636J216Q61
57403c0325R4j246k794l809l692k561j249n35n50r60j381j423r13l10l51r44j038
57386e3987j02J035J456J476J875K452K465K043J991K302K080R27m87j449j915
57371c7838k141k298k609l117l342k789j848j428j740k143k162j931j605j142
$$ plain form
57489 17573 15367 13852 12776 11928 11119 10166 9049 7946 6973 6071 5223 4595 4319 4306 4337 4147 3364 1668
57470 -823 -3570 -6163 -8680 -11346 -14077 -16535 -18474 -19856 -20780 -21407 -21852 -22053 -21931 -21750 -22062 -23139 -24701
57453 -24701 -26317 -27851 -29347 -30720 -31853 -32822 -33757 -34541 -34909 -34890 -34939 -35500 -36440 -37003 -36494 -35066 -33677
57436 -33677 -33048 -32858 -32278 -31185 -30408 -30717 -31946 -33247 -33872 -33507 -32204 -30345 -28625 -27765 -28088 -29320 -30747
57419 -30747 -31745 -32328 -33105 -34513 -36260 -37786 -39013 -40175 -40987 -40644 -38842 -36304 -34038 -32402 -31186 -30325
57403 -30325 -30231 -31477 -34271 -38080 -41772 -44333 -45582 -46117 -46667 -47627 -49008 -50431 -51344 -51654 -52005 -52949 -53987
57386 -53987 -54089 -53054 -51598 -50122 -48247 -45795 -43330 -41287 -39296 -36994 -34914 -33987 -34474 -35923 -37838
57371 -37838 -39979 -42277 -44886 -48003 -51345 -54134 -55982 -57410 -59150 -61293 -63455 -65386 -66991 -68133
57357f8133p43o91p29l13M73J026J273J700K256K188J226P1o60j113j537j747
57341f5453j689j778k195k470k184j583j119q67p23o65n61k34N0k48j081j681
57325h4481j554j045o68m94m21m98o95q64j139j692k065j554m88j89j166k296
57309a01309k375j700j344j465j332o04J90M51J92j05m4K33J35o41j493j510o69
57292a13390J60M28M29M89M93M54P32J284J451R95N18M47M01J29J81R27J608J329
57274a00935L83k38k32j1K57P28J225J346J060O48J18o20j260j370j037o96m79
57257a01113k31n7k23o46q96p75n05l92n20p04n90p2M08K95j98k57L30P67M31
57238a04948k11l93n8M31J027J738K189K173K194K739L416L543L276L359M026
$$ plain form
57357 -68133 -68876 -69567 -70296 -70609 -70136 -69110 -67837 -66137 -63881 -61693 -60467 -60396 -61056 -62169 -63706 -65453
57341 -65453 -67142 -68920 -71115 -73585 -75769 -77352 -78471 -79338 -80061 -80726 -81287 -81521 -81471 -81719 -82800 -84481
57325 -84481 -86035 -87080 -87748 -88242 -88663 -89161 -89856 -90720 -91859 -93551 -95616 -97170 -97658 -97847 -99013 -101309
57309 -101309 -103684 -105384 -106728 -108193 -109525 -110129 -109939 -109488 -109296 -109401 -109445 -109212 -109077 -109718 -111211 -112721 -113390
57292 -113390 -113230 -112802 -112373 -111884 -111391 -110937 -110205 -108921 -107470 -106475 -105957 -105510 -105109 -104980 -104799 -103872 -102264 -100935
57274 -100935 -100552 -100790 -101022 -101033 -100776 -100048 -98823 -97477 -96417 -95769 -95651 -96271 -97531 -98901 -99938 -100634 -101113
57257 -101113 -101344 -101401 -101624 -102270 -103166 -103941 -104446 -104838 -105358 -106062 -106652 -106724 -106316 -106021 -106219 -106476 -106146 -105379 -104948
57238 -104948 -105159 -105552 -105610 -105179 -104152 -102414 -100225 -98052 -95858 -93119 -89703 -86160 -82884 -79525 -75499
57223g5499M804N243N205M700M018L780M257M895N100N168N777O871P776B65Q294
57208H559Q337Q418Q813R632J0389J0530J0177R788R476R303R745J0992J2137
57195A36296J2133J1366J1253J2307J3689J4664J5350J5901J6014J5729J5729
57184B90431J6290J6705J6288J5418J4980J5235J5785J6334J6971J7837J8935
57173D71209K0218K1637K3089K4441K5579K6484K7290K8204K9331L0688L2436
57162G60606L4721L7123L8760L9360L9759M0828M2215M2826M2311M1327M0477
57151A200313L9673L8654L7404L5965L4303L2562L1038K9713K8250K6600K5346
57140A559821K5259K6538K8479K9883L0051K9514K9436L0150L0697L0199K9085
$$ plain form
57223 -75499 -70695 -65452 -60247 -55547 -51529 -47749 -43492 -38597 -33497 -28329 -22552 -15681 -7905 265 8559
57208 8559 16896 25314 34127 43759 54148 64678 74855 84643 94119 103422 113167 124159 136296
57195 136296 148429 159795 171048 183355 197044 211708 227058 242959 258973 274702 290431
57184 290431 306721 323426 339714 355132 370112 385347 401132 417466 434437 452274 471209
57173 471209 491427 513064 536153 560594 586173 612657 639947 668151 697482 728170 760606
57162 760606 795327 832450 871210 910570 950329 991157 1033372 1076198 1118509 1159836 1200313
57151 1200313 1239986 1278640 1316044 1352009 1386312 1418874 1449912 1479625 1507875 1534475 1559821
57140 1559821 1585080 1611618 1640097 1669980 1700031 1729545 1758981 1789131 1819828 1850027 1879112
57129A879112K8424K8486K8630K8281K7400K6162K4861K3999K3906K4397K5191
57118B168849K6435K8388L0973L4114L8121M3201M9061N5726O4279P6088R1727
57107B706962J11318J35226J63357J94369K27288K64340L11591L76728M66466
57098D957645N85013P32931R06472J098107J297910J495163J681026J852238K012765
57089A6619270K170597K331146K490502K631458K726862K753989K710930K613972
57081C7048726K469406K247783J897174J391411P65396J00587n22168j056022
57073D4342293j487336j819007k060779k227930k338388k406361k438201k433513
57065B7130778k389263k304043k180910k027687j855016j673904j494165j323459
$$ plain form
57129 1879112 1907536 1936022 1964652 1992933 2020333 2046495 2071356 2095355 2119261 2143658 2168849
57118 2168849 2195284 2223672 2254645 2288759 2326880 2370081 2419142 2474868 2539147 2615235 2706962
57107 2706962 2818280 2953506 3116863 3311232 3538520 3802860 4114451 4491179 4957645
57098 4957645 5542658 6275589 7182061 8280168 9578078 11073241 12754267 14606505 16619270
57089 16619270 18789867 21121013 23611515 26242973 28969835 31723824 34434754 37048726
57081 37048726 39518132 41765915 43663089 45054500 45819896 45920483 45398315 44342293
57073 44342293 42854957 41035950 38975171 36747241 34408853 32002492 29564291 27130778
57065 27130778 24741515 22437472 20256562 18228875 16373859 14699955 13205790 11882331
57057A1882331j166630j025642r00154p88388o88454n99877n23821m61182m10524
57048E317659l68593l32654l01548k74528k50252k27327k05222j84148j64409
57039C008978j46277j30132j16241j04343r3651q3314p2990o2924n3475m4575
57029B101056l5796k6680j6633m908P933J8114J9552Q357j3331l8459n9951p4234
57017A885020q1097q1881p8331p2242o5189n8345n2373m7239m2375l7451l2890
57006A235607k9215k6237k3380k0620j8410j6808j5480j4410j3872j3601j2845
56995A030729j1506j0403j0061r918r138p671n938m047j940N2J501K531L496M012
56981I71699K890o60o089j1919j6845k0234k1932k2026k0891j9130j7226j5267
$$ plain form
57057 11882331 10715701 9690059 8789905 8001517 7313063 6713186 6189365 5728183 5317659
57048 5317659 4949066 4616412 4314864 4040336 3790084 3562757 3357535 3173387 3008978
57039 3008978 2862701 2732569 2616328 2511985 2418334 2335020 2262030 2199106 2145631 2101056
57029 2101056 2065260 2038580 2021947 2017039 2024972 2043086 2062638 2070995 2057664 2019205 1959254 1885020
57017 1885020 1803923 1722042 1643711 1571469 1506280 1447935 1395562 1348323 1305948 1268497 1235607
57006 1235607 1206392 1180155 1156775 1136155 1117745 1100937 1085457 1071047 1057175 1043574 1030729
56995 1030729 1019223 1008820 998759 988841 979703 972032 966094 962047 960107 960159 961660 964191 967687 971699
56981 971699 974589 973929 967840 955921 939076 918842 896910 874884 853993 834863 817637 802370
56969H02370j3115j0765q429o315m388k415j72K333M784O880Q854J1406J4693
56956H05721J7361J7104J2463M051n929j5011k1422k4474k4655k3220k1257j9049
56944G01683j6398j3354j0323p637n267k959m41K486N873R631J3623J7693K1544
56931G16154K4630K6155K5013J9964J0529j939j4428k3970k9379l1314l1101k9745
56919F60569k7784k5434k2751j9880j7200j5082j3450j1855j0061q474p762q029
56907D72807q450p911o091l809k183j663j909k349k457j721J6K119L586M171M706
56892D48862O070Q185J0309J2019J3533J5183J6806J7643J6793J3857R186L507
56880E91953k545q293j2738j4941j4840j3291j1250r105o782m055p42L006O533
$$ plain form
56969 802370 789255 778490 770061 763746 759358 756943 756771 759104 763888 770768 779622 791028 805721
56956 805721 823082 840186 852649 856700 850771 835760 814338 789864 765209 741989 720732 701683
56944 701683 685285 671931 661608 653971 648704 645745 645304 647790 653663 663294 676917 694610 716154
56931 716154 740784 766939 791952 811916 822445 820506 806078 782108 752729 721415 690314 660569
56919 660569 632785 607351 584600 564720 547520 532438 518988 507133 497072 488598 480836 472807
56907 472807 464357 456446 450355 446546 444363 442700 440791 438442 435985 434264 434280 436399 439985 444156 448862
56892 448862 454932 463117 473426 485445 498978 514161 530967 548610 565403 579260 588446 591953
56880 591953 589408 581115 568377 553436 538596 525305 514055 504950 498168 494113 493371 496377 502910
56867E02910R233J1335J3694J6847K0679K5021K9805L4467L7660L7832L3770K4830
56855G98083J1581l551j7118k6687l1760l2779l0287k5398j9947j5177j0784n950
56843E90226p27M309R213J4533K0379K6504L3025M0303M8141N5666O1630O4090
56831I67292O0114M7160K5458j159k6982m7072n8903o2614o0191n4178m6612l8763
56819G03550l1325k4527j8243j2322o747j383M139J0121J6612K3607L1081L8598
56807G33161M5085M8910M7775L9108K2021m64k2279l8376m7610n1375n0799m6492
56795F78665m0013l3648k8548k4192j9828j5419j1208p200l394K70M224Q858J3763
56782E22330J8040K1333K3720K4456K1741J4338L059r531k0648k8449l2368l2838
$$ plain form
56867 502910 512143 523478 537172 554019 574698 599719 629524 663991 701651 739483 773253 798083
56855 798083 809664 806113 788995 762308 730548 697769 667482 642084 622137 606960 596176 590226
56843 590226 589499 593808 603021 617554 637933 664437 697462 737765 785906 841572 903202 967292
56831 967292 1027406 1074566 1100024 1098865 1071883 1024811 965908 903294 843103 788925 742313 703550
56819 703550 672225 647698 629455 617133 610386 609003 613142 623263 639875 663482 694563 733161
56807 733161 778246 827156 874931 914039 936060 935596 913317 874941 827331 775956 725157 678665
56795 678665 638652 605004 576456 552264 532436 517017 505809 498609 495215 495485 499709 508567 522330
56782 522330 540370 561703 585423 609879 631620 645958 649017 639486 618838 590389 558021 525183
56770E25183l0780k7270k3516k0570j8612j6847j4589j2225j0594r742q953p841
56758C23644o720n905n313m755m122l312k405j847j901k113j835j220j016j477
56744B79703k067k243j987j505r77o20n16l77P1N28M83M0j76O5L36K73Rj53j24
56725B70763N5L43P18J235J941K535K463J686R71R19J163J068P71P88J024J027
56709B89470Q55Q13O29j00q31n16Q59K176K664K529K097J315L82j32j56l07r19
56692C00828j533j656j445j335j523j934k235j858o07Q07J461J396J371J627J721
56677B95085J585J653J898J678Q23o5o36j155j657j660j143q00r14q62k52L13
56661B93891K20k00k92o5O5Nq8j59j43J04L86K01n46j264j454j280j090r30o88
$$ plain form
56770 525183 494403 467133 443617 423047 404435 387588 372999 360774 350180 340438 331485 323644
56758 323644 316924 311019 305706 300951 296829 293517 291112 289265 287364 285251 283416 282196 281180 279703
56744 279703 277636 275393 273406 271901 270924 270304 269788 269411 269482 270010 270493 270533 270357 270422 270758 271031 271040 270887 270763
56725 270763 270818 271161 271879 273114 275055 277590 280053 281739 282710 283629 284792 285860 286631 287419 288443 289470
56709 289470 290325 291138 291767 291667 290836 290320 291179 293355 296019 298548 300645 301960 302342 302210 302054 301747 300828
56692 300828 299295 297639 296194 294859 293336 291402 289167 287309 286702 287509 288970 290366 291737 293364 295085
56677 295085 296670 298323 300221 301899 302722 302657 302021 300866 299209 297549 296406 295606 294692 293830 293578 293891
56661 293891 294111 293911 293619 293554 293619 293624 293536 293377 293234 293338 293724 293925 293379 292115 290661 289381 288291 287361 286673
56642B86673l16K74J033J418Q74l00j202j506j640j787j619j152q83q59n82r4
56626B78332r3o36q71n08l83r84j613j676j668j972j877r00j4l49j418j924j734
56609B59712j714k076k158j647q72PJ058J897J937J326Q53Q87J132J331J513J532
56593B64718J074K25n29q87q87n67oM37L99L7j33P6M02N42M51L03M07R46J607
56574B68615J816J518J343J610J798J468J131J557K596L472M014M745N849O803
56560C08335P231P535Q327R493R985Q641N276J008k644m949o088o379n973n242
56546C34556m695m317l663k791k285k153j663p27l72j116j917j702j099j413k510
56531C02133l040k444j525j044r43j013j266j405q66K72J100R86K82l29o88j021
$$ plain form
56642 286673 286357 286631 287664 289082 289956 289656 288454 286948 285308 283521 281902 280750 279867 279008 278426 278332
56626 278332 278239 277603 276732 276224 275841 274857 273244 271568 269900 267928 266051 265151 265137 264788 263370 261446 259712
56609 259712 257998 255922 253764 252117 251245 251252 252310 254207 256144 257470 258323 259210 260342 261673 263186 264718
56593 264718 265792 266017 265488 264601 263714 263147 263141 263578 263977 264014 263881 263957 264359 264901 265352 265655 266062 267008 268615
56574 268615 270431 271949 273292 274902 276700 278168 279299 280856 283452 286924 290938 295683 301532 308335
56560 308335 315566 323101 331428 340921 350906 359547 364823 365831 363187 358238 352150 345771 339798 334556
56546 334556 329861 325544 321881 319090 316805 314652 312989 312262 311890 310774 308857 307155 306056 304643 302133
56531 302133 299093 296649 295124 294080 293137 292124 290858 289453 288587 288859 289959 290945 291227 290898 290210 289189
56515B89189j363j536j540j639k031k517k549j704j92J201J711J123j82j441j880
56500B74650j306m00Lj44k88l12o46j268j445q21N7N87Q28R62Q42N14M14N39J91
56481B72957q36j618j361n42J5M02J036J488J024k6n99l70M1K13L18M67M48K39
56463B73296J40K99N93Q42Q52M28k25m82r9L52K84r5k97l44m91o10n01l31j22
56444B73489O23K032L148K969J801P29J43l66r78j444j666j667j247l80L01K05
56428B77692l24n05j78K96P75J203J175N16j65k70q6k9K97J208J799J021m81j079
56410B82865m36L19N46O93R39P42L0m40l00QK86R30J841K185J694J169J177J243
56392B95491Q66M69O23J069J192R32N80J42m86j019j008m83N4K45K26L65P18R03
$$ plain form
56515 289189 287826 286290 284750 283111 281080 278563 276014 274310 274118 275319 277030 278153 277971 276530 274650
56500 274650 273344 272944 272947 272803 272515 272203 271557 270289 268844 268023 268080 268667 269495 270457 271299 271813 272227 272766 272957
56481 272957 272121 270503 269142 268600 268615 269017 270053 271541 272565 272539 271940 271570 271611 271824 272142 272609 273057 273296
56463 273296 273436 273735 274328 275170 276022 276450 276225 275743 275644 275996 276280 276185 275888 275544 275053 274443 273942 273611 273489
56444 273489 274112 276144 279292 282261 284062 284791 284934 284568 283590 282146 280480 278813 277566 277186 277487 277692
56428 277692 277368 276863 276685 276981 277756 278959 280134 280650 280485 280215 280129 280100 280397 281605 283404 284425 283944 282865
56410 282865 282429 282748 283294 283987 284926 285668 285698 285258 284958 284966 285252 286182 288023 290208 291902 293071 294248 295491
56392 295491 296357 296826 297449 298518 299710 300642 301222 301364 300878 299859 298851 298368 298422 298667 298893 299258 299976 300879
56374C00879N74o6n34p93j126j232l61J328K390J851N71M5M93J072J417J791K100
56357C10399J950J484J208J066P08L77N78J046J041N46J99J97K33L74R07J458
56341C23771J329O57K54L48N41Q65J730K853L349L013K448J933J158L19K51J226
56325C46045K455L080K983K523K117K064K178J773P09m1L04R56O58k94m86L91
56309C67415J211J214Q32O63Q89J691L031M052L967L439L755M754N019M103K995
56294D09030K372J948J729K194L014L163K678K759L745M590M761M992N648N921
56280D58544N392M893N077N431N486N635O121O439O463O903Q017R089R808J0807
56266E54105J2243J3217J3398J3857J5401J7356J8884K0371K2549K5339K8399
$$ plain form
56374 300879 301453 301387 300853 300060 298934 297702 297341 298669 301059 302910 303481 303526 304019 305091 306508 308299 310399
56357 310399 312349 313833 315041 316107 316815 317192 317770 318816 319857 320403 320602 320799 321032 321406 322313 323771
56341 323771 325100 325757 326011 326359 326900 327765 329495 332348 335697 338710 341158 343091 344249 344568 344819 346045
56325 346045 348500 351580 354563 357086 359203 361267 363445 365218 365927 365886 366190 367146 367804 367510 367024 367415
56309 367415 368626 369840 370672 371335 372224 373915 376946 380998 384965 388404 392159 396913 401932 406035 409030
56294 409030 411402 413350 415079 417273 420287 423450 426128 428887 432632 437222 441983 446975 452623 458544
56280 458544 463936 468829 473906 479337 484823 490458 496579 503018 509481 516384 524401 533490 543298 554105
56266 554105 566348 579565 592963 606820 622221 639577 658461 678832 701381 726720 755119
56255G55119L1920L6037M0436M5089N0440N6256O1589O6409P2013P8966Q5945
56244A380219R1422R5352R8283J00056J00359R9388R6980R2087Q4089P3658O1442
56233B373335M7079L0532J3296k898j7664l1237m3078n2514o0001o6581p2520
56222B117749p7360q0816q2821q3225q2150q0225p7921p5192p2039o8687o4976
56211A272337o0590n6166n2966n0964m8540m4651m0071l5930l2289k8887k5963
56200G95320k3520k0950j8199j6055j4649j2994j0815r319r246r562r158q380
56188F32473p782o822n082l516l082l226k993k542k379k111j243k43L56R08J691
56173E94407K034J551J124J588K477L169M054N403O338O255O065O723P666Q088
$$ plain form
56255 755119 787039 823076 863512 908601 959041 1015297 1076886 1143295 1215308 1294274 1380219
56244 1380219 1471641 1566993 1665276 1765332 1865691 1965079 2062059 2154146 2238235 2311893 2373335
56233 2373335 2420414 2450946 2464242 2461344 2443680 2412443 2369365 2316851 2256850 2190269 2117749
56222 2117749 2040389 1959573 1876752 1793527 1711377 1631152 1553231 1478039 1406000 1337313 1272337
56211 1272337 1211747 1155581 1102615 1051651 1003111 958460 918389 882459 850170 821283 795320
56200 795320 771800 750850 732651 716596 701947 688953 678138 668819 659573 650011 640853 632473
56188 632473 624691 617869 612787 609271 606189 602963 599970 597428 595049 592938 591695 591452 591808 592716 594407
56173 594407 596441 597992 599116 600704 603181 606350 610404 615807 622145 628400 634465 641188 648854 656942
56159F56942Q548R869J1491J2419J2902J3789J5125J6682J8910K2012K5153K7761
56147H51603L0663L4725L9509M4580N0818N9003O8299P7696Q7703R9005J10555
56136A554159J20619J28568J33847J34282J27634J14378R7576Q0594O6191N6622
56126B614470N2431N1344M9638M4389L4033J8350n12j8253l1410l9719m4944m8982
56114B680835n4280o3942p9057r6790j12840j24747j31554j32160j26309j16097
56104A643059j04227r1656p8560o6178n5686m6446l7585l0121k5358k2268j8794
56093A066180j4809j1602r286p020m940l739k894j410L38J332J764K491L459M273
56079A024137N276O526O994O369O173P325Q397Q197Q131R711J1696J2284J2304
$$ plain form
56159 656942 665490 675359 686850 699269 712171 725960 741085 757767 776677 798689 823842 851603
56147 851603 882266 916991 956500 1001080 1051898 1110901 1179200 1256896 1344599 1443604 1554159
56136 1554159 1674778 1803346 1937193 2071475 2199109 2313487 2411063 2491657 2557848 2614470
56126 2614470 2666901 2718245 2767883 2812272 2846305 2864655 2864143 2845890 2814480 2774761 2729817 2680835
56114 2680835 2626555 2562613 2483556 2386766 2273926 2149179 2017625 1885465 1759156 1643059
56104 1643059 1538832 1447176 1368616 1302438 1246752 1200306 1162721 1132600 1107242 1084974 1066180
56093 1066180 1051371 1039769 1030483 1023463 1018523 1014784 1011890 1010480 1010818 1012150 1013914 1016405 1019864 1024137
56079 1024137 1029413 1035939 1042933 1049302 1055475 1062800 1071197 1079394 1087525 1097236 1108932 1121216 1133520
56066A133520J3330J4472J4146J3442J4455J6519J7361J6901J6743J6916J6259
56055A304064J5146J4784J4701J3853J3220J4336J6283J7063J6949J7572J8874
56044A476845J9826K0933K3014K4891K5339K5744K7624K9295K8428K6201K5191
56033A753331K5022K4015K3355K5267K8631L0820L2452L5834M0036M2168M2409
56022B103340M3199M4586M5031M5632M8719N3294N6592N8947O2380O5878O7213
56011B694811O7917P1030P5352P7586P8734Q2316Q7598R0976R3002R7457J04343
56000C621122J10365J15651J23246J32606J40404J47173J56298J67158J76312
55991D890335J84689J96237K10337K23194K35871K52846K73561K93804L14474
$$ plain form
56066 1133520 1146850 1161322 1175468 1188910 1203365 1219884 1237245 1254146 1270889 1287805 1304064
56055 1304064 1319210 1333994 1348695 1362548 1375768 1390104 1406387 1423450 1440399 1457971 1476845
56044 1476845 1496671 1517604 1540618 1565509 1590848 1616592 1644216 1673511 1701939 1728140 1753331
56033 1753331 1778353 1802368 1825723 1850990 1879621 1910441 1942893 1978727 2018763 2060931 2103340
56022 2103340 2146539 2191125 2236156 2281788 2330507 2383801 2440393 2499340 2561720 2627598 2694811
56011 2694811 2762728 2833758 2909110 2986696 3065430 3147746 3235344 3326320 3419322 3516779 3621122
56000 3621122 3731487 3847138 3970384 4102990 4243394 4390567 4546865 4714023 4890335
55991 4890335 5075024 5271261 5481598 5704792 5940663 6193509 6467070 6760874 7075348
55982G075348L40176L70056L99492M29923M67123N10610N55331O03107O61352
55973A1412518P30897Q06791Q90848R91647J112775J253747J422195J632430J893680
55964B2147528K214256K615752L127193L765781M536484N442684O476665P608982
55956E7935325Q818547J0136357J1639856J3413851J5541754J8110175K1171751
55949A56767616K4710951K8649489L2710267L5983219L6594675L2269867K1880402
55942C69566486O778715r491999k3081700l1749811l5393372l5247378l2825573
55935B08555368k9351133k5637306k2121717j8955760j6146373j3672931j1518684
55928G1151464r662691q085694o772880n696946m813439m082467l480867k988030
$$ plain form
55982 7075348 7415524 7785580 8185072 8614995 9082118 9592728 10148059 10751166 11412518
55973 11412518 12143415 12950206 13841054 14832701 15945476 17199223 18621418 20253848 22147528
55964 22147528 24361784 26977536 30104729 33870510 38406994 43849678 50326343 57935325
55956 57935325 66753872 76890229 88530085 101943936 117485690 135595865 156767616
55949 156767616 181478567 210128056 242838323 278821542 315416217 347686084 369566486
55942 369566486 376345201 366853202 343771502 312021691 276628319 241380941 208555368
55935 208555368 179204235 153566929 131445212 112489452 96343079 82670148 71151464
55928 71151464 61488773 53403079 46630199 40933253 36119814 32037347 28556480 25568450
55920B5568450k577220k228553j935779j692984j486948j307876j155096j026655
55912A2157339r14328q13467p26997o55250n91738n32934m82539m42161m06774
55903F591151l73075l43696l19649k96767k73177k52402k35763k19154k00595
55894D076873j83862j71395j60336j48616j38473j30934j23019j13406j05016
55885B801816r9192r2958q4712p7160p2224o8344o5106o4882o7383o8085o4817
55874A976953o0817n8695n6561n2911n0171n0104n0207m7962m4598m1728l8197
55863A425002l3231k8935k6861k5580k4301k5228k9474l4080l6001l6010l5927
55852A089374l5046l2250k8847k6477k4534k2209k0726k1064k1657k0749j9094
$$ plain form
55920 25568450 22991230 20762677 18826898 17133914 15646966 14339090 13183994 12157339
55912 12157339 11243011 10429544 9702547 9047297 8455559 7922625 7440086 6997925 6591151
55903 6591151 6218076 5874380 5554731 5257964 4984787 4732385 4496622 4277468 4076873
55894 4076873 3893011 3721616 3561280 3412664 3274191 3143257 3020238 2906832 2801816
55885 2801816 2702624 2609666 2524954 2447794 2375570 2307226 2242120 2177238 2109855 2041770 1976953
55874 1976953 1916136 1857441 1800880 1747969 1697798 1647694 1597487 1549525 1504927 1463199 1425002
55863 1425002 1391771 1362836 1335975 1310395 1286094 1260866 1231392 1197312 1161311 1125301 1089374
55852 1089374 1054328 1022078 993231 966754 942220 920011 899285 878221 856564 835815 816721
55841H16721j8168j7696j6924j6381j6372j5663j3563j1523j0903j0897j0326
55830F58305r627r421q979p706o544o301o283n989o396q115r896j0432j0097r714
55816E42805r121q204p665p575o826n116l786l541l136j530M35J726K772M075
55802D95313M889M631M222M645N390N449M628L060P52j668l210m146n777p980
55788E10198q930p957o573n782m565k317o50j241l569o154q359r726r219o722
55774D28434l776j505Q72M433Q953J3754J8185K0175J6665P340l787j2240j7062
55761D80441j9502j9901j8103j5446j3748j2993j1999j0620r608q992q265p599
55749C23665p368p141o457n898o097o478o219n667n493n381m853m477m829n056
$$ plain form
55841 816721 798553 780857 763933 747552 731180 715517 701954 690431 679528 668631 658305
55830 658305 648678 639257 630278 622572 616028 609727 603444 597455 591059 582944 573048 562616 552519 542805
55816 542805 533684 525480 517815 510240 503414 498298 494512 490971 487835 486305 486740 488466 491238 495313
55802 495313 500202 504833 509055 513700 519090 524539 529167 532227 532979 531311 528101 523955 518178 510198
55788 510198 501268 493311 486738 480956 476391 474074 473424 472183 468614 462460 454101 444375 435156 428434
55774 428434 424658 423153 424025 428458 437411 451165 469350 489525 506190 513530 509743 497503 480441
55761 480441 460939 441038 422935 407489 393741 380748 368749 358129 348521 339529 331264 323665
55749 323665 316297 309156 302699 296801 290704 284226 278007 272340 266847 261466 256613 252136 247307 242251
55735B42251m045k291j159q92p58o06q35j269j418j444j750j983j654j191j318
55720B19638j790j906j733j757j742j107q1O31J011J596K441L115L414L342K718
55705B27790J554M20k89r47k002l200m148m922n482n247m059k794k246k049j552
55690A90827r43o12k23O12J454J788J962K393K668K472K532L413M119L325J498
55675B17285L42M50P77L43p17j788k411k329j663r17k77P19K204L352L547L468
55659B22385L971M516L981K624J805J895J853R43k64r49j151j414j995k721l290
55644B32189l503l526l792m414m901m764m182l688l577l874m480m931m545l275
55630A74737j969j340j201j071r14p88m07K89O98L42m65j200j757k032j664q50
$$ plain form
55735 242251 238206 235915 234756 233864 233106 232500 231665 230396 228978 227534 225784 223801 222147 220956 219638
55720 219638 217848 215942 214209 212452 210710 209603 209522 210153 211164 212760 215201 218316 221730 225072 227790
55705 227790 229344 229764 229475 228528 226526 223326 219178 214256 208774 203527 199468 196674 194428 192379 190827
55690 190827 189884 189272 189049 189661 191115 192903 194865 197258 199926 202398 204930 208343 212462 215787 217285
55675 217285 217627 218077 218854 219197 218480 216692 214281 211952 210289 209372 209095 209814 212018 215370 218917 222385
55659 222385 226356 230872 234853 237477 239282 241177 243030 243973 243709 242760 241609 240195 238200 235479 232189
55644 232189 228686 225160 221368 216954 212053 207289 203107 199419 195842 191968 187488 182557 178012 174737
55630 174737 172768 171428 170227 169156 168242 167454 167047 167336 168034 168376 167911 166711 164954 162922 161258 160408
55614A60408o57j620k796k983k290j622j324j217j348j745j930j589j184j103
55600A37000q90j89L08m7n54k45M08K73m62n94P7N08K13j72j58KJ84O36J098Q22
55580A38218j36o41M6J290K062K220K368K899L600M019L954L696L673L853L725
55565A74846K993J954Q98l16j733k907l536l940m372m473l969l293k821k190j192
55550A45949n50r05j583j536r19n85n30j01N84P84N31N63R14Q78M27L87R86J391
55532A46685J076N67L83J84n36j527k140k142j849j695j869k159k202j988j902
55517A28886k004j789j040l42k07k92k38n39j580k465k086r54n98j316j914j603
55501A09919q56k33L36Q39Q78M54J08j1l41r45j254j001n79j74M92J323J610R98
$$ plain form
55614 160408 159751 158131 155335 152352 150062 148440 147116 145899 144551 142806 140876 139287 138103 137000
55600 137000 136110 135921 136229 136182 135628 135383 135791 136064 135602 135008 135085 135593 135806 135634 135476 135478 135662 136298 137396 138218
55580 138218 138082 137441 137487 138777 140839 143059 145427 148326 151926 155945 159899 163595 167268 171121 174846
55565 174846 177839 179793 180691 180375 178642 175735 172199 168259 163887 159414 155445 152152 149331 147141 145949
55550 145949 145399 144494 142911 141375 140456 139871 139341 139240 139824 140608 141139 141702 142616 143494 143921 144308 145294 146685
55532 146685 147761 148328 148711 148895 148359 146832 144692 142550 140701 139006 137137 134978 132776 130788 128886
55517 128886 126882 125093 124053 123711 123504 123212 122974 122435 120855 118390 116304 115350 114752 113436 111522 109919
55501 109919 109063 108830 109166 110005 110883 111337 111445 111434 111093 110148 108894 107893 107314 107140 107632 108955 110565 111563
55483A11563O2m50l60J60Q65J360J363J140J093J006M30k89l11L38P14L47k74
55466A18757p77j385k038k076j298m56k29m21o19q07r37o58P0O66P25M66J51k95
55448A08839p25n58L72J330J515Q68j47j073j496j208o04l93o37p11l74j80n01
55431A04317r17r06n37p1L97O50L49k13j83O72J477J396O20j78p37j055j011o30
55413A03440k17J28N90R30M85o86j508j265n27r9J04M14N10Q1k42K51R92Q33j79
55394A04035p81l06M68N50j1l84mR90J914K006J012l97j112o63K27L79o00j861
55376A05462k265j612p22k73l7L88P07M43J2L10J266J798J417Q77Q56Q76J65j074
55358A08594j981k126j749j237q54o34k27P29J779J859P90k42k82K2l79j106q59
$$ plain form
55483 111563 111625 111175 110815 110975 111840 113200 114563 115703 116796 117802 118232 117943 117632 117970 118684 119031 118757
55466 118757 117980 116595 114557 112481 111183 110727 110498 110077 109458 108651 107714 107056 107126 107792 108517 108983 109134 108839
55448 108839 108114 107556 107928 109258 110773 111641 111494 110421 108925 107717 107113 106720 106083 105372 104998 104818 104317
55431 104317 103400 102494 101957 101886 102283 102933 103282 103069 102886 103558 105035 106431 107051 106873 106136 105081 104070 103440
55413 103440 103223 103351 103941 104871 105356 104670 103162 101897 101370 101271 101375 101789 102299 102380 102138 102389 103381 104214 104035
55394 104035 103254 102948 103416 103966 103955 103571 103567 104557 106471 108477 109489 109092 107980 107317 107544 107923 107323 105462
55376 105462 103197 101585 100863 100590 100553 100941 101648 102091 102103 102413 103679 105477 106894 107771 108627 109503 109668 108594
55358 108594 106613 104487 102738 101501 100647 100013 99786 100515 102294 104153 104943 104701 104419 104441 104062 102956 102097
55341A02097M65J476J259N02K59N32O42M16K41K37K7o45j478j990j984j574q81
55324I9601l0O37P24L11LK23O17N73J13j53L9L09K73N4j9J32L99O26O14K58k48
55303A05056n75o93p67p09k95K75M77K08j08k48m31o99o98l26M6K63O45J223J403
55284A04047Q65K21J98O40Q83P00L07j72o77r03o37j94n4k16l72m54n34m46M8
55265A03250P00R20M57l38r05r05m09J63L99L75N37R92J223P78j05q19j105j097
55247A04111r09n44k8N45J046J241R17K53k63l99l80m28m61m18m75o85p52m73
55229A01898o7R5j11n24p82m09O67J706J796R89K03o6j61l06j78K04J37o21j226
55210A03244r33k10R3J4J18M02M68L32K99L23K19J58L03L08j19n72n59l58n03
$$ plain form
55341 102097 102562 104038 105297 105799 106058 106590 107232 107648 107889 108126 108153 107508 106030 104040 102056 100482 99601
55324 99601 99571 100208 100932 101243 101246 101469 102086 102659 102772 102619 102658 102967 103240 103294 103275 103407 103806 104432 105046 105304 105056
55303 105056 104481 103788 103021 102312 102017 102292 102769 102977 102869 102621 102190 101491 100793 100467 100513 100776 101421 102644 104047
55284 104047 104912 105133 105331 105971 106854 107554 107861 107689 107012 106109 105472 105278 105224 105008 104636 104182 103648 103202 103250
55265 103250 103950 104870 105327 104989 104084 103179 102770 102933 103332 103707 104244 105236 106459 107237 107132 106313 105208 104111
55247 104111 103202 102658 102630 103175 104221 105462 106379 106632 106369 105970 105590 105162 104701 104283 103808 103123 102371 101898
55229 101898 101831 101926 101815 101291 100509 100100 100767 102473 104269 105258 105461 105395 105234 104928 104750 104954 105091 104470 103244
55210 103244 102311 102101 102194 102208 102326 102728 103196 103528 103827 104150 104369 104527 104830 105138 105019 104447 103888 103530 103027
55191A03027p40m06M60J138J216Q45K62k67k93K54P02M48o6l6N00R46J275J802
55173A11067K144J551K01q57j137j072r48n32N1J66k70m55J73J159J728J589Q71
55156A15429j18q57r56p34p88r65n42M59J083Q61M64N27O59K45n27j045j131q67
55138A11197j62Q33J326O57p37j715j727j216q71q92j017q91l95K41O49P07O20
55121A06607O24P59R49J054R26O17M72O45P32K90l72n73l41l87r07j235r04k96
55103A08660J52O13J209J428R62N15Q85J602J442K79n26Q7J436J945J101q5m46
55086A21259n7J22l50q73q13m43l98n93l86K40M84r8r16j167q36m61k85j74l3
55067A14222J04K54M09M34L58M71Q24Q59R3j031j442p29L34O95J54n88p88l26
$$ plain form
55191 103027 102287 101881 102341 103479 104695 105540 105802 105535 105242 105496 106198 106646 106580 106544 107044 107990 109265 111067
55173 111067 113211 114762 114963 114106 112969 111897 110949 110417 110468 110634 110364 109909 110082 111241 112969 114558 115429
55156 115429 115311 114454 113498 112764 111976 111011 110469 110928 112011 112872 113336 113863 114522 114767 114240 113195 112064 111197
55138 111197 111035 111868 113194 113851 113114 111399 109672 108456 107585 106693 105676 104785 104390 104631 105280 105987 106607
55121 106607 107231 107990 108939 109993 110919 111536 112008 112653 113385 113675 113303 112730 112389 112002 111095 109860 108956 108660
55103 108660 108812 109425 110634 112062 113024 113539 114424 116026 117468 117747 117221 117308 118744 120689 121790 121705 121259
55086 121259 121202 121324 120974 120101 119288 118845 118447 117854 117468 117708 118192 118094 117178 116011 115175 114714 114429 114255 114222
55067 114222 114326 114580 114989 115423 115781 116252 117076 117935 118028 116997 115555 114826 115160 115855 116009 115421 114633 114307
55049A14307L90Q68Q53L74k50n27j89M20N99J04n23o90m77k94j29L21R01J024
55031A17082N13j49n59q20j019q42r9Q09J336J432J355J128O27N4j11K79P26N10
55013A22252n60j779k057j021M20R93M33l75o86o85p69o97LJ099J781J655J125
54996A21132P73P59Q60Q39O43L63R9j64m87p79p96m52L0L09J93k87q58j090p60
54977A20327k12pj36j6O25J220J121N08J06J99M15M26L98O16J000J179R44M35
54959A29148o8m36o88p83o06k03J53L35N15P36O23k4o09l96L29N24j15p31o45
54940A27059k90k65l17R8P87J182J283J467J617J285N44m5k16o2N86J971L611
54923A40295M515M439M261M792N826O659O970O816O155M907L258J600J68j067
$$ plain form
55049 114307 114697 115565 116418 116792 116542 116015 115826 116246 116845 116949 116426 115736 115259 114965 114836 115157 116058 117082
55031 117082 117595 117446 116887 116067 115048 114206 114107 114916 116252 117684 119039 120167 120794 120848 120737 121016 121742 122252
55013 122252 121692 119913 117856 116835 117255 118248 118681 118306 117620 116935 116166 115469 115472 116571 118352 120007 121132
54996 121132 121905 122664 123524 124363 125006 125369 125468 125304 124817 124038 123242 122790 122820 123129 123322 123035 122177 121087 120327
54977 120327 120115 120108 119972 119956 120581 121801 122922 123430 123536 123735 124150 124576 124974 125590 126590 127769 128713 129148
54959 129148 129080 128644 127956 127173 126567 126364 126517 126852 127367 128103 128726 128702 128093 127697 128026 128550 128435 127704 127059
54940 127059 126769 126504 126187 126285 127072 128254 129537 131004 132621 133906 134450 134405 134189 134127 134713 136684 140295
54923 140295 144810 149249 153510 158302 164128 170787 177757 184573 190728 195635 198893 200493 200661 199594
54909A99594k305l699n053n805n651n118n053n503n636m893l612k368j325n29
54895A43044k51n44r76j183j285j249n83P77J821J648Q15N82J065J328J167J511
54879A47687K834M332N228N788O396O607N998N136M674M102K461n0k251l586m484
54864A90872n287n846o156o402o198m966l246k507l114l633k843j510j184j976
54850A36004k596k282j545j148j165j223j003m56Q3L1o66j156o61L53N97l69j619
54833A21179k040j461n10J57K93J81M43J300K074J823N70o48r74m53M39J299J682
54816A25354J197J35n25j64P36J264J065L98m24j153j507j337q30k75J77L83K03
54799A24697j44q7N72J214J127M02k67m87m33l42k21p9j8l5L9L01O65J002J237
$$ plain form
54909 199594 197289 193590 188537 182732 177081 171963 166910 161407 155771 150878 147266 144898 143573 143044
54895 143044 142793 142249 141273 140090 138805 137556 136973 137750 139571 141219 142034 142616 143681 145009 146176 147687
54879 147687 150521 154853 160081 165869 172265 178872 184870 190006 194680 198782 201243 201193 198942 195356 190872
54864 190872 185585 179739 173583 167181 160983 156017 152771 150264 147150 143517 140674 139164 137980 136004
54850 136004 133408 131126 129581 128433 127268 126045 125042 124586 124669 124700 124034 122878 122217 122570 123167 122798 121179
54833 121179 119139 117678 117168 117325 117618 117799 118242 119542 121616 123439 124009 123361 122387 121934 122373 123672 125354
54816 125354 126551 126686 126161 125997 126733 127997 129062 129460 129036 127883 126376 125039 124209 123934 124111 124494 124697
54799 124697 124553 124466 125038 126252 127379 127781 127514 127027 126594 126252 126031 125952 125934 125899 125938 126239 126904 127906 129143
54780A29143J305J189J015R64J129J511K099K798L336L422L061K590K404K671
54766A58637L268L925M451M838N175N461N544N240M427L070J293o20k415m014
54752A98280n329o099o153n768n406n138m663l915l238k818k339j501n49NQ6J22
54736A45577M40Q07P04o5j036j464r95J15J432K709L674L961L621L404L943M857
54720A71684N299N213N243N376M655K604K06j228j614j979l054m592n851o239
54706A75723n637m496l605l444l725l750l155k152j224o81m92m38m71p85j370
54691A40298j715j364o46l06n11p88q83r69r87n85N8K10k92p17o34n62q52q96
54673A27859k06N22M06k01l65j16k31p31q03k02L27K08k59n20l91M9N82P91M03
$$ plain form
54780 129143 130448 131637 132652 133616 134745 136256 138355 141153 144489 147911 150972 153562 155966 158637
54766 158637 161905 165830 170281 175119 180294 185755 191299 196539 200966 204036 205329 204709 202294 198280
54752 198280 192951 186852 180699 174931 169525 164387 159724 155809 152571 149753 147414 145913 145364 145369 145455 145577
54736 145577 146017 146824 147528 147463 146427 144963 143968 144083 145515 148224 151898 155859 159480 162884 166827 171684
54720 171684 176983 182196 187439 192815 197470 200074 200280 199052 197438 195459 192405 187813 181962 175723
54706 175723 170086 165590 161985 158541 154816 151066 147911 145759 144535 143854 143362 142924 142453 141668 140298
54691 140298 138583 137219 136573 136267 135756 134968 134085 133116 132129 131544 131602 131812 131520 130803 130169 129607 128755 127859
54673 127859 127653 128175 128581 128380 128015 127899 127668 126937 126134 125932 126259 126467 126208 125688 125297 125346 125928 126719 127122
54654A27122k16m76l85l50k70L62J376J846J324M87J54L31N64O65O68M72L5l96
54636A33313n86o37p52q44o55j92K27K70m7l31k02K22L54q7o08n30Q6N50M73J62
54616A30186R8M05Q68J115Q52K64L2N72J340J384N54l29n41j93J70K17o3n57j132
54597A35242j728k311k571j934l40J278J780J103J93j93n2L72R28J347J326R71
54581A35411O42L54j33o77q91r15j237j670j379j93R30J128O58K70K53N23J002
54564A34076J440J433J063R71J341J410N45o96j225p63O2N87O10K58j20j65P6
54547A40903K04J65L89R70J286R35M54M74P20N42O4m0L40O35M78L0m69q90j024
54528A46166p69m62n01p72q83q05p15m54K18R60J116O62K30J67K08J14K5Rj16
$$ plain form
54654 127122 126906 126430 126045 125695 125425 125787 127163 129009 130333 130820 130974 131305 131869 132534 133202 133674 133709 133313
54636 133313 132727 132090 131338 130494 129839 129647 129874 130144 130097 129766 129564 129786 130140 130053 129445 128915 129001 129551 130024 130186
54616 130186 130284 130689 131557 132672 133524 133788 133820 134392 135732 137116 137670 137341 136800 136607 136777 136994 136931 136374 135242
54597 135242 133514 131203 128632 126698 126358 127636 129416 130519 130712 130519 130467 130839 131767 133114 134440 135411
54581 135411 136053 136407 136274 135597 134706 133791 132554 130884 129505 129312 130242 131370 132028 132298 132551 133074 134076
54564 134076 135516 136949 138012 138983 140324 141734 142279 141583 140358 139595 139657 140244 140854 141112 140992 140827 140903
54547 140903 141107 141272 141661 142631 143917 144852 145306 145780 146500 147042 147106 147066 147406 148041 148519 148549 148080 147190 146166
54528 146166 145397 144935 144434 143662 142779 141974 141259 140805 141023 141983 143099 143761 143991 144158 144366 144480 144505 144514 144398
54509A44398l24k86N6K50p3p25j266j447j201o00N4L76L77L93N31N06K06k9P2
54490A41268K45Q7l76p52p69m46P9O24R92J083R39O36K49o8j61l8J78M70Q93J318
54470A46451J507J444J333J232J023P71P08P86O66L25K21N87R34O92L4l86k47
54453A58081J92N32M98l3q35j294j030n06m42p60o51R8O07P0j078j723j420o40
54435A49666R5O50Q97N84j83p42n46K18Q72R45M80j34m23j36M77Q19N58l0m73
54416A53594o69p71p21l08L67Q29P91M82L25M33N77N11K57P5J68M41O05N23M17
54397A57926N66R25J134Q98K75l42n27k77j08m56r76q99j82K62j53q10p73q5N70
54378A56968J006J482J752J260J98n25n33k44J74J079K279K758K108J246J109
$$ plain form
54509 144398 144074 143788 143844 144094 144021 143296 142030 140583 139382 138782 138836 139212 139589 139982 140513 141019 141225 141196 141268
54490 141268 141513 141600 141224 140472 139703 139257 139336 139960 140952 142035 142974 143610 143859 143791 143630 143592 143770 144240 145133 146451
54470 146451 147958 149402 150735 151967 152990 153761 154469 155255 155921 156246 156467 157054 157988 158680 158714 158328 158081
54453 158081 158273 158805 159303 159270 158435 157141 156111 155605 155163 154403 153752 153850 154457 154527 153449 151726 150306 149666
54435 149666 149761 150411 151308 151892 151709 150967 150421 150639 151511 152456 152936 152802 152379 152243 152720 153539 154097 154067 153594
54416 153594 152925 152154 151433 151125 151492 152321 153112 153594 153919 154352 154929 155440 155697 155772 155940 156381 156986 157509 157926
54397 157926 158492 159417 160551 161449 161724 161382 160855 160578 160470 160014 159038 158139 157957 158219 158066 157256 156483 156398 156968
54378 156968 157974 159456 161208 162468 162666 162141 161608 161364 161538 162617 164896 167654 169762 171008 172117
54363A72117J376J298J031J229J871K365K484K341J751N48p62j440j498j490j564
54348A81657j462j311j497j838j779j377j265j567j683j357j021r09o27k6L51
54333A64289J45j67n7K10O0m67r07j085j120r53m44K01N93O23M14j2o08j002q06
54314A58907k32P9j25m28l77n9R2j32n19p01m47J71Q28J156J038O93M35L37K07
54295A60923r7m65o98q18r65j148j255j303j353j153l02J002J818J481M72j93
54279A55946j31L14Q82J551J984J643P17K21P81J741J946J051k79j167j165m14
54263A65621M23O46K82J01N28Q91L14q33j199k43R44J029J10n43j52P63J290J219
54245A71191R66P22K66m84j141j291j035p93p39o66l77L4L51M95N04L55k9o18
$$ plain form
54363 172117 173493 174791 175822 177051 178922 181287 183771 186112 187863 188411 187649 186209 184711 183221 181657
54348 181657 180195 178884 177387 175549 173770 172393 171128 169561 167878 166521 165500 164591 163964 163938 164289
54333 164289 164434 164267 164210 164420 164480 164013 163106 162021 160901 159948 159504 159705 160298 160921 161335 161323 160715 159713 158907
54314 158907 158675 158754 158629 158201 157824 157765 157857 157725 157206 156505 156058 156229 157057 158213 159251 159944 160379 160716 160923
54295 160923 160826 160361 159663 158845 157880 156732 155477 154174 152821 151668 151366 152368 154186 155667 156139 155946
54279 155946 155815 156129 157011 158562 160546 162189 162906 163127 163908 165649 167595 168646 168367 167200 166035 165621
54263 165621 166044 166690 166972 167073 167601 168492 168806 167973 166774 166531 167475 168504 168614 168071 167919 168682 169972 171191
54245 171191 172157 172879 173145 172661 171520 170229 169194 168401 167662 166996 166619 166653 167004 167499 168003 168358 168329 167711
54227A67711j108j076m07M21O99K13n31r05p79m39j20J06K08K41L90O93Q37N69
54209A66723J14j65l35o72r75p16P6O55N22N9o7K54N95N78J73l76o71m72J2L14
54189A65626K96K06J33j05l64n7R13J638J194l4p23j67J016J740J558Q80M64P38
54171A74952J371J476N03j035k049k073j659j492j555j356p74k31j23l61o01o76
54155A64317o44m69RO77R84M61o33j489j601j188p35m27j63J50N14Q66J077J046
54137A62752R12Q87Q69N40k9k81N0M78L89j32n35n61l59n7L03N49N28M26N51Q38
54117A68118R69Q79P90Q53J044J299J409R68n6q92o96L36J184J306J098R99R47
54100A80555Q70J036J473J675J362J044J294J900K221K075J706J136J34j227k448
$$ plain form
54227 167711 166603 165527 165120 165541 166240 166453 165922 165017 164238 163799 163679 163785 163993 164234 164624 165317 166154 166723
54209 166723 166837 166672 166337 165665 164690 163974 164050 164705 165227 165286 165219 165473 166068 166646 166819 166443 165772 165300 165312 165626
54189 165626 165922 166128 166261 166156 165792 165735 166648 168286 169480 169446 168723 168556 169572 171312 172870 173750 174214 174952
54171 174952 176323 177799 178302 177267 175218 173145 171486 169994 168439 167083 166309 166078 165955 165594 164993 164317
54155 164317 163673 163204 163213 163890 164874 165335 164702 163213 161612 160424 159689 159262 159099 159249 159763 160629 161706 162752
54137 162752 163664 164551 165420 165960 165931 165650 165700 166178 166567 166435 165900 165339 164980 164923 165226 165775 166303 166729 167280 168118
54117 168118 169087 169966 170756 171609 172653 173952 175361 176329 176273 175381 174685 175021 176205 177511 178609 179608 180555
54100 180555 181425 182461 183934 185609 186971 188015 189309 191209 193430 195505 197211 198347 198481 197254 194806
54085A94806l020k727j687m25L44L44N5R6M71P89R79J258J589J759J884K288K791
54068B01594K817K309J945K111K236J580L23o16p27l89k82n83r24r18n89k44%
54051B09643L27Q38J267J368J399J819K590L240L638M195N163O215O934P297P402
54036B63335P148O592O237O492P095P503P621P647P421O536N068L661K745K096
54022C47197J326M58j53k95j12o0o18j845l225m133m464m573m748n049n572o381
54006C07753p101p086o223n280n086n593n966n524m377l246k721k718k728k568
53992B41536k599k966l055k266j125q44j686k550k407j483o41k73k73m96o47k26
53976B17999O86J029m8j829k699k045p42K00O59Q89Q95P20P41J216J867K328K695
$$ plain form
54085 194806 191786 189059 187372 186947 187291 187635 187690 187786 188257 189046 190025 191283 192872 194631 196515 198803 201594
54068 201594 204411 206720 208665 210776 213012 214592 214915 214299 213572 213183 212901 212318 211394 210476 209887 209643 209643
54051 209643 209970 210808 212075 213443 214842 216661 219251 222491 226129 230324 235487 241702 248636 255933 263335
54036 263335 270483 277075 283312 289804 296899 304402 312023 319670 327091 333627 338695 342356 345101 347197
54022 347197 348523 348981 348828 348533 348421 348361 347743 345898 342673 338540 334076 329503 324755 319706 314134 307753
54006 307753 300652 293566 287343 282063 276977 271384 265418 259894 255517 252271 249550 246832 244104 241536
53992 241536 238937 235971 232916 230650 229525 228681 226995 224445 222038 220555 219914 219641 219368 218872 218225 217999
53976 217999 218685 219714 219666 217837 215138 213093 212351 212551 213210 214099 214994 215714 216455 217671 219538 221866 224561
53959B24561L248L855M062L734L291L263L837M785N734O384O520N866M209J837
53945B85186l37j438j390p58R6J306K835M100M567M456M419M636M675M258L772
53930C20383L759M155M404M302M290M730N238N234M940N250O514Q003Q847R013
53916C99062Q979Q954Q921R120R772J0417J0208Q840O824M797L054J669N32p41
53902D90408k392l951m637m400l983l832l603l102l014m160o314q390r600j0096
53888D18934j0462j0923j1133j0631r528q579q372q550q234p219o171n620n268
53875C08244m704m141m038m271m279l839l312l139l409l880m226m297m194m016
53861B52499l578k694j694j253j550k051k257k226k153j983j737j672j737j399
$$ plain form
53959 224561 227809 231664 235726 239460 242751 246014 249851 254636 260370 266754 273274 279140 283349 285186
53945 285186 284849 283411 282021 281263 281359 282665 285500 289600 294167 298623 303042 307678 312353 316611 320383
53930 320383 324142 328297 332701 337003 341293 346023 351261 356495 361435 366685 373199 381202 390049 399062
53916 399062 408041 416995 425916 435036 444808 455225 465433 474273 481097 485894 488948 490617 491149 490408
53902 490408 488016 484065 479428 475028 471045 467213 463610 460508 457494 453334 447020 438630 429030 418934
53888 418934 408472 397549 386416 375785 366257 357678 349306 340756 332522 325303 319132 313512 308244
53875 308244 303540 299399 295361 291090 286811 282972 279660 276521 273112 269232 265006 260709 256515 252499
53861 252499 248921 246227 244533 243280 241730 239679 237422 235196 233043 231060 229323 227651 225914 224515
53847B24515n23J22j48q55r97m83j02k28m10k68r3k40n81p52o38l29P1M38P09
53828B19208J035J598K156K173J510O60J85J30K37N03J197K295L189L176K318
53813B41570J557J776K764L471L229K464K078K539L662M905N672N718N537N903
53799B92845O851P499P212O388N699N114M245L228K510K133J873J784J954K001
53785C51336J512P56K07l76j498k869l719m067m678n688o375o467o549o909o947
53770B97669o245n329m806m520m112l747l621l432k948k536k539k642k444k212
53756B46536k336k527k291j851j814k152k260j880j346r30o09l93l73m37m03m12
53740B24522p03j072r90l09O11J351J659J325L94n21o73m5O32Q66R24J188J444
$$ plain form
53847 224515 223992 224114 223966 223111 222114 221631 221529 221301 220891 220623 220530 220290 219709 218957 218319 217990 218061 218499 219208
53828 219208 220243 221841 223997 226170 227680 228340 228525 228655 228892 229395 230592 232887 236076 239252 241570
53813 241570 243127 244903 247667 251138 254367 256831 258909 261448 265110 270015 275687 281405 286942 292845
53799 292845 299696 307195 314407 320795 326494 331608 335853 339081 341591 343724 345597 347381 349335 351336
53785 351336 352848 353604 353811 353435 351937 349068 345349 341282 336604 330916 324541 318074 311525 304616 297669
53770 297669 291424 286095 281289 276769 272657 268910 265289 261857 258909 256373 253834 251192 248748 246536
53756 246536 244200 241673 239382 237531 235717 233565 231305 229425 228079 227149 226540 226147 225774 225337 224934 224522
53740 224522 223819 222747 221757 221448 222059 223410 225069 226394 226788 226267 225594 225549 226181 227047 227971 229159 230603
53723B30603J215N59J43M97J401K059J895J051J89j86j10R0K17L39O15J129J797
53706B43503K388K711K806K777K608K310K178K430K749K671K446K791L617L907
53692B81892L270K686K991L409K677J078N2J8n2p04j086m96J93l07j843l030k994
53675B87754k103j116l99J3J40J57L34O53P25L20k12l28n4kn02r94o67L71J115
53656B85205R60M09J79J61j08l57J09J126J688J362R28J152J690J815J604J683
53640B99606K092K236J853J385J250J238Q95K00l36j78P34J901K660K700K203
53625C20439J585J218J345J927K554K748K553K536L032L744M238M489M565M184
53611C61157L090J756J126J677L012M396N247N193M177K698J614J401J716J787
$$ plain form
53723 230603 231818 232377 232520 233017 234418 236477 238372 239423 239612 239426 239316 239406 239623 239962 240577 241706 243503
53706 243503 245891 248602 251408 254185 256793 259103 261281 263711 266460 269131 271577 274368 277985 281892
53692 281892 285162 287848 290839 294248 296925 298003 298055 298073 298021 297317 296231 295735 295928 295621 293778 290748 287754
53675 287754 285651 284535 284136 284149 284289 284446 284780 285433 286158 286478 286266 285938 285884 285882 285380 284386 283719 284090 285205
53656 285205 286165 286574 286753 286914 286806 286449 286558 287684 289372 290734 291662 292814 294504 296319 297923 299606
53640 299606 301698 303934 305787 307172 308422 309660 310555 310755 310419 310241 310975 312876 315536 318236 320439
53625 320439 322024 323242 324587 326514 329068 331816 334369 336905 339937 343681 347919 352408 356973 361157
53611 361157 364247 366003 367129 368806 371818 376214 381461 386654 390831 393529 395143 396544 398260 400047
53597D00047J159Lj070j554j474j324j439j633j609j473j504j570j322r16r16
53582C83405j460j983k078k003k068k001j434o96n46j227k206k795k769k327j795
53567C56017j423j267j221j138q95l60M73J237J485J289J217J492J630J237O98
53552C60471O05Q60R44P50N10J86l17n57L7J184K057K550L335M443M882M142L172
53535C89254L167M089N103N814O325O539O415O562P658R331J0464J0604J0332
53522D81657J0256J0391J0698J1434J2669J3959J4829J5209J5301J5356J5707
53511F27466J6553J7613J8426J9058K0022K1353K2351K2485K2015K1445K0768
53500H49555J9746J8503J7468J6897J6741J6759J6601J6082J5479J5214J5106
$$ plain form
53597 400047 401206 401209 400139 398585 397111 395787 394348 392715 391106 389633 388129 386559 385237 384321 383405
53582 383405 381945 379962 377884 375881 373813 371812 370378 369682 369136 367909 365703 362908 360139 357812 356017
53567 356017 354594 353327 352106 350968 350073 349713 350186 351423 352908 354197 355414 356906 358536 359773 360471
53552 360471 361076 361936 362880 363630 364140 364326 364009 363452 363489 364673 366730 369280 372615 377058 381940 386082 389254
53535 389254 392421 396510 401613 407427 413752 420291 426706 433268 440926 450257 460721 471325 481657
53522 481657 491913 502304 513002 524436 537105 551064 565893 581102 596403 611759 627466
53511 627466 644019 661632 680058 699116 719138 740491 762842 785327 807342 828787 849555
53500 849555 869301 887804 905272 922169 938910 955669 972270 988352 1003831 1019045 1034151
53489A034151J4553J3655J3398J4239J5228J5247J4583J4311J4549J4414J3597
53478A191925J2823J2491J1949J0532Q559O691M957L080J227k92j711l501n603
53465A253127p514r051j0356j1300j1579j1457j1648j2217j2346j1688j1329j2612
53453A120030j5328j7814j8798j8445j7575j6600j5592j4744j4235j3913j3508
53442I43478j2914j1948j0215p725n311l854l196k469j365m03R3N24J253K049
53428H87997K742L810N721P954R414R730R649J0119J1387J3017J4452J5425J6096
53415A017513J6885J8083J9581K1031K2202K3107K3914K4831K5956K7146K8198
53404A268447K9210L0524L2176L3735L4918L6103L7844M0002M1821M2756M2994
$$ plain form
53489 1034151 1048704 1062359 1075757 1089996 1105224 1120471 1135054 1149365 1163914 1178328 1191925
53478 1191925 1204748 1217239 1229188 1239720 1248279 1254970 1259927 1263007 1264234 1263942 1262231 1258730 1253127
53465 1253127 1245613 1236562 1226206 1214906 1203327 1191870 1180222 1168005 1155659 1143971 1132642 1120030
53453 1120030 1104702 1086888 1068090 1049645 1032070 1015470 999878 985134 970899 956986 943478
53442 943478 930564 918616 908401 900676 895365 891511 888315 885846 884481 884078 884171 884695 885948 887997
53428 887997 890739 894549 900270 908224 917638 927368 937017 947136 958523 971540 985992 1001417 1017513
53415 1017513 1034398 1052481 1072062 1093093 1115295 1138402 1162316 1187147 1213103 1240249 1268447
53404 1268447 1297657 1328181 1360357 1394092 1429010 1465113 1502957 1542959 1584780 1627536 1670530
53393A670530M3186M3908M5268M6682M7254M6618M5365M4292M3407M2090M0072
53382B158672L7723L5353L2834L0056K7274K4685K2015J8897J5374J1724P938
53371B422545L738r63n908j0812j5666k0572k5496l0216l4533l8297m1282m3173
53359B159365m3953m4132m4315m4551m4370m3528m2218m0509l8162l5359l3100
53348A705168l2226l2347l2431l2164l2035l2148l1741l0150k7617k4953k2826
53337A374530k1446k0532j9430j7704j5680j3892j2127r742p038n380n547o826
53325A219186q243r846j1870j3493j3587j2420j1411j1165j0847r760q505p975
53313A090064p908p237n557l597k222j486q64q3N41O63N84J102K661M863P010
$$ plain form
53393 1670530 1713716 1757624 1802892 1849574 1896828 1943446 1988811 2033103 2076510 2118600 2158672
53382 2158672 2196395 2231748 2264582 2294638 2321912 2346597 2368612 2387509 2402883 2414607 2422545
53371 2422545 2426283 2425320 2419412 2408600 2392934 2372362 2346866 2316650 2282117 2243820 2202538 2159365
53359 2159365 2115412 2071280 2026965 1982414 1938044 1894516 1852298 1811789 1773627 1738268 1705168
53348 1705168 1672942 1640595 1608164 1576000 1543965 1511817 1480076 1449926 1422309 1397356 1374530
53337 1374530 1353084 1332552 1313122 1295418 1279738 1265846 1253719 1243977 1236939 1231559 1226012 1219186
53325 1219186 1210943 1201097 1189227 1175734 1162147 1149727 1138316 1127151 1116304 1106544 1098039 1090064
53313 1090064 1082156 1074919 1069362 1065765 1063543 1062057 1061193 1061110 1061651 1062314 1062898 1064000 1066661 1071524 1078534
53298A078534Q893J0805J2870J4803J6284J7301J8059J8757J9511K0255K0650
53287A256722K0396J9620J8726J7813J6545J4747J2715J0786Q896O848M741K718
53275A411273N39k142n109p659r510j1157j3127j5244j6937j8092j9193k0586
53263A273056k2028k3012k3323k3190k3075k3363k4069k4757k4895k4417k3748
53252A013179k3206k2603k1694k0691k0034j9729j9352j8699j8088j7864j7910
53241G93309j7828j7404j6701j5797j4618j3104j1417r918q904q327p884p339
53229F44068o716o111n561n220n374n990o587o841p195q301j0049j1617j2520
53216E45986j3032j3511j3815j3564j2619j1091r317p956p590q025q387q185p775
$$ plain form
53298 1078534 1087427 1098232 1111102 1125905 1142189 1159490 1177549 1196306 1215817 1236072 1256722
53287 1256722 1277118 1296738 1315464 1333277 1349822 1364569 1377284 1388070 1396966 1403814 1408555 1411273
53275 1411273 1411812 1409670 1404561 1396902 1387392 1376235 1363108 1347864 1330927 1312835 1293642 1273056
53263 1273056 1251028 1228016 1204693 1181503 1158428 1135065 1110996 1086239 1061344 1036927 1013179
53252 1013179 989973 967370 945676 924985 904951 885222 865870 847171 829083 811219 793309
53241 793309 775481 758077 741376 725579 710961 697857 686440 676522 667618 659291 651407 644068
53229 644068 637352 631241 625680 620460 615086 609096 602509 595668 588473 580172 570123 558506 545986
53216 545986 532954 519443 505628 492064 479445 468354 459037 451081 443491 435466 427079 418894 411119
53203D11119p603p528p274p000o992p229p698q571r573r774q684p118o177n824
53189C04074n319m663m506m805m641l632k499k024k224k802l496l716k809j183
53175B55755l27j081k517l215k952k406j782q07K85Q22P38O60Q66R21N45J23N
53158B45633j03n70j158j383j249j108r68n02K00M43k23j217j495q03K0J19l41
53141B35295n34j13M71P70R62J460K162K446J798L66j080j691j204j37P44J182
53125B42897J431J641J650J415J190J073Q17M48N11J258J987J812Q79J07r0j50
53109B58876l77m59k49k85j013j910k040j292n46o08j338j962j932j343o49j78
53093B42695jm2j66j57J46N20M32l23j183j397r72n99o95r13p90m29k65m25o21
$$ plain form
53203 411119 403516 395988 388714 381714 374722 367493 359795 351224 341651 331877 323193 316075 309898 304074
53189 304074 298755 294092 289586 284781 280140 276508 274009 271985 269761 266959 263463 259747 256938 255755
53175 255755 255428 254347 251830 248615 245663 243257 241475 240668 240953 241775 242513 243173 244039 244960 245505 245628 245633
53158 245633 245530 244960 243802 242419 241170 240062 239094 238592 238792 239235 239012 237795 236300 235497 235517 235636 235295
53141 235295 234761 234648 235119 235889 236851 238311 240473 242919 244717 245083 244003 242312 241108 240971 241715 242897
53125 242897 244328 245969 247619 249034 250224 251297 252114 252562 253073 254331 256318 258130 259009 259116 259026 258876
53109 258876 258499 258040 257791 257506 256493 254583 252543 251251 250705 250097 248759 246797 244865 243522 242873 242695
53093 242695 242694 242652 242486 242329 242475 242995 243427 243104 241921 240524 239552 238953 238258 237345 236555 236126 235861 235436 234815
53074B34815n27j8P70J423J491R34J80l94p79r99q26j91M07L67k69r06j088p66
53056B33624l2Q53J330R57P8m32j59N16J092J410J376P96j75r19j040p85n21k32
53038B37737R2O4n51j230j259o47N4O04J072J197N84m36r52o13M4O42J445K438
53020B40285K755J844N68K87J012J440P72l03o58r2P35J230J286R78K73q37k076
53003B49499k806k430j069K70N72q7o26k75O42J365J688J902K017J662P49k48
52987B52825q06q65o45k38L77J093J671J983K098K166K273K430K639K915L208
52972B73124L255K654J266m30j602j809j326o25J80J120J812J658O70l51p17o34
52956B78245p84j405k112k492k462k132j667j316j204j108p62l99n10r75r99k13
$$ plain form
53074 234815 234288 234270 235040 236463 237954 238888 239068 238674 237895 236896 236070 235879 236286 236653 236384 235478 234390 233624
53056 233624 233592 234445 235775 236732 236810 236378 236219 236735 237827 239237 240613 241409 241234 240315 239275 238490 237969 237737
53038 237737 237829 237893 237342 236112 234853 234206 234260 234864 235936 237133 237717 237281 236329 235716 235760 236402 237847 240285
53020 240285 243040 244884 245452 245739 246751 248191 248963 248660 248002 247910 248645 249875 251161 252139 252412 251575 249499
53003 249499 246693 244263 243194 243464 244036 243949 243323 243048 243690 245055 246743 248645 250662 252324 253073 252825
52987 252825 252019 251154 250509 250271 250648 251741 253412 255395 257493 259659 261932 264362 267001 269916 273124
52972 273124 276379 279033 280299 279869 278267 276458 275132 274507 274687 275807 277619 279277 279947 279596 278879 278245
52956 278245 277461 276056 273944 271452 268990 266858 265191 263875 262671 261563 260801 260402 259892 258917 257918 257705
52940B57705O85Q53M23J24J26J6k69l20r5j17n11o61j97K69Np45j195j160r77
52921B53959o77l3O50O80J41m7N03R75O08q0q0N72R10M85j52m39n01o33p26o27
52901B55488n57p70j061r75l81M15R70R74M40j81l71j39l0k93m13J29J025J496
52883B55766J264O15k20j109j541r27M61J501J534J073Q96J047J177J353J830
52868B64720K330K317J854J513J459J254P26L48M89Q08Q06N02J29n41j892l574
52852B73248m536m208l167k389k116j850j287p59o82j049j587k153k618k648k040
52837B40159j126n23m22m89m91n79q62j044p73r5N49P14K32n70r22l24P10J046
52819B35190L44m74n38j80j73l74J8J050J805J682J047N16K39K02N01R91J122
$$ plain form
52940 257705 258390 259243 259666 259790 259916 259932 259663 259343 259248 259131 258620 257959 257762 258031 258036 257291 256096 254936 253959
52921 253959 253282 253249 253899 254579 254720 254673 255176 256151 256759 256679 256599 257171 258081 258566 258414 257975 257474 256841 256115 255488
52901 255488 254931 254161 253100 252125 251744 252159 253129 254103 254543 254362 253991 253852 253822 253529 253116 253245 254270 255766
52883 255766 257030 257645 257425 256316 254775 253848 254309 255810 257344 258417 259313 260360 261537 262890 264720
52868 264720 267050 269367 271221 272734 274193 275447 276173 276521 277010 277818 278624 279126 279255 278714 276822 273248
52852 273248 268712 264504 261337 258948 256832 254982 253695 252936 252254 251205 249618 247465 244847 242199 240159
52837 240159 239033 238510 238088 237599 237108 236529 235667 234623 233850 233755 234304 235018 235250 234680 233758 233434 234144 235190
52819 235190 235534 235060 234522 234342 234169 233795 233813 234863 236668 238350 239397 239913 240152 240354 240855 241846 242968
52802B42968N61l27r68j188j155j041j019j233j543j565j241r60r36q29l43J93
52786B29374K74m2k00J53Q84J550J666J030M8n52n25l34l37k90j8L4m88j082j045
52767B30100n28k08j70MK43O7l68k75M88J038P45R1j74p7p7k32k52J0N51J373
52747B32349K237K596K170J400R50R95J303J676J985K091K076K235K498K257J254
52732B60072J75k07j29l91j001j158n31K00L02j21n29o93p32p60q36j033j297
52715B51331j431j394j368j417j337r30k76M04Q80Q53J38q76j338q05K18Q97R83
52698B44532Q31P61P58P13N53K46j22l01k27k69p62j348j232j83J057J588J238
52681B47833M69k69q00j040r66p49o56p55q82q88p35l76J80O53O14j0o66p06r0
$$ plain form
52802 242968 243529 243202 242234 241046 239891 238850 237831 236598 235055 233490 232249 231289 230353 229524 229181 229374
52786 229374 229648 229606 229406 229559 230443 231993 233659 234689 234737 234185 233660 233326 232989 232699 232681 232715 232227 231145 230100
52767 230100 229572 229364 229194 229198 229441 229508 229140 228865 229353 230391 231136 231227 231053 230976 230899 230667 230415 230425 230976 232349
52747 232349 234586 237182 239352 240752 241702 242697 244000 245676 247661 249752 251828 254063 256561 258818 260072
52732 260072 260247 260040 259911 259520 258519 257361 256830 257030 257332 257211 256682 255989 255257 254497 253661 252628 251331
52715 251331 249900 248506 247138 245721 244384 243454 243178 243582 244462 245315 245453 244577 243239 242434 242652 243549 244532
52698 244532 245363 246124 246882 247595 248148 248394 248272 247971 247744 247475 246713 245365 244133 243950 245007 246595 247833
52681 247833 248302 248033 247233 246193 245227 244478 243822 243067 242185 241297 240562 240186 240366 241019 241633 241623 240957 240251 240161
52662B40161N81P53M57J44J80O66J551K701L760M216L787K764J760J128O98J85
52646B65492l65p15r43j390k066k454k190j621j310j119l84R85K058J933Q37k08
52630B56540n70m94m58n18l86J00P73J271J302Q88L35p3k74k81m9K72J75p20j974
52611B55859k587k039p74M22J198J590J629J356R79O75L53j02m48l12K54P73Q78
52594B59704N61m3p50j209j065m63l2j29l38m3P04J262J293J106J060J046Q47
52577B63511O81Q72J138P61m08j623k142k036j745j285m96K57L59o4j66L98R34
52560B58946P23k2o39r13j000q83n41l46n88q29m81J59J76n51j060o71R7L91J76
52541B52144J2J04J71L5j68k19N2P54J671K187J857R92K95k6l67r01j138n46N92
$$ plain form
52662 240161 240742 241495 241952 242096 242276 242942 244493 247194 250954 255170 258957 261721 263481 264609 265307 265492
52646 265492 265127 264412 263469 262079 260013 257559 255369 253748 252438 251319 250935 251920 253978 255911 256748 256540
52630 256540 255970 255476 255018 254500 254114 254214 254987 256258 257560 258448 258783 258710 258436 258155 258106 258378 258553 257833 255859
52611 255859 253272 251233 250459 250881 252079 253669 255298 256654 257633 258308 258661 258559 258111 257799 258053 258826 259704
52594 259704 260265 260222 259472 258263 257198 256735 256703 256574 256236 256193 256897 258159 259452 260558 261618 262664 263511
52577 263511 264192 265064 266202 266963 266555 264932 262790 260754 259009 257724 257228 257485 257844 257780 257614 258012 258946
52560 258946 259669 259647 259008 258095 257095 256212 255671 255325 254737 253908 253427 253586 253762 253211 252151 251480 251577 251968 252144
52541 252144 252156 252260 252431 252466 252298 252079 252131 252885 254556 256743 258600 259592 259887 259861 259494 258593 257455 256909 257501
52522B57501J322J059K54j19L38J113J562J750K166K826L181K937K465K191K070
52507B82616J971K111K572K713J693m44k683m056m367l974l355k920k791k605
52493B66481j880o72M09R05R03O05j9q82j485j352o50n3rl30m78j30N24R87J012
52474B63886R21J151J585J672J295J057J433K009K078J680J536J970K499K569
52460B87341K281K061J946J557O37o49j895k747l060k959k741k567k358k055j848
52445B72944j878j802j108J01R72Q57L2p31j087j203j160p91j92J63k8n51j038
52428B63500j338j344q45Q3Q85J096R77J145J719K198K154J657J066P19Q51J419
52412B75942J977K078J926K258L448M971O003O321O384O666P103P166O358M609
$$ plain form
52522 257501 258823 259882 260136 260017 260355 261468 263030 264780 266946 269772 272953 275890 278355 280546 282616
52507 282616 284587 286698 289270 291983 293676 293232 290549 286493 282126 278152 274797 271877 269086 266481
52493 266481 264601 263929 264338 265243 266146 266751 266732 265850 264365 263013 262363 262310 262301 261971 261493 261363 261887 262874 263886
52474 263886 264807 265958 267543 269215 270510 271567 273000 275009 277087 278767 280303 282273 284772 287341
52460 287341 289622 291683 293629 295186 295823 295174 293279 290532 287472 284513 281772 279205 276847 274792 272944
52445 272944 271066 269264 268156 268257 269229 270086 270118 269387 268300 267097 265937 265146 264954 265117 265089 264538 263500
52428 263500 262162 260818 259973 260056 260941 262037 263014 264159 265878 268076 270230 271887 272953 273672 274523 275942
52412 275942 277919 279997 281923 284181 287629 292600 298603 304924 311308 317974 325077 332243 338601 343210
52398C43210K221n18l462o193p828p711o254m608l453k605j880j649k072k338
52384B94860j459L35J740K026J922K495L635M239L698K688K302K818L618M077
52370C28994M144M091M111M207M210L778K708J349L92J3l44j032j548j252m10
52355C53411K14M76Q52J427J719J567J368J322J206J156J787L095M068L991L460
52340C81119L492M173M929N589O361P124P579P887Q441R199J0013J1289J3437
52327D80632J5839J7334J7824J8424J9826K1444K2478K2940K3129K2900K2146
52316G04916K1395K1233K1426K1295K0731K0221K0052K0009J9896J9751J9438
52305I30363J8572J7068J5471J4444J4009J3579J2747J1704J0743R514P246L764
$$ plain form
52398 343210 345431 344913 341451 335258 327430 319719 313465 308857 305404 302799 300919 299270 297198 294860
52384 294860 293401 293736 295476 297502 299424 301919 305554 309793 313491 316179 318481 321299 324917 328994
52370 328994 333138 337229 341340 345547 349757 353535 356243 357592 357984 357997 357653 356621 355073 353821 353411
52355 353411 353625 354101 354953 356380 358099 359666 361034 362356 363562 364718 366505 369600 373668 377659 381119
52340 381119 384611 388784 393713 399302 405663 412787 420366 428253 436694 445893 455906 467195 480632
52327 480632 496471 513805 531629 550053 569879 591323 613801 636741 659870 682770 704916
52316 704916 726311 747544 768970 790265 810996 831217 851269 871278 891174 910925 930363
52305 930363 948935 966003 981474 995918 1009927 1023506 1036253 1047957 1058700 1068214 1075460 1079224
52293A079224j29l507o221q602j0610j1803j2087j1879j1485j0844r978r190q618
52280I64271p922o608m546k070J42J444J907K620M660P723J0442J2127J3397J4774
52266A012361J5655J5408J4688J4690J5459J6003J5885J5693J5862J5956J5414
52255A183074J4284J2843J1084R031P096N599M171K077q69m126p080r638j2088
52242A215458j4506j6533j7821j8606j9608k1182k2762k3403k2786k1522k0482
52231I96247k0050j9963j9608j8533j6898j5421j4674j4372j3638j1962r685p513
52219H13930n898m896m315l760k834j518k70L85L42j8j35L22J135J644J459J044
52203G96617J229K062K649K341J658J585K283L022L270L275L540M223N170O102
$$ plain form
52293 1079224 1079095 1075588 1069367 1060765 1050155 1038352 1026265 1014386 1002901 992057 982079 972889 964271
52280 964271 956349 949741 945195 943125 943267 944711 946618 949238 953898 961621 972063 984190 997587 1012361
52266 1012361 1028016 1043424 1058112 1072802 1088261 1104264 1120149 1135842 1151704 1167660 1183074
52255 1183074 1197358 1210201 1221285 1230316 1237412 1243011 1247182 1249259 1248390 1244264 1237184 1227546 1215458
52242 1215458 1200952 1184419 1166598 1147992 1128384 1107202 1084440 1061037 1038251 1016729 996247
52231 996247 976197 956234 936626 918093 901195 885774 871100 856728 843090 831128 821443 813930
52219 813930 808032 803136 798821 795061 792227 790709 790439 790824 791166 791148 791013 791335 792470 794114 795573 796617
52203 796617 797846 799908 802557 804898 806556 808141 810424 813446 816716 819991 823531 827754 832924 839026
52189H39026O595O190M901L347K061Q70p39k718m357n186n555o144p086p884q046
52174H15275p546o660n662m735l944l188k298j353o69l46L2R66K409L805M754
52159G90840N362N858O138N825M706K997J318L54L83J025J606J883K169K708L223
52144H36395L386L426L840M610N186N299N334N725O346O832P262Q150R831J2125
52130I23747J4635J7084J9422K1700K3921K5936K7583K8978L0519L2330L3859
52119A199714L4378L3831L2846L1866L0636K8750K6334K3857K1497J9032J6317
52108A499058J3521J0864Q386O045L909K098O06p49k228l937n755p484r139j0946
52094A504249j3021j5191j7229j9081k0834k2489k3962k5094k5593k5158k3863
$$ plain form
52189 839026 845621 851811 856712 860059 862120 862990 862251 859533 855176 849990 844435 838291 831205 823321 815275
52174 815275 807729 801069 795407 790672 786728 783540 781242 779889 779220 778874 778906 779872 782281 786086 790840
52159 790840 796202 802060 808198 814023 818729 821726 823044 823398 823781 824806 826412 828295 830464 833172 836395
52144 836395 839781 843207 847047 851657 856843 862142 867476 873201 879547 886379 893641 901791 911622 923747
52130 923747 938382 955466 974888 996588 1020509 1046445 1074028 1103006 1133525 1165855 1199714
52119 1199714 1234092 1267923 1300769 1332635 1363271 1392021 1418355 1442212 1463709 1482741 1499058
52108 1499058 1512579 1523443 1531829 1537874 1541783 1543881 1544487 1543738 1541510 1537573 1531818 1524334 1515195 1504249
52094 1504249 1491228 1476037 1458808 1439727 1418893 1396404 1372442 1347348 1321755 1296597 1272734
52083A272734k2137k0151j7512j3938r970o517l849j544O53K587M248N993P938
52070A198535R819J1652J3926J6684J8974J9810J9336J8530J8003J7621J7175
52059A380065J6736J6328J5660J4457J2831J1193R870Q693P022M306P77k727n747
52046A489464q662j1952j5475j8882k2178k5275k7401k7779k6808k5778k5396
52035A253878k5287k4943k4369k3641k2627k1461k0562j9860j8638j6673j4882
52024A020935j4266j4685j5238j5449j5386j4963j3947j2603j1647j1348j1185
52013H70218j0516r319q178p770q325r385j0139j0219j0036j0166j0622j1037
52001G54506j1314j1576j1666j1218j0251r170q149o999n681m458l532k960l003
$$ plain form
52083 1272734 1250597 1230446 1212934 1198996 1189026 1182509 1178660 1177116 1177769 1180356 1184604 1190597 1198535
52070 1198535 1208354 1220006 1233932 1250616 1269590 1289400 1308736 1327266 1345269 1362890 1380065
52059 1380065 1396801 1413129 1428789 1443246 1456077 1467270 1477140 1485833 1492855 1497161 1497938 1495211 1489464
52046 1489464 1480802 1468850 1453375 1434493 1412315 1387040 1359639 1331860 1305052 1279274 1253878
52035 1253878 1228591 1203648 1179279 1155638 1133011 1111550 1090988 1071128 1052490 1035817 1020935
52024 1020935 1006669 991984 976746 961297 945911 930948 917001 904398 892751 881403 870218
52013 870218 859702 850383 842205 834435 826110 816725 806586 796367 786331 776165 765543 754506
52001 754506 743192 731616 719950 708732 698481 689311 681162 674163 668482 664024 660492 657532 654529
51988F54529l941n415o548p067p685r054j0768j1932j2331j2413j2402j2035j1150
51975E31788j0048r130q468p759o525m563k352q09k50R7J199L062M891O178O887
51960E04198O799N579L624K043J303O31q01k661m042m745n200n389m689k849m41
51945D93360J812L689N285O694Q112R799J1628J3001J3571J3804J4426J5402J5909
51932F26492J5347J4065J2860J1908J0448P573L110k354q158j3931j9273k3450
51920F34637k5833k6467k5894k4430k2070j9142j6497j4661j3150j1072q317n699
51908D21405l869k578j162N92K385L905N064N763N838N268M228K812R72j208l383
51893D46032n265o880q259r138r238q679p792o660n187l599k329j426m98O12J621
$$ plain form
51988 654529 650588 645173 638625 631558 623873 614819 604051 592119 579788 567375 554973 542938 531788
51975 531788 521740 512610 504142 496383 489858 485295 482943 482134 481884 481981 483180 486242 491133 497311 504198
51960 504198 510997 516576 520200 522243 523546 524177 523376 520715 516673 511928 506728 501339 496650 493801 493360
51945 493360 495172 498861 504146 510840 518952 528751 540379 553380 566951 580755 595181 610583 626492
51932 626492 641839 655904 668764 680672 691120 698693 701803 699449 691291 677360 658087 634637
51920 634637 608804 582337 556443 532013 509943 490801 474304 459643 446493 435421 427104 421405
51908 421405 417536 414958 413796 414388 416773 420678 425742 431505 437343 442611 446839 449651 450623 449415 446032
51893 446032 440767 433887 425628 416490 407252 398573 390781 384121 378934 375335 373006 371580 371082 371694 373315
51878C73315K469L531M887N908O122N957N977N858M918L370K136J476P76k13r10
51863D25577r49q16r63j039n57K31Q33J300J908K441K487K161J883J676J302Q61
51847D38336N18j66j848m290o351p272p343p160o831o252n606n086m492l505k261
51832C70391j277q69q40p35k44N78J338J491O62j020k849l879l627k542j559j099
51816C53920q28m39j89l81p17p31m75k27K16J165K136K152J072j41n97l00L57
51799C55993J146J736J624Q85L41N26R60R41M75j71j240k912m327m213k487m37
51783C48840Q56J509K075K491K281J421N77N41J532K973L916L923L550L662M382
51768C84529N088N443N887O829P812P975P067N567L916K072r6k360m302n723o734
$$ plain form
51878 373315 375784 379315 384202 390110 396232 402189 408166 414024 418942 422312 424448 425924 426700 426487 425577
51863 425577 424628 423812 422849 421810 421253 421484 422317 423617 425525 427966 430453 432614 434497 436173 437475 438336
51847 438336 438854 438688 436840 432550 426199 418927 411584 404424 397593 391341 385735 380649 376157 372652 370391
51832 370391 369114 368245 367405 366670 366426 367004 368342 369833 370495 369475 366626 362747 359120 356578 355019 353920
51816 353920 353092 352653 352464 352083 351366 350635 350160 349933 350149 351314 353450 355602 356674 356533 355936 355636 355993
51799 355993 357139 358875 360499 361384 361725 362251 363211 364152 364627 364456 363216 360304 355977 351764 349277 348840
51783 348840 349696 351205 353280 355771 358052 359473 360050 360591 362123 365096 369012 372935 376485 380147 384529
51768 384529 389617 395060 400947 407776 415588 423563 430630 436197 440113 442185 442089 439729 435427 429704 422970
51753D22970p450p826p797p459p001o475n738m663l364k187j488j380j604j644
51739C56894j102j11Q26J505K355L839N610O687O445N108L246J274l70j023l65
51724C90818J008K051K307K029J381J12j779l642m782n101m807l875k348q21N3
51709C72604L71O26O48k32j780k615j845k33R50J599K362L084K753J110p80j832
51693C76790k048j923j459l71J094K163K255J380n4j494k455k792k736k578k363
51678C63409j975j348n35K84P67O67K38P8M66J150J865K747L918N094N902O333
51662C89060O551O430N671M228K286J5k328m209n095m840l594j502J110L440M624
51647D01847M442L304J588n79k912m784n707n715n198m555m040l654l052j902
$$ plain form
51753 422970 415520 407694 399897 392438 385437 378962 373224 368561 365197 363010 361522 360142 358538 356894
51739 356894 355792 355681 356507 358012 360367 364206 369816 376503 382948 388056 391302 392576 392206 391183 390818
51724 390818 391826 393877 396184 398213 399594 399706 397927 394285 389503 384402 379595 375720 373372 372551 372604
51709 372604 372975 373601 374249 374017 372237 369622 367777 367544 368494 370093 372455 375539 378292 379402 378622 376790
51693 376790 374742 372819 371360 370989 372083 374246 376501 377881 377827 376333 373878 371086 368350 365772 363409
51678 363409 361434 360086 359551 359835 360602 361269 361507 361585 362051 363201 365066 367813 371731 376825 382727 389060
51662 389060 395611 402041 407712 411940 414226 414241 411913 407704 402609 397769 394175 392673 393783 397223 401847
51647 401847 406289 409593 411181 410602 407690 402906 397199 391484 386286 381731 377691 374037 370985 369083
51633C69083l97P99J330J604K186K895K879J595m75k259l071l024k594k104j761
51618C66686j864k577l561m221m330m105l696l016k150j466j101p69l36j02j94
51603C33198r2P05J883K747L176L626M321N063N764O572P426P941P864P173N720
51588D03087L231j14l475n912o949o594n165l193j271K07J225K091L271N001O959
51573C92399Q625J0030J1624J3202J3783J3162J2819J4132J6235J7010J5920J4500
51561E53441J4019J4233J4833J6527J9615K2714K4059K3335K1215J7792J2675
51550G54458O242l68o400j1760j6310j9764k2226k4055k5168k5109k3811k1702
51538E64027j9128j6184j3099j0189p531n210l661l154l098k628j830j634k459
$$ plain form
51633 369083 368686 369485 370815 372419 374605 377500 380379 381974 381499 379240 376169 373145 370551 368447 366686
51618 366686 364822 362245 358684 354463 350133 346028 342332 339316 337166 335700 334599 333830 333494 333392 333198
51603 333198 333106 333811 335694 338441 341617 345243 349564 354627 360391 366963 374389 382330 390194 397367 403087
51588 403087 406318 406204 402729 396817 389868 383274 378109 374916 373645 373852 375077 377168 380439 385440 392399
51573 392399 401024 411054 422678 435880 449663 462825 475644 489776 506011 523021 538941 553441
51561 553441 567460 581693 596526 613053 632668 655382 679441 702776 723991 741783 754458
51550 754458 760700 760332 753932 742172 725862 706098 683872 659817 634649 609540 585729 564027
51538 564027 544899 528715 515616 505427 497896 492686 489025 485871 482773 480145 478315 476681 474222
51525D74222l718m788n692o647p558q236q571q300p255o002n533o009o453o062
51511C83398n175m498m031l383k596k016j680j450j442j686j635p60N24J251J218
51496C56039J149J481J649J024nl78K56J030Q75j94j067q30J88R08P77J08o90
51479C62320j550k252k276j696j529k459l669l843l041k494k642k563j620n62
51465C30124l12o13p55r00j658k712l009k262j324r32q26m08M30J450K472L290
51449C22055L601L432L380L968N040O010O613P087P792Q846R960J0420R460O981
51435D14645L815J083n88j085m43J008K328K362P18j870m269n763o220n850n080
51420C94791m425m206m271m175l612k710j870j343j003n71l2L55M38L40J56k05
$$ plain form
51525 474222 470504 465716 460024 453377 445819 437583 429012 420712 413457 407455 401922 395913 389460 383398
51511 383398 378223 373725 369694 366311 363715 361699 360019 358569 357127 355441 353806 353046 353570 354821 356039
51496 356039 357188 358669 360318 361342 361337 360959 361215 362245 363120 362926 361859 361029 361217 362125 362902 363010 362320
51479 362320 360770 358518 356242 354546 353017 350558 346889 343046 340005 337511 334869 332306 330686 330124
51465 330124 329812 329199 328444 327544 325886 323174 320165 317903 316579 315647 314821 314413 314843 316293 318765 322055
51449 322055 325656 329088 332468 336436 341476 347486 354099 361186 368978 377824 387784 398204 407664 414645
51435 414645 418460 419543 418955 417870 417427 418435 420763 423125 423843 421973 417704 411941 405721 399871 394791
51420 394791 390366 386160 381889 377714 374102 371392 369522 368179 367176 366605 366573 366928 367366 367706 367862 367657
51404C67657o70q30n05j49k87o70n92M7O36R24J489K805M427N554O142O845Q037
51387D00860R413J0554J1552J2969J5350J8780K2667K6047K8338K9891L1602L3925
51375F51948L6392L8061L8174L6289L1975K4888J5362M792m995j2982j9438k5050
51363H15416k9862l3384l5490l6600l6928l6186l4277l1734k9071k6119k2542
51352D63223j8752j5665j3596j1965j0190q406p068o247n598m877m136l541l146
51339C50036k893k669k333j782j097n20k64k46j13L77J035J401J240P67M37N08
51323C43884Q13Q66L17o18j232j103o00m13o80r58r94r80r94p34r5M47L89j82
51305C37133q70j544k182k479k097j261o28n63q65j142j141q07k98M0J4j39L0
$$ plain form
51404 367657 366987 366157 365652 365503 365216 364546 363954 364001 364637 365561 367050 369855 374282 379836 385978 392823 400860
51387 400860 410273 420827 432379 445348 460698 479478 502145 528192 556530 586421 618023 651948
51375 651948 688340 726401 764575 800864 832839 857727 873089 877881 872886 859904 840466 815416
51363 815416 785554 752170 716680 680080 643152 606966 572689 540955 511884 485765 463223
51352 463223 444471 428806 415210 403245 393055 384649 377581 371334 365736 360859 356723 353182 350036
51339 350036 347143 344474 342141 340359 339262 338742 338478 338232 338119 338496 339531 340932 342172 342939 343376 343884
51323 343884 344697 345563 345880 345262 344030 342927 342327 341914 341234 340276 339282 338302 337308 336574 336479 336926 337315 337133
51305 337133 336263 334719 332537 330058 327961 326700 326072 325509 324644 323502 322361 321554 321256 321296 321310 321171 321201
51288C21201O58J480K080K192J920J829K493L678M387M079L465L594M399M828
51274C62283M178K691R43n90j352r19L25J348J540J272J216J625K408L274L566
51259C83808K576M46j711k971l494l886m187m013l380k762k508k641l133l850
51245C48294m363m174l279k187j421j124j111j059p51k74R7L08N75R37J059Q15
51229C32342O52R93J507J502R18M08M02O57P85P82P97P38M27r9n72o68j58Q09
51211C42222J560J421O37L41J238K597L096K529K025K422L113K965J935J097J117
51196C70315J453J262N18j72n23q11j262j686j761j447r53n29l09k31j80k57p75
51179C62652j761k664k895k483j842j081JJ250K068K123J731J416J446J834K335
$$ plain form
51288 321201 321859 323339 325419 327611 329531 331360 333853 337531 341918 345997 349462 353056 357455 362283
51274 362283 366461 369152 370095 369505 368153 367234 367559 368907 370447 371719 372935 374560 376968 380242 383808
51259 383808 386384 386830 385119 382148 378654 374768 370581 366568 363188 360426 357918 355277 352144 348294
51245 348294 343931 339757 336478 334291 332870 331746 330635 329576 328825 328551 328648 328956 329531 330468 331527 332342
51229 332342 332994 333987 335494 336996 337914 338322 338724 339381 340166 340948 341745 342483 342910 342811 342239 341571 341413 342222
51211 342222 343782 345203 345840 346181 347419 350016 353112 355641 357666 360088 363201 366166 368101 369198 370315
51196 370315 371768 373030 373548 373376 372853 372042 370780 369094 367333 365886 364933 364404 364095 363864 363684 363427 362652
51179 362652 360891 358227 355332 352849 351007 349926 349927 351177 353245 355368 357099 358515 359961 361795 364130
51164C64130K367J534L61j02L97R74R20O14O49P95N06o3m61q91j802k738k650
51147C64540j394n8M16J27m24j061j651j798j318n77M1O02J216J575J356P99M81
51130C62872O76J193J631J623J140P81J310K622L577L296K205J289Q09M06J89
51115C85619O63J635K145J809J395J627K056J830J060O55R66J310J016L38N9N59
51099D04742J539K410K740K378J502N74P0J36M47N13J80j98k04J18L46L18K94
51082D17905L98K64l74j065j158p22l41p3O02J710K429K271J868K007K491K662
51066D30874K638L118M204N322O285P523R173J0838J2470J4515J6725J7587J5776
51053E57048J1732P261L983K677L546O090Q777R784Q472N844L384J760N40j196
$$ plain form
51164 364130 366497 368031 368392 368290 368687 369661 370581 371195 371844 372639 373145 373082 372621 371730 369928 367190 364540
51147 364540 363146 363088 363504 363631 363207 362146 360495 358697 357379 356802 356843 357445 358661 360236 361592 362391 362872
51130 362872 363548 364741 366372 367995 369135 369916 371226 373848 377425 380721 382926 384215 385024 385430 385619
51115 385619 386282 387917 390062 391871 393266 394893 396949 398779 399839 400494 401460 402770 403786 404124 404183 404742
51099 404742 406281 408691 411431 413809 415311 415885 415955 416091 416538 417051 417231 417033 416829 416947 417293 417611 417905
51082 417905 418303 418567 418193 417128 415970 415248 414907 414834 415436 417146 419575 421846 423714 425721 428212 430874
51066 430874 433512 436630 440834 446156 452441 459964 469137 479975 492445 506960 523685 541272 557048
51053 557048 568780 576041 580024 582701 586247 592337 601114 610898 619370 625214 628598 630358 630898 629702
51039F29702m019p482j0168j0728r025o178l562k044j983l382n810q467j0521
51026E46333j1371j0750q946o856n298m207k891j112O19J994L376N005O349O868
51012E19113O997P589Q619R254R159Q902Q864Q571P597O405N692N258M366K992
50998F19378J914J438Q57m53j952k540j896o67N48J801L304M881O185P300Q747
50983F48845J0932J3686J6422J8759K0872K3114K5256K6437K6097K4800K3859
50972H79079K4241K6109K9252L3500L8634M4307N0236N6244O2013O7103P1310
50961A382028P4844P8051Q1121Q3945Q5866Q5699Q2482P6465O8914O0721N1715
50950B211851M1515L0538J9639R175r90j0713j9397k6542l2176l6623m0134m2728
$$ plain form
51039 629702 625683 618201 608033 597305 588280 582102 578540 576496 574513 571131 565321 556854 546333
51026 546333 534962 524212 515266 508410 503112 498905 496014 494902 495521 497515 500891 505896 512245 519113
51012 519113 526110 533699 542318 551572 560731 569633 578497 587068 594665 601070 606762 612020 616386 619378
50998 619378 621292 622730 623587 623134 621182 618642 616746 616079 616627 618428 621732 626613 632798 640098 648845
50983 648845 659777 673463 689885 708644 729516 752630 777886 804323 830420 855220 879079
50972 879079 903320 929429 958681 992181 1030815 1075122 1125358 1181602 1243615 1310718 1382028
50961 1382028 1456872 1534923 1616044 1699989 1785855 1871554 1954036 2030501 2099415 2160136 2211851
50950 2211851 2253366 2283904 2303543 2312718 2311728 2301015 2281618 2255076 2222900 2186277 2146143 2103415
50938B103415m4269m4770m4640m4405m4015m2814m0451l7555l5207l3997l3801
50927A657491l4193l4776l5383l6275l7821l9763m1229m1823m2078m2350m1923
50916A229877m0027l7198l4641l2543l0121k7208k4588k2642k0830j8844j7178
50905I24057j6024j4628j2479j0387r484r627r640q909p843o918o016m879l621
50892H03602k485j433k99P92J409J332R68J049J839K844L455L632L736L954M327
50877H28722N069O350P911R379J0819J2361J3524J3826J3951J5258J7892K0498
50865I75560K2243K4007K6855L0387L3583L6599M0457M5414N0803N6397O2802
50854A405107P0401P8834Q7778R7425J07949J19070J30368J41544J52158J61680
$$ plain form
50938 2103415 2059146 2014376 1969736 1925331 1881316 1838502 1798051 1760496 1725289 1691292 1657491
50927 1657491 1623298 1588522 1553139 1516864 1479043 1439280 1398051 1356228 1314150 1271800 1229877
50916 1229877 1189850 1152652 1118011 1085468 1055347 1028139 1003551 980909 960079 941235 924057
50905 924057 908033 893405 880926 870539 861055 851428 841788 832879 825036 818118 812102 807223 803602
50892 803602 801117 799684 799385 800177 801586 802918 803886 804935 806774 809618 813073 816705 820441 824395 828722
50877 828722 833791 840141 848052 857431 868250 880611 894135 907961 921912 937170 955062 975560
50865 975560 997803 1021810 1048665 1079052 1112635 1149234 1189691 1235105 1285908 1342305 1405107
50854 1405107 1475508 1554342 1642120 1739545 1847494 1966564 2096932 2238476 2390634 2552314
50844B552314J70009J77505J84191J89305J91878J91342J87184J78373J63759
50835D185860J43113J17553Q8840N8416K7222l721l2914n8856q0878r9188j13943
50824D231504j24557j30086j30104j25106j16308j05301r3671q2601p2943o5696
50814C185131o1951o1933o4465o7910p1565p5755q0750q6142r1265r5635r8901
50803B328859j00734j00948r9449r6044r0682q3869p6486o9126o1909n4876m8123
50792A446613m1498l4712k7937k1872j6937j2699q532m457j051J395L119M303
50780A285735M631L760K013K85q92j873l219m759n835o440p419r326j1608j3439
50766A231614j4815j6195j7462j8045j7927j7728j7733j7618j7163j6599j5941
$$ plain form
50844 2552314 2722323 2899828 3084019 3273324 3465202 3656544 3843728 4022101 4185860
50835 4185860 4328973 4446526 4535366 4593782 4621004 4617283 4584369 4525513 4444635 4345447 4231504
50824 4231504 4106947 3976861 3846757 3721651 3605343 3500042 3406371 3323770 3250827 3185131
50814 3185131 3123180 3061247 2996782 2928872 2857307 2781552 2700802 2614660 2523395 2427760 2328859
50803 2328859 2228125 2127177 2027728 1931684 1841002 1757133 1680647 1611521 1549612 1494736 1446613
50792 1446613 1405115 1370403 1342466 1320594 1303657 1290958 1282426 1277969 1276918 1278313 1281432 1285735
50780 1285735 1290366 1294126 1296139 1296424 1295532 1293659 1290440 1285681 1279846 1273406 1265987 1256661 1245053 1231614
50766 1231614 1216799 1200604 1183142 1165097 1147170 1129442 1111709 1094091 1076928 1060329 1044388
50755A044388j4694j2549r857p064m155j066J840M197O293Q817J2080J5800J9570
50742A063600K3261K7039L1208L5966M1197M6582N1970N7413O2891O8254P3490
50731A582871P8713Q3771Q8262R2057R5359R8081R9647R9678R8416R6152R2611
50720B605618Q7260P9812O9920N6842M0101K0286j216k3076m4009o2295p6207
50709B753036q5074q9390q9807q6647q0502p2624o4263n5930m7664l9723l2766
50698B008646k7500k4389k3513k4580k7207l1283l6788m3139m9058n3314n5450
50687A612425n5636n4166n1377m7814m3937l9688l4665k8786k2541j6488j0771
50676A206556n246J12N179R956J4651J9358K3803K7504L0190L1924L2784L2607
$$ plain form
50755 1044388 1029694 1017145 1007288 1000224 996069 995003 996843 1001040 1007333 1016150 1028230 1044030 1063600
50742 1063600 1086861 1113900 1145108 1181074 1222271 1268853 1320823 1378236 1441127 1509381 1582871
50731 1582871 1661584 1745355 1833617 1925674 2021033 2119114 2218761 2318439 2416855 2513007 2605618
50720 2605618 2692878 2772690 2842610 2899452 2939553 2959839 2958623 2935547 2891538 2829243 2753036
50709 2753036 2667962 2578572 2488765 2402118 2321616 2248992 2184729 2128799 2081135 2041412 2008646
50698 2008646 1981146 1956757 1933244 1908664 1881457 1850174 1813386 1770247 1721189 1667875 1612425
50687 1612425 1556789 1502623 1451246 1403432 1359495 1319807 1285142 1256356 1233815 1217327 1206556
50676 1206556 1201310 1201422 1206601 1216557 1231208 1250566 1274369 1301873 1332063 1363987 1396771 1429378
50664A429378L1246K9041K6760K4928K3330K1414J9119J7117J6111J6091J6414
50653A670949J6507J6289J5900J5310J4434J3542J3217J3817J5184J7023J9294
50642A841466K2079K5126K7950L0359L2627L4942L6979L8182L8331L7579L6031
50631B201651L3640L0488K6934K3360K0074J7540J6192J5465J3150O537n178j9731
50619B380122l3227m2680m7099m6763m2354l5053k6671j8958j2608p277k512J533
50607B066453M307N456N006L085m43n979j3678k2882l2199m0454m7448n3522n8481
50594A809221o1476o2147o1312o0053n8394n5539n1394m7131m3974m1828l9548
50583A226425l6361l2565k8968k5990k3443k0893j8076j5059j2083r281o611m009
$$ plain form
50664 1429378 1460624 1489665 1516425 1541353 1564683 1586097 1605216 1622333 1638444 1654535 1670949
50653 1670949 1687456 1703745 1719645 1734955 1749389 1762931 1776148 1789965 1805149 1822172 1841466
50642 1841466 1863545 1888671 1916621 1946980 1979607 2014549 2051528 2089710 2128041 2165620 2201651
50631 2201651 2235291 2265779 2292713 2316073 2336147 2353687 2369879 2385344 2398494 2405031 2399853 2380122
50619 2380122 2346895 2304215 2257116 2210353 2167999 2132946 2106275 2087317 2074709 2067432 2064920 2066453
50607 2066453 2070760 2076216 2081222 2084307 2083864 2077885 2064207 2041325 2009126 1968672 1921224 1867702 1809221
50594 1809221 1747745 1685598 1624286 1564233 1505839 1450300 1398906 1351775 1307801 1265973 1226425
50583 1226425 1190064 1157499 1128531 1102541 1079098 1058205 1040129 1025070 1012987 1003706 997095 993086
50571I93086j458J131L849O488Q531R743J0604J1790J3434J5208J6978J8943K1106
50558A129433K3194K5109K6968K8566K9446K9723L0292L1753L3597L4890L5358
50547A458329L5351L5104L4649L4140L3720L3299L3065L3936L6718M0988M5630
50536A854929N0344N5702O1556O6574O9911P2413P5350P8673Q1477Q3827Q6952
50525B637708R1585R6921J01548J04730J06449J06674J05119J01520R5784Q7809
50515C635847P7371O4312M8825L1577J3527m523k2175l9304n5756p1185q5045
50504C593471r6500j04543j08424j08024j03656r5621q4234p0278n4985l9315
50494B727891k3468p495P798K0872L0496L6386L8610L6581K9113J5693k506k3077
$$ plain form
50571 993086 991628 992759 996608 1003096 1011627 1021370 1031974 1043764 1057198 1072406 1089384 1108327 1129433
50558 1129433 1152627 1177736 1204704 1233270 1262716 1292439 1322731 1354484 1388081 1422971 1458329
50547 1458329 1493680 1528784 1563433 1597573 1631293 1664592 1697657 1731593 1768311 1809299 1854929
50536 1854929 1905273 1960975 2022531 2089105 2159016 2231429 2306779 2385452 2466929 2550756 2637708
50525 2637708 2729293 2826214 2927762 3032492 3138941 3245615 3350734 3452254 3548038 3635847
50515 3635847 3713218 3777530 3826355 3857932 3871459 3866936 3844761 3805457 3749701 3678516 3593471
50504 3593471 3496971 3392428 3284004 3175980 3072324 2976703 2892469 2822191 2767206 2727891
50494 2727891 2704423 2696928 2704726 2725598 2756094 2792480 2831090 2867671 2896784 2912477 2909971 2886894
50482B886894m3795o3338q0794r4964j04709j09893j11527j10754j07990j03282
50472A955848r7146r0475q3629p6273o8434o1231n5894n2267m8988m5182m1315
50461A235014l8064l5019l1171k6377k1528j7296j3402r389n556k590n21J390
50449A035491L714O250Q512J0508J2635J5022J7356J9494K1737K4109K5637K4931
50437A225396K1574J6584J1399O873L391J332Q88J619K733L768M736N715O763
50424A312771Q125J0061J2386J4506J6087J7364J8812K0752K3374K6837L1113
50413A512188L5868M0616M4956M8696N1858N4562N6788N8293N8832N8292N6569
50402B077518N3488M9207M4318L9264L3700K6900J8671R496j79j0322k1032l2218
$$ plain form
50482 2886894 2843099 2779761 2698967 2604003 2499294 2389401 2277874 2167120 2059130 1955848
50472 1955848 1858702 1768227 1684598 1608325 1539891 1478660 1422766 1370499 1321511 1276329 1235014
50461 1235014 1196950 1161931 1130760 1104383 1082855 1065559 1052157 1042768 1037212 1034622 1034101 1035491
50449 1035491 1039205 1045455 1053967 1064475 1077110 1092132 1109488 1128982 1150719 1174828 1200465 1225396
50437 1225396 1246970 1263554 1274953 1281826 1285217 1286549 1287437 1289056 1291789 1295557 1300293 1306008 1312771
50424 1312771 1320896 1330957 1343343 1357849 1373936 1391300 1410112 1430864 1454238 1481075 1512188
50413 1512188 1548056 1588672 1633628 1682324 1734182 1788744 1845532 1903825 1962657 2020949 2077518
50402 2077518 2131006 2180213 2224531 2263795 2297495 2324395 2343066 2352562 2352383 2342061 2321029 2288811
50390B288811m3560n4367o3411o9354p1575p0456o6906o1857n5973m9375m1714
50379A640263l2958k3955j5725q389j410N199J0608J4116J5511J4538J0888M959
50367A633645k225j0147j8945k8084l5938m1317m4635m6758m7557m6481m3984
50356A267574m1288l8910l6374l3268k9783k6265k2900j9823j7088j4676j2923
50345I74276j2693j4463j7456k0170k1593k1466j9775j6789j3399j0629q698p097
50333G90048n538m195l099j998q13K68J216K179L105L810M369M967N399N288M732
50318H09738M258M155M311M551M622M095K912J887J907K743L438L766M411N703
50304H62497P066P942Q413Q701Q851R221J0426J2467J4599J6436J8443K1012K3786
$$ plain form
50390 2288811 2245251 2190884 2127473 2058119 1986544 1916088 1849182 1787325 1731352 1681977 1640263
50379 1640263 1607305 1583350 1567625 1559236 1557826 1563025 1573633 1587749 1603260 1617798 1628686 1633645
50367 1633645 1631420 1621273 1602328 1574244 1538306 1496989 1452354 1405596 1358039 1311558 1267574
50356 1267574 1226286 1187376 1151002 1117734 1087951 1061686 1038786 1018963 1001875 987199 974276
50345 974276 961583 947120 929664 909494 887901 866435 846660 829871 816472 805843 797145 790048
50333 790048 784510 780315 777216 775218 774405 774673 775889 778068 781173 784983 789352 794319 799718 805006 809738
50318 809738 813996 818151 822462 827013 831635 835730 838642 840529 842436 845179 848617 852383 856794 862497
50304 862497 869563 877505 885918 894619 903470 912691 923117 935584 950183 966619 985062 1006074 1029860
50291A029860K6454K9421L3208L7713M2442M6439M7189M0720K4608J231k2785
50280A336500m0801m9865n0997m7111m1001l4510k8601k3752k0007j6807j3249
50269I69799r059n073k420j229n44O68K688N150P506R438J1138J3272J6332K0010
50255A037676K3312K5353K5937K5425K4258K2660K0701J8607J6927J6167J6146
50244A273169J5882J4361J1332P277K739k137p491j3333j9211k4203k7346k8239
50232A202800k7276k5278k2915k0414j7674j4824j2707j2649j5352k0030k4876
50221I88805k8405l0131l0176k8818k6501k3796k1059j8381j5948j4046j2614
50210G38930j1163r392p532n964m807l993l427k910k271j684j474j576j638j747
$$ plain form
50291 1029860 1056314 1085735 1118943 1156656 1199098 1245537 1292726 1333446 1358054 1359285 1336500
50280 1336500 1295699 1245834 1194837 1147726 1106725 1072215 1043614 1019862 999855 983048 969799
50269 969799 960740 955667 953247 952018 951474 952142 954830 959980 967486 976924 988062 1001334 1017666 1037676
50255 1037676 1060988 1086341 1112278 1137703 1161961 1184621 1205322 1223929 1240856 1257023 1273169
50244 1273169 1289051 1303412 1314744 1322021 1324760 1322623 1315132 1301799 1282588 1258385 1231039 1202800
50232 1202800 1175524 1150246 1127331 1106917 1089243 1074419 1061712 1049063 1033711 1013681 988805
50221 988805 960400 930269 900093 871275 844774 820978 799919 781538 765590 751544 738930
50210 738930 727767 718375 710843 704879 700072 696079 692652 689742 687471 685787 684313 682737 681099 679352
50196F79352k441l693m568m273l153k177j904k263k948l534l634l382l430m025
50182F33927m504m134l032j826q35j82j88r11j590j363m64O9j48l93J59J477K863
50165F18925L633L625L382L766N034O414P042P040P193P733Q193Q333Q608R578
50151G08499J1471J4270J7579K0403K1757K1844K2002K3313K5710K8605L1766
50140I47219L5191L8692M2031M5072M7422M8278M7207M4892M2667M1309M0604
50129A420584L9900L8760L6949L4084K9521K2653J3366K281r423k0526l0240l8378
50117A539531m5072n0248n3455n4395n3515n1710m9327m5912m1178l5762l0722
50106A028235k6615k3525k1562k0735k0497k0048j9068j7768j6342j4872j3629
$$ plain form
50196 679352 676911 673218 668650 664377 661224 659047 657143 654880 651932 648398 644764 641382 637952 633927
50182 633927 629423 625289 622257 620431 619596 619414 619226 618315 616725 615362 614898 614967 614819 614426 614585 616062 618925
50165 618925 622558 626183 629565 633331 638365 644779 651821 658861 666054 673787 681980 690313 698921 708499
50151 708499 719970 734240 751819 772222 793979 815823 837825 861138 886848 915453 947219
50140 947219 982410 1021102 1063133 1108205 1155627 1203905 1251112 1296004 1338671 1379980 1420584
50129 1420584 1460484 1499244 1536193 1570277 1599798 1622451 1635817 1638098 1628675 1608149 1577909 1539531
50117 1539531 1494459 1444211 1390756 1336361 1282846 1231136 1181809 1135897 1094719 1058957 1028235
50106 1028235 1001620 978095 956533 935798 915301 895253 876185 858417 842075 827203 813574
50095H13574j2842j2232j1249r738p902n776l415j478p41r78j058l89N24J115
50081G47415J501J798J568O14l02l16L78Q53P03L05K0k54p61j521k280k590k145
50064G44986j325j116k018l237l534k758j981k073k683k872k295j452r93j083
50050G15566j344j218l96J020K711M487O281P840Q656Q505P925P893Q826J0158
50036G86910J0982J0995J0603J0310J0415J1104J2328J3462J3759J3367J3365
50025I17600J4405J5847J6767J7306J8367K0302K2673K5006K7001K8060K7497
50014A150831K5301K1976J7708J2626P922N509N952P522P874O042K333k849r197
50001A259550j6022k2521k8299l3077l6154l6935l5833l4012l2176l0205k7851
$$ plain form
50095 813574 800732 788500 777251 767513 759611 753835 750420 748942 748201 747223 746165 745776 746300 747415
50081 747415 748916 750714 752282 752896 752594 752278 752656 753509 754212 754517 754537 754283 753522 752001 749721 747131 744986
50064 744986 743661 742545 740527 737290 733756 730998 729017 726944 724261 721389 719094 717642 716649 715566
50050 715566 714222 713004 712608 713628 716339 720826 727107 734947 743603 752108 760033 767926 776752 786910
50036 786910 797892 808887 819490 829800 840215 851319 863647 877109 890868 904235 917600
50025 917600 932005 947852 964619 981925 1000292 1020594 1043267 1068273 1095274 1123334 1150831
50014 1150831 1176132 1198108 1215816 1228442 1236364 1241873 1247825 1255347 1263221 1269263 1271596 1268747 1259550
50001 1259550 1243528 1221007 1192708 1159631 1123477 1086542 1050709 1016697 984521 954316 926465
49990I26465k5307k2924k0918j9422j8526j8109j7859j7494j6891j6103j5393
49979G17519j5057j4985j4633j3683j2553j1841j1457j0675r037o860m844l467
49967E88427k742k348j962j533j226j098j070j213j649k026j613k39J366K557
49953E73631L634N150O832P865Q019P730P193O214M949M008L623L340K773K123
49939F47084J648J167M14n18j422k379l619n200p063r068j0793j1521j0912r501
49925E78317q239p458o615n148l314j964j437j091j48J227K179K411K499K784
49911E54003K750K047J481K066L490M506M714M908N657O575P288Q052Q886R056
49897F25479Q143O918O281N983N183L819K452J097p38k922m680n803o949q399
$$ plain form
49990 926465 901158 878234 857316 837894 819368 801259 783400 765906 749015 732912 717519
49979 717519 702462 687477 672844 659161 646608 634767 623310 612635 603598 596738 591894 588427
49967 588427 585685 583337 581375 579842 578616 577518 576448 575235 573586 571560 569947 569708 571074 573631
49953 573631 577265 582415 589247 597112 605131 612861 620054 626268 631217 635225 638848 642188 644961 647084
49939 647084 648732 649899 650313 649795 648373 645994 642375 637175 630112 621044 610251 598730 587818 578317
49925 578317 570078 562620 556005 550857 547543 545579 544142 543051 542903 544130 546309 548720 551219 554003
49911 554003 556753 558800 560281 562347 565837 570343 575057 579965 585622 592197 599485 607537 616423 625479
49897 625479 633622 640540 646821 652804 657987 661806 664258 665355 664617 661695 657015 651212 644263 635864
49883F35864r392r199q207p353o995o929p116p630q021p465n716l493j802j106
49869E45440j185j478j425q21M9P66J365K296L728N215O237O836P477Q395R404
49854E92299J0211J0694J0857J0731J0348R662Q500O765M682K758J391N67j76
49841F79289j446l512n938p924r108r842j0458j0578r595p646n583l998k806j774
$$ plain form
49883 635864 626472 617273 609066 601713 594718 587789 580673 573043 565022 557557 551841 548348 546546 545440
49869 545440 544255 542777 541352 540531 540580 541346 542711 545007 548735 553950 560187 567023 574500 582895 592299
49854 592299 602510 613204 624061 634792 645140 654802 663302 670067 674749 677507 678898 679465 679289
49841 679289 677843 674331 668393 660469 651361 641519 631061 620483 610888 603242 597659 593661 590855 589081
$$ [...]
##END NTUPLES=NMR SPECTRUM
##END=
