##TITLE=AC1772_HONWASH_9683924_HdDlBBrSZe
##JCAMPDX= 6.0         $$ Bruker NMR JCAMP-DX V2.0
##DATA TYPE= NMR SPECTRUM
##DATA CLASS= NTUPLES
##ORIGIN= BRUKER
##OWNER= Administrator
$$ 1.72 TOPSPIN		Version 2.1
$$ 2016-04-16 19:58:17.595 -0700  Administrator@X
$$ Compression mode = diff/dup
##.OBSERVE FREQUENCY= 400.02188249412
##.OBSERVE NUCLEUS= ^1H
##.ACQUISITION MODE= SIMULTANEOUS (DQD)
##.ACQUISITION SCHEME= undefined
##.AVERAGES= 64
##.DIGITISER RES= 22
##SPECTROMETER/DATA SYSTEM= spect
##.PULSE SEQUENCE= noesygpps1d.comp
##.SOLVENT NAME= COFFEE_meoh
##.SHIFT REFERENCE= INTERNAL, COFFEE_meoh, 1, 14.96076
##AUDIT TRAIL= $$ (NUMBER, WHEN, WHO, WHERE, PROCESS, VERSION, WHAT)
$$ ##TITLE= Audit trail, TOPSPIN		Version 2.1
$$ ##JCAMPDX= 5.01
$$ ##ORIGIN= Bruker BioSpin GmbH
$$ ##OWNER= Administrator
$$ $$ E:\/data/COFFEE/nmr/AC1772_HONWASH_9683924_HdDlBBrSZe/12/pdata/1/auditp.txt
$$ ##AUDIT TRAIL=  $$ (NUMBER, WHEN, WHO, WHERE, PROCESS, VERSION, WHAT)
(   1,<2016-04-16 19:58:12.329 -0700>,<Administrator>,<X>,<go>,<TOPSPIN 2.1>,
      <created by zg
	started at 2016-04-16 19:46:42.689 -0700,
	POWCHK enabled, PULCHK disabled,
       configuration hash MD5:
       21 0F 79 D6 B3 7B B4 F6 88 20 88 DB 03 48 BD 9F
       data hash MD5: 64K
       39 3D 27 A8 C8 B5 DD A4 62 6F 1A EF CD 9B B5 52>)
(   2,<2016-04-16 19:58:15.533 -0700>,<Administrator>,<X>,<proc1d>,<TOPSPIN 2.1>,
      <Start of raw data processing
       efp LB = 0.3 FT_mod = 6 PKNL = 1 PHC0 = 0 PHC1 = 0 SI = 128K 
       data hash MD5: 128K
       2B F5 9E 11 B2 30 87 4E C4 35 40 5B E9 B1 4E 0F>)
(   3,<2016-04-16 19:58:16.408 -0700>,<Administrator>,<X>,<proc1d>,<TOPSPIN 2.1>,
      <pk PHC0 = 269.2639 PHC1 = 0 
       data hash MD5: 128K
       52 5B 6C 05 52 02 2E A5 C4 39 23 78 48 2F C6 8A>)
(   4,<2016-04-16 19:58:16.783 -0700>,<Administrator>,<X>,<proc1d>,<TOPSPIN 2.1>,
      <abs ABSG = 1 
       data hash MD5: 128K
       9F C6 75 61 30 CC 49 4E B9 26 C7 54 9A 45 54 93>)
(   5,<2016-04-16 19:58:16.892 -0700>,<Administrator>,<X>,<proc1d>,<TOPSPIN 2.1>,
      <abs ABSG = 2 
       data hash MD5: 128K
       18 90 C5 10 D3 98 82 A2 33 17 5F A8 09 61 E8 63>)
(   6,<2016-04-16 19:58:16.970 -0700>,<Administrator>,<X>,<proc1d>,<TOPSPIN 2.1>,
      <abs ABSG = 3 
       data hash MD5: 128K
       B2 41 76 9B 9E 60 CE 22 E8 A4 22 27 DA FA B9 16>)
(   7,<2016-04-16 19:58:17.064 -0700>,<Administrator>,<X>,<proc1d>,<TOPSPIN 2.1>,
      <abs ABSG = 4 
       data hash MD5: 128K
       3A 3E 0F 25 9B 78 FD A3 29 B4 DE F9 FF D8 A5 67>)
(   8,<2016-04-16 19:58:17.142 -0700>,<Administrator>,<X>,<proc1d>,<TOPSPIN 2.1>,
      <abs ABSG = 5 
       data hash MD5: 128K
       A0 DC EE 54 5F AA 1B 23 42 E6 F5 75 50 AB 39 6D>)
$$ ##END=
$$ 
$$ $$ hash MD5
$$ $$ FD A7 A5 97 5D 16 8E 0F 9E 2C F7 08 E2 EA 61 FA
##$RELAX= 
##$RELAX= 
##$RELAX= 
##$RELAX= 
##$RELAX= 
##$RELAX= 
##$RELAX= 
##$RELAX= 
$$ Bruker specific parameters
$$ --------------------------
##$DU= <E:\>
##$EXPNO= 12
$$ [...]
##$TP07= 0
##$TPNAME0= <>
##$TPNAME1= <>
##$TPNAME2= <>
##$TPNAME3= <>
##$TPNAME4= <>
##$TPNAME5= <>
##$TPNAME6= <>
##$TPNAME7= <>
##$TPOAL= (0..7)
0.5 0.5 0.5 0.5 0.5 0.5 0.5 0.5
##$TPOFFS= (0..7)
0 0 0 0 0 0 0 0
##$TUNHIN= 0
##$TUNHOUT= 0
##$TUNXOUT= 0
##$USERA1= <user>
##$USERA2= <user>
##$USERA3= <user>
##$USERA4= <user>
##$USERA5= <user>
##$V9= 5
##$VALIST= <valist>
##$VCLIST= <CCCCCCCCCCCCCCC>
##$VD= 0
##$VDLIST= <DDDDDDDDDDDDDDD>
##$VPLIST= <PPPPPPPPPPPPPPP>
##$VTLIST= <TTTTTTTTTTTTTTT>
##$WBST= 2048
##$WBSW= 25
##$XGAIN= (0..3)
0 0 0 0
##$XL= 0
##$YL= 0
##$YMAX_a= 6324885
##$YMIN_a= -11145813
##$ZGOPTNS= <>
##$ZL1= 120
##$ZL2= 120
##$ZL3= 120
##$ZL4= 120
##$ABSF1= 14.96076
##$ABSF2= -5.597422
##$ABSG= 5
##$ABSL= 3
##$ALPHA= 0
##$AQORDER= 0
##$ASSFAC= 0
##$ASSFACI= 0
##$ASSFACX= 0
##$ASSWID= 0
##$AUNMP= <proc_prof1d_extract.lims>
##$AXLEFT= 0
##$AXNAME= <>
##$AXNUC= <1H>
##$AXRIGHT= 0
##$AXTYPE= 0
##$AXUNIT= <>
##$AZFE= 0.1
##$AZFW= 0.1
##$BCFW= 0
##$BC_mod= 0
##$BYTORDP= 0
##$COROFFS= 0
##$CY= 15
##$DATMOD= 1
##$DC= 0
##$DFILT= <>
##$DTYPP= 0
##$F1P= 0
##$F2P= 0
##$FCOR= 0.5
##$FTSIZE= 131072
##$FT_mod= 6
##$GAMMA= 0
##$GB= 0
##$INTBC= 1
##$INTSCL= 1
##$ISEN= 128
##$LB= 0.3
##$LEV0= 0
##$LPBIN= 0
##$MAXI= 10000
##$MC2= 0
##$MEAN= 0
##$ME_mod= 0
##$MI= 0
##$NCOEF= 0
##$NC_proc= -2
##$NLEV= 6
##$NOISF1= 0
##$NOISF2= 0
##$NSP= 0
##$NTH_PI= 0
##$NZP= 0
##$OFFSET= 14.96076
##$PC= 1
##$PHC0= 269.2639
##$PHC1= 0
##$PH_mod= 1
##$PKNL= yes
##$PPARMOD= 0
##$PPDIAG= 0
##$PPIPTYP= 0
##$PPMPNUM= 2147483647
##$PPRESOL= 1
##$PSCAL= 4
##$PSIGN= 0
##$PYNMP= <proc.py>
##$REVERSE= no
##$SF= 400.020009733297
##$SI= 131072
##$SIGF1= 0
##$SIGF2= 0
##$SINO= 400
##$SIOLD= 131072
##$SPECTYP= <>
##$SREGLST= <1H.CDCl3>
##$SSB= 0
##$STSI= 131072
##$STSR= 0
##$SW_p= 8223.68421052631
##$SYMM= 0
##$S_DEV= 0
##$TDeff= 65536
##$TDoff= 0
##$TI= <>
##$TILT= no
##$TM1= 0
##$TM2= 0
##$TOPLEV= 0
##$USERP1= <user>
##$USERP2= <user>
##$USERP3= <user>
##$USERP4= <user>
##$USERP5= <user>
##$WDW= 1
##$XDIM= 131072
##$YMAX_p= 381919976
##$YMIN_p= -18851
##$CURPLOT= <Network HP LaserJet P1505>
##$CURPRIN= <$Network HP LaserJet P1505>
##$DFORMAT= <normdp>
##$LAYOUT= <+/1D_H.xwp>
##$LFORMAT= <normlp>
##$PFORMAT= <normpl>
##$SURQMSG= 1
$$ End of Bruker specific parameters
$$ ---------------------------------
##NTUPLES= NMR SPECTRUM
##VAR_NAME=  FREQUENCY,     SPECTRUM/REAL,   SPECTRUM/IMAG
##SYMBOL=    X,             R,               I
##VAR_TYPE=  INDEPENDENT,   DEPENDENT,       DEPENDENT
##VAR_FORM=  AFFN,          ASDF,            ASDF
##VAR_DIM=   131072,        131072,          131072
##UNITS=     HZ,            ARBITRARY UNITS, ARBITRARY UNITS
##FACTOR=    0.0627417313425164, 1,          1
##FIRST=     8223.62146879497, 2716,         -63467
##LAST=      0,             4096,            -63106
##MIN=       0,             -18851,          0
##MAX=       8223.62146879497, 381919976,    0
$$ Real data points
##PAGE= N=1
##DATA TABLE= (X++(R..R)), XYDATA
$$ [...]
63905A621194j24136j11260r9096q7773p7869o9352o1747n5031m9377m4255l8861
$$ 1621194 1497058 1385798 1286702 1198929 1121060 1051708 989961 934930 885553 841298 802437
63894H02437l3408k9024k6211k4273k2478k0917j9819j8750j7121j5153j3732
$$ 802437 769029 740005 713794 689521 667043 646126 626307 607557 590436 575283 561551
63883E61551j3288j3132j2038r505o352l887k547j600k63J443L040M300N274O126
$$ 561551 548263 535131 523093 513588 507236 503349 500802 499202 498939 500382 503422 507722 512996 519122
63869E19122P301R242J1476J2676J2291J1504J1630J2185J1698J0048Q635Q162
$$ 519122 526423 535665 547141 559817 572108 583612 595242 607427 619125 629173 637808 645970
63857F45970P598N785L001L50j589k948m042n251p047r531j2181j4330j5716j6390
$$ 645970 653568 659353 662354 662704 661115 658167 654125 648874 641827 632296 620115 605785 590069 573679
63843E73679j6468j6229j6076j6123j6058j5655j5146j4868j4746j4398j3640
$$ 573679 557211 540982 524906 508783 492725 477070 461924 447056 432310 417912 404272
63832D04272j2737j2150j2045j2004j1432j0300r227q629q184p532p004o936o738
$$ 404272 391535 379385 367340 355336 343904 333604 324377 315748 307564 300032 293028 286092 279354
63819B79354n520l616k428k643l429l679l245k635k177j989k116k275j907r31
$$ 279354 273834 270218 267790 265147 261718 258039 254794 252159 249982 247993 245877 243602 241695 240764
63805B40764J0L48K40J17O5l2k29o97j651k775l256k822k208k118k308k240k103
$$ 240764 240774 241122 241362 241479 241544 241512 241283 240586 238935 236160 232904 230082 227874 225756 223448 221208 219105
63788B19105k374k780k611j880j334j305j270p63q9J30k25o92p63l70M4J5l53
$$ 219105 216731 213951 211340 209460 208126 206821 205551 204788 204699 204829 204604 203912 203149 202779 202823 202838 202485
63771B02485m57o5K49j00p37p34R1Q81Q11jq55j263j187p92k45L06P71J045R93
$$ 202485 202028 201963 202212 202112 201375 200641 200732 201613 202424 202423 201568 200305 199118 198326 198081 198387 199158 200203 201196
63752B01196O33K96L74Q17J183J200J099J216J504J669J617J590J817K225K522
$$ 201196 201829 202125 202499 203316 204499 205699 206798 208014 209518 211187 212804 214394 216211 218436 220958
63737B20958K528K356K252K337K548K781K986L116L173L332L829M615N289N562
$$ 220958 223486 225842 228094 230431 232979 235760 238746 241862 245035 248367 252196 256811 262100 267662
63723B67662N629N888O422O980P346P469P307O829O098N139L760J867j45j680
$$ 267662 273291 279179 285601 292581 299927 307396 314703 321532 327630 332769 336529 338396 338251 336571
63709C36571k722l842n275o423o600n922n078m453l944l477l181l026k725k118
$$ 336571 333849 330007 324732 318309 311709 305787 300709 296256 292312 288835 285654 282628 279903 277785
63695B77785j363n64L81J452K337K767K815K636K250J784J580J696J601Q86N7
$$ 277785 276422 275858 276239 277691 280028 282795 285610 288246 290496 292280 293860 295556 297157 298043 298100
63680B98100K1P92J343R36J03o4P92K106L223L978M514M895N106N248N508N866
$$ 298100 298121 298913 300256 301192 301295 301231 302023 304129 307352 311330 315844 320739 325845 331093 336601 342467
63664C42467N904N128L578J875M58r79k889m929o243o614o752p275p985q387q309
$$ 342467 348371 353499 357077 358952 359410 358431 355542 350613 344370 337756 331004 323729 315744 307357 299048
63649B99048p685o356m581l207k739k664k276j703j419j138j26J458K506K398
$$ 299048 291363 285007 280426 277219 274480 271816 269540 267837 266418 265280 265154 266612 269118 271516
63635B71516J780J590J918K230K338K666L643N028N958N787M920M551N346O714
$$ 271516 273296 274886 276804 279034 281372 284038 287681 292709 298667 304454 309374 313925 319271 325985
63621C25985P714Q239Q753R296R610J0071J1497J3862J6081J7432J8482K0173
$$ 325985 333699 341938 350691 359987 369597 379668 391165 405027 421108 438540 457022 477195
63609D77195K2528K4758K6309K7324K8267K9326L0042K9578K7516K4283K0444
$$ 477195 499723 524481 550790 578114 606381 635707 665749 695327 722843 747126 767570
63598G67570J5867J0284M435k91l411n488o719o595n487n181o849r504j1598j3258
$$ 767570 783437 793721 798156 797865 794454 788966 782247 775652 770165 764984 758135 748631 737033 723775
63584G23775j5599j8473k0501k1184k1433k1789k1519j9980j7745j5683j3754
$$ 723775 708176 689703 669202 648018 626585 604796 583277 563297 545552 529869 516115
63573E16115j1479r023p036n698m577l245j583L69K437M194N234N622N854O359
$$ 516115 504636 495613 488577 482879 478302 475057 473474 473843 476280 480474 485708 491330 497184 503543
63559E03543P156P975Q571Q996R546J0433J1529J2607J3820J5674J8365K1414
$$ 503543 510699 518674 527245 536241 545787 556220 567749 580356 594176 609850 628215 649629
63547F49629K4181K6605K9121L1906L4463L6065L6276L4848L1278K5019J6423
$$ 649629 673810 700415 729536 761442 795905 831970 868246 903094 934372 959391 975814
63536I75814P241k53m839o949p725p786p091n682m203l606m538p031j0652j4901
$$ 975814 983055 982802 977963 971014 963289 955503 948412 942730 938527 934921 930383 923352 912700 897799
63522H97799j9518k4340k8923l2510l4484l4815l3961l2484l0768k8881k6553
$$ 897799 878281 853941 825018 792508 758024 723209 689248 656764 625996 597115 570562
63511E70562k3589k0439j8049j6788j5808j3952j1147q409o570n560m986m744
$$ 570562 546973 526534 508485 491697 475889 461937 450790 442381 435811 430251 425265 420521
63499D20521m705m366l357k095j393j496j849j842j399q19l87k17k58k07K67J069
$$ 420521 415816 411450 408093 405998 404605 403109 401260 399418 398019 397200 396813 396596 396338 396131 396398 397467
63483C97467J606J467J084J372K713M503N791O208O112O046O125N926M915L049
$$ 397467 399073 400540 401624 402996 405709 410212 416003 422211 428323 434369 440494 446420 451335 454384
63469D54384R49p42k081l602n354o687p233p550q263r020q950p952o775n886n080
$$ 454384 455333 454591 452510 448908 443554 436867 429634 422084 413821 404801 395851 387899 381124 375238 370158
63454C70158m232l629l253k586j474n44j85J47J037K117K775L300M361N694O426
$$ 370158 365926 362297 359044 356458 354984 354440 354255 354402 355439 357556 360331 363631 367992 373686 380112
63439C80112O639P468R376J1438J2829J4132J6316J9132K1429K2743K3523K3837
$$ 380112 386751 394219 403595 415033 427862 441994 458310 477442 498871 521614 545137 568974
63427E68974K2883K0155J6437J3037J0567R021Q734J0360J3812J7861K1299K4110
$$ 568974 591857 612012 628449 641486 652053 661074 669808 680168 693980 711841 733140 757250
63415G57250K7125L0713L4217L6565L6983L5185L1329K5898J9394J2071M329k748
$$ 757250 784375 815088 849305 885870 922853 958038 989367 1015265 1034659 1046730 1051059 1048311
63403A048311p760j0245j1123j1663j2301j2775j3091j3858j5749j8925k2855
$$ 1048311 1040551 1030306 1019183 1007520 995219 982444 969353 955495 939746 920821 897966
63392H97966k6530k9060l0331l0899l1013l0127k7769k4598k1934k0325j9084
$$ 897966 871436 842376 812045 781146 750133 720006 692237 667639 645705 625380 606296
63381F06296j7354j5075j2747j0647q574o176l349l63K329M441N998P146Q055
$$ 606296 588942 573867 561120 550473 541899 535723 532374 532011 534340 538781 544779 551925 559980
63368E59980R088J0591J2221J2972J2480J1995J3191J6037J8750K0019K0472K1592
$$ 559980 569068 579659 591880 604852 617332 629327 642518 658555 677305 697324 717796 739388
63356G39388K3927K6931K9918L2433L3989L4153L2857L0228K6242K0967J4961
$$ 739388 763315 790246 820164 852597 886586 920739 953596 983824 1010066 1031033 1045994
63345A045994Q932L182k194o697r645j1059j1763j2484j3289j4097j5218j7021
$$ 1045994 1054926 1058108 1055914 1049217 1039572 1028513 1016750 1004266 990977 976880 961662 944641
63333I44641j9399k1976k4576k7128k9181l0078k9615k8268k6593k4701k2428
$$ 944641 925242 903266 878690 851562 822381 792303 762688 734420 707827 683126 660698
63322F60698j9802j7062j4324j1513q676o135m292l450l889n832r006j2348j4544
$$ 660698 640896 623834 609510 597997 589321 583186 578894 575444 571555 565723 556717 544369 529825
63309E29825j5042j4362j3329j2187j0661q701o818n617n157m974m575l880l166
$$ 529825 514783 500421 487092 474905 464244 455543 448725 443108 437951 432977 428402 424522 421356
63296D21356k767k831l201l505l453l250l552m715o071o410n421m227m061m685
$$ 421356 418589 415758 412557 409052 405599 402349 398797 394082 388011 381601 376180 371953 367892 363207
63282C63207m771l792k714k510k805k574j725j105j194j585j768j690j432j044
$$ 363207 358436 354644 351930 349420 346615 344041 342316 341211 340017 338432 336664 334974 333542 332498
63268C32498q90j489k513k700j371M41J136N12j68L8P52J151J109J074J373J954
$$ 332498 331608 330119 327606 324906 323535 323976 325112 325624 325456 325494 326246 327397 328506 329580 330953 332907
63252C32907K584L002L160L399M096N016N481N321N241N891P079Q253R327J0500
$$ 332907 335491 338493 341653 345052 349148 354164 359645 364966 370207 376098 383177 391430 400757 411257
63238D11257J1638J2407J2895J3479J4262J5166J6474J8568K0970K2327K1716
$$ 411257 422895 435302 448197 461676 475938 491104 507578 526146 547116 569443 591159
63227E91159J9676J7695J6816J6960J7308J7159J6547J6190J6714J7928J8957
$$ 591159 610835 628530 645346 662306 679614 696773 713320 729510 746224 764152 783109
63216G83109J9127J8495J7536J6496J5169J3080R911N895J759j941n360r022j2992
$$ 783109 802236 820731 838267 854763 869932 883012 892923 898818 900577 898636 893276 884254 871262
63203H71262j6705j9557k1304k1924k1581k0805k0173j9569j8150j5405j1932
$$ 871262 854557 835000 813696 791772 770191 749386 729213 709644 691494 676089 664157
63192F64157q856o716n169l616j737M36K675M678O240P398Q424R681J1339J3126
$$ 664157 655301 648585 643416 639800 638063 638499 641174 645852 652092 659490 667914 677595 688934 702060
63178G02060J4475J5087J5263J5400J5432J5130J4741J4721J4879J4439J3095
$$ 702060 716535 731622 746885 762285 777717 792847 807588 822309 837188 851627 864722
63167H64722J1356R644P614M801J400k086n611r487j3737j7915k1433k3866k5137
$$ 864722 876078 885722 893336 898137 899537 897451 891840 882353 868616 850701 829268 805402 780265
63154G80265k5610k5788k5815k5488k4770k3812k2403k0098j7196j4818j3554
$$ 780265 754655 728867 703052 677564 652794 628982 606579 586481 569285 554467 540913
63143E40913j2637j1109r191p721o803n887m917m351m115l517k338j207o39l46
$$ 540913 528276 517167 507976 500255 493452 487565 482648 478297 474182 470665 468327 467120 466481 466135
63129D66135J86R89J789K420K804K880K860L265M346N575O063N512M549M059M207
$$ 466135 466321 467310 469099 471519 474323 477203 480063 483328 487674 493249 499312 504824 509373 513432 517639
63114E17639M283L608K344J154K92m42r31o82K06Q02N30k6q8J51M7l30l84m9K04
$$ 517639 521922 525530 527874 529028 529320 528878 527947 527265 527471 528273 528803 528777 528689 528840 528887 528557 528173 528124 528328
63095E28328K49L41M70L90K47L60N00J77l88m40R7M87L44J26K49M98O02P16J020
$$ 528328 528577 528918 529388 529778 530025 530385 530885 531062 530674 530234 530331 530818 531162 531288 531537 532035 532637 533353 534373
63076E34373J415J874K531L206L478L427L693M592N791P030Q423R846J0835J1466
$$ 534373 535788 537662 540193 543399 546877 550304 553997 558589 564380 571410 579833 589679 600514 611980
63062F11980J2563J4562J6848J8758K0534K2666K4968K7047K9190L1960L5198
$$ 611980 624543 639105 655953 674711 695245 717911 742879 769926 799116 831076 866274
63051H66274L8160M0483M2380M4005M5176M5729M5750M5462M5100M4805M4416
$$ 866274 904434 944917 987297 1031302 1076478 1122207 1167957 1213419 1258519 1303324 1347740
63040A347740M3619M2471M1476M1009M0981M1199M1478M1146L9188L5421L0873
$$ 1347740 1391359 1433830 1475306 1516315 1557296 1598495 1639973 1681119 1720307 1755728 1786601
63029A786601K6387K1392J4828O720k043j1077k0550l0002l8255m4732m9947n4306
$$ 1786601 1812988 1834380 1849208 1855928 1853885 1842808 1822258 1792256 1754001 1709269 1659322 1605016
63017A605016n7244n8065n7005n4851n1825m7470m1609l4989k8790k3648j9252
$$ 1605016 1547772 1489707 1432702 1377851 1326026 1278556 1236947 1201958 1173168 1149520 1130268
63006A130268j4836r947m658P93O210J1219J5278J8228K0575K2824K4747K5769
$$ 1130268 1115432 1105485 1100827 1101620 1107830 1119049 1134327 1152555 1173130 1195954 1220701 1246470
62994A246470K5891K5794K5938K6112K5990K5671K5428K5155K4349K2568J9724
$$ 1246470 1272361 1298155 1324093 1350205 1376195 1401866 1427294 1452449 1476798 1499366 1519090
62983A519090J5972J1413O036j14o766j3581k0449k7377l4058l9784m4056m7091
$$ 1519090 1535062 1546475 1552511 1552397 1545631 1532050 1511601 1484224 1450166 1410382 1366326 1319235
62971A319235m9435n1252n2217n1937n0263m7253m3259l9009l5381l2895l1403
$$ 1319235 1269800 1218548 1166331 1114394 1064131 1016878 973619 934610 899229 866334 834931
62960H34931l0260k8776k6689k4341k2284k0740j9512j8421j7464j6533j5422
$$ 834931 804671 775895 749206 724865 702581 681841 662329 643908 626444 609911 594489
62949E94489j4286j3599j3418j3161j2489j1909j1947j2169j1778j0821j0005
$$ 594489 580203 566604 553186 540025 527536 515627 503680 491511 479733 468912 458907
62938D58907r530q924q007p170o542n778m805m034l517k742j728j414k284l269
$$ 458907 449377 440453 432446 425276 418734 412956 408151 404117 400600 397858 396130 394716 392432 389163
62924C89163k977j548l87k72p10j122j621k306k665k298j666j494j793j972j790
$$ 389163 386186 384638 384251 383979 383269 382147 380526 378220 375555 373257 371591 370097 368304 366332 364542
62909C64542j530j375j176r07q56j155j493j562j469j462j441j110m94L6K17J84
$$ 364542 363012 361637 360461 359554 358698 357543 356050 354488 353019 351557 350116 349006 348512 348548 348765 348949
62893C48949K59N58Q98R50N89Q9p0K73P71R72Q04M95K09k0j07j5M8k16q63j639
$$ 348949 349208 349766 350664 351614 352203 352292 352222 352495 353266 354238 355042 355537 355746 355726 355619 355604 355652 355436 354573 352934
62873C52934k172k052j011N99J769J719P67j52o85j154j596j502p24R2L74L16
$$ 352934 350762 348710 347699 348298 350067 351786 352553 352401 351716 350562 348966 347464 346740 346832 347206 347522
62857C47522L43M62N91R70J673K130J809J051O04N51M16J38J79O69J178J449J750
$$ 347522 347865 348327 348918 349888 351561 353691 355500 356551 357155 357706 358122 358260 358439 359108 360286 361735 363485
62840C63485K140K060J099j51o16OR08J190Q39M75L76J96k84n76p1J026J883K172
$$ 363485 365625 367685 368784 368633 368017 368023 368931 370121 370960 371435 371811 372007 371723 371147 371076 372102 373985 376157
62822C76157K383K842L076K598J887J800K300K438J723Q37P40J548K606L386L893
$$ 376157 378540 381382 384458 387056 388943 390743 393043 395481 397204 398041 398781 400329 402935 406321 410214
62807D10214M309M628M715M563M304M095M124M608N594O763P680Q314R046J0067
$$ 410214 414523 419151 423866 428429 432733 436828 440952 445560 451154 457917 465597 473911 482957 493024
62793D93024J1145J2213J3702J5762J7658J8740J9722K2040K5904L0058L3656
$$ 493024 504169 516382 530084 545846 563504 582244 601966 624006 649910 679968 713624
62782G13624L7276M1585M6092N0078N3902N8322O3035O7019O9971P2343P4006
$$ 713624 750900 792485 838577 888655 942557 1000879 1063914 1130933 1200904 1273247 1347253
62771A347253P3952P1431O6582N9862N1489M1721L0996J9645P796m272j6173k7702
$$ 1347253 1421205 1492636 1559218 1619080 1670569 1712290 1743286 1762931 1770727 1766455 1750282 1722580
62759A722580l8617m8169n5499o0639o4430o7340o8951o8847o7426o5403o2969
$$ 1722580 1683963 1635794 1580295 1519656 1455226 1387886 1318935 1250088 1182662 1117259 1054290
62748A054290n9866n6024n1773m7517m3485l9683l6039l2612k9620k7134k4902
$$ 1054290 994424 938400 886627 839110 795625 755942 719903 687291 657671 630537 605635
62737F05635k2661k0445j8269j5802j2921j0392r211r218r030p667n631m043l219
$$ 605635 582974 562529 544260 528458 515537 505145 495934 486716 477686 470019 464388 460345 457126
62724D57126k521j342K41J621K263K253K302L060M378N542O199O713P562Q915
$$ 457126 454605 453263 453504 455125 457388 459641 461943 465003 469381 474923 481122 487835 495397 504312
62710E04312J0801J3207J5763J7870J9468K1270K3891K7123L0387L3575L6994
$$ 504312 515113 528320 544083 561953 581421 602691 626582 653705 684092 717667 754661
62699G54661M0746M4611M8333N1723N4583N6822N8535N9708N9984N8996N6704
$$ 754661 795407 840018 888351 940074 994657 1051479 1110014 1169722 1229706 1288702 1345406
62688A345406N3189M8278M1689L3395K3640J2779J429r511j9428k8493l7181m5325
$$ 1345406 1398595 1446873 1488562 1521957 1545597 1558376 1559805 1550294 1530866 1502373 1465192 1419867
62676A419867n2051n6686n9280o0239n9873n8532n6732n4746n2288m8977m5083
$$ 1419867 1367816 1311130 1251850 1191611 1131738 1073206 1016474 961728 909440 860463 815380
62665H15380m1391l8346l5640l2784k9770k6920k4307k1687j8958j6346j4157
$$ 815380 773989 735643 700003 667219 637449 610529 586222 564535 545577 529231 515074
62654E15074j2515j1426j0777j0214r326q108o990o296n903n610n489n591n480
$$ 515074 502559 491133 480356 470142 460816 452708 445718 439422 433519 427909 422420 416829 411349
62641D11349m578k946j370o00o07o93k12P57J487J437R08O03N42K6j160k107j844
$$ 411349 406771 403825 402455 401855 401248 400555 400343 401100 402587 404024 404932 405535 406077 406103 404943 402836 400992
62624D00992o75J56p7j017j899k206j808r31qQ32J976L565M880N143M724M769
$$ 400992 400317 400473 400396 399379 397480 395274 393466 392535 392527 393359 395335 398900 403780 408923 413647 418416
62608D18416N604O387O487O381O866Q049R493J0884J2137J3269J4524J6290J8638
$$ 418416 424020 430407 436894 443275 450141 458190 467683 478567 490704 503973 518497 534787 553425
62595E53425K1260K3996K7000L0191L3007L4940L5958L6141L5318L3395L0584
$$ 553425 574685 598681 625681 655872 688879 723819 759777 795918 831236 864631 895215
62584H95215K7011K2460J6852J0653M448j600p556j3254j8390k2846k6622k9573
$$ 895215 922226 944686 961538 972191 976639 975039 967483 954229 935839 912993 886371 856798
62572H56798l1513l2426l2450l1820l0939l0134k9184k7475k4880k2129k0021
$$ 856798 825285 792859 760409 728589 697650 667516 638332 610857 585977 563848 543827
62561E43827j8554j7182j5630j4086j2732j1514j0271q877p356n996n243n192
$$ 543827 525273 508091 492461 478375 465643 454129 443858 434981 427625 421629 416386 411194
62549D11194n374n159m282k908j459m64k88p16j067r08m41m0L10Q09J364J652
$$ 411194 405820 400661 396379 393471 392012 391548 391260 390544 389477 388569 388128 388088 388398 389207 390571 392223
62533C92223J558J299J196J475K188L196M295N435O672P955R174J0400J1799J3318
$$ 392223 393781 395080 396276 397751 399939 403135 407430 412865 419537 427492 436666 447066 458865 472183
62519D72183J4731J6003J7267J8572K0058K2182K5219K8563L1245L3116L4728
$$ 472183 486914 502917 520184 538756 558814 580996 606215 634778 666023 699139 733867
62508G33867L6106L6571L5992L5093L4011L1682K7386K1970J6635J1375N690J30
$$ 733867 769973 806544 842536 877629 911640 943322 970708 992678 1009313 1020688 1026378 1026508
62496A026508m219p313r991j2348j3482j2846j0849p959m267J6M497R291J4865
$$ 1026508 1022289 1014976 1004985 992637 979155 966309 955460 947501 943234 943250 947747 957038 971903
62483I71903K0988K6638L1237L5232L9134M2732M5562M7366M7689M5697M1061
$$ 971903 992891 1019529 1050766 1085998 1125132 1167864 1213426 1260792 1308481 1354178 1395239
62472A395239L4412K6519J7523P580k403j1534k0131k9325l9403m9150n6857o1574
$$ 1395239 1429651 1456170 1473693 1481273 1478870 1467336 1447205 1417880 1378477 1329327 1272470 1210896
62460A210896o3445o3384o2530o1485n9887n6955n2551m7448m2441l7660l2909
$$ 1210896 1147451 1084067 1021537 960052 900165 843210 790659 743211 700770 663110 630201
62449F30201k8366k4519k1538j9094j6788j4519j2380j0469q867p627o617n581
$$ 630201 601835 577316 555778 536684 519896 505377 492997 482528 473661 466034 459417 453836
62437D53836m417l336k575k109j731j326q65l31J48K72j57r22j644k225k745l035
$$ 453836 449419 446083 443508 441399 439668 438342 437477 437146 437294 437566 437409 436487 434843 432618 429873 426838
62421D26838k745j922j150r52j275j717k024k208k347k510k705k882k965k912
$$ 426838 424093 422171 421021 420069 418794 417077 415053 412845 410498 407988 405283 402401 399436 396524
62407C96524k666k118j320o57n28q27j042q64m10J13O78J246J632J686J487J301
$$ 396524 393858 391740 390420 389763 389235 388408 387366 386502 386092 386205 386883 388129 389761 391447 392934 394235
62391C94235J471K197L154L644L417L144L511M129M066L341L044L793N010N932
$$ 394235 395706 397903 401057 404701 408118 411262 414773 418902 422968 426309 429353 433146 438156 444088
62377D44088O603P371Q139Q645Q958R298R702J0258J1208J2535J3893J5217J6777
$$ 444088 450691 458062 466201 474846 483804 493102 502804 513062 524270 536805 550698 565915 582692
62364E82692J8462J9706K0558K2037K4853K8568L2590L7144M2397M7384N0901
$$ 582692 601154 620860 641418 663455 688308 716876 749466 786610 829007 876391 927292
62353I27292N3051N4813N6400N6985N5813N2632M7212L9505L0320K0930J1896
$$ 927292 980343 1035156 1091556 1148541 1204354 1256986 1304198 1343703 1374023 1394953 1406849
62342A406849L050n407j2716j8672k4033k9446l4593l8728m1518m3012m3280m2508
$$ 1406849 1409899 1404492 1391776 1373104 1349071 1319625 1285032 1246304 1204786 1161774 1118494 1075986
62330A075986m1185l9847l8643l7268l5270l2539k9606k7245k5658k4277k2616
$$ 1075986 1034801 994954 956311 919043 883773 851234 821628 794383 768725 744448 721832
62319G21832k0946j9850j9363j9029j8454j7506j6223j4897j3957j3382j2613
$$ 721832 700886 681036 661673 642644 624190 606684 590461 575564 561607 548225 535612
62308E35612j1385j0111q976p423n237l399k892l168k898j835p49J17J266K687
$$ 535612 524227 514116 505140 497717 492480 489081 486189 483021 480123 478288 477539 477656 478922 481609
62294D81609L691M182M818N760O371O429O521O901P081O914O985P415P357O358
$$ 481609 485300 489482 494300 500060 506431 512860 519381 526282 533363 540277 547262 554677 562034 568392
62280E68392N271N026N298N223M769M487M405M092L561L419M066N295O556P339
$$ 568392 573663 578689 583987 589210 593979 598466 602871 606963 610524 613943 618009 623304 629860 637199
62266F37199P583P913R237J1821J5012J8087K0980K4017K7417L1290L5720M0463
$$ 637199 644782 652695 661932 673753 688765 706852 727832 751849 779266 810556 846276 886739
62254H86739M4994M9077N2838N5961N7422N6485N3464M8922M2649L4096K3667
$$ 886739 931733 980810 1033648 1089609 1147031 1203516 1256980 1305902 1348551 1382647 1406314
62243A406314J2810K831n947j3772k0743k6718l1783l6378m0862m4935m7858m9314
$$ 1406314 1419124 1421955 1416008 1402236 1381493 1354775 1322992 1286614 1245752 1200817 1152959 1103645
62231A103645m9767m9635m8501m5786m1877l7876l4272l0694k6994k3692k1107
$$ 1103645 1053878 1004243 955742 909956 868079 830203 795931 765237 738243 714551 693444
62220F93444j8893j6792j5120j3967j2702j0791q631o988o046n531n241m924m112
$$ 693444 674551 657759 642639 628672 615970 605179 596548 589560 583514 577983 572742 567818 563706
62207E63706k750j620j425j707j329L6J560K484L123M360O432Q514R554R419R022
$$ 563706 560956 559336 557911 556204 554875 554911 556471 558955 562078 566438 572870 581384 590938 600357 609379
62192F09379R252J0061J0889J1566J2213J2603J2439J2168J2563J3403J3586J2833
$$ 609379 618631 628692 639581 651147 663360 675963 688402 700570 713133 726536 740122 752955
62180G52955J2198J2382J2578J1754J0126Q476O799M782L060K781M137O354Q999
$$ 752955 765153 777535 790113 801867 811993 820469 827268 832050 835110 837891 842028 848382 857381
62167H57381J2324J6368K0694K5148K9949L4800L8706M0979M1799M1465L9648
$$ 857381 869705 886073 906767 931915 961864 996664 1035370 1076349 1118148 1159613 1199261
62156A199261L5827L0117K3256J5998Q754J723m934j1040j6432k1077k5125k8798
$$ 1199261 1235088 1265205 1288461 1304459 1313213 1314936 1310002 1298962 1282530 1261453 1236328 1207530
62144A207530l2204l5248l7649l9070l9334l8511l6684l3821l0125k6388k3417
$$ 1207530 1175326 1140078 1102429 1063359 1024025 985514 948830 915009 884884 858496 835079
62133H35079k1144j8836j6296j4171j2821j1592r775p642n891m526k994j180M92
$$ 835079 813935 795099 778803 764632 751811 740219 730444 722802 716911 712385 709391 708211 708703
62120G08703J880L310M945O471P571Q279Q801R188R174Q202N863K572m07j999
$$ 708703 710583 713893 718838 725309 732880 741159 749960 759148 768322 776524 782387 784959 784552 782553
62106G82553k257j996j784j763k134l181m762o287p308p797p842p356o141m073
$$ 782553 780296 778300 776516 774753 772619 769438 764676 758389 751081 743284 735442 728086 721945 717872
62092G17872j299J545L499M094L930M115N133O606Q058R510J1141J2792J4056
$$ 717872 716573 718118 721617 725711 729641 733756 738889 745495 753553 763063 774204 786996 801052
62079H01052J4780J5273J5959J6888J7746J8344J8869J9417J9588J8931J7732
$$ 801052 815832 831105 847064 863952 881698 900042 918911 938328 957916 976847 994579
62068I94579J6853J6757J7186J7820J8639J9520K0171K0684K1560K2756K3409
$$ 994579 1011432 1028189 1045375 1063195 1081834 1101354 1121525 1142209 1163769 1186525 1209934
62057A209934K2772K0884J7911J3636Q189K542k475p125j1946j6609k0519k4051
$$ 1209934 1232706 1253590 1271501 1285137 1293326 1295868 1293393 1286268 1274322 1257713 1237194 1213143
62045A213143k8083l2522l6375l9178m1244m2487m2166m0205l7686l5478l3193
$$ 1213143 1185060 1152538 1116163 1076985 1035741 993254 951088 910883 873197 837719 804526
62034H04526l0138k6675k3827k1828j9860j7312j4623j2623j1432j0443r267q169
$$ 804526 774388 747713 723886 702058 682198 664886 650263 637640 626208 615765 606498 598329
62022E98329p416o700n783n297o122p901r199r383r409j0134j0717r734p307m982
$$ 598329 590913 584213 578430 573133 567011 559110 549911 540528 531119 520985 510268 500534 493227 488245
62008D88245l649k700j242P71K906M898O541P553P969Q279Q820R307R252Q559
$$ 488245 484596 481896 480654 481425 484331 489229 495770 503323 511292 519571 528391 537698 546950 555509
61994E55509P450N993M029J535j140l496n278o610p770q929j0167j1482j2552
$$ 555509 562959 568952 572981 574516 573376 569880 564602 557992 550222 541293 531126 519644 507092
61981E07092j2775j1947j0779j0126r836r099p825o807o349n736m504l253k621
$$ 507092 494317 482370 471591 461465 451629 442530 434705 427898 421549 415813 411309 408056 405435
61968D05435k323j942j774k085k291j845j273j210j080Q6J934L166L379L359L674
$$ 405435 403112 401170 399396 397311 395020 393175 391902 390692 389612 389698 391632 394798 398177 401536 405210
61953D05210M177M873O102P698Q974R774J0686J2077J3740J5536J7625J9894K1986
$$ 405210 409387 414260 420362 428060 437034 446808 457494 469571 483311 498847 516472 536366 558352
61940E58352K3911K5987K8065K9606L0531L1258L1891L2057L1592L0657K9272
$$ 558352 582263 608250 636315 665921 696452 727710 759601 791658 823250 853907 883179
61929H83179K7384K5343K3425K1139J7847J3882J0039O207J688l224p310j0112
$$ 883179 910563 935906 959331 980470 998317 1012199 1022238 1028445 1030133 1026909 1019599 1009487
61917A009487j2250j3886j4306j3296j1538r253n820j268L282P334J1761J6925
$$ 1009487 997237 983351 969045 955749 944211 934958 929138 927870 931152 938486 950247 967172
61905I67172K1404K3678K3972K3322K1746J8603J4025Q759L159k637q013j2410
$$ 967172 988576 1012254 1036226 1059548 1081294 1099897 1113922 1122681 1125840 1123203 1115190 1102780
61893A102780j6120j9602k2433k3908k4301k4559k4980k5133k4783k4043k2819
$$ 1102780 1086660 1067058 1044625 1020717 996416 971857 946877 921744 896961 872918 850099
61882H50099k1048j9380j8730j9178j9958k0495k0774k0730k0038j8581j6614
$$ 850099 829051 809671 790941 771763 751805 731310 710536 689806 669768 651187 634573
61871F34573j4374j1926r403p033m982l387k304j320M27L337O725R594J1790J3943
$$ 634573 620199 608273 598870 591837 586855 583468 581164 579844 580271 583608 590333 599927 611717 625660
61857F25660J6494J9356K2396K5721K9472L3654L8096M2364M5980M8885N1414
$$ 625660 642154 661510 683906 709627 739099 772753 810849 853213 899193 948078 999492
61846I99492N3522N4542N4025N2252M9521M5464L9731L2771K5186J6829P405k349
$$ 999492 1053014 1107556 1161581 1213833 1263354 1308818 1348549 1381320 1406506 1423335 1430740 1428391
61834A428391j1001j7739k2493k4889k4211k0502j4938q811k734K990Q006J2163
$$ 1428391 1417390 1399651 1377158 1352269 1328058 1307556 1292618 1283807 1281073 1284063 1292069 1304232
61822A304232J5644J8424J9980J9657J7050J1950M388n026j5161k4854l3274l9867
$$ 1304232 1319876 1338300 1358280 1377937 1394987 1406937 1411325 1406299 1391138 1366284 1333010 1293143
61810A293143m4451m7375m9201n0049m9619m7914m5504m3001m0506l7785l4789
$$ 1293143 1248692 1201317 1152116 1102067 1052448 1004534 959030 916029 875523 837738 802949
61799H02949l1785k9184k7264k5850k4307k2113j9489j7195j5674j4643j3612
$$ 802949 771164 741980 714716 688866 664559 642446 622957 605762 590088 575445 561833
61788E61833j2445j1276j0123q902p761p081p022p171o808n627m071k877k317
$$ 561833 549388 538112 527989 519087 511326 504245 497223 490052 483244 477617 473546 470669 468352
61775D68352k067j709j128m81k7k5m81r13p35J18J134J882K373K744L046L456
$$ 468352 466285 464576 463448 462967 462940 462915 462434 461521 460786 460904 462038 463920 466293 469037 472083 475539
61759D75539M209N142N737N835N816N801N325M212L134K671K312J127q11k506
$$ 475539 479748 484890 490627 496462 502278 508079 513404 517616 520750 523421 525733 526860 526049 523543
61745E23543l369l808m414n227n888o081n664m742l735l138l072l214l144k666
$$ 523543 520174 516366 511952 506725 500837 494756 489092 484350 480615 477477 474405 471191 468047 465381
61731D65381j882j092m95R1R98K038K545K263J855K097K927L681L955L815L453
$$ 465381 463499 462407 461912 462003 463001 465039 467584 469847 471702 473799 476726 480407 484362 488177 491630
61716D91630L131L177L563L658K906J557K11j061k535m012m902n151n363n869
$$ 491630 494761 497938 501501 505159 508065 509622 509833 508772 506237 502225 497323 492172 486809 480940
61702D80940o316o370o321o671p378p835p489o377n098m214l705l157k537k335
$$ 480940 474624 468254 461933 455262 447884 440049 432560 426183 421085 416871 413166 410009 407472 405137
61688D05137k751l225l200k936k983l221l139k797k745k992k890k143j303r75
$$ 405137 402386 399161 395961 393025 390042 386821 383682 380885 378140 375148 372258 370115 368812 367837
61674C67837j061j079q32m97l43m73p17p19l57L4J26J62O53J596K419K706K587
$$ 367837 366776 365697 364865 364368 364025 363552 362835 362116 361759 361793 361919 362081 362734 364330 366749 369455 372042
61657C72042K420K498L013L918M776N145N134N240N619N903N720N063M189L523
$$ 372042 374462 376960 379973 383891 388667 393812 398946 404186 409805 415708 421428 426491 430680 434203
61643D34203L540M296N155N407N079M625M031K956J658R37Q28L08j291l183m048
$$ 434203 437743 442039 447194 452601 457680 462305 466336 469292 470950 471887 472715 473023 471732 468549 464501
61628D64501l623k738k090j676j365j415k092l077l608l256k461k105k529l122
$$ 464501 460878 458140 456050 454374 453009 451594 449502 446425 442817 439561 437100 434995 432466 429344
61614D29344l083k382j746j821k605l732m922o077p151q047q627q754q420p754
$$ 429344 426261 423879 422133 420312 417707 413975 409053 402976 395825 387778 379151 370397 361977 354223
61600C54223o928o135n608n345m878l771k435j877k371k982k897k507k573k852
$$ 354223 347295 341160 335552 330207 325329 321558 319123 317246 314875 311893 308996 306489 303916 301064
61586C01064k521j540o79l70m61q92j640k090j562n55l27j003j241k28J021J100
$$ 301064 298543 297003 296324 295954 295493 294601 292961 290871 289309 288754 288427 287424 286183 285955 286976 288076
61570B88076J17o80o45k29lJ12N71J521K433K415J199k52o28J57R11Q25L93M16
$$ 288076 288193 287513 286868 286639 286636 286748 287319 288840 291273 293688 294887 294635 294007 294164 295075 295900 296293 296709
61552B96709Q23J114J257J465J532J161O81O65J071J327J209J080J305J872K581
$$ 296709 297532 298646 299903 301368 302900 304061 304742 305407 306478 307805 309014 310094 311399 313271 315852
61537C15852L216L622L892M272M667M519L574K418J700J194K34j107k054k294
$$ 315852 319068 322690 326582 330854 335521 340040 343614 346032 347732 348926 349160 348053 345999 343705
61523C43705k344k596k758k524k198k181k271k026j537j347j655k038k034j630
$$ 343705 341361 338765 336007 333483 331285 329104 326833 324807 323270 321923 320268 318230 316196 314566
61509C14566j107o49k57J09N22J133J950K639K703J955P95m1N4J142K573L304
$$ 314566 313459 312810 312553 312662 313184 314317 316267 318906 321609 323564 324359 324318 324372 325514 328087 331391
61493C31391K748J430M42J96P8m49r13n03O98J788K215K212K172K185K319K729
$$ 331391 334139 335569 336011 336207 336285 335836 334923 334420 335118 336906 339121 341333 343505 345690 348009 350738
61477C50738L261L422L024K433J999J690J484J513J523P35j137l071l630k610
$$ 350738 353999 357421 360445 362878 364877 366567 368051 369564 371087 371822 370685 367614 363984 361374
61463C61374j267r12j630k479k548j753q10n63j145j835j836j198o32n03l91K10
$$ 361374 360107 359195 357565 355086 352538 350785 349975 349412 348267 346432 344596 343398 342766 342263 341872 342082
61447C42082J072J540J461J341J546J741J474J017J156K175L464M253M367M144
$$ 342082 343154 344694 346155 347496 349042 350783 352257 353274 354430 356605 360069 364322 368689 372833
61433C72833L906L778L751L671L362K931K726K772K653K191J881K199K874L330
$$ 372833 376739 380517 384268 387939 391301 394232 396958 399730 402383 404574 406455 408654 411528 414858
61419D14858L538L788L893L397K529K151K524K822K165O28j073k421l285l645
$$ 414858 418396 422184 426077 429474 432003 434154 436678 439500 441665 442293 441220 438799 435514 431869
61405D31869l540l152k716k406k392k785l445m045m375m370l928l004j857r12
$$ 431869 428329 425177 422461 420055 417663 414878 411433 407388 403013 398643 394715 391711 389854 388942
61391C88942l39m7L3K4K79R72J613J529Q91N72R65J564J943K357L077L731L898
$$ 388942 388603 388556 388589 388613 388892 389864 391477 393006 393897 394469 395434 396998 398941 401298 404375 408106 412004
61374D12004L819L982M281M152L418K575K242K570L082L081K334J346P34M36m5
$$ 412004 415823 419805 424086 428238 431656 434231 436473 439043 442125 445206 447540 448886 449620 450056 450011
61359D50011o83q98m64K11R31K052L636M984N605O019O912Q007Q509Q272P767
$$ 450011 449328 448430 447966 448177 449108 451160 454796 459780 465385 471404 478316 486323 494832 503104 510871
61344E10871P162O246N175M516M495M823N365O239P141P185N934M126K897K399
$$ 510871 518033 524279 529454 533970 538465 543288 548653 554892 562033 569218 575152 579278 582175 584574
61330E84574J698K3k261m160n285o093o935p381o856n646m693m423m300l609k309
$$ 584574 586272 586295 584034 579874 574589 568496 561561 554180 547324 541678 536985 532562 528262 524653 522344
61315E22344r30K8M78P19J156J855K492K978L867N565P350P961P227O222N594
$$ 522344 521414 521442 521920 522639 523795 525650 528142 531120 534987 540552 547902 555863 563090 569312 574906
61300E74906M663K601k77l048n277o962p941q162q080q089p917p236o458o117
$$ 574906 579569 582170 581893 578845 573568 566606 558665 550503 542423 534334 526417 519181 512723 506606
61286E06606n835m809l125j694r50m83M4M97R33J724K812L608M007M737O194P642
$$ 506606 500771 495962 492837 491143 490193 489710 489754 490251 491184 492908 495720 499328 503335 508072 514266 521908
61270E21908Q101P632P023O620O170N698N761O724Q240R719J0861J1577J1831
$$ 521908 530009 537641 544664 551284 557454 563152 568913 575637 583877 593596 604457 616034 627865
61257F27865J1783J1868J2191J2089J0775Q519O693O294O772O635N164L016J214
$$ 627865 639648 651516 663707 675796 686571 695090 701783 708077 714849 721484 726648 729664 730878
61244G30878j32j804m342p254r434j0316j0414j0607j1086j1331j1017j0426r836
$$ 730878 730746 728942 724600 717346 707912 697596 687182 676575 665489 654158 643141 632715 622879
61231F22879r058p960o927o311n783m894l925l535l715l825l628l442l291k678
$$ 622879 613821 605861 598934 592623 586840 581946 578021 574486 570771 566946 563318 559876 556585 553907
61217E53907j476l70j15p21j608k136j889r54n7L4o31j351j691j675j127K72K150
$$ 553907 552431 552061 551946 551225 549617 547481 545592 544638 544581 544615 543984 542633 540942 539267 538140 538412 540562
61200E40562L552M213M942O330P931R219J0510J2264J4030J4907J4622J3511J1763
$$ 540562 544114 548327 553269 559599 567530 576749 587259 599523 613553 628460 643082 656593 668356
61187F68356R413O847M717L356K646K302K040J690J381J298J178M83o66j367j102
$$ 668356 677769 684616 689333 692689 695335 697637 699677 701367 702748 704046 705224 705707 705041 703674 702572
61172G02572n16n35j193j796j878j529j147j288k381m153n724o580p072p634q040
$$ 702572 702056 701521 700328 698532 696654 695125 693978 692690 690309 686156 680432 673852 666780 659146 651106
61157F51106p889p298o608n861n058m449m069l469k411j421j051j132j244j534
$$ 651106 643217 635919 629311 623450 618392 613943 609874 606405 603994 602573 601522 600390 599146 597612
61143E97612k488m233o588r246j1466j2159j0999r011p412o344n334m354l643
$$ 597612 595124 590891 584303 575057 563591 551432 540433 531422 524010 517666 512332 507978 504335
61130E04335k908j684j42J249K540L996N259N721N631N946P174Q928J0618J1951
$$ 504335 501427 499743 499601 500850 503390 507386 512645 518366 523997 529943 537117 546045 556663 568614
61116E68614J2910J3713J4658J5672J6329J6639J7209J8146J8563J7914J7066
$$ 568614 581524 595237 609895 625567 641896 658535 675744 693890 712453 730367 747433
61105G47433J7044J7342J6684J4987J3277J1851R908P017L780P79k045m656o547
$$ 747433 764477 781819 798503 813490 826767 838618 848526 855543 859323 860102 858057 853401 846854
61092H46854p503q064q788r567r953r774r218q591q030p328o226m996m330m302
$$ 846854 839351 831287 822499 812932 802979 793205 783987 775396 767366 760038 753812 748816 744486 740184
61078G40184m007k806j319m94j40O90K230L918N529P403R525J1313J2477J3436
$$ 740184 736177 733371 732052 731558 731418 732108 734338 738256 743785 751188 760713 772026 784503 797939
61064G97939J4757J6584J8570K0096K0774K1100K2134K4144K6130K7158K7462
$$ 797939 812696 829280 847850 867946 888720 909820 931954 956098 982228 1009386 1036848
61053A036848K7594K7397K6702K6153K6217K6072K4724K2638K1001J9837J8231
$$ 1036848 1064442 1091839 1118541 1144694 1170911 1196983 1221707 1244345 1265346 1285183 1303414
61042A303414J6033J3980J2393J0954R636Q591P496O152N395O056P503Q555R478
$$ 1303414 1319447 1333427 1345820 1356774 1366410 1375001 1382497 1388649 1394044 1400100 1407603 1416158 1425636
61029A425636J1500J4673J7791K0317K2704K4966K6582K7853K9840L2839L6400
$$ 1425636 1437136 1451809 1469600 1489917 1512621 1537587 1564169 1592022 1621862 1654701 1691101
61018A691101M0746M6688N4202O2675P2408Q4257R8038J13077J30245J51709J79040
$$ 1691101 1731847 1778535 1832737 1895412 1967820 2052077 2150115 2263192 2393437 2545146 2724186
61007B724186K13397K56898L11346L76345M51646N40875O49699P81325R37840
$$ 2724186 2937583 3194481 3505827 3882172 4333818 4874693 5524392 6305717 7243557
60998G243557J123400J336307J554478J737447J849353J872562J790638J570919
$$ 7243557 8366957 9703264 11257742 12995189 14844542 16717104 18507742 20078661
60990B0078661J192357P03638K36175o8612j57325q9550K7715J13735J21380K938
$$ 20078661 21271018 21974656 22210831 22142219 21984894 21895344 21923059 22036794 22158174 22161112
60980B2161112k87295p38229j247438j667589j897804j931526j827482j652213
$$ 22161112 21873817 21135588 19888150 18220561 16322757 14391231 12563749 10911536
60972A0911536j450805j249859j065151r02877p62393o42163n41501m58004l87711
$$ 10911536 9460731 8210872 7145721 6242844 5480451 4838288 4296787 3838783 3451072
60963C451072l28270k79222k39360k06444j79262j57452j39549j23544j09083
$$ 3451072 3122802 2843580 2604220 2397776 2218514 2061062 1921513 1797969 1688886
60954A688886r6865q6233p5636o5199n6444m9624m3590l8256l4863l3621l3148
$$ 1688886 1592021 1505788 1430152 1364953 1308509 1258885 1215295 1177039 1142176 1108555 1075407
60943A075407l2547l2051l1384k9515k6534k4025k2994k2868k2859k2836k2508
$$ 1075407 1042860 1010809 979425 949910 923376 899351 876357 853489 830630 807794 785286
60932G85286k1238j9152j7243j5971j4913j3913j3359j3071j2193j0520q848p766
$$ 785286 764048 744896 727653 711682 696769 682856 669497 656426 644233 633713 624865 617099
60920F17099p072o482o008n555n082m985n425n549m594l340l135l745l668k464
$$ 617099 610027 603545 597537 591982 586900 581915 576490 570941 566347 563007 559872 556127 552459 549995
60906E49995j237p85p87q79j082j135p95p82j950l523l895l185l142m312n291
$$ 549995 548758 547973 547186 546307 545225 544090 543295 542513 540563 537040 533145 529960 526818 522506 517215
60891E17215n211m990n396n721n435n448o545p908q380q097p821p581p036o363
$$ 517215 512004 507014 501618 495897 490462 485014 478469 470561 462181 454084 446263 438682 431646 425283
60877D25283n877n412m784m238l852l299k568k092j791r94K92J152J239J353K007
$$ 425283 419406 413994 409210 404972 401120 397821 395253 393161 391370 390376 390668 391820 393059 394412 396419
60862C96419K752L420M655O395P194O227M693M098M201L959L447L404L629L310
$$ 396419 399171 402591 407246 413641 420835 427062 431755 435853 440054 444013 447460 450864 454493 457803
60848D57803K529K125K285K384K023J277J99j113k189k732l162l995m999n647
$$ 457803 460332 462457 464742 467126 469149 470426 470625 469512 467323 464591 461429 457434 452435 446788
60834D46788n948o124o009n462m943m873m920m673m463m723n041m781m180l841
$$ 446788 440840 434716 428707 423245 418302 413429 408509 403836 399373 394650 389609 384828 380648 376807
60820C76807l639l171k793l039l353k749j582j287k253l274l409l125l119l141
$$ 376807 373168 369997 367204 364165 360812 358063 356481 355194 352941 349667 346258 343133 340014 336873
60806C36873k727k243k299k692k662j982j088l56J99O01P73P73Q41J122J520J851
$$ 336873 334146 331903 329604 326912 324250 322268 321180 320824 321023 321624 322397 323170 324011 325133 326653 328504
60790C28504K052K190K353K474K292J622P54L81Q55J647J846J249N87N07P26N99
$$ 328504 330556 332746 335099 337573 339865 341487 342241 342622 343477 345124 346970 348219 348806 349313 350039 350638
60774C50638J63j2J33O7k81k78K01K56o32j517j276l99k55r08j110m07R6m72j437
$$ 350638 350801 350789 350922 350989 350708 350430 350631 350887 350255 348738 347462 347063 346808 345900 344790 344383 344479 344007 342570
60755C42570j731j355r76p60m69k15l08n79n10L6O36Q54O96N45P20R88O12p83
$$ 342570 340839 339484 338508 337748 337279 337064 336756 336177 335667 335703 336339 337193 337889 338434 339154 340142 340754 339971
60737C39971k563l730m082m120m057l694l233l157l115k107j42J301J163K49J
$$ 339971 337408 333678 329596 325476 321419 317725 314492 311335 308220 306113 305971 307272 308435 308684 308685
60722C08685O04J178J272J201J251J342J362J246R66Q08J282K290K885K390J316
$$ 308685 309289 310467 311739 312940 314191 315533 316895 318141 319107 319915 321197 323487 326372 328762 330078
60707C30078N96L98L77N97J333K228K551K155J547J077P31N16M58K65l51j170
$$ 330078 330674 331072 331449 332046 333379 335607 338158 340313 341860 342937 343668 344184 344642 344907 344556 343386
60691C43386j790k273k813l008k246p92K54K33m69j148j480j383q08P1Q83J467
$$ 343386 341596 339323 336510 333502 331256 330464 330718 330951 330482 329334 327854 326471 325663 325734 326617 328084
60675C28084J900K076J738J082P16Q02P07j05j216j764j565j249j341j712k015
$$ 328084 329984 332060 333798 334880 335596 336398 337105 337000 335784 334020 332455 331206 329865 328153 326138
60660C26138k219k427k442j972j115l08K72Q68J548J898J677J381J667K412K867
$$ 326138 323919 321492 319050 317078 315963 315655 315927 316795 318343 320241 321918 323299 324966 327378 330245
60645C30245K681K252K008J826J281J85j228k408k899k854k953l449l608k701
$$ 330245 332926 335178 337186 339012 340293 340478 339250 336842 333943 331089 328136 324687 321079 318378
60631C18378j190j93K7J01K56P0l46j87O85J254Q11k3l46j80N9M65J220J907K059
$$ 318378 317188 316995 317022 317123 317379 317449 317103 316916 317601 318855 319666 319643 319297 319117 319176 319641 320861 322768 324827
60612C24827J877J717J364O01oK58J184J918K068J849J428P57o6q37j418j535
$$ 324827 326704 328421 329785 330386 330380 330638 331822 333740 335808 337657 339085 339842 339776 338939 337521 335986
60596C35986q17N35J600J785J502J346J263J138J415K265K774K096Q21J56J70
$$ 335986 335169 335704 337304 339089 340591 341937 343200 344338 345753 348018 350792 352888 353709 353865 354035
60581C54035O8j52K95J369J979J624J106J265J959K698L467M440N503O485P388
$$ 354035 354103 353951 354246 355615 357594 359218 360324 361589 363548 366246 369713 374153 379656 386141 393529
60566C93529Q131Q531Q688Q938R257R174Q403P120N566L774J760l91k546m324
$$ 393529 401660 410191 418879 427817 437074 446248 454651 461771 467337 471111 472871 472480 469934 465610
60552D65610n108m750l990l542l039j706K38J773K611L458M669N735O413P365
$$ 465610 460502 455752 451762 448220 445181 443475 443713 445486 448097 451555 456224 461959 468372 475737
60538D75737R188J1563J3882J5948J7708J8899J9444J9558J9015J7017J3325Q906
$$ 475737 484925 496488 510370 526318 544026 562925 582369 601927 620942 637959 651284 660190
60526F60190M834J086k880o855r931j1616j2159j1952j1196j0126r089q284p744
$$ 660190 665024 666110 663230 656375 646444 634828 622669 610717 599521 589395 580306 572022 564278
60513E64278p402o877n496l030k59J695K639L410M704O349Q044J0172J3384J7516
$$ 564278 556876 549999 544503 541473 541214 542909 545548 548958 553662 560011 568055 578227 591611 609127
60499F09127K1559K4808K7650L0850L4437L7667M0071M1922M3490M4289M3462
$$ 609127 630686 655494 683144 713994 748431 786098 826169 868091 911581 955870 999332
60488I99332M0723L6517L1457K5914K0135J4289Q247J564o116j4639k3341l1443
$$ 999332 1040055 1076572 1108029 1133943 1154078 1168367 1176614 1178178 1172062 1157423 1134082 1102639
60476A102639l8471m4316m8810n1443n1789n0177m7505m4300m0469l6155l2137
$$ 1102639 1064168 1019852 971042 919599 867810 817633 770128 725828 685359 649204 617067
60465F17067k8962k6175k3074j9814j7049j4860j2779j0787r404q771q372p808
$$ 617067 588105 561930 538856 519042 501993 487133 474354 463567 454163 445392 437020 429212
60453D29212p218o718o063n087m056l266k673k159j864j961k290k447k121j336
$$ 429212 421994 415276 409213 404126 400070 396804 394131 391972 390108 388147 385857 383410 381289 379953
60439C79953n29k74p31j358j434q21j3M63L91j27p18q93n94m03p89j337j329q56
$$ 379953 379424 379150 378419 377061 375627 374806 374793 375256 375647 375520 374802 373909 373315 372912 372123 370786 369457 368601
60421C68601o76r41r33k14O97J125J169J313J639J833J768J646J635J717J860
$$ 368601 367925 366984 366051 365837 366534 367659 368828 370141 371780 373613 375381 377027 378662 380379 382239
60406C82239K072K281K289J936J343R43J093J642K064K077J871J646J351J088
$$ 382239 384311 386592 388881 390817 392160 393103 394196 395838 397902 399979 401850 403496 404847 405935
60392D05935J232J819K295K376K529L100L478L013K191J905J984J601R09R48J854
$$ 405935 407167 408986 411281 413657 416186 419286 422764 425777 427968 429873 431857 433458 434367 435315 437169
60377D37169K529K364K027K073J993J356Q42J277K360L210L532L490L038K203
$$ 437169 439698 442062 444089 446162 448155 449511 450353 451630 453990 457200 460732 464222 467260 469463
60363D69463J535J544J965K260K505L095L930M576M977N371N759O070O622P680
$$ 469463 470998 472542 474507 476767 479272 482367 486297 490873 495850 501221 506980 513050 519672 527352
60349E27352Q785R169Q769Q116P329N912L670J120j175l135m872o263p106p378
$$ 527352 536137 545306 554075 562191 569520 575432 579102 580222 579047 575912 571040 564777 557671 550293
60335E50293p165o561n790n093m441l636k817k499k921l603l909l840l939m385
$$ 550293 543128 536567 530777 525684 521243 517607 514790 512291 509370 505767 501858 498018 494079 489694
60321D89694m638m089k850j547m99N06J630K588L175L803N098P079R100J0631
$$ 489694 485056 480967 478117 476570 476071 476577 478207 480795 483970 487773 492871 499950 509050 519681
60307E19681J1688J2545J3331J3937J4079J3496J2356J1305J0667R669P110K881
$$ 519681 531369 543914 557245 571182 585261 598757 611113 622418 633085 642754 649864 652745
60295F52745j742n564q616j1559j4422j6509j7243j6648j5154j3282j1457r778
$$ 652745 651003 645439 636823 625264 610842 594333 577090 560442 545288 532006 520549 510771
60283E10771q045o162m434l254k646k342k184k263k647l185l461l079k123j332
$$ 510771 502726 496564 492130 488876 486230 483888 481704 479441 476794 473609 470148 467069 464946 463614
60269D63614j531k709l933m332l903l236k733k364j911j250m81j1k67j127j836
$$ 463614 462083 459374 455441 451109 447206 443970 441237 438873 436962 435712 435231 435220 434953 433826 431990
60254D31990j810j321j131j476j765j329k70O53R21Q46J121J872K438K260J625
$$ 431990 430180 428859 427728 426252 424487 423158 422888 423541 424462 425308 426429 428301 430739 432999 434624
60239D34624J190J069Q19K53l15o07o41l79L36J338K067K234K190K404K896L393
$$ 434624 435814 436883 437702 437955 437640 437033 436392 436013 436349 437687 439754 441988 444178 446582 449478 452871
60223D52871L668L527K856J981J625K170L222M160M823N423O011O436O611O497
$$ 452871 456539 460066 462922 464903 466528 468698 471920 476080 480903 486326 492337 498773 505384 511881
60209E11881O032N372M984N201N789O200O186N904N611N498N681O080O358O150
$$ 511881 517913 523285 528269 533470 539259 545459 551645 557549 563160 568658 574339 580419 586777 592927
60195E92927N356M153K890K017J834K095K082J297n6j430k540l441m199m771n153
$$ 592927 598283 602436 605326 607343 609177 611272 613354 614651 614595 613165 610625 607184 602985 598214 593061
60180E93061n449n783o208o553o419n598m498l814l618l215k126q75l72p99j559
$$ 593061 587612 581829 575621 569068 562649 557051 552553 548739 545121 541906 539780 538905 538533 537734 536175
60165E36175k163k687l281l655l323k213q45O9J88k36n95l93M38J531K330K460
$$ 536175 534012 531325 528044 524389 521066 518853 518008 518077 518265 518029 517434 517041 517479 519010 521340 523800
60149E23800K010J421J054R24R06R65J070J106J090J218J546J859K179K952M289
$$ 523800 525810 527231 528285 529209 530115 531080 532150 533256 534346 535564 537110 538969 541148 544100 548389
60134E48389N413N526M932M550M517M151L320K828L113L477L094K136J352J120
$$ 548389 553802 559328 564260 568810 573327 577478 580798 583626 586739 590216 593310 595446 596798 597918
60120E97918J413K219L400M483N033N067M805M346L943M077M751N052M057K003
$$ 597918 599331 601550 604950 609433 614466 619533 624338 628684 632627 636704 641455 646507 650564 652567
60106F52567M7j018j345j500j816k371l118l842m198m004l511l228l442l854l860
$$ 652567 652614 651596 650251 648751 646935 644564 641446 637604 633406 629402 625891 622663 619221 615367 611507
60091F11507l259k515k143k078j959j760j688j645j372j103j364k176l018l614
$$ 611507 608248 605733 603590 601512 599553 597793 596105 594460 593088 591985 590621 588445 585427 581813
60077E81813m163m737n094n215n259m993m055k921k662l409m018l755l293l362
$$ 581813 577650 572913 567819 562604 557345 552352 548297 545376 542714 539305 535287 531532 528239 524877
60063E24877l457k808j885j785k547l184l135k753k452k228k061k023j924j423
$$ 524877 521420 518612 516727 514942 512395 509211 506076 503323 500871 498643 496582 494559 492635 491212
60049D91212o13J05O44J294K124K782L050L183L645M612N763O403O018M856L733
$$ 491212 490599 490704 491348 492642 494766 497548 500598 503781 507426 512038 517801 524204 530222 535078 538811
60034E38811L116K697K051J213L66n50j494k085k255k675l885n299n823n331m863
$$ 538811 541927 544624 546675 547888 548254 547704 546210 544125 541870 539195 535310 530011 524188 518857 513994
60019E13994n370o760q148q694q150p041o201n944n765n068l933k922k443k551
$$ 513994 508624 501864 493716 485022 476872 469831 463630 457686 451921 446853 442920 439998 437555 435004
60005D35004l016l226k552j199k94n75j413j772j619j593j597q49O94J942K090
$$ 435004 431988 428762 426210 425011 424717 424142 422729 420957 419338 417745 416148 415299 415993 417935 420025
59990D20025J689J857K918M228N062N265N072M674M103L439K898K569K218J563
$$ 420025 421714 423571 426489 430717 435779 441044 446116 450790 454893 458332 461230 463799 466017 467580
59976D67580P18ro22j308j873j892j513j446j912k295k120j728j559j423r88l84
$$ 467580 468298 468289 467667 466359 464486 462594 461081 459635 457723 455428 453308 451580 450021 448598 447610 447226
59960D47226J83Q36J485J531P64m9j63O5r2m77m03J00L35K4m80r20j290j410j099
$$ 447226 447409 448245 449730 451261 452025 451976 451813 451878 451786 451309 450906 451006 451341 451365 450885 449965 448675 447265 446166
59941D46166o50n37o95o85m09r5J84M11L95K24N93J890L355L901L569L332L716
$$ 446166 445516 444979 444284 443599 443190 443095 443279 443690 444085 444309 444902 446792 450147 454048 457617 460949 464665
59924D64665M423N080N430M958L327J186l40r65j263j431j013J07J316K128K610
$$ 464665 469088 474168 479598 484556 487883 489069 488729 487764 486501 485070 484057 484164 485480 487608 490218
59909D90218K830K610J983J257M31p09j893k415k061j378q65n51m25o53j103j300
$$ 490218 493048 495658 497641 498898 499329 498620 496727 494312 492251 490873 490008 489457 489032 488379 487276 485976
59893D85976j049o31j96M88J567K772L763M421M819N184N798O563O852O269N286
$$ 485976 484927 484296 484100 484588 486155 488927 492690 497111 501930 507114 512912 519475 526327 532596 537882
59878E37882M660M496M477M637N088N288M608L444K780K643K015L97j491k764
$$ 537882 542542 547038 551515 556152 561240 566528 571136 574580 577360 580003 582018 582415 580924 578160
59864E78160l212k889j854o64l00j011j841j739o69O57J655K120K058J704J491
$$ 578160 574948 572059 570205 569541 569241 568230 566389 564650 563981 564638 566293 568413 570471 572175 573666
59849E73666J848K997M813O621P446O931N773M794L954K807J433J94r80k084k328
$$ 573666 575514 578511 583324 589945 597391 604322 610095 614889 618843 621650 623083 623277 622297 620213 617885
59834F17885j030R66J981J485K89j019k547l996m592m329m057m023l626k923k897
$$ 617885 616855 617821 619802 621287 621576 620557 618010 614014 609422 605093 601036 597013 593387 590464 587567
59819E87567l702m060l154j901j447j506j199o52n94j062j468j578j590j601j709
$$ 587567 583865 579805 576651 574750 573303 571797 570598 569946 569352 568290 566822 565244 563654 562053 560344
59804E60344k216l113l737l538k873k459k420k445k507k816l317l646l548l044
$$ 560344 558128 555015 551278 547740 544867 542408 539988 537543 535036 532220 528903 525257 521709 518665
59790E18665k347j859j887k232k343j998j515j252j245j409j647j745j606j429
$$ 518665 516318 514459 512572 510340 507997 505999 504484 503232 501987 500578 498931 497186 495580 494151
59776D94151j237m80J064K414K438J701J920L546N099N354M881M828N307N742
$$ 494151 492914 492434 493498 495912 498350 500051 501971 505517 510616 515970 520851 525679 530986 536728
59762E36728N927N904N481M671M041M029M347M505M455M353M232M229M559N044
$$ 536728 542655 548559 554040 558711 562752 566781 571128 575633 580088 584441 588673 592902 597461 602505
59748F02505N215N062M922M602L536J972R35P27N57K1k95j52l21j212k025k023
$$ 602505 607720 612782 617704 622306 625842 627814 628749 629476 630033 630054 629759 629607 629286 628074 626049 624026
59732F24026j604j325r38k94q2o72j217r39l92l97n88j59O71J096J013Q55P09
$$ 624026 622422 621097 620159 619865 619783 619111 617894 616955 616563 616166 615578 615419 616090 617186 618199 619054 619763
59715F19763O33J137K332L208K866J909J577K093K912L952N356O538O756O325
$$ 619763 620396 621533 623865 627073 629939 631848 633425 635518 638430 642382 647738 654276 661032 667357
59701F67357O100O092N675M856M219L854L426L015K954K961K517J807J316P82
$$ 667357 673457 679549 685224 690080 694299 698153 701579 704594 707548 710509 713026 714833 716149 716931
59687G16931l84j912k997l618m366n124n199m709m605n226n867o008n900n762
$$ 716931 716547 714635 711638 708020 703654 698530 693331 688622 684017 678791 672924 666916 661016 655254
59673F55254n402m979n162o040o618o007m543l311k877k854k472j388j1R03J074
$$ 655254 649852 644873 639711 633671 627053 621046 616503 613192 610315 607461 604989 603601 603590 604493 605567
59658F05567R83J237J876K566L149L729M419N257O044O203N302L823K720J942
$$ 605567 606550 607787 609663 612229 615378 619107 623526 628783 634827 641030 646332 650155 652875 654817
59644F54817L84k302m818n922o053o361o990p399p603p902p932p220o239n749
$$ 654817 655201 652899 648081 642159 636106 629745 622755 615356 607753 599851 591919 584699 578460 572711
59630E72711n527m923m205m074m252l957l474l768m708n151m844m723n085n033
$$ 572711 567184 562261 558056 553982 549730 545773 542299 538531 533823 528672 523828 519105 514020 508987
59616E08987m123l202l021l175l059k864k909k862k294j411o36pN44Q37Q31Q13
$$ 508987 504864 501662 498641 495466 492407 489543 486634 483772 481478 480067 479431 479424 479968 480805 481636 482449
59600D82449Q66O39j5n45l49N09J528K407L101L472L272K460J415P39P16R42P00
$$ 482449 483315 483954 483939 483394 483045 483554 485082 487489 490590 494062 497334 499794 501209 501948 502664 503606 504306
59583E04306j67j009j231j042j109j773k925m184m908m507l256k311k405k936
$$ 504306 504139 503130 501899 500857 499748 497975 495050 490866 485958 481451 478195 475884 473479 470543
59569D70543k962k536k425k870l374l380k633j218K25P83L67n1J26K42k94p11
$$ 470543 467581 465045 462620 459750 456376 452996 450363 449145 449370 450153 450520 450469 450595 450837 450543 449832
59553D49832n8J085J467J174J393K422L397L857M208M650M873M938N313O070P058
$$ 449832 449774 450859 452326 453500 454893 457315 460712 464569 468777 473427 478300 483238 488551 494621 501679
59538E01679Q740J1613J4814J6687J6871J6460J5862J3904R680M169o11l311l738
$$ 501679 510419 522032 536846 553533 570404 586864 602726 616630 626310 630479 629868 626557 622819
59525F22819k492o22R45K017K815L159K649J572O95N6j139l285n808p981r524
$$ 622819 620327 619705 620650 622667 625482 628641 631290 632862 633557 633613 632474 629189 623381 615400 605876
59510F05876j0306j0263r730r195q721q160p740p687p582p007o418o375o330n387
$$ 605876 595570 585307 575577 566382 557661 549501 541761 534074 526492 519485 513067 506692 500362 494975
59496D94975l950l163k993k391j330r11j304j301k94Q22J320J670K330K844K889
$$ 494975 491025 487862 484869 482478 481148 480237 478933 477632 477338 478160 479480 481150 483480 486324 489213
59481D89213K986L506M012M212M478M896M892M352L947L856L356K273J516J509
$$ 489213 492199 495705 499717 503929 508407 513303 518195 522547 526494 530350 533706 535979 537495 539004
59467E39004J394N87j44l3L38J74j52J74J057J870K489L079L561M047N052O484
$$ 539004 540398 540985 540841 540808 541146 541320 541168 541342 542399 544269 546758 549837 553398 557445 562497 568981
59451E68981P279O821N938N648N681N201M189L186K210R39n23j900l335m969o391
$$ 568981 576260 583081 589019 594667 600348 605549 609738 612924 615134 616073 615550 613650 610315 605346 598955
59436E98955p171p451p382o604m965l213k235k047k106k065j689o75Q45K281L544
$$ 598955 591784 584333 576951 570347 565382 562169 559934 557887 555781 553716 552027 551352 552197 554478 558022
59421E58022N207P235Q618R068R919J2191J4814J6246J6991J8724K1356K2915
$$ 558022 563229 570464 579082 588150 598069 610260 625074 641320 658311 677035 698391 721306
59409G21306K2413K0897J9004J5161P642k263j0534j4010j2870r440n386q92L921
$$ 721306 743719 764616 783620 798781 806423 804160 793626 779616 766746 757306 751920 751028 754949
59396G54949P966J0101J0085P869K816m993j3125j8115j8740j6769j4274j1614
$$ 754949 762915 773016 783101 790970 793786 788793 775668 757553 738813 722044 707770 696156
59384F96156q526n638l787k783j915j051l79K94J148J819J925J673J348P26l27
$$ 696156 687630 681992 678205 675422 673507 672456 672077 672371 673519 675338 677263 678936 680284 681010 680683
59369F80683j285j634j648j882k333k636k573j993q34M16R49P92R72K084L512
$$ 680683 679398 677764 676116 674234 671901 669265 666692 664699 663865 664281 665230 666022 666994 669078 672590
59354F72590M595N597O899Q133Q947R733J0786J1620J1949J2482J3665J4507J3912
$$ 672590 677185 682782 689681 697814 706761 716494 727280 738900 750849 763331 776996 791503 805415
59341H05415J2444J1540J1425J1073R997Q727P602O187M060J402j301l612n269
$$ 805415 817859 829399 840824 851897 861894 870621 878223 884410 888470 889872 888571 884959 879690
59328H79690o437p647r121j0467j1410j2282j3293j3936j3791j3389j3453j3743
$$ 879690 873253 865606 856485 846018 834608 822326 809033 795097 781306 767917 754464 740721
59316G40721j3476j2497j1350j0413r718r264q955q497p886p613p814p687o422
$$ 740721 727245 714748 703398 692985 683267 674003 665048 656551 648665 641052 633238 625551 619129
59303F19129m332k367q39Q36L298O538R734J1651J1677J0509R130P064K902l168
$$ 619129 614797 612430 611591 612427 615725 622263 631997 643648 655325 665834 674964 682028 684930 681762
59289F81762q815j2173j3697j4444j4022j1693q365n789m355l138j713m75N37
$$ 681762 672947 660774 647077 632633 618611 606918 598553 592764 588409 585271 583558 583083 583620
59276E83620J771L254M631N978P642R464J0954J2021J2722J2767J2018J1003J0119
$$ 583620 585391 588645 593276 599254 606896 616360 627314 639335 652057 664824 676842 687845 697964
59263F97964Q927P056N091L538J745r88l845n444n798n963o224o032n391m917
$$ 697964 706891 713947 719038 722576 724321 723333 719488 714044 708246 702283 696059 690027 684636 679719
59249F79719m584l799k611j697j170m78O11J907L402M996N986N877N385N422N587
$$ 679719 675135 671336 668725 667028 665858 665380 665991 667898 671300 676296 682282 688159 693544 698966 704553
59234G04553M928L798L330L418K817J259k38j300k763m882o537o928o802p229
$$ 704553 709481 713279 716609 720027 722844 724103 723865 722565 719802 714920 708383 701455 694653 687424
59220F87424q146q764q780q491q244q151q031p505o472n404m704m039k936j696
$$ 687424 679278 670514 661734 653243 644999 636848 628817 621312 614840 609436 604732 600693 597757 596061
59206E96061r50o83m91n27j076j551j031K91J318J663J966K607L186L433L623
$$ 596061 595111 594428 593937 593410 592334 590783 589752 590043 591361 593024 594990 597597 600783 604216 607839
59191F07839L987M462N096N913O495O513O472P041P825P864P122O435O088N561
$$ 607839 611826 616288 621384 627297 633792 640305 646777 653818 661643 669507 676629 683064 689152 694713
59177F94713M555L226J516n35k086k264j682j770k694l220k738j997j659j514
$$ 694713 699268 702494 704010 703475 701389 699125 697443 695673 692979 689759 687021 685024 683365 681851
59163F81851j433j729k200k124j638j890l235m477m605m220m525n683o935p656
$$ 681851 680418 678689 676489 674365 672727 670837 667602 663125 658520 654300 649775 644092 637157 629501
59149F29501p766p520p333p406p413o949o270n934n852n513n016m952n288n336
$$ 629501 621735 614215 606882 599476 592063 585114 578844 572910 567058 561545 556529 551577 546289 540953
59135E40953m882m294l593k449j196n99m72K86K024L806M882N562O294P000P724
$$ 540953 536071 531777 528184 525735 524539 523940 523468 523754 525778 529584 534466 540028 546322 553322 561046
59120E61046Q900J0440J1590J2103J2656J3646J4500J4655J4383J4141J3946J3805
$$ 561046 569946 580386 591976 604079 616735 630381 644881 659536 673919 688060 702006 715811
59108G15811J3946J4148J3714J2627J1849J1957J2266J1879J0876R796Q597O857
$$ 715811 729757 743905 757619 770246 782095 794052 806318 818197 829073 838869 847466 854323
59096H54323M679K698J391O86J92m05j043j348j179r42j095j604k297l387n076
$$ 854323 859002 861700 863091 863777 863969 863564 862521 861173 859994 859052 857957 856353 854056 850669 845593
59081H45593o987q646j0135j1620j2646j2795j2600j2902j3589j3922j3734j3306
$$ 845593 838606 829960 819825 808205 795559 782764 770164 757262 743673 729751 716017 702711
59069G02711j2494j1100r713r004q547p528o254n606n458n081m699n062n708n475
$$ 702711 690217 679117 669404 660400 651853 644325 638071 632465 627007 621926 617227 612165 606457 600982
59055F00982m583m394n070n325m651l892l410k585j568j464k182k036m03J046
$$ 600982 596399 592005 586935 581610 576959 573067 569657 567072 565504 564040 561858 559822 559419 560465
59041E60465Q79K7J80J339K255K343K090K179L026M597O175O970P146P458P958
$$ 560465 561344 561371 561551 562890 565145 567488 569578 571757 574783 579380 585555 592525 599671 607129 615087
59026F15087Q160Q494J0122J3089J6036J8098J9607K0680K0750J9884J8905J7682
$$ 615087 623247 631741 641863 654952 670988 689086 708693 729373 750123 770007 788912 806594
59014H06594J5011J0824O784L951J601q44k477k597k064j815j428l45Q20J368
$$ 806594 821605 832429 839213 843164 844765 843921 841444 838847 836783 834968 833540 833195 834015 835383
59000H35383J612J883J683Q85M50Q18Q55m62k604m769p270j0317j2733j3405j3041
$$ 835383 836995 838878 840561 841446 841896 842714 843569 843107 840503 835734 828464 818147 805414 792009 778968
58985G78968j3070j3602j3787j3390j2720j1713j0162q386o699m911l010j484
$$ 778968 765898 752296 738509 725119 712399 700686 690524 682138 675439 670528 667518 666034
58973F66034k94J393L637N168N310N225O075P207P406O845O446O219N606M662
$$ 666034 665740 667133 670770 675938 681248 686473 692548 699755 707161 714006 720452 726671 732277 736939
58959G36939L652K185k3k272l860n251p144r119j0310j0737j0972j1116j1063
$$ 736939 740591 742776 742753 740481 736621 731370 724226 715107 704797 694060 683088 671972 660909
58946F60909j0965j0624r270o862m694l800l635l249k681k255j580m56K27k86
$$ 660909 649944 639320 630050 623188 618494 614694 611059 607810 605129 602874 601294 600838 601065 600779
58932F00779j352j962k123k237k133j809k116l377m409m103l027k286j827j202
$$ 600779 599427 597465 595342 593105 590972 589163 587047 583670 579261 575158 572131 569845 568018 566816
58918E66816r16j494k181k019j427j242j099k02J051J771K183K994L892M182M415
$$ 566816 565900 564406 562225 560206 558779 557537 556438 556236 557287 559058 561241 564235 568127 572309 576724
58903E76724N740Q010R909J0769J1029J1262J1682J2285J2604J1892J0303R117
$$ 576724 582464 590474 600383 611152 622181 633443 645125 657410 670014 681906 692209 701326
58891G01326R040R217Q903Q861R946J1444J2188J2241J2129J1378R437P100N479
$$ 701326 710366 719583 728486 737347 747293 758737 770925 783166 795295 806673 816110 823210 828689
58878H28689M319K762R76m03j638l229m648n206n403n991o585o568o507p081p552
$$ 828689 833008 835770 836746 836343 834705 831476 826828 821622 816219 810228 803643 797075 790568 783487 775935
58863G75935o951n971n986o937p870q788j0171j1342j1187r983q967q545q368
$$ 775935 768984 763013 757027 750090 742220 733432 723261 711919 700732 690749 681782 673237 664869
58850F64869q537r144r311q273o779n933n470m703m194m724n512n354m769n097
$$ 664869 656332 647188 637877 629604 622825 616892 611422 606719 602525 597801 592289 586935 582166 577069
58836E77069o167o754o651o395n683m050k355j691j490p11Pm46j217p13M43L46
$$ 577069 570902 564148 557497 551102 545419 541369 539014 537323 535833 535122 535129 534683 533466 532753 533196 533542
58820E33542q46j179k40M38K71K53O08L50m73n48L24Q21N25O01J517K176J862
$$ 533542 532696 531517 531277 531715 531986 532239 532847 533197 532724 532176 532500 533321 533846 534447 535964 538140 540002
58803E40002J222P83J67p16j262j305j266j008p4R18P58l44r03m20J21J29J61
$$ 540002 541224 542007 542174 541458 540196 538891 537625 536617 536543 537461 538219 537875 536972 536552 536673 536802 536963
58786E36963O72J430K324L372M067M107M412N900P637P933O868N877N306M339
$$ 536963 537635 539065 541389 544761 548828 552935 557347 563247 570884 578817 585685 591562 596868 601207
58772F01207K996J992R01j306m011n485n590n725o093n495l955l146l754m601
$$ 601207 604203 606195 607096 605790 601779 596294 590704 584979 578886 573391 569436 566290 562536 557935
58758E57935m811m751m453l265j539o52q06o73L61J395J795J936J957J527J127
$$ 557935 553124 548373 543920 540655 539116 538464 537658 536985 537346 538741 540536 542472 544429 545956 547083
58743E47083J726L102M204N119O731Q547R099Q476Q173Q399P987P079P353R068
$$ 547083 548809 551911 556115 561234 567965 576512 585611 594087 602260 610659 618646 625725 633078 642146
58729F42146J0354R976Q635P071N147L266K440K419J880Q23O60J636K547L171
$$ 642146 652500 662476 671111 678182 683329 686595 689035 691454 693334 694157 694817 696453 699000 702171
58715G02171M454O019O224N137M650N023M247J636q61k036l273n765q490j0312
$$ 702171 706625 712644 718868 724005 728655 733678 737925 739561 738700 736664 733391 727626 719136 708824
58701G08824j1701j3070j3671j3522j4102j5887j7244j7035j6164j5483j4345
$$ 708824 697123 684053 670382 656860 642758 626871 609627 592592 576428 560945 546600
58690E46600j2467j0934j0163q973o871n134m495l926k865k338k739k757j806
$$ 546600 534133 523199 513036 504063 497192 492058 487563 483637 480772 478434 475695 472938 471132
58677D71132j192j592j712p89o7l12k13J165K593L034L592N381P438Q492Q904
$$ 471132 469940 468348 466636 465847 465780 465468 465255 466420 469013 472047 475639 481020 488458 496950 505854
58662E05854R250Q938P667O415N515L719O03k160l343l928m897n469n106m947
$$ 505854 515104 524042 531709 538124 543639 547358 547961 545801 542458 538530 533633 528164 523058 518111
58648E18111n638n864m862m150m896n771n336m450m240l860k369q81o42p86j88
$$ 518111 512473 506609 501747 497597 492701 486930 481594 477144 472904 469044 466675 465794 465152 464366 464178
58633D64178L64o7m24M66J530J242K29o5J23j28m15q2J13n82j132l96Q09J232
$$ 464178 464542 464475 464051 464517 466047 467289 467518 467453 467576 467448 467033 466951 467064 466482 465350 464954 465763 466995
58615D66995J331K036K818K958L268M588N898N950N350N134M679L073J234O03
$$ 466995 468326 470362 473180 476138 479406 483994 489892 495842 501192 506326 511005 514078 515312 515915
58601E15915R28J159J330J749J663O16k06K60J104J117Q27J199J780J923K400
$$ 515915 516843 518002 519332 521081 522744 523360 523154 523414 524518 525635 526462 527661 529441 531364 533764
58586E33764L943N642O524P206Q275Q738P971P421Q312R345Q777P194O148N673
$$ 533764 537707 543349 549873 557079 565354 574092 582063 589484 597796 607141 615918 623112 629260 634933
58572F34933N328O023Q503J1448J3271J4468J6193J8016J9235K0762K3497K6229
$$ 634933 640261 646284 654787 666235 679506 693974 710167 728183 747418 768180 791677 817906
58560H17906K7386K7435K7514K7181K5611K3432K1233J7934J2830P493L480n1
$$ 817906 845292 872727 900241 927422 953033 976465 997698 1015632 1028462 1035955 1039435 1039384
58548A039384m156p546q830r367j1099j3272j4147j4435j5997j8552k0544k1986
$$ 1039384 1035228 1027682 1018852 1009485 998386 985114 970967 956532 940535 921983 901439 879453
58536H79453k3693k4928k4601k3629k3314k2679k0141j6598j4093j2552j0625
$$ 879453 855760 830832 806231 782602 759288 736609 716468 699870 685777 673225 662600
58525F62600q526p328o580n372m564n209o027n162l354k500k308j262J69K73q50
$$ 662600 654074 646746 640166 634794 630230 625021 618994 613832 610478 607978 605670 604408 604577 604850 604000
58510F04000j692j934k129j829o22J89n48j500r09L81N82J52N06J100P60L92J309
$$ 604000 602308 600374 598245 596416 595794 595983 595435 593935 593026 593407 593989 594141 594647 595747 596507 596899 598208
58493E98208K298J593M48J389M091O190P183Q267R402R712R936J1417J3558J5014
$$ 598208 600506 602099 602547 603936 608027 614217 621400 629667 639069 648781 658717 670134 683692 698706
58479F98706J6210J7940J8989J8173J7069J7470J7754J5243J0609O378K613k134
$$ 698706 714916 732856 751845 770018 787087 804557 822311 837554 848163 854541 857154 855020
58467H55020p053j0145j1868j3894j5393j4409j1720r523p433l757N14K987M148
$$ 855020 847967 837822 825954 812060 796667 782258 770538 761015 753582 749825 750339 753326 757474
58454G57474O241Q869R843R412R487R514P300L295k0k334n163q186r818j0588
$$ 757474 763715 772584 782427 791839 801326 810840 818140 821435 821415 819081 813918 805732 795914 785326
58440G85326j1951j2795j1173q393p168o869n033k301j146q83J118M217N564N542
$$ 785326 773375 760580 749407 741014 733846 726977 721944 719643 718497 717614 718732 722949 728513 734055
58426G34055P030R848J1151J0834J1369J2618J2019R713Q251P387M438l48l934
$$ 734055 741085 750933 762084 772918 784287 796905 808924 818637 826888 834275 838713 838365 834431
58413H34431n944q619j1496j1670r528q697r836r818p605n605m707l177j054m18
$$ 834431 828487 819868 808372 796702 787174 778477 768641 758823 751218 745613 740906 737729 736675 736257
58399G36257q23M59L176M245L450L711N347N627M399M424N573M533J145q10j06
$$ 736257 735434 735893 739069 743314 746764 750475 755822 761449 765848 770272 775845 780378 781523 780713 780607
58384G80607K91q49j231k55l46j675j180J704L712L492L433M541M833L977M162
$$ 780607 780898 780049 778818 778563 778217 776542 775362 777066 780778 784270 787703 792244 797077 801054 805216
58369H05216N364N116L934N159Q559J0007Q656Q323J0448J1925J1424J1549J2983
$$ 805216 810580 815696 819630 824789 833348 843355 852011 860334 870782 882707 894131 905680 918663
58356I18663J2700R939Q013Q213P728N462M029M288L730J976J977M122N211M689
$$ 918663 931363 941302 949315 957528 965256 970718 974747 979035 982765 984741 986718 990840 996051 1000740
58342A000740N683Q463R479Q337Q921J1995J3693J3074J3851J6699J7361J4767
$$ 1000740 1006423 1014886 1024365 1032702 1041623 1053618 1067311 1080385 1094236 1110935 1128296 1143063
58330A143063J3403J5007J5428J2589J0099R914Q843N535L585M406M289J753O35
$$ 1143063 1156466 1171473 1186901 1199490 1209589 1219503 1228346 1233881 1237466 1241872 1246161 1247914 1248549
58317A248549K622M057L333L945O986Q337O712O745J0381J3203J2853J3081J5705
$$ 1248549 1251171 1255228 1258561 1262506 1269492 1277829 1284541 1291286 1301667 1314870 1327723 1340804 1356509
58304A356509J6736J4638J4143J7474J9955J8753J7805J9594K0269J7633J5736
$$ 1356509 1373245 1387883 1402026 1419500 1439455 1458208 1476013 1495607 1515876 1533509 1549245
58293A549245J6898J7333J5274J4945J7908J9235J7003J6572K0554K3684K2818
$$ 1549245 1566143 1583476 1598750 1613695 1631603 1650838 1667841 1684413 1704967 1728651 1751469
58282A751469K2531K5496K6980K4602K3741K7304K9994K8759K8847L3208L6205
$$ 1751469 1774000 1799496 1826476 1851078 1874819 1902123 1932117 1960876 1989723 2022931 2059136
58271B059136L4564L4112L8692M2907M3010M4289N0153N4794N4510N5300O1193
$$ 2059136 2093700 2127812 2166504 2209411 2252421 2296710 2346863 2401657 2456167 2511467 2572660
58260B572660O6080O5504O5192O9246P1466O7403O3509O4976O6234O2912O1318
$$ 2572660 2638740 2704244 2769436 2838682 2910148 2977551 3041060 3106036 3172270 3235182 3296500
58249C296500O6281P1678P2876P6109Q5488R3678R5836R9403J09363J17918J19989
$$ 3296500 3362781 3434459 3507335 3583444 3668932 3762610 3858446 3957849 4067212 4185130 4305119
58238D305119J24259J36938J49667J55909J63699J79044J93137J99919K09446
$$ 4305119 4429378 4566316 4715983 4871892 5035591 5214635 5407772 5607691 5817137
58229E817137K29012K48469K59797K73132K97048L21750L39328L61049L96059
$$ 5817137 6046149 6294618 6554415 6827547 7124595 7446345 7785673 8146722 8542781
58220H542781M33160M63292M98959N50649O06234O55902P14248P94054Q82800
$$ 8542781 8975941 9439233 9938192 10488841 11095075 11750977 12465225 13259279 14142079
58211A4142079R70523J074997J212390J370736J541944J750669K020822K346553
$$ 14142079 15112602 16187599 17399989 18770725 20312669 22063338 24084160 26430713
58203B6430713K731097L218052L844731M602184N483235O528165P779823R248101
$$ 26430713 29161810 32379862 36224593 40826777 46310012 52838177 60618000 69866101
58195F9866101J0974543J3071952J5634875J8674887K2188968K6128565L0117494
$$ 69866101 80840644 93912596 109547471 128222358 150411326 176539891 206657385
58188B06657385L3307513L4763770L3967832L0707551K4573818J5111312K830795
$$ 206657385 239964898 274728668 308696500 339404051 363977869 379089181 381919976
58181C81919976j0177799k1105756k8064266l0903897l0712303k8869324k6488163
$$ 381919976 371742177 350636421 322572155 291668258 260955955 232086631 205598468
58174B05598468k4225706k2226405k0277104j8177434j5978336j3866580j1947242
$$ 205598468 181372762 159146357 138869253 120691819 104713483 90846903 78899661
58167G8899661j0226941q715819p432617o348539n412613m612997l956306l414155
$$ 78899661 68672720 59956901 52524284 46175745 40763132 36150135 32193829 28779674
58159B8779674k943996k538846k208680j935115j688616j470206j295243j153776
$$ 28779674 25835678 23296832 21088152 19153037 17464421 15994215 14698972 13545196
58151A3545196j023989r07863q18418p46910o75239o06720n54128n10692m61680
$$ 13545196 12521207 11613344 10794926 10048016 9372777 8766057 8211929 7701237 7239557
58142G239557m12080l75363l46682l13216k79674k58328k44352k25316k05267
$$ 7239557 6827477 6452114 6105432 5792216 5512542 5254214 5009862 4784546 4579279
58133D579279j95923j93022j84017j70971j64161j60660j50251j35742j27346
$$ 4579279 4383356 4190334 4006317 3835346 3671185 3510525 3360274 3224532 3097186
58124C097186j23182j14246j02724r7232r5548q9399q0889p7664p7194p1935o4615
$$ 3097186 2974004 2859758 2757034 2659802 2564254 2474855 2393966 2316302 2239108 2167173 2102558
58113B102558o2799o3626n9191n1959m9816n0823m7603m2031m1124m2900m0442
$$ 2102558 2039759 1976133 1916942 1864983 1815167 1764344 1716741 1674710 1633586 1590686 1550244
58102A550244l5708l5535l8090l6791l3555l4791l8183l6747l2247l1560l3243
$$ 1550244 1514536 1479001 1440911 1404120 1370565 1335774 1297591 1260844 1228597 1197037 1163794
58091A163794l0597k4870k2586k2795j9549j4299j3443j5968j5574j2819j3378
$$ 1163794 1133197 1108327 1085741 1062946 1043397 1029098 1015655 999687 984113 971294 957916
58080I57916j6341j6012j3417j4512j8529j9309j6832j6542j8488j7838j5006
$$ 957916 941575 925563 912146 897634 879105 859796 842964 826422 807934 790096 775090
58069G75090j4800j6579j5392j1963j1545j3731j3213r879q537r397q338n885
$$ 775090 760290 743711 728319 716356 704811 691080 677867 667988 659451 650054 641716 635831
58057F35831o552r751j0554q964r430j1738j1359q509p817r238q175m619l373
$$ 635831 629279 619528 608974 600010 590580 578842 567483 558974 551157 541919 533744 529125 525752
58044E25752n057n375l637l671n740n801l433k748m677n745n137n702p426p094
$$ 525752 520695 515320 511683 508012 502272 496471 493038 490290 485613 479868 474731 469029 461603 454509
58030D54509m952m803o940p814o936p350r047q676o192n091n743n114l213l203
$$ 454509 449557 444754 437814 430000 423064 415714 406667 397991 391799 386708 380965 375851 372638 369435
58016C69435m858m691k783k770m729m899k879k300l715l604j286j93j212j271
$$ 369435 364577 359886 357103 354333 349604 344705 341826 339526 335811 332207 330921 330728 329516 328245
58002C28245L89P81p75j224L07J016kk71R15J307N84J067K731K893J526J433K564
$$ 328245 328634 329415 328640 327416 327723 328739 328737 328466 329381 330688 331272 332339 335070 337963 339489 340922 343486
57985C43486J792r59k174j151j188l323m630l915l583m508m428k798k054k740
$$ 343486 345278 344319 342145 340994 339806 336483 331853 327938 324355 319847 315419 312621 310567 307827
57971C07827k408n86J53p98r88J68L57p57p02P27P05j244k209j343j245k707l291
$$ 307827 305419 304833 304986 304188 303200 303368 303725 302968 302266 302993 303698 302454 300245 298902 297657 294950 291659
57954B91659k306k156l301l101j046p7j159j586k41N11j70K21K568M232L991M114
$$ 291659 289353 287197 283896 280795 279749 279672 278513 276927 276686 277197 277027 277248 279816 284048 288039 292153
57938B92153N694O627O088O346Q211R292Q627Q439R366Q722N524K607J566J83
$$ 292153 297847 304474 310562 316908 325119 334411 343038 351477 360843 369565 375089 377696 379262 379445
57924C79445k857n277n667o116p964r177q521q123r266r725p978o120n930n828
$$ 379445 376588 371311 365644 359528 351564 342387 333866 325743 316477 306752 298774 292654 286724 280896
57910B80896m409l306l775m011k631j386j758k190j332p83j881k974k459j581
$$ 280896 276487 273181 269406 265395 262764 261378 259620 257430 256098 255315 253434 250460 248001 246420
57896B46420j636j389K44J728J675J358K185L230L443L682M611N138M787M890
$$ 246420 244784 243395 243639 245367 247042 248400 250585 253815 257258 260940 265551 270689 275476 280366
57882B80366N716N403L381J763J634J283j35p10L96Q87n29j457J0J827J564L93
$$ 280366 286082 291485 294866 296629 298263 299546 299411 298701 299097 299984 299455 297998 298008 299835 301399 301792
57866C01792M99J247R34K2k11j58n06l96P91J900K137K585L838M586M265M399
$$ 301792 302291 303538 304472 304494 304283 304125 303619 303223 304014 305914 308051 310636 314474 319060 323325 327724
57850C27724N458N329K977O56K39K71r49k279k274k079l081m173l967l404l647
$$ 327724 333182 338511 341488 342144 342383 342654 341705 339426 337152 335073 331992 327819 323852 320448 316801
57835C16801l735k678j582j411r99M80J568J329J406K949M162L421K173K125K278
$$ 316801 313066 310388 308806 307395 306396 306876 308444 309773 311179 314128 318290 321711 323884 326009 328287
57820C28287J461J046K213L117J844k11r78j306k781m304m209l742n025p322q562
$$ 328287 329748 330794 333007 336124 337968 337757 336779 335473 332692 328388 324179 320437 315412 308090 299528
57805B99528q888r569r989q911p224o459n965m419k629k048k054j463j081j942
$$ 299528 290640 281071 271082 262171 254947 248488 242523 238104 235475 233427 231373 229910 228829 226887
57791B26887k672j645p4N2m44M06J992K367J894K365L595M095M223N442P252P833
$$ 226887 224215 222570 222496 222548 222104 222510 224502 226869 228763 231128 234723 238818 243041 248483 255735 263568
57775B63568P152O583O184N040L579K884K418R82q94j906k405l410m298m090l831
$$ 263568 270720 277303 283487 288527 292106 294990 297408 298390 297496 295590 293185 289775 285477 281387 277556
57760B77556m913o145n444l504k670l011k639j322n99n90K07J974L223L425L469
$$ 277556 272643 266498 261054 257550 254880 251869 249230 247908 247309 246719 246926 248900 252123 255548 259017
57745B59017L530K914J949J733K060J724P32J61R1k03m46K13J219J206K52m26
$$ 259017 262547 265461 267410 269143 271203 272927 273659 273820 273911 273708 273262 273475 274694 275900 276152 275726
57729B75726o78j306k185k495k387k504k422j404j83O1k06J83Q32O24j8M5K77
$$ 275726 275048 273742 271557 269062 266675 264171 261749 260345 260162 260223 260017 260200 261032 261656 261638 261683 261960
57712B61960o00j882j737l95J54m86o43L97J322J142N33L79O82J225J992K719
$$ 261960 261360 259478 257741 257346 257500 257014 256371 256768 258090 259232 259765 260144 260826 262051 264043 266762
57696B66762L161L593M041L734K401J145O73j11k100m009m350m052m713n531m643
$$ 266762 269923 273516 277557 281291 283692 284837 285510 285399 283299 279290 274940 270888 266175 260644 256001
57681B56001k523j161m97J381M776Q001J0382J3068J6683K0655K5039L0786L7854
$$ 256001 253478 252317 251820 253201 257977 265978 276360 289428 306111 326766 351805 382591 420445
57668D20445M4847N0613N4520N5425N2136M4500L2409J4797p880l0870m7746n5921
$$ 420445 465292 515905 570425 625850 677986 722486 754895 769692 761812 730942 683196 627275
57656F27275n7519n5277n0260m3512l6852l1208k6146k1498j7733j4595j1292
$$ 627275 569756 514479 464219 420707 383855 352647 326501 305003 287270 272675 261383
57645B61383q087n981m907l911k905k420k109j374r58j728k536j641K23Q26N4
$$ 261383 253296 247315 242408 238497 235592 233172 231063 229689 228731 227003 224467 222826 223049 223875 223929
57630B23929j85N47O61m08j376j708k356l497l965l451k973k813k244j543j858
$$ 223929 223744 224291 224952 224544 223168 221460 219104 215607 211642 208191 205218 202405 200161 198618 196760
57615A96760k777k498q42L08N1n41q19j494k488k387r86k1m63j153j032o68o66
$$ 196760 193983 191485 190643 190951 191002 190461 189642 188148 185660 183273 182287 182266 181803 180650 179618 178950 178284
57598A78284o14m98j164k524l150k562k061k450k723k008j111j040j531j895k051
$$ 178284 177670 177172 176008 173484 170334 167772 165711 163261 160538 158530 157419 156379 154848 152953 150902
57583A50902k002j513q52o74q43o96m30p68j292r33o1j44j194j691j208r55j396
$$ 150902 148900 147387 146535 145861 145018 144322 143892 143124 141832 140899 140838 140694 139500 137809 136601 135646 134250
57566A34250j554j153j175j783j836j072o20p79n27J88L3j107j481l18R55J301
$$ 134250 132696 131543 130368 128585 126749 125677 125057 124278 123751 123939 123972 122865 121384 121066 122021 123322
57550A23322J594K468K934K358J744J682J095o31k117k072j161n22n6M95N06j78
$$ 123322 124916 127384 130318 132676 134420 136102 137197 136566 134449 132377 131216 130694 130638 131133 131639 131461
57534A31461m00M53J173O50l63o82n29o51q47n76J8O45J358J828J397M15J66Q53
$$ 131461 131061 131514 132687 133337 132974 132292 131763 131112 130265 129689 129707 130352 131710 133538 134935 135350 135516 136369
57516A36369J295J152J501K471K449Q30n23l8J148J124j7r22j130r65m74J26J9
$$ 136369 137664 138816 140317 142788 145237 146067 145544 145506 146654 147778 147761 146839 145709 144744 144270 144396 144415
57499A44415q97j447r53m02p32j284j141p36q35j164j263j552k290k609j825o85
$$ 144415 143518 142071 141118 140716 139984 138700 137559 136823 135988 134824 133561 132009 129719 127110 125285 124600
57483A24600k33l56m66n71p07m16L09O29K04k65n54j492l156m021l098j523q98
$$ 124600 124367 124011 123545 122974 122267 121851 122160 122789 122993 122728 122174 120682 117526 113505 110407 108884 107986
57466A07986j315k023k673k874j942k86M50k94r31j25J255J832J787J861J734
$$ 107986 106671 104648 101975 99101 97159 96873 97323 97029 96098 95973 97228 99060 100847 102708 104442
57451A04442R27R5q8j92q05j238p59RK56L63Q14J003M17j03L01J075J356J341
$$ 104442 105369 105464 105376 105184 104379 103141 102382 102391 102647 103010 103824 104827 105244 105141 105442 106517 107873 109214
57433A09214J367R52Qm04J86O32K03J4Q95J590Q62j56J82J252J402P79O38Q38
$$ 109214 110581 111533 111541 111137 111323 111955 112158 112172 113067 114657 115519 115363 115545 116797 118199 118978 119616 120454
57415A20454K88p20q32J45J207J852K196K019J286R45J559J880N18j715k923k921
$$ 120454 120742 120022 119190 119335 120542 122394 124590 126609 127895 128840 130399 132279 132797 131082 128159 125238
57399A25238k980l379l130j932n72M52J247J682J554J309J391J385R85J008K132
$$ 125238 122258 118879 115749 113817 113245 113697 114944 116626 118180 119489 120880 122265 123250 124258 126390
57384A26390L451L835L860M683N778N677M327K934J924R53M17R91J959J853O60
$$ 126390 129841 133676 137536 142219 147997 153674 158001 160935 162859 163812 164229 165220 167179 169032 169692
57369A69692l35p28j284k197k768k791k758k610j837p88m17p01p37m16o10j527
$$ 169692 169357 168629 167345 165148 162380 159589 156831 154221 152384 151596 151179 150478 149741 149325 148715 147188
57353A47188k220j992j186m13J01L02K42J91K45P7l97o15l49k38o06o45J19O16
$$ 147188 144968 142976 141790 141377 141478 141780 142022 142213 142458 142535 142138 141523 141174 140936 140330 139685 139804 140420
57335A40420k50j707k245j851j544j419p97N8J34o07j171j023n04MK48j74j157
$$ 140420 140170 138463 136218 134367 132823 131404 130607 130665 130799 130192 129021 127998 127494 127498 127746 127572 126415
57318A26415j687j141l38k34m17j11K92J02k30n3N7n55j052m85K47k52j301j144
$$ 126415 124728 123587 123249 123015 122598 122487 122779 122881 122651 122598 122655 122100 121048 120563 120810 120558 119257 118113
57300A18113K10J222J373J338J110K08n83kJ351J698R32O09J208J630J470J516
$$ 118113 118323 119545 120918 122256 123366 123574 122991 122989 124340 126038 126970 127579 128787 130417 131887 133403
57284A33403J838J601J024J291K173K009N24m52J88J334J740J839K451L277L556
$$ 133403 135241 136842 137866 139157 141330 143339 143863 143411 143599 144933 146673 148512 150963 154240 157796
57269A57796L181K467J758J588K152K604K026R92Q27J466J682J257J179J618J665
$$ 157796 160977 163444 165202 166790 168942 171546 173572 174564 175391 176857 178539 179796 180975 182593 184258
57254A84258J210J196J699J644Q72N65J079J232M87N2R67K527L485L491K748J463
$$ 184258 185468 186664 188363 190007 190879 191444 192523 193755 194242 194294 195261 197788 201273 204764 207512 208975
57238B08975K79J7N03P86Q09J456K746L481L166K776L057L566L757L868M112M294
$$ 208975 209254 209271 209774 210560 211369 212825 215571 219052 222218 224994 228051 231617 235374 239242 243354 247648
57222B47648M483M853M774L562K124K155L540M448M253M314N317O111N970N889
$$ 247648 252131 256984 261758 265320 267444 269599 273139 277587 281840 286154 291471 297582 303552 309441
57208C09441O523O803N936N081N584O936P886Q364Q989R638R837R699R498R158
$$ 309441 315964 322767 328703 333784 339368 346304 354190 362554 371543 381181 391018 400717 410215 419373
57194D19373Q919R517J0904J1824J1521J0838J0814J1285J1665J2146J3123J4296
$$ 419373 428292 437809 448713 460537 472058 482896 493710 504995 516660 528806 541929 556225
57182E56225J5157J5653J5787J5493J5387J6532J8883K1023K2001K2364K2868
$$ 556225 571382 587035 602822 618315 633702 650234 669117 690140 712141 734505 757373
57171G57373K3371K3712K4386K5537K6418K6632K6803K7305K7504K6984K6313
$$ 757373 780744 804456 828842 854379 880797 907429 934232 961537 989041 1016025 1042338
57160A042338K5907K5281K4290K3824K4387K5214K5595K5919K6521K6764K6316
$$ 1042338 1068245 1093526 1117816 1141640 1166027 1191241 1216836 1242755 1269276 1296040 1322356
57149A322356K6050K6716K7822K8901L0565L3155L5576L6870L7872M0020M3366
$$ 1322356 1348406 1375122 1402944 1431845 1462410 1495565 1531141 1568011 1605883 1645903 1689269
57138A689269M7142N1337N6317O1620O6551P1346P6277Q0072Q0565P6739O9266
$$ 1689269 1736411 1787748 1844065 1905685 1972236 2043582 2119859 2199931 2280496 2357235 2426501
57127B426501N9620M9762M2190L8902M0287M5582N3831O3533P2108P7210P8658
$$ 2426501 2486121 2535883 2578073 2616975 2657262 2702844 2756675 2820208 2892316 2969526 3048184
57116C048184P8326P8318P9913Q3754R0025R8447J08734J21032J35632J52873
$$ 3048184 3126510 3204828 3284741 3368495 3458520 3556967 3665701 3786733 3922365 4075238
57106D075238J73908K00803K35276K78042L30375L95527M77424N78493O99966
$$ 4075238 4249146 4449949 4685225 4963267 5293642 5689169 6166593 6745086 7445052
57097G445052Q43615J011407J203704J419869J661033J929859K225725K541288
$$ 7445052 8288667 9300074 10503778 11923647 13584680 15514539 17740264 20281552
57089B0281552K864645L182646L479620L735784L932318M055319M081488L951141
$$ 20281552 23146197 26328843 29808463 33544247 37476565 41531884 45613372 49564513
57081D9564513L567780K853306J825874O24511n54496j557903k328898k886341
$$ 49564513 53132293 55985599 57811473 58435984 57881488 56323585 53994687 51108346
57073E1108346l272667l521096l651661l677781l611240l465345l256453l002597
$$ 51108346 47835679 44314583 40662922 36985141 33373901 29908556 26652103 23649506
57065B3649506k721432k429727k142615j871481j623185j401869j209926j046760
$$ 23649506 20928074 18498347 16355732 14484251 12861066 11459197 10249271 9202511
57057I202511r08839p92486o95322o14370n45089m83722m28911l79845l34829
$$ 9202511 8293672 7501186 6805864 6191494 5646405 5162683 4733772 4353927 4019098
57048D019098k93216k56824k27524k04616j86031j70575j57488j45350j33111
$$ 4019098 3725882 3469058 3241534 3036918 2850887 2680312 2522824 2377474 2244363
57039B244363j21192j10167r9529q9000p9527p1618o4005n5432m6456l8059k9825
$$ 2244363 2123171 2013004 1913475 1824475 1744948 1673330 1609325 1553893 1507437 1469378 1439553
57028A439553k0789j0729N35J3354K6265L5468L7984L3764K3332N757j8402m3933
$$ 1439553 1418764 1408035 1408570 1421924 1448189 1483657 1521641 1555405 1578737 1584494 1566092 1522159
57016A522159o3812p4721p7880p5663o9969o2960n6566n1009m5521m0177l5531
$$ 1522159 1458347 1383626 1305746 1230083 1160114 1097154 1040588 989579 944058 903881 868350
57005H68350l1266k6952k3391k1385j9981j7784j5343j4210j4357j4476j4259
$$ 868350 837084 810132 786741 765356 745375 727591 712248 698038 683681 669205 654946
56994F54946j4332j4471j3839j2627j1545j0109p260l327L38L266N637O798N868
$$ 654946 640614 626143 612304 599677 588132 578023 570763 567436 567774 571040 576677 583475 589343
56981E89343L394N83k598o751j1039j3887j5244j6127j6328j4751j1810r349q037
$$ 589343 592737 593320 590722 583971 572932 559045 543801 527674 511346 496595 484785 475436 467399
56968D67399o789m841k586l03K225M747O801Q863J1696J4703J6489J6782J6158
$$ 467399 460610 455769 453183 452880 455105 459852 466653 475516 487212 501915 518404 535186 551344
56955E51344J4207R861L468l305r463j4886j8728j9775j8461j6643j5161j3311
$$ 551344 565551 575412 578880 575575 566112 551226 532498 512723 494262 477619 462458 449147
56943D49147j0835q538o660m382j329J904N001Q292J1802J5214J8685K2249K4628
$$ 449147 438312 429774 423114 418732 417403 419307 424308 432600 444402 459616 478301 500550 525178
56930E25178K4175K0820J5469Q056j773j2245k0143k4185k5724k5968k4688k2062
$$ 525178 549353 570173 585642 593698 591925 579680 559537 535352 509628 483660 458972 436910
56918D36910j9528j7904j6501j4808j3369j2333j0851q757p203o883o922o368
$$ 436910 417382 399478 382977 368169 354800 342467 331616 322859 315656 308773 301851 295483
56906B95483n440m621l726k620j754j415j260j044q25l17Q70K248K874K883L411
$$ 295483 290043 285422 281696 279076 277322 275907 274647 273603 272778 272461 273331 275579 278453 281336 284747
56891B84747M881O709Q612J0824J2876J3700J3144J1959J0188P079K785j421m851
$$ 284747 289628 296337 304949 315773 328649 342349 355493 367452 377640 384719 387504 386083 381232
56878C81232p808j0016j0407q892o853n302l897k115r4K106M739P639J0438J3548
$$ 381232 373424 363408 353001 344109 337256 331954 328057 325942 325848 327954 332693 340332 350770 364318
56864C64318J7601K1989K5553K8467L1556L3820L2782K7547J9459R585j915j3423
$$ 364318 381919 403908 429461 457928 489484 523304 556086 583633 603092 612677 610762 597339
56852E97339k1558k4659k4545k3580k1944j8954j5089j1023o294n51N114R610
$$ 597339 575781 551122 526577 502997 481053 462099 447010 435987 429693 429142 434256 443866
56840D43866J3622J8576K4786L1648L8748M5529N0653N2807N1470M6139L5710
$$ 443866 457488 476064 500850 532498 571246 616775 667428 720235 771705 817844 853554
56829H53554J9731j12k0336l7127m7613n0987m9039m4683l9551l3656k7215k1250
$$ 853554 873285 873173 852837 815710 768097 717110 668071 623388 583837 550181 522966 501716
56817E01716j6140j1138n884r19L801R412J6404K3592K9460L3360L5003L4049
$$ 501716 485576 474438 468554 467635 471436 480848 497252 520844 550304 583664 618667 652716
56805F52716L0530K4374J4461P0j6359k9982l7953m1266m1793l9711l5049k9485
$$ 652716 683246 707620 722081 722151 705792 675810 637857 596591 554798 515087 480038 450553
56793D50553k4751k0721j6592j2577r055n376r72L438P084J0387J3727J6256J7210
$$ 450553 425802 405081 388489 375912 366857 361481 360509 363947 371031 381418 395145 411401 428611
56780D28611J7188J6664J4355Q660J01q998j6604k1734k4041k3964k2749k1351
$$ 428611 445799 462463 476818 485478 485579 476581 459977 438243 414202 390238 367489 346138
56768C46138j9786j7963j6268j4732j2798j0549r002q452p908o863o149o145n752
$$ 346138 326352 308389 292121 277389 264591 254042 245040 236588 228680 221817 215668 209523 203771
56755B03771m344l085l038l388k998k305k154k091j438q38j052j319o46K60J20
$$ 203771 199427 196342 193304 189916 186918 184613 182459 180368 178930 178092 177040 175721 175075 175335 175455
56740A75455p35j016o45n38p66n96K4M05L69K89K27J5j52j40l24p81p52J42R75
$$ 175455 174720 173704 173059 172521 171755 171159 171183 171588 171957 172246 172473 172488 172336 172196 171872 171091 170339 170481 171456
56721A71456Q24K07J14M29M34J86K51O76J262K123L069L222K238J085O71O13K96
$$ 171456 172280 172487 172601 173030 173464 173650 173901 174577 175839 177962 181031 184253 186491 187576 188247 188860 189156
56704A89156R5M71Q25N42J85M55Q91Q23O06O40J93j300k748k730j570o63m11k52
$$ 189156 189251 189722 190547 191089 191274 191729 192620 193443 194049 194689 194882 193582 190834 188104 186534 185871 185460 185208
56686A85208m1M8L82J259J975J775J129R04R11N18jO0N62Q80Q97O49j79j389j875
$$ 185208 185167 185215 185597 186856 188831 190606 191735 192639 193550 194068 194067 194127 194689 195569 196466 197115 196936 195547 193672
56667A93672j184m07m17m20L82J016L01j032j524j267j184r77K15J836K514K104
$$ 193672 192488 192081 191664 191244 191626 192642 192943 191911 190387 189120 187936 186959 187174 189010 191524 193628
56651A93628J411N39p50j689j394n47m41q56o52O6K47j16j54P5j83p20o72j89
$$ 193628 195039 195578 194828 193139 191745 191198 190757 189901 189249 189315 189562 189446 189292 189367 189184 188464 187792 187603
56633A87603j04k46J30N95R4r56j066j12M13k58j254j607j323p63k74l62j076
$$ 187603 187499 187253 187383 187978 188072 187116 186050 185938 186351 186093 184839 183232 181909 181146 180872 180510 179434
56616A79434j434o44M94P09K33J60L89p2j070j400q46m15n39o07l14m9R2L76N46
$$ 179434 178000 177356 177850 178559 178792 178952 179341 179269 178199 176799 175953 175538 174999 174392 174078 174029 174121 174497 175043
56597A75043J14n40n60M7N31O15N05J73k68r9Q75J467P28l60k93O55J215J339
$$ 175043 175157 174617 174057 174104 174635 175250 175755 175928 175660 175561 176436 177903 178631 178271 177978 178633 179848 181187
56579A81187J768K135J518L91J3L11L25L53J468L189L829L134K569K918L483L755
$$ 181187 182955 185090 186608 186999 187012 187323 187648 188001 189469 192658 196487 199621 202190 205108 208591 212346
56563B12346M072M593N187O293Q312J0330J1020J0436R400P711M788J524o13j826
$$ 212346 216418 221011 226198 232491 240803 251133 262153 272589 281989 289700 294488 296012 295399 293573
56549B93573l237m452m237l171l131m221m755m231l819l836l234j960j333j691
$$ 293573 290336 285884 281647 278476 275345 271124 266369 262138 258319 254483 251249 249289 247956 246265
56535B46265j864j396j102j162q31l30p57j856k151j597j682k559k590j330m39
$$ 246265 244401 243005 241903 240741 239910 239580 238823 236967 234816 233219 231537 228978 226388 225058 224619
56520B24619q31j350j124r67j444j712j283r96j320j515j275j348j779j518m92
$$ 224619 223788 222438 221314 220347 218903 217191 215908 214912 213592 212077 210802 209454 207675 206157 205665
56505B05665j03q38j387r39m13n87q48p25p88j161r99k15M6m89o39m4Rj058j835
$$ 205665 205562 204724 203337 202398 201985 201398 200550 199825 199037 197876 196877 196662 196708 196219 195580 195536 195545 194487 192652
56486A92652j179P2O62N89K71l48r46o65L35P21P7m60j66L92R08J816K661K169
$$ 192652 191473 191545 192207 192796 193067 192719 191773 191108 191443 192164 192241 191781 191615 192007 192915 194731 197392 199561
56468A99561O36L0R18J555Q81R8J80K11m54p21O3O20N2m41K25R77N57k17OQ54
$$ 199561 200197 200227 201145 202700 203581 203679 203859 204070 203616 202895 202958 203578 203630 203189 203414 204391 204948 204731 204737 205591
56448B05591J288J528K214K865K718K131J730J255M18j77p5J11j73n14n27o03
$$ 205591 206879 208407 210621 213486 216204 218335 220065 221320 221738 221561 221486 221597 221424 220910 220383 219780
56432B19780r17r96q20r94j264o33O40J039L55J00P09P04l82q18K97J298P99N
$$ 219780 218863 217867 217047 216053 214789 214156 214796 215835 216190 216290 216999 217703 217321 216503 216800 218098 218897 218902
56414B18902L84J217J289J068J291J194O7j014q88k41j33j40M02P91L25k08K0
$$ 218902 219286 220503 221792 222860 224151 225345 225412 224398 223510 223269 223136 222996 223398 224189 224514 224306 224326
56397B24326L56J72K89J316K074J404J21m38l98l98j28O30R57L41j81K51Q72R19
$$ 224326 224682 224854 225143 226459 228533 229937 230058 229620 229222 228824 228696 229326 230283 230624 230443 230694 231566 232485
56379B32485R89J467J396M43P1J159K292K039J128O63J42r62j542p86Q4r2l62
$$ 232485 233474 234941 236337 236780 236851 238010 240302 242341 243469 244132 244274 243312 241770 240984 241068 240976 240614
56362B40614L97J300J195P56Q80Q43O5k21P73J410J76j585j852j020m26K68J690
$$ 240614 241011 242311 243506 244262 245142 245985 246050 245829 246602 248012 248188 246603 244751 243731 243305 243573 245263
56345B45263K501J329n29r75l00j6J4O71J262P56J21Q31K239K852K925L322L326
$$ 245263 247764 249093 248564 247589 247289 247273 247287 247958 249220 249976 250097 250928 253167 256019 258944 262266 265592
56328B65592K156J212K093L647L790K899K626K684J696J68l61j68n85j280j055
$$ 265592 267748 268960 271053 274700 278490 281389 284015 286699 288395 288563 288202 288034 287449 286169 285114
56313B85114l31k17k05N75J046j9j142j73J939K550J622J416K570L617L894M020
$$ 285114 284783 284566 284361 284936 285982 285963 284821 284648 286587 289137 290759 292175 294745 298362 302256 306276
56297C06276L932L190K674L360M092L192J434P36Q82M15k21M77J948K395J981
$$ 306276 310208 313398 316072 319432 323524 326716 328150 328886 329768 330183 329962 330439 332387 334782 336763
56282C36763K219K941K937K734L593M554L800K182J985K894K741J660J809L268
$$ 336763 338982 341923 344860 347594 351187 355741 359541 361723 363708 366602 369343 371003 372812 376080
56268C76080L976L645M161N897P072P004O908P234P232P255Q526J0576J1728J2108
$$ 376080 380056 383701 387862 393759 400831 407835 414743 421977 429209 436464 444990 455566 467294 479402
56254D79402J3330J5461J7217J8780K1369K4438K6437K7993L0948L4646L6602
$$ 479402 492732 508193 525410 544190 565559 589997 616434 644427 675375 710021 746623
56243G46623L6622L6708L7111L6163L3937L2289L1098K8216K3500J9266J6193
$$ 746623 783245 819953 857064 893227 927164 959453 990551 1018767 1042267 1061533 1077726
56232A077726J2358O829R19m562j0062j4962j7834j9321k1521k4260k5356k4711
$$ 1077726 1090084 1096913 1097832 1093270 1083208 1068246 1050412 1031091 1009570 985310 959954 935243
56220I35243k4471k5009k4524k3051k2839k4136k4434k2841k1440k1334k1005
$$ 935243 910772 885763 861239 838188 815349 791213 766779 743938 722498 701164 680159
56209F80159j9708j8807j8641j7453j4776j2641j2156j1927j0882r762q856p234
$$ 680159 660451 641644 623003 605550 590774 578133 565977 554050 543168 533406 524550 517316
56197E17316n139m136m237l786k685k571l368l070j526q46j424j150N48J579J007
$$ 517316 512177 508041 503804 500018 497333 494762 491394 488324 486798 485952 484528 483378 483926 485505 486512
56182D86512N11J001J280J012J584L035L552K952L183M490M734L428K830L900
$$ 486512 487023 488024 489304 490316 491900 494935 498487 501439 504622 509112 513846 517274 520104 524004
56168E24004M835M754N227O938Q269Q367Q419Q896Q910Q926J0585J3233J4424
$$ 524004 528839 533593 538820 545758 554027 562394 570813 579709 588619 597545 608130 621363 635787
56155F35787J4324J5627J8634K0866K2107K5060L0135L4559L7901M3397N2135
$$ 635787 650111 665738 684372 705238 727345 752405 782540 817099 855000 898397 950532
56144I50532O1077O8781P8008R0389J03117J13396J21595J27662J28956J24348
$$ 950532 1011609 1080390 1158398 1248787 1351904 1465300 1586895 1714557 1843513 1967861
56134A967861J16257J06311R3316P7934O4711N6548N1138M5546M0072L4919K7482
$$ 1967861 2084118 2190429 2283745 2361679 2426390 2482938 2534076 2579622 2619694 2654613 2682095
56123B682095J6334M202o032j4972k3863l1932l9240m8498o1346p6035r0828j05872
$$ 2682095 2698429 2702631 2696599 2681627 2657764 2625832 2586592 2538094 2476748 2400713 2309885 2204013
56111B204013j19690j28077j28969j24693j17364j06403r2622p9938p0273o1165
$$ 2204013 2084323 1956246 1827277 1702584 1585220 1478817 1386195 1306257 1235984 1174819
56101A174819n1055m2340l6539l1244k4837j9576j6961j4642j1054q405p965p064
$$ 1174819 1123764 1081424 1044885 1013641 988804 969228 952267 937625 926571 918166 910201 903137
56089I03137m080j689j866k250p68P84J073K249N272P069N942M956O377P686O799
$$ 903137 899057 897368 895502 893252 892484 893268 894341 896590 901862 908931 914873 919829 926206 933892 940691
56074I40691O212Q095J0189J0432J0795J2723J3742J2412J1636J3258J4599J3990
$$ 940691 946903 954998 965187 975619 986414 999137 1012879 1025291 1036927 1050185 1064784 1078774
56062A078774J4258J6863J8415J7051J6261J8152J9167J7015J5466J7270J8775
$$ 1078774 1093032 1109895 1128310 1145361 1161622 1179774 1198941 1215956 1231422 1248692 1267467
56051A267467J6854J4835J5954J7254J5729J4330J5955J7627J6578J5949J8416
$$ 1267467 1284321 1299156 1315110 1332364 1348093 1362423 1378378 1396005 1412583 1428532 1446948
56040A446948K0409J8867J7444J9698K2494K2568K2998K6591K9581K8808K8346
$$ 1446948 1467357 1486224 1503668 1523366 1545860 1568428 1591426 1618017 1647598 1676406 1704752
56029A704752L1896L5575L5429L4984L7851M0214L8593L7480M1092M5038M4812
$$ 1704752 1736648 1772223 1807652 1842636 1880487 1920701 1959294 1996774 2037866 2082904 2127716
56018B127716M4755M9604N4915N5437N5199N9485O4526O5322O5907P1408P7637
$$ 2127716 2172471 2222075 2276990 2332427 2387626 2447111 2511637 2576959 2642866 2714274 2791911
56007B791911P9312Q0755Q7455R4943R7422R9235J06142J13638J16048J18636
$$ 2791911 2871223 2951978 3039433 3134376 3231798 3331033 3437175 3550813 3666861 3785497
55997C785497J28048J39480J46182J52626J64890J77553J84297J91599K07114
$$ 3785497 3913545 4053025 4199207 4351833 4516723 4694276 4878573 5070172 5277286
55988E277286K24584K35803K46937K66735K89561L07404L27240L58154L92978
$$ 5277286 5501870 5737673 5984610 6251345 6540906 6848310 7175550 7533704 7926682
55979G926682M22074M53104M96885N46506N92183O43147P11783P90571Q69535
$$ 7926682 8348756 8801860 9298745 9845251 10437434 11080581 11792364 12582935 13452470
55970A3452470R61212J081728J223701J377117J559801J796222K086101K429191
$$ 13452470 14413682 15495410 16719111 18096228 19656029 21452251 23538352 25967543
55962B5967543K859790L416767M100718M903160N853839O993882Q335146R903858
$$ 25967543 28827333 32244100 36344818 41247978 47101817 54095699 62430845 72334703
55954G2334703J1789569J4084704J6814025J9980429K3564859K7295980L0464056
$$ 72334703 84124272 98208976 115023001 135003430 158568289 185864269 216328325
55947B16328325L2192480L1923091K9407933K4218887J5739277M109935q905592
$$ 216328325 248520805 280443896 309851829 334070716 349809993 353919928 345014336
55940C45014336k0455904k8265326l1798182l1970623l0094628k7193059k3933400
$$ 345014336 324558432 296293106 264494924 232524301 202429673 175236614 151303214
55933A51303214k0733767j7798668j5185517j2914631j0996864r392661q028537
$$ 151303214 130569447 112770779 97585262 84670631 73673767 64281106 56252569
55926E6252569o860827n877456n050066m335800l718859l204802k779269k411505
$$ 56252569 49391742 43514286 38464220 34128420 30409561 27204759 24425490 22013985
55918B2013985k091710j827725j610427j416658j241402j095401r75196q64852
$$ 22013985 19922275 18094550 16484123 15067465 13826063 12730662 11755466 10890614
55910A0890614p63177o81425o17287n56866m99237m54659m21357l87140l51521
$$ 10890614 10127437 9446012 8828725 8271859 7772622 7317963 6896606 6509466 6157945
55901F157945l24354l04822k82575k57597k39050k26197k09614j89749j75899
$$ 6157945 5833591 5528769 5246194 4988597 4749547 4523350 4313736 4123987 3948088
55892C948088j68037j57147j42597j32363j26785j18208j06178r7665r2735q4690
$$ 3948088 3780051 3622904 3480307 3347944 3221159 3102951 2996773 2899108 2806373 2721683
55882B721683p3891o7179o4139n7936m9373m6481n0205n3468n4309n7306o2062
$$ 2721683 2647792 2580613 2516474 2458538 2409165 2362684 2312479 2259011 2204702 2147396 2085334
55871B085334o2844o0012n9816o2484o1959n7659n5103n4567n0443m2551l7182
$$ 2085334 2022490 1962478 1902662 1840178 1778219 1720560 1665457 1610890 1560447 1517896 1480714
55860A480714l6008l4367l1445l1885l6089l8696l7913l7329l7502l4911l0071
$$ 1480714 1444706 1410339 1378894 1347009 1310920 1272224 1234311 1196982 1159480 1124569 1094498
55849A094498k7849k8668k7986k5172k4365k5815k5056k1614k0039k1166k0652
$$ 1094498 1066649 1037981 1009995 984823 960458 934643 909587 887973 867934 846768 826116
55838H26116j7405j5399j5795j5105j2526j1460j2348j1548q667p731r583j0326
$$ 826116 808711 793312 777517 762412 749886 738426 726078 714530 705863 698132 688549 678223
55826F78223q746q215r714r968q170p799r935j1202j0138r426j0138r786p792
$$ 678223 669477 661262 651548 641580 633410 625611 615676 604474 594336 584910 574772 564986 557194
55813E57194o943p816p413m894l108l059k357m09M24n3R08L482M547L590L729
$$ 557194 550251 542435 535022 530128 527020 523961 521604 521195 521619 521566 522474 525956 530503 534093 537822
55798E37822N655O296M799M098M973M231O27k741l909m759o508p368o600o172
$$ 537822 543477 549773 554572 558670 563643 567874 568501 565760 561851 557092 550584 543216 536616 530444
55784E30444o670o098m211l525m664n324n020o077q626r455p249m223j266L454
$$ 530444 523774 517676 513465 509940 505276 499952 494932 488855 480229 470774 463525 459302 458036 461490
55770D61490R667J3871J4761J4773J4503J0691K050p669j4750j9327k2148k2114
$$ 461490 471157 485028 499789 514562 529065 539756 541806 534137 519387 500060 477912 455798
55758D55798j9444j6992j6059j4664j1921j0099j0323j0399q962p834q101p848
$$ 455798 436354 419362 403303 388639 376718 366619 356296 345897 336935 329101 321000 313152
55746C13152o065m811n360n903n237m902n566n194l121k008l353m683l784k124
$$ 313152 307087 302276 296916 291013 285776 280874 275308 270114 266993 264985 261632 256949 253165 251041
55732B51041j624j429n03r3j061j871j594j822l329m016k609j266j983l334l276
$$ 251041 249417 247988 247485 247392 246331 244460 242866 241044 237715 233699 231090 229824 227841 224507 221231
55717B21231k405j934j201M26J682J680J654K374K501J411R05K055L027K150M65
$$ 221231 218826 216892 215691 216117 217799 219479 221133 223507 226008 227419 228324 230379 233406 235556 236021
55702B36021o79j842l366l913l101k879m219n268m715l988m086l442j281Q6j003
$$ 236021 235342 233500 230134 226221 223120 220241 216022 210754 206039 202051 197965 194523 193242 193328 192325
55687A92325k513k058n58J57O45J921K854K384J980L014L984L180J828J722J976
$$ 192325 189812 187754 187196 187353 187998 189919 192773 195157 197137 200151 204135 207315 209143 210865 212841
55672B12841J039j55p3L34n92k043k316j843j948k112j240j18mj75N38J296R16
$$ 212841 213880 213725 213652 213986 213394 211351 209035 207192 205244 203132 201892 201774 201770 201595 202133 203429 204345
55655B04345L72J120K327K362J649J467J319J40j151r72J69P02O33P67M54j303
$$ 204345 204717 205837 208164 210526 212175 213642 214961 215101 213950 212978 213147 213849 214482 215249 215703 214400
55639B14400l521m485m495n059o115o378n723n064m554l758k992k717k357j373
$$ 214400 210879 206394 201899 196840 190725 184347 178624 173560 169006 165248 162256 159539 157182 155809
55625A55809n79q45j510j550j154p77k5J038J090k71j326q89l48j144k195j969
$$ 155809 155230 154385 152875 151325 150171 149394 149369 150407 151497 151226 149900 149011 148663 147519 145324 143355
55609A43355j242j367j641r50l21j066k010j399j31j09p03j3J423J385k08j327
$$ 143355 142113 140746 139105 138155 137834 136768 134758 133359 133228 133119 132416 132403 133826 135211 135003 133676
55593A33676j260j114j247r37m49q38j743j796r61l10K02J417K789K879J865J329
$$ 133676 132416 131302 130055 129118 128669 127831 126088 124292 123331 123021 123223 124640 127429 130308 132173 133502
55577A33502J697K034K199L002M306N066N236N716O505O742O435O284N998M638
$$ 133502 135199 137233 139432 142434 146740 151806 157042 162758 169263 176005 182440 188724 194722 199360
55563A99360K443N90o88j960k966k989k546k901m041m901n293n814o187n530m088
$$ 199360 201803 202393 201705 199745 196779 193790 191244 188343 184302 179401 174108 168294 162107 156577 152489
55548A52489l014k555k100j614j432j081p0O92P6j140j255l17J77j78m74m82p55
$$ 152489 149475 146920 144820 143206 141774 140693 140623 141315 141391 140251 138996 138679 138856 138678 138204 137722 136967
55531A36967r97m07M64K17j030j832j835k028k586k590j953j686j999j988j444
$$ 136967 135970 135563 136027 136244 135214 133382 131547 129519 126933 124343 122390 120704 118705 116717 115273
55516A15273j197j433j411j062j160j692j690r65m20m77o46q08j360j978j743
$$ 115273 114076 112643 111232 110170 109010 107318 105628 104663 104243 103766 103120 102312 100952 98974 97231
55501I7231p22K8J02Q8K57L44M92J024J396Q38r2k31J85j35j237j791j234l93
$$ 97231 96509 96537 96639 96727 96984 97328 97820 98844 100240 101078 100986 100755 100940 100805 99568 97777 96543 96150
55483I6150J53O45R90O92J08K28J040J534J396J248J213P80P4k21k12n57r86o63
$$ 96150 96303 96948 97938 98630 98738 98966 100006 101540 102936 104184 105397 106177 106251 106030 105818 105261 104275 103612
55465A03612P8P0p23j167r15o83o91m66j73m27q88p51m40r37j736j490m75j21
$$ 103612 103690 103760 103037 101870 100955 100272 99581 99115 98942 98515 97627 96876 96436 95499 93763 92273 91798 91677
55447I1677k76N34K020K145O55j72P83J644O81j058j749j388r45n34N4L59J20
$$ 91677 91401 91935 93955 96100 96755 96583 97366 99010 99691 98633 96884 95496 94551 94017 94071 94430 94550
55430I4550k9K94M61J21j9M73R26P84M46J92l38r01m68R40J716J013J30M59J409
$$ 94550 94521 94815 95276 95397 95378 95851 96777 97561 98007 98199 97861 96960 96492 97432 99148 100161 100291 100750 102159
55411A02159J647J142P03M56R5j63J6K74R8l80q27j329j958k353k232j700q34
$$ 102159 103806 104948 105651 106107 106202 106039 106055 106329 106427 106047 105220 103891 101933 99580 97348 95648 94814
55394I4814K80R58N22l31o4J414K384J758M89j41k06k74k02K11M13j0n17n18k94
$$ 94814 95094 96052 96574 96243 96179 97593 99977 101735 102224 102083 101877 101603 101401 101612 102025 102015 101498 100980 100686
55375A00686l29n09o42q91j178j058o79q32j547j756q79L14J014J327J388Q00
$$ 100686 100357 99848 99206 98315 97137 96079 95400 94568 93021 91265 90386 90700 91714 93041 94429 95229
55359I5229l32j008p61l50l52l01M8o3r58j633j291n74k65Q4J003J757J398L52
$$ 95229 94897 93889 93128 92778 92426 92125 92173 92110 91152 89519 88228 87654 87389 87473 88476 90233 91631 91983
55341I1983l62o35q50p07K18J327J607J042M41K35K81M10M04q3q96j190n16M36
$$ 91983 91621 90986 90136 89429 89647 90974 92581 93623 94064 94299 94580 94990 95394 95311 94415 93225 92709 93145
55323I3145Q00O52N19M70L01J58J98K00k0k47l23l71l23M7M10J24n54o00J03N35
$$ 93145 93945 94597 95116 95586 95887 96045 96243 96443 96423 96176 95853 95482 95159 95206 95616 95740 95186 94586 94689 95224
55303I5224L26L82J100J415N86m40n24J0K72K32J97q6o67p55l4M52j20q88p16
$$ 95224 95550 95932 97032 98447 99033 98593 98069 98079 98351 98583 98780 98694 98027 97272 97238 97690 97570 96682 95966
55284I5966p9r1n37l87L50P85P28P19P52K75p09j550j834j594j008m93n65r73
$$ 95966 95887 95796 95259 94872 95222 96007 96735 97454 98206 98481 97772 96222 94388 92794 91786 91293 90728 89755
55266H9755o99M91J417J231P35Q97J082K29j138j568q69r5K27L97M37O2l97l10
$$ 89755 89056 89547 90964 92195 92930 93827 94909 95138 94000 92432 91563 91468 91695 92092 92529 92591 92194 91884
55248I1884J06J28j67k6O59J167J030L87m83j163j014l4O02j10j466j883j008
$$ 91884 91990 92118 91951 91925 92584 93751 94781 95168 94685 93522 92508 92474 93076 92966 91500 89617 88609
55231H8609R5N17K52m17j079r84L00J994K843K568J826J017J24n79p39o95j017
$$ 88609 88704 89221 89473 89056 87977 86993 87293 89287 92130 94698 96524 97541 97665 97086 96347 95652 94635
55214I4635j408j078j03O20O86N18M37L38K38L13L38o3o61p87k56N85J433K058
$$ 94635 93227 92149 92046 92666 93352 93870 94307 94645 94883 95196 95534 95471 94810 94023 93767 94352 95785 97843
55196I7843K013J194L67K72M63p3j285k028j612n06M77R45R15O66N48M68j09j142
$$ 97843 99856 101050 101417 101689 102152 102079 100794 98766 97154 96648 97125 98070 98985 99651 100199 100667 100558 99416
55178I9416j616r06J10L18P0M49J267J308L59m12k38L51O37O15M97L15K57N80
$$ 99416 97800 96894 97004 97322 97392 97841 99108 100416 100775 100363 100125 100476 101113 101728 102225 102540 102797 103377
55160A03377R14N03o25j473j328n74j0M5k64o75r38q94n44Q2R18J512J178l3j025
$$ 103377 104291 104794 104169 102696 101368 100794 100784 100829 100565 99890 98952 98058 97514 97596 98514 100026 101204 101171 100146
55141A00146r10j36L01L09M85R52J256J206R25L48n38j222j215q03n09k72J03
$$ 100146 99236 99100 99401 99710 100195 101147 102403 103609 104534 104882 104344 103122 101907 101104 100595 100323 100426
55124A00426J85l72q56l83O25R75M77j7j45l59p85r40o42k16K63R41J508J491
$$ 100426 100611 100239 99383 99000 99625 100600 101077 101060 100915 100556 99771 98831 98189 97973 98236 99177 100685 102176
55106A02176J122J005J048P23K05J40M12L04k01l99j31O4O8L18P71Q62N09J61
$$ 102176 103298 104303 105351 106074 106279 106419 106831 107135 106934 106535 106404 106468 106536 106854 107625 108487 108996 109157
55088A09157j72q72j683j835j227n09j9K99J63n94j056k34J026Q19r56k172j432
$$ 109157 108985 108113 106430 104595 103368 102859 102840 103139 103302 102708 101652 101418 102444 103263 102307 100135 98703
55071I8703J79R51P37M16L63L73L40K16r8m49n41n09o60p04j78M18J70o05o53
$$ 98703 98882 99833 100570 100986 101349 101722 102062 102278 102180 101731 101190 100681 100021 99317 99139 99557 99727 99122 98469
55052I8469J48N77K18J29P78J053K40n70k13O86Q38K09l19m19k86P6N48M98k83
$$ 98469 98617 99194 99412 99541 100319 101372 101612 101042 100829 101515 102353 102562 102243 101824 101538 101614 102162 102660 102377
55033A02377q79m43N32R71P51N72P45R81J022Q08L08k14k30K33L79k32r25q75
$$ 102377 101498 101055 101587 102558 103309 103881 104626 105607 106629 107437 107745 107531 107301 107534 107913 107681 106756 105881
55015A05881k40L15O41R22J032P92M78M44N38N12N40Q55J218J267J026O12n7q45
$$ 105881 105641 105956 106597 107519 108551 109343 109821 110265 110803 111315 111855 112710 113928 115195 116221 116833 116776 115931
54997A15931j176p77j36J81K74M71O86O77N04L31J80J56L97N40m1j162j769j353
$$ 115931 114755 113978 113842 114023 114297 114768 115454 116131 116635 116966 117146 117302 117699 118239 118198 117036 115267 113914
54979A13914o17k92j39K26M49J61j70P8O90J141J410J570J206J43p86o69J85P32
$$ 113914 113297 113005 112866 113092 113541 113702 113532 113610 114300 115441 116851 118421 119627 119770 118984 118315 118500 119232
54961A19232O18L56L02L66M44M78K73j57l37kL35P9n44r06r01p94n46n8K47j27
$$ 119232 119850 120206 120508 120874 121318 121796 122069 121912 121575 121573 121908 121987 121443 120537 119636 118842 118296 118238 118485 118358
54941A18358q70j171q01k50M2M5j42l57l29J4K83J89J16O36J661K532K856K805
$$ 118358 117488 116317 115516 115266 115308 115353 115211 114854 114525 114539 114822 115011 115127 115763 117424 119956 122812 125617
54923A25617K700K696K763K788K841L358M686O317P140O635N361M011K679J284
$$ 125617 128317 131013 133776 136564 139405 142763 147449 153766 160906 167541 172902 176913 179592 180876
54909A80876J8j095k318l520m080l937l929m505m991m773m314m183l957l118k165
$$ 180876 180894 179799 177481 173961 169881 165944 162015 157510 152519 147746 143432 139249 135292 132174 130009
54894A30009j773j481n25O05P44q1o56l21M22R90J347J540J565J731K392L231
$$ 130009 128236 126755 126230 126835 127579 127498 126842 126521 126943 127933 129280 130820 132385 134116 136508 139739
54878A39739L584L388L186L271L526L908M378M593M399M259M415M049K262l85
$$ 139739 143323 146711 149897 153168 156694 160602 164980 169573 173972 178231 182646 186695 188957 188572
54864A88572k516l821n098o480o962o040m536l437k864k585k646k967l103k831
$$ 188572 186056 182235 177137 170657 163695 157655 153119 149682 146818 144233 141587 138620 135517 132686
54850A32686k449k191j985j943k354k909k764j723o29k00j89j61k68p10j006o29
$$ 132686 130237 128046 126061 124118 121764 118855 116091 114368 113739 113539 113350 113189 112921 112211 111205 110576
54834A10576J06M68L61K68L46K03l20p24m29M48J177J133L73n61j203j430j244
$$ 110576 110682 111150 111511 111779 112125 112328 112008 111284 110855 111303 112480 113613 113986 113425 112222 110792 109548
54817A09548o33K29R41J253J283J124N93l05r93q86j42N76R81J241J399J239Q11
$$ 109548 108915 109144 110085 111338 112621 113745 114338 114033 113040 112154 112012 112588 113569 114810 116209 117448 118259
54800A18259N29O17Q25Q05M61n7m58m05J27O46O08M2n88j012j284j370j046k89
$$ 118259 118788 119405 120230 121035 121496 121439 120981 120576 120703 121349 121957 121999 121411 120399 119115 117745 116699 116410
54782A16410N45J023R47M57LN5O76J458K061K526K867K860K561K581L278M087
$$ 116410 116955 117978 118925 119382 119385 119440 120116 121574 123635 126161 129028 131888 134449 137030 140308 144395
54766A44395M261M021M179M916N661O133O571O848O210M254J626o09j998k854
$$ 144395 148656 152677 156856 161772 167433 173566 180137 186985 193195 197449 199075 198466 196468 193614
54752A93614l711m750n659n981n671n189m853m409l523k443j722j548j705j991
$$ 193614 189903 185153 179494 173513 167842 162653 157800 153391 149868 147425 145703 144155 142450 140459
54738A40459k173j872j007j38K10L22P77J410J588J296J109J167J051Q03J117
$$ 140459 138286 136414 135407 135269 135479 135801 136578 137988 139576 140872 141981 143148 144199 145002 146119
54723A46119K233L399L859L817L984M572N148N208M619L632K581J490O1j760l464
$$ 146119 148352 151751 155610 159427 163411 167983 173131 178339 182958 186590 189171 190661 190722 188962 185498
54708A85498m514n016n361n448m908l903l093k778k687k597k485k178j509r25
$$ 185498 180984 175968 170607 165159 160251 156348 153255 150477 147790 145193 142708 140530 139021 138096
54694A38096j128j986k474j942q53J7M48N55L29j53m87l66m4N4j02j72K4K97K75
$$ 138096 136968 134982 132508 130566 129713 129730 130178 130733 131062 130909 130422 130056 130012 130066 129964 129792 129816 130113 130388
54675A30388k47j072j717j891j762j598j356q88l16J31M75P77P92L60j37j75J65
$$ 130388 130141 129069 127352 125461 123699 122101 120745 119857 119541 119672 120147 120924 121716 122076 121939 121764 121929
54658A21929L66K46j8l89q90j164q39k29K4p2M5M55O25L85K20M21O13M33L0k78
$$ 121929 122295 122541 122523 122134 121244 120080 119241 119012 119036 118964 119009 119464 120089 120474 120694 121115 121728 122161 122191 121913
54638A21913l14P3Q82J624J670J024K68l17q64j233r86k03M64P17Q93J135J035
$$ 121913 121599 121672 122554 124178 125848 126872 127140 126823 125959 124726 123740 123537 124001 124718 125611 126746 127781
54621A27781L96l26o98p55n80m3P06J081P43n9r58j667j688n68J165K156J713
$$ 127781 128177 127851 127153 126398 125818 125775 126481 127562 128305 128246 127288 125621 123933 123365 124530 126686 128399
54604A28399N15m38q80r44o14j2L88M44O61J333J917J794J183P09N08L11O9k5
$$ 128399 128914 128476 127596 126652 126038 126026 126414 126858 127519 128852 130769 132563 133746 134455 134963 135274 135343 135318
54586A35318Q7K79L86J83m18j034j102o11r9K03N34Q24N73j73o03l28j6k21l94
$$ 135318 135405 135684 136070 136253 135835 134801 133699 133088 132989 133192 133726 134550 135123 134950 134347 134019 134003 133782 133388
54567A33388K19J300J889J622Q86J09m01l57J60N05L04K0J93N08L77K2J31O56
$$ 133388 133607 134907 136796 138418 139304 139413 139012 138655 138815 139320 139624 139644 139837 140345 140722 140744 140875 141531
54549A41531Q37M06MK22Q87J389J361Q51J85k08r1L98Q82J044P62J69k93k31K09
$$ 141531 142368 142774 142778 143000 143887 145276 146637 147488 147673 147465 147374 147772 148654 149698 150460 150629 150336 150105 150314
54530A50314M75L78K79L86L37j77q51j185j057n68K36J085J433J142P91Q19P64
$$ 150314 150789 151167 151446 151832 152169 151992 151141 149956 148899 148331 148567 149652 151085 152227 153018 153837 154601
54513A54601J3j035j357o74K25N34J96m01r73j299j111l91L60M82p3n35j33R08
$$ 154601 154614 153579 152222 151548 151773 152307 152503 152102 151129 149830 148719 148328 148688 149170 149097 148562 148429 149337
54495A49337J529J140L17j23j83k79k76J86P50P58M34O08J236J437J066R55J306
$$ 149337 150866 152006 152323 152200 152017 151738 151462 151648 152398 153156 153590 154198 155434 156871 157937 158892 160198
54478A60198J221M31R0R68K079K208J762J891K544K749K264J715J390J093R09
$$ 160198 161419 161850 161940 162908 164987 167195 168957 170848 173392 176141 178405 180120 181510 182603 183512
54463A83512J098J377J196O20J79K8M4M10J219J819J401J81r27j562k042k425
$$ 183512 184610 185987 187183 187803 187982 188010 188054 188464 189683 191502 192903 193084 192157 190595 188553 186128
54447A86128k374j924j544j393j233j065j136j301j123o21k85k60j85J30L68J77
$$ 186128 183754 181830 180286 178893 177660 176595 175459 174158 173035 172414 172129 171869 171684 171814 172182 172359
54431A72359m63j263j719j335k18P70Q53J45p62j550k008j688n18O62R69N84K82
$$ 172359 171896 170633 168914 167579 167361 168131 168984 169129 168367 166817 164809 163121 162603 163265 164234 164818 165100
54414A65100J79j60o53p41l64oJ24J86J42j06j45M21J097J067M81K15M25M65J88
$$ 165100 165279 165119 164466 163725 163361 163355 163479 163665 163807 163701 163556 163977 165074 166141 166622 166837 167262 167727 167915
54395A67915J78O18R93J197J758K614K753J609n5j182j590j612j366q74m13j47
$$ 167915 168093 168711 169704 170901 172659 175273 178026 179635 179580 178398 176808 175196 173830 172956 172543 172396
54379A72396J33N28P07L39m17j105j281p00L92J123Q13j39p35o07q2P57K030L125
$$ 172396 172529 173057 173764 174103 173686 172581 171300 170600 170992 172115 172928 172789 172054 171447 171365 172122 174152 177277
54361A77277L047J909Q90M25k92j471j851o55Q30R12j02n59J1M89J36m66o24n48
$$ 177277 180324 182233 183123 183548 183256 181785 179934 179279 180109 181021 180919 180360 180371 180860 180996 180530 179906 179358
54343A79358o70q33p37o58j145k200l200l555l145k198j034j0N02L76j14n38p47
$$ 179358 178688 177855 177118 176460 175315 173115 169915 166360 163215 161017 159983 159973 160475 160851 160737 160199 159452
54326A59452q29o61M3J059J474P17o11j413j416j200j044o11K02P88O18ll30q3
$$ 159452 158623 157962 158005 159064 160538 161255 160644 159231 157815 156615 155571 154960 155162 155950 156568 156565 156235 156152
54308A56152L13K67l86j188j473j064m24j2K38M99N45J72k12j19J79N0l94m38
$$ 156152 156465 156732 156346 155158 153685 152621 152197 152185 152423 152922 153467 153639 153427 153308 153487 153537 153143 152705
54290A52705R1O26Q29Q95Q19K54o32j025n03M00R43R38N03j72o52m75J65N56M50
$$ 152705 152796 153422 154251 155146 155965 156219 155587 154562 154059 154459 155402 156340 156843 156671 156019 155544 155709 156265 156715
54271A56715K68K01l5m46n43k38l3l1L15J062J346P19n0j38K06M12O42J147J381
$$ 156715 156983 157184 157149 156703 156160 155922 155889 155858 156173 157235 158581 159300 159250 159112 159318 159730 160372 161519 162900
54252A62900P73j12k87J92M58K04j20l24o79j109j164r28j074j749k110j379N1
$$ 162900 163673 163561 163274 163466 163924 164128 164008 163684 163005 161896 160732 159804 158730 156981 154871 153492 153543
54235A53543J051J096Q08J087J869K116J115m57j253q40l3L43K74M4k96n90m54
$$ 153543 154594 155690 156498 157585 159454 161570 162685 162228 160975 160135 160102 160445 160719 160763 160467 159877 159423
54218A59423Q4M38L99N10R89J026k9j464k053j669j082o03M0O43N06l82j034p09
$$ 159423 159507 159945 160344 160854 161843 162869 162840 161376 159323 157654 156572 155969 156009 156652 157158 156776 155742 155033
54200A55033J80P23N89J45j57j65l0L4o3k74n76r24j087q01k05K41L75M31M25
$$ 155033 155213 155936 156525 156670 156513 156348 156318 156352 156289 156015 155439 154515 153428 152627 152422 152663 153038 153469 153894
54181A53894L8n80o45J62J018J072N67K42J22j40k39L87J364J652J026L15J8l45
$$ 153894 153932 153352 152707 152869 153887 154959 155526 155768 155890 155750 155511 155898 157262 158914 159940 160255 160273 159928
54163A59928j261k354k927k759k055j110l45j97o00q93n48J91O62N29O0k57j92
$$ 159928 158667 156313 153386 150627 148572 147462 147117 146920 146320 145427 144879 145070 145732 146261 146321 146064 145872
54146A45872P8K59L70O85J163J279O98j36n06k89N5J97K24L12N47R62J340J195
$$ 145872 145950 146209 146579 147264 148427 149706 150404 150268 149762 149473 149528 149725 149949 150261 150808 151770 153110 154305
54128A54305L81m41m55K20O96N14J46K27P78J337J493J202Q68J019J626J912J281
$$ 154305 154686 154245 153790 154010 154706 155220 155366 155593 156371 157708 159201 160403 161271 162290 163916 165828 167109
54111A67109K67o2M91J099J182J104J403J991K425K507K311J959J623J428J256
$$ 167109 167376 167314 167805 168904 170086 171190 172593 174584 177009 179516 181827 183786 185409 186837 188093
54096A88093R28N76M00M1j097k739l630k995j540n61m34n28l08R7K84R0k83l38
$$ 188093 189021 189597 189997 190038 188941 186202 182572 179577 178037 177476 177042 176514 176206 176303 176587 176677 176394 176056
54078A76056L74J673K652K517J447L78n6rP3M4P6L22O79Q67O33R7k86k35q2l80
$$ 176056 176430 178103 180755 183272 184719 185097 185041 185032 185105 185149 185225 185547 186226 187093 187726 187823 187537 187302 187220 186840
54058A86840j138j683j511q76l60j14J48N27P81P85Q02J174J965K988L909M265
$$ 186840 185702 184019 182508 181632 181272 181158 181306 181833 182614 183399 184201 185375 187340 190328 194237 198502
54042A98502L786K896K484K841L264L139K980L704N123O001N732N109N107N564
$$ 198502 202288 205184 207668 210509 213773 216912 219892 223596 228719 234720 240452 245561 250668 256232
54028B56232N532M572L256K535K816L540L626K542R89J14J34K76N7j63j13l09
$$ 256232 261764 266336 269592 272127 274943 278483 282109 284651 285640 285754 285888 286164 286221 286058 285945 285636
54012B85636j267k633l689m304m765n087n090m897m730m467l903l312l131l297
$$ 285636 284369 281736 278047 273743 268978 263891 258801 253904 249174 244707 240804 237492 234361 231064
53998B31064l345l092k780k647k704k863k885k456j603q47o19p52q77r57j026
$$ 231064 227719 224627 221847 219200 216496 213633 210748 208292 206689 205842 205223 204471 203594 202637 201611
53983B01611q37k75J95J20k24k40P6K69K09J27Q0K6K35R93J984K637K945L327
$$ 201611 200774 200499 200694 200814 200590 200350 200426 200695 200904 201031 201111 201137 201372 202365 204349 206986 209931 213258
53965B13258L833M150M309M618M949M734L737K188K52j880l439l529k357j241
$$ 213258 217091 221241 225550 230168 235117 239851 243588 245776 246028 244148 240709 237180 234823 233582
53951B33582j105j567j731j302n01N10J647K701L421L737L736L646L793M271M694
$$ 233582 232477 230910 229179 227877 227376 227886 229533 232234 235655 239392 243128 246774 250567 254838 259532
53936B59532M608M098L615L294K869K262J735J476J366J237J008P22P12J488K995
$$ 259532 264140 268238 271853 275147 278016 280278 282013 283489 284855 286092 287100 287822 288534 290022 293017
53921B93017M316M711M625M963N703O099O025O087O442O576O362O317O559O481
$$ 293017 297333 302044 306669 311632 317335 323434 329459 335546 341988 348564 354926 361243 367802 374283
53907C74283N802N012M360L378J816L08n55j032j581k032k078k052k489l337m106
$$ 374283 380085 385097 389457 392835 394651 394959 394404 393372 391791 389759 387681 385629 383140 379803 375697
53892C75697m616n073n674o442p294q026q456q632q595q029o705n267m718n013
$$ 375697 371081 366008 360334 353892 346598 338572 330116 321484 312889 304860 298155 292888 288170 283157
53878B83157n029m237l524l724m243l942k827j973k044k605k850k530k124k274
$$ 283157 278128 273891 270367 266643 262400 258458 255631 253658 251614 249009 246159 243629 241505 239231
53864B39231l020l565l156k129j527j691j937j777j601j804k059j959j709j632
$$ 239231 236211 232646 229490 227361 225834 224143 222206 220429 218828 217024 214965 213006 211297 209665
53850B09665j575j347j141j050p35n8N44P48P43N80j14j255j925j611r77p23m91
$$ 209665 208090 206743 205602 204552 203817 203759 204303 205051 205794 206374 206260 205005 203080 201469 200492 199769 199278
53833A99278J63O47K88k94o7O44O36k06p61m34J43K41r6m52m27L78J888L135L170
$$ 199278 199441 200088 200376 200082 200015 200659 201295 201089 200328 199894 200037 200278 200182 199730 199303 199681 201569 204704 207874
53814B07874K400K013K210K110J429J024J412J975K175K511L588M984N905O248
$$ 207874 210274 212287 214497 216607 218036 219060 220472 222447 224622 227133 230721 235705 241610 247858
53800B47858O342O074N236M365M381N261N815N012L186J595J009J090J135J068
$$ 247858 254200 260274 265510 269875 274256 279517 285332 290344 293530 295125 296134 297224 298359 299427
53786B99427J286J795K025J689J203Q92L45q55k245l057l386l954m830n263m923
$$ 299427 300713 302508 304533 306222 307425 308317 308662 307807 305562 302505 299119 295165 290335 285072 280149
53771B80149m430m371m518m407m163m225m603m818m490l639k595j728j205q95
$$ 280149 275719 271348 266830 262423 258260 254035 249432 244614 240124 236485 233890 232162 230957 230062
53757B30062o12m16m94p94j021r88p58m51k04k48p60j517j994j855j241n95l24
$$ 230062 229450 229034 228540 227746 226725 225737 224979 224528 224324 224076 223316 221799 219805 217950 216709 216114 215790
53740B15790m45n19j18M96N84Km79k70J38M9k92j48M08O98O88J042J889K484K318
$$ 215790 215345 214826 214708 215204 215788 215790 215311 215041 215179 215228 214936 214788 215196 215894 216582 217624 219513 221997 224315
53721B24315J706J120P20O99J228J873J830J182J001J782K623K570K022K012K630
$$ 224315 226021 227141 227861 228560 229788 231661 233491 234673 235674 237456 240079 242649 244671 246683 249313
53706B49313L009K664K044J816K114K534K592K215J920K323L336M174M375M362
$$ 249313 252322 254986 257030 258846 260960 263494 266086 268301 270221 272544 275880 280054 284429 288791
53692B88791M632M921M601L662K696K013J330L53o71j172q90k58r2p58j706k082
$$ 288791 293423 298344 302945 306607 309303 311316 312646 312999 312328 311156 310266 310008 309916 309158 307452 305370
53676C05370j759j340j150p74J11J049J354J024N86L52K45J91K23K24o6p49j601
$$ 305370 303611 302271 301121 300347 300458 301507 302861 303885 304471 304823 305068 305259 305482 305706 305640 304891 303290
53659C03290k157j934q38N12J217J001L98q3n25j106j568j581j218o51K41J394
$$ 303290 301133 299199 298361 298873 300090 301091 301489 301406 300881 299775 298207 296626 295408 294757 294998 296392
53643B96392K158K002J393J298J868K274J850Q66Q6PO42J618K396K635K485K317
$$ 296392 298550 300552 301945 303243 305111 307385 309235 310101 310187 310194 310836 312454 314850 317485 319970 322287
53627C22287K355K674L323M018M066L180K141K010K724L210K929K535K739L269
$$ 322287 324642 327316 330639 334657 338723 341903 344044 346054 348778 351988 354917 357452 360191 363460
53613C63460L430L108K763K676K776L038L594M458N344N708N054L477K025J970
$$ 363460 366890 369998 372761 375437 378213 381251 384845 389303 394647 400355 405409 408886 410911 412881
53599D12881L351M591M036J759n68j423p25M97J124O51o38j898k390k124j777
$$ 412881 416232 420823 424859 426618 426050 424627 423902 424399 425523 426174 425536 423638 421248 419124 417347
53584D17347j893k373k770k857k635k071j133j24K87l81j842l148l519l075k613
$$ 417347 415454 413081 410311 407454 404819 402748 401615 401491 401778 401397 399555 396407 392888 389813 387200
53569C87200k656k913k796k240j700j419j148o32LM99Q51J105J040M10n51j208
$$ 387200 384544 381631 378835 376595 374895 373476 372328 371696 371699 372198 373049 374154 375194 375604 375053 373845
53553C73845j095k44R90K085K475J920Q70J79L01J015J938K927L850M402M516
$$ 373845 372750 372506 373496 375581 378056 379976 380846 381025 381326 382341 384279 387206 391056 395458 399974
53538C99974M613N083N712O048O159O540P382Q359R158R776J0240J0511J0820
$$ 399974 404587 409670 415382 421430 427589 434129 441511 449870 459028 468804 479044 489555 500375
53525E00375J1625J2984J4282J4943J5077J5187J5485J5910J6615J7935J9756
$$ 500375 512000 524984 539266 554209 569286 584473 599958 615868 632483 650418 670174
53514F70174K1391K2255K2536K2965K4102K5847K7542K8475K8434K7890K7599
$$ 670174 691565 713820 736356 759321 783423 809270 836812 865287 893721 921611 949210
53503I49210K7925K8610K9204K9514K9585K9445K9106K8638K8020K7003K5429
$$ 949210 977135 1005745 1034949 1064463 1094048 1123493 1152599 1181237 1209257 1236260 1261689
53492A261689K3692K2471K1909K1379K0362J9182J8525J8426J8311J7962J7848
$$ 1261689 1285381 1307852 1329761 1351140 1371502 1390684 1409209 1427635 1445946 1463908 1481756
53481A481756J8294J8831J8758J8079J7420J7118J6694J5327J2635R038N439K530
$$ 1481756 1500050 1518881 1537639 1555718 1573138 1590256 1606950 1622277 1634912 1643950 1649389 1651919
53469A651919K49k021m651p337r602j1503j3547j5909j8076j9374j9731j9801
$$ 1651919 1652168 1650147 1645496 1638159 1628557 1617054 1603507 1587598 1569522 1550148 1530417 1510616
53457A510616k0413k1842k3667k5275k6435k7203k7474k7022k6126k5582k5779
$$ 1510616 1490203 1468361 1444694 1419419 1392984 1365781 1338307 1311285 1285159 1259577 1233798
53446A233798k6149k5935k5167k4331k3391k1835j9623j7303j5129j2726r954
$$ 1233798 1207649 1181714 1156547 1132216 1108825 1086990 1067367 1050064 1034935 1022209 1012255
53435A012255p397n624m386l087j648l38R46K622M684O601Q048R359J1024J3068
$$ 1012255 1004858 999234 994848 991761 990113 989775 990721 993343 998027 1004628 1012676 1022035 1033059 1046127
53421A046127J5131J6994J8757K0546K2281K3783K5049K6276K7629K9047L0399
$$ 1046127 1061258 1078252 1097009 1117555 1139836 1163619 1188668 1214944 1242573 1271620 1302019
53410A302019L1808L3646L6106L8866M1385M3476M5460M7657M9915N1819N3314
$$ 1302019 1333827 1367473 1403579 1442445 1483830 1527306 1572766 1620423 1670338 1722157 1775471
53399A775471N4880N6924N9178O0942O1964O2754O3976O5688O7320O8253O8210
$$ 1775471 1830351 1887275 1946453 2007395 2069359 2132113 2196089 2261777 2329097 2397350 2465560
53388B465560O7241O5540O3345O0873N8326N5949N3948N2230N0338M7846M4759
$$ 2465560 2532801 2598341 2661686 2722559 2780885 2836834 2890782 2943012 2993350 3041196 3085955
53377C085955M1395L7909L4153K9974K5444K0705J5687R995L106n211j4611k4401
$$ 3085955 3127350 3165259 3199412 3229386 3254830 3275535 3291222 3301217 3304323 3299112 3284501 3260100
53365C260100l4058m3313n1667n8274o2621o5144o6781o8034o8818o9103o9211
$$ 3260100 3226042 3182729 3131062 3072788 3010167 2945023 2878242 2810208 2741390 2672287 2603076
53354B603076o9397o9435o8804o7153o4669o2138o0545o0221o0419o0044n8776
$$ 2603076 2533679 2464244 2395440 2328287 2263618 2201480 2140935 2080714 2020295 1960251 1901475
53343A901475n7191n5793n4335n2210m9219m5805m2683m0205l7959l5077l1257
$$ 1901475 1844284 1788491 1734156 1681946 1632727 1586922 1544239 1504034 1466075 1430998 1399741
53332A399741k7246k4018k1565j9135j6553j4605j3931j4156j4442j4378j3970
$$ 1399741 1372495 1348477 1326912 1307777 1291224 1276619 1262688 1248532 1234090 1219712 1205742
53321A205742j3235j2232j1167j0050q553o619m873l904l352k304m92J398K708
$$ 1205742 1192507 1180275 1169108 1159058 1150505 1143886 1139013 1135109 1131757 1129453 1128961 1130359 1133067
53308A133067L619M789O517Q502J0295J1753J3069J4491J6077J7721J9352K0991
$$ 1133067 1136686 1141475 1147992 1156494 1166789 1178542 1191611 1206102 1222179 1239900 1259252 1280243
53296A280243K2657K4348K6144K8154L0255L2023L3088L3440L3285L2734L1744
$$ 1280243 1302900 1327248 1353392 1381546 1411801 1443824 1476912 1510352 1543637 1576371 1608115
53285A608115L0384K8917K7611K6422K4967K2887K0206J7249J4170J0788P018
$$ 1608115 1638499 1667416 1695027 1721449 1746416 1769303 1789509 1806758 1820928 1831716 1838734
53274A838734L217j15k889n404p963j0817j4369j8869k3881k8412l1759l4028
$$ 1838734 1841951 1841836 1838947 1833543 1825580 1814763 1800394 1781525 1757644 1729232 1697473 1663445
53262A663445l5751l7297l8628l9423l9386l8699l8023l7776l7519l6559l5063
$$ 1663445 1627694 1590397 1551769 1512346 1472960 1434261 1396238 1358462 1320943 1284384 1249321
53251A249321l3920l3462l3061l2255l1522l1532l2130l2624l2701l2541l2308
$$ 1249321 1215401 1181939 1148878 1116623 1085101 1053569 1021439 988815 956114 923573 891265
53240H91265l1988l1556l0868k9556k7433k4804k2123j9478j6816j4386j2596
$$ 891265 859277 827721 796853 767297 739864 715060 692937 673459 656643 642257 629661
53229F29661j1442j0553r709r073q847q976r218r374r540j0061j1101j2218j2674
$$ 629661 618219 607666 597957 588884 580037 571061 561843 552469 542929 532868 521767 509549 496875
53216D96875j2286j1608j1143j0783j0219r457q625p692o846o695p442q212p882
$$ 496875 484589 472981 461838 451055 440836 431379 422754 415062 408216 401521 394079 385867 377985
53203C77985o549n511n647o412o674o136n520n585o286p032p422p478p163o164
$$ 377985 371436 365925 360278 353866 347192 341056 335536 329951 323665 316633 309211 301733 294570 288406
53189B88406m508l057k692l105l085k156j146q78j075j135j186j616k125k167
$$ 288406 283898 280841 278149 275044 271959 269803 268657 267779 266704 265569 264383 262767 260642 258475
53175B58475j972k171k617k528j787j189j212j419j324j070r06o67k50k7k24l56
$$ 258475 256503 254332 251715 249187 247400 246211 244999 243580 242256 241186 240280 239613 239363 239336 239112 238756
53159B38756J42R46J186O37rj77j78n41j012p46M39J554J524M51o61j199j421
$$ 238756 238898 239844 241030 241667 241658 241481 241303 240762 239750 239004 239443 240997 242521 242972 242311 241112 239691
53142B39691j643j617j034j16O54J071J180J034Q28Q76J083Q31j76j248j488q88
$$ 239691 238048 236431 235397 235281 235935 237006 238186 239220 240048 240924 242007 242838 242662 241414 239926 239038
53126B39038j22M85J055J432J220N88L24P85J446J731J821K153K544K344J360
$$ 239038 238916 239401 240456 241888 243108 243696 244020 244805 246251 247982 249803 251956 254500 256844 258204
53111B58204K45k09KR3n52j632k355k463k382k407k324k041j958k275k419j798
$$ 258204 258449 258240 258242 258335 257783 256151 253796 251333 248951 246544 244220 242179 240221 237946 235527 233729
53095B33729p27NJ72J27O5l5LK80L65j48p77o84L1M89M05L78O14M60m13j245j232
$$ 233729 233002 233007 233179 233306 233371 233336 233339 233619 233984 233836 233059 232375 232406 232895 233300 233678 234292 234752 234339 233094 231862
53074B31862o21j94j64k18j91j76k07l40p26j272j500j172p38p44j049j082o56
$$ 231862 231241 231047 230883 230665 230474 230298 230091 229751 229025 227753 226253 225081 224343 223599 222550 221468 220812
53057B20812j60L1r3l21m41l14Q5O09J080J379J408J150P55M46J62l78j191j800
$$ 220812 220652 220683 220590 220269 219828 219514 219599 220208 221288 222667 224075 225225 225980 226426 226588 226210 225019 223219
53039B23219j694r19p1K94J62l1J5P4k31o68n25L19R51N49m73j064r33o31m89
$$ 223219 221525 220606 220535 220829 220991 220960 220975 221049 220818 220150 219625 219944 220895 221444 220971 219907 218974 218343 217854
53020B17854l40k29m12o03j48Q66J591J673J639J721J439P34M60R65J209K89j042
$$ 217854 217514 217285 216873 216270 216122 216988 218579 220252 221891 223612 225051 225785 226245 227210 228419 228708 227666
53003B27666j426q91n30o30m46K75P77N14j13n24o42n23o3N32P16M57N63J568
$$ 227666 226240 225349 224819 224189 223743 224018 224795 225309 225196 224672 224030 223507 223444 223976 224692 225149 225712 227280
52985B27280K760K965K035R68O28Q98J217J436J765K163K235J785J102N52J33
$$ 227280 230040 233005 235040 236008 236636 237534 238751 240187 241952 244115 246350 248135 249237 249789 249922
52970B49922l15o53n77j21K86L45J54m9r9J41O75J211J403J343J314J052q6j975
$$ 249922 249607 248954 248377 248256 248542 248887 249041 248992 248893 249034 249709 250920 252323 253666 254980 256032 255946 253971
52952B53971l380l336k382j760j770j679j117o41p77j160j136p37n54q20j102
$$ 253971 250591 247255 244873 243113 241343 239664 238547 237906 237129 235969 234833 234096 233542 232722 231620
52937B31620r78o17m40m51k66J74M18J55k68l50j02K00N45R22Q21j38j212j115
$$ 231620 230642 230025 229585 229134 228868 229042 229460 229615 229347 228997 228895 229095 229640 230562 231383 231245 230033 228918
52919B28918J85J161O75n90j268j118r02r88r23l81L35P23O17K20o1O9M25M62
$$ 228918 229103 230264 230939 230349 229081 227963 227061 226073 225150 224769 225104 225827 226444 226664 226603 226672 227097 227559
52901B27559J2m48n00l64l62k85J95P74Q72M34j36o07r17p70J0Q70J023M80K3
$$ 227559 227571 227123 226623 226259 225897 225612 225807 226581 227453 227887 227751 227144 226227 225457 225467 226337 227360 227840 227863
52882B27863J25N44Q90R60N36l55r71m47R65J958J772J091R93J591K185K287J972
$$ 227863 227988 228532 229422 230382 230918 230563 229592 229145 230110 232068 233840 234931 235924 237515 239700 241987 243959
52865B43959J477R43M84K16K74P50J485J894J412J95r89j710k281l027l641l627
$$ 243959 245436 246379 246863 247079 247353 248103 249588 251482 252894 253089 252100 250390 248109 245082 241441 237814
52849B37814l080k523k217j972j639j336j170r81o08k41l51j068j802j790j064
$$ 237814 234734 232211 229994 228022 226383 225047 223877 222896 222288 222047 221696 220628 218826 217036 215972
52834B15972n10o98j074p92l7K19l70j089j269j042p52l15L86R68R63M08l55j088
$$ 215972 215462 214764 213690 212898 212861 213080 212710 211621 210352 209310 208558 208243 208629 209597 210560 210968 210613 209525
52816B09525j518j241k97N62P19N44Q01J503K013K097K057J922J295J68p96j132
$$ 209525 208007 206766 206469 207031 207750 208294 209095 210598 212611 214708 216765 218687 219982 220150 219354 218222
52800B18222j116j173j230j052q10q31j100j329j366j185p61k79j67n33p93l45
$$ 218222 217106 215933 214703 213651 212841 212010 210910 209581 208215 207030 206269 205990 205823 205290 204497 204152
52784B04152N46J041Q25M02K68L88N53P24P61L67m16j005r74o36n32o78p28o32
$$ 204152 204698 205739 206564 206966 207234 207622 208175 208899 209660 210027 209611 208606 207632 206996 206464 205786 205058 204426
52766B04426o02o01l90q8p9k73k7R04J778J672O73j62k0Q09J381J197O07K33K56
$$ 204426 203824 203223 202833 202745 202666 202393 202366 203270 205048 206720 207393 207231 207211 208020 209401 210598 211205 211438 211694
52747B11694M95Q74J424J893J842J369J187J641K083J739Q19J71P0J07J00L31
$$ 211694 212189 213063 214487 216380 218222 219591 220778 222419 224502 226241 227060 227231 227301 227408 227508 227839
52731B27839Q05J073J039J205J746J976J256m3r65j059o41k95m18j024j571j354
$$ 227839 228644 229717 230756 231961 233707 235683 236939 236896 235931 234872 234231 233936 233518 232494 230923 229569
52715B29569l89M64N59K93L25M48l7j094j814j613q33m9O13J120J117L49p15j237
$$ 229569 229180 229644 230203 230496 230821 231269 231232 230138 228324 226711 225878 225829 226442 227562 228679 229028 228313 227076
52697B27076r16j91M47R29J246J100L25n53q01m64k72m67l75M16J204J103K81
$$ 227076 226160 225969 226416 227345 228591 229691 230016 229463 228662 228198 227926 227459 227084 227500 228704 229807 230088
52680B30088n00j064j613j780j089k22m48j629k154j189K60J082J504K009K094
$$ 230088 229588 228524 226911 225131 224042 223820 223372 221743 219589 218400 218660 219742 221246 223255 225349
52665B25349J225N7m67n64r05j199p32J60N29L87O13J381J975K114K228K387K147
$$ 225349 226574 226631 226164 225600 224695 223496 222764 222924 223453 223840 224453 225834 227809 229923 232151 234538 236685
52648B36685J622J536J927J870Q96k78q87j071j250j311j092r29j101j231q41
$$ 236685 238307 239843 241770 243640 244536 244258 243371 242300 241050 239739 238647 237718 236617 235386 234545
52633B34545j83J03p1j15N19J770L053L664L310K356J432Q08K49m95j372k122
$$ 234545 234362 234465 234394 234279 234798 236568 239621 243285 246595 248951 250383 251191 251440 250945 249573 247451
52617B47451k476k276j694j194j029r55o63k45J35O33J235J335M93o06q84l40
$$ 247451 244975 242699 241005 239811 238782 237827 237164 236919 237054 237687 238922 240257 240750 240144 239260 238920
52601B38920R2Q6K48P57Q31m7j178j600j300r61r09q90n72R5Q23J135Q43L78L08
$$ 238920 239012 239098 239346 240103 240934 240887 239709 238109 236809 235848 234939 234049 233477 233572 234395 235530 236373 236751 237059
52582B37059N63O25M80P05J488K235K323J717O78m79j225j139n94m44q08r18m13
$$ 237059 237622 238247 238727 239432 240920 243155 245478 247195 247873 247394 246169 245030 244436 243992 243184 242266 241853
52565B41853Q1pl14k50R6K99K89K04K5k10k62j58k48n97q52r43j195j452r76L28
$$ 241853 241934 241927 241613 241363 241459 241758 242047 242251 242276 242066 241804 241646 241398 240801 239949 239006 237811 236359 235383 235711
52545B35711J439J560J118P83L80l87r30n83J41K07l65o58k99J83M02N44P31P62
$$ 235711 237150 238710 239828 240611 240991 240604 239674 239091 239232 239439 239074 238416 238117 238300 238702 239246 239977 240739
52527B40739N79M04L55L67M86P75J032J058J040J227J434J343J094J058J251J428
$$ 240739 241318 241722 242077 242444 242930 243705 244737 245795 246835 248062 249496 250839 251933 252991 254242 255670
52511B55670J596J916K293K534K632K530J963J026M33N12M74m92j819k261j742
$$ 255670 257266 259182 261475 264009 266641 269171 271134 272160 272593 273105 273579 273087 271268 269007 267265
52496B67265j401j827k418k638k767k968k617j308J50N26l25j296j314l89N74
$$ 267265 265864 264037 261619 258981 256214 253246 250629 249321 249471 249997 249672 248376 247062 246673 247247
52481B47247P47J31o09r42r22p42k63O39J573J979J895J788J761J503J070J023
$$ 247247 247994 248125 247516 246574 245652 244910 244647 245286 246859 248838 250733 252521 254282 255785 256855 257878
52465B57878J579K155K122J625J373J761K534L119L137K537J450Rj616l103m067
$$ 257878 259457 261612 263734 265359 266732 268493 271027 274146 277283 279820 281270 281279 279663 276560 272493
52450B72493m337l994l153j987r72o64j038j441j423j213j133j095r81j074j511
$$ 272493 268156 264162 261009 259022 258050 257386 256348 254907 253484 252271 251138 250043 249062 247988 246477
52435B46477j871j736j270p00K03J464K256J810O29j17j05Q3J43L01M95L68R3
$$ 246477 244606 242870 241600 240900 241103 242567 244823 246633 247262 247145 247040 247123 247266 247567 248062 248430 248523
52418B48523K70R05J377J473J568J718J621J543K192L365L900L472L321M438O022
$$ 248523 248793 249698 251075 252548 254116 255834 257455 258998 261190 264555 268455 271927 275248 279686 285708
52403B85708O696O462O417O895O951N639L072J26k348l954m814n263n431n244
$$ 285708 292404 298866 305283 312178 319129 324768 327840 327966 325618 321664 316850 311587 306156 300912
52389C00912m819m460m075l076j192R60K453K846K282J196K99K86J041J547J099
$$ 300912 296093 291633 287558 284482 283290 284250 286703 289549 291831 293027 293326 293612 294653 296200 297299
52374B97299L20L61J402K638L511M223M957N378N165M539L891L182K095N71j048
$$ 297299 297619 297980 299382 302020 305531 309754 314711 320089 325254 329793 333684 336866 338961 339532 338484
52359C38484k308k920k763j970j010m54m67n74k36L65M65k05q48n19O32J543J646
$$ 338484 336176 333256 330493 328523 327513 327059 326592 326018 325782 326147 326612 326407 325559 325040 325672 327215 328861
52342C28861J516J959K941L758L968L808L825M334N214O027O384O315O263O718
$$ 328861 330377 332336 335277 339035 343003 346811 350636 354970 360184 366211 372595 378910 385173 391891
52328C91891P861R481J1113J2310J2992J3528J4279J5127J5666J5790J5769J5782
$$ 391891 399752 409233 420346 432656 445648 459176 473455 488582 504248 520038 535807 551589
52316E51589J5700J5398J4975J4566J4202J3969J4010J4300J4624J4790J4661
$$ 551589 567289 582687 597662 612228 626430 640399 654409 668709 683333 698123 712784
52305G12784J4111J3199J2383J2084J2057J1606J0521R342Q562P978P120N904
$$ 712784 726895 740094 752477 764561 776618 788224 798745 808087 816649 824627 831747 837651
52293H37651M589L273J802l1k243m554o410p425p839q194q491q081o628m764l423
$$ 837651 842240 845513 847315 847284 845041 840487 834077 826652 818813 810619 802128 794047 787419 782655 779232
52278G79232k787k262j314%J347K599L943N536P168Q371Q950R229R618J0077J0356
$$ 779232 776445 774183 772869 772869 774216 776815 780758 786294 793462 801833 810783 820012 829630 839707 850063
52263H50063J0555J0958J1376J1266J0592R997R909J0042J0059J0216J0794J1285
$$ 850063 860618 871576 882952 894218 904810 914807 924716 934758 944817 955033 965827 977112
52251I77112J0847R396P752O592N718M505K697N03j841m208o255p395p511p456
$$ 977112 987959 997355 1005107 1011699 1017417 1021922 1024619 1025122 1023281 1019073 1012818 1005423 997912 990456
52237I90456q295r944j1150j1014j0071r360r110q900q690q785q983q641p616
$$ 990456 982161 972217 961067 950053 939982 930622 921512 912612 903922 895137 886154 877513 869897
52224H69897o428n459m666m050l671l182k153q77n3L98J232K503L313L268L112
$$ 869897 863469 858010 853344 849294 845623 842441 840288 839411 839358 839756 840988 843491 846804 850072 853184
52209H53184L433L792L735L641L842L852L354L126L917N038N159M090K797K049
$$ 853184 856617 860409 864144 867785 871627 875479 878833 881959 885876 890914 896073 900163 902960 905009
52195I05009J971K560L632M406M207L556L684M862O037O070M794K836J068J46
$$ 905009 906980 909540 913172 917578 921785 925341 929025 933887 939924 945994 950788 953624 954692 954838
52181I54838l2m38j887m007n784o940p932q796q907q050o912o183n797n322m597
$$ 954838 954806 954368 952481 948474 942690 935750 927818 919022 910115 902065 895153 888970 883173 877851 873254
52166H73254l653k524j340k86O73J750K878L695L942L649K947K095J497J289J020
$$ 873254 869601 867077 865737 865451 866124 867874 870752 874447 878389 882038 884985 887080 888577 889866 890886
52151H90886L13l56k18N24P84Q0q21r54k46O98J397J721J789J854J991J873J271
$$ 890886 891199 890843 890625 891149 891933 892013 891192 890238 889992 890690 892087 893808 895597 897451 899442 901315 902586
52134I02586P26J088K339L612M510N613P410R520J1443J3321J5461J7637J9483
$$ 902586 903312 904400 906739 910351 914861 920474 927884 937404 948847 962168 977629 995266 1014749
52121A014749K1037K2396K3330K3760K4063K4327K3849K2176K0122J8814J8053
$$ 1014749 1035786 1058182 1081512 1105272 1129335 1153662 1177511 1199687 1219809 1238623 1256676
52110A256676J6647J4257J1843J0099Q545O543M460L122K651K438J955J147J69
$$ 1256676 1273323 1287580 1299423 1309522 1318067 1324610 1329070 1332192 1334843 1337281 1339236 1340383 1340552
52097A340552p58j381j715k294l762o082q431j0005j0824j1612j2877j4285j5037
$$ 1340552 1339794 1338413 1336698 1334404 1330642 1324560 1316129 1306124 1295300 1283688 1270811 1256526 1241489
52084A241489j4875j4372j4083j3581j1973r299o867n699n169l781j147J525L076
$$ 1241489 1226614 1212242 1198159 1184578 1172605 1163306 1156439 1150740 1145571 1141790 1140643 1142168 1145244
52071A145244L809M874O763Q975J0874J2268J3089J3173J2583J1785J1190J0692
$$ 1145244 1149053 1153927 1160690 1169665 1180539 1192807 1205896 1219069 1231652 1243437 1254627 1265319
52059A265319R941Q913Q003P578P602P727P637P279O689N671L870J269j565m063
$$ 1265319 1275260 1284173 1292176 1299754 1307356 1315083 1322720 1329999 1336688 1342359 1346229 1347498 1345933 1341870
52045A341870o295q645j0989j2769j3939j5185j6871j8348j8774j8220j7429j6812
$$ 1341870 1335575 1326930 1315941 1303172 1289233 1274048 1257177 1238829 1220055 1201835 1184406 1167594
52033A167594j6219j5474j4525j3263j1741j0491r978r846r304q300p609p641
$$ 1167594 1151375 1135901 1121376 1108113 1096372 1085881 1075903 1066057 1056753 1048453 1040844 1033203
52021A033203p920q014q180q657q974q634p993p754p853p628o975o616p134q420
$$ 1033203 1025283 1017269 1009089 1000432 991458 982824 974831 967077 959224 951596 944621 938005 930871 922451
52007I22451j0090j1829j3118j3363j2720j2260j2803j3939j4740j4994j5113
$$ 922451 912361 900532 887414 874051 861331 849071 836268 822329 807589 792595 777482
$$ [...]
##END NTUPLES=NMR SPECTRUM
##END=
