##TITLE=AC1773_VIETDRY_9683792_yMcy3rT8sS
##JCAMPDX= 6.0         $$ Bruker NMR JCAMP-DX V2.0
##DATA TYPE= NMR SPECTRUM
##DATA CLASS= NTUPLES
##ORIGIN= BRUKER
##OWNER= Administrator
$$ 1.72 TOPSPIN		Version 2.1
$$ 2016-04-16 23:30:54.173 -0700  Administrator@X
$$ Compression mode = diff/dup
##.OBSERVE FREQUENCY= 400.02188249412
##.OBSERVE NUCLEUS= ^1H
##.ACQUISITION MODE= SIMULTANEOUS (DQD)
##.ACQUISITION SCHEME= undefined
##.AVERAGES= 8
##.DIGITISER RES= 22
##SPECTROMETER/DATA SYSTEM= spect
##.PULSE SEQUENCE= zg30
##.SOLVENT NAME= COFFEE_meoh
##.SHIFT REFERENCE= INTERNAL, COFFEE_meoh, 1, 14.98509
##AUDIT TRAIL= $$ (NUMBER, WHEN, WHO, WHERE, PROCESS, VERSION, WHAT)
$$ ##TITLE= Audit trail, TOPSPIN		Version 2.1
$$ ##JCAMPDX= 5.01
$$ ##ORIGIN= Bruker BioSpin GmbH
$$ ##OWNER= Administrator
$$ $$ E:\/data/COFFEE/nmr/AC1773_VIETDRY_9683792_yMcy3rT8sS/10/pdata/1/auditp.txt
$$ ##AUDIT TRAIL=  $$ (NUMBER, WHEN, WHO, WHERE, PROCESS, VERSION, WHAT)
(   1,<2016-04-16 23:30:47.079 -0700>,<Administrator>,<X>,<go>,<TOPSPIN 2.1>,
      <created by zg
	started at 2016-04-16 23:29:41.204 -0700,
	POWCHK enabled, PULCHK disabled,
       configuration hash MD5:
       21 0F 79 D6 B3 7B B4 F6 88 20 88 DB 03 48 BD 9F
       data hash MD5: 64K
       E0 98 18 6E 75 07 FF 45 11 26 A6 79 99 36 11 0D>)
(   2,<2016-04-16 23:30:50.189 -0700>,<Administrator>,<X>,<proc1d>,<TOPSPIN 2.1>,
      <Start of raw data processing
       efp LB = 0 FT_mod = 6 PKNL = 1 PHC0 = 0 PHC1 = 0 SI = 32K 
       data hash MD5: 32K
       99 1E EC 1F D3 A0 26 73 30 C4 4E DA F9 5E 6C 9F>)
(   3,<2016-04-16 23:30:50.470 -0700>,<Administrator>,<X>,<proc1d>,<TOPSPIN 2.1>,
      <pk PHC0 = 89.36279 PHC1 = 0 
       data hash MD5: 32K
       B2 EC C9 07 07 78 F4 DD D9 66 9E BA E3 9F 08 7C>)
(   4,<2016-04-16 23:30:50.579 -0700>,<Administrator>,<X>,<proc1d>,<TOPSPIN 2.1>,
      <abs ABSG = 1 
       data hash MD5: 32K
       B6 FC 5B 19 38 72 A0 7A 63 4A 97 E0 99 3C 7A 3A>)
(   5,<2016-04-16 23:30:50.626 -0700>,<Administrator>,<X>,<proc1d>,<TOPSPIN 2.1>,
      <abs ABSG = 2 
       data hash MD5: 32K
       CC 47 6F DE A8 17 B7 D9 18 CE E2 90 96 A2 06 BB>)
(   6,<2016-04-16 23:30:50.689 -0700>,<Administrator>,<X>,<proc1d>,<TOPSPIN 2.1>,
      <abs ABSG = 3 
       data hash MD5: 32K
       E5 7D 9A 53 A8 F3 DA 37 81 76 0A B7 5A 81 F7 E2>)
(   7,<2016-04-16 23:30:50.751 -0700>,<Administrator>,<X>,<proc1d>,<TOPSPIN 2.1>,
      <abs ABSG = 4 
       data hash MD5: 32K
       B9 7D 1B 5A 01 D1 5F D0 53 28 05 31 61 F4 C7 9F>)
(   8,<2016-04-16 23:30:50.814 -0700>,<Administrator>,<X>,<proc1d>,<TOPSPIN 2.1>,
      <abs ABSG = 5 
       data hash MD5: 32K
       A3 69 18 E6 5A 35 92 31 A0 C7 91 B7 04 E5 84 B9>)
$$ ##END=
$$ 
$$ $$ hash MD5
$$ $$ 59 E2 91 BC 7B 9B 57 2E 6C C1 30 7B CE 80 9D CA
##$RELAX= 
##$RELAX= 
##$RELAX= 
##$RELAX= 
##$RELAX= 
##$RELAX= 
##$RELAX= 
$$ Bruker specific parameters
$$ --------------------------
##$DU= <E:\>
##$EXPNO= 10
##$NAME= <AC1773_VIETDRY_9683792_yMcy3rT8sS>
##$PROCNO= 1
$$ [...]
150 150 150 150 150 150 150 150
##$TP07= 0
##$TPNAME0= <>
##$TPNAME1= <>
##$TPNAME2= <>
##$TPNAME3= <>
##$TPNAME4= <>
##$TPNAME5= <>
##$TPNAME6= <>
##$TPNAME7= <>
##$TPOAL= (0..7)
0.5 0.5 0.5 0.5 0.5 0.5 0.5 0.5
##$TPOFFS= (0..7)
0 0 0 0 0 0 0 0
##$TUNHIN= 0
##$TUNHOUT= 0
##$TUNXOUT= 0
##$USERA1= <user>
##$USERA2= <user>
##$USERA3= <user>
##$USERA4= <user>
##$USERA5= <user>
##$V9= 5
##$VALIST= <valist>
##$VCLIST= <CCCCCCCCCCCCCCC>
##$VD= 0
##$VDLIST= <DDDDDDDDDDDDDDD>
##$VPLIST= <PPPPPPPPPPPPPPP>
##$VTLIST= <TTTTTTTTTTTTTTT>
##$WBST= 2048
##$WBSW= 25
##$XGAIN= (0..3)
0 0 0 0
##$XL= 0
##$YL= 0
##$YMAX_a= 559184
##$YMIN_a= -487639
##$ZGOPTNS= <>
##$ZL1= 120
##$ZL2= 120
##$ZL3= 120
##$ZL4= 120
##$ABSF1= 14.98509
##$ABSF2= -5.573092
##$ABSG= 5
##$ABSL= 3
##$ALPHA= 0
##$AQORDER= 0
##$ASSFAC= 0
##$ASSFACI= 0
##$ASSFACX= 0
##$ASSWID= 0
##$AUNMP= <proc_prof1d_extract_pilot.lims>
##$AXLEFT= 0
##$AXNAME= <>
##$AXNUC= <1H>
##$AXRIGHT= 0
##$AXTYPE= 0
##$AXUNIT= <>
##$AZFE= 0.1
##$AZFW= 0.1
##$BCFW= 0
##$BC_mod= 0
##$BYTORDP= 0
##$COROFFS= 0
##$CY= 15
##$DATMOD= 1
##$DC= 0
##$DFILT= <>
##$DTYPP= 0
##$F1P= 0
##$F2P= 0
##$FCOR= 0.5
##$FTSIZE= 32768
##$FT_mod= 6
##$GAMMA= 0
##$GB= 0
##$INTBC= 1
##$INTSCL= 1
##$ISEN= 128
##$LB= 0
##$LEV0= 0
##$LPBIN= 0
##$MAXI= 10000
##$MC2= 0
##$MEAN= 0
##$ME_mod= 0
##$MI= 0
##$NCOEF= 0
##$NC_proc= -8
##$NLEV= 6
##$NOISF1= 0
##$NOISF2= 0
##$NSP= 0
##$NTH_PI= 0
##$NZP= 0
##$OFFSET= 14.98509
##$PC= 1
##$PHC0= 89.36279
##$PHC1= 0
##$PH_mod= 1
##$PKNL= yes
##$PPARMOD= 0
##$PPDIAG= 0
##$PPIPTYP= 0
##$PPMPNUM= 2147483647
##$PPRESOL= 1
##$PSCAL= 4
##$PSIGN= 0
##$PYNMP= <proc.py>
##$REVERSE= no
##$SF= 400.02
##$SI= 32768
##$SIGF1= 0
##$SIGF2= 0
##$SINO= 400
##$SIOLD= 32768
##$SPECTYP= <>
##$SREGLST= <1H.CDCl3>
##$SSB= 0
##$STSI= 32768
##$STSR= 0
##$SW_p= 8223.68421052631
##$SYMM= 0
##$S_DEV= 0
##$TDeff= 65536
##$TDoff= 0
##$TI= <>
##$TILT= no
##$TM1= 0
##$TM2= 0
##$TOPLEV= 0
##$USERP1= <user>
##$USERP2= <user>
##$USERP3= <user>
##$USERP4= <user>
##$USERP5= <user>
##$WDW= 1
##$XDIM= 32768
##$YMAX_p= 439185548
##$YMIN_p= -705118
##$CURPLOT= <Network HP LaserJet P1505>
##$CURPRIN= <$Network HP LaserJet P1505>
##$DFORMAT= <normdp>
##$LAYOUT= <+/1D_H.xwp>
##$LFORMAT= <normlp>
##$PFORMAT= <normpl>
##$SURQMSG= 1
$$ End of Bruker specific parameters
$$ ---------------------------------
##NTUPLES= NMR SPECTRUM
##VAR_NAME=  FREQUENCY,     SPECTRUM/REAL,   SPECTRUM/IMAG
##SYMBOL=    X,             R,               I
##VAR_TYPE=  INDEPENDENT,   DEPENDENT,       DEPENDENT
##VAR_FORM=  AFFN,          ASDF,            ASDF
##VAR_DIM=   32768,         32768,           32768
##UNITS=     HZ,            ARBITRARY UNITS, ARBITRARY UNITS
##FACTOR=    0.250966925370066, 1,           1
##FIRST=     8223.43324360094, -57998,       -89610
##LAST=      0,             -26739,          108443
##MIN=       0,             -705118,         0
##MAX=       8223.43324360094, 439185548,    0
$$ Real data points
##PAGE= N=1
##DATA TABLE= (X++(R..R)), XYDATA
$$ [...]
$$ plain form
19588 -274358 -107683 -227833 -193469 -9067 -68525 81871 406175 58119 242239 257551 91184
19576 -153784 9822 -22105 235239 -272520 35551 -286382 -46653 -124218 -81281 249714 -191742
19564 -156782 -278429 2514 -252955 24357 -7727 70375 -150178 -94938 -32206 228400 -63142
19552 35223 -70659 3396 47281 -55244 -164296 -142574 -163813 -200510 138932 -209914 30972
19540 -99402 -216795 -119728 -291612 -57178 -95594 -98645 -112799 -197595 -260044 -36884 -11393
19528 -276277 -226906 -218724 150667 218685 -430593 -69385 -63364 137482 -220839 77104 -123769
19516 10262 1605 101808 199401 -54147 23412 61440 -15443 93629 100004 -59419 -276416 406701
19503 -167637 -272051 -62272 272445 -13841 -53101 80502 113320 4080 -280855 -387007 -11292
$$ packed form
19588b74358a07683j20150L4364i067n9458H1871L24304E8119J84120J5312I1184
19576a53784I822b2105B35239b72520C5551b86382d6653p7565M2937B49714a91742
19564a56782j21647B514b52955B4357g727G0375a50178N5240c2206B28400f3142
19552C5223g0659C396M3885e5244j09052K1722k1239l6697A38932b09914C0972
19540i9402j17393R7067j71884e7178l8416l051j4154q4796o2449c6884a1393
19528b76277M9371Q182A50667O8018d30593f9385O021A37482b20839G7104a23769
19516A0262A605J00203R7593e4147B3412L8028a5443I3629O375e9419k16997D06701
19503a67637j04414f2272B72445a3841l9260H0502L2818D080b80855j06152a1292
$$ plain form
19491 25266 2823 69971 -89428 195075 66581 90713 53092 -11831 97065 -185605 -210261
19480 -210261 -190718 103566 -312146 -343731 68619 -286645 -23676 178446 -130656 -228602
19470 -228602 -273631 -198811 87635 83869 62709 -145612 20368 101969 -269511 285869 -157615
19458 -42083 -7077 -192095 223796 15887 -14975 -194939 -100132 -157817 -194667 -85838 -41863
19446 -29330 307576 133350 110560 -138743 120300 -20824 -85988 -45158 -163773 30741 4063
19434 -53300 -159399 -48833 -52603 -63019 59679 -15142 28790 -263189 -70618 -135662 -155832
19423 -155832 78456 -18412 -236507 59941 -166864 -165444 -33082 -227006 -402542 -175070 201011
19411 -255224 -54874 -34349 -22265 -85131 41411 90341 -84870 -332603 -104256 -49513 86268
$$ packed form
19491B5266B823O7148h9428A95075F6581K4132l7621a1831I7065a85605k4656
19480b10261J9543A03566c12146l1585F8619b86645b3676A78446a30656r7946
19470b28602m5029P4820H7635l766k1160a45612B0368Q1601b69511B85869a57615
19458d2083g077j85018B23796A5887a4975j79964R4807n7685l6850h5838d1863
19446b9330C07576A33350k2790a38743A20300b0824o5164M0830j18615C0741D063
19434e3300j06099d8833l770j0416E9679a5142B8790b63189g0618o5044k0170
19423a55832G8456a8412k18095E9941a66864J420c3082j93924j75536a75070B01011
19411b55224e4874K0525J2084o2866D1411M8930h4870k47733a04256d9513H6268
$$ plain form
19399 277144 -16091 -89140 -193254 143076 211429 -24335 -313397 -217881 57955 -169724 -195972
19388 -195972 -163357 2428 -38480 -306830 -282404 51723 -210476 -118127 277068 -415068 -208072
19377 -208072 13203 -329657 -291570 -174969 190211 107411 -154129 25586 95587 90822 -69506
19365 399128 8516 79053 -25676 -130769 -140955 164060 186850 -243931 235159 24537 -132650
19353 50086 371616 -250127 82777 -31189 -160256 178175 21216 -192831 -213197 -101171
19342 -219549 147087 -325886 25681 -106348 41733 190800 -349181 270228 -131329 -142082
19332 -142082 118013 -35807 -65698 7145 -84207 114569 70188 -164029 -202339 -173601 -306394
19321 -306394 -51643 -246588 46959 -26945 -78642 -316154 235700 -210322 -143256 -54332 -393586
$$ packed form
19399B77144a6091p3049j04114A43076O8353b4335k89062R5516E7955a69724k6248
19388a95972L2615B428c8480k68350K4426E1723b10476R2349B77068d15068K06996
19377b08072A3203c29657L8087J16601A90211q2800a54129B5586P0001m765f9506
19365C99128H516P0537b5676j05093j0186A64060K2790b43931B35159B4537a32650
19353E0086L21530b50127H2777c1189j29067A78175B1216a92831k0366a01171
19342b19549A47087c25886B5681a06348D1733J49067c49181B70228a31329j0753
19332a42082A18013c5807k9891G145h4207A14569m4381a64029l8310K8738j32793
19321c06394e1643j94945D6959b6945n1697k37512B35700b10322O7066e4332l39254
$$ plain form
19310 -393586 -32632 -79812 -255009 -160827 -11964 -231877 110148 -314220 -140122 -95601
19300 -95601 -72551 -56114 46582 171449 31432 -93385 -86979 -27788 -226291 -179179 -19780
19288 -181782 495110 54667 -148163 127704 170185 -135954 -138685 -95193 -384189 -58384 68374
19276 201133 137392 24220 40642 -553034 226774 6701 1004 -127106 71039 -117378 -41422
19264 350434 -63171 -55853 24856 -341238 -64662 -166829 136156 -254715 111691 -16769 -139996
19253 -139996 -96533 -374573 -71426 -90854 -81645 113482 -88364 50630 445230 -210766 320571
19241 -100438 -222127 -43234 -201896 -117198 -34265 -52560 68282 -21890 -94780 -186689 74028
19229 43824 108725 -37735 19417 -81443 -50551 -269200 -75806 -344996 12942 -26415 -53836
$$ packed form
19310c93586c2632m7180j75197R4182a1964k19913A10148c14220a40122M4521
19300i5601K3050J6437D6582J24867C1432i3385O406b7788j98503M7112a9780
19288a81782D95110E4667a48163A27704M2481a35954k731M3492k88996e8384F8374
19276B01133o3741B4220J6422e53034B26774F701A004a27106G1039a17378d1422
19264C50434f3171P318B4856c41238f4662j02167A36156b54715A11691a6769j23227
19253a39996M3463k78040g1426j9428R209A13482h8364E0630L94600b10766C20571
19241a00438j21689d3234j58662Q4698c4265j8295F8282b1890p2890r1909G4028
19229D3824O4901c7735A9417h1443L0892k18649g5806k69190A2942b6415k7421
$$ plain form
19218 -53836 -4343 130264 -217556 -141766 -174041 185753 -106615 78556 -235625 -341535 154316
19206 -182212 312922 75353 103484 -60443 250567 -172086 -81602 36936 -110358 -37612 5078
19194 -163475 -51785 -8866 -198746 -294186 -161443 240817 215938 58833 -126242 -262653 -106517
19182 -156505 -477971 -270248 -177386 88422 -201457 -250283 -3145 -290750 -22283 -189608 -2170
19170 117919 65435 40472 -188237 123206 -20147 -115001 -113503 193312 149369 -94609 -63674
19159 -63674 -131005 148528 -97088 -37115 -344396 -135843 -238061 -98670 -281700 -353438 201000
19147 -453631 91563 86790 -26295 -118036 -366942 -18119 -88282 26947 -51532 -289049 -48111
19135 241482 -54182 9657 65317 51886 95644 -172707 24965 -327617 -21453 216545 134805
$$ packed form
19218e3836d343A30264b17556P5790l2275A85753a06615G8556b35625j05910A54316
19206a82212C12922G5353K8131f0443B50567a72086h1602C6936a10358c7612E078
19194a63475e1785h866j89880r5440J32743B40817k4879E8833a26242j36411a06517
19182a56505l21466K07723R2862H8422b01457m8826c145k87605b2283j67325b170
19170A17919n2484k4963a88237A23206b0147r4854J498A93312m3943i4609L0935
19159f3674o7331A48528i7088c7115l07281a35843j02218i8670j83030p1738B01000
19147d53631I1563m773b6295r1741k48906a8119p0163B6947e1532k37517d8111
19135B41482e4182I657N5660j3431M3758a72707B4965c27617b1453B16545q1740
$$ plain form
19124 134805 -252398 156792 -321926 46104 247821 -17823 -151955 -308944 -98342 303448
19113 87934 -45299 137563 134947 -119238 -26702 127869 123107 94140 155657 -320163 149414
19101 438448 -95829 47925 83108 -258324 -81466 -265817 -141242 47828 -140368 -8579 29292
19089 58724 -327084 -142681 90082 262899 -71645 -65833 -71112 -238778 -204960 -209405 22254
19077 -314933 -264568 226726 -35189 -64269 -7037 -39814 173329 95207 171109 -30685 -138165
19066 -138165 -95154 -20054 76709 159119 118544 -170516 -2586 -84785 305467 26954 -275694
19054 -260248 -38648 -111526 -16856 -69985 72435 224891 30118 -236180 -81198 -127684 66525
19042 -59639 -98704 230406 -185648 133371 71242 10306 53539 -211299 -126210 -114986 149194
$$ packed form
19124A34805b52398A56792c21926D6104K01717a7823j34132j56989i8342C03448
19113H7934d5299A37563k616a19238b6702A27869m762k8967O1517c20163A49414
19101D38448i5829D7925L5183b58324h1466j84351J24575D7828a40368h579B9292
19089E8724c27084a42681I0082J72817g1645N812n279j67666L3818m445B2254
19077c14933N0365B26726c5189k9080g037l2777A73329p8122P5902c0685j07480
19066a38165M3011b0054G6709Q2410m0575a70516b586q2199C05467B6954b75694
19054b60248c8648p2878a6856n3129G2435J52456C0118b36180h1198m6486F6525
19042e9639l9065B30406a85648A33371o2129A0306M3233b11299Q5089J1224A49194
$$ plain form
19030 -144471 16958 -198501 12095 -418206 -28868 -114904 -328948 -80809 80847 320594 -94982
19018 57759 -300786 84340 346452 -299426 -66078 11779 48375 109428 57988 -216743 69525
19006 207862 -71058 -25121 -224964 -212152 -40703 275540 301420 -113914 -272085 -108165
18995 -84640 -430710 101325 45360 -301379 -177003 87192 184318 130725 -120800 -18599 -56268
18984 -56268 -388680 205903 -137958 -151721 -87542 -109872 24997 -180928 287708 112049
18973 -4636 -335798 2589 -196281 70719 -374906 -39625 -24160 14204 -179684 -180376 70396 106244
18961 106244 122298 230119 -584940 -40801 -159340 106294 84469 24128 271602 37372
18950 -82078 -453465 -157606 48124 -241376 -60997 -84353 -111173 -336587 38702 9454 -250602
$$ packed form
19030a44471A6958a98501A2095d18206b8868q6036k14044h0809H0847K39747i4982
19018E7759c00786H4340K62112b99426f6078A1779L6596O1053n1440b16743F9525
19006B07862g1058b5121j99843J2812d0703B75540K5880a13914j58171a08165
18995h4640l46070A01325D5360c01379J24376H7192R7126n3593a20800a8599l7669
18984e6268l32412B05903a37958j3763O4179k2330B4997a80928B87708A12049
18973d636l31162B589a96281G0719c74906c9625J5465A4204a79684o92G0396L5848
18961A06244J6054J07821e84940d0801j18539A06294k1825B4128K47474C7372
18950h2078l71387a57606D8124b41376f0997k3356k6820k25414C8702I454b50602
$$ plain form
18938 -90571 -232943 -175321 -199572 213127 -158374 604039 -160976 35465 103709 -290316
18927 -66757 346940 -17137 99304 89647 -324436 27180 84670 16232 -156794 129469 168328
18916 168328 -117770 -15916 194879 -206558 -49996 103071 -274525 78479 83989 -91342 -71791
18905 -71791 31185 10760 -196297 -300738 665088 -252914 45646 87202 318355 -217102
18894 -159625 -33123 -329704 -377074 -144277 -25839 -467174 81109 -67345 20398 -39085 299693
18882 -50964 2840 -85085 -371945 -125984 -149462 25941 -25934 -332225 -256523 96324 -241310
18870 -482862 56854 8916 60096 29076 -176140 -218182 -158265 -53953 108206 -60654 85702
18858 64476 64771 43628 59405 -71868 -163974 85080 188531 24323 128394 -78962 80906 199902
$$ packed form
18938i0571j42372N7622k4251B13127a58374F04039a60976C5465O8244b90316
18927f6757C46940a7137I9304r657c24436B7180N7490A6232a56794A29469L8859
18916A68328a17770a5916A94879b06558d9996A03071b74525G8479N510i1342J9551
18905g1791C1185A0760a96297j04441F65088b52914D5646M1556K31153b17102
18894a59625c3123k96581m7370a44277b5839m41335H1109f7345B0398c9085B99693
18882e0964B840h5085k86860a25984k3478B5941b5934l06291P5702I6324b41310
18870d82862E6854H916N1180B9076a76140m2042N9917e3953A08206f0654H5702
18858F4476K95k1143J5777g1868r2106H5080J03451B4323J04071g8962H0906J18996
$$ plain form
18846 199902 -253140 128545 378755 45705 -165496 -300835 -194279 17103 65256 -153180
18835 -240699 -37837 -92004 145272 -87475 164398 -210887 -67179 -131300 240457 -283381
18824 20774 -48025 -44301 -269675 -18026 76887 99199 129912 55855 292982 -210713 257067
18812 -171603 -176813 70704 -111135 -365609 258677 98477 333417 -219951 -86889 210876
18801 23624 -39617 -137824 -117127 7127 55681 -142068 -115616 -10379 -25597 56082 -87796 58291
18788 78620 -140613 342257 -335952 139927 -239489 -203845 -119593 128516 136981 -129737
18777 87821 56213 -177930 -13512 191215 -113784 -474114 -148982 246445 74776 47373
18767 47373 17199 159945 -7114 249566 -208657 -168422 -252261 65388 216592 -107374 235802
$$ packed form
18846A99902b53140A28545K50210D5705a65496j35339J06556A7103M8153a53180
18835b40699c7837n4167A45272h7475A64398b10887f7179o4121B40457b83381
18824B0774d8025L724k25374a8026G6887K2312L0713E5855K37127b10713B57067
18812a71603n210G0704a11135k54474B58677I8477K34940b19951h6889B10876
18801B3624c9617r8207K0697G127M8554a42068K6452a0379j5218E6082h7796E8291
18788G8620a40613C42257c35952A39927b39489L5644Q4252A28516Q465a29737
18777H7821l1608a77930a3512A91215a13784l60330a48982B46445G4776k7403
18767D7373A7199J42746g114B49566b08657M0235q3839F5388J51204a07374B35802
$$ plain form
18755 126376 106415 400092 -99505 -67700 -134204 219850 -50633 253996 -262347 62578 -273287
18743 -66771 -270993 -21657 85689 36571 104002 -100163 -3721 -167030 -207515 -22504 53473
18731 -111561 4700 63327 -46231 -235048 -19282 54472 -195787 10587 -109737 -143420 38700
18719 -186905 -109174 93879 4052 -338718 -28994 339380 154420 -10481 22048 -615 -4420 170733
18706 -134654 -72037 42549 124304 -39001 195725 100359 -28823 -240608 -25375 -314871 -157793
18695 -157793 -173274 -160027 48750 -274771 -229827 -363823 -68328 -401653 -145828 146927
18684 -112780 130503 -329654 16515 -53261 265888 -52216 -207631 387855 -151079 103884
18673 -144433 19132 -16963 110144 -320889 -222420 13889 12202 -119210 -200115 -263407 83081
$$ packed form
18755A26376j9961K93677i9505L1805o6504B19850e0633B53996b62347F2578b73287
18743f6771k04222b1657H5689C6571O7431a00163c721j63309m0485b2504E3473
18731a11561D700N8627d6231j88817a9282E4472a95787A0587a09737l3683C8700
18719a86905P7731I3879D052c38718b8994C39380A54420a0481B2048f15l805A70733
18706a34654O2617D2549Q1755c9001A95725r5366b8823k11785b5375k89496J57078
18695a57793j5481J3247D8750b74771M4944j33996f8328l33325a45828A46927
18684a12780A30503c29654A6515e3261B65888e2216j55415C87855a51079A03884
18673a44433A9132a6963A10144c20889R8469A3889j687a19210q0905o3292H3081
$$ plain form
18661 197664 -10792 191132 189236 -193740 172470 -117045 11026 -83559 -201490 133783
18650 257059 -39585 425616 -60345 -313028 -159653 -254703 1597 -56847 -33725 -188631 -298941
18639 -298941 -164856 -291106 50051 -25742 -34538 43542 -292855 -55790 127325 -278022 104934
18627 41913 95230 131494 -119932 189432 92171 -201818 -2811 26084 -66865 -195437 126423
18615 -237856 -75911 66879 -114344 -86729 -155093 -70467 137767 -35660 -288570 232492 -20755
18603 -109986 -79072 66093 -24244 118944 -208837 278981 -46976 -108388 -79439 -39555 107457
18591 51717 -12212 -224951 250723 -95694 97332 -48551 20718 -136276 -245943 135867 237393
18580 237393 -226414 66811 243271 -47300 -196220 408604 43319 -88850 102709 -60030
$$ packed form
18661A97664a0792A91132j896a93740A72470a17045A1026h3559j17931A33783
18650B57059c9585D25616f0345k52683J53375r5050A597e6847K3122j54906j10310
18639b98941J34085j26250E0051b5742q796D3542b92855e5790A27325b78022A04934
18627D1913N3317L6264a19932A89432I2171b01818b811B6084f6865j28572A26423
18615b37856g5911F6879a14344K7615o8364g0467A37767c5660k52910B32492b0755
18603a09986L0914F6093b4244A18944b08837B78981d6976o1412K8949c9555A07457
18591E1717a2212k12739B50723i5694I7332d8551B0718a36276j09667A35867J01526
18580B37393b26414F6811J76460d7300j48920D08604D3319h8850A02709f0030
$$ plain form
18569 82374 8530 20485 95227 -183589 -123098 -266554 -439328 -165811 -170997 -140463 -56187
18557 -265652 34029 186202 -136694 -44658 -237147 -39807 -529497 -91228 -89042 2156 -43932
18545 83172 79165 91864 22696 34944 -201617 182814 806 127820 -6899 -270804 58152 -228667
18532 -49395 -35077 -181401 64460 -104613 141136 234841 -48201 79118 30111 15920 -20086
18520 51578 -40150 -69058 -151878 17617 -163733 -124494 -141193 -68023 4620 -221618 -361946
18509 -361946 -232885 -312850 -159633 97225 78226 -117314 -194842 89658 -188836 221583
18498 -58540 114573 -141923 36229 42106 -116801 215951 -65500 -212079 327982 -80 22364
18486 87907 -156466 -234666 167946 -185593 290808 199023 -83531 -90210 42005 -237010 12597
$$ packed form
18569H2374H530J1955P4742a83589O0491j43456j72774a65811n186L0534e6187
18557b65652C4029J52173a36694d4658j92489c9807m89690i1228K186B156d3932
18545H3172m007J2699B2696J2248b01617A82814H06J27014f899k63905E8152b28667
18532d9395J4318j46324F4460a04613A41136R3705d8201G9118C0111j4191b0086
18520E1578d0150k8908q2820A7617a63733L9239j6699f8023D620b21618j40328
18509c61946J29061p9965J53217I7225j8999a17314p7528H9658a88836B21583
18498e8540A14573a41923C6229N877a16801B15951f5500j46579C27982h0B2364
18486H7907a56466p8200A67946a85593B90808r1785h3531o679D2005b37010A2597
$$ plain form
18474 -7287 -91187 -1949 -141673 -254358 -65316 -172338 277954 -184373 177158 70165 -119899
18462 155050 19200 -196966 -145653 -113706 253025 31067 283851 45507 41892 160536 -62745
18450 -332557 -31830 130084 1280 168482 141261 -120106 147858 -181145 157063 -91847
18439 -163220 11741 -58011 132753 -110316 -13769 76924 16755 150128 -12463 -106965 -121502
18428 -121502 -37854 118929 -136227 68912 39987 -235952 -95364 -304096 -71279 22650 267998
18417 267998 -34375 -305819 -154073 18063 -86167 16786 -249733 -217024 14466 144061 -95776
18405 -138833 -55375 105878 38379 -154708 36857 257140 -1075 89857 -313023 -2490 115434
18393 -88005 -185872 92839 -70665 -1432 -183387 -207242 -280796 48956 16207 234701 -47753
$$ packed form
18474g287q3900a949j39724j12685f5316j07022B77954a84373A77158G0165a19899
18462A55050A9200a96966N1313L1947B53025C1067K52784D5507l615J18644f2745
18450c32557c1830A30084A280J67202k7221a20106A47858a81145A57063i1847
18439a63220A1741e8011A32753a10316a3769G6924A6755J33373a2463r4502j4537
18428a21502c7854A18929a36227F8912k8925b35952i5364k08732g1279B2650K45348
18417B67998c4375k71444J51746A8063h6167A6786b49733L2709A4466J29595i5776
18405a38833e5375A05878C8379a54708C6857K20283a075H9857c13023b490A15434
18393h8005r7867I2839g0665a432j81955k3855p3554D8956A6207K18494d7753
$$ plain form
18381 -256041 142310 18557 -203708 227679 218456 -129970 220945 54054 -213529 -14479
18370 86684 -44910 4386 -83308 6664 -144064 -298749 -34071 -46485 42913 -191729 63206
18358 -40963 5458 -101994 150151 -64460 33835 30572 26075 -233657 -141543 95957 -340843
18346 127078 -34280 104975 199347 -71334 104047 -100406 73483 -705118 -46257 -236190
18336 -236190 59625 80888 -78485 136698 -28816 -48625 33289 56362 -218638 -355391 -290337
18325 -290337 -243787 181623 -67339 -110288 130414 -17352 -261732 292649 141209 -341058
18314 304102 269159 -438853 -153760 -116036 -65990 121495 268178 54517 128463 -126856
18303 43407 -6361 -38447 -201182 129934 -63165 -148040 -12687 -156012 300196 -178844 -228913
$$ packed form
18381b56041A42310A8557b03708B27679r223a29970B20945E4054b13529a4479
18370H6684d4910D386h3308F664a44064j54685c4071j2414D2913a91729F3206
18358d0963E458a01994A50151f4460C3835l263m497b33657R2114I5957c40843
18346A27078c4280A04975R4372g1334A04047a00406G3483g05118d6257j89933
18336b36190E9625K1263g8485A36698b8816j9809C3289K3073b18638j36753O5054
18325b90337M6550A81623f7339m2949A30414a7352k44380B92649A41209c41058
18314C04102l4943d38853a53760L7724N0046A21495J46683E4517P3946a26856
18303D3407f361l2086j62735A29934f3165q4875a2687j43325C00196a78844n0069
$$ plain form
18292 -228913 -66561 64217 -195146 -21609 -5324 159876 328643 -211202 -253200 148708 17682
18280 117672 -285902 96383 -334193 169716 62144 -89627 -299724 -47920 249699 -133182
18269 -201905 -160192 -60434 -368169 -209089 -45196 -123938 -19639 -65884 20101 -105845 -103864
18258 -103864 95356 -333947 -41874 -217667 -130983 -125281 119224 -1960 62290 -116210 174479
18246 -123905 -191343 34387 36763 -267582 -141108 -151293 1630 -250017 -96142 -38744 -97292
18235 -97292 88194 -166722 111748 29726 -46319 -312313 24154 172529 54509 69813 -93072
18223 -20753 240478 -203666 160012 -2381 -265397 156672 184879 2838 23521 37225 -313715
18211 -279193 -54885 -115171 120160 171897 -102711 -21763 -15719 -193691 130045 -48430 24370
$$ packed form
18292b28913f6561F4217a95146b1609e324A59876J68767b11202m1998A48708A7682
18280A17672b85902I6383c34193A69716F2144h9627k10097d7920B49699a33182
18269b01905M1713f0434l07735J59080d5196p8742a9639m6245B0101a05845J981
18258a03864I5356c33947d1874j75793Q6684N702A19224a960F2290a16210A74479
18246a23905o7438C4387K376b67582J26474j0185A630b50017i6142c8744n8548
18235i7292H8194a66722A11748B9726d6319k65994B4154J48375E4509J5304i3072
18223b0753B40478b03666A60012b381k63016A56672K8207B838K0683J3704c13715
18211b79193e4885o0286A20160N1737a02711b1763O044j77972A30045d8430B4370
$$ plain form
18199 270275 67307 -220549 14402 -38274 232225 34313 -87375 90820 126120 5429 -27043
18187 -48529 90963 8769 -97389 -185993 -71994 -160452 -144182 -252905 129343 181115 -210743
18175 -61582 43421 24742 -117346 -63339 142574 -120241 -74862 143243 -231547 110057
18164 95307 -159853 353978 -156388 58168 53305 247116 39595 -52967 14798 114688 -272554
18152 -170294 -329003 35863 -66802 61192 -132440 -339492 170608 -206509 -77089 -212403
18142 -212403 -172638 21388 118477 -25993 -46435 12371 46791 -310385 232320 107174 -90762
18130 136725 53715 259087 -230216 -191124 34397 66313 14247 113128 -180065 55929 -390659
18118 -180318 -84747 101948 -49325 -274837 -105835 -4242 -125279 -342700 -95209 -386139
$$ packed form
18199B70275F7307b20549A4402c8274B32225C4313h7375I0820L5300E429b7043
18187d8529I0963H769i7389q8604g1994q8458J6270j08723A29343N1772b10743
18175f1582D3421j8679a17346N4007A42574a20241M5379A43243b31547A10057
18164I5307a59853C53978a56388E8168m863J93811C9595e2967A4798R9890b72554
18152a70294j58709C5863f6802F1192a32440k07052A70608b06509g7089j35314
18142b12403L9765B1388R7089b5993k0442A2371L4420c10385B32320A07174i0762
18130A36725E3715K05372b30216L9092C4397L1916A4247R8881a80065E5929c90659
18118a80318h4747A01948d9325k25512a05835d242j21037k17421i5209k90930
$$ plain form
18108 -386139 330297 -131059 -29105 23717 10066 133132 148596 -55880 50360 -129012 -55133
18096 -209811 91749 -82169 -208650 -91082 -734 -228214 -116127 8767 -58460 173517 150304
18085 150304 -29639 -177006 -412935 -30151 -66761 77493 182915 44670 -116051 83022 116520
18074 116520 30121 99356 -212333 94768 -220896 -35860 -196323 -189157 111801 -173647 -13967
18062 -154541 264256 159323 -299207 85383 367579 236619 257065 97703 -33278 5973 -15253
18050 87027 -392801 308652 -222183 38470 -65962 205082 66352 -18469 -263244 103630
18039 -245276 -283080 -38214 90673 -10468 78796 -20954 -308902 -71831 75728 277812 29521
18027 216848 -66270 150859 -65676 -131372 164659 474214 -168638 260836 -128282 53428
$$ packed form
18108c86139C30297a31059b9105B3717A0066J23066J5464e5880E0360a29012e5133
18096b09811I1749h2169j26481i1082g34k27480J12087H767e8460A73517k3213
18085A50304b9639j47367k35929c0151l6610G7493J05422D4670a16051H3022L3498
18074A16520C0121O9235b12333I4768b20896c5860j60463P166A11801a73647a3967
18062a54541B64256j04933b99207H5383K82196j30960K0446I7703c3278E973a5253
18050H7027c92801C08652b22183C8470f5962B05082F6352a8469k44775A03630
18039b45276l7804c8214I0673a0468G8796b0954k87948g1831G5728K02084B9521
18027B16848f6270A50859f5676o5696A64659L09555a68638B60836a28282E3428
$$ plain form
18016 -344861 -72250 40891 267656 -165412 -51920 45868 -97210 -93661 -8244 101145 -137567
18004 114791 99796 -53046 -14238 -71868 -46971 -119479 -290468 -289849 -118049 -233148 -82341
17992 167498 -23360 -92905 -2625 -87591 30428 5963 -209356 -24797 134039 127259 -434650
17980 -23588 88251 -324674 93726 -140087 166398 -255107 419455 -94836 -197876 -170504
17970 -170504 -143579 -91295 -28943 -243069 154025 -53148 -202958 -11966 64008 34902 -73671
17958 -128419 338525 -63327 107090 -141549 -12170 -369087 119815 -121834 -96175 -369280
17948 -369280 -121361 -118025 96572 -92869 -134914 -130714 186869 -170231 -97633 112774 126792
17937 126792 111745 -224250 -130212 -166113 -91802 -15251 26344 73794 -149015 12520 181661
$$ packed form
18016c44861g2250D0891K26765a65412e1920D5868i7210L549h244A01145a37567
18004A14791j4995e3046a4238n7630K4897p2508j70989O19a18049j15099h2341
17992A67498b3360o9545b625q4966C0428E963b09356b4797A34039o780d34650
17980b3588H8251c24674I3726a40087A66398b55107D19455i4836j03040K7372
17970a70504K6925N2284b8943k14126A54025e3148j49810a1966F4008k9106g3671
17958a28419C38525f3327A07090a41549a2170l56917A19815a21834K5659k73105
17948c69280a21361L336I6572i2869m2045M200A86869a70231P2598A12774J4018
17937A26792j5047b24250R4038l5901P4311a5251B6344M7450a49015A2520J69141
$$ plain form
17926 181661 -57634 -37820 244206 187935 422669 -97762 176749 -137808 179620 134286
17916 134286 1270 -14123 120236 -68271 22033 -383492 -273460 13598 -223990 328548 -15651
17904 -324986 -113296 -170022 -212227 125705 -241365 -130124 -65411 123746 254890 -180363
17893 16695 30941 -209540 -140786 -104868 -17394 57707 97491 143387 17216 110668 157872
17882 157872 205585 -44349 228853 152934 -159464 25248 200 -55981 -44199 -77712 145801
17870 -72667 20881 -17357 88247 119147 15033 -334159 6155 -102048 -199548 10058 -116430
17858 -208810 -115078 124353 -131467 30992 185547 -211708 223766 355629 116775 -349148
17847 16132 131988 90829 -21340 -286774 -105230 -11890 74253 286866 20484 -205953 70263
$$ packed form
17926A81661e7634J9814B44206n6271K34734i7762A76749a37808A79620m5334
17916A34286A270a4123A20236f8271B2033c83492J10032A3598b23990C28548a5651
17904c24986a13296n6726m2205A25705b41365J11241O4713A23746J31144a80363
17893A6695J4246b09540O8754L5918a7394E7707L9784M5896A7216R3452M7204
17882A57872M7713d4349B28853p5919a59464B5248B00e5981J1782l3513A45801
17870g2667B0881a7357H8247L0900A5033c34159F155a02048r7500A0058a16430
17858b08810R3732A24353a31467C0992J54555b11708B23766J31863A16775c49148
17847A6132J15856m1159b1340k65434a05230a1890G4253K12613B0484b05953G0263
$$ plain form
17835 65427 47684 -253658 -130480 -192711 -108808 11030 101852 -242997 205813 214796 169
17823 51102 -40927 -84890 -319787 256768 51070 163924 -158521 214470 -88297 -25666 52313
17811 1184 179898 -278606 -63668 50578 -52595 -145787 -66393 -40133 -112899 -152150 -13838
17799 -85842 -30327 -184980 31313 109674 -152955 -19778 -71736 -76055 -200438 43897 169476
17788 169476 210019 -276433 95979 83778 -376042 178690 237088 -192020 12100 123218
17778 123218 211581 372817 177304 20869 219789 178947 84029 -102458 -41349 521856
17767 -117025 86238 -116881 80060 76398 91099 17864 -239986 -70607 170544 -18247 197207
17755 85164 -222885 33087 -13311 42368 -204840 -73130 -122764 67051 95576 -57715 -264748
$$ packed form
17835F5427j7743b53658J23178o2231Q3903A1030R0822b42997B05813Q983A69
17823E1102d0927m3963k34897B56768E1070J12854a58521B14470h8297b5666E2313
17811A184J78714b78606f3668E0578e2595r3192f6393K6260p2766l9251a3838
17799h5842c0327j54653C1313P8361a52955a9778n1958m319j24383D3897J25579
17788A69476M0543b76433I5979j2201c76042A78690N8398a92020A2100J11118
17778A23218Q8363J61236A77304B0869J98920m0842H4029a02458d1349E21856
17767a17025H6238a16881H0060l662J4701A7864b39986g0607A70544a8247A97207
17755H5164b22885C3087a3311D2368b04840g3130m9634F7051K8525e7715k07033
$$ plain form
17744 -264748 -235539 50665 -63686 64649 -79430 111984 -17422 14376 42003 -46416 118809
17732 -322940 -32564 75504 -373686 -240457 -173594 -104477 26113 19138 -124032 -142090 42795
17720 -76153 54500 -167985 -181048 -8085 56313 138712 -200513 -21711 102929 45414 207056
17709 207056 216473 144865 -79066 -184405 42653 27133 371027 123046 176296 70090 -207609
17697 95331 324253 -171727 71979 -89763 -64711 -147507 -240386 70462 -59512 130789 268427
17686 268427 294121 -79959 42100 -548910 -57127 217188 -289460 119582 22729 46364 181140
17675 181140 3747 166000 23377 -110374 53310 29953 -122982 -236033 79107 -218085 181088
17663 -93804 56381 75773 -73898 313857 45932 -249909 -84352 -25516 -118619 -199069 55150
$$ packed form
17744b64748K9209E0665f3686F4649g9430A11984a7422A4376K7627d6416A18809
17732c22940c2564G5504c73686J33229O6863O9117B6113o975a24032j8058D2795
17720g6153E4500a67985j3063h085E6313Q2399b00513b1711A02929D5414J61642
17709B07056R417p1608g9066j05339D2653j5520L43894A23046N3250G0090b07609
17697I5331K28922a71727G1979h9763K5052q2796r2879G0462e9512A30789J37638
17686B68427K5694g9959D2100e48910e7127B17188b89460A19582B2729K3635J34776
17675A81140C747J62253B3377a10374E3310k3357a22982j13051G9107b18085A81088
17663i3804E6381J9392g3898C13857D5932b49909h4352b5516r3103q0450E5150
$$ plain form
17651 -213057 -160200 -249886 -41878 140623 -198760 48748 -141941 50056 -99310 19727 81837
17640 81837 -100428 247967 -30928 -99033 -108559 -24503 64728 -217126 78019 33792 85798
17629 85798 107181 42670 -21413 -53423 254158 -276608 174620 -60369 46562 529307 2176
17617 -91579 -11593 -47600 -146363 87457 -149968 110650 55383 86458 -60678 -68969 -215878
17606 -215878 -172997 13443 92954 -280703 58468 217568 21426 44881 -149836 -26725 312074
17594 82017 -255340 31122 -127705 333658 120418 -112953 129841 210 62521 343684 -171891
17582 103890 -12046 -32125 324625 -20740 87752 215681 -191628 65201 35181 -277144 101265
17570 -123087 -55224 -403260 205545 224725 161610 -73669 -186008 -102860 -146851 64628 100648
$$ packed form
17651b13057N2857q9686d1878A40623a98760D8748a41941E0056i9310A9727O2110
17640H1837a00428B47967c0928o8105r526b4503F4728b17126G8019C3792N2006
17629H5798K1383D2670b1413l2010B54158b76608A74620f0369D6562M82745B176
17617i1579a1593l6007r8763H7457a49968A10650n5267L1075f0678q291j46909
17606b15878M2881A3443P9511b80703E8468J59100B1426K3455a49836b6725C12074
17594H2017b55340C1122a27705C33658A20418a12953A29841B10O2311K81163a71891
17582A03890a2046k0079C24625b0740H7752J27929a91628F5201l0020b77144A01265
17570a23087e5224l48036B05545J9180o3115g3669j12339Q3148m3991F4628L6020
$$ plain form
17559 100648 -104275 -109717 153159 308796 -62350 -172772 51870 319589 17946 -245909
17548 -21616 -140617 185046 171018 366343 381921 184141 152444 -128885 -31647 119696
17537 424564 87546 131179 319770 -457134 -86544 144845 203641 -109275 -445 -49826 -42507
17526 -42507 -7009 156077 153480 202813 11445 74428 145118 151047 91302 170913 -351703 31923
17513 40553 -95954 142853 86458 224008 343780 -11092 451 -60116 445415 97763 366444
17502 366444 24379 223018 317433 -90675 378475 64159 118598 34403 -75323 425216 -80520
17490 -51891 -25045 -359071 239408 29078 -21190 139621 184056 -192199 -137996 306723 267858
17479 267858 -91511 395282 -80736 170553 -33137 -105571 88783 32264 3986 18905 9362
$$ packed form
17559A00648a04275n442A53159J55637f2350j10422E1870K67719A7946b45909
17548b1616j19001A85046j4028J95325J5578A84141l1697a28885c1647A19696
17537D24564H7546M3633J88591d57134h6544A44845N8796a09275d45m9381P319
17526d2507g009A56077k597M9333A1445O2983P0690N929n9745P9611c51703C1923
17513D0553i5954A42853n6395J37550J19772a1092D51f0116D45415I7763K68681
17502C66444B4379J98639R4415i0675C78475F4159N4439C4403g5323D25216h0520
17490e1891b5045l34026B39408B9078b1190A39621M4435a92199N4203C06723l8865
17479B67858i1511C95282h0736A70553c3137p2434H8783C2264C986J4919I362
$$ plain form
17467 420576 -118344 -392573 -40788 -95896 312468 108734 32974 65737 -322704 -61822
17456 272041 194195 24019 155081 303354 345298 305650 146438 306902 470674 198660
17445 540599 211326 78792 139656 192532 -53851 360323 33202 105137 244295 184887 266807
17434 266807 281262 -209848 89625 266143 417901 72427 161779 168234 310605 -218543 353247
17422 357648 6446 422610 -94799 379348 135996 158356 325228 282964 187519 41108 337708
17411 337708 198987 136419 138611 310348 -58942 -175732 -112030 -39225 -48327 204202 19105
17399 -52374 184433 -194861 19686 -60603 170390 237595 40104 408711 -135969 225294
17388 -12380 -6236 72558 26539 -18551 169631 330790 224417 -144306 -99978 108986 156828
$$ packed form
17467D20576a18344k74229d0788n5108C12468A08734C2974L2763c22704f1822
17456B72041p7846B4019J31062J48273M1944l9648A46438J60464J63772A98660
17445E40599B11326G8792O0864N2876e3851C60323C3202P1935J39158n9408Q1920
17434B66807J4455b09848H9625J76518J51758G2427Q9352O455J42371b18543C53247
17422C57648F446M16164i4799C79348A35996K2360J66872m2264r5445D1108K96600
17411C37708j38721o2568K192J71737e8942j16790O3702c9225r102B04202A9105
17399e2374A84433a94861A9686f0603A70390O7205D0104L68607a35969B25294
17388a2380O144G2558B6539a8551A69631J61159j06373a44306M4328A08986M7842
$$ plain form
17377 156828 46966 -129659 66294 357012 234705 13030 221364 188376 72614 -350097
17366 487023 122634 229941 19423 273389 37542 232860 455186 92156 532084 236081
17355 206220 256779 291705 191836 213340 171230 246925 295295 234663 407475 384877 254112
17344 254112 85927 273389 -18688 194757 333812 -6325 88924 -103476 99837 -188973 -111500
17333 -111500 55992 174135 137725 213657 156734 256201 83758 14866 -23276 -155257 -255784
17322 -255784 -54668 -157706 289721 157985 193309 134067 97552 82752 240418 71722 390389
17311 390389 50750 462628 190957 182256 -88638 231710 91197 162021 219107 8062 149842
17300 149842 112095 216102 135228 125035 -109923 283 -67302 206215 68861 -4825 111060
$$ packed form
17377A56828D6966a29659F6294K90718j22307A3030K08334l2988G2614c50097
17366D87023A22634J07307A9423K53966C7542J95318K22326I2156M39928B36081
17355B06220N0559L4926r9869K1504m2110P5695M8370o0632J72812k2598j30765
17344B54112H5927J87462a8688A94757J39055f325H8924a03476I9837a88973P7473
17333a11500E5992J18143l6410P5932n6923R9467H3758A4866b3276j31981j00527
17322b55784e4668j03038B89721j31736L5324n9242l6515j4800J57666G1722L18667
17311C90389E0750M11878A90957q701h8638B31710I1197P0824N7086H062J41780
17300A49842l7747J04007q0874j0193a09923B83f7302B06215F8861d825A11060
$$ plain form
17288 237692 158327 258929 373989 158739 144612 56387 92329 8179 85304 326311 135265
17276 154915 -23609 84003 -29596 311218 129415 31496 228029 244393 96088 44069 446202
17265 446202 107571 305249 214464 97024 11059 -44520 -214762 297915 -74108 259681
17254 130535 113825 -49198 11080 298593 227717 104532 218816 -278089 -46339 103796
17243 27942 331973 148622 153821 -91655 85594 267553 -19906 118146 397746 505577 188679
17231 201699 -7634 170974 126663 324314 174913 40850 285685 65800 108935 125703 146611
17220 146611 279392 400316 173802 77527 -193928 206014 55795 204231 27770 90821
17210 90821 159969 6607 124590 137888 214811 68207 310746 377061 135912 476174 378618
$$ packed form
17288B37692p9365J00602J15060A58739j4127E6387L5942H179P7125K41007A35265
17276A54915b3609H4003b9596C11218A29415C1496J96533J6364I6088D4069M02133
17265D46202A07571J97678r0785I7024A1059d4520j70242B97915g4108B59681
17254A30535j6710d9198A1080K87513p0876A04532J14284b78089d6339A03796
17243B7942L04031A48622N199i1655H5594J81959a9906A18146K79600J07831A88679
17231B01699g634A70974m4311J97651j49401D0850K44835F5800M3135J6768K0908
17220A46611J32781J20924A73802G7527a93928B06014E5795J48436B7770O3051
17210I0821O9148F607J17983J3298P6923F8207K42539O6315A35912L40262r7556
$$ plain form
17199 378618 -110788 -1583 66650 -217523 368651 250439 216402 273272 56236 263529 387250
17188 387250 272860 161789 419939 38114 69738 158829 180933 92166 272414 -4001 414960
17176 215976 404344 318534 92032 282496 190634 415505 181285 489462 -31079 383343
17165 231854 232536 300069 42105 363404 61365 354530 -165847 159656 80348 272760 131533
17153 -2090 219795 254974 514579 309137 93317 243716 152726 313870 188873 481865
17143 481865 454833 343613 23633 227257 350138 349876 241709 -112898 58911 142113 275738
17132 275738 223383 211885 729793 267785 248492 362891 507334 558128 157963 174021
17122 174021 570438 434048 109821 41309 432149 228073 73177 203598 321837 387831
$$ packed form
17199C78618a10788a583F6650b17523C68651j18212l4037N6870E6236K07293J23721
17188C87250j14390j11071K58150C8114L1624Q9091K2104q8767J80248d001D14960
17176B15976J88368q5810I2032J90464r1862K24871A81285L08177c1079C83343
17165B31854O82O7533D2105L21299F1365K93165a65847A59656p9308J92412A31533
17153b090B19795L5179K59605k05442I3317J50399r0990J61144j24997K92992
17143D81865k7032j11220B3633K03624J22881k62j08167a12898E8911Q3202J33625
17132B75738n2355j1498N17908B67785j9293J14399J44443N0794A57963J6058
17122A74021L96417j36390A09821D1309L90840k04076G3177J30421J18239O5994
$$ plain form
17112 387831 384068 425267 280991 82182 284012 379307 70536 161853 258940 301791 549943
17101 549943 140156 295554 106002 562536 223442 87125 600857 464969 458724 238209
17091 238209 207824 472014 328244 375619 -34358 588444 226018 200607 472520 501002
17081 501002 660822 388136 475165 188103 445853 552152 353403 230530 539021 311860
17071 311860 584828 237115 492906 283229 149630 299346 95723 136067 504968 585728
17061 585728 378932 429996 304629 370913 266363 378931 824748 578142 536217 408581
17051 408581 398491 371781 214088 194879 436336 490626 242175 658156 385280 386590 324946
17040 324946 543094 624495 580703 330144 495581 171167 423400 431345 543059 501235
$$ packed form
17112C87831l763M1199j44276H2182K01830R5295G0536R1317R7087M2851K48152
17101E49943A40156J55398A06002M56534B23442H7125N13732j35888o245k20515
17091B38209l0385K64190j43770M7375c4358E88444B26018k5411K71913K8482
17081E01002J59820k72686Q7029A88103K57750J06299j98749j22873L08491k27161
17071C11860K72968B37115K55791k09677j33599J49716I5723M0344L68901Q0760
17061E85728k06796N1064j25367O6284j04550J12568M45817k46606m1925j27636
17051D08581j0090k6710j57693j9209K41457N4290B42175M15981k72876J310o1644
17040C24946K18148Q1401m3792k50559J65437A71167K52233P945J11714m1824
$$ plain form
17030 501235 406326 404039 174140 429997 591124 575027 340535 658056 532000 663663
17020 663663 192175 760108 519030 593869 738893 609434 337092 416262 616634 587724
17010 587724 463968 311015 445982 678143 294608 338198 391347 499021 314136 727094
17000 727094 377869 397441 581321 595049 634804 519347 800424 756515 477264 374331
16990 374331 319918 572086 491895 670511 731129 600179 770266 516615 732759 962982
16980 962982 539518 803068 483360 720350 845653 652166 534067 717841 828778 684103
16970 684103 806809 752714 579482 839602 657000 617680 712831 617938 826718 730559
16960 730559 806390 596828 807452 753884 911158 902367 608490 678250 1078378 855050
$$ packed form
17030E01235r4909k287A74140K55857J61127j6097k34492L17521j26056J31663
17020F63663A92175N67933k41078P4839J45024j29459k72342P9170K00372k8910
17010E87724j23756j52953J34967K32161B94608M3590N3149J07674j84885M12958
17000G27094l49225J9572J83880J3728L9755j15457K81077m3909k79251j02933
16990C74331n4413K52168q0191J78616O0618j30950J70087k53651K16144K30223
16980I62982m23464K63550l19708K36990J25303j93487j18099J83774J10937j44675
16970F84103J22706n4095j73232K60120j82602l9320R5151r4893K08780r6159
16960G30559P5831k09562K10624n3568J57274q791k93877O9760M00128k23328
$$ plain form
16950 855050 597462 920961 652925 971561 752939 850555 808684 1289922 687634 1021534
16940 1021534 910255 968484 920743 1210949 1100284 1270314 1154267 708060 904698 797978
16930 797978 1083393 966772 932780 1377560 1011531 1185286 1276171 1314429 1308611 1266392 1209856
16919 1209856 1288658 1452784 1381941 1052261 1139023 1346799 1262939 1402906 1359454 1201567
16909 1201567 1105785 1088522 943807 1513534 1433109 1781601 1598317 1335264 1321269 1521598
16899 1521598 1325511 1339971 1595609 1718993 1092339 1507736 1422870 1508860 1586213 1629096
16889 1629096 1653447 1779610 1633036 1901290 1950593 1718027 1760920 1480327 1811871 1733113
16879 1733113 1883327 1732778 1809357 1678032 1682733 1897577 2300305 2157049 1926278 2005376
$$ packed form
16950H55050k57588L23499k68036L18636k18622R7616m1871M81238o02288L33900
16940A021534j11279N8229m7741K90206j10665J70030j16047m46207J96638j06720
16930G97978K85415j16621l3992M44780l66029J73755R0885L8258n818m2219n6536
16919A209856P8802J64126p0843l29680Q6762K07776q3860J39967m3452j57887
16909A201567r5782j7263j44715N69727q0425L48492j83284k63053j3995K00329
16899A521598j96087J4460K55638J23384o26654M15397q4866Q5990P7353M2883
16889A629096K4351J26163j46574K68254M9303k32566M2893k80593L31544p8758
16879A733113J50214j50549P6579j31325M701K14844M02728j43256k30771P9098
$$ plain form
16869 2005376 1927165 2124212 2005978 2230084 1991733 2435540 2283434 2282790 1974959 2098870
16859 2098870 2293750 2388999 2171879 2396810 2163758 2447895 2690299 2578214 2575589 2425364
16849 2425364 2816204 2994639 2894380 2717997 2843635 2745047 2790469 3160770 2978551 3202579
16839 3202579 3071183 3496904 3489573 3506169 3255606 3536326 3629917 3575989 3354405 3644204
16829 3644204 3940568 3841590 3612941 4141847 3913279 3803225 4168585 4254492 4159133 4289531
16819 4289531 4559411 4727167 4475215 4680331 4892478 4774856 5007773 5024928 5412571 5134529
16809 5134529 5526757 5686874 5915115 5818432 5969628 6246748 5996182 6796975 6575000 6493306
16799 6493306 7067058 6868769 7465567 7244479 7396845 7800768 7770998 8006729 8245364 8493909
$$ packed form
16869B005376p8211J97047j18234K24106k38351M43807j52106o44l07831J23911
16859B098870J94880R5249k17120K24931k33052K84137K42404j12085k625j50225
16849B425364L90840J78435j00259j76383J25638r8588M5422L70301j82219K24028
16839C202579j31396M25721p331J6596k50563K80720R3591n3928k21584K89799
16829C644204K96364r8978k28649N28906k28568j10054L65360Q5907r5359J30398
16819D289531K69880J67756k51952K05116K12147j17622K32917J7155L87643k78042
16809E134529L92228J60117K28241r6683J51196K77120k50566Q00793k21975q1694
16799F493306N73752j98289N96798k21088J52366M03923k9770K35731K38635K48545
$$ plain form
16789 8493909 8765959 8782674 8815603 9821952 9590964 9853957 10464597 10539343 11027416 11224576
16779 11224576 11337016 11591429 12205009 12481444 13204959 13418330 13788314 14214965 14852646
16770 14852646 15088091 15599377 16292453 17046368 17464972 18213709 18570875 19549887 20086615
16761 20086615 21117314 21939735 22877347 23789853 24959934 25714614 27104458 28163175 29455410
16752 29455410 30807515 32115129 33938077 35799707 37551489 39900582 41549243 43714130
16744 43714130 45987244 48557807 51313108 54257556 57380771 60675712 64378883 68253833
16736 68253833 72537380 76773686 81660360 86275137 92131438 97481371 103642250 109935931
16728 109935931 116300825 123150820 130275366 137075195 144096052 150594668 156590903 162535675
$$ packed form
16789H493909K72050J6715L2929J006349k30988K62993O10640P4746M88073J97160
16779A1224576J12440K54413O13580K76435P23515K13371L69984M26651O37681
16770A4852646K35445N11286O93076P53915M18604P48737L57166R79012N36728
16761B0086615J030699Q22421R37612R12506J170081P54680J389844J058717J292235
16752B9455410J352105J307614J822948J861630J751782K349093J648661K164887
16744D3714130K273114K570563K755301K944448L123215L294941L703171L874950
16736F8253833M283547M236306M886674M614777N856301N349933O160879O293681
16728A09935931O364894O849995P124546O799829P020857O498616N996235N944772
$$ plain form
16720 162535675 167521717 171795736 174791191 176671872 177133692 176554348 174752367 171714983
16712 171714983 167656026 162624139 156707461 150619240 143935078 136885618 129550666 122637431
16704 122637431 115784402 109092677 102599891 96284199 90446600 85002295 79738875 74988601
16696 74988601 70290737 66472595 62527457 58741232 55586903 52502709 49622773 47163042
16688 47163042 44445734 41882352 40014534 37567127 35879145 34166980 32366908 30692287
16680 30692287 29436877 27949897 26572634 25914278 24689260 23560558 22631381 21481602
16672 21481602 20583363 19770178 19157675 18277743 17573919 17102613 16345731 15847318 15536905
16663 15536905 14722423 13983827 13687259 13384127 12724016 12304147 11694349 11430903 11224070
$$ packed form
16720A62535675M986042M274019K995455J880681M61820n79344j801981l037384
16712A71714983m058957n031887n916678o088221o684162p049460p334952o913235
16704A22637431o853029o691725o492786o315692n837599n444305n263420m750274
16696G4988601m697864l818142l945138l786225l154329l084194k879936k459731
16688D7163042k717308k563382j867818k447407j687982j712165j800072j674621
16680C0692287j255410j486980j377263o58356j225018j128702r29177j149779
16672B1481602q98239q13185o12503q79932p03824m71306p56882m98413l10413
16663A5536905q14482p38596k96568l03132o60111m19869o09798k63446k06833
$$ plain form
16654 11224070 10734562 10431775 10633594 10051393 9365182 9469029 9207384 8978168 8748292
16645 8748292 8427176 7894154 7913382 7453122 7327461 6766007 7025508 6802510 6886929 6589455
16635 6589455 6224716 6022469 6062033 6137026 5894239 5803361 5479289 5399155 5663071 5023139
16625 5023139 4918419 5023179 4566672 5149036 4547641 4511050 4448878 4481357 3943829 4219797
16615 4219797 3953134 3967005 3954250 3960845 3614121 3754118 3544980 3463542 3532117 3931278
16605 3931278 3049825 3446662 3249225 3089615 3291799 3206081 3125173 2882879 2953857 2583741
16595 2583741 2877178 2865440 2954978 2750009 2953850 2844795 2551117 2418744 2560280 2492461
16585 2492461 2257355 2183851 2070735 2170985 2147854 2087437 2259612 2368973 2299266 2284177
$$ packed form
16654A1224070m89508l02787K01819n82201o86211J03847k61645k29216k29876
16645H748292l21116n33022J9228m60260j25661n61454K59501k22998Q4419k97474
16635F589455l64739k02247L9564P4993k42787r0878l24072q0134K63916o39932
16625E023139j04720J04760m56507N82364o01395l6591o2172L2479n37528K75968
16615D219797k66663J3871j2755O595l46724J39997k09138q1438O8575L99161
16605C931278q81453L96837j97437j59610K02184q5718q0908k42294P0978l70116
16595B583741K93437j1738Q9538k04969K03841j09055k93678j32373J41536o7819
16585B492461k35106p3504j13116J00250k3131o0417J72175J09361o9707j5089
$$ plain form
16575 2284177 2073860 2006561 2181256 1715289 2178998 2122701 1699735 1729423 1867340 2097953
16565 2097953 1853106 1690633 1874773 1833197 1487700 1875023 1479848 1511836 1437480 1570439
16555 1570439 1738525 1264462 1402004 1493806 1289965 1799326 1281419 1593595 1371309 1533722
16545 1533722 1446747 1371070 1321679 1611436 1393184 1566890 1163246 1431546 1235705 1464199
16535 1464199 1323484 1239114 1386603 1331350 1072559 1148461 738818 922463 954580 1159561
16525 1159561 1065007 798756 1087779 860466 1219330 955774 984775 1118167 1044637 866770
16515 866770 911260 712450 1238385 1179452 876691 814727 969550 839796 971851 972777 962182
16504 962182 811821 915475 820479 801269 708871 1163397 1121487 950629 794439 1057045
$$ packed form
16575B284177k10317o7299J74695m65967M63709n6297m22966K9688J37917K30613
16565B097953k44847j62473J84140m1576l45497L87323l95175L1988p4356J32959
16555A570439J68086m74063J37542R1802k03841N09361n17907L12176k22286J62413
16545A533722q6975p5677m9391K89757k18252J73706m03644K68300j95841K28494
16535A464199j40715q4370J47489n5253k58791P5902m09643J83645L2117K04981
16525A159561r4554k66251K89023k27313L58864k63556K9001J33392p3530j77867
16515H66770M4490j98810N25935n8933l02761o1964J54823j29754J32055R26j0595
16504I62182j50361J03654r4996j9210r2398M54526m1910j70858j56190K62606
$$ plain form
16494 1057045 568312 817816 823149 1016679 701626 577273 670680 570149 715414 623496
16484 623496 756604 473413 943718 583030 524565 815106 634422 744372 637551 1002130
16474 1002130 745610 432995 359155 608157 583383 837352 648248 815836 869311 752822
16464 752822 669619 694856 510767 594895 713811 445183 473483 454838 868687 607887
16454 607887 650085 285998 375566 602646 485220 577707 417023 864401 583770 680732
16444 680732 569445 471200 408407 472318 546226 731084 498134 751203 215556 496662
16434 496662 654408 221611 516896 556778 435048 389450 693547 487293 485178 615148
16424 615148 600887 809721 86930 504723 405299 347353 63565 56726 486462 12244 306792
$$ packed form
16494A057045m88733K49504N333J93530l15053j24353R3407j00531J45265r1918
16484F23496J33108k83191M70305l60688n8465K90541j80684J09950j06821L64579
16474A002130k56520l12615p3840K49002k4774K53969j89104J67588N3475j16489
16464G52822q3203K5237j84089Q4128J18916k68628K8300j8645M13849k60800
16454F07887M2198B85998Q9568K27080j17426R2487j60684M47378k80631R6962
16444F80732j11287r8245o2793O3911P3908J84858k32950K53069B15556K81106
16434D96662J57746B21611K95285L9882j21730m5598L04097k06254k115J29970
16424F15148j4261K08834H6930M17793r9424n7946F3565o839M29736A2244K94548
$$ plain form
16413 306792 222599 210794 557899 599429 374601 751139 418452 413007 372677 568084 97037
16401 94597 554664 444184 482294 484091 202427 748462 545235 98143 367367 228121
16391 228121 288208 330607 508150 391852 502580 243126 383004 277206 303740 334780
16381 334780 476621 388412 209815 163427 232329 549158 370710 332070 226129 481644
16371 481644 232872 340680 -15080 485281 222564 294501 381683 377834 251549 315234 271885
16360 271885 232691 277214 331828 162763 -139883 40856 226507 406275 386930 -146574
16349 -15567 176027 315831 483549 89939 -15415 368975 593169 436608 252065 185522
16339 185522 -67052 145164 228125 324796 88518 21188 170364 231670 259637 230845 198528
$$ packed form
16413C06792q4193j1805L47105M1530k24828L76538l32687n445m0330J95407I7037
16401I4597M60067j10480L8110J797B02427N46035k03227I8143K69224j39246
16391B28121O0087M2399J77543j16298J10728B43126J39878j05798K6534L1040
16381C34780J41841q8209j78597m6388O8902L16829j78448l8640j05941K55515
16371D81644B32872J07808a5080D85281B22564P1937Q7182l849j26285O3685m3349
16360B71885l9194M4523N4614A62763a39883D0856J85651J79768j9345a46574
16349a5567A76027J39804J67718H9939a5415C68975K24194j56561j84543o6543
16339A85522f7052A45164Q2961R6671H8518B1188J49176O1306K7967k8792l2317
$$ plain form
16328 198528 449798 1794 359678 302986 166408 -8425 257012 172839 -137957 355850 148131
16316 288542 214126 196535 394943 142733 51211 -20648 172857 280543 366659 475506
16306 475506 399084 309036 349031 195268 404310 496339 184013 -195682 51256 557291
16296 557291 282445 102022 188142 288243 136590 298997 -72907 286971 258858 481260
16286 481260 -222067 240676 143909 353341 -17110 466182 69522 369177 -84044 147695
16275 187104 259129 271589 330343 411492 -153904 471 62838 -262824 97274 247448 -116526
16263 211868 -97700 359568 239557 143510 217671 334562 261588 -25107 3210 -190982 -65988
16251 252341 500596 250057 39480 73533 164413 168389 358367 114669 59003 -26240 62029
$$ packed form
16328A98528K51270A794L57884n6692j36578h425B57012q4173a37957C55850A48131
16316B88542p4416j7591J98408A42733E1211b0648A72857J07686Q6116J08847
16306D75506p6422r0048L9995j53763K09042R2029A84013a95682E1256N06035
16296E57291k74846A02022Q6120J00101A36590J62407g2907B86971k8113K22402
16286D81260b22067B40676r6767K09432a7110D66182F9522K99655h4044A47695
16275A87104P2025J2460N8754Q1149a53904D71O2367b62824I7274J50174a16526
16263B11868i7700C59568j20011r6047P4161J16891p2974b5107C210a90982f5988
16251B52341K48255B50057C9480L4053R0880L976J89978A14669n5666b6240F2029
$$ plain form
16239 348907 40495 -134549 276384 -100650 -28134 262275 -59832 -168142 -5436 59376 134342
16228 134342 -101131 6469 204893 -119133 194042 84901 -126245 119656 -141137 -12914
16217 179131 350091 1252 235565 -96281 -113266 230044 175544 426025 275593 109163
16206 233690 212974 188117 -1976 -103408 104484 246955 72040 247199 43579 503554 -47775
16194 253138 -129130 -98233 30649 102139 166692 82251 15408 188481 424884 48301 155348
16183 155348 151140 114616 175639 120997 241217 -32363 -100707 -94791 -18141 -45770 280976
16171 37401 -216319 198160 365901 251095 -357524 183512 211687 153179 223552 -121221
16160 115164 329160 20653 24159 78258 76506 17010 -106128 128256 58524 -29156 281276
$$ packed form
16239C48907D0495a34549B76384a00650b8134B62275e9832j08310e436E9376P4966
16228A34342a01131F469J98424a19133A94042H4901a26245A19656a41137a2914
16217A79131J70960A252K34313i6281j6985B30044n4500K50481j50432A09163
16206B33690k0716k4857a976j01432A04484J42471G2040J75159D3579M59975d7775
16194B53138a29130L0897C0649P1490O4553H2251A5408J73073K36403D8301J07047
16183A55348m208l6524O1023n4642J20220c2363o8344N916a8141k7629B80976
16171C7401b16319A98160J67741j14806c57524A83512K8175n8508P0373a21221
16160A15164K13996B0653L506N4099j752A7010a06128A28256E8524b9156B81276
$$ plain form
16148 -23221 95621 23511 -38538 24388 307644 50294 -154081 42432 339526 -72088 -19410
16136 156419 27080 -132816 274991 54999 55996 -111826 105150 -243094 -136503 169170
16125 -145090 -260498 -39499 -5646 -57366 -108177 -78559 128418 16395 -354481 6036 67715
16114 67715 -88460 -6521 6318 -212204 148968 -205861 -12186 226794 -60812 96677 57392
16103 57392 -5024 291880 116479 28864 234269 -31402 -83481 80188 -118133 -129073 25166
16091 -149404 130177 42638 -32638 -393961 126624 -98879 -72283 -41513 -122872 35570 47233
16080 47233 -80533 38371 -1298 -44079 75380 174097 -4101 5626 174389 -57659 154407 -190854
16067 -32391 -195155 -142079 -93728 85096 -11970 -108393 117661 126991 101454 51058 19461
$$ packed form
16148b3221I5621B3511c8538B4388K83256E0294a54081D2432K97094g2088a9410
16136A56419B7080a32816B74991E4999R97a11826A05150b43094J06591A69170
16125a45090j15408c9499e646n1720n0811K9618A28418A6395c54481F036O1679
16114F7715h8460f521F318b12204A48968b05861a2186B26794f0812I6677l9285
16103E7392e024B91880A16479B8864K05405c1402n2079H0188a18133j0940B5166
16091a49404A30177D2638c2638l61323A26624i8879K6596L0770q1359C5570J1663
16080D7233h0533C8371a298m2781G5380R8717d101E626J68763e7659A54407a90854
16067c2391j62764N3076M8351H5096a1970r6423A17661R330k5537n0396A9461
$$ plain form
16055 -11814 38262 -74919 109989 -14484 119836 13491 167431 62436 -50071 -49765 89254
16043 -45659 67944 238764 -17197 -242320 1442 -267578 -216168 -152220 74367 -98203 -30515
16031 -48471 -157715 160184 -145240 14270 91192 1459 -16217 -219235 -226708 146392 96220
16020 96220 117709 -244038 -231034 -5168 117930 27792 -94316 -208026 -85750 -122664 -135412
16009 -135412 -63908 -135531 327181 98940 -154739 -108294 108467 371388 -249863 -117038
15998 -103110 69768 -121088 -293963 -399822 -256892 -48704 29130 61138 53237 249735 -180369
15986 141489 -106962 -107423 164594 209895 287298 -230785 398639 324509 284495 22625 -136008
15974 39179 -124100 -98503 -117152 -42661 -23955 84295 259488 263843 165594 -32268 -86121
$$ packed form
16055a1814C8262g4919A09989a4484A19836A3491J53940F2436e0071L06H9254
16043d5659F7944J70820a7197k25123A442b67578N1410O3948G4367i8203c0515
16031d8471j09244A60184a45240A4270P6922A459a6217k03018p473A46392n0172
16020I6220K1489b44038J3004e168A17930B7792i4316j13710h5750l6914j2748
16009a35412f3908p1623C27181I8940a54739M6445A08467K62921b49863a17038
15998a03110F9768a21088j72875j05859J42930d8704B9130L2008p901J96498a80369
15986A41489a06962m61A64594M5301P7403b30785C98639p4130m0014B2625a36008
15974C9179a24100K5597j8649d2661J8706H4295J75193M355r8249c2268n3853
$$ plain form
15963 -86121 -108300 -20497 -181479 -51258 -158769 -7839 153533 -69893 100555 -7339 85307
15951 -391631 157405 -295356 211539 131409 -8530 -2260 58016 -122372 -10690 -91315 -245051
15940 -245051 219460 -2343 -138561 61949 -126051 -435607 68888 -129684 88924 15433 145658
15929 145658 -201640 -204911 -108902 189596 -427383 -239740 95134 -64316 -177526 364999
15918 1935 80912 -14664 -48841 -94165 226538 -204239 -131180 219949 312591 -153234 -130914
15907 -130914 -29873 -9473 -124546 73282 -33701 -176525 -12736 56219 3413 17809 211865
15896 211865 -40053 -121464 -22654 -46564 22252 -276120 164026 151677 -197724 -193602 -139330
15885 -139330 -98198 -268452 58247 93487 -25719 265837 -322599 -212571 -315591 -131589
$$ packed form
15963h6121k2179b0497j60982e1258j07511g839A53533f9893A00555g339H5307
15951c91631A57405b95356B11539q0130h530b260E8016a22372a0690q0625j53736
15940b45051B19460b343j36218F1949a26051l09556F8888a29684H8924A5433J30225
15929A45658b01640l271R6009A89596d27383J87643I5134f4316j13210C64999
15918A935P8977a4664l4177m5324B26538b04239P3059B19949R2642a53234K2320
15907a30914b9873i473j15073G3282c3701j42824a2736E6219C413J4396J94056
15896B11865d0053q1411b2654k3910B2252b76120A64026j2349a97724M122N4272
15885a39330M1132j70254E8247L5240b5719B65837c22599J10028j03020a31589
$$ plain form
15874 -36621 -50554 -185260 74984 153361 -132229 28145 -333798 -8908 -40667 -192718 114205
15862 -197549 -64985 -130691 -123844 378271 -143889 -191863 -233956 65581 -75532 97241 116816
15851 116816 587168 19805 326768 -92189 -86709 -169137 63456 299444 260436 -29290 175407
15839 -65044 -111080 207625 -38131 -4873 -106527 29843 143132 -203049 -277004 -40468 76117
15827 -500721 149723 -6765 18490 84106 19884 -143020 -213333 250615 -88210 -57770 6474
15815 -153079 -251345 -137993 162507 110099 -97392 -213119 -113338 -120884 -137129 -158932 -348984
15804 -348984 -81377 -135979 79341 139718 93120 142992 126478 122493 22254 -469531 25151
15792 226362 103096 69973 -184735 -305028 -38208 -175756 -113492 -179517 -226462 -123651
$$ packed form
15874c6621j3933j34706G4984P8377a32229B8145c33798h908l1759j52051A14205
15862a97549f4985o5706O847C78271a43889m7974m2093F5581g5532I7241J9575
15851A16816M70352A9805L06963i2189N480q2428F3456K35988l9008b9290A75407
15839f5044m6036B07625c8131d873j01654B9843J13289b03049p3955d0468G6117
15827e00721A49723f765A8490O5616A9884a43020p0313B50615h8210L0440F474
15815a53079r8266J13352A62507n2408i7392j15727R9781p546j6245k1803j90052
15804c48984h1377n4602G9341O0377m6598M9872j6514l985B2254d69531B5151
15792B26362A03096l3123a84735j20293c8208j37548O2264o6025m6945J02811
$$ plain form
15782 -123651 29188 -90944 -147173 128176 67460 171013 143346 -36544 140693 85684 -141728
15770 -82565 -145210 -132434 81974 -188142 -125709 101966 -62728 24643 -156203 11441 176683
15759 176683 -115249 -31910 42699 52508 -298266 141720 -129011 -336273 -276484 -30141 -37213
15748 -37213 -37435 -97850 -93461 95149 30877 -201556 -25545 86038 -197557 -227226 -97765 -20998
15735 -66569 -189809 -42657 -176716 -233719 -52507 -80458 -25142 80478 113424 -3455 62643
15723 104091 -159070 75402 199358 -159222 144601 -33664 -19863 -282808 -153221 120525
15712 86780 -198821 -166200 13766 23132 55319 -38564 -150308 -170887 -332561 91878 171495
15701 171495 135533 101847 216790 -113423 -121007 -54809 209639 -91087 249139 -26024 4473
$$ packed form
15782a23651B9188i0944n6229A28176o0716J03553k7667c6544A40693n5009a41728
15770h2565o2645J2776H1974a88142O2433A01966f2728B4643a56203A1441J65242
15759A76683a15249c1910D2699R809b98266A41720a29011k07262N9789c0141p072
15748c7213k22o0415M389I5149C0877b01556b5545H6038a97557k9669i7765b0998
15735f6569j23240d2657j34059n7003e2507k7951b5142H0478L2946c455F2643
15723A04091a59070G5402J23956a59222A44601c3664J3801k62945J29587A20525
15712H6780a98821L2621A3766R366L2187c8564j11744k0579j61674I1878P9617
15701A71495l5962l3686J14943a13423p584e4809B09639i1087B49139b6024D473
$$ plain form
15689 137795 346975 -23137 -25301 -132175 100346 67795 -272302 164608 323173 114313
15678 -106853 53531 73259 -20648 219836 32253 431380 134558 13743 -154144 -230243 261013
15666 -56470 -358954 71924 168226 115938 -102962 -238580 273184 118125 -30204 246047
15655 57181 149933 -10543 -359903 61357 -271667 37484 12102 -116997 -193409 -148270 -67441
15643 -31677 -134016 -44034 -368023 -329573 -177071 92819 40773 -182653 -89536 -275186 242369
15631 -319405 -118812 -184065 83256 151805 181335 50598 -72711 74233 -137445 -105211 -30628
15619 -323755 -92361 -17481 9962 -125399 315000 84808 -53311 51902 -169221 -393279 -164799
15607 19552 284303 -292245 -314441 -95924 -208911 -128930 -405528 7235 135619 174173 195178
$$ packed form
15689A37795K09180b3137k164j06874A00346l2551b72302A64608J58565A14313
15678a06853E3531J9728b0648B19836C2253L99127A34558A3743a54144p6099B61013
15666e6470l02484G1924R6302n2288a02962j35618B73184A18125c0204B46047
15655E7181R2752a0543l49360F1357b71667C7484A2102a16997p6412M5139f7441
15643c1677j02339d4034l23989L8450J52502I2819D0773a82653h9536j85650B42369
15631c19405a18812o5253H3256O8549K9530E0598g2711G4233a37445L2234c0628
15619c23755i2361a7481I962a25399C15000H4808e3311E1902a69221k24058a64799
15607A9552K64751b92245k2196i5924j12987P9981k76598G235J28384L8554K1005
$$ plain form
15596 195178 40020 -198891 -61813 -125702 -253903 -210675 -28946 -81773 34340 -253941 88646
15584 -104633 389489 74243 -35408 -113420 -71182 215093 -74082 27268 -228476 -203145 41210
15572 -357606 -39418 67574 -29294 -38842 125150 21748 -80828 -30403 148382 174378 41949
15560 75627 -324895 -320888 105976 89718 -112297 51492 -144510 286058 -18626 -111434 -112075
15549 -112075 -198796 -28030 172629 -94478 -109524 97473 194381 224516 161418 -80667 236990
15537 92276 -120646 82577 279894 -17566 -30657 39209 61693 162755 134654 -55221 37660
15525 252210 -43068 -116380 -233068 120408 221436 -163344 146987 -65337 49803 3315 -65827
15513 5786 -214473 -153183 -84451 -174614 -202227 31974 -62809 48705 -34026 -111356 -233411
$$ packed form
15596A95178D0020a98891f1813o3889j28201M3228b8946n2827C4340b53941H8646
15584a04633C89489G4243c5408p8012M2238B15093g4082B7268b28476K5331D1210
15572c57606c9418F7574b9294r548A25150B1748h0828c0403A48382K5996D1949
15560G5627c24895M007A05976j6258a12297E1492a44510B86058a8626r2808o41
15549a12075q6721b8030A72629i4478j5046I7473R6908L0135o3098h0667B36990
15537I2276a20646H2577J97317a7566j3091C9209K2484J01062k8101e5221C7660
15525B52210d3068p3312j16688A20408J01028a63344A46987f5337D9803C315f5827
15513E786b14473O1290O8732r0163k7613C1974f2809D8705c4026p7330j22055
$$ plain form
15502 -233411 -20230 -132723 -232710 21101 -194985 -220690 -171131 -123033 -33615 -295613 -10042
15490 73830 -133756 405497 -335118 21728 152915 -170948 -403855 51565 -74669 512863
15479 182678 121161 16637 168113 -317778 -156572 128879 37169 -136517 3874 24791 137710
15468 137710 25089 111480 100753 39916 -36717 -53621 204950 -136081 -210644 9753 -103779
15456 -55892 63990 -48132 -189944 304044 112205 62154 190908 -123895 -5122 -88316 -16983
15444 -97211 -204632 115878 -67599 -270298 -284097 195939 -147092 -201886 -130454 170704
15433 198227 72923 264954 -176824 -160521 -94101 -87544 228924 -27103 71676 155205 64562
15421 125742 5232 -52654 -112292 54777 134671 34027 -122874 181508 40337 -127437 173492
$$ packed form
15502b33411b0230j12493r9987B1101a94985k5705M9559M8098c3615k61998a0042
15490G3830a33756D05497c35118B1728J31187a70948k32907E1565g4669E12863
15479A82678o1517A6637J51476c17778a56572A28879C7169a36517C874K0917J12919
15468A37710B5089Q6391j0727C9916c6717j6904B04950a36081p4563I753a03779
15456e5892F3990d8132j41812C04044A12205n0051J28754a23895e122q3194a6983
15444i7211j07421A15878f7599k02699j3799A95939a47092n4794P1432A70704
15433A98227G2923J92031a76824J6303O6420O557B28924b7103G1676Q3529F4562
15421A25742E232e2654n9638E4777P9894C4027a22874A81508D0337a27437A73492
$$ plain form
15409 243127 224101 329263 144672 -11552 -119121 19372 29887 -50737 95085 -72130 -260910
15398 -260910 199012 -209048 -165758 167165 76609 81656 -55399 -73745 103509 1869 -143545
15386 -251914 134084 -100292 111712 21695 -66448 -249961 37545 -146206 -186178 -43750
15375 -2868 -62917 269088 -159085 -118911 -85351 -120943 -64565 39567 -136176 398155 -190998
15363 -13261 11396 -8219 242780 -413906 -163634 -294732 243139 197629 -134403 -70588 340561
15351 213027 142441 140722 170485 137409 -91746 -264527 -428328 133886 -216632 -157745 152711
15339 55127 -265484 -79888 -118640 -58889 -218655 87005 -23857 129776 232789 -219960 -66495
15327 -178862 320611 -374910 81042 62065 -186385 -94599 61028 -92307 58903 323999 58477
$$ packed form
15409B43127j9026J05162A44672a1552j07569A9372J0515e0737I5085g2130j88780
15398b60910A99012b09048M3290A67165G6609N047e5399j8346A03509A869a43545
15386b51914A34084a00292A11712B1695f6448j83513C7545a46206l9972d3750
15375b868o0049B69088a59085M0174L3560l5592N6378C9567a36176C98155a90998
15363a3261A1396h219B42780d13906a63634j31098B43139m5510a34403O3815C40561
15351B13027p0586j719K9763l3076i1746j72781j63801A33886b16632N8887A52711
15339E5127b65484g9888l8752e8889j59766H7005b3857A29776J03013b19960f6495
15327a78862C20611c74910H1042j8977a86385R1786F1028i2307E8903K65096E8477
$$ plain form
15315 117632 98314 29401 -37700 -160857 -91496 -291007 140980 -79444 -173243 -206452 -164182
15304 -164182 10413 -32789 226247 210051 -262510 -155887 483663 304714 46464 -38503
15293 308857 71841 119140 82050 -117780 -164533 129323 48665 26383 23514 103545 -242481
15281 426299 -373626 -124007 -41990 191146 12525 -19164 -41515 81298 67988 488410 -117030
15269 369693 139572 185633 286645 63445 -20320 -6841 85806 -48642 305980 138033 237730
15258 237730 -164788 275526 -149505 200062 -212219 72886 297820 132616 213246 149585
15248 149585 650278 555884 1453219 1854779 1715775 2054272 1421697 764157 375199 85856
15237 62296 -73076 -301311 268929 22230 -156828 -109599 -269586 78269 -88141 -135165 -222401
$$ packed form
15315A17632j9318B9401c7700j23157O9361j99511A40980g9444r3799l3209M2270
15304a64182A0413c2789B26247j6196b62510J06623D83663j78949D6464c8503
15293C08857G1841M7299l7090a17780m6753A29323D8665k2282k869Q0031b42481
15281D26299c73626a24007d1990A91146A2525a9164k2351H1298j3310M20422a17030
15269C69693A39572M6061J01012F3445b0320f841H5806d8642C05980A38033R9697
15258B37730a64788B75526a49505B00062b12219G2886K24934A32616Q0630o3661
15248A49585N00693r4394Q97335M01560j39004L38497o32575o57540C75199H5856
15237F2296g3076k28235B68929B2230a56828M7229j59987G8269h8141m7024q7236
$$ plain form
15226 -222401 8673 -158249 466761 221128 293600 -15048 -93942 236540 -130047 25973 -115257
15214 57619 82206 -94026 -51908 134537 132148 -68841 96989 -72531 -74345 37265 211266 -33509
15201 -149530 110025 -117289 243151 -199773 128897 128339 34720 -318879 57450 -92284 118585
15189 402868 -28260 -9810 -314993 4489 351822 -182726 184651 161432 92147 48392 428619
15178 428619 223609 159688 -26091 -28820 198020 -90857 -199209 83961 98504 -131413 38664
15166 -121615 -16689 111907 248087 131934 144319 -30819 -56178 -10797 57438 429049 23282
15154 615232 -150441 276835 257354 173507 198702 40221 441408 -125861 -96456 -56644 -85336
15143 -85336 -127652 136701 153558 -161450 236045 80035 253682 173003 -32226 312965 164653
$$ packed form
15226b22401H673a58249D66761B21128P2472a5048p8894B36540a30047B5973a15257
15214E7619K4587i4026M2118A34537k389f8841I6989g2531j814C7265J74001c3509
15201a49530A10025a17289B43151a99773A28897n58C4720c18879E7450i2284A18585
15189D02868b8260i810l05183D489L47333a82726A84651k3219o9285m3755L80227
15178D28619k05010o3921b6091k729A98020i0857j08352H3961J4543a31413C8664
15166a21615a6689A11907J36180j16153J2385c0819k5359a0797E7438L71611B3282
15154F15232a50441B76835j9481q3847K5195D0221M01187a25861K9405L9812k8692
15143h5336m2316A36701J6857a61450B36045H0035J73647q0679c2226C12965j48312
$$ plain form
15132 164653 -106081 174682 319095 77917 -10813 -31262 126768 175308 92700 67811 481971
15121 481971 407574 62504 226828 77224 327642 -21556 71064 196162 226693 221395 -302341
15109 101802 234595 -531181 -135531 157952 60550 -158693 -71784 15875 -98758 134706
15098 47806 33575 71517 -111816 -52482 74573 79536 212677 8976 217607 -69592 122471
15086 34502 293278 -9161 313014 -131244 166456 242631 242961 -147546 -172666 63335 302159
15075 302159 83632 330980 333270 71952 144978 198520 262291 387503 -110653 -197157 71619
15063 72173 253915 -6089 98681 -11792 299092 41529 -62008 -291318 431356 372282 307452
15052 307452 278928 146288 305296 419872 -1036 128051 381340 64759 109308 42588 66598
$$ packed form
15132A64653a06081A74682J44413G7917a0813k0449A26768M8540q2608k4889M14160
15121D81971p4397F2504J64324G7224K50418b1556G1064J25098L0531n298c02341
15109A01802J32793e31181a35531A57952F0550a58693g1784A5875i8758A34706
15098D7806j4231L7942a11816e2482G4573M963J33141H976K08631f9592A22471
15086C4502K58776i161C13014a31244A66456P6175L30a47546k5120F3335K38824
15075C02159H3632K47348K290G1952P3026N3542O3771J25212a10653q6504G1619
15063G2173J81742f089I8681a1792B99092D1529f2008k29310D31356n9074o4830
15052C07452k8524j32640J59008J14576a036A28051K53289F4759M4549D2588K4010
$$ plain form
15041 66598 7318 61099 319349 -50307 301454 345379 5179 258830 316365 360946 189363
15030 189363 -28951 260849 184678 55827 57157 268725 297974 89264 -17349 247692 349374
15019 349374 192734 223323 221068 242533 286064 106956 363790 134311 28499 73236 43523
15008 43523 650 -29194 261082 267220 280030 -9933 175717 -53670 409061 143015 133833 210212
14996 210212 77381 336749 143509 260478 441260 -109488 45211 156755 -13741 178672
14985 630652 -258109 376720 62914 226021 31408 182192 111902 111759 -153579 270086 68192
14973 12757 298390 334988 412264 24557 84996 309632 261748 424998 101898 496555 75747
14961 302401 415449 116576 216372 19257 302313 64452 284454 334460 343393 224830 355472
$$ packed form
15041F6598G318N3781K58250e0307C01454M3925E179K53651N7535M4581j71583
15030A89363b8951B60849p6171E5827J330K11568K9249H9264a7349B47692J01682
15019C49374j56640L0589k255K1465M3531A06956K56834A34311B8499M4737k9713
15008D3523F50b9194B61082O138J2810i933A75717e3670D09061A43015r182P6379
14996B10212G7381K59368A43509J16969J80782a09488D5211J11544a3741A78672
14985F30652b58109C76720F2914J63107C1408J50784p0290j43a53579B70086F8192
14973A2757K85633L6598P7276B4557O0439K24636m7884J63250A01898L94657G5747
14961C02401J13048A16576R9796A9257K83056F4452K20002N0006Q933j18563J30642
$$ plain form
14950 355472 149303 119575 493314 294054 -32328 86746 271373 336564 174056 176871 137979
14939 137979 100268 154019 15878 147521 55266 556542 174141 355873 -38299 254297
14928 270503 203150 162118 158395 192822 237389 74345 321244 301264 650709 166044 484695
14917 484695 74318 308505 225443 364208 194488 214753 146422 99887 75273 295971 157258
14906 157258 285525 342216 196175 485983 -84974 110195 281561 81549 49247 206577
14896 206577 107108 127506 88085 286244 279282 359475 285219 407660 550078 354169 333920
14885 333920 318739 304702 34801 247558 239313 326039 189876 374226 74071 570542 64943
14873 296139 462438 159180 396425 189697 311181 323167 184759 153308 197936 675657
$$ packed form
14950C55472A49303k9728L73739j99260c2328H6746J84627O5191j62508K815l8892
14939A37979l7711N3751A5878J31643E5266N01276A74141J81732c8299B54297
14928B70503o7353m1032l723L4427M4567G4345K46899j9980L49445A66044L18651
14917D84695G4318K34187q3062J38765j69720K0265o8331m6535k4614K20698j38713
14906A57258J28267N6691j46041K89808h4974A10195J71366H1549l2302J57330
14896B06577r9469K0398l9421J98159o962Q0193p4256J22441J42418j95909k0249
14885C33920j5181j4037C4801K12757q245Q6726j36163J84350G4071M96471F4943
14873B96139J66299A59180K37245A89697J21484J1986j38408l1451M4628M77721
$$ plain form
14863 675657 112490 462421 143513 286237 353843 377610 230311 -96538 483833 295575
14853 295575 402848 330265 513499 138305 338155 364085 582676 173784 218213 534604
14843 534604 442490 541213 107781 473966 483587 325617 369098 539100 333977 227812
14833 227812 403533 232344 417113 659454 127904 176494 330065 481072 316640 174250
14823 174250 187926 325766 487483 490009 342748 329371 611186 448270 565342 394636
14813 394636 222719 469274 726478 297194 590526 88599 181252 476125 289977 409705
14803 409705 609525 242324 354673 294972 484022 489234 296892 363558 284708 493259
14793 493259 225955 666210 368688 472292 559148 362204 382023 311778 445844 484127
$$ packed form
14863F75657A12490L49931A43513J42724O7606K3767j47299i6538D83833j88258
14853B95575J07273p2583J83234A38305J99850K5930K18591A73784M4429L16391
14843E34604r2114R8723A07781L66185R621j57970M3481J70002k05123j06165
14833B27812J75721j71189J84769K42341A27904M8590J53571J51007j64432j42390
14823A74250J3676J37840J61717K526j47261j3377K81815j62916J17072j70706
14813C94636j71917K46555K57204B97194K93332H8599R2653K94873j86148J19728
14803D09705J99820B42324J12349n9701J89050N212j92342O6666p8850K08551
14793D93259B25955M40255k97522J03604Q6856j96944J9819p0245J34066L8283
$$ plain form
14783 484127 123282 458082 250490 477226 589658 735996 492240 371991 654403 650278
14773 650278 416332 779727 662456 352935 536947 601002 521551 352397 672295 386260
14763 386260 511527 402555 489125 300048 390417 654087 420993 870293 704754 868646
14753 868646 785482 471191 328656 414324 647544 698595 387001 512261 518531 511665 833109
14742 833109 275193 322664 579559 560451 357655 733880 350059 585691 515837 636762
14732 636762 602726 335045 709769 433813 501089 507481 463760 866468 311076 378799 764756
14721 764756 553233 686153 523672 745245 548438 747017 722935 541533 671797 616062
14711 616062 697618 386845 648181 765677 1065277 421180 196929 676547 672362 592497
$$ packed form
14783D84127A23282L34800k07592K26736J12432J46338k43756j20249K82412m125
14773F50278k33946L63395j17271l09521J84012O4055p9451j69154L19898k86035
14763C86260J25267j08972Q6570j89077R0369K63670k33094M49300j65539J63892
14753H68646q3164l14291j42535Q5668K33220N1051l11594J25260O270o866L21444
14742H33109B75193M7471K56895j9108k02796L76225C50059K35632o9854J20925
14732F36762l4036k67681L74724k75956O7276O392m3721M02708C11076O7723L85957
14721G64756k11523J32920j62481K21573j96807J98579k4082j81402J30264n5735
14711F16062Q1556l10773K61336J17496K99600D21180A96929M79618m185p9865
$$ plain form
14701 592497 720477 954182 627271 813223 706362 603304 956559 681666 939024 636908
14691 636908 362846 610500 813557 728798 418762 781486 627677 1235245 736762 662748
14681 662748 677530 798087 514595 976333 776777 503100 724100 438988 687001 1080889
14671 1080889 921497 581235 1055581 1058479 692064 1008362 992204 667675 1113848 1055322
14661 1055322 679805 754781 884669 767370 1036242 888073 1036550 1061750 1109181 840019
14651 840019 1192958 1209977 682229 1026502 1055298 981764 1099441 663682 956446 812257
14641 812257 1158545 1239292 841224 876958 983860 1174172 1025022 1176570 1102300 1108971
14631 1108971 1117282 1325343 969613 922628 1055597 1116750 1076379 1220704 1298856 991236
$$ packed form
14701E92497J27980K33705l26911J85952j06861j03058L53255k74893K57358l02116
14691F36908k74062K47654K03057q4759l10036L62724j53809O07568m98483p4014
14681F62748J4782J20557k83492M61738j99556k73677K21000k85112K48013L93888
14671A080889j59392l40262M74346K898l66415L16298j6158l24529M46173n8526
14661A055322l75517P4976J29888j17299K68872j48169J48477K5200M7431k69162
14651H40019L52939J7019n27748L44273K8796p3534J17677m35759K92764j44189
14641H12257L46288Q0747l98068L5734J06902J90312j49150J51548p4270O671
14631A108971Q311K08061l55730m6985J32969O1153m0371J44325P8152l07620
$$ plain form
14621 991236 1167106 1145326 1215012 1012878 1108680 1038620 1339991 1198082 998766 1077034
14611 1077034 1288343 1410343 1040580 1477727 1296967 1372079 1081611 1409368 995547 1633028
14601 1633028 1349784 1355876 1214774 1543538 1470288 1299070 1515555 1434803 1461521 1477738
14591 1477738 1500388 1809744 1591667 1333516 1249726 1305516 1625327 1486111 1448894 1452950
14581 1452950 1819004 1923051 1530687 1725000 1682415 1659972 1349197 1693408 1889530 1646832
14571 1646832 1790327 2134154 1880236 1940780 2123607 1903560 1758755 2141454 1933386 1938625
14561 1938625 2299319 2318146 2185569 2672666 2490487 2478512 2901984 3202977 3619205 3793984
14551 3793984 4034122 5196196 7418031 11846664 21387689 33862343 31486687 17223551
$$ packed form
14621I91236J75870k1780O9686k02134R5802p0060L01371j41909j99316P8268
14611A077034K11309J22000l69763M37147j80760P5112k90468L27757m13821O37481
14601A633028k83244O092j41102L28764p3250j71218K16485q0752K6718J6217
14591A477738K2650L09356k18077k58151q3790N5790L19811j39216l7217M056
14581A452950L66054J04047l92364J94313m2585k2443l10775L44211J96122k42698
14571A646832J43495L43827k53918O0544J82827k20047j44805L82699k08068N239
14561A938625L60694J8827j32577M87097j82179j1975M23472L00993M16228J74779
14551C793984K40138J162074K221835M428633R541025J2474654k375656j4263136
$$ plain form
14543 17223551 8284008 5864876 6153831 5100345 2987446 2221808 1983733 1823773 1672693
14534 1672693 1658998 1611256 1245690 1803155 1926145 1532949 1575716 1967855 1935363 1776688
14524 1776688 1877636 1812882 1915616 2053447 1993827 1763182 2008158 1963652 1985220 1958390
14514 1958390 2195560 2443500 2422986 2410407 2181310 2175399 2091141 2552388 2326666 2452833
14504 2452833 2649170 2694170 2787023 2586917 2638461 2406947 2571894 2464040 2657276 2630348
14494 2630348 2494476 2717787 2987062 2480121 2917722 2693782 2860744 3055470 2767069
14485 2767069 3136188 2983649 3346366 2919667 2745643 3180449 3397280 3333953 3076207 3248224
14475 3248224 3311877 3211967 3649155 3548210 3614430 3812919 3840158 3658574 4079544 3869664
$$ packed form
14543A7223551H284008k419132K88955j053486k112899p65638k38075j59960j51080
14534A672693j3695m7742l65566N57465J22990l93196M2767L92139l2492j58675
14524A776688J00948o4754J02734J37831n9620k30645K44976m4506K1568k6830
14514A958390K37170K47940k0514j2579k29097n911q4258M61247k25722J26167
14504B452833J96337M5000R2853k00106N1544k31514J64947j07854J93236k6928
14494B630348j35872K23311K69275n06941M37601k23940J66962J94726k88401
14485B767069L69119j52539L62717m26699j74024M34806K16831o3327k57746J72017
14475C248224O3653r9910M37188j00945O6220J98489K7239j81584M20970k09880
$$ plain form
14465 3869664 3923830 3938846 3877778 4070750 3844138 4262293 4081172 4059670 4167669 4288136
14455 4288136 3907214 4381600 4160984 4685237 4525058 4726885 4594722 4594553 4780892 4937240
14445 4937240 4790267 4754379 4885478 4942918 5089281 4894659 4975068 5034947 5128245 5240466
14435 5240466 5393781 5623569 5767960 5642405 5414180 5825942 6042818 5674089 5960655
14426 5960655 5873344 5927644 6206223 6413849 6335931 6330621 6565348 6735410 7003902 6874393
14416 6874393 7179557 7176633 7399528 7426606 7240555 7486737 7484733 7284692 7803511 8012162
14406 8012162 8141081 7978466 8317550 8478874 8905160 8610241 9082815 8767901 9051927
14397 9051927 9263393 9757131 9541523 9703476 9931389 10061155 10402675 10609078 10765644
$$ packed form
14465C869664N4166J5016o1068J92972k26612M18155j81121k1502J07999J20467
14455D288136l80922M74386k20616N24253j60179K01827j32163j69J86339J56348
14445D937240j46973l5888J31099N7440J46363j94622Q0409N9879R3298J12221
14435E240466J53315K29788J44391j25555k28225M11762K16876l68729K86566
14426E960655q7311N4300K78579K07626p7918n310K34727J70062K68492j29509
14416F874393L05164k924K22895K7078j86051K46182k004k00041N18819K08651
14406H012162J28919j62615L39084J61324M26286k94919M72574l14914K84026
14397I051927K11466M93738k15608J61953K27913J29766L41520K06403J56566
$$ plain form
14388 10765644 11178586 11005147 11156565 11363357 11728767 12127750 12063147 12227465 12650769
14379 12650769 12723526 13208549 13354783 13420635 13762360 13736559 14407876 14432551 14960027 15122349
14369 15122349 15382740 16055052 16021286 16332925 16650171 17144154 17497897 18122543 18263237
14360 18263237 18591678 19030654 19479605 20259266 20242532 21196128 21512132 21943417 22446886
14351 22446886 23228911 23340574 24292221 24870449 25328241 26224695 26699508 27539244 28190016
14342 28190016 28925184 29979008 30376037 31337076 32109065 33585771 34114670 35048441 36260122
14333 36260122 37641008 38415364 39435038 40924080 42476151 43754093 44719127 46115134
14325 46115134 47906838 49603601 51359450 53048586 54963328 56886335 59237270 61444089
$$ packed form
14388A0765644M12942j73439J51418K06792L65410L98983o4603J64318M23304
14379A2650769P2757M85023J46234O5852L41725k5801O71317K4675N27476J62322
14369A5122349K60391O72312l3766L11639L17246M93983L53743O24646J40694
14360A8263237L28441M38976M48951P79661j6734R53596L16004M31285N03469
14351B2446886P82025J11663R51647N78228M57792Q96454M74813Q39736O50772
14342B8190016P35168J053824L97029R61039P71989J476706N28899R33771J211681
14333C6260122J380886P74356J019674J489042J552071J277942R65034J396007
14325D6115134J791704J696763J755849J689136J914742J923007K350935K206819
$$ plain form
14317 61444089 63938172 66023533 68848526 71565138 74414948 77644811 81052597 84326672
14309 84326672 87763368 92095780 96008603 100090760 105019572 110127686 115301440 120834245
14301 120834245 126855389 133282672 140106529 147498479 155152759 163618385 172076276 181197854
14293 181197854 191087354 201615647 212689353 224293182 236682642 249642289 263009012
14286 263009012 277001476 291370013 306100540 320943247 335939288 351099005 365600118
14279 365600118 379465855 393078734 405920212 417163480 427095154 434843117 438796077
14272 438796077 439185548 438105247 434538999 429967341 425153994 420127331 413253412 403298599
14264 403298599 391412153 378118347 363454670 348195885 332335709 316905421 301158549
$$ packed form
14317F1444089K494083K085361K824993K716612K849810L229863L407786L274075
14309H4326672L436696M332412L912823M082157M928812N108114N173754N532805
14301A20834245O021144O427283O823857P391950P654280Q465626Q457891R121578
14293A81197854R889500J0528293J1073706J1603829J2389460J2959647J3366723
14286B63009012J3992464J4368537J4730527J4842707J4996041J5159717J4501113
14279C65600118J3865737J3612879J2841478J1243268R931674P747963L952960
14272D38796077L89471j080301l566248m571658m813347n026663o873919r954813
14264D03298599j1886446j3293806j4663677j5258785j5860176j5430288j5746872
$$ plain form
14257 301158549 285809302 271207500 256628409 243018158 230013861 218068488 207434536
14250 207434536 196803549 186121276 176066812 167124588 158384531 150504034 143272334
14243 143272334 136231307 129263890 122994104 117341254 111866048 106889542 102214163 97862814
14235 97862814 93219557 89279674 85385125 81955055 78852136 75976754 72664752 69739538
14227 69739538 66765942 64326604 61736421 59612496 57296399 55515628 53782204 51449068
14219 51449068 49716312 48103772 46303253 44825540 43583166 42215832 41220560 39533098
14211 39533098 38314183 37496274 36275598 35326747 34426859 33330763 32193151 31340682 30315577
14202 30315577 29818438 29323441 28131105 27603070 26984550 26381352 25581452 24524940 24175415
$$ packed form
14257C01158549j5349247j4601802j4579091j3610251j3004297j1945373j0633952
14250B07434536j0630987j0682273j0054464q942224q740057p880497p231700
14243A43272334p041027o967417o269786n652850n475206m976506m675379m351349
14235I7862814m643257l939883l894549l430070l102919k875382l312002k925214
14227F9739538k973596k439338k590183k123925k316097j780771j733424k333136
14219E1449068j732756j612540j800519j477713j242374j367334r95272j687462
14211C9533098j218915q17909j220676r48851q99888j096096j137612q52469j025105
14202C0315577m97139m94997j192336n28035o18520o03198p99900j056512l49525
$$ plain form
14193 24175415 23544791 23147868 22557457 21982705 21299373 20774160 20457528 19863934 19399805
14184 19399805 19086529 18517408 18251725 18054454 17148489 17145992 16390604 16229003 16293955 15910902
14174 15910902 15222442 15244290 15018946 14331854 14216407 13933495 13525689 13177611 13214299 12827936
14164 12827936 12549548 12165512 12117149 12032522 11779980 11288018 11320323 10905888 10954576 10744695
14154 10744695 10854128 10598499 10490142 9980728 9974613 9887214 9600196 9418511 9105772 9487517
14144 9487517 8931997 8911711 8824966 8424389 8430980 8334462 8073479 8206599 8211937 7818670 7661343
14133 7661343 7942331 7662562 7436000 7200876 7075637 7256866 7196814 7267751 6894320 6539154
14123 6539154 6544257 6551861 6517377 6475360 6372064 6218058 6477084 6028998 5938789 5780300 6063285
$$ packed form
14193B4175415o30624l96923n90411n74752o83332n25213l16632n93594m64129
14184A9399805l13276n69121k65683j97271r05965k497p55388j61601O4952l83053
14174A5910902o88460K1848k25344o87092j15447k82912m07806l48078L6688l86363
14164A2827936k78388l84036m8363q4627k52542m91962L2305m14435M8688k09881
14154A0744695J09433k55629j08357n09414o115q7399k87018j81685l12739L81745
14144I487517n55520k0286q6745m00577O591r6518k60983J33120N338l93267j57327
14133G661343K80988k79769k26562k35124j25239J81229o0052P0937l73431l55166
14123F539154N103P604l4484m2017j03296j54006K59026m48086r0209j58489K82985
$$ plain form
14112 6063285 5860248 5633695 5643600 5957240 5108628 5544072 5483837 5504778 5385394 5396276
14102 5396276 5329348 5341891 4901550 5074965 4964165 4708694 4819425 4964492 4780278 4540102
14092 4540102 4395636 4587949 4700401 4480293 4420543 4466858 4661483 4001417 4148587 3886153
14082 3886153 4033471 4103628 3885071 4016808 4193125 3915220 3928613 3679260 3827738 3606025
14072 3606025 3767626 3490181 3284913 3452581 3243227 3396706 3199580 3388278 3475156 3497807
14062 3497807 3578782 3577291 3452601 3483325 3339697 3217030 2914739 3315131 3226875 3242498
14052 3242498 3334940 2951952 3084577 3248934 3148025 2943235 2774572 2981341 2512798 2904166
14042 2904166 2840604 2536461 2506740 2521885 3006432 2540051 2717276 2687135 2824080 2307759
$$ packed form
14112F063285k03037k26553R905L13640q48612M35444o0235K0941j19384J0882
14102E396276o6928J2543m40341J73415j10800k55471J10731J45067j84214k40176
14092D540102j44466J92313J12452k20108n9750M6315J94625o60066J47170k62434
14082C886153J47318P0157k18557J31737J76317k77905J3393k49353J48478k21713
14072C606025J61601k77445k05268J67668k09354J53479j97126J88698Q6878K2651
14062C497807Q0975j491j24690L0724j43628j22667l02291M00392q8256J5623
14052C242498R2442l82988J32625J64357j00909k04790j68663K06769m68543L91368
14042B904166o3562l04143k9721J5145M84547m66381J77225l0141J36945n16321
$$ plain form
14032 2307759 2598989 2731482 2583113 2496966 2582600 2343757 2234937 2541103 2290915 2567190
14022 2567190 2678889 2353136 2443186 2175231 2384815 2409628 2495029 2005739 2162696 2237474
14012 2237474 2112535 2358287 2154230 1805518 2270801 1725373 2034089 1844513 1859537 2151006
14002 2151006 1965446 1720211 2033959 1838305 1993487 1697093 1960975 2091007 1925381
13993 1925381 2126000 1876161 2447556 3141810 4176240 7293781 15888803 30636548 32702583
13984 32702583 21080048 11786476 7042951 5147413 3960274 3612831 3161034 2790668
13976 2790668 2666987 2191740 2498589 2269313 2108222 2209802 2097432 2155763 1800985 1916145
13966 1916145 2254451 1900369 1928321 2070209 1967925 1892652 1658157 1688256 1835708 1801101
$$ packed form
14032B307759K91230J32493j48369q6147Q5634k38843j08820L06166k50188K76275
14022B567190J11699l25753R0050k67955K09584K4813Q5401m89290J56957P4778
14012B237474j24939K45752k04057l48712M65283n45428L08716j89576J5024K91469
14002B151006j85560k45235L13748j95654J55182k96394K63882J30032j65626
13993A925381K00619k49839N71395O94254J034430L117541Q595022J4747745K066035
13984C2702583j1622535r293572m743525j895538j187139l47443m51797l70366
13976B790668j23681m75247L06849k29276j61091J01580j12370N8331l54778J15160
13966A916145L38306l54082K7952J41888j02284p5273k34495L0099J47452l4607
$$ plain form
13956 1801101 1473658 1688177 1791856 1602265 1465017 1866254 1583936 1343615 1407013 1501631
13946 1501631 1306605 1305423 1426617 1412598 1692626 1460788 1340462 1726804 1403507 1534858
13936 1534858 1765413 1473227 1446474 1652931 1095619 1711006 1472241 1279032 1417177 1558004
13926 1558004 1148553 1480850 1281162 1566113 1307707 1125780 1247765 1631110 1129044
13917 1129044 1217620 903905 1048308 1419978 850217 1354894 1353711 1369159 1429391 1149180
13907 1149180 1089841 930641 1564038 1138159 1281988 1248911 954559 965468 1388664 821508
13897 821508 1010233 1261982 1062934 1220998 1263185 673508 1573264 1019045 1116000 1066827
13887 1066827 1139281 924805 1197487 763195 916260 1001679 830554 837070 990919 798110
$$ packed form
13956A801101l27443K14519J03679j89591j37248M01237k82318k40321O3398R4618
13946A501631j95026j182J21194j4019K80028k31838j20326L86342l23297J31351
13936A534858K30555k92186k6753K06457n57312O15387k38765j93209J38145J40827
13926A558004m09451L32297j99688K84951k58406j81927J21985L83345n02066
13917A129044Q8576l13715J44403L71670n69761N04677j183J5448O0232k80211
13907A149180n9339j59200O33397m25879J43829l3077k94352J0909M23196n67156
13897H21508J88725K51749j99048J58064M2187n89677Q99756n54219R6955m9173
13887A066827P2454k14476K72682m34292J53065Q5419j71125O516J53849j92809
$$ plain form
13877 798110 962033 927808 812953 1190440 850803 1108514 1251880 1089367 987088 912417
13867 912417 992057 863862 736264 868870 865881 768522 789984 1150924 763552 895427
13857 895427 1235761 932754 642662 830412 815637 839517 1017455 976044 871436 828687
13847 828687 839448 489486 900976 732883 730636 675901 665546 955074 771542 968829
13837 968829 536549 916912 908294 512777 450046 820363 1048028 939996 548884 830228
13827 830228 1046479 708180 796585 1045452 895130 859725 863626 640781 925197 985965
13817 985965 572356 854743 874391 606793 794930 347981 1124559 504846 555262 798406
13807 798406 514669 543741 782681 696588 507166 518189 745425 404730 696888 630828
$$ packed form
13877G98110J63923l4225j14855L77487l39637K57711J43366j62513j02279p4671
13867I12417P9640j28195j27598J32606k989r7359K1462L60940l87372J31875
13857H95427L40334l03007k90092J87750j4775K3880J77938m1411j04608m2749
13847H28687J0761l49962M11490j68093k247n4735j0355K89528j83532J97287
13837I68829m32280L80363q618l95517o2731L70317K27665j08032l91112K81344
13827H30228K16251l38299Q8405K48867j50322l5405L901k22845K84416O0768
13817I85965m13609K82387J9648k67598J88137C47981P76578E04846N0416K43144
13807G98406k83737K9072K38940q6093j89422J1023K27236l40695K92158o6060
$$ plain form
13797 630828 602121 922028 1055717 465316 717419 604168 720632 843343 645921 694780
13787 694780 442464 526109 738916 696829 816920 562967 489048 572815 400662 540514
13777 540514 520780 646740 460243 517280 573291 444111 608447 637601 872265 587860
13767 587860 768781 217602 513444 426370 753227 658862 714205 543462 641841 884092
13757 884092 486504 670099 725110 495571 784856 618457 357319 449974 482057 138556
13746 444265 246780 550785 629983 779988 612394 725005 536284 494582 408869 444295
13736 444295 144642 238508 448961 565975 758191 309755 773277 578568 394359 126994
13725 420012 608502 412416 580066 779094 552925 386053 330125 208218 418938 344402
$$ packed form
13797F30828k8707L19907J33689D65316K52103j13251J16464J22711j97422M8859
13787F94780k52316Q3645K12807m2087J20091k53953p3919Q3767j72153J39852
13777E40514j9734J25960j86497N7037N6011j29180J64336K9154K34664k84405
13767E87860J80921B17602K95842q7074L26857r4365N5343j70743R8379K42251
13757H84092l97588J83595N5011k29539K89285j66399k61138R2655L2083A38556
13746D44265j97485L04005P9198J50005j67594J12611j88721m1702q5713L5426
13736D44295A44642R3866K10453J17014J92216C09755M63522j94709j84209A26994
13725D20012J88490j96086J67650J99028k26169j66872n5928j21907K10720p4536
$$ plain form
13715 344402 1049511 502448 687970 479229 604976 490439 446699 583545 540862 562226
13705 562226 240744 400158 541243 463874 811693 422760 396622 267320 239597 240738
13695 240738 976774 408450 380025 247506 636063 575064 310130 504121 398219 428185
13685 428185 288285 604603 690712 397634 536796 417813 378128 551651 207656 509433
13675 509433 404085 505715 492798 667604 392742 350915 347058 239698 696392 385346
13665 385346 451374 333238 368452 231435 532069 248931 245169 467329 -129224 657255
13654 83931 381550 245483 253077 315876 324423 167087 398464 535966 448432 634778 322095
13643 322095 273651 349740 605861 491005 464075 207650 288651 285267 219673 396638 559310
$$ packed form
13715C44402P05109E02448J85522k08741J25747j14537m3740J36846m2683K1364
13705E62226B40744J59414J41085p7369L47819l88933k6138j29302k7723J141
13695B40738P36036D08450k8425j32519L88557o0999k64934J93991j05902K9966
13685D28185j39900L16318Q6109k93078J39162j18983l9685J73523B07656L01777
13675E09433j05348J01630j2917J74806k74862m1827l857j07360M56694l11046
13665C85346O6028j18136L5214j37017L00634B48931l762K22160a29224F57255
13654H3931K97619j36067P594O2799Q547j57336K31377J37502q7534J86346l12683
13643C22095m8444P6089K56121j14856k6930B07650Q1001l384o5594J76965J62672
$$ plain form
13632 559310 490792 208897 260448 195926 41940 383419 91832 333462 383704 180233 443718
13621 443718 96282 409445 342379 275639 416893 644341 429986 334681 165359 639615
13611 639615 462937 199536 302638 549012 132530 350866 149625 459058 276852 457754
13601 457754 549650 302103 75744 399526 219602 318493 182181 319702 418761 179790
13590 262661 108654 338423 240343 481307 194975 358722 165082 11078 196244 186878
13580 186878 347675 387305 220825 277929 363888 231959 423828 199508 103836 155477
13570 155477 169296 530966 576912 431906 204001 355507 592404 354739 246319 247299
13560 247299 262044 333937 43819 269760 142989 307767 190098 -22012 179109 200309
$$ packed form
13632E59310o8518B08897N1551o4522D1940L41479I1832K41630N0242A80233K63485
13621D43718I6282L13163o7066o6740J41254K27448k14355r5305A65359M74256
13611F39615j76678A99536J03102K46374A32530K18336A49625L09433j82206J80902
13601D57754R1896k47547G5744L23782j79924R8891j36312J37521R9059A79790
13590B62661A08654K29769r8080K40964A94975J63747A65082A1078J85166r366
13580A86878J60797L9630j66480N7104Q5959j31929J91869A99508r5672N1641
13570A55477J3819L61670M5946j45006B04001J51506K36897k37665j08420R80
13560B47299J4745P1893D3819K25941j26771J64778j17669b2012A79109K1200
$$ plain form
13550 200309 -96106 351508 211236 154711 229756 586423 259540 285332 79975 104461 457335
13539 457335 10940 39408 494552 305772 225646 113446 180399 243352 212468 -94694 -129870
13528 -129870 292176 102118 37568 502389 -84203 316303 181210 371574 -14162 299916
13517 290196 219402 190595 142403 164240 215372 -11111 439745 283330 300178 -53115 143799
13505 230623 72808 184743 107023 513387 313077 385583 143055 62013 290382 100746
13494 324856 233122 270372 62981 220852 516920 303314 43979 188844 -101547 349543
13483 69751 343473 104441 554238 -75005 239511 55546 -1150 235148 295379 154065 44150
13471 330457 209995 264309 -275549 207892 78402 392768 95530 162675 21623 194588
$$ packed form
13550B00309i6106C51508j40272n6525P5045L56667B59540K5792G9975K4486L52874
13539D57335A0940K8468M55144j88780q0126j12200O6953O2953l0884i4694l5176
13528a29870B92176A02118C7568M64821h4203C16303j35093J90364a4162B99916
13517B90196p0794k8807m8192K1837N1132a1111D39745j56415J6848e3115A43799
13505B30623G2808J11935p7720M06364k00310P2506A43055F2013K28369A00746
13494C24856r1734L7250F2981J57871K96068k13606D3979J44865a01547C49543
13483F9751K73722A04441M49797g5005B39511E5546a150B35148O0231j41314D4150
13471C30457j20462N4314b75549B07892G8402L14366I5530O7145B1623J72965
$$ plain form
13461 194588 366211 251653 229306 188515 104320 42108 201214 144666 198860 294512 -111554
13449 288333 209400 140644 109114 413210 389801 92357 312135 526124 332966 253740 396338
13438 396338 329633 465710 236286 5357 128332 208222 285049 167431 252740 251438 283809
13427 283809 305669 437484 159734 -179151 130260 116852 69213 118580 295251 381036
13417 381036 134553 377100 200320 122255 96853 238075 206592 237438 75337 491171
13407 491171 -7995 9623 326150 140765 -189572 290797 124139 57274 21266 69015 279353
13396 279353 210739 -23643 239496 41437 182945 -56876 149790 213620 141158 -248693 -185333
13385 -185333 108860 304855 -16415 -31989 142713 21166 17685 78188 326866 140866 453965
$$ packed form
13461A94588J71623j14558k2347m0791q4195D2108J59106n6548N4194R5652a11554
13449B88333p8933o8756l1530L04096k3409I2357K19778K13989j93158p9226J42598
13438C96338o6705J36077k29424E357J22975P9890P6827j17618Q5309j302L2371
13427B83809K1860J31815A59734a79151A30260j3408m7639M9367J76671Q5785
13417C81036A34553K42547j76780p8065k5402J41222l1483L0846G5337M15834
13407D91171g995I623L16527A40765a89572B90797A24139E7274B1266M7749K10338
13396B79353o8614b3643B39496D1437J41508e6876A49790O3830p2462b48693O3360
13385a85333A08860J95995a6415j5574A42713B1166l481O0503K48678A40866L13099
$$ plain form
13374 453965 227537 230867 -37537 70452 524711 432263 248093 443228 168914 108724 219655
13363 219655 51483 224514 226083 237200 -2433 200595 465942 292148 210151 368227 49455
13351 -51601 -9281 167525 238236 382615 491022 3918 318413 317769 127663 229333 298037
13340 298037 104671 214194 417446 268062 553330 205556 160112 33437 206756 303466
13330 303466 2045 173787 232829 303218 402116 104731 40137 -74053 277593 -44260 -18587
13318 -26723 190398 104563 100636 190979 -91202 443270 -45159 87283 -2540 341186 289621
13307 289621 -119805 53450 290229 292320 176987 -43062 173973 5112 -50789 -103069 427386
13295 37543 135574 -103220 182495 370407 -159772 140831 111215 272069 121589 -38408
$$ packed form
13374D53965k26428L330c7537G0452M54259r2448j84170J95135A68914o0190J10931
13363B19655E1483J73031J569J1117b433B00595K65347j73794q1997J58076D9455
13351e1601i281A67525P0711J44379J08407C918L14495o44A27663J01670O8704
13340B98037A04671J09523K03252j49384K85268B05556m5444C3437J73319R6710
13330C03466B045J71742N9042P0389R8898A04731D0137g4053B77593d4260a8587
13318b6723A90398q5835l927R0343i1202D43270d5159H7283b540C41186n1565
13307B89621a19805E3450K36779K091j15333d3062A73973E112e0789n2280D27386
13295C7543R8031a03220A82495J87912a59772A40831k9616J60854A21589c8408
$$ plain form
13284 -7227 207868 229280 -12765 -222996 34735 90230 -279167 79438 446636 -81522 189167
13272 108119 528290 -26036 -17870 285015 76035 12512 -83554 326828 -12819 71669 -87048
13260 218604 162992 141915 61377 65211 301373 -123772 3174 33926 82082 339413 113596
13248 223817 136915 -66334 -13519 241891 -88239 308089 -109993 140862 212800 204639 10493
13236 122807 359902 176961 24371 89108 200513 86696 -3746 159429 67711 -118872 -277175
13225 -277175 83165 -33148 78304 122589 150514 115305 271138 101060 31537 157529 -10919
13213 -80127 45189 233869 -7994 -30782 248983 160342 213895 -48428 135849 138729 95258
13202 95258 22980 242297 34554 45297 194937 208981 80560 283484 262440 -18983 110003
$$ packed form
13284g227B07868K1412a2765k10231C4735N5495b79167G9438L67198h1522A89167
13272A08119M20171b6036Q166B85015G6035A2512h3554C26828a2819G1669h7048
13260B18604n5612k1077F1377L834K36162a23772C174L0752M8156K57331A13596
13248B23817q6902f6334a3519B41891h8239C08089a09993A40862P1938q161A0493
13236A22807K37095A76961B4371O4737J11405H6696c746A59429F7711a18872j58303
13225b77175H3165c3148G8304M4285K7925l5209J55833A01060C1537J25992a0919
13213h0127D5189J88680g994k2788B48983q8641N3553d8428A35849K880m3471
13202I5258B2980K19317C4554J0743J49640J4044H0560K02924k1044a8983A10003
$$ plain form
13190 145011 -258732 230612 70141 267765 241258 152458 -128819 132712 237649 -5846
13179 50100 14143 -101290 -52086 55071 -45422 238982 -15276 -73403 278370 200294 192069
13168 192069 -102583 230665 -66521 -129233 -57000 249888 7119 86803 153288 -153531 253288
13156 144154 323623 205418 251878 -80400 375536 132074 95905 178479 23917 310355
13146 310355 -176325 82388 84526 -18666 -83559 -37276 -184376 423063 -30580 -79733 194487
13134 -80744 36386 256345 -88883 13571 19255 210178 -23331 30235 160949 -141592 265668
13122 162310 166594 283630 102988 172590 -500039 36108 -194159 161987 75936 -177859
13111 -255184 60252 45863 -164746 211108 53035 345331 213298 -47552 -30418 -126907 -180149
$$ packed form
13190A45011b58732B30612G0141J97624k6507q8800a28819A32712J04937e846
13179E0100A4143a01290M9204E5071d5422B38982a5276n8127B78370p8076q225
13168A92069a02583B30665f6521o2712e7000B49888G119P9684O6485a53531B53288
13156A44154J79469j18205M6460h0400C75536A32074l6169Q2574B3917K86438
13146C10355a76325H2388K138a8666o4893c7276j47100D23063c0580m9153A94487
13134h0744C6386K19959h8883A3571N684J90923b3331C0235J30714a41592B65668
13122A62310M284J17036A02988O9602e00039C6108a94159A61987G5936a77859
13111b55184F0252j4389a64746B11108E3035K92296j32033d7552J7134r6489n3242
$$ plain form
13100 -180149 -207862 215549 -32994 -41228 -171341 -78336 -79925 -68378 196648 271155 -43844
13088 194475 88431 119293 162109 88792 -23048 184207 435388 128939 906 253772 -135100
13076 14649 232568 88550 -126581 102951 175325 120218 -67094 235329 45270 411806 193192
13064 -167603 154394 146549 -68596 20091 150835 262721 38129 -144141 309879 -84684 -284066
13053 -284066 -66675 -144210 115435 -162238 -51265 255388 1728 144101 -169591 308578
13042 -37385 68466 -304610 -126699 243897 232155 73646 223831 112122 216117 174935
13032 174935 -59721 248909 150265 59021 31346 165233 64553 -138164 25487 10458 249798
13021 249798 59057 404175 -66025 69610 395539 265920 -178642 -130961 125839 -4397 -100472
$$ packed form
13100a80149k7713B15549c2994q234j30113g8336j589J1547A96648P4507d3844
13088A94475H8431L0862M2816p3317b3048A84207K51181A28939I06K52866a35100
13076A4649K17919H8550a26581A02951P2374n5107f7094B35329D5270L66536A93192
13064a67603A54394p845f8596B0091J30744J11886C8129a44141C09879h4684j99382
13053b84066f6675p7535A15435a62238e1265B55388A728J42373a69591C08578
13042c7385F8466c04610a26699B43897j1742G3646J50185j11709J03995m1182
13032A74935e9721B48909r8644E9021k7675J33887F4553a38164B5487A0458K39340
13021B49798E9057L45118f6025F9610L25929j29619a78642M7681A25839d397r6075
$$ plain form
13010 -100472 36625 194229 133329 305565 143731 67842 -49498 202225 96101 8097 9651
12999 9651 188522 38611 -187905 216977 182433 -66182 53227 212172 210401 118545 -7678
12987 36733 215227 336677 285925 -28826 53546 447476 -122142 -144537 96765 -211237 452993
12975 -201337 309713 40192 -36824 -360847 -314654 357733 131438 -253267 -49199 99107
12964 3883 84336 105903 -206259 -22127 -123024 151442 -47413 147266 -74135 260098 30651
12952 74229 -51083 -143374 -92318 -132899 116084 -190308 37354 143180 109667 54134 -28399
12940 -106608 309095 -64606 365038 -147098 -189712 124948 479721 330763 24942 214561
12930 214561 268335 135016 -118677 -3117 77766 104917 40632 74379 7801 256570 -197999
$$ packed form
13010a00472C6625J57604o0900J72236A43731F7842d9498B02225I6101H097J554
12999I651J78871C8611a87905B16977l4544f6182E3227J58945j771r1856g678
12987C6733J78494J21450n0752b8826E3546L93930a22142k2395I6765b11237D52993
12975b01337C09713D0192c6824l24023M6193C57733A31438b53267d9199I9107
12964C883Q0453K1567b06259b2127j00897A51442d7413A47266g4135B60098C0651
12952G4229e1083r2291N1056m0581A16084a90308C7354J05826l3513E4134b8399
12940a06608C09095f4606C65038a47098m2614A24948L54773j48958B4942J89619
12930B14561N3774j33319a18677c117G7766K7151D0632L3747G801K48769a97999
$$ plain form
12918 177149 124714 -137564 40946 -32549 208083 174118 -143798 -107990 92179 206421 -51762
12906 -193875 -83181 123624 212728 149517 -19766 131269 -223675 214411 125183 -47499 183204
12894 300653 -124668 193276 233357 86360 23147 79971 3267 80779 -91207 19119 -38085
12882 -148248 244551 -112092 136686 146427 138389 85635 -229939 15289 -100900 -38180 -83885
12871 -83885 -33567 6417 -6580 66123 -70879 -104183 -298933 -111275 259733 -428513 5364
12859 -196085 54982 -111983 -53756 28400 -44226 181082 -22635 27157 34197 197982 -28006
12847 181488 14460 96816 191813 27434 -55 -186215 184502 112137 172713 -119747 -76385
12836 -76385 -44612 -168213 -238760 -207844 101774 157549 -52543 -150455 -316504 -167946 -300322
$$ packed form
12918A77149n2435a37564D0946c2549B08083l3965a43798L5808I2179J14242e1762
12906a93875h3181A23624Q9104o3211a9766A31269b23675B14411q9228d7499A83204
12894C00653a24668A93276M0081H6360B3147N6824C267P7512i1207A9119c8085
12882a48248B44551a12092A36686R741q038n2754b29939A5289a00900c8180m5705
12871h3885c3567F417f580F6123g0879l3304j94750a11275B59733d28513E364
12859a96085E4982a11983e3756B8400d4226A81082b2635B7157P040J63785b8006
12847A81488A4460Q2356R4997B7434e5j86160A84502p2365O0576a19747M3362
12836g6385L1773j23601p0547L0916A01774N5775e2543r7912j66049J48558j32376
$$ plain form
12825 -300322 -131869 198568 -45209 220435 115769 -8181 -224359 -96540 230102 -138585
12814 142239 89197 133183 -54811 -108016 -136001 116896 -52410 -213501 10556 227810 -25492
12802 40091 -29660 -31995 -261465 93614 -245952 142343 -275224 216490 44324 31802 -249911
12790 -430905 345994 -237371 177094 -22855 106024 -48231 134566 -3084 53862 7039 98156
12779 98156 -92877 -366418 71518 -583 132174 -49165 37001 -239777 200277 30687 -109087
12767 237981 -155793 -60620 -153950 -88127 34018 -113352 125136 -28763 19902 -127612 344866
12755 353161 141405 -33590 168749 165774 -88380 304825 -118842 18385 -56938 -121627 -175742
12744 -175742 -69646 -3237 -211424 -198865 65792 71122 31974 14926 120090 251288 -251639
$$ packed form
12825c00322a31869A98568d5209B20435j04666h181k16178i6540B30102a38585
12814A42239n3042M3986e4811n3205k7985A16896e2410j61091A0556K17254b5492
12802D0091b9660k335k29470I3614b45952A42343b75224B16490D4324j2522b49911
12790d30905C45994b37371A77094b2855A06024d8231A34566c084E3862G039R1117
12779I8156i2877k73541G1518e83A32174d9165C7001b39777B00277C0687a09087
12767B37981a55793f0620r3330O5823C4018a13352A25136b8763A9902a27612C44866
12755C53161A41405c3590A68749k975h8380C04825a18842A8385e6938o4689n4115
12744a75742f9646c237k08187J2559F5792N330C1974A4926J05164J31198b51639
$$ plain form
12732 -95236 -94247 -147871 122895 143560 9967 48549 31061 112784 359287 108321 -135967
12720 -123396 164472 -129891 -163627 -189549 100369 389340 176251 -242000 -71033 116909
12709 -311504 339749 -162670 144043 8204 -4764 271746 10061 376404 -144964 63821 173968
12698 173968 48615 142588 -98774 -140070 13087 118096 -53894 -20107 189148 -106507 222033
12686 228183 -446792 -76289 267072 -36300 -56688 105053 -146408 36704 -151804 -77880
12676 -77880 159542 438093 158643 -124229 174200 68308 229038 133581 46820 158003
12666 158003 242999 83417 62600 509737 79158 122782 -180716 214838 -79609 18923 -37506
12654 300152 425999 -86615 90253 256621 109918 -4766 -85208 -194995 -204557 -107790 190043
$$ packed form
12732i5236R89n3624A22895K0665I967L8582j7488Q1723K46503A08321a35967
12720a23396A64472a29891l3736k5922A00369K88971A76251b42000g1033A16909
12709c11504C39749a62670A44043H204d764B71746A0061L66343a44964F3821J10147
12698A73968D8615R3973i8774m1296A3087J05009e3894b0107A89148a06507B22033
12686B28183d46792g6289B67072c6300k0388A05053a46408C6704a51804P3924
12676g7880A59542K78551A58643a24229A74200F8308J60730r5457D6820J11183
12666A58003Q4996H3417k0817M47137G9158M3624a80716B14838g9609A8923c7506
12654C00152J25847h6615I0253J66368A09918d766q0442j09787r562R6767A90043
$$ plain form
12642 51277 -94574 135988 185215 -49716 -135318 379973 197868 151785 315089 -32195 39922
12630 146523 333107 56646 402245 277686 3966 177879 447683 164368 143023 18428
12619 33419 128566 81590 250632 33019 223020 -14447 -78605 -119871 115500 244509 285758
12608 285758 -41955 -280754 140324 -185404 47235 -165971 34109 32815 -39992 100536 -61074
12596 99297 230360 -103464 172045 16530 291626 -58965 21078 205010 458794 110445
12585 360468 326491 122994 -110192 41711 31408 -69812 107371 54020 64198 106772 243807
12574 243807 225862 23908 -18379 322676 -63471 -101886 -120795 104293 13256 -184908 -108364
12563 -108364 96813 63701 214426 -11368 73246 150853 168223 76539 93550 -136833 -273607
$$ packed form
12642E1277i4574A35988M9227d9716q5602C79973j82105m6083J63304c2195C9922
12630A46523J86584E6646L45599j24559C966J73913K69804A64368k1345A8428
12619C3419R5147m6976J69042C3019J90001a4447o4158m1266A15500J29009M1249
12608B85758d1955k38799A40324a85404D7235a65971C4109j294c9992A00536f1074
12596I9297J31063a03464A72045A6530K75096e8965B1078J83932K53784A10445
12585C60468l3977A22994a10192D1711j0303f9812A07371n3351J0178M2574J37035
12574B43807j7945B3908a8379C22676f3471l8415j8909A04293A3256a84908P6544
12563a08364I6813l3112J50725a1368G3246P7607J7370G6539J7011a36833j36774
$$ plain form
12552 -273607 -168647 20087 47598 238350 308751 -58086 13348 -35150 -15198 43403 -39726
12540 -61663 -41709 237840 356564 30361 -201450 80741 -109992 96522 -211636 -140479 189784
12528 -142758 -201976 276906 264484 109276 46728 -67021 126925 184932 187100 -64512 390232
12516 123319 -123977 53591 -145047 52164 198920 -96632 -87085 270608 -250827 -25087 36979
12504 316477 162024 -144443 -378375 -235251 -13945 222452 -451761 321538 187120 88326
12493 183489 -34721 -356943 38859 -3524 -40681 -31760 333019 138779 385735 196942 -75245
12481 -310967 52492 211938 -199345 -20086 -21995 -175855 -162474 148910 -79106 -93294 267854
12469 258398 119042 22171 -101125 -339713 -211438 -38537 -248218 18181 -362955 -168691
$$ packed form
12552b73607J04960B0087K7511J90752P0401e8086A3348c5150a5198D3403c9726
12540f1663J9954B37840J18724C0361b01450H0741a09992I6522b11636P1157A89784
12528a42758n9218B76906j2422A09276D6728f7021A26925N8007K168f4512C90232
12516A23319a23977E3591a45047E2164J46756i6632R547B70608b50827b5087C6979
12504C16477j54453a44443k33932J43124a3945B22452d51761C21538j34418H8326
12493A83489c4721l22222C8859c524l7157Q921C33019A38779K46956j88793g5245
12481c10967E2492J59446a99345b0086j909j53860J3381A48910g9106j4188B67854
12469B58398A19042B2171a01125k38588J28275c8537k09681A8181c62955a68691
$$ plain form
12458 -164785 197208 -507665 -91490 -57117 -60592 28701 -18531 76841 351540 346269 395914
12447 395914 76329 284837 372098 -44911 147339 188179 -328751 -176561 -150516 236354
12436 -33687 220526 -142080 -310770 96511 275693 117828 31931 -5085 -161134 -156750 82015
12424 140493 331033 -126129 154771 124365 20825 202984 96011 -124038 260354 -154155
12413 -99919 183853 136381 202025 87485 -93075 -57305 70157 -49261 279837 147438 76492
12402 76492 108665 -10350 -64498 -46267 -123309 -261573 28773 -213574 230940 -95020 25453
12390 -85868 -72687 115220 38716 -108786 51423 326804 34953 -190287 138671 -30226 -134428
12379 -134428 26952 92352 33675 -60163 -363476 216384 96843 139754 -73858 -335925 246506
$$ packed form
12458a64785A97208e07665i1490L4373l475B8701a8531G6841K74699n271M9645
12447C95914G6329K08508Q7261d4911A47339M0840c28751J52190K6045B36354
12436c3687B20526a42080j68690I6511J79182A17828C1931e085j56049M384H2015
12424A40493J90540a26129A54771l0406B0825J82159I6011a24038B60354a54155
12413i9919A83853m7472O5644H7485i3075L5770G0157d9261B79837j32399p0946
12402G6492L2173a0350n4148J8231p7042j38264B8773b13574B30940i5020B5453
12390h5868J3181A15220C8716a08786E1423K75381C4953a90287A38671c0226j04202
12379a34428B6952O5400C3675f0163l03313B16384I6843M2911g3858k62067B46506
$$ plain form
12367 -206285 -16080 -38656 29410 -177536 76113 -146461 -159936 -357419 -110421 -77395 186997
12355 -82653 445825 -37846 184291 79928 145053 -26781 -246621 15899 -199653 86740 201199
12344 201199 -356614 45247 377625 -191661 154800 -94254 -3874 65756 -52076 -103079 -360371
12333 -360371 97144 -13332 -297430 86336 110299 -155203 -144800 78280 -119067 74225 11492
12321 -218935 102707 262400 115239 -11924 -43125 260500 -154175 -119226 213736 82671
12310 194014 -93013 -74091 -142348 109972 -186072 428591 -80013 34708 150403 83426 -10342
12298 34805 112297 43883 -53194 -251320 -29521 -129335 -166836 -111728 -120858 -104872 -171466 191141
12285 99721 -10489 -40298 -212890 -186124 25624 325855 -198840 207416 -103638 225680
$$ packed form
12367b06285a6080k2576B9410a77536G6113a46461j3475j97483a10421L3026A86997
12355h2653D45825c7846A84291G9928O5125b6781k19840A5899a99653H6740J14459
12344B01199c56614D5247L32378a91661A54800i4254c874F5756e2076n1003k57292
12333c60371I7144a3332k84098H6336K3963a55203J0403G8280a19067G4225A1492
12321b18935A02707J59693A15239a1924l1201B60500a54175L4949B13736H2671
12310A94014i3013J8922o8257A09972a86072D28591h0013C4708J15695o6977a0342
12298C4805P7492D3883e3194j98126b9521r9814l7501N5108r130J5986o6594A91141
12285I9721a0489k9809j72592K6766B5624L00231a98840B07416a03638B25680
$$ plain form
12274 85689 231184 54232 -27472 163067 -64570 -36243 87864 116005 -209486 24875 73981
12263 73981 -85829 -74209 34420 72929 120189 -7266 323920 177140 -42742 111289 314710
12252 314710 302507 38944 -172942 -164715 -20233 200316 369073 565233 190935 -220075
12241 -165511 -123596 -24575 47833 -491365 18768 -7662 234719 227534 218742 27451 -25998 227652
12228 -198896 171851 167173 326443 -58738 171502 -136626 331031 23886 185852 321154
12218 321154 319506 243906 203967 262604 -232567 223733 96584 2992 231240 -94793 -74109
12207 -74109 303705 -25114 44432 81174 220426 -142149 65204 252108 235765 380798 108191
12195 294730 63685 187499 20193 78576 1744 167190 -53951 124001 144683 76058 206161
$$ packed form
12274H5689J45495E4232b7472A63067f4570K8327H7864K8141b09486B4875M9106
12263G3981h5829J1620C4420L8509M7260g266C23920j46780d2742A11289K03421
12252C14710j2203C8944a72942Q227b0233B00316J68757J96160A90935b20075
12241a65511M1915b4575D7833d91365A8768g662B34719p185q792B7451b5998B27652
12228a98896A71851m678J59270e8738A71502a36626C31031B3886J61966J35302
12218C21154j648p5600l9939N8637b32567B23733I6584B992K28248i4793K0684
12207g4109C03705b5114D4432L6742J39252a42149F5204J86904j6343J45033A08191
12195B94730F3685J23814B0193N8383A744J65446e3951A24001K0682o8625J30103
$$ plain form
12184 206161 286790 141054 -60883 176458 119238 182252 70542 -40300 48294 -23212 93534
12172 -6565 129409 53423 -4015 1455 21704 173533 40958 156032 -88852 64491 -190064
12160 334198 350109 2772 83433 85510 181107 -130139 -229116 104627 120454 115047 63256 -78707
12147 -342789 199060 282646 -319820 -62235 -223979 -143539 -43600 -95298 -232373 40055 62830
12136 62830 -128721 327050 -185252 103182 68335 90219 186816 -123400 58780 -113499
12125 -61738 177422 261082 192944 -135581 363416 -163778 12734 609083 162224 226672
12115 226672 -28706 -63561 84092 -270355 249782 115822 61403 186440 16195 -314402
12104 -320 218014 48278 160296 40481 -89374 -114232 -103322 168555 -90571 -87048 -306924
$$ packed form
12184B06161Q0629A41054f0883A76458n7220O3014G0542d0300D8294b3212I3534
12172f565A29409E3423d015A455K0249J51829D0958J15074h8852F4491a90064
12160C34198J5911B772Q0661K077R5597a30139r8977A04627J5827n407n1791g8707
12147c42789A99060Q3586c19820f2235j61744Q0440d3600n1698j37075D0055K2775
12136F2830a28721C27050a85252A03182l4847K1884R6597a23400E8780a13499
12125f1738A77422Q3660o8138a35581C63416a63778A2734N96349A62224O4448
12115B26672b8706l4855H4092b70355B49782A15822n4419J25037A6195c14402
12104c20B18014D8278J12018D0481h9374k4858J0910A68555i0571L523k19876
$$ plain form
12093 -306924 400066 -215180 -108888 29083 191280 -119376 31029 145430 70664 230644
12083 230644 117186 30813 297241 -55304 -159485 -9516 -16158 -103190 -258136 68058 73700
12072 73700 -259421 207990 -38647 294995 173271 116955 -188899 99485 -129755 -147519
12062 -147519 -141041 -39475 142699 371974 1184002 531782 427533 63733 316983 -150391
12051 388556 130739 36318 -80603 141552 -104084 -86738 -102302 -168782 415703 -67361 -73617
12040 -73617 -89672 -287928 34366 -159349 26493 -153823 198174 -297708 236494 153741
12030 153741 111247 186070 -169985 197974 -20746 2394 38148 -156495 260812 -169562 -3876
12018 142849 283420 -130242 -200214 71947 182443 63367 -63338 78366 58449 -43463 -129134
$$ packed form
12093c06924D00066b15180J06292B9083J62197a19376C1029J14401G0664J59980
12083B30644j13458C0813K66428e5304j04181i516o642q7032j54946F8058N642
12072G3700b59421B07990c8647B94995j21724n6316a88899I9485a29755j7764
12062a47519O478c9475A42699K29275Q12028E31782j04249F3733K53250a50391
12051C88556A30739C6318h0603A41552a04084J7346j5564o6480D15703f7361o256
12040g3617j6055j98256C4366a59349B6493a53823A98174b97708B36494q2753
12030A53741m2494P4823a69985A97974b0746B394L5754a56495B60812a69562c876
12018A42849J40571a30242o9972G1947J10496F3367f3338G8366j9917d3463q5671
$$ plain form
12007 -129134 377942 -35379 81797 -54420 266494 100750 84464 -159653 -207994 49710 -129664
11995 -169031 -208309 -32203 -51969 -12408 -46230 -271692 115182 -104861 40159 -83129 -137283
11984 -137283 -73696 -17624 266826 362731 -270830 67738 -232373 43170 -118809 -17079 -50437
11973 -50437 -179348 276246 241236 94791 253547 227545 -77707 100366 132621 159426 -131106
11961 -1890 292389 -236412 -59107 68539 -46221 -180618 130000 -76694 -58054 -291955 -110035
11949 -184907 -330705 -75490 -45725 83608 75362 -32728 160269 326861 -334766 198277 11962
11937 -24364 -35449 -107288 -3676 -114681 30238 -9914 193438 -80873 144647 144306 -85761 -84001
11925 -84001 -106957 -87011 -287281 55656 169443 -214261 -268357 287404 -109960 -249169
$$ packed form
12007a29134C77942c5379H1797e4420B66494A00750j6286a59653m8341D9710a29664
11995a69031l9278c2203j9766a2408l3822k25462A15182a04861D0159h3129n4154
11984a37283O3587a7624B66826R5905b70830F7738b32373D3170a18809a7079l3358
11973e0437j28911B76246l5010I4791J58756k6002g7707A00366L2255K6805a31106
11961a890B92389b36412e9107F8539d6221j34397A30000g6694J8640k33901a10035
11949a84907j45798g5490K9765H3608q246c2728A60269J66592c34766A98277A1962
11937b4364j1085p1839c676j11005C0238i914A93438h0873A44647l41h5761J760
11925h4001k2956J9946k00270E5656J13787b14261n4096B87404a09960j39209
$$ plain form
11915 -249169 217497 189459 142813 -254099 72280 -103364 258386 -129818 -265437 -181675
11905 -181675 -112001 -170862 58370 -13607 -122299 -33459 -22911 -130893 -215143 -116609 299134
11893 216508 -25607 -14498 -313621 155711 41162 -123037 102609 117634 -89963 -31988 -61529
11882 -61529 -29827 113606 8629 98837 -79966 102271 -79141 296262 -177813 186670 -178214
11870 19657 -235920 -144243 68890 -306755 249390 -10140 156469 -224526 -288258 320036
11859 8272 217188 177366 -137979 -288032 -146802 16877 105057 -181361 379321 -10337 -194610
11848 -194610 1468 68076 56462 -141601 -38742 -12411 385111 -154339 80946 141338 159056
11837 159056 -197462 91074 -27431 -35292 -181770 67087 -134161 -272937 -136605 -76840 -10551
$$ packed form
11915b49169B17497k8038m6646b54099G2280a03364B58386a29818j35619Q3762
11905a81675O9674n8861E8370a3607j08692c3459J0548j07982q4250R8534B99134
11893B16508b5607J1109k99123A55711D1162a23037A02609J5025h9963c1988k9541
11882f1529b9827A13606H629R0208g9966A02271g9141B96262a77813A86670a78214
11870A9657b35920R1677F8890c06755B49390a0140A56469b24526o3732C20036
11859H272K08916l9822a37979j50053J41230A6877Q8180a81361C79321a0337j84273
11848a94610A468O6608j1614a41601c8742a2411C85111a54339H0946O0392J7718
11837A59056a97462I1074b7431p861j46478F7087a34161j38776J36332N9765a0551
$$ plain form
11825 -283839 204004 -20442 -195462 -27999 -102182 -187516 -253225 78264 -106308 -68486 -122492
11814 -122492 221988 -27450 374765 -28297 -101606 -211715 -37790 -139070 -37876 -84358 8445
11802 82277 -18138 -63958 -76776 248329 -148485 -310122 -35955 262141 68399 -175970 -40821
11790 354178 -347175 -129435 113276 -112961 -175863 -23288 141059 33694 63685 146191
11780 146191 -86751 -19369 -162580 137056 -52444 -94044 -103095 -126293 -204185 68816 114877
11769 114877 -215360 87024 -75767 44128 -226079 -247318 83127 -111482 -61603 -261668 -40322
11757 248993 -177016 -2166 -17598 205273 -76717 188290 -342851 -130828 193688 -171368
11746 -136500 117821 -107811 -28110 -163306 302775 84585 -119880 -9895 -174273 -260654
$$ packed form
11825b83839B04004b0442j75020b7999p4183q5334o5709G8264a06308L7822n4006
11814a22492B21988b7450C74765b8297p3309j10109c7790j01280c7876m6482H445
11802H2277a8138m5820j2818B48329a48485j61637c5955B62141F8399a75970d0821
11790C54178c47175a29435A13276a12961o2902b3288A41059C3694K9991Q2506
11780A46191h6751a9369j43211A37056e2444m1600r051k3198p7892F8816M6061
11769A14877b15360H7024g5767D4128b26079k1239H3127a11482M9879k00065d0322
11757B48993a77016b166j5432B05273g6717A88290c42851a30828A93688a71368
11746a36500A17821a07811b8110j35196C02775H4585a19880i895j64378q6381
$$ plain form
11736 -260654 104252 -395772 -195427 77026 40295 -212715 -152749 -214967 -78297 267425
11725 -130092 214549 438257 -132897 -272525 96813 -37880 -140714 121711 -240183 48517
11714 -248421 220728 -62523 -77301 30172 362532 -255042 -150165 36784 71498 -211465
11703 65213 -71412 286958 8544 -38599 -95040 324963 57258 100796 -47233 97129 -171111
11691 138634 -120749 110359 116097 -140244 321856 -110313 11556 39319 323665 -33163
11680 -131666 -169729 263518 -7633 117148 113899 185808 -146671 -66575 -14088 18769 107171
11669 107171 135113 312184 -60683 -110771 144816 -74650 -145283 32140 -11846 72659 14885
11657 -31012 183307 -38978 -91556 -93099 287112 -38853 -106288 -219842 147087 -335025 261678
$$ packed form
11736b60654A04252c95772a95427G7026l6731b12715N9966o2218g8297B67425
11725a30092B14549K23708a32897j39628I6813c7880j02834A21711b40183D8517
11714b48421B20728f2523j4778C0172L32360b55042J04877C6784L4714b11465
11703F5213g1412B86958H544c8599n6441C24963E7258M3538d7233I7129a71111
11691A38634a20749A10359N738a40244C21856a10313A1556K7763K84346c3163
11680a31666l8063B63518g633A17148l249P1909a46671f6575a4088A8769Q8402
11669A07171K7942J77071f0683n0088A44816g4650p0633C2140a1846G2659A4885
11657c1012A83307c8978n2578j543B87112c8853o7435j13554A47087c35025B61678
$$ plain form
11645 -180863 -99487 -309755 -73670 76798 -35660 -171028 -13584 38823 36065 -7657 -230622
11634 -230622 184480 100826 -197695 -258697 28441 51682 126036 -290452 136519 91997 -51659
11622 -134818 221964 125342 281765 -69403 -32105 -170362 -510270 -84605 166628 -6831 28872
11610 -241017 53996 -248483 115827 21412 -100059 278019 -34903 -161965 -271325 -349186
11600 -349186 -55433 -72954 -164715 -147306 90652 -32674 -172831 32588 -7727 -181774 110486
11588 129903 -36894 -24743 -208072 136546 310241 -8231 403024 29364 43669 139511 308580
11577 308580 18217 -45186 120318 -339293 -13825 -97132 -281393 175473 197434 179844 127494
11566 127494 8000 126624 161491 14835 -57123 23497 103086 -45983 206676 33941 133564
$$ packed form
11645a80863Q1376k10268g3670G6798c5660j35368a3584C8823k758g657k22965
11634b30622A84480q3654a97695o1002B8441K3241P4354b90452A36519m4522e1659
11622a34818B21964r6622J56423f9403c2105j38257l39908h4605A66628f831B8872
11610b41017E3996b48483A15827B1412a00059B78019c4903j27062j09360p7861
11600c49186e5433j7521r1761J7409I0652c2674j40157C2588g727j74047A10486
11588A29903c6894J2151j83329A36546J73695h231D03024B9364J4305R5842J69069
11577C08580A8217d5186A20318c39293a3825q3307j84261A75473K1961j7590n2350
11566A27494H000J18624L4867A4835e7123B3497P9589d5983B06676C3941R9623
$$ plain form
11555 133564 350440 121085 48706 -139324 -61627 222795 -25228 258980 -59861 47192
11544 -13186 189760 -76045 -14086 121637 61123 -57001 137810 71619 44207 321920 95848
11532 -111322 145731 174679 61760 -267962 -133733 -173666 287974 -1664 101645 126980 -246758
11520 360727 46758 -3710 132740 -34480 187624 495053 98909 397665 -177914 -58242 17263
11508 64213 -160748 -98460 52815 84082 313398 -77621 147807 322133 246318 291243 139516
11496 670 100609 346159 111622 -74391 -159604 245690 70561 -351385 -258596 374646 292739
11485 292739 -69518 -1766 81808 109586 154164 99313 145424 25671 331891 137630 110632
11474 110632 59426 25997 102690 195253 179838 -177804 288207 60409 225262 110690 162388
$$ packed form
11555A33564K16876A21085D8706a39324f1627B22795b5228B58980e9861D7192
11544a3186A89760g6045a4086A21637o0514e7001A37810o6191k7412K77713I5848
11532a11322A45731K8948F1760b67962a33733l9933B87974a664A01645K5335b46758
11520C60727D6758c710A32740c4480A87624L07429I8909K98756a77914e8242A7263
11508F4213a60748O2288E2815L1267K29316g7621A47807J74326p5815M4925A39516
11496F70R9939K45550A11622g4391q5213B45690G0561c51385R2789C74646q1907
11485B92739f9518a766H1808K7778M4578n4851M6111B5671L06220A37630k6998
11474A10632n1206B5997P6693R2563j5415a77804B88207F0409J64853A10690N1698
$$ plain form
11463 162388 -158271 8441 153284 146546 126808 -239217 278169 -43660 14270 230230 -67046
11451 312605 107165 162638 170189 48399 25370 -182350 77073 381904 -9907 143152 136932
11440 136932 -101426 99120 121376 433798 41072 68517 -279715 314666 -228543 -132490
11430 -132490 -119101 -150267 -63415 105002 -28640 -265343 -57119 -258148 -102758 161809
11419 57313 -74771 1883 141104 -192691 -37651 -121809 -231745 -70181 -258640 130003 -339057
11407 -66233 191775 -22972 32550 -46493 9651 24178 -232729 -118255 45498 35174 -59624
11395 -287341 -308159 -160220 -60116 -8158 -26529 7943 98137 64606 -109904 -224822 11298
11383 108197 273970 -86030 -337518 50074 -207707 250172 4563 -311764 40467 25679 72048
$$ packed form
11463A62388a58271H441J44843o738j9738b39217B78169d3660A4270K15960f7046
11451C12605A07165N5473P551D8399k3029a82350G7073L04831i907A43152o220
11440A36932a01426I9120K2256L12422D1072K7445b79715C14666b28543R6053
11430a32490J3389l1166f3415A05002b8640k36703e7119k01029a02758A61809
11419E7313g4771A883J39221a92691c7651q4158j09936g0181j88459A30003c39057
11407f6233A91775b2972C2550d6493I651J4527b32729J14474D5498j0324e9624
11395b87341k0818J47939f0116h158j8371G943R0194l3531a09904j14918A1298
11383A08197J65773h6030k51488E0074b07707B50172D563c11764D0467j4788M6369
$$ plain form
11372 72048 169559 68317 168510 126607 261939 74432 -6827 249524 -365054 140555 -128489
11360 -3626 133140 212044 -90351 132588 19113 55728 -63295 48096 -72372 -44833 -25629
11349 -25629 -316186 -106094 -44555 -51530 -316140 116811 -209934 -4180 154149 -150836 575
11337 122604 -133321 -166621 -378220 -95541 -23146 2466 14681 -108148 -92953 -8054 241122
11325 112251 190160 -71686 5670 130197 -135386 -25396 126383 291942 -29038 138337 64687
11313 19738 292363 -60213 -43906 60367 141052 -3225 -137193 -10466 82173 -138692 -162227
11302 -162227 -67034 403101 18572 160267 36575 8133 688 -34777 -92032 -267155 196682
11290 21929 113409 -7181 -151720 -495294 94172 59986 -37159 -253522 -303775 87973 66939
$$ packed form
11372G2048R7511F8317J00193m1903J35332G4432f827B49524c65054A40555a28489
11360c626A33140P8904i0351A32588A9113L6615f3295D8096g2372K7539J9204
11349b5629k90557a06094d4555o975k64610A16811b09934d180A54149a50836E75
11337A22604a33321l3300k11599i5541b3146B466J2215a08148J5195h054B41122
11325A12251P7909g1686E670J24527a35386b5396A26383J65559b9038A38337F4687
11313A9738K72625f0213J6307F0367Q0685c225j33968a0466H2173a38692k3535
11302a62227f7034D03101A8572J41695C6575H133F88c4777n7255j75123A96682
11290B1929R1480g181j44539l43574I4172l4186c7159k16363n0253H7973k1034
$$ plain form
11279 66939 113362 25999 -101701 -56697 -290497 -85941 -15063 41151 -97444 -94101 197594
11267 -255023 14070 163817 146846 30232 -65855 76095 -236433 -124014 94636 -29609 -59415
11256 -59415 -76907 -41905 70170 161322 -532671 -130443 -89889 -62525 -201748 53803 -161225
11244 41112 -3887 18214 -134207 -196130 193066 -239603 -135987 -92025 -222642 -26072 -254633
11233 -254633 -335135 -44986 -378160 101669 128002 -312405 266947 307936 -121220 -35659
11222 -182511 -54839 -367932 83619 -214463 -38658 -16682 -17344 -196689 -58659 -211834 -12729
11210 -145161 -56515 -196948 -464466 56017 44924 -53441 -259780 17038 -86686 197549 -72489
11198 10549 -157803 151133 -399142 -68240 -79251 -206505 -58293 -93662 -111449 -204241 195517
$$ packed form
11279F6939M6423B5999a01701M5004k33800h5941a5063D1151i7444L343A97594
11267b55023A4070J49747j6971C0232f5855G6095b36433J12419I4636b9609k9806
11256e9415j7492L5002G0170R1152e32671a30443M0554K7364j39223E3803a61225
11244D1112c887A8214a34207o1923A93066b39603J03616M3962j30617b6072k28561
11233b54633q0502d4986l33174A01669K6333c12405B66947M0989a21220c5659
11222a82511e4839l13093H3619b14463c8658a6682o62j79345e8659j53175a2729
11210a45161e6515j40433k67518E6017j1093e3441k06339A7038h6686A97549g2489
11198A0549a57803A51133c99142f8240j1011j27254e8293l5369j7787r2792A95517
$$ plain form
11186 7213 125316 185078 -7155 317983 131593 44787 -41267 -21702 -352493 164771 -48526
11174 91434 17057 12936 327079 -51918 -116080 -164498 16636 -207369 -104815 -238173 -220417
11163 -220417 -152973 20487 -188505 -63726 -84641 -88902 -6213 -17640 96586 6008 291717 58297
11150 -220630 -279317 59917 -350948 64854 184265 192424 -76800 -45579 -78786 336921 26854
11138 -78547 -25521 -264095 -383895 234761 121879 202385 106208 -38775 -92818 128948 151648
11127 151648 189857 62441 26485 162507 -313751 225440 -150377 -24860 48477 -533218
11116 -38750 -317821 144879 -35122 -78874 98964 164707 167006 435148 210130 86382 -119764
11104 144541 372427 135799 113762 316442 -26279 484767 -6765 197658 318104 -129566
$$ packed form
11186G213J18103N9762g155C17983A31593D4787d1267J9565l30791A64771d8526
11174I1434A7057m121L14143e1918o4162m8418A6636b07369J02554j33358J7756
11163b20417O7444B0487a88505f3726k0915m261f213j1427I6586F008K85709E8297
11150b20630n8687E9917c50948F4854J19411Q159g6800L1221l3207C36921B6854
11138g8547b5521k38574j19800B34761j12882Q0506r6177c8775n4043A28948K2700
11127A51648L8209F2441B6485J36022c13751B25440a50377b4860D8477e33218
11116c8750k79071A44879c5122m3752I8964O5743K299K68142B10130H6382a19764
11104A44541K27886A35799k2037K02680b6279D84767f765A97658J20446a29566
$$ plain form
11093 460873 -57350 -154091 111683 -21113 395212 170839 205883 324436 311534 29221 -27130
11081 197705 22016 101084 525262 262174 173123 48232 34163 341092 251596 291922 51337
11069 98045 291311 635899 160236 337312 147693 173148 592072 392798 647201 480311
11059 480311 461600 223045 375464 453840 421314 362240 444531 383380 332242 421019 1051478
11048 1051478 660731 449435 783982 521762 506176 497524 550050 686459 591469 674053
11038 674053 656039 676763 401882 640092 556507 383200 599641 659187 503433 814673
11028 814673 228646 783779 824249 638656 811452 495570 761632 476750 581358 371481
11018 371481 544158 424881 626881 592137 531827 277673 810549 711156 484761 767728
$$ packed form
11093D60873e7350r6741A11683b1113C95212A70839L5044J18553j2902B9221b7130
11081A97705B2016P9068M24178B62174q9051D8232j4069L06929q9496M0326E1337
11069I8045J93266L44588A60236J77076A47693K5455M18924j99274K54403j66890
11059D80311j8711B23045J52419P8376l2526n9074Q2291o1151n1138Q8777O30459
11048A051478l90747k11296L34547k62220j5586q652N2526J36409r4990Q2584
11038F74053j8014K0724k74881K38210q3585j73307K16441N9546j55754L11240
11028H14673B28646N55133M0470j85593J72796l15882K66062k84882J04608k09877
11018C71481J72677j19277K02000l4744o0310k54154N32876r9393k26395K82967
$$ plain form
11008 767728 489860 438085 697550 856727 433872 572034 517398 435968 671760 401737
10998 401737 451621 744915 843356 538465 582892 620992 499646 668691 608847 539085 703019
10987 703019 970292 852076 791087 811133 630789 1059181 1020645 1220740 1000793 1077186
10977 1077186 1450925 1455909 1835006 2321638 2504972 2407539 2459679 2371517 2136318 2436329
10967 2436329 2196435 1841501 1507388 1160594 1105922 813529 1314320 547339 989128 1032204
10957 1032204 860083 1054468 865010 534359 611882 614766 507500 437133 352126 105175
10946 -140069 325727 49486 321947 159245 217239 31717 -70017 27260 269506 324838 -218676
10934 -161375 332863 128767 -157559 -9544 -18223 -15905 63617 -197326 -52482 123247 145444
$$ packed form
11008G67728k77868n1775K59465J59177m22855J38162n4636q1430K35792k70023
10998D01737M9884K93294R8441l04891M4427L8100j21346J69045n9844o9762J63934
10987G03019K67273j18216o0989K0046j80344M28392l8536K00095k19947P6393
10977A077186L73739M984L79097M86632J83334r7433N2140q8162k35199L00011
10967B436329k39894l54934l34113l46794n4672k92393N00791E47339M41789M3076
10957A032204j72121J94385j89458l30651P7523K884j07266p0367q5007A05175
10946a40069C25727D9486K72461A59245N7994C1717g0017B7260K42246N5332b18676
10934a61375C32863A28767a57559i544q679K318F3617a97326e2482A23247K2197
$$ plain form
10923 145444 -102117 74165 97245 145347 31030 239948 230223 -12381 184668 175141 -105265
10911 -475288 26242 92932 -103138 179143 -292155 -167724 112680 -151289 -17571 76932
10900 -2445 246699 105872 -70545 11856 -206055 21925 254591 -31672 -108639 -14904 1592
10888 -236843 -32981 224340 -186425 -44073 198304 15863 -116594 -134244 -71128 119397
10877 233055 355341 139904 -807 -86495 81940 -174009 -324378 7483 -184570 206638 249696
10866 249696 -303020 -188625 165684 181361 -133119 47130 -19551 -38310 138149 247766
10856 247766 -7438 9695 104578 13671 -222031 285513 58452 -35113 -407909 1437 -125144
10844 187829 12164 -93786 -171159 -352345 71761 -153104 -87090 57289 -241381 264637 18759
$$ packed form
10923A45444a02117G4165K3080M8102C1030K08918r725a2381A84668r527a05265
10911d75288B6242O6690a03138A79143b92155J24431A12680a51289a7571G6932
10900b445B46699A05872g0545A1856b06055B1925K32666c1672p6967a4904A592
10888b36843c2981B24340a86425d4073A98304A5863a16594j7650O3116A19397
10877B33055J22286A39904h07q5688H1940a74009j50369G483a84570B06638M3058
10866B49696c03020J14395A65684J5677a33119D7130a9551j8759A38149J09617
10856B47766g438I695R4883A3671b22031B85513E8452c5113l72796A437a25144
10844A87829A2164i3786p7373j81186G1761a53104O6014E7289b41381B64637A8759
$$ plain form
10832 67482 -136112 -51969 49887 -59931 113445 -130263 -415018 50790 99861 226814 23561
10820 26518 246820 -198531 -120802 -175612 -131114 -195379 -334477 -39223 -238718 -225005 247438
10808 87432 -317886 -78779 40147 -106140 -58662 170297 1417 59374 39346 -103411 -101329
10797 -101329 -206296 -189344 71310 -234274 -200872 -32624 -205032 176916 -228594 175798
10786 -221481 38870 -31231 -64217 -170830 104867 -239846 111838 -146060 43242 -260370
10775 -131893 304661 -142249 410447 82675 -15298 70450 -69156 -263839 3081 -97174 126504
10763 9915 25471 -1217 -22538 -188772 -219581 154640 111629 281025 263057 386273 252155
10752 252155 -139794 189881 -238834 -446679 144079 -176357 -253964 184085 -160161 -95758
$$ packed form
10832F7482a36112e1969D9887e9931A13445a30263k84755E0790M9071J26953B3561
10820B6518K20302a98531P7729n4810M4498o4265j39098c9223j99495J3713B47438
10808H7432c17886g8779D0147a06140M7478A70297A417N7957k0028a03411K082
10797a01329j04967J6952G1310b34274L3402c2624j72408A76916b28594A75798
10786b21481C8870c1231l2986j06613A04867b39846A11838a46060D3242b60370
10775a31893C04661a42249D10447H2675a5298G0450f9156j94683C081i7174A26504
10763I915J5556a217k1321j66234l0809A54640m3011J69396j7968J23216j34118
10752B52155a39794A89881b38834k07845A44079a76357p7607A84085a60161O4403
$$ plain form
10742 -95758 -265196 10348 -79874 -82630 -4522 -99733 -115153 286983 -55900 22331 120713 231889
10730 231889 -74392 172220 -82001 -29523 -272236 -388404 71120 -330108 -223555 -20050
10719 27804 110227 -113846 205589 17992 139144 -85816 -80866 -155868 -122351 -166188 -195437
10708 -195437 -161357 -125601 -7591 -40200 11947 152691 16201 67103 222888 -3055 -13992
10697 -13992 -48197 -42456 -45427 -111988 -23695 -267301 -253260 -246242 -152535 41632 -97507 81534
10684 -142350 -242468 -133758 254007 -113023 -104514 -247780 -107965 11107 -161702 -179175
10674 -179175 99568 86511 134943 -209559 -140763 -138573 -141345 -146210 315628 -322582 167884
10662 56405 321283 9184 171750 20564 -90654 127449 -18112 -337797 42885 65510 -19767
$$ packed form
10742i5758j69438A0348g9874k756d522r5211j5420B86983e5900B2331R8382J11176
10730B31889g4392A72220h2001b9523k42713j16168G1120c30108J06553b0050
10719B7804Q2423a13846B05589A7992J21152h5816M950p5002L3517m3837k9249
10708a95437L4080L5756g591l2609A1947J40744A6201N0902J55785c055j0937
10697a3992l4205N741k971o6561b3695k43606J4041P018R3707D1632i7507H1534
10684a42350j00118J08710B54007a13023Q509j43266a07965A1107a61702j7473
10674a79175I9568j3057M8432b09559O8796K190k772m865C15628c22582A67884
10662E6405K64878I184J62566B0564i0654A27449a8112l19685D2885K2625a9767
$$ plain form
10650 325872 157544 223848 -8225 -174673 229567 -11915 86139 -175958 -64735 -214846 41044
10638 21374 -284476 199863 -45082 -99186 -156006 73684 256687 -208536 -118526 146642 316680
10627 316680 7363 -124368 -314766 -236780 19074 -19612 -45957 -68607 -127109 -35660 45045
10615 -83534 -83501 -67489 -213612 -37459 -69824 -103111 -197147 -43685 -33135 12585 -122004 -7180
10602 59224 -130963 -41192 -160187 72160 9478 -308201 -230130 -15616 -17210 -127904 279037
10590 -215892 99486 52555 -73518 -39234 -185984 -69883 291818 90820 -183706 91978 -82274
10578 -300270 -175713 -214852 -209185 -95032 -7479 -125298 -178909 -96400 326585 -139293 33124
10566 127297 124585 161509 -113626 -196516 121608 -136555 170435 135121 -111425 258358
$$ packed form
10650C25872A57544O6304h225j66448B29567a1915H6139a75958f4735j50111D1044
10638B1374b84476A99863d5082n4104n6820G3684J83003b08536R0010A46642J70038
10627C16680G363a24368j90398P7986A9074a9612k6345k2650n8502c5660D5045
10615h3534L3J6012j46123c7459l2365l3287r4036d3685J0550A2585a22004g180
10602E9224a30963d1192j18995G2160I478c08201P8071a5616j594j10694B79037
10590b15892I9486m6931g3518L4284j46750f9883B91818I0820a83706I1978h2274
10578c00270J24557l9139N667i5032g479j17819n3611Q2509C26585a39293C3124
10566A27297k712L6924a13626q2890A21608a36555A70435l5314a11425B58358
$$ plain form
10555 -46553 -17821 300335 -123247 15299 -159612 -217208 87533 -341836 -78507 -237873 -112814
10543 172851 57467 141686 -57463 -171034 15829 126151 89779 155860 130076 -109480 -223519
10532 -223519 486870 187940 127769 -104880 194236 -108373 7419 -85625 227596 -194517
10521 -32212 77998 -281911 189717 -24667 -43702 -146379 -100275 -93301 -201558 -5030 -281949
10510 -281949 -36235 -32071 -127189 79024 -155985 -52028 -214276 112894 31782 85301 77948
10499 77948 -175601 31376 349746 -155608 -78880 276554 -31201 -68602 -29354 -131794 -68264
10488 -68264 263340 -204134 -169074 -60310 295129 -355708 46119 58260 -36905 -115616 -27629
10476 49040 115038 -64666 214842 -175046 6071 -144320 209815 44517 69359 -50012 117357
$$ packed form
10555d6553a7821C00335a23247A5299a59612n7596H7533c41836g8507j59366a12814
10543A72851E7467Q4219e7463j13571A5829J10322l6372O6081k5784a09480j14039
10532b23519D86870A87940o0171a04880A94236a08373G419h5625B27596a94517
10521c2212G7998b81911A89717b4667j9035j02677M6104O974j08257e030k76919
10510b81949c6235M164r5118G9024a55985e2028j62248A12894C1782N3519p353
10499G7948a75601C1376L18370a55608P6728B76554c1201l7401b9354j02440O3530
10488f8264B63340b04134L5060f0310B95129c55708D6119J2141c6905p8711b7629
10476D9040O5998f4666B14842a75046F071a44320B09815D4517K4842e0012A17357
$$ plain form
10464 -189217 -304412 241739 199858 269495 -43940 -277308 -139686 -162752 166789 -125019
10453 59153 -11554 154892 238124 193375 136893 174705 64728 -243000 102358 -108200 -53403
10441 48235 -42576 -10333 76154 -140058 170274 201418 -36155 -254018 198671 -66743 -283129
10430 -283129 104673 -225335 -145933 127715 -155084 243235 -424064 -5651 -188145 184688
10419 96206 -37283 -88312 306233 -133898 340735 25534 60865 56108 27927 -301489 -41775
10407 134811 -144175 74255 -165831 -369383 108657 -170792 210864 23931 41974 92057
10397 92057 49427 -13499 -137060 227275 272814 -46962 73548 -135056 -61404 107265 -142535
10385 128189 6520 -108562 -30114 297420 -134084 -219878 180058 284680 220209 84942 8439
$$ packed form
10464a89217j15195B41739m1881O9637d3940k33368J37622k3066A66789a25019
10453E9153a1554A54892Q3232m4749n6482L7812F4728b43000A02358a08200e3403
10441D8235d2576a0333G6154a40058A70274L1144c6155k17863A98671f6743k16386
10430b83129A04673b25335P9402A27715a55084B43235d24064e651j82494A84688
10419I6206c7283n1029C06233a33898C40735B5534L5331m757B7927c01489d1775
10407A34811a44175G4255a65831k03552A08657a70792B10864B3931J8043N0083
10397I2057m2630a3499j23561B27275M5539d6962G3548a35056f1404A07265a42535
10385A28189F520a08562c0114B97420a34084q5794A80058J04622o4471H4942H439
$$ plain form
10373 -73936 313038 -108075 305134 366692 319765 229341 433387 304201 391866 397980 445675
10362 445675 517481 209512 341220 122953 136410 78854 -58212 234045 -60493 556258
10351 349059 384569 626542 222310 281675 281049 168205 364206 70928 222153 348944 -21653
10339 173759 74270 112090 155051 -114327 58877 -132753 172044 14578 -148077 -9815 198287
10327 -77434 110489 -110457 89455 72074 52207 4045 368567 53909 111992 1805 -70508
10315 47477 731 -314043 118911 -318938 -72273 96594 -340988 -187562 -226441 -181708 126573
10303 4538 91813 328878 -95842 131508 24861 -1919 -246736 -227523 -142549 90849 333867
10292 333867 107313 -72437 30664 205693 -5147 -151986 -229487 -187371 -86101 228953 121028
$$ packed form
10373g3936C13038a08075C05134O1558m6927r0424K04046j29186Q7665O114M7695
10362D45675P1806B09512J31708A22953J3457n7556e8212B34045f0493E56258
10351C49059L5510K41973B22310N9365o26j12844J96001G0928J51225J26791b1653
10339A73759G4270L7820M2961a14327E8877a32753A72044A4578a48077i815A98287
10327g7434A10489a10457H9455j7381j9867D045L64522E3909N8083A805g0508
10315D7477G31c14043A18911c18938g2273I6594c40988J53426l8879M4733A26573
10303D538Q7275K37065i5842A31508B4861a919k44817J9213Q4974I0849K43018
10292C33867A07313g2437C0664J75029e147j46839p7501M2116h6101B28953j07925
$$ plain form
10281 121028 -42323 116070 87803 44707 -364660 151189 -185257 144859 364956 -194974
10270 178983 220302 -144392 76991 58385 -10294 232498 -120859 -96223 -57813 -182934 96062
10258 -46936 250771 70947 100104 398486 -114086 162057 78508 -32960 125425 215628 177560
10247 177560 -96223 -148382 157813 -182050 -280640 -6839 -142135 1998 179472 -227964 -262402
10236 -262402 177041 -142098 -83923 139478 58817 -13044 -190316 -145476 383261 130994
10225 -3908 -302364 156578 156901 82485 -421690 28445 -68973 -118343 -204677 -95393 -130723 195119
10212 91748 -212809 -76723 -162181 256810 -74457 -77512 -321211 -173282 137505 118033 -31362
10200 -379869 182560 -162590 107774 163915 -475137 54169 -91822 -55039 290684 241182
$$ packed form
10281A21028d2323A16070k8267m3096c64660A51189a85257A44859K20097a94974
10270A78983M1319a44392G6991j8606a0294B32498a20859K4636L8410j25121I6062
10258d6936B50771G0947K9157K98382a14086A62057G8508c2960A25425R0203l8068
10247A77560i6223n2159A57813a82050r8590f839j35296A998J77474b27964l4438
10236b62402A77041a42098N8175A39478E8817a3044j77272M4840C83261A30994
10225c908k98456A56578L23p4416d21690B8445f8973m9370q6334i5393l5330A95119
10212I1748b12809g6723q5458B56810g4457l055k43699J47929A37505j9472c1362
10200c79869A82560a62590A07774N6141d75137E4169i1822L6783B90684m9502
$$ plain form
10190 241182 152029 -149490 -111233 -9984 -208353 -150205 -298825 -309176 -238129 -169391 -74100
10178 185597 -194841 -69815 347994 123674 24417 43917 65677 -5924 17123 2842 -107901
10166 -72962 -150225 -258890 -322411 -135380 -42036 49041 104075 124104 -19925 151298 216760
10155 216760 -156810 -370304 -163996 165928 -122205 -29989 -194006 34625 -229708 15006
10144 -159664 -344766 223230 -354110 -97568 52222 67750 89912 208205 -171820 68519
10133 -119255 76665 275078 -148758 -44113 99625 -79827 -1843 22100 -38256 15300 84950
10122 84950 188025 56883 29059 -183294 -413520 -334494 -252723 -184998 -242332 185985 -126311
10110 -250902 -102795 27108 156433 -213257 -383606 -1363 187744 -28149 -7892 -18403 -165325
$$ packed form
10190B41182q9153a49490L8257i984j98369N8148j48620j0351P1047O8738g4100
10178A85597a94841f9815C47994A23674B4417J9500K1760e924A7123B842a07901
10166g2962p7263j08665o3521a35380d2036D9041N5034K0029a9925A51298O5462
10155B16760a56810k13494a63996A65928a22205b9989j64017C4625b29708A5006
10144a59664j85102B23230c54110i7568E2222J5528K2162J18293a71820F8519
10133a19255G6665J98413a48758d4113I9625g9827a843B2100c8256A5300O9650
10122H4950J03075E6883k7824a83294k30226P9026Q1771O7725n7334A85985a26311
10110b50902a02795B7108J29325b13257j70349a363A87744b8149g892j0511j46922
$$ plain form
10099 -165325 -56061 -270198 57117 -124484 94323 20253 147930 23880 -48897 159739 -429744
10087 -66362 -297823 146235 159890 -36645 50829 118361 141801 -208293 -190106 66802 134621
10076 134621 -25353 -253951 -54255 -156851 117812 -125967 -337596 -87671 -46946 232416
10065 -146634 175533 71064 -90403 44082 -117041 -198895 24408 -150387 -84030 306017 -6655
10053 -279849 -112574 -127862 -102912 110083 119450 50366 13270 -17096 82482 -90601 -11414
10041 95260 -212000 -243487 -64307 -46687 -130460 -132509 -312761 47781 -397473 -66838 106876
10029 -223255 -1319 -386137 143564 82116 -253464 133174 82335 -292628 -308812 -227785 -3975
10017 68375 92372 -168238 87188 103759 -69591 1022 -117862 -237708 -268810 -369510 -411430
$$ packed form
10099a65325e6061k14137E7117a24484I4323B0253J27677B3880d8897A59739d29744
10087f6362k31461A46235J3655c6645E0829O7532K3440b08293J8187F6802O7819
10076A34621b5353k28598e4255j02596A17812a25967k11629h7671M0725B32416
10065a46634A75533G1064i0403D4082a17041q1854B4408a50387O6357C06017f655
10053b79849a12574j5288K4950A10083R367E0366A3270a7096H2482i0601a1414
10041I5260b12000l1487f4307J7620q3773k049j80252D7781c97473f6838A06876
10029b23255a319l84818A43564o1448b53464A33174n0839b92628j6184Q1027c975
10017F8375K3997a68238H7188J6571f9591A022a17862j19846l1102j00700m1920
$$ plain form
10006 -411430 -191637 144943 -230735 171033 73013 18983 61294 79791 145689 -117667
9995 163925 -73088 -164561 66242 -167991 -155146 228958 -47417 -333198 -341098 -37531 -141348
9984 -141348 190842 82271 -242753 4182 -79633 -14886 -274782 -40867 20523 -112705 126379
9972 -140453 -49240 29797 198714 -234613 -32180 17061 108921 148693 59574 -60266 29897
9960 -165322 -186898 -13639 60160 -23698 -434040 -213354 -103454 80049 -74527 -48384 58626
9948 -115758 -48790 68272 -52013 -215234 -258795 133442 -179210 -88430 -173887 55549 -128442
9936 53927 -54901 -351724 -180205 -76476 -147117 -196848 7368 -113604 103344 -37115 -60061
9925 -60061 -14952 376361 34273 -61530 -266014 33090 -41631 27884 85044 -170995 -200737
$$ packed form
10006d11430a91637A44943b30735A71033G3013A8983M2311J8497O5898a17667
9995A63925g3088r1473F6242a67991J2845B28958d7417k85781p900c7531j03817
9984a41348A90842H2271b42753D182g9633a4886k59896d0867B0523a12705A26379
9972a40453d9240B9797J68917b34613c2180A7061R1860L9772E9574f0266B9897
9960a65322k1576a3639F0160b3698m10342b13354a03454H0049g4527K6143E8626
9948a15758d8790F8272e2013j63221m3561A33442a79210h8430q5457E5549a28442
9936E3927e4901k96823J71519g6476p0641m9731G368a13604A03344c7115k2946
9925f0061a4952C76361C4273f1530k04484C3090d1631B7884N7160a70995k9742
$$ plain form
9914 -200737 4479 130898 219446 20651 60360 -170524 22024 13493 -18688 37745 -47576 119491
9901 -82045 -271444 -367239 248319 68566 -48245 -307830 -62941 -42954 -136146 99938 -46124
9889 -146972 18379 -11274 -56782 -333329 -60617 -152495 -137408 -200506 -177756 -204340 80203
9877 -110290 -130151 -370449 -111957 -285227 -267827 -233002 -339044 131754 38468 -17130 -164102
9866 -164102 121094 -154965 221985 -186808 116896 17012 -19487 -246109 -120923 -205857
9856 -205857 121052 128367 -143162 103999 63479 82632 -176241 61762 -180001 -54175 76153
9844 92943 -406464 -236415 -61661 140885 -173026 -85221 -124267 31386 -206519 136654 -98045
9832 -58137 -314105 184812 -342362 206719 171719 -198412 -28170 62047 100479 149011 -38609
$$ packed form
9914b00737D479J26419Q8548B0651L9709a70524B2024q531a8688C7745d7576A19491
9901h2045j89399r5795B48319F8566d8245k59585f2941J9987r3192I9938d6124
9889a46972A8379a1274m5508k76547f0617r1878J5087o3098K2750k6584H0203
9877a10290j9861k40298a11957j73270J7400L4825j06042A31754C8468a7130j46972
9866a64102A21094a54965B21985a86808A16896A7012a9487k26622a20923q4934
9856b05857A21052P315a43162A03999m0520J9153a76241F1762a80001e4175G6153
9844I2943d06464J70049f1661A40885a73026h5221l9046C1386b06519A36654i8045
9832e8137k55968A84812c42362B06719l5000a98412b8170F2047L8432M8532c8609
$$ plain form
9820 -23616 -73825 159246 354625 -45092 -168942 -30365 117213 172371 -45354 -75246 -32434
9808 -359652 84935 -125071 -184274 -153024 143119 -38128 107425 9559 215065 -154657 11834
9796 -15212 138230 -311275 -62392 -156612 -49313 -243571 -74285 11557 254629 213175 33436
9784 -47067 -313717 125634 -116383 139276 -33322 225655 -53226 332216 -171798 63353
9773 201099 -49260 -76207 17898 126738 -165508 -237470 10807 202621 -155434 11749 -115247
9761 -23117 185253 171914 -145113 -191830 -77934 -113797 275870 -22784 455390 29366 52265
9750 52265 -29735 3008 -150386 110352 -33480 29781 57085 51803 -120735 -66271 -317704
9739 -317704 -3280 206430 69961 47147 -28061 -83425 45467 -92373 -5526 49204 205005 -141146
$$ packed form
9820b3616n0209A59246J95379d5092j23850c0365A17213N5158d5354k9892c2434
9808c59652H4935a25071n9203L1250A43119c8128A07425I559K05506a54657A1834
9796a5212A38230c11275f2392r4220d9313j94258g4285A1557K43072m1454C3436
9784d7067k66650A25634a16383A39276c3322B25655e3226C32216a71798F3353
9773B01099d9260k6947A7898J08840a65508p1962A0807J91814a55434A1749a15247
9761b3117A85253j3339a45113m6717g7934l5863B75870b2784D55390B9366K2899
9750E2265b9735C008a50386A10352c3480B9781K7304n282a20735N4464k51433
9739c17704c280B06430F9961k2814b8061n5364D5467i2373e526D9204J55801a41146
$$ plain form
9726 -146468 -74681 -124016 227319 -207806 -7332 63300 6216 63703 -25938 8841 165661 -24856
9713 -331779 43652 -12954 -146385 51250 -196864 30772 -44511 -29715 -78308 -72098 -161024
9702 -161024 -40937 6606 -149557 -99954 -110957 -324326 854 12393 -179629 136505 78223
9691 78223 -259158 -256632 -42276 -47171 -118099 -78170 100852 -261576 -334946 -176115 85581
9679 56775 -47199 -218226 55433 -191959 -55621 -231532 -204745 -70767 7526 1855 -115282
9667 107296 -68120 -125534 -263805 -408937 -67839 -31862 -124700 -400242 -30176 -157371 -52242
9655 -44693 -95711 -63489 -194376 408873 -22205 49774 -47500 -83246 -8665 445153 63606
9643 -184121 -71563 -224687 -296158 -100036 244426 -139964 -305762 -83036 217130 26995
$$ packed form
9726a46468P1787m9335B27319b07806g332F3300F216N7487b5938H841J56820b4856
9713c31779D3652a2954j33431E1250a96864C0772d4511J4796m8593O210q8926
9702a61024d0937F606a49557M9603j1003k13369H54J1539a79629A36505n8282
9691G8223b59158K526d2276m895p0928L9929A00852b61576p3370J58831H5581
9679E6775d7199j71027E5433a91959e5621j75911K6787g0767G526A855a15282
9667A07296f8120n7414j38271j45132f7839c1862r2838k75542c0176j27195e2242
9655d4693n1018L2222j30887D08873b2205D9774d7500l5746h665D45153F3606
9643a84121g1563j53124p1471a00036B44426a39964j65798h3036B17130B6995
$$ plain form
9632 -58990 -83092 81036 -153833 -8590 94934 -168399 124230 -19235 175105 -327931 104772
9620 -17681 -419443 -163587 -373796 11803 -206006 47545 119720 -131394 113514 -169959
9609 -52822 -125623 -129259 -199713 -288889 212922 -288686 149046 9082 204013 -275561 -298425
9598 -298425 223814 -144928 -199001 159779 96150 115269 -352694 -193225 -62180 -70492 -15241
9586 24472 202952 57903 -32160 42761 -64071 -3700 -422238 -174095 59999 -45125 83464
9574 -95800 -81949 65208 136616 -304189 -500383 -49919 -41908 137967 -113601 -2306 -34855
9563 -34855 43489 21763 -103838 -27306 -125970 -121743 -149952 63232 -172631 -44200 73275 -239574
9550 67300 -190054 -413830 -151012 -62780 -165984 -156823 57003 -237554 -25600 -277869 -258978
$$ packed form
9632e8990k4102H1036a53833h590I4934a68399A24230a9235A75105c27931A04772
9620a7681m01762a63587k10209A1803b06006D7545P2175a31394A13514a69959
9609e2822p2801l636p0454q9176B12922b88686A49046I082J94931b75561k2864
9598b98425B23814a44928n4073A59779o3629J9119c52694J59469f2180q312a5241
9586B4472J78480E7903c2160D2761f4071c700m18538a74095E9999d5125H3464
9574i5800J3851F5208P1408c04189j96194d9919Q011A37967a13601b306l2549
9563c4855D3489k1726a03838b7306r8664M227k8209F3232a72631d4200G3275b39574
9550F7300a90054k23776a51012f2780j03204R161E7003b37554b5600k52269J8891
$$ plain form
9539 -258978 -256981 -151494 59173 -6270 -162672 115117 424470 -212178 -138639 -10390 57113
9527 -58043 -146144 41816 -79152 131435 38471 -4853 133392 212934 78118 -162597 -136695
9516 -136695 219864 -27242 106795 -88634 -213876 142210 29176 10550 99856 -90872 -371815
9505 -371815 -13097 -125685 -241125 -38793 204391 354778 -53611 -191207 87591 108117 -113570
9493 8398 -147427 -80992 141134 6723 -297093 -97058 -117366 27963 -99079 -205364 51371
9481 200169 3493 100708 -429845 230623 -48816 87121 -145864 -129863 -71208 -122630 -198574
9470 -198574 -133752 120650 -158292 -69762 316013 165387 18805 -36287 82831 -134600 -2573
9458 -99005 -18816 -484693 -229874 -318536 -19826 -199981 70110 -59802 -166743 -202671 -159951
$$ packed form
9539b58978J997J05487E9173f270j56402A15117L09353b12178P3539a0390E7113
9527e8043q8101D1816g9152A31435C8471d853A33392P9542G8118a62597K5902
9516a36695B19864b7242A06795h8634j25242A42210B9176A0550Q9306i0872k80943
9505c71815a3097j12588j15440c8793B04391J50387e3611j37596H7591K0526a13570
9493H398a47427O6435A41134F723b97093i7058k0308B7963i9079j06285E1371
9481B00169C493R7215d29845B30623d8816H7121a45864J6001N8655n1422p5944
9470a98574O4822A20650a58292f9762C16013j50626A8805c6287H2831a34600b573
9458i9005a8816m65877b29874q8662a9826j80155G0110e9802j06941l5928M2720
$$ plain form
9447 -159951 -261547 -102929 -31699 -36296 -77613 25281 120551 50434 -58687 27537 -124074
9435 -159397 99380 35528 74771 2875 75137 153037 -175566 -186280 -174292 25237 78080 -77787
9422 -125655 -229046 -59906 -102637 -121418 -89676 -205884 173232 74980 207886 -116044 -67551
9411 -67551 216409 64413 67825 -54582 -116144 -342731 -439253 -251362 -29003 153032 -185924
9399 -207566 -262143 -113862 170102 147691 169994 -236681 -64980 109071 -287984 217294
9388 -16006 77392 -64536 33689 -80556 30908 -218574 -119705 35657 -135063 -105337 -72314
9377 -72314 -227782 -224526 134711 148707 -163014 55388 160429 -221041 -81152 -168251 -306423
9366 -306423 -171014 -163660 46724 -56294 158938 -1892 -175422 -102935 -24643 -114359 -151214
$$ packed form
9447a59951j01596a02929c1699m597m1317B5281R5270E0434e8687B7537a24074
9435a59397I9380C5528L9243B875P2262P7900a75566j0714J1988B5237N2843g7787
9422a25655j03391e9906m2731j8781L1742j16208A73232G4980J32906a16044M8493
9411f7551B16409F4413L412e4582o1562k26587r6522J87891b9003A53032a85924
9399b07566n4577a13862A70102k2411K2303b36681f4980A09071b87984B17294
9388a6006G7392f4536C3689h0556C0908b18574R8869C5657a35063K9726L3023
9377g2314j55468L256A34711J3996a63014E5388J05041b21041h1152q7099j38172
9366c06423J35409P354D6724e6294A58938a892j73530P2487b4643q9716l6855
$$ plain form
9355 -151214 323195 -251562 -287632 -248018 179942 134363 -11018 10518 -4095 -121090 145029
9343 -164981 -27665 -372845 105741 -12987 -74796 8908 -23146 -5032 -257454 303326 102804
9331 -264170 -24002 -106282 -184344 -189854 -253386 -202829 168327 21239 -11066 -181352 67419
9319 -214340 -37143 30088 -71348 -192452 296735 -296134 -135725 -472463 93874 -26728 -91057
9308 -91057 215104 -397693 -70856 243022 -190092 9432 -175455 -23795 -148770 -167739 125265
9296 -151438 -280192 -240656 133574 -12503 71177 201616 71394 58718 81027 167636 -284863
9284 185161 -274021 -54284 -81676 19041 -265723 158107 6929 -110858 -74559 -298020 -207407
9273 -207407 -29880 -418845 -162189 21725 -147028 -147399 -291387 -186094 -62325 47290 -44193
$$ packed form
9355a51214C23195b51562l6070L9614A79942m5579a1018A0518d095j16995A45029
9343a64981b7665l45180A05741a2987o1809H908b3146e032k52422C03326A02804
9331b64170b4002q2280p8062n510o3532N0557A68327B1239a1066j70286F7419
9319b14340c7143C0088g1348j21104B96735b96134a35725l36738I3874b6728o4329
9308i1057B15104c97693g0856B43022a90092I432a75455b3795j24975j8969A25265
9296a51438j28754L9536A33574a2503G1177J30439G1394j2676K2309Q6609b84863
9284A85161b74021e4284k7392A9041b65723A58107F929a10858L6299k23461R0613
9273b07407b9880l88965a62189B1725a47028l71j43988J05293f2325D7290d4193
$$ plain form
9261 22703 -42522 -19421 -311748 -52253 -59240 -698 -200190 -267671 -356089 -92718 -35898 118361
9248 -203329 -43124 -239162 -93889 288036 -10444 217585 -49950 -203130 250962 -121409
9237 -225111 -59889 -150884 881 -178839 -239857 -132759 104281 162494 -353740 -23836 -10641
9225 -52508 -34291 107365 -143474 -241557 -592 50343 261950 -220471 -285965 -333064 -302205
9214 -302205 -90595 -234317 127516 -125686 126007 -229279 -38831 186244 -52981 -47001 -82760
9203 -82760 -135144 245516 -171183 -59168 170168 12531 -27479 -82470 -429858 -377519 49215
9191 85021 164793 -509442 -299758 54336 -286280 -283971 -186300 -209472 -253562 -63995 -38282
9180 -38282 -240177 125834 -193276 -60951 -222573 -191902 -137040 -172329 199338 150977 66822
$$ packed form
9261B2703d2522a9421k92327e2253o987f98j99492o7481q8418i2718c5898A18361
9248b03329d3124j96038i3889B88036a0444B17585d9950j53180B50962a21409
9237b25111e9889r0995H81a78839o1018J07098A04281N8213c53740b3836a0641
9225e2508J8217A07365a43474r8083e92E0343K11607b20471o5494m7099L0859
9214c02205i0595j43722A27516a25686A26007b29279c8831A86244e2981N980l5759
9203h2760n2384B45516a71183e9168A70168A2531b7479n4991l47388N2339D9215
9191H5021P9772e09442K09684E4336b86280K309R7671k3172m4090f3995K5713
9180c8282k01895A25834a93276f0951j61622L0671N4862l5289A99338m8361F6822
$$ plain form
9168 -106405 -203653 -118672 259762 -115854 -147001 -345745 -278002 75182 -160977 202554 -203060
9156 -30454 -243427 -99004 -123148 -1578 -48099 132280 -15482 192314 164276 -27046 4901 -114882
9143 -263735 -218044 -29071 -246373 -94517 -479776 -74838 55633 -369431 83991 -75940 -193526
9132 -193526 -185477 -11571 1790 40723 -317627 -201128 -99536 -84380 114128 110786 -135146
9120 158309 361244 17452 -313614 -244979 127058 -206854 -217311 -7866 -75942 251177 -89720
9108 82868 -69339 72722 -15940 310727 132689 193360 53413 19778 2517 257570 100384
9096 -211972 37545 71405 -113193 49731 -186329 -15558 -147884 -21925 -38370 -40583 70016
9084 -89310 18889 -316079 -44475 -291503 -57562 110374 185762 -134587 -28058 -424385 47713
$$ packed form
9168a06405r7248Q4981B59762a15854l1147j98744O7743G5182a60977B02554b03060
9156c0454k12973i9004k4144a578m6521A32280a5482A92314k8038b7046D901a14882
9143b63735M5691b9071k17302i4517l85259g4838E5633c69431H3991g5940j17586
9132a93526Q049a1571A790L8933c17627J16499i9536J5156A14128l342a35146
9120A58309K02935A7452c13614O8635A27058b06854j0457g866o8076B51177h9720
9108H2868f9339G2722a5940C10727A32689O0671E3413A9778B517K55053A00384
9096b11972C7545L3860a13193D9731a86329a5558j32326b1925j6445k213G0016
9084h9310A8889c16079d4475k47028e7562A10374P5388a34587b8058l96327D7713
$$ plain form
9072 -3244 -295938 -211958 -12272 20306 212363 177930 17453 3030 -58842 -183142 -274651 -88997
9059 -28507 -109154 -146059 123137 -32437 206835 -6154 10039 -126197 -132671 150903 17214
9047 -39935 -263690 68167 4839 129786 -296531 117934 82287 134739 26706 47493 -1616
9035 130854 -91228 -234257 -194196 322141 212491 56147 -334299 -30426 28313 -69923 -130059
9024 -130059 134058 -42092 -352888 -89419 -981 101445 11924 24535 340539 -89876 5651
9012 31258 -118094 306306 54171 -199509 -129197 -215304 -230535 -130894 282501 -121676 -323654
9001 -323654 -58164 112459 92993 -284132 126950 -244061 49496 -240240 -184821 124485
8990 -399665 -283026 -1750 -354152 -17608 -86264 91931 99286 -57537 -225878 -152782 155489
$$ packed form
9072c244k92694Q3980a2272B0306J92057l4433A7453C030e8842j24300r1509h8997
9059b8507q0647l6905A23137c2437B06835f154A0039a26197o474A50903A7214
9047c9935k23755F8167D839J24947b96531A17934l5647N2452B6706K0787a616
9035A30854i1228j43029M0061C22141j09650E6147c34299c0426B8313f9923o0136
9024a30059A34058d2092l10796h9419i81A01445A1924J2611L16004h9876E651
9012C1258a18094C06306E4171a99509P0312q6107j5231R9641B82501a21676k01978
9001c23654e8164A12459j9466b84132A26950b44061D9496b40240N5419A24485
8990c99665J16639a750l52402a7608o8656I1931P355e7537j68341P3096A55489
$$ plain form
8978 -1847 -12132 -14306 56285 -339983 -188003 55763 -169705 -102478 146944 55124 -49606
8966 -173567 -89953 -224077 -121398 269279 -520768 -427447 70273 -226293 -113564 -127503
8956 -127503 30298 30879 178422 -84270 92973 -57812 -265299 -347601 -44800 -84541 -68414 -219641
8944 -219641 -134027 36675 -362896 199745 -70541 -253874 -12202 -296153 406236 382864 288598
8933 288598 73888 211032 -119356 -112189 -22995 68204 374105 800674 885584 1792713 4564261
8922 4564261 12752594 13587373 5636195 2007458 1127965 588752 76498 88105 50707 99471
8912 99471 75174 -148429 -72666 -86362 443414 148894 -72424 -166832 -165611 -224859 -26024
8900 -97500 -91131 -212140 -380535 56996 -270614 18798 -42054 -238071 -38880 -15422 15242
$$ packed form
8978a847j0285k174E6285c39983J51980E5763a69705O7227A46944E5124d9606
8966a73567Q3614j34124J02679B69279e20768R3321G0273b26293J12729j3939
8956a27503C0298N81J47543h4270I2973e7812k07487q2302d4800l9741J6127j51227
8944b19641Q5614C6675c62896A99745g0541j83333a2202k83951D06236k3372r4266
8933B88598G3888J37144a19356P167b2995F8204L05901M26569Q4910R07129K771548
8922D564261Q188333Q34779E636195B007458q79493n39213G6498J1607l7398M8764
8912I9471k4297a48429g2666j3696D43414A48894g2424r4408J221n9248b6024
8900i7500O369j21009j68395E6996b70614A8798d2054j96017c8880a5422A5242
$$ plain form
8888 177230 213769 42342 -175650 12714 -139546 178423 148422 -149287 -27288 10870 -202213
8876 -161926 -23017 3659 17783 -283989 -179485 -30641 115307 -156527 77603 -3775 2869
8864 5445 -246085 27232 390461 -248596 119054 34224 -249089 -400596 -689 -23620 -31236
8853 -31236 -45260 -128123 -123285 190300 -145516 20276 -107979 -50902 -185807 -69690 -289560
8842 -289560 109036 -187050 -110775 -106729 -46131 -163118 -83956 76580 155661 -61632 -79953
$$ packed form
8888A77230L6539D2342a75650A2714a39546A78423l0001a49287b7288A0870b02213
8876a61926b3017C659J4124b83989J04504c0641A15307a56527G7603c775B869
8864E445b46085B7232L63229b48596A19054C4224b49089j51507f89k2931p616
8853c1236j4024q2863M838A90300a45516B0276a07979e0902j34905f9690k19870
8842b89560A09036a87050P6275M046d6131j16987P9162G6580P9081f1632j8321
$$ [...]
##END NTUPLES=NMR SPECTRUM
##END=
