##TITLE=AC1774_ZAMWASH_9683880_mo20mlyxms
##JCAMPDX= 6.0         $$ Bruker NMR JCAMP-DX V2.0
##DATA TYPE= NMR SPECTRUM
##DATA CLASS= NTUPLES
##ORIGIN= BRUKER
##OWNER= Administrator
$$ 1.72 TOPSPIN		Version 2.1
$$ 2016-04-16 21:21:57.673 -0700  Administrator@X
$$ Compression mode = diff/dup
##.OBSERVE FREQUENCY= 400.02188249412
##.OBSERVE NUCLEUS= ^1H
##.ACQUISITION MODE= SIMULTANEOUS (DQD)
##.ACQUISITION SCHEME= undefined
##.AVERAGES= 8
##.DIGITISER RES= 22
##SPECTROMETER/DATA SYSTEM= spect
##.PULSE SEQUENCE= zg30
##.SOLVENT NAME= COFFEE_meoh
##.SHIFT REFERENCE= INTERNAL, COFFEE_meoh, 1, 14.98509
##AUDIT TRAIL= $$ (NUMBER, WHEN, WHO, WHERE, PROCESS, VERSION, WHAT)
$$ ##TITLE= Audit trail, TOPSPIN		Version 2.1
$$ ##JCAMPDX= 5.01
$$ ##ORIGIN= Bruker BioSpin GmbH
$$ ##OWNER= Administrator
$$ $$ E:\/data/COFFEE/nmr/AC1774_ZAMWASH_9683880_mo20mlyxms/10/pdata/1/auditp.txt
$$ ##AUDIT TRAIL=  $$ (NUMBER, WHEN, WHO, WHERE, PROCESS, VERSION, WHAT)
(   1,<2016-04-16 21:21:50.564 -0700>,<Administrator>,<X>,<go>,<TOPSPIN 2.1>,
      <created by zg
	started at 2016-04-16 21:20:44.673 -0700,
	POWCHK enabled, PULCHK disabled,
       configuration hash MD5:
       21 0F 79 D6 B3 7B B4 F6 88 20 88 DB 03 48 BD 9F
       data hash MD5: 64K
       B8 22 7C 8E 41 85 F8 55 89 93 D0 B2 B8 4A 40 CE>)
(   2,<2016-04-16 21:21:53.673 -0700>,<Administrator>,<X>,<proc1d>,<TOPSPIN 2.1>,
      <Start of raw data processing
       efp LB = 0 FT_mod = 6 PKNL = 1 PHC0 = 0 PHC1 = 0 SI = 32K 
       data hash MD5: 32K
       C0 BA F1 7E 92 7D D9 8B 2C 30 A8 0A E2 02 90 0D>)
(   3,<2016-04-16 21:21:53.970 -0700>,<Administrator>,<X>,<proc1d>,<TOPSPIN 2.1>,
      <pk PHC0 = 88.42346 PHC1 = 0 
       data hash MD5: 32K
       8C 06 DE BB 6F 58 1D BE 58 8C FF 90 B2 0B C5 23>)
(   4,<2016-04-16 21:21:54.079 -0700>,<Administrator>,<X>,<proc1d>,<TOPSPIN 2.1>,
      <abs ABSG = 1 
       data hash MD5: 32K
       A9 DB 0F 0F 2B 70 B8 B0 D5 C9 07 B9 2F EA 9A 90>)
(   5,<2016-04-16 21:21:54.126 -0700>,<Administrator>,<X>,<proc1d>,<TOPSPIN 2.1>,
      <abs ABSG = 2 
       data hash MD5: 32K
       79 73 23 EE 20 9A 1F CE 50 74 01 38 C1 E9 9C D0>)
(   6,<2016-04-16 21:21:54.189 -0700>,<Administrator>,<X>,<proc1d>,<TOPSPIN 2.1>,
      <abs ABSG = 3 
       data hash MD5: 32K
       0E 1A 8A D9 37 06 C9 6E 1A 83 4D 23 B5 BD DA D0>)
(   7,<2016-04-16 21:21:54.251 -0700>,<Administrator>,<X>,<proc1d>,<TOPSPIN 2.1>,
      <abs ABSG = 4 
       data hash MD5: 32K
       6D 4D E9 B8 67 EA 8B A5 AE 6D AA 76 51 89 F6 3D>)
(   8,<2016-04-16 21:21:54.314 -0700>,<Administrator>,<X>,<proc1d>,<TOPSPIN 2.1>,
      <abs ABSG = 5 
       data hash MD5: 32K
       14 3E 8A DB A2 CA 07 12 E8 FF A8 82 8A 54 26 F5>)
$$ ##END=
$$ 
$$ $$ hash MD5
$$ $$ BB 1F BF DF 55 37 CC 01 12 34 34 1E 4C 3F 11 19
##$RELAX= 
##$RELAX= 
##$RELAX= 
##$RELAX= 
##$RELAX= 
##$RELAX= 
##$RELAX= 
$$ Bruker specific parameters
$$ --------------------------
##$DU= <E:\>
##$EXPNO= 10
##$NAME= <AC1774_ZAMWASH_9683880_mo20mlyxms>
##$PROCNO= 1
$$ [...]
150 150 150 150 150 150 150 150
##$TP07= 0
##$TPNAME0= <>
##$TPNAME1= <>
##$TPNAME2= <>
##$TPNAME3= <>
##$TPNAME4= <>
##$TPNAME5= <>
##$TPNAME6= <>
##$TPNAME7= <>
##$TPOAL= (0..7)
0.5 0.5 0.5 0.5 0.5 0.5 0.5 0.5
##$TPOFFS= (0..7)
0 0 0 0 0 0 0 0
##$TUNHIN= 0
##$TUNHOUT= 0
##$TUNXOUT= 0
##$USERA1= <user>
##$USERA2= <user>
##$USERA3= <user>
##$USERA4= <user>
##$USERA5= <user>
##$V9= 5
##$VALIST= <valist>
##$VCLIST= <CCCCCCCCCCCCCCC>
##$VD= 0
##$VDLIST= <DDDDDDDDDDDDDDD>
##$VPLIST= <PPPPPPPPPPPPPPP>
##$VTLIST= <TTTTTTTTTTTTTTT>
##$WBST= 2048
##$WBSW= 25
##$XGAIN= (0..3)
0 0 0 0
##$XL= 0
##$YL= 0
##$YMAX_a= 558630
##$YMIN_a= -490010
##$ZGOPTNS= <>
##$ZL1= 120
##$ZL2= 120
##$ZL3= 120
##$ZL4= 120
##$ABSF1= 14.98509
##$ABSF2= -5.573092
##$ABSG= 5
##$ABSL= 3
##$ALPHA= 0
##$AQORDER= 0
##$ASSFAC= 0
##$ASSFACI= 0
##$ASSFACX= 0
##$ASSWID= 0
##$AUNMP= <proc_prof1d_extract_pilot.lims>
##$AXLEFT= 0
##$AXNAME= <>
##$AXNUC= <1H>
##$AXRIGHT= 0
##$AXTYPE= 0
##$AXUNIT= <>
##$AZFE= 0.1
##$AZFW= 0.1
##$BCFW= 0
##$BC_mod= 0
##$BYTORDP= 0
##$COROFFS= 0
##$CY= 15
##$DATMOD= 1
##$DC= 0
##$DFILT= <>
##$DTYPP= 0
##$F1P= 0
##$F2P= 0
##$FCOR= 0.5
##$FTSIZE= 32768
##$FT_mod= 6
##$GAMMA= 0
##$GB= 0
##$INTBC= 1
##$INTSCL= 1
##$ISEN= 128
##$LB= 0
##$LEV0= 0
##$LPBIN= 0
##$MAXI= 10000
##$MC2= 0
##$MEAN= 0
##$ME_mod= 0
##$MI= 0
##$NCOEF= 0
##$NC_proc= -8
##$NLEV= 6
##$NOISF1= 0
##$NOISF2= 0
##$NSP= 0
##$NTH_PI= 0
##$NZP= 0
##$OFFSET= 14.98509
##$PC= 1
##$PHC0= 88.42346
##$PHC1= 0
##$PH_mod= 1
##$PKNL= yes
##$PPARMOD= 0
##$PPDIAG= 0
##$PPIPTYP= 0
##$PPMPNUM= 2147483647
##$PPRESOL= 1
##$PSCAL= 4
##$PSIGN= 0
##$PYNMP= <proc.py>
##$REVERSE= no
##$SF= 400.02
##$SI= 32768
##$SIGF1= 0
##$SIGF2= 0
##$SINO= 400
##$SIOLD= 32768
##$SPECTYP= <>
##$SREGLST= <1H.CDCl3>
##$SSB= 0
##$STSI= 32768
##$STSR= 0
##$SW_p= 8223.68421052631
##$SYMM= 0
##$S_DEV= 0
##$TDeff= 65536
##$TDoff= 0
##$TI= <>
##$TILT= no
##$TM1= 0
##$TM2= 0
##$TOPLEV= 0
##$USERP1= <user>
##$USERP2= <user>
##$USERP3= <user>
##$USERP4= <user>
##$USERP5= <user>
##$WDW= 1
##$XDIM= 32768
##$YMAX_p= 445323536
##$YMIN_p= -665297
##$CURPLOT= <Network HP LaserJet P1505>
##$CURPRIN= <$Network HP LaserJet P1505>
##$DFORMAT= <normdp>
##$LAYOUT= <+/1D_H.xwp>
##$LFORMAT= <normlp>
##$PFORMAT= <normpl>
##$SURQMSG= 1
$$ End of Bruker specific parameters
$$ ---------------------------------
##NTUPLES= NMR SPECTRUM
##VAR_NAME=  FREQUENCY,     SPECTRUM/REAL,   SPECTRUM/IMAG
##SYMBOL=    X,             R,               I
##VAR_TYPE=  INDEPENDENT,   DEPENDENT,       DEPENDENT
##VAR_FORM=  AFFN,          ASDF,            ASDF
##VAR_DIM=   32768,         32768,           32768
##UNITS=     HZ,            ARBITRARY UNITS, ARBITRARY UNITS
##FACTOR=    0.250966925370066, 1,           1
##FIRST=     8223.43324360094, 42520,        44231
##LAST=      0,             -3763,           -197729
##MIN=       0,             -665297,         0
##MAX=       8223.43324360094, 445323536,    0
$$ Real data points
##PAGE= N=1
##DATA TABLE= (X++(R..R)), XYDATA
$$ [...]
19584b4814B39657d8903A00144a63616G5130c32105O2550B44544k286n9831j2223
19573A70204h5483L8590j59619B18958c87824a70694E5603a4231j03810A05826
19562g3279j04452f3344A45021a35870N3956d0170A80499K6407c04492b4307C4412
19550A37942a06400p3604Q0595A23321h1032A44093C2211a58707A23313a23026
19539I5439J8425b13957d5601k02034f4070J9525k33762B85077j34768a50524
19528A90894G915i5177r467j03316Q4856E3857K90436a4993k50945a21958j05637
19517b27595B90872a11754j08257A48153g992B352a31869L301j50581d0706F1197
19505E4162b790n67928a80145F4952b22830D3399a15263A06675A8654b30976g2454
$$ y = [-24814, 239657, -48903, 100144, -163616, 75130, -332105, -269555, 244544, 242258, 182427, 170204, -85483, -46893, -206512, 218958, -387824, -170694, 55603, -14231, -118041, 105826, -73279, -177731, -63344, 145021, -135870, -81914, -40170, 180499, 206906, -304492, -24307, 34412, 137942, -106400, -180004, -99409, 123321, -81032, 144093, 32211, -158707, 123313, -123026, 95439, 113864, -213957, -45601, -247635, -64070, -44545, -278307, 285077, 150309, -150524, 190894, 7915, -95177, -104644, -207960, -123104, 53857, 344293, -14993, -265938, -121958, -227595, 290872, -111754, -220011, 148153, -7992, 2352, -131869, -128568, -279149, -40706, 61197, 54162, -2790, -570718, -180145, 64952, -222830, 43399, -115263, 106675, 18654, -230976, -72454]
19493e8646j26241B89533A34303c62046h6678q3540c6295k83341B3711c76403
19482A47662E2784b15208A85963l4852L9975G9688P5203a56839e66D5146B0100
19470a00943F3528o497d4649k04625f5048k8809j65100Q4847l36033a23345A0347
19458a76346r9366A51936c05106A24145b05277L3411b8331j14832B9550a44460
19447G561a56620j36957A0803J80806H3226a0281A34258R8728b18158c7290i197
19435C4449Q8475c33417J18659a05021C7450a94532A56599E3925e8800A92541
19424g0967l9699d1447k42049E7009b12715A74152G5087K3380a05671A05662L6803
19413A42465a6736j50112F9875q48d87504a38352H4703a08396q0221J6037k15294
$$ y = [-58646, -184887, 289533, 134303, -362046, -86678, -170218, -36295, -319636, 23711, -376403, 147662, 52784, -215208, 185963, 151111, 191086, 79688, 154891, -156839, -566, 45146, 20100, -100943, 63528, 57031, -44649, -249274, -65048, -93857, -258957, -174110, -510143, -123345, 10347, -176346, -275712, 151936, -305106, 124145, -205277, -171866, -28331, -143163, 29550, -144460, 7561, -156620, -293577, 10803, 191609, 83226, -10281, 134258, 232986, -218158, -37290, -9197, 34449, 122924, -333417, -214758, -105021, 37450, -194532, 156599, 53925, -58800, 192541, -70967, -110666, -41447, -283496, 57009, -212715, 174152, 75087, 98467, -105671, 105662, 142465, -16736, -166848, 69875, 69027, -487504, -138352, 84703, -108396, -188617, -172580, -387874]
19402c87874a52321A788c76810f9280o8693j27494I7222a54479A441c71554B27656
19390g0528j97724I0889b8365n7584L6357o4658b809B6859r84f7680B57271d0129
19377B05437o7486Q8774c35320A10587c36544g6970l01910a35935B62010a12123
19366h1400b2233H9685d09603a8462F8014h7985G4875b52092B43105C189b88923
19354F219a78498l4844H9633a93397j43069P7022C03915D918c16362a40050d8920
19342i9546k13070a2839j3088j26839A38512a42403A64745b29743d1586l33826
19332c75412R7628A257L36022d9872M337k12545h7923j39639K0671h0298p6686
19321a56984F0106a06107J4543A32468e8021k14000J1139J05874H8704c01665
$$ y = [-387874, -152321, 1788, -376810, -69280, -137973, -265467, 97222, -154479, 1441, -371554, 227656, -70528, -268252, 90889, -28365, -85949, -49592, -114250, -2809, 26859, 25875, -67680, 257271, -40129, 205437, 137951, 226725, -335320, 110587, -336544, -76970, -378880, -135935, 262010, -112123, -81400, -22233, 89685, -409603, -18462, 68014, -87985, 74875, -252092, 243105, 3189, -288923, 6219, -178498, -213342, 89633, -193397, -336466, -259444, 303915, 4918, -316362, -140050, -48920, -99546, -312616, -12839, -25927, -152766, 138512, -142403, 164745, -229743, -41586, -375412, -277784, 1257, 337279, -49872, -45535, -258080, -87923, -227562, -206891, -80298, -156984, 60106, -106107, -91564, 132468, -58021, -272021, -260882, -155008, 88704, -301665]
19310A60940H023a46107A29496k9274C7659b81389M1262L472g7668J7227l3724
19299i4165a0516j96708e0371j6146C0552a51264F1824a75482a7736k55881j54234
19288d27851h6368m17993c7974j3183C7462i8422M0783j37397d4248C74813E4060
19276a79929F2100a99040C8047J33908C3845B333J90393g7826B23017c03458o1518
19265c64976b0551j16487J1598C2512J14943d822A08555a20582a4023B6971h1825
19253D7866g7956k73735a18197e2780C5396e7695E3623c75338a4700m6708b4365
19241f5761A28279f1694p4345c2827A41528i8134A02065i4187A38328k3140d8140
19229G7878f9475F403a04250A90412a44287f0966A96338q2041a13863G6722a01572
$$ y = [160940, 8023, -146107, 129496, 100222, 37659, -281389, -240127, -236655, -77668, -60441, -94165, -10516, -207224, -50371, -66517, 30552, -151264, 61824, -175482, -17736, -273617, -427851, -86368, -504361, -37974, -51157, 37462, -98422, -57639, -195036, -44248, 374813, 54060, -179929, 62100, -199040, 38047, 171955, 33845, 2333, 192726, -77826, 223017, -303458, -364976, -20551, -137038, -125440, 32512, 147455, -4822, 108555, -120582, -14023, 26971, -81825, 47866, -77956, -351691, -118197, -52780, 35396, -57695, 53623, -375338, -14700, -61408, -24365, -65761, 128279, -61694, -136039, -32827, 141528, -98134, 102065, -94187, 138328, 115188, -48140, 77878, -69475, 6403, -104250, 190412, -144287, -60966, 196338, 114297, -113863, 76722, -101572]
19217e3949a0351D23601c51695Q9827h1964j9760J8864A37631M2959B0908a11898
19205b62997b2260R282B75322e800k79834f7460j47747A4922J2950i3316E2338
19193a37922D6232a2166A3477a53840B2087N7871b14370l9369D6393c14069A71566
19181G3232d20552B09676N3887c8808l66968I8669m064c06621C3997a23669G8159
19169a27770k4132N225l9299A51014p2483f4152p7065D8157j5318J13768j4340
19158A32267d2389q5642E4403b81700H8499a21214j77515a32071n4134B89367
19147A70442a53117k24904A6505a14461b3342j06446k61432J53609j33318c6775
19136A32286g5169C72762a37127B5430K5753F794d30641a31036q381l17597a34340
$$ y = [-53949, -10351, 423601, -351695, -261868, -81964, -101724, -82860, 137631, 180590, 20908, -111898, -262997, -22260, -12978, 275322, -5800, -285634, -67460, -215207, 14922, 27872, -93316, 52338, -137922, 46232, -12166, 13477, -153840, 22087, 79958, -214370, -253739, 46393, -314069, 171566, 73232, -420552, 209676, 263563, -38808, -405776, 98669, 94605, -306621, 33997, -123669, 78159, -127770, -151902, -146677, -185976, 151014, 78531, -64152, -141217, 48157, 32839, 146607, 132267, -42389, -128031, 54403, -281700, 88499, -121214, -298729, -132071, -186205, 289367, 170442, -153117, -378021, 16505, -114461, -23342, -129788, -391220, -237611, -370929, -36775, 132286, -75169, 372762, -137127, 25430, 51183, 6794, -430641, -131036, -139417, -457014, -134340]
19124A75270a18181A10989d80613a53346n0459Q864a2692j92748F2831i855D4922
19112B22833b78274J3885a20565A21503H851J33806b01286H0063k7599f0008A6499
19100A03809a90031g1800k56094a25578r3408M0728c5915A71340a8399B01302
19089B1759d7952F0982L37156g3648k4020M6644A28134b16113J00854a7185r0909
19078a08094j02879K9074B29048a70385M2073B54308j07823a14091e2634q3682
19068a36316e2003k78109A27986F2039N5200d7415o6518K9648B8930J11723F7572
19056A85151f5133p0625A74809j6748p6123K2632a24755A29478M22a66556a8335
19044b05274B14485n0463i6414j37932J07279n3721A63119a0873j81950A70723
$$ y = [175270, -118181, 110989, -480613, -153346, -203805, -194941, -12692, -205440, 62831, -9855, 44922, 222833, -278274, -264389, -120565, 121503, 8851, 142657, -201286, 80063, 52464, -60008, 16499, 103809, -190031, -71800, -327894, -125578, -218986, -178258, -35915, 171340, -18399, 201302, 21759, -47952, 60982, 398138, -73648, -97668, -51024, 128134, -216113, -115259, -17185, -108094, -210973, -181899, 229048, -170385, -128312, 254308, 146485, -114091, -52634, -136316, -52003, -330112, 127986, 62039, 117239, -47415, -113933, -84285, 28930, 140653, 67572, 185151, -65133, -135758, 174809, 158061, 81938, 104570, -124755, 129478, 129900, -166556, -18335, -205274, 214485, 164022, -96414, -234346, -127067, -180788, 163119, -10873, -192823, 170723]
19033a73436B41536c28449B3690P6098K666E513f8573q15k53848E710a56517P8168
19021g8349B68616h9061N191M346B07894a41178p1117N1864g0600B0400a38158
19009h3252A94310d843A97026A2703c35127f0912j07804H9757c14015G0935b95577
18997B02243G8463J98225h4335A47109d7788j45469C7575e1026j76087j95968
18987d23081e0200m6582l5550C4315Q7905b09195A26499c0309m6791c7712A32588
18975a35096O6276k47908H2779h7093D742c5151r908B53218C6313d1416A97025
18963d7139B23916b25628F163a76906e9773m7711J2827K4322b8393l4244B01984
18951a89161D8631G986f5094m428k4300j04230h2339I2735a10122A28388a28643
$$ y = [-173436, 241536, -328449, 23690, 99788, 102454, 5513, -68573, -69388, -323236, 5710, -156517, -78349, 268616, -89061, -83870, -79524, 207894, -141178, -212295, -160431, -70600, 20400, -138158, -83252, 194310, -4843, 197026, 12703, -335127, -60912, -168716, 89757, -314015, 70935, -295577, 202243, 78463, 276688, -84335, 147109, -47788, -193257, 37575, -51026, -227113, -423081, -50200, -96782, -132332, 34315, 122220, -209195, 126499, -30309, -77100, -37712, 132588, -135096, -68820, -316728, 82779, -87093, 4742, -35151, -45059, 253218, 36313, -41416, 197025, -47139, 223916, -225628, 6163, -176906, -59773, -107484, -94657, -70335, -28393, -62637, 201984, -189161, 48631, 7986, -65094, -69522, -93822, -198052, -82339, 92735, -110122, 128388, -128643]
18939i4268a4522j78459i191A77672D9357k3684R4647J10777c73668a45581D7531
18927A09490c29994A17517c06959a25652B5178L6219a38564A47777O9621o0645
18917A56753d3845I0312A7104b67060O1303P3026j6473M8842A4303a21616N3937
18906f7679B43462a53361O9509k15433d1433A33320a00651k396b3924j2603l0240
18895f6767k30212D8727M900f9275k07922J15724f7665n7411j5001E4611b46397
18883b0241l9685b8134l01995f3628A4184a03239M8639J4083K076I1637M1020
18872A32657o164d1862a6765k16958R5034B35476A7179b42991J1207C57300b09705
18860b32390Q3843I2491b45133f6909k15727a15716E8511A2795J99446e4029m2235
$$ y = [-94268, -14522, -192981, -9191, 177672, 49357, 25673, 120320, 231097, -373668, -145581, 47531, 109490, -329994, 117517, -306959, -125652, 25178, 61397, -138564, 147777, 217398, 156753, -43845, 90312, 17104, -267060, -205757, -132731, -149204, -100362, 14303, -121616, -67679, 243462, -153361, -83852, -299285, -41433, 133320, -100651, -103047, -23924, -36527, -66767, -296979, 48727, 53627, -69275, -277197, -161473, -67665, -125076, -140077, 54611, -246397, -20241, -59926, -28134, -330129, -63628, 14184, -103239, -54600, -40517, -38441, 91637, 132657, 126493, -41862, -16765, -233723, -138689, 235476, 17179, -242991, -231784, 357300, -209705, -232390, -148547, 92491, -245133, -66909, -282636, -115716, 58511, 12795, 212241, -54029, -96264]
18849i6264A42173c0052E1304d63239J18787F0016g3641k93518E7579R7022e7631
18837A51368L69a28299j8775b9892q6420M2415k47594g8103j2964q6206A62657
18825a41792J1225r0403h579G2387Q9118f761A74266a25570e8706A6452J28579
18814A45031c0913q075C9521M0978h1279j11903i2660b112B7993b48174J04705
18803a43469e9829A40961J07769h0608F7405B9559c6290I9334c0570j37171A32284
18791B78861a5790l21872J62488A13839Q3825a47174O2444B7906f0603k22687
18781b83290A61943l9637k0480b30290A10935j3020a22973d0187m6810A19737
18770i6861A67533F4978h8447r7390I1122J40249a7545A17475a3162C74220i2054
$$ y = [-96264, 142173, -30052, 51304, -463239, -344452, 60016, -73641, -367159, 57579, 154601, -57631, 151368, 151737, -128299, -147074, -29892, -116312, -73897, -321491, -78103, -91067, -177273, 162657, -141792, -130567, -220970, -8579, 72387, 161505, -6761, 174266, -125570, -58706, 16452, 145031, -30913, -38988, 39521, 80499, -81279, -193182, -92660, -2112, 27993, -248174, -143469, -59829, 140961, 248730, -80608, 67405, 29559, -36290, 99334, -30570, -167741, 132284, 278861, -15790, -337662, -175174, 113839, 197664, -147174, -84730, 27906, -60603, -283290, 161943, 122306, 101826, -230290, 110935, 97915, -122973, -40187, -86997, 119737, -96861, 167533, 64978, -88447, -185837, 91122, 231371, -17545, 117475, -13162, 374220, -92054]
18758h4435k8221B45688a56887B06308a06715r1791h9018p1991F3439b27429A16436
18746a72174b1445j66637j88564a03937A8795a68520j0664A83389C6447J32716
18736A69163q0242g4270E9827a28945r7639J10574B56060k4328a02613k0172d2542
18724B72036c14573R3609B79646H384a57832O3963m6405A12757a06796q8130K4852
18713a70074E8286b0664m6700j41786d2189j61339e0231h771G6830B9806L40550
18702C70356j60591P0278a74035D195a36857J5774k78561J76591l32937c6398
18691A38303h6628m9433K5885j21056e6934l6712F1657b61615A30012O9776F2468
18679A97484e2157q9504B553a24867d7422K3016D0110M9894D4937K21957g9673
$$ y = [-84435, -112656, 245688, -156887, 206308, -106715, -198506, -89018, -161009, 63439, -227429, 116436, -172174, -21445, -188082, -376646, -103937, 18795, -168520, -179184, 183389, 36447, 169163, 88921, -74270, 59827, -128945, -226584, -116010, 256060, 231732, -102613, -122785, -42542, 272036, -314573, -220964, 279646, 8384, -157832, -93869, -140274, 112757, -106796, -194926, -170074, 58286, -20664, -67364, -209150, -42189, -203528, -50231, -8771, 76830, 29806, 370356, 209765, 280043, -174035, 4195, -136857, -121083, -399644, -223053, -555990, -36398, 138303, -86628, -136061, -110176, -231232, -56934, -93646, 61657, -261615, 130012, 199788, 62468, 197484, -52157, -141661, 2553, -124867, -47422, -24406, 40110, 90004, 44937, 266894, -79673]
18667B28291a03252j93469L8752D6033J03103a86961C993b14689B07587a28541
18656C7576L80389G3420b2675j58715g7257c4095D30310g171E5744a93266M2259
18645a51007J6157j35277J26418C8729O2632c031j85213Q643m2575a3904E9007
18633I290a2998j99441A94624L4556J3248b48143A06314b42397d044o7979A11406
18621b90493p9164a69178F103Q3674B1673a80335D5853a00575A60706a07247j99902
18610c07149h9263l35303B81685h7732b9536j2811j86549j96622C0767K18694
18600B49461d7084G4539a7468D0285M5202d9038j15372K7288A19929B2753a66569
18588I0421A9618N6175c0709j4208A37633K0908A8308Q5687b85357I2655a0661
$$ y = [228291, -103252, -296721, -257969, 46033, 149136, -186961, 3993, -214689, 207587, -128541, 37576, 417965, 73420, -22675, -181390, -77257, -34095, 430310, -7171, 55744, -193266, -151007, -134850, -270127, -143709, 38729, 101361, -3031, -188244, -179601, -222176, -13904, 59007, 9290, -12998, -212439, 194624, 229180, 242428, -248143, 106314, -242397, -4044, -72023, 111406, -290493, -369657, -169178, 6103, 89777, 21673, -180335, 45853, -100575, 160706, -107247, -307149, -89263, -424566, 281685, -87732, -29536, -42347, -228896, -425518, 30767, 249461, -47084, 74539, -17468, 40285, 85487, -49038, -164410, -137122, 119929, 22753, -166569, 90421, 19618, 75793, -30709, -44917, 137633, 158541, 18308, 103995, -285357, 92655, -10661]
18576h8628F9395b38077o5254K8084J32815f5812C5609a28390K7840B0716J91890
18565B12606B8748a25442j28888B05371c08446J47394B24592b4603F7818M12864
18555D80682b24450O7376n0169d7209p9478B48037l6677c91413a74415C1838J95354
18544B27192k6174C1637b11495H5904O726a54020E6827J51445b23592d0594B36163
18532E363L8644a96167i7113n543L6923A23615b55577l0784h7981j4512I9473
18520b32086B08524n5809l3625n0561B8409R8396a05002o6549j33679c2975k86273
18509c19248A635a5442B29941c4211C1289K6562g9869k78094c4704q8372G2073
18497a52416p1493k321B4047e4923k26262O3956A57835g0102q6975f7147a8859
$$ y = [-88628, 69395, -238077, -303331, -275247, -142432, -65812, 35609, -128390, -100550, 20716, 212606, 28748, -125442, -254330, 205371, -308446, -161052, 224592, -24603, 67818, 480682, -224450, -157074, -207243, -47209, -126687, 248037, 211360, -391413, -174415, 31838, 227192, 201018, 31637, -211495, 85904, 92630, -154020, 56827, 208272, -223592, -40594, 236163, 5363, 44007, -196167, -97113, -102656, -65733, 123615, -255577, -286361, -87981, -102493, 99473, -232086, 208524, 152715, 119090, 68529, 28409, 126805, -105002, -171551, -305230, -32975, -319248, 1635, -15442, 229941, -34211, 31289, 57851, -79869, -357963, -34704, -123076, 72073, -152416, -223909, -226230, 24047, -54923, -281185, -217229, 157835, -70102, -157077, -67147, -18859]
18485b15873K3094j24080i1299j9092D1061r568g0002j47745E9455c65423a25763
18473a40738j3933j66890A1410Q9962e0659j49939g3323A5917P0909d5343k8347
18462g3690c6570A02317o244K2126O8126c26863B69431A04412j3126J83982i9778
18450B2282b71048A2684b26650C9853d5370J2105j18251B94331A46533b8096E3643
18438a01725j4258j617L6533L6467k1189j41923B43959b82386p6275B45286a9926
18426b78284N8770g5350l9412M6514g94k5224j94997C17350g4033o5159r7302
18415b36494E5596c040o7244L0746j5046j37460B40844b84030F0623M2364a968
18403b18874C226J97052o5748M1550C6945f9549A73239J26290a33126E7521J81217
$$ y = [-215873, -192779, -316859, -91299, -110391, 41061, 31493, -70002, -217747, 59455, -365423, -125763, -140738, -154671, -321561, 11410, 101372, -50659, -200598, -73323, 15917, 86826, -45343, -73690, -36570, 102317, 96073, 118199, 186325, -326863, 269431, 104412, 91286, 275268, -99778, 22282, -271048, 12684, -226650, 39853, -45370, -33265, -151516, 294331, 146533, -28096, 53643, -101725, -115983, -117600, -81067, -44600, -65789, -207712, 243959, -282386, -358661, 245286, -19926, -278284, -219514, -75350, -114762, -68248, -794, -26018, -221015, 317350, -74033, -139192, -236494, 55596, -3040, -70284, -39538, -54584, -192044, 240844, -284030, 60623, 102987, -1968, -218874, 3226, 200278, 134530, 176080, 36945, -69549, 173239, 299529, -133126, 57521, 238738]
18392B38738B3946O9850g1665k15824J04244b2315E6110j3888b54721c6859k25969
18381b62828m8628J39792k0846B09302D281a46486e748A5769a50013A78632H5698
18369b03186I9647f1776D76729a1939j35103J9815l37645A2257h8308j3997G525
18357c15295h466k05472k52A84477c20978G9803b38220D5305d5366b1076E5549
18345d10567g9164B3727b57497F3861J28798f5274j42635d1786A83279R0894k5615
18334B48558f4146F2239b968n4544b702A14913e1976k32390J10094P21P6806r6439
18322a93184K6211C16712C1850f8743A65280m0919a86597Q0441J9469E955a52035
18310a00996j83347b4439A67487b91637a32870L8297a4022G413f6675R377m3173
$$ y = [238738, 23946, 93796, -71665, -287489, -183245, -22315, 56110, 42222, -254721, -36859, -262828, -311456, -171664, -192510, 209302, 4281, -146486, -5748, 15769, -150013, 178632, 85698, -203186, 99647, -61776, 476729, -11939, -147042, -127227, -464872, 12257, -88308, -102305, 7525, -315295, -8466, -213938, -214190, 184477, -320978, 79803, -238220, 45305, -45366, -21076, 55549, -410567, -79164, 23727, -257497, 63861, 192659, -65274, -207909, -41786, 183279, 274173, 248558, -64146, 62239, -2968, -57512, -2702, 114913, -51976, -284366, -174272, -173551, -96745, -193184, -166973, 316712, 31850, -68743, 165280, 124361, -186597, -106156, -86687, 5955, -152035, -100996, -284343, -24439, 167487, -291637, -132870, -94573, -14022, 7413, -66675, -57298, -100471]
18299a00471I033L97873I2894b6458j58052G5502b2033n9541G0625b4848F6017
18287c40916A01090d4353H9791J23847b2081A0979i2030C9142P2072b29581A7754
18275a26295C4816a50764O7693K8308D5426a57713A76104b14318h3264n6186B39779
18263b85598A11063a81712o760D5133c6789I8706i4433r0491N3448j99256D1171
18251a29381B4364a57223k2237I2040c20296A3083K49138A840J58628g7086A0797
18239a88320e7570B5477M42398B08420a67159A5963J68417J25618j18816a49506
18228b64260A36462A9998O895h5489B14188a87662A40636C2827d8432A36874a07150
18216a05939A32249m5641g759B55746g6998B5521i2600o2967G5542b29055A2437
$$ y = [-100471, 9033, 406906, 92894, -26458, -184510, 75502, -22033, -81574, 70625, -24848, 66017, -340916, 101090, -44353, 89791, 213638, -22081, 10979, -92030, 39142, 111214, -229581, 17754, -126295, 34816, -150764, -83071, -54763, 45426, -157713, 176104, -214318, -83264, -139450, 239779, -285598, 111063, -181712, -188472, 45133, -36789, 98706, -94433, -184924, -131476, -330732, 41171, -129381, 24364, -157223, -179460, 92040, -320296, 13083, 262221, 1840, 160468, -77086, 10797, -188320, -57570, 25477, 467875, 208420, -167159, 15963, 184380, 309998, 191182, -149506, -264260, 136462, 19998, 26893, -85489, 214188, -187662, 140636, 32827, -48432, 136874, -107150, -105939, 132249, 86608, -7759, 255746, -76998, 25521, -92600, -155567, 75542, -229055, 12437]
18204F4096k2786a23148A79364b66862B67124h4411j6857j56188i381j65171A24671
18192G9993O1860E4882a47856A38967b55408Q5993j65513J54548k2579D29638
18181C0059d98090a53422I125a00269B8846d4927o2836A97695a62702m552A4491
18169I0690K1427c9364h761r2829J9404B91176A13671b63728h8951p4828d0718
18157I5912g6659j56951A88017A8681f7470j08713f8951b9896n8900j40770F5079
18145a50605q268c9352j84658P6872M8054k4533A28588c8980A36800o0813b25804
18133b20357J06473A7511h056k31246K0753k3745e4032F0582J27749a48810a6719
18121a19742N4092D32258f9933b6879j90823j71201a9249A35277a93813d4378
$$ y = [64096, 41310, -123148, 179364, -266862, 267124, -84411, -101268, -257456, -9381, -174552, 124671, 79993, 141853, 54882, -147856, 138967, -255408, -169415, -334928, -180380, -202959, 429638, 30059, -498090, -153422, 9125, -100269, 28846, -44927, -107763, 197695, -162702, -167254, 14491, 90690, 112117, -39364, -8761, -101590, -82186, 291176, 113671, -263728, -88951, -163779, -40718, 95912, -76659, -233610, 188017, 18681, -67470, -176183, -68951, -29896, -88796, -229566, 65079, -150605, -158873, -39352, -224010, -147138, -99084, -123617, 128588, -38980, 136800, 75987, -225804, -220357, -113884, 17511, -8056, -239302, -218549, -242294, -54032, 60582, 188331, -148810, -16719, -119742, -65650, 432258, -69933, -26879, -217702, -388903, -19249, 135277, -193813, -44378]
18110a66239a389k19794j812l08480A4463e9927j43036d1940m905A2575J38890
18099A51465J7025b3519j67593C17250A18545a19685N5868b1786D7002J20655
18089A67657j6774J56653d1389A099M5030c0498j55501q2182R3035A18160d4894
18077F0349K57575b0181j23025A37337h3464E6591e9629A558d8886A75779a25425
18065G2100M7171E1188j4936P729b60966K8488A0186R2591a47304A06735J37360
18054B44095a83123q3262B54034j08445b95087d627o8149L4362q8926J4657J0966
18043a01717J0634D4654b9481A64986n7969M7295c015C6120b17470P5087B13489
18031d8236C03375B4008O0783c96013C37875G3480A6282a96148b8998k5035j81288
$$ y = [-166239, -1389, -221183, -222995, -531475, 14463, -59927, -202963, -41940, -46845, 12575, 151465, 168490, -23519, -191112, 317250, 118545, -119685, -63817, -21786, 47002, 167657, 150883, 307536, -41389, 1099, 46129, -30498, -185999, -268181, -175146, 118160, -44894, 60349, 317924, -20181, -143206, 137337, -83464, 56591, -59629, 1558, -48886, 175779, -125425, 72100, 119271, 51188, 36252, 43981, -260966, -232478, 10186, 102777, -147304, 106735, 244095, -183123, -266385, 254034, 145589, -295087, -4627, -72776, -38414, -127340, -112683, -101717, -91083, 44654, -29481, 164986, 107017, 154312, -3015, 36120, -217470, -142383, 213489, -48236, 303375, 24008, 84791, -396013, 337875, 73480, 16282, -196148, -28998, -54033, -235321]
18020b35321D9922J17331d3789j590j56030B54427j09399a1864j64105j62302
18010c38271C80093a8856m5812l9571K3881a177H3470A8301b52772i5197n4259
17999a49456F9783Q8596e8330J8871j77010J5978B10394j00732K358c72253J16796
17988b55457l213d9370H2413K49870E8126j5253b0468j47608A78207C4523a0164
17976g9299A96658l2067j5830Q2660a68218D7902h816k90292i7708B70554n2728
17965B17826p2658m5136e8908j52252A26294d0818B9118b73443R6001P398J1069
17954a58975M0147m7713d1843A39378d0653m0665A3708O2155J06355J5118a51961
17942b56440A133K6888d3071r0113b0081m2915C06046j01470p6150L2839D8498
$$ y = [-235321, 49922, 167253, -43789, -45379, -201409, 254427, 145028, -11864, -175969, -338271, 380093, -18856, -64668, -104239, -80358, -1177, 83470, 18301, -252772, -95197, -149456, 69783, 158379, -58330, -39459, -216469, -200491, 210394, 109662, 112020, -372253, -255457, -258670, -49370, 82413, 332283, 58126, 42873, -20468, -168076, 178207, 34523, -10164, -79299, 196658, 164591, 148761, 231421, -168218, 47902, -8816, -299108, -97708, 270554, 217826, 145168, 100032, -58908, -211160, 126294, -40818, 29118, -273443, -177442, -170044, -158975, -118828, -166541, -41843, 139378, -40653, -81318, 13708, 75863, 182218, 197336, -151961, -256440, 1133, 28021, -43071, -133184, -20081, -62996, 306046, 204576, 128426, 161265, 48498]
17930f5362J1276G7263a60168B3380K7114f450J71j94428k2051Q7396F4461a14992
17917a96689r7963a28931k87278A73143a02413D2644a0891j30221k1199A17214
17906a07368e0155A44648m2490h6953l17757J95291E3212b1194H7401i3874r8914
17895a92788G2154Q9695d46585B86368F6360a18932d8281B80550a61886b6788
17884a2603A98183a04895k05308a18120d0732a012G8485A9595b07929A36435A0848
17872B85751d2968A70874c7964r876j18629j2964K8205B10856L6405a17169b3909
17860A35415a54836j74230F2064J18816a8611j45860A106c17869O1301B3658a76001
17848A16381e6346b1853k16364l9302J13278B9682K69991a21668E1906i4772j1977
$$ y = [-65362, -54086, 77263, -160168, 23380, 50494, -6450, -6279, -200707, -222758, -135362, 64461, -114992, -196689, -294652, -128931, -416209, 173143, -102413, 42644, -10891, -141112, -162311, 117214, -107368, -50155, 144648, 102158, -86953, -404710, -209419, 53212, -21194, 87401, -93874, -192788, 72154, 161849, -446585, 286368, 66360, -118932, -48281, 280550, -161886, -26788, -12603, 198183, -104895, -310203, -118120, -40732, -1012, 78485, 19595, -207929, 136435, 10848, 285751, -42968, 170874, -37964, -47840, -166469, -179433, -151228, 210856, 247261, -117169, -23909, 135415, -154836, -329066, 62064, 180880, -18611, -164471, 1106, -317869, -256568, 23658, -176001, 116381, -56346, -21853, -238217, -277519, -164241, 29682, 299673, -121668, 51906, -94772, -106749]
17837a06749L9827C15516C7461j3057P9689i590C02320b21267D5750D737b42448
17825a10217B7740c2790C2673d8993k4841b2483A29023b31401B3127J26639G3114
17813a85846F2531J49410h9395J6018B21704r0245K59505I0160a46378C00173
17802a2060p0257C281b836k28681B64865I0285b03542E9003a08832m2567K4456
17791a26943N4923b4247A06429b42192A4219O9076c21697E9335B7038J09874B2973
17779B59715I5245b4592p1940m1110A05558a50463F0825b52663B83003a13515
17768I7104Q4115J08704b6467j05316f1647j1460I6210D2336g7666A11261J05666
17757B16927b96047a4860j61043B83476E3352H583a37935r5790N8938B55128a47174
$$ y = [-106749, -66922, 315516, 37461, 24404, 104093, -9590, 302320, -221267, 45750, 4737, -242448, -110217, 27740, -32790, 32673, -48993, -73834, -22483, 129023, -231401, 23127, 149766, 73114, -185846, 62531, 211941, -89395, -73377, 221704, 131459, 390964, 90160, -146378, 300173, -12060, -82317, 3281, -2836, -231517, 264865, 90285, -203542, 59003, -108832, -151399, -126943, -72020, -24247, 106429, -242192, 14219, 83295, -321697, 59335, 27038, 136912, 22973, 259715, 95245, -24592, -96532, -137642, 105558, -150463, 60825, -252663, 283003, -113515, 97104, 181219, 289923, -26467, -131783, -61647, -73107, 96210, 42336, -77666, 111261, 216927, -296047, -14860, -175903, 283476, 53352, 8583, -137935, -233725, -174787, 255128, -147174]
17745e7896I3424m4047A6180J90644c8988k443A46927a18847A13206n665b56165
17733C41320a17298c6755j03212l1205G6300L1225J85924a0761A93911g4122A38651
17721A78512i3234j514m6311I3314a20783j11203D6166f8464k61746A55831l3394
17710A22437C4073f0597B53487i8297B35519c7578j3188A59921B963K03218g5348
17698B0498b02968A20211r722k3216J03942d0644J2635n2981j48259B48026k4336
17687B23690E0366r910c9920k58599j50839I1867D5857K58144d00317J76217B58207
17675A34206a59200A55578l1794c0339B6183g2976a2203C51490j62294d9150A72834
17663D9409J28277a5035l5203p1458C1451J68447B9467c73806h9397A51928c48326
$$ y = [-57896, 93424, 49377, 16180, 206824, -38988, -41431, 146927, -118847, 113206, 107541, -256165, 341320, -117298, -36755, -139967, -171172, 76300, 107525, 293449, -10761, 193911, -74122, 138651, 178512, -93234, -94748, -141059, 93314, -120783, -231986, 46166, -68464, -330210, 155831, 122437, 34073, -60597, 253487, -98297, 235519, -37578, -50766, 159921, 2963, 206181, -75348, 20498, -202968, 120211, 110489, 87273, 191215, -40644, -28009, -80990, -229249, 248026, 223690, 50366, 40456, -39920, -298519, -449358, 91867, 45857, 304001, -400317, -224100, 258207, 134206, -159200, 155578, 123784, -30339, 26183, -72976, -12203, 351490, 189196, -49150, 172834, 49409, 177686, -15035, -50238, -121696, 31451, 199898, 29467, -373806, -89397, 151928, -348326]
17651C21564a31498C06974a45517I4840L5352j7854a34887o4956a4159A05681
17640b09944A82593H0358J66122n9242e1330E8759j1795K5036e8001D04642A01837
17628B00074J52662a55400A62615A7060b45080J04099F2384a04603C67219e3209
17617a27672j653n6160d1693m0169k1789k1040K3851A19806D2978J93578O7630
17606C04186C3593a69381B8450J26634H175a03651A47305D1172L61173j38680
17596B63665c05233A0765D75c0280o3191q8346D2285L2281C5806a3970r7809J7163
17584i4616L7915B48154D3926L44072F6377A6416J46962a15009e740B14230e6338
17572b66574e8642A52627A5971b70398E2418h6688C4299J75432K7506L5521r8728
$$ y = [321564, -131498, 306974, -145517, 94840, 130192, 112338, -134887, -199843, -14159, 105681, -209944, 182593, 80358, 246480, 187238, -51330, 58759, 46964, 72000, -58001, 404642, 101837, 200074, 352736, -155400, 162615, 17060, -245080, -140981, 62384, -104603, 367219, -53209, -127672, -129325, -185485, -41693, -81862, -103651, -124691, -100840, 119806, 42978, 236556, 304186, 33593, -169381, 28450, 155084, 8175, -103651, 147305, 41172, 402345, 263665, -305233, 10765, 475, -30280, -93471, -181817, 42285, 74566, 35806, -13970, -111779, -94616, -56701, 248154, 43926, 387998, 66377, 16416, 163378, -115009, -5740, 214230, -56338, -266574, -58642, 152627, 15971, -270398, 52418, -86688, 34299, 209731, 237237, 272758, 174030]
17561A74030H0915e6881n0060E27328E7156K60002i4065K8946A10875J02436g4579
17549A41911J09703g6337D0847a40152A86502a70715A66704f2978A61493c39155
17538a57527D4639a22529B59114e815j27815A72045a30515A79558b01663B38242
17527a19539B41584j4387a85480n8773a00977k6233E1136a63887k13424D52799
17516b52286d0391J7692l4270B48567g1037B47884e6725I4865h9318A02265h8377
17504a75279l30116J47406B33872e7011A72879g1267A98364r1179J7106i6402
17493d7774A47532a310D1601L83988A18827J37004j10714N979N736A5244L05332
17482C20576a18196h267B0064a7058E1319K13026b07423C19345A44569a23232
$$ y = [174030, 80915, -56881, -106941, 527328, 57156, 317158, -94065, -65119, 110875, 213311, -74579, 141911, 251614, -76337, 40847, -140152, 186502, -170715, 166704, -62978, 161493, -339155, -157527, 44639, -122529, 259114, -5815, -133630, 172045, -130515, 179558, -201663, 238242, -119539, 241584, 227197, -185480, -244253, -100977, -127210, 51136, -163887, -377311, 452799, -252286, -40391, -22699, -56969, 248567, -71037, 247884, -56725, 94865, -89318, 102265, -88377, -175279, -505395, -357989, 233872, -57011, 172879, -71267, 198364, 107185, 124291, -96402, -47774, 147532, -1310, 41601, 425589, 118827, 255831, 145117, 151096, 156832, 15244, 320576, -118196, -8267, 20064, -17058, 51319, 264345, -207423, 319345, 144569, -123232]
17471A37636g4491j5082A50287P5078n6237a53006C44868q1499r9064l1100h1522
17459a27819B04068E0314a29195b9876A35529o6973K09698d0790D23539A77681
17448B27224N99784l43453A84318p9982M27926K98518B32316J22859p7716f0358
17437A94905B8875i526B78332b47822E05649p8245A64752k089p8544l9772e4056
17425B40674R8434p6475O4796A2018a26785C90500J08571K9733A94566K54573
17415D49139A81285H625b2624A42071J94789c8370B41390b271A80176O3404J51243
17404C94823o1415G953J26352L4542L2255e4929f516C33502E9512j6496J76678
17393B19694K789L3299j3359E9118L677P575K11916j28401c5834B18857p5143
$$ y = [137636, -74491, -89573, 150287, 225365, 169128, -153006, 344868, 263369, 164305, 133205, -81522, -127819, 204068, 50314, -129195, -29876, 135529, 68556, 278254, -40790, 423539, 177681, 227224, 827008, 483555, 184318, 104336, 532262, 830780, 232316, 355175, 277459, -60358, 194905, 28875, -9526, 278332, -247822, 505649, 427404, 164752, 162663, 84119, 44347, -54056, 240674, 339108, 262633, 327429, 12018, -126785, 390500, 499071, 528804, 194566, 449139, 181285, 8625, -22624, 142071, 336860, -38370, 241390, -2271, 180176, 243580, 394823, 333408, 7953, 134305, 168847, 201102, -54929, -6516, 333502, 59512, 43016, 219694, 222483, 255782, 242423, 59118, 62795, 70370, 282286, 153885, -35834, 218857, 143714]
17382A43714J91432j12226I7121M7502i3886J0857E0206i9302D912J57971J21180
17371B84063A1155R9813M04814a72492A01925J63463m4170J83619O1525g1580
17360B16433M2040k9578E9356K87922A41475J42454A1832a8016D4069J39894H669
17348A99185L908E0928L32654A51126B7154A3088K39367q9255J9071C9404K79346
17337C18750d6944F2768B3315j184J51708n6447J79162g0301D85742k29209J25495
17326C82028A18915J22175f4622n1398C27961j15984j04888a95862A99837m7565
17316A52272l1254m0960a46720C54567G8089L7425c52561a5192E06442A25171
17305B9528d71010A87448O8074f9025C00948b0943f760A9113O3735N1134q641
$$ y = [143714, 335146, 222920, 97121, 144623, -93886, -83029, 50206, -99302, 4912, 162883, 284063, 11155, 110968, 515782, -172492, 101925, 265388, 221218, 404837, 466362, -71580, 216433, 258473, 228895, 59356, 347278, 141475, 283929, 11832, -18016, 44069, 183963, 8669, 199185, 203093, 50928, 383582, 151126, 27154, 13088, 252455, 163200, 182271, 39404, 318750, -46944, 62768, 23315, 22131, 173839, 117392, 296554, -70301, 485742, 256533, 382028, 118915, 241090, -64622, -116020, 327961, 211977, 107089, -195862, 199837, 152272, 121018, 80058, -146720, 354567, 78089, 115514, -352561, -15192, 506442, 125171, 29528, -471010, 187448, 255522, -69025, 300948, -20943, -6760, 19113, 82848, 133982, 125341]
17294A25341J4780L5883p866e9567q3296A61551a02229a1064o660B88104H2738
17282c59845a10055A63026J38390A39708J2384c0652A12737M7682K63747C4783
17271B03567C49e7729C74603l8814A06085b2515A50863O890g775C95641A55169
17259F1443j2601L16270F3334J27823b30642B05568o2729m014M8891J02486K03009
17248D93211k28493J12121I1395J85405j05490J57059l4859j2110K3160J8754
17238C23314j14673j03147K20688A18230K73730b04273I6905j5401K9204h1138
17227B58713A15577N9467O4660j16360J4045J09627A17971K07016k2909j12910
17217A89168J09328o1744J89332j38349R4530j85955b74197B50731b87162C489
$$ y = [125341, 140121, 176004, 168138, -59567, -142863, 161551, -102229, -11064, -17724, 288104, 82738, -359845, -110055, 163026, 301416, 139708, 152092, -30652, 112737, 160419, 424166, 34783, 203567, 349, -57729, 374603, 335789, 106085, -22515, 150863, 157753, -7775, 395641, 155169, 61443, 48842, 365112, 63334, 191157, -230642, 205568, 142839, 138825, 187716, 290202, 493211, 264718, 376839, 91395, 276800, 171310, 328369, 293510, 281400, 304560, 323314, 208641, 105494, 326182, 118230, 391960, -204273, 96905, 81504, 110708, -81138, 258713, 115577, 175044, 239704, 123344, 137389, 247016, 117971, 324987, 302078, 189168, 298496, 236752, 426084, 287735, 382265, 196310, -274197, 250731, -287162, 3489]
17206C60095p3128a03515E83215B72726r7474D1725K69925F7233L34673j27915
17196B73991J35401A72089c2439B02268j3596O3345k259L8019P067E2659c08267
17184B28210J58483J3987P624A18014J06541B660a71819D35948j79987P2832I9785
17172C63361j27634J0772j04377O0063P5852k8621G6503K51673K6317r6174O6770
17161C25089E2816N5825Q9086L15583A41281J11515J36064q1517L2136j33129
17151B06350R010A06926Q2654j6062K0574O2236m8161J96360j55724F950K35077
17140B42027P8611r819J75490j55477J13196A44096J35426H2090M06150k04836
17130B83404a20126B09380Q2698K28802B20683J94222m7660m7536j17970M6767
$$ y = [360095, 286967, -103515, 583215, 272726, 175252, 41725, 311650, 67233, 401906, 273991, 409392, 172089, -32439, 202268, 188672, 252017, 249758, 287777, 294844, 52659, -308267, 228210, 386693, 400680, 408304, 118014, 224555, 2660, -171819, 435948, 255961, 328793, 99785, 363361, 235727, 246499, 142122, 202185, 278037, 249416, 76503, 328176, 354493, 258319, 325089, 52816, 108641, 197727, 513310, 141281, 252796, 388860, 307343, 339479, 206350, 215360, 106926, 189580, 173518, 194092, 256328, 208167, 404527, 248803, 6950, 242027, 320638, 310819, 486309, 330832, 444028, 144096, 279522, 82090, 488240, 283404, -120126, 209380, 292078, 520880, 220683, 414905, 367245, 319709, 201739, 248506]
17120B48506j03399J16934G9555K83644J7363A29822J17568J53643A54622J01280
17110B55902J89602m5285A39105M40877p9876k23713m4688J59217J09866j11585
17100C89203C2487L13244n034l8836K35653A96550J59057L28778B70331K7356
17090B97687k5130L45993A54613Q9919K84923j59583j0028Q3397A88151j7563
17080A70588K91245O5435B08299d9824C95664p3287K35287j40183q5922L5790
17070C67349p602P37P4059J27699O115M5456J88863l00362j58165P1663j6650
17059C99162m0735m5784k9748K19719m8150Q2093B55433q3703J40228L72848B22753
17047C16126J13336j76846Q6544J88193k21985Q3116J90300B76801j03499L89149
$$ y = [248506, 145107, 262041, 79555, 363199, 380562, 129822, 247390, 401033, 154622, 255902, 445504, 400219, 139105, 579982, 500106, 276393, 231705, 390922, 500788, 389203, 32487, 345731, 340697, 301861, 537514, 196550, 355607, 684385, 270331, 297687, 272557, 618550, 154613, 244532, 529455, 369872, 359844, 443241, 188151, 170588, 461833, 527268, 208299, -49824, 395664, 322377, 557664, 417481, 331559, 367349, 359747, 360484, 434543, 562242, 568357, 613813, 802676, 502314, 344149, 415812, 399162, 358427, 312643, 282895, 502614, 454464, 536557, 255433, 171730, 311958, 684806, 222753, 316126, 429462, 252616, 339160, 527353, 305368, 388484, 578784, 276801, 173302, 562451]
17037E62451j92491J8867K48645B75509o9147M67190J1397B20496o8294M73649
17027F25851k37843L26411j60870N7365j65660J22768k8338j28407L42686j02194
17017F51769J25750k02304l9710O6650r0603k35238K24916L07035k59300J25105
17007F74070B01917O89814D29571K63368q1602k36754O4281K54192j7814j0572
16997F64670k25461J5572L80878J3700C86311J2897J91760k82833M07562J10045
16987H25742k27270J05416j27381O7976N2321J67937j87215q9751j27033K42383
16977G03125P3169C42053K00487K08811N6683j57281J12636j47020L44736j95114
16967G65991k8063J48763k20132K86852k58637N8998n2032k53073K18160J77927
$$ y = [562451, 369960, 388827, 637472, 275509, 206362, 673552, 684949, 220496, 152202, 625851, 388008, 714419, 553549, 610914, 445254, 568022, 539684, 411277, 753963, 651769, 777519, 575215, 535505, 602155, 511552, 276314, 501230, 808265, 548965, 674070, 201917, 891731, 429571, 692939, 611337, 374583, 438864, 693056, 675242, 664670, 439209, 454781, 835659, 849359, 386311, 399208, 590968, 308135, 715697, 825742, 598472, 703888, 576507, 644483, 696804, 864741, 677526, 587775, 460742, 703125, 776294, 342053, 542540, 751351, 808034, 650753, 763389, 616369, 961105, 765991, 737928, 886691, 666559, 953411, 694774, 753772, 701740, 448667, 666827, 844754]
16957H44754m14770N15245m11781O9861L23765q7197J92324j32643j11924n3529
16947G34105j36690K92852K12758k44811J31829l8392J11683q8483N9768j86578
16937H48041j22977J13544Q3407k1157O5811K82441j12325l3457j62894r3183
16927H47251K63206J90821l03304K68289j3035M4922k06104j09148K56503M4158
16917A283559k14563L11967K5803j76227R5728j55805L21321k1836o12515L44249
16907A201681N5547m2199K47457L2630j54592j01185m5596N172M15156j67964
16897A446107K26606j58242k87750L25975j49302R9895R1144j43073J61656j66443
16887A446573P4769J31202J45561k99030o3589N06333n32060L88232J80234k52159
$$ y = [844754, 429984, 945229, 533448, 603309, 927074, 839877, 1032201, 899558, 787634, 734105, 597415, 890267, 1103025, 858214, 990043, 951651, 1063334, 974851, 1034619, 848041, 725064, 838608, 922015, 900858, 966669, 1249110, 1136785, 1103328, 940434, 847251, 1110457, 1301278, 997974, 1266263, 1253228, 1298150, 1092046, 982898, 1239401, 1283559, 1068996, 1380963, 1406766, 1230539, 1326267, 1170462, 1491783, 1469947, 857432, 1201681, 1257228, 1215029, 1462486, 1495116, 1340524, 1239339, 1193743, 1198915, 1614071, 1446107, 1672713, 1514471, 1226721, 1552696, 1403394, 1503289, 1594433, 1451360, 1613016, 1446573, 1521342, 1652544, 1798105, 1499075, 1435486, 1941819, 1409759, 1797991, 1978225, 1726066]
16877A726066p1267N44452k75773J94977j04761l66966L93992j64088J60264J19003
16867B155899J49684k68037N7247j3981K839J0225M75721o03698K08071N37040
16857B711010m33622K87958K22405m49669K43334J80127j97782K47537j30249
16848B681049j18680j9389n1990N77293l48282Q2097L7144L4203J94234j53706
16838B913973J00972L19939Q7065j32225j71118Q3630N80040l79387O7768K39649
16828C710306J27738J1601O9328K94696j80003k32670L21672Q3306L37325l50401
16818D192898L17197l5111L1316L53968J17804l0246l0325J75153O7050J56716
16808E316420j0990L31747K9192N6148j8005M69103q1620L7061K30116J09088
$$ y = [1726066, 1654799, 2199251, 1923478, 2118455, 2013694, 1646728, 2040720, 1876632, 2036896, 2155899, 2305583, 2037546, 2094793, 2080812, 2083651, 2093876, 2569597, 1965899, 2173970, 2711010, 2277388, 2565346, 2787751, 2338082, 2581416, 2761543, 2563761, 2811298, 2681049, 2562369, 2542980, 2490990, 3068283, 2720001, 2802098, 2839242, 2873445, 3067679, 2913973, 3014945, 3334884, 3421949, 3289724, 3118606, 3202236, 3782276, 3402889, 3470657, 3710306, 3838044, 3849645, 3918973, 4213669, 4033666, 3800996, 4122668, 4205974, 4543299, 4192898, 4510095, 4474984, 4506300, 4860268, 4978072, 4947826, 4917501, 5092654, 5159704, 5316420, 5305430, 5637177, 5666369, 5722517, 5704512, 6173615, 6091995, 6129056, 6359172, 6468260]
16798F468260O8177O1310M06451k9615L93637J32095L43794O7614L19677p7115
16788H154285L18151N57670r1363N03502P4287K04408L50609j09463R15169j12834
16778A0764421M46725N59821J09212M85134O56398J96282J76552O75548L87390
16769A4457483M72626M27378O25282O20122O38162Q00077J004976N14782R97052
16760B0557940L68142J017845J009922Q31132J323540J009176J151705J153642
16752B8423044J608310J326038J508326J546842J772567K232313K214360K186535
16744D2818335K320880K601100K514888L619365K827433L732777L638004M386692
16736F8459474M523960M939857N298112N589363O145690O747805P061961P022866
$$ y = [6468260, 6536437, 6597747, 7004198, 6974583, 7368220, 7500315, 7844109, 7911723, 8231400, 8154285, 8472436, 9030106, 8938743, 9442245, 9516532, 9720940, 10071549, 9962086, 10877255, 10764421, 11211146, 11770967, 11880179, 12365313, 13021711, 13217993, 13394545, 14070093, 14457483, 14930109, 15357487, 15982769, 16602891, 17241053, 18041130, 19046106, 19560888, 20557940, 20926082, 21943927, 22953849, 23784981, 25108521, 26117697, 27269402, 28423044, 30031354, 31357392, 32865718, 34412560, 36185127, 38417440, 40631800, 42818335, 45139215, 47740315, 50255203, 53874568, 56702001, 60434778, 64072782, 68459474, 72983434, 77923291, 83221403, 88810766, 94956456, 101704261, 108766222, 115789088]
16728A15789088Q261163P752608Q315293Q383726Q276531Q101862P766832O672380
16720A79319483N832420M821199L443279J536761j62958j214450l332041m911303
16712A85332390n494733p282238p337328q507030q530390q280455q584779q368952
16704A22946485p875049p987103o848709o744211o284476n413400n775407m871677
16696G1146453m308197m365218l865740l619494l087965l120684l228567k395852
16688D3154736k148393k308922k071977k185703j628204j598846j538195j700710
16680B7973786j255866j243115j422051q89983r50631q26075j147969q66583j113707
16671A8257806m16198r30538l09382r63439l93122n01227p05863m02287o26155
$$ y = [115789088, 124050251, 131802859, 140118152, 148501878, 156778409, 164880271, 172647103, 179319483, 185151903, 189973102, 193416381, 194953142, 194790184, 193575734, 190243693, 185332390, 179837657, 172555419, 165218091, 156711061, 148180671, 139900216, 131315437, 122946485, 115071436, 107084333, 100235624, 93491413, 87206937, 81793537, 76018130, 71146453, 66838256, 62473038, 58607298, 54987804, 51899839, 48779155, 45550588, 43154736, 41006343, 38697421, 36625444, 34439741, 32811537, 31212691, 29674496, 27973786, 26717920, 25474805, 24052754, 23162771, 22212140, 21386065, 20238096, 19371513, 18257806, 17841608, 16911070, 16601688, 15638249, 15245127, 14743900, 14038037, 13635750, 13009595]
16662A3009595m41191l62119n56629j69150m44352n95843l0334p38478N8389m90459
16652I239429J16773o36595j4825n70615j26740l26439k14986l24358N8397j47479
16642G052562m86340M16866r83001N91655m96389m90624J80718l66816J21650
16633E540281l46389J74182k22691k67362k9501J2138l19499k27803K92440j37169
16623D468627o5892k80629j30410J46473j22629j56871P4522l72434J62758j37363
16613C586152m32939J28087m9807j3886k75433K40050k53813j50732j56893j1291
16603B609495L33016m02996M60544l23963M3950n46478L59338J44893j52605k44737
16593B280457j6062l4696K6664k26066K50046m44148K05947R1747K1595k72369
$$ y = [13009595, 12568404, 12206285, 11649656, 11480506, 11036154, 10440311, 10409977, 9671499, 9729888, 9239429, 9356202, 8719607, 8704782, 8134167, 8007427, 7680988, 7466002, 7141644, 7200041, 7052562, 6566222, 6983088, 6000087, 6591742, 6095353, 5604729, 5785447, 5418631, 5540281, 5193892, 5368074, 5145383, 4878021, 4848520, 4860658, 4541159, 4313356, 4605796, 4468627, 4402735, 4122106, 3991696, 4138169, 4015540, 3858669, 3933191, 3560757, 3723515, 3586152, 3153213, 3281300, 3231493, 3217607, 2942174, 3182224, 2928411, 2777679, 2620786, 2609495, 2942511, 2539515, 3000059, 2676096, 2720046, 2173568, 2532906, 2677799, 2525194, 2280457, 2264395, 2229699, 2256363, 2030297, 2280343, 1836195, 2042142, 2133889, 2155484, 1883115]
16583A883115O5239Q9186p0995J04245k74398r9837K14250K4076k86920L36831
16573A984792q4158l4855k28143J68648k29266K1941Q944m20297Q7498Q3481L62466
16562A721051l06812M5073J38187j14666k90055l10759K34389J75497j40451k14754
16552I36700L39805o9235Q047P2452j29773k50051O0266K38121q2324P421k24687
16541I06742K68696Q1274j75611m7760J15333j78954p0740k54827j9127K14859
16531H39885J59472j33362L72820k68610p1222l05315J17036J72941l18657K72855
16521H37843J4596L18721m77335N4918j0326m5323P2775O7727j9877l61295L61682
16510H14106K138J31176k86881Q7867j76599J12443j4963C33389K02745J56915
$$ y = [1883115, 1948354, 2037540, 1966545, 2070790, 1796392, 1696555, 1910805, 1934881, 1647961, 1984792, 1900634, 1865779, 1637636, 1806284, 1577018, 1598959, 1607903, 1187606, 1275104, 1358585, 1721051, 1414239, 1459312, 1597499, 1482833, 1192778, 882019, 1116408, 1291905, 1151454, 936700, 1276505, 1207270, 1215317, 1287769, 1157996, 907945, 968211, 1206332, 1124008, 1131429, 906742, 1175438, 1256712, 1081101, 1033341, 1148674, 969720, 898980, 644153, 625026, 839885, 999357, 865995, 1238815, 970205, 898983, 593668, 710704, 883645, 564988, 837843, 852439, 1171160, 693825, 748743, 738417, 693094, 765869, 833596, 813719, 452424, 814106, 816244, 947420, 660539, 748406, 571807, 684250, 669287, 333389, 536134, 693049]
16500F93049k96753J83835k3012J24494J2274M8038J3309k94534J00189k02712
16490C58177L55949k0760C39794j05729N16554p9242O6479B54984P891M09440
16480F72315j11812j06296j52851O3279m7811J01522K97160j10246B11721M10090
16470F21811m2852j49233j10611K40812J561j79060j13493K69062Q5162M6261
16460F69420k1904G9340J18600K77784r4211P9517A88327J66501M42651k63814
16450E33665K42287C07605j15855K22306I4135Q0309K26058j91989L12297k45372
16440B75438J33666l7319j18229N8105L60065G3134J02029P7349K32589A64866
16429D21243D6877K25463L48487o8166k44323b7600B57219J10911A40250K32554
$$ y = [693049, 396296, 580131, 557119, 681613, 693887, 741925, 755234, 460700, 560889, 358177, 714126, 693366, 339794, 234065, 750619, 671377, 737856, 254984, 262875, 672315, 560503, 454207, 301356, 364635, 316824, 418346, 715506, 605260, 211721, 621811, 578959, 429726, 319115, 559927, 561488, 382428, 268935, 537997, 623159, 669420, 647516, 79340, 197940, 475724, 381513, 461030, 188327, 354828, 797479, 533665, 775952, 307605, 191750, 414056, 94135, 174444, 400502, 208513, 520810, 275438, 409104, 371785, 253556, 311661, 671726, 73134, 175163, 252512, 485101, 164866, 421243, 46877, 272340, 620827, 552661, 308338, -27600, 257219, 368130, 140250, 372804]
16419C72804l3689K65819k99500M52628A79915A661J85536J88806O4981j1248
16409D29736j18679c1169A20878J066K15126A32514m4719L87858A00437c3070
16398B59933K06370f8338A63422M73272B12741F5694E797J23826J18920Q9803
16388C38346d28j22228A82252D9850L5475h4030j675F7804K65137G6919q001A140
16375a61082E3268K51333F2320J9280J72602K1871a6064A04011L33358I6580k1445
16364G5135A3265M53711I4803J28757a0836A57287P9986m8279J13945E0404K6165
16353G6569J52097O1609j38062K40174A47830M0706b6705G4479K8969J558K48226
16342C53232d6984o2705A52194K87547d4369D63203a71758A20124K04185j51932
$$ y = [372804, 339115, 604934, 305434, 758062, 179915, 1661, 187197, 376003, 440984, 429736, 311057, -31169, 120878, 121944, 337070, 132514, 87795, 475653, 100437, -33070, 259933, 466303, -68338, 163422, 636694, 212741, 65694, 5797, 129623, 248543, 338346, -428, -122656, 182252, 49850, 85325, -84030, -85705, 67804, 332941, 76919, 68918, 1140, -161082, 53268, 304601, 62320, 81600, 254202, 276073, -16064, 104011, 437369, 96580, 75135, 13265, 466976, 94803, 223560, -10836, 157287, 237273, 188994, 302939, 50404, 76569, 228666, 290275, 152213, 392387, 147830, 188536, -26705, 74479, 103448, 105006, 353232, -46984, -109689, 152194, 439741, -44369, 463203, -171758, 120124, 324309, 172377]
16332A72377R3959j4852l5966P7043D6011a42914A13042R9491J09573n798f986
16320A34101A4892N2290N6877h6261A18163P968k1999h2353k487c3698B29602
16308D31854F2839a04628A31746r881O1179k1631D3767J66114J11805a96645e465
16296a79441A82087b80996A93658K76957E9414f9734B45010g5549j01164D9520
16285A15206b2378A25700J7866E6413M49340i0802A78369a3182B11847k0030N718
16274A97535p5885d710A8441b05668D5053a2037C01840J2334c0726A33336M4201
16263A77537j5190a5451l14918c0888k7291A55734c4430j21438B06896l505a9872
16251B21336a47400o1854f4353K3468B51972O6347F2101d1521j14141A7509P3764
$$ y = [172377, 266336, 251484, 215518, 292561, 46011, -142914, 113042, 212533, 322106, 316308, -6986, 134101, 14892, 67182, 124059, -86261, 118163, 126131, 104132, -82353, -84840, -33698, 229602, 431854, 62839, -104628, 131746, 121865, 183044, 161413, 43767, 209881, 321686, -196645, -5465, -179441, 182087, -280996, 193658, 470615, 59414, -69734, 245010, -75549, -176713, 49520, 115206, -22378, 125700, 143566, 56413, 505753, -90802, 178369, -13182, 211847, 191817, 197535, 121650, -4710, 18441, -205668, 45053, -12037, 301840, 314174, -30726, 133336, 177537, 162347, -15451, -330369, -30888, -58179, 155734, -34430, -155868, 206896, 203391, -19872, 221336, -147400, -209254, -64353, -40885, 251972, 318319, 62101, -41521, -155662, 17509, 91273]
16240I1273k4215c19995J24639A6292F71a25184E973c69199H8430a38241C58e8093
16227B31143h5044B84755D5782i6093f710A23231E5443Q4378a44330L0415c45
16215a11762a2993l12366c141k03603P2348e3707K2122D7791d89179d3358l9267
16204h2625j3115d3672j70216M8419A60843b1207A07076f4872B31857h3609L5479
16193d8130j27264K9983B24023A5936J72554a28660c1492A49771B3574J025K5105
16182D9704c03058g5656F7387i6665l5652B9534j1946K60514E2582c9636j3087
16171e2723A8337J87771Q154g314p4749J1126A87801J18873i3362b7100C89294
16159g9369B523a61743A49381A1317P7220a76618j21472e8725A38826a3573B36498
$$ y = [91273, 67058, -319995, -195356, 16292, 671, -125184, 5973, -369199, 88430, -138241, 358, -58093, 231143, -85044, 284755, 45782, -96093, -6710, 123231, 55443, 139821, -144330, -113915, -345, -111762, -12993, -325359, -3141, -206744, -134396, -53707, -31585, 47791, -489179, -43358, -82625, -95740, -43672, -213888, -165469, 160843, -21207, 107076, -64872, 231857, -83609, -48130, -175394, -145411, 224023, 15936, 188490, -128660, -31492, 149771, 23574, 24599, 49704, -303058, -75656, 67387, -96665, -132317, 29534, 17588, 278102, 52582, -39636, -52723, 18337, 206108, 214262, -7314, -82063, -70937, 187801, 306674, -93362, -27100, 389294, -79369, 2523, -161743, 149381, 11317, 88537, -176618, -298090, -58725, 138826, -13573, 236498]
16147d4254k85941a02451I9769J00048C947K19770f8756B87820j41089a75171
16136D4815h7381D5365d1973j37242A60580b90668I7230e6085A81759a96211K5579
16125a70632B62676A241b77473B2596b2489l1376k6688p8591J5202b6850l7834
16114f4684k835B05273A028R489O9134Q2505e0283J4089I7155G66N6061f818C09961
16100B03590o0735N6265J0386H28J89854O2154a36295n8544B65012g7790j66260
16089b44050A27869E447M30790H755a72026A01880Q7246b88304a20853L9639B52861
16077D373e6555j55490b3185A46176a33628l1185a6987l3493j03046A79923b12215
16065a91791o0775A52763j7725a49941m8315O976A46551k2736A3094a10414A0036
$$ y = [-44254, -330195, -102451, 99769, 199817, 3947, 223717, -68756, 287820, 146731, -175171, 44815, -87381, 45365, -41973, -179215, 160580, -290668, 97230, -56085, 181759, -196211, -170632, 262676, 1241, -277473, 22596, -22489, -53865, -80553, -159144, -143942, -26850, -64684, -67519, 205273, 1028, 10517, 79651, 162156, -50283, -36194, 97155, 766, 56827, -6818, 309961, 203590, 142855, 199120, 209506, 828, 190682, 252836, -136295, -194839, 265012, -77790, -244050, 127869, 5447, 436237, 8755, -172026, 101880, 189126, -288304, -120853, -81214, 252861, 4373, -56555, -212045, -23185, 146176, -133628, -164813, -16987, -50480, -153526, 179923, -212215, -191791, -252566, 152763, 135038, -149941, -198256, -191280, 146551, 123815, 13094, -110414, 10036]
16053e2481k45709C30008a33770L9357p6363m2985L1468l7319J7274P5644A8134
16041B86626j19916b62485D6147a60477B5972e5409H7816A9004K84531b21586
16030b06329M3546k8676C40025r4957h0041j04736c569k37512a11087B1108a47317
16018A2391J29874b75180D9074J17601M2770J87436e4559k24506O7885A06049
16007h3343C42190i0579n8670m4546A68277Q486m1262b08954A01037m4854h2807
15995a32412a1246l4859B19979a18545B85145c4039A2211c1730F2491N6422e2973
15983A94094J72471E2163J20677a61978g009B23335J0938a88662D20799A80317
15972a40424e1676K180n2457i1B42641j21285N5559I573f1466B1056b10150P2704
$$ y = [-52481, -298190, 330008, -133770, -94413, -170776, -213761, -182293, -219612, -202338, -126694, 18134, 286626, 166710, -262485, 46147, -160477, 25972, -55409, 87816, 19004, 303535, -221586, -206329, -162783, -191459, 340025, 245068, -80041, -184777, -3569, -241081, -111087, 21108, -147317, 12391, 142265, -275180, 49074, 166675, 209445, 396881, -54559, -279065, -211180, 106049, -83343, 342190, -90579, -149249, -193795, 168277, 176763, 135501, -208954, 101037, 56183, -82807, -132412, -11246, -46105, 219979, -118545, 285145, -34039, 12211, -31730, 62491, 118913, -52973, 194094, 366565, 52163, 172840, -161978, -7009, 223335, 234273, -188662, 420799, 180317, -140424, -51676, -49496, -101953, -91, 242641, 121356, 176915, 9573, -61466, 21056, -210150, -137446]
15960a37446a8979A26736K64865g7558A08815j4227c4867A7121a44104B69266
15949a22815O1009p379j9762F9453A7378a97142j11810a39902m540A25810a91341
15937A47719c18651a12732r4847P7344B6665J77173b81874M5921A96553G1690
15926a02122n5648A2718g6128I2562J4758b39213R3251q5474j8673D2977e6349
15914c9996B53945p6968a45974C19842I0938K3870M8157b10127q0654j84028a04559
15902D0734a52397E5553a769A51263L3901a10979a0351B15380e1533m5784E3014
15890c81236g1252k99528a45094G4974a24186D4982i9011j81658d3993l5583c9515
15878i8070M5567l2367j38437C61768A54824a35610j9977C2927g9623q613A85995
$$ y = [-137446, -18979, 126736, 391601, -77558, 108815, 94588, -34867, 17121, -144104, 269266, -122815, -61806, -69185, -88947, 69453, 17378, -197142, -308952, -139902, -144442, 125810, -191341, 147719, -318651, -112732, -207579, -130235, 26665, 203838, -281874, -235953, 196553, 71690, -102122, -157770, 12718, -76128, 92562, 107320, -239213, -145962, -231436, -250109, 42977, -56349, -39996, 253945, 176977, -145974, 319842, 90938, 114808, 162965, -210127, -290781, -474809, -104559, 40734, -152397, 55553, -1769, 151263, 185164, -110979, -10351, 215380, -51533, -97317, 53014, -381236, -71252, -370780, -145094, 74974, -124186, 44982, -99011, -280669, -43993, -79576, -39515, -98070, -52503, -84870, -223307, 361768, 154824, -135610, -155587, 32927, -79623, -88236, 185995]
15866a44893f8032P979m2812k53384c2351j14512C1009a02142n6689l051G825
15854A28963J86519d5647A48488m2427a38891a549H156h9188B0922a87673d8903
15842A31178Q7072a62561D0877a34351a1055k36069A4667R2967a48631e7909j46005
15831b03914R4262A31318b5362H6732a01151m7081A84365C2822N9181J35607a1787
15819c51723B05194a56391A96843d70990K24555a03728a4088j54788F2572f4289
15808a61105B38161a53816A25087P1881E4879b31656c5206H3597a05176r6947
15798b02123G01a84697B596f9849j30480h1249E3529e794B93527a10028r0172
15787b00200A28196c55667a35451A5336k01h2403D61617c23736E5411a33483A01016
$$ y = [-144893, -68032, -60053, -102865, -356249, -32351, -146863, 31009, -102142, -158831, -161882, 7825, 128963, 315482, -45647, 148488, 106061, -138891, -1549, 8156, -89188, 20922, -187673, -48903, 131178, 218250, -162561, 40877, -134351, -11055, -247124, 14667, 107634, -148631, -57909, -203914, -109652, 131318, -25362, 86732, -101151, -148232, 184365, 32822, 92003, 227610, -11787, -351723, 205194, -156391, 196843, -470990, -246435, -103728, -14088, -168876, 62572, -64289, -161105, 238161, -153816, 125087, 196968, 54879, -231656, -35206, 83597, -105176, -202123, 701, -184697, 2596, -69849, -200329, -81249, 53529, -5794, 293527, -110028, -200200, 128196, -355667, -135451, 15336, 15135, -82403, 461617, -323736, 55411, -133483, 101016]
15775G6200B8408a94875A25729a42731j40623M5049r7421h5323J6720B6687P8848
15764A05535R6686D912e2168I6295C045b8595A20973c5754l2058j87343H6011
15752C63249H6647J0188b34941j89725D6480J73508D1817a40602C4036J40024
15742A74060c5657p5695E8317f0437h498j18160c5755A02835a30764a0637D3624
15730b39295O3848n0165D5503N8342e7505E0535g5417j21419R4987A29872d2002
15718a89578c5222r4055a945A05131J41414J55372A94541g5748m7882H2484b76235
15706A75018a13457D2144b99740a33205j42294B07293a00551J2006H0188Q6695
15696A66883b77090q380B115c64522E4142m045a22259d649j09898j76440P7687
$$ y = [76200, 28408, -194875, 125729, -142731, -283354, -238305, -335726, -85323, -68603, 26687, 105535, 202221, 4912, -52168, 96295, 3045, -28595, 120973, -35754, -67812, -255155, 86011, 363249, 86647, 96835, -234941, -424666, 46480, 219988, 41817, -140602, 34036, 174060, -35657, -111352, 58317, -60437, -8498, -126658, -35755, 102835, -130764, -10637, 43624, -239295, -175447, -225612, 45503, 103845, -57505, 50535, -75417, -196836, -101849, 129872, -42002, -189578, -35222, -129277, -1945, 105131, 246545, 401917, 194541, -75748, -123630, 82484, -276235, 175018, -113457, 42144, -299740, -133205, -275499, 207293, -100551, -88545, 80188, 166883, -277090, -285470, 2115, -364522, 54142, 50097, -122259, -4649, -114547, -290987, -213300]
15685b13300G4170e1694m8493j01890L9789A00865a346A43130E4997j8341b2022
15673f2486A45014d5008d913n5724A21091a8163k4004A03151J48215G1235g3222
15661e5656j07058O7439j31842A61591J30415b53669e9726k12774C12428J62684
15651D75112i7440a007D417b78501a23947a1529m3782A25168b21101A07500a25442
15639b51683A81132a7443b875C12534A9068a41946k92223A57066a60594K6475
15629a34119m6704b7072k54311l0862A9770n283Q2379l6960m997O2709d5140A56717
15616E0763i778l0308A75156a59703C6007a19475k09840A2272b05614p6794a39393
15604A80657c17A8098d26k36238b7409k8685H1133g9372j55B8197a4834A27075
$$ y = [-213300, 74170, -51694, -100187, -202077, -162288, 100865, -1346, 143130, 54997, 36656, -22022, -62486, 145014, -45008, -4913, -60637, 121091, -18163, -42167, 103151, 251366, 71235, -73222, -55656, -162714, -95275, -227117, 161591, 292006, -253669, -59726, -272500, 312428, 475112, -97440, -1007, 4417, -278501, -123947, -11529, -55311, 125168, -221101, 107500, -125442, -251683, 181132, -17443, -2875, 312534, 19068, -141946, -434169, 157066, -160594, -134119, -180823, -27072, -281383, -312245, 19770, 14487, 96866, 59906, 54909, 117618, -45140, 156717, 50763, -9778, -40086, 175156, -159703, 36007, -119475, -329315, 12272, -205614, -282408, -139393, 180657, -317, 18098, -426, -236664, -27409, -56094, 81133, -79372, -79527, 28197, -14834, 127075]
15591a10998m6685d3969k18202B63548j1843A21071c34266D4719R2642C1143K24881
15580B56024b5206j2472B46645I8877e6706H8418j0401A7867J78198b82847H4522
15568e8726B60693a35232B93611G1870d29322J78264C87281J4176b15790B4091
15557F8371F174L0292b7367B84448b36001f4025B84475f1461E1013a01463I5950
15545B46591a05654E5726c7764l6625C8669P0104D708f9010F8623J6286k5234
15534E9675J7189L2646a9742o539C2687b14892A68387C9301a30635A40713a92059
15522e854C04948h0950G7636a54460A50278a52215A12564b68905E7203p109a296
15510A42367A2165O2804J27227a82308J7418N9388j83430B09988d7476p9539H2395
$$ y = [-110998, -157683, -43969, -262171, 263548, 251705, 121071, -334266, 44719, 137361, 31143, 256024, -25206, -37678, 246645, 98877, -56706, 88418, 78017, 17867, 196065, -282847, 84522, -58726, 260693, -135232, 293611, 71870, -429322, -251058, 387281, 401457, -215790, 24091, 68371, 6174, 36466, -27367, 284448, -236001, -64025, 284475, -61461, 51013, -101463, 95950, 246591, -105654, 55726, -37764, -74389, 38669, 108773, 4708, -69010, 68623, 84909, 59675, 76864, 109510, -19742, -26281, 32687, -214892, 168387, 39301, -130635, 140713, -192059, -5854, 304948, -80950, 77636, -154460, 150278, -152215, 112564, -268905, 57203, 50094, -1296, 142367, 12165, 74969, 202196, -182308, -164890, -105502, -288932, 209988, -47476, -127015, 82395]
15498A25847h1764A53659M2444a08338j09549b0070j44239I3598m6484a05970
15487b7012B68836a44010M0707A15057F547b51952L133I9969g2696I0415b30386
15475B09694a51935A21470L02647I7954D3916g9743C78339a9554k2689H3007a66371
15463a6640j7601A88647a63262B19498C4442J96994C2072d5367n9688D5354a26044
15451a61419r3808Q6899r2523h1012j59790A41777j4139b18445N9569p3962G8318
15439A18542k1748c4987l5189A03019c42959A03098k7216k877a53852H6770e5857
15427b09682M1284O4927j14209R133a5036A36001I667a61238N1788f254r8527
15416a04781d533A43246f6374F7862J06802E0495K6013K1599a08498m338A0235
$$ y = [125847, -81764, 153659, 196103, -108338, -217887, -20070, -164309, 93598, 47114, -105970, -27012, 268836, -144010, -103303, 115057, 6547, -251952, -248819, 99969, -72696, 90415, -230386, 209694, -151935, 121470, 424117, 97954, 43916, -79743, 378339, -19554, -42243, 83007, -166371, -16640, -34241, 188647, -163262, 219498, 34442, 231436, 32072, -45367, -105055, 45354, -126044, -161419, -255227, -168328, -260851, -81012, -240802, 141777, 127638, -218445, -158876, -232838, 78318, 118542, 96794, -34987, -70176, 103019, -342959, 103098, 75882, 73005, -153852, 86770, -55857, -209682, -168398, -103471, -217680, -208547, -15036, 136001, 9667, -161238, -109450, -6254, -104781, -4533, 143246, -66374, 67862, 174664, 50495, 76508, 98107, -108498, -112836, 10235]
15404C10776G0512a1052B3634O1397K01578o5424m4446f869l70990i1036l8243
15393a29279d714A7717c76548E0044e14134D3902M799e0125K4227j01397J6145
15382a11150b4060j81239B00825d1433A31106c4955A4088d96H5113f0007k9226
15371h9233a6678j4551F6788e5196j71177A51164n806E3487N4114b2523k70336
15360b92859B17271H8288e6132j1882E9712a2944k4499E9028j7168Q7231b8563
15348C0519M1946a41130p7529e4972j93654C07480g009m2606A01164A9964K78864
15337B98828a90057k1727i8709i864m8567n0737k21998A5839P3118g886b350H4613
15324A66598F7212M17078D5853Q7619b045D9651J2823j3987M6651K2234a00502
$$ y = [310776, 70512, -11052, 23634, 85031, 286609, 221185, 176739, -6869, -377859, -91036, -129279, -4714, 17717, -376548, 50044, -514134, 43902, 48701, -50125, -25898, -127295, -111150, -24060, -205299, 200825, -41433, 131106, -34955, 14088, -496, 85113, -60007, -89233, -16678, -31229, 66788, -55196, -226373, 151164, 145358, 53487, 107601, -22523, -292859, 217271, 88288, -56132, -68014, 59712, -12944, -37443, 59028, 41860, 129091, -28563, 30519, 72465, -141130, -218659, -54972, -248626, 307480, -7009, -49615, 101164, 19964, 298828, -190057, -211784, -98709, -9864, -58431, -109168, -331166, 15839, 88957, -7886, -2350, 84613, 166598, 67212, 484290, 45853, 133472, -2045, 49651, 62474, 48487, 95138, 117372, -100502]
15312b46882f4521d659n7002B97433a93818a4814A68805K46144a02711o7756B7090
15300H1654a92345a6017j58632D1451b11710A95709a91280B22535m0135C5515
15289b41583N9537Q0321i39A51550M9805I7872J06373h3580C17507H5120c17346
15277B21392c08748A62868J36704G2738J0449Q3557J5150J8300a72960B20950
15266C961j609N42276A47475h924l20332D26669G6659a55027b7469l02058A40747
15254c4478j56429B2727K06602J41097n2861L46716L31391j49196k3737J53802
15244I76541C94573l5752b7781j6185A86518J41675E0881K65653A25986a13165
15233a61045b5111I5837i7008A63222k6460g4079Q986j66011C4087g5798r1795
$$ y = [-246882, -64521, -4659, -61661, 297433, -193818, -14814, 168805, 414949, -102711, -170467, 27090, 81654, -192345, -16017, -174649, 41451, -211710, 195709, -191280, 222535, 182400, 35515, -241583, -182046, -101725, -939, 151550, 201355, 97872, 204245, -83580, 317507, 85120, -317346, 221392, -308748, 162868, 299572, 72738, 83187, 166744, 181894, 200194, -172960, 220950, 3961, 2352, 544628, 147475, -8924, -329256, 426669, 76659, -155027, -27469, -329527, 140747, -34478, -190907, 22727, 229329, 370426, 317565, 664281, 995672, 846476, 822739, 976541, 394573, 358821, -27781, -43966, 186518, 328193, 50881, 316534, 125986, -113165, -161045, -25111, 95837, -97008, 163222, 136762, -74079, -65093, -231104, 34087, -75798, -167593]
15222a67593A81978A0200M9502j9394a02112E5067j495J08882a91270g8796A28693
15210H7988b35541C28169g8566E3497R1023J53032I0821L3911K74971j33967g2987
15198a2104j49655L4215E1234b2392B16269B7663h8775A31430K01528c1240j51113
15187a82353j51295a12048B1216a31445B00422n2692N4032L582f1486B1092K82173
15176C03265i4428B49466j04565b3381A27912a46032f1747B81042A09629a58847
15165B83851j23532n9829d1479B3002P1128a85425b2928B7619c71225G8365c1260
15153A59292d05293B99000F1863J38006M02113A77639A1799J34727a67610A28526
15142B11288D4519K49601a4178A43437K00199A46042E8328J59911i3465p408d266
$$ y = [-167593, 181978, 10200, 59702, 40308, -102112, 55067, 53572, 162454, -191270, -78796, 128693, 87988, -235541, 328169, -78566, 53497, 144520, 297552, 90821, 124732, 399703, 265736, -72987, -12104, -161759, -127544, 51234, -22392, 216269, 27663, -88775, 131430, 332958, -31240, -182353, -333648, -112048, 21216, -131445, 200422, 147730, 201762, 205344, -61486, 21092, 303265, -94428, 249466, 144901, -23381, 127912, -146032, -61747, 281042, 109629, -158847, 283851, 160319, 100490, -41479, 23002, 94130, -185425, -22928, 27619, -371225, 78365, -31260, 159292, -405293, 299000, 61863, 199869, 601982, 177639, 11799, 146526, -167610, 128526, 211288, 44519, 294120, -14178, 143437, 343636, 146042, 58328, 218239, -93465, -100873, -4266]
15130d0692A29674J4975b3524B10086A5129c98540a85017C14696q5926G4360K59950
15119C34310a41272j55523H6514g9295H3545b47575A29779d7347H7295Q0274i5157
15107C84041A11648M43596C5723K28640h3829B23232E6303J24103E2047M2686
15097I4733j112J3134J66582J07513A82084M5946I9349O9131h4206B8807L43634
15086C72441F4335K04545k3825H9558R3391J24360d648G1772O0728M5531M1878
15075B19909d0242k3922E8137O310a2363n152l7866g977J323F2558c60627A89706
15062B56113L9305J68620j97630j13176F3253J78279J12864D6382M09380j58259
15052B97503B6762L6671M28300h185A80996a6283k8294A99485b18475A91632M3915
$$ y = [-40692, 129674, 144649, -23524, 210086, 15129, -398540, -185017, 314696, 228770, 74360, 334310, -141272, -296795, 86514, -79295, 83545, -247575, 129779, -47347, 87295, 167569, -95157, 384041, 111648, 555244, 35723, 264363, -83829, 223232, 56303, 180406, 52047, 94733, 93621, 106755, 273337, 380850, 182084, 228030, 99349, 168480, -84206, 28807, 372441, 64335, 268880, 245055, 89558, 182949, 307309, -4648, 71772, 132500, 178031, 219909, -40242, -64164, 58137, 64447, -12363, -17515, -55381, -7977, -6654, 62558, -360627, 189706, 256113, 295418, 464038, 266408, 153232, 63253, 241532, 354396, 46382, 455762, 297503, 26762, 63433, 491733, -8185, 180996, -16283, -44577, 199485, -218475, 191632, 235547]
15041B35547r3823l370D520L33081j58623k8269g0710A90557o6854m7722a60044
15029C67338a7461F8842L68329D7665n46Q2099l5877f1079A26395J49506h3544
15017A84680J10414D388K55487j29673e1125D47593G2670N8642J36797h6242D19518
15005D2575M7052L4048K33028a53429C7320R9847K85914G9907J11930b6940A27237
14993C11129a63335d9181D02680D5297J48282O3209H4653k7752K22019J08210
14983C87130n6415E3901Q299N3139J85003j26663Q2527a52222D87109B02255j01103
14972A01152N8786K54167k4871A39140a614A30325a39611H5608L03565P2903k8921
14961D33155A67884m3641J44497Q6624A40254J40328a36072B76426o5785O8192
$$ y = [235547, 141724, 138354, 4520, 337601, 178978, 150709, -70710, 190557, 123703, 75981, -160044, 367338, -17461, 68842, 437171, 47665, 47119, 129218, 93341, -61079, 126395, 275901, -83544, 184680, 295094, 4388, 259875, 130202, -51125, 447593, 72670, 131312, 268109, -86242, 419518, 42575, 89627, 123675, 356703, -153429, 37320, 137167, 423081, 79907, 191837, -26940, 127237, 311129, -163335, -49181, 402680, 45297, 193579, 256788, 84653, 56901, 278920, 387130, 330715, 53901, 62200, 115339, 300342, 173679, 256206, -152222, 487109, 202255, 101152, 159938, 414105, 389234, 139140, -1614, 130325, -139611, 85608, 389173, 462076, 433155, 167884, 124243, 268740, 355364, 140254, 280582, -136072, 276426, 210641, 278833]
14951B78833A01758K45550q8241r4125a9888B30532A09168J11650A06932J0567
14941A17499g3214D61639B21273o2243J49606L12808A22203K70042L39696l19999
14931D11942j07599j39347l9718K96000n0960e3955C97739P719H0353J39723r6110
14920A23966n3419L15808A24483K33470q6766P1004q553r1585J85403k13647j04115
14909A09694M48734k15896j13005O8344m9460N4356A8053L93467j44177o1411
14899B05932N8621a6436B79550J9581L7418q3601j00764i7106M7015C83142p0898
14888C12244I9855P4206m2295J73671A48976k2687K79126j65427Q4147a4438A58744
14876D1629K07012J72264A89440Q8665K88785B74848j12355j8342J65517j06147
$$ y = [278833, 101758, 347308, 259067, 164942, -19888, 230532, 109168, 220818, 106932, 117499, -73214, 461639, 221273, 159030, 308636, 621444, 122203, 392245, 731941, 411942, 304343, 164996, 125278, 421278, 370318, -53955, 397739, 405458, 80353, 220076, 123966, 70547, 386355, 124483, 357953, 271187, 342191, 333638, 242053, 427456, 213809, 109694, 558428, 342532, 229527, 297871, 248411, 302767, 18053, 411520, 267343, 205932, 264553, -16436, 279550, 299131, 336549, 252948, 152184, -97106, -50091, 383142, 312244, 99855, 174061, 131766, 305437, 148976, 126289, 405415, 239988, 324135, -14438, 158744, 41629, 248641, 420905, 189440, 278105, 566890, 274848, 162493, 144151, 309668, 203521]
14866B03521L46255j60526C5008M32850B25164J56304j32277O2954P8220j25906
14856B64459K14610B737L9204P2987K06415N850J2502J84542j79387C3601P57287
14845G90888k54059C5788L55537B4306O00377B80921Q7981A52500J22143J67331
14835D41974p1189r4337K44531j55549K88658M8015k62425B12232j9154J26435
14825C19513Q9763A36692J85952R1676j78778J87261L4719j49603J2553K61206
14815E81678j09693A83014J66833l2697A22814L77718j51375L12906A82155L83249
14805E65404p3030Q004J36800l5555L5886B78012J71709j56722J03412K17360
14795F13771k4666B25838K06872L6602J08843k73876K88419j9184J57781q689
$$ y = [203521, 549776, 389250, 35008, 467858, 225164, 381468, 249191, 312145, 390365, 264459, 479069, 2737, 41941, 114928, 321343, 327193, 339695, 524237, 344850, 33601, 790888, 536829, 35788, 391325, 24306, 624683, 280921, 368902, 152500, 274643, 441974, 370785, 276448, 520979, 365430, 654088, 702103, 439678, 212232, 193078, 319513, 409276, 136692, 322644, 414320, 235542, 422803, 457522, 307919, 320472, 581678, 471985, 183014, 349847, 317150, 122814, 500532, 349157, 662063, 182155, 565404, 492374, 500378, 637178, 601623, 637509, 278012, 449721, 292999, 396411, 613771, 589105, 225838, 432710, 469312, 578155, 304279, 592698, 573514, 731295, 722606]
14785G22606C09628A39180R829N60159A37637L16446J54923K58024k20365P056
14775F53721j39089O3968k52240K07282k00743J04387O9285j06700K28079o1106
14765E66844j02118A44261L51068J33727C08207P1184K44434j55517J28936P7560
14755F74804r0920K45001l09576Q4046K55873K5740l42989m6213p9823L88882
14745H04825p5794j29992n7199J97423j16864J15634J55039l72607M15026m66529
14735D68962k6296Q6797J23865J12252j23946o8874M009J89195j16088q0996j42518
14724D26362J78267k71013L18122j9086j65317K15723j8099m2648M7620L46371
14714A016302l68185K12236M4059k25073o4401M5475p1003B42460O19992j67421
$$ y = [722606, 309628, 139180, 149009, 709168, 137637, 454083, 609006, 867030, 646665, 653721, 514632, 578600, 326360, 533642, 332899, 437286, 506571, 399871, 627950, 566844, 464726, 144261, 495329, 629056, 308207, 379391, 623825, 468308, 597244, 674804, 583884, 828885, 519309, 603355, 859228, 884968, 541979, 495766, 415943, 804825, 729031, 599039, 541840, 739263, 622399, 738033, 893072, 520465, 935491, 468962, 442666, 529463, 653328, 765580, 641634, 572760, 576769, 765964, 649876, 568880, 426362, 604629, 333616, 651738, 632652, 467335, 683058, 664959, 622311, 669931, 1016302, 648117, 860353, 904412, 679339, 614938, 660413, 589410, 242460, 862452, 695031]
14704F95031Q3894l00822J99701j60890K37431C32496K53944J37021J5592j41593
14694E97460k24310L61761j23882K9678j59440M24360L271j06495J56536j31316
14684H27623k81031K70853j89567j88528P91503m20997j12308J42563O0711J83042
14674A083864l16462J05368K77303j88697M7193l58071K21496M6065k49935J68191
14664H36315M9598M2841j15707K30794l25914J62383K86207l36572J92197K94465
14654A316607l50369k81543N93113n12010J61924J01076K26866l80789O9364k4683
14644I19556J14819J59475j67532K85578n14276L50459Q650J82258n19419N0193
14634H69761Q073J532J38726R1240q9587j2442j07754K05443j3430J95020j27161
$$ y = [695031, 778925, 478103, 677804, 516914, 754345, 332496, 586440, 723461, 739053, 597460, 373150, 734911, 611029, 640707, 481267, 905627, 908898, 802403, 958939, 827623, 546592, 817445, 627878, 439350, 1230853, 809856, 697548, 840111, 900822, 1083864, 767402, 872770, 1150073, 961376, 1008569, 650498, 871994, 918059, 668124, 836315, 885913, 928754, 813047, 1043841, 717927, 880310, 1166517, 829945, 1022142, 1316607, 966238, 684695, 1277808, 765798, 927722, 1028798, 1255664, 874875, 944239, 919556, 1034375, 1193850, 1026318, 1311896, 797620, 1148079, 1156729, 1338987, 819568, 869761, 877834, 879366, 1018092, 1109332, 1019745, 1007303, 899549, 1104992, 1091562, 1286582, 1159421]
14623A159421j67597J85436J87540j92330L4879j79119L10558k34307j209M146
14613A107418K06779j9981k69872K00292R571j90768J76826j13920k8199q1972
14603I96174K69747J10210K23446j83230O8226L7050k64822N7832K46341o30444
14593I30530L27750K06536j24676K2813L95570j98241k24879M56036m03480L0680
14583A418639P8744J7964l20246M68413q2199k5765L57012k05442j28834J16691
14573A694977j98377K37401J39166o9515j70011R2690J96376J78392J6718k12838
14563A904979K77087k13874M29503j75946q0949J34447M08160m11653K34118N57940
14553C063812m43046M43150J034711J287670K025306M779217J0158913J6697182
$$ y = [1159421, 991824, 1177260, 1364800, 1172470, 1207349, 1028230, 1338788, 1104481, 1103272, 1107418, 1314197, 1294216, 1024344, 1224636, 1234207, 1043439, 1220265, 1106345, 1078146, 996174, 1265921, 1376131, 1599577, 1416347, 1484573, 1521623, 1256801, 1314633, 1560974, 930530, 1258280, 1464816, 1340140, 1362953, 1758523, 1560282, 1335403, 1791439, 1387959, 1418639, 1497383, 1515347, 1195101, 1663514, 1581315, 1555550, 1912562, 1707120, 1578286, 1694977, 1496600, 1734001, 1873167, 1803652, 1633641, 1726331, 1922707, 2101099, 2117817, 1904979, 2182066, 1968192, 2397695, 2221749, 2140800, 2275247, 2683407, 2271754, 2505872, 3063812, 2620766, 3063916, 4098627, 5386297, 7411603, 12190820, 22349733, 39046915]
14545C9046915k651952A7002758G230974C514888j144146k47638k89754k10990
14537A622360j19579M27474J06901m61458J56689l8498R495j15174K58871j25987
14527A721094M01429k57234n2689L32163k44910K21705K78309l93684K20964j89479
14517B037668K07622p276Q3889l07042L02244Q8109K01408n09663L37128l7843
14507B396244Q6738K60171k92066J65160j97017M0286J37460j29261M33476k61244
14497B639947j08721J63224K10871k38892J44303K06221j86490J17575j10548
14488B837490J511K80053k52872Q0327K11394j13416J56327k20519K10182j34514
14478C055963K85755n2567J13498Q0013j72205L08471k03678K94448l72493L04141
$$ y = [39046915, 36394963, 17002758, 7230974, 3514888, 2370742, 2123104, 1833350, 1622360, 1502781, 1930255, 2037156, 1575698, 1732387, 1693889, 1703384, 1588210, 1847081, 1721094, 2122523, 1865289, 1812600, 2144763, 1899853, 2121558, 2399867, 2006183, 2227147, 2037668, 2245290, 2238014, 2321903, 2014861, 2317105, 2405214, 2606622, 2096959, 2434087, 2396244, 2482982, 2743153, 2451087, 2616247, 2419230, 2459516, 2596976, 2467715, 2901191, 2639947, 2531226, 2694450, 2905321, 2666429, 2810732, 3016953, 2830463, 2948038, 2837490, 2839001, 3119054, 2866182, 2946509, 3157903, 3044487, 3200814, 2980295, 3190477, 3055963, 3341718, 3289151, 3402649, 3482662, 3310457, 3618928, 3415250, 3709698, 3337205, 3641346]
14468C641346j30533P5348N9025K03255J57271k47600M00960O1422o4355J75691
14458D331830k24901k30521j2376K58604r3935M09698k87338J52465K66768k12947
14448D357347M58715j5317l02744K15631l0879J17634K56990j03563R413J08722
14438E071949K4465N77580m40892J20017n2173K00121J09327R4949j51346J78114
14428E732111M99037l57864o827L06448R0507k53203M76343p7806M17627j13118
14418F713255L06088j02982J33961L1396n0711M15697P5905K0729K84155l01064
14408G526429n1400L43878N2669N3574J92606J44472M17731q7914l2327K83473
14398H843191J48331L11038R6485L4693J76253K20893J01832J81818N4146J94208
$$ y = [3641346, 3510813, 3586161, 3645186, 3848441, 4005712, 3758112, 4159072, 4220494, 4156139, 4331830, 4106929, 3876408, 3864032, 4122636, 4028701, 4438399, 4151061, 4303526, 4570294, 4357347, 4816062, 4800745, 4498001, 4713632, 4682753, 4800387, 5057377, 4953814, 4963227, 5071949, 5096414, 5673994, 5233102, 5353119, 5300946, 5501067, 5610394, 5705343, 5553997, 5732111, 6231148, 5873284, 5866457, 6172905, 6263412, 6010209, 6486552, 6408746, 6826373, 6713255, 7019343, 6916361, 7050322, 7081718, 7031007, 7446704, 7522609, 7543338, 7827493, 7526429, 7475029, 7818907, 7871576, 7925150, 8117756, 8262228, 8679959, 8592045, 8559718, 8843191, 8991522, 9302560, 9399045, 9433738, 9609991, 9830884, 9932716, 10114534, 10168680, 10362888]
14388A0362888M89795O533R4847N57388m21614N86110J53335L50029J13682J53476
14378A2446469M62862o9480O82264j02551L91242L44524K09852J25426L35664
14369A4826272N78223N06690J31815q2816N74803j5374J163929J63578j48485
14360A7698635M10156R43255O1905Q04372L77060k9973Q11352P01429P85124J3422
14350B2576737P17846M96365O62605O75659N69904P83515N04318R42529P82239
14341B8711717M18246R83408Q92822L81983J147530J090478J069354P69898J525484
14332C6990920J280658R53035J348330J121988J259814J384604J692686J225897
14324D7257932J743175J542394J937717K341428J838818J615478K506712K149869
$$ y = [10362888, 10852683, 10859216, 10954063, 11511451, 11089837, 11675947, 11829282, 12179311, 12292993, 12446469, 12909331, 12839851, 13522115, 13419564, 13810806, 14155330, 14365182, 14490608, 14826272, 15404495, 15911185, 16043000, 15960184, 16534987, 16519613, 17683542, 17847120, 17698635, 18108791, 19052046, 19113951, 19918323, 20295383, 20265410, 21076762, 21778191, 22563315, 22576737, 23294583, 23790948, 24453553, 25129212, 25699116, 26482631, 26986949, 27929478, 28711717, 29129963, 30113371, 31006193, 31388176, 32535706, 33626184, 34695538, 35465436, 36990920, 38271578, 39224613, 40572943, 41694931, 42954745, 44339349, 46032035, 47257932, 49001107, 50543501, 52481218, 54822646, 56661464, 58276942, 60783654, 62933523]
14316F2933523K221126K682388K808780L055130L202005K989992L392875L832447
14308H7118266M014713L967465M510871M672203N017390N056033N599937O013677
14300A25970555O510041O635306P630272P686689Q230894Q925223R172707J0334177
14292A91095864J0497893J1355191J2411396J2621319J2964573J4138260J4452090
14285B79536586J5467362J5641227J5805601J6227143J5855753J5970795J5077845
14278C89582312J4069985J3084712J1779537R762816O486127N58047k205203j362171
14270D41756162q33885k244267o958615l810927q181631j1856983j3007769j4224626
14262C80637459j5675942j6422645j6348353j6525518j6149615j5666198j4943027
$$ y = [62933523, 65154649, 67837037, 70645817, 73700947, 76902952, 79892944, 83285819, 87118266, 91132979, 95100444, 99611315, 104283518, 109300908, 114356941, 119956878, 125970555, 132480596, 139115902, 146746174, 154432863, 162663757, 171588980, 180761687, 191095864, 201593757, 212948948, 225360344, 237981663, 250946236, 265084496, 279536586, 295003948, 310645175, 326450776, 342677919, 358533672, 374504467, 389582312, 403652297, 416737009, 428516546, 438279362, 444765489, 445323536, 443118333, 441756162, 440922277, 438678010, 431719395, 427908468, 419726837, 407869854, 394862085, 380637459, 364961517, 348538872, 332190519, 315665001, 299515386, 283849188, 268906161]
14255B68906161j3708534j3508489j3089558j2469713j1384447j0805323j0328583
14248A83611514r869125q685482q817887p661833p063679o981161o710054o344653
14240A21477640n692482n300146m800062m824592m394373m083336m181723l987762
14232H4213164l069437k775767l532609l132591k867881k622978k503883k508392
14224F1199626k338660k040627j829155k043584j678533j478272k262689j158541
14216D6369565j703682j467332j202460r86533j684962j047416j595896q50989
14208C5830295o89768j014404r50067r37962j191012q10741p96279n99539p44151
14199B8096372o29224q56969o32446r99024m80712k44900p30640r88661m11246
$$ y = [268906161, 255197627, 241689138, 228599580, 216129867, 204745420, 193940097, 183611514, 173742389, 165056907, 156239020, 148577187, 141513508, 134532347, 127822293, 121477640, 115785158, 110485012, 105684950, 100860358, 96465985, 92382649, 88200926, 84213164, 81143727, 78367960, 74835351, 71702760, 68834879, 66211901, 63708018, 61199626, 58860966, 56820339, 54991184, 52947600, 51269067, 49790795, 47528106, 46369565, 44665883, 43198551, 41996091, 41009558, 39324596, 38277180, 36681284, 35830295, 35140527, 34126123, 33176056, 32238094, 31047082, 30236341, 29440062, 28840523, 28096372, 27467148, 26610179, 25977733, 24978709, 24497997, 24253097, 23522457, 22533796, 22122550]
14190B2122550o65244n62867j89471o09643l65742k21623o19502j73071l94193
14181A8321194n48070r33409L03227m73408n65357q7245l30965n94891l56214
14172A4734862Q2491m25735o55553J7873j76551j31122j59670l96544j11156m37845
14162A2341050j64491k51050k14976j79946m46962O5942o4168m31884p9915j9088
14152A0554512l91492o5758m01420P9072P5685l66636l11084k8841N7946j74725
14142I027259j74090j58537q4286l34938N2561j42589l84711J11744k55640J92823
14132G849596q1996m36233R2665k16182r1527K1116k51701N7512k99144j30573
14122F513533k04712J56339k16089K57087m11890L08082p5191p16328N66542j80752
$$ y = [22122550, 21457306, 20894439, 20704968, 20095325, 19729583, 19507960, 18888458, 18715387, 18321194, 17773124, 16839715, 17142942, 16669534, 16104177, 16016932, 15685967, 15091076, 14734862, 14817353, 14391618, 13736065, 13753938, 13577387, 13446265, 13286595, 12890051, 12778895, 12341050, 12176559, 11925509, 11710533, 11530587, 11083625, 11149567, 11085399, 10653515, 10573600, 10554512, 10163020, 10097262, 9695842, 9774914, 9850599, 9483963, 9172879, 9144038, 9201984, 9027259, 8853169, 8694632, 8610346, 8275408, 8327969, 8185380, 7800669, 7912413, 7656773, 7849596, 7767600, 7331367, 7424032, 7207850, 7116323, 7137439, 6885738, 6943250, 6644106, 6513533, 6308821, 6465160, 6249071, 6506158, 6094268, 6402350, 6327159, 5610831, 6177373, 5996621]
14112E996621n12389K06212j06070j39123J28139j31803j39610O4910J28724j65699
14102E329912l09488K60889l5183l64777J2088n53316M44753j25783P1157k885
14092D727367R4035m51258P0007j0985o6114l51778L96289l51818L39544m2177
14082D353112Q1193p28731O54551l66290k75045J50856k12228J33863J84475o06634
14072C369122K42652j08749k17304p928J24334M97924l33333l99678L37672J2029
14062C516741k20395j0732j05333L0061M7491j82400J23336k05543K9563q7614
14052B935175J32457j9822j02947p5537l05099P2011K93708m52489N81484k51961
14042B806980m9449j43000L43324l32357J66790r5074L0291m04534j08792K94059
$$ y = [5996621, 5484232, 5690444, 5584374, 5445251, 5573390, 5441587, 5301977, 5366887, 5495611, 5329912, 5020424, 5281313, 5246130, 4881353, 4893441, 4340125, 4784878, 4659095, 4730252, 4727367, 4821402, 4370144, 4440151, 4429166, 4363052, 4011274, 4407563, 4055745, 4395289, 4353112, 4434305, 3705574, 4360125, 3993835, 3718790, 3869646, 3657418, 3791281, 3975756, 3369122, 3611774, 3503025, 3285721, 3277793, 3402127, 3900051, 3566718, 3167040, 3504712, 3516741, 3296346, 3285614, 3180281, 3210342, 3257833, 3075433, 3198769, 2993226, 3022789, 2935175, 3067632, 3047810, 2944863, 2869326, 2564227, 2636238, 2929946, 2477457, 3058941, 2806980, 2757531, 2614531, 2957855, 2625498, 2792288, 2697214, 2727505, 2322971, 2214179, 2508238]
14032B508238K9840p8059J42117l22143K30864k25363J66376j72323o5809J68604
14022B382342L6371M3061j34366k91780K08537k26193K91995r7038J12749n34567
14012A791111N7365J62810j36016K88987l75886J40384j93609R3110J51763o0286
14002A919733j73493J12187j66733L0802J01382j98616M0227p8276j20370K52793
13992A719636J21403l1303N17129J672673L322422Q453022J8231484M225587j8169222
13983B0062831r392470m142217j908051j064381o9977k91100m39433M9592m04540
13974B400254j91253J03215j46362l55213M56300m52615K63668j57884J04344
13965B024454k50856N1744J68734j08067k72193J49220N1428l08465L8046J60149
$$ y = [2508238, 2538078, 2460019, 2602136, 2279993, 2510857, 2285494, 2451870, 2279547, 2213738, 2382342, 2418713, 2461774, 2327408, 2035628, 2244165, 2017972, 2309967, 2212929, 2325678, 1791111, 1848476, 2011286, 1875270, 2164257, 1788371, 1928755, 1735146, 1828256, 1980019, 1919733, 1746240, 1858427, 1691694, 1722496, 1823878, 1625262, 1665489, 1587213, 1466843, 1719636, 1841039, 1809736, 2326865, 3999538, 7321960, 15774982, 34006466, 38232053, 20062831, 10670361, 6528144, 4620093, 3555712, 3485735, 3194635, 2755202, 2804794, 2400254, 2209001, 2312216, 2165854, 1810641, 2266941, 1814326, 2077994, 1920110, 2024454, 1773598, 1825342, 1994076, 1886009, 1613816, 1763036, 1814464, 1505999, 1544045, 1704194]
13955A704194N6364j86754j69447M65371k09040R2696k95047J29811j44553L51259
13945A794854j04297n1444J05884k58944O1266p4646p1138K45358j0255k27890
13935A408748q1939k09415L82430l26193K09350j33674O6444l7360K36501k9248
13925A485644m11545p4016K53878K30023l05520J82425J70606K8121n81955M27727
13915A405388L7265l35712K83865j14523l48883L37138l02756K92979O5153l5863
13905A284051k25550J63087l88588K80828O2679k09777K41128j4223k42832J71072
13895A121875j20018J46933K81121k86237n0577M23j10705k03274J21173M3831
13885I44545L34505n8566K9136l02695k2641j63K52660k76611J9201K69776k16834
$$ y = [1704194, 1760558, 1573804, 1404357, 1869728, 1660688, 1753384, 1458337, 1588148, 1443595, 1794854, 1690557, 1639113, 1744997, 1486053, 1547319, 1472673, 1401535, 1646893, 1636638, 1408748, 1326809, 1117394, 1499824, 1173631, 1382981, 1249307, 1315751, 1278391, 1514892, 1485644, 1074099, 1000083, 1253961, 1483984, 1178464, 1360889, 1531495, 1559616, 977661, 1405388, 1442653, 1106941, 1390806, 1276283, 927400, 1264538, 961782, 1254761, 1319914, 1284051, 1058501, 1221588, 833000, 1113828, 1176507, 966730, 1207858, 1193635, 950803, 1121875, 1001857, 1148790, 1429911, 1143674, 1093097, 1093520, 982815, 779541, 900714, 944545, 1279050, 1220484, 1249620, 946925, 924284, 924121, 1176781, 900170, 919371, 1189147, 972313]
13874I72313r7817J03361J19946l7622M1629j83798q9603K01204j50329j18647
13864G60637K43555k57125K65397P7665m22476J62219L3927L8093p6660o1250
13854G63982K09585k3296l25833K84242K5430l4577k39798Q5273L6653M47864
13844A229525m15389k18740K45614l62718J91725L19170j38372J2959Q2654j48541
13834G97887O9692k51328J77598M3904J80107D34615J56319J65098Q091p3626
13824F90497m0762p8543L40593j17637J77719l19661O3269k55229K42339J75055
13814H77640j67994k60450L79877j42619J24378j44025P6372Q4773r8635O0434
13804G89751r2436L1952J0341j84339P1130N7430k02773L18933j07223j32833
$$ y = [972313, 874496, 977857, 1097803, 1060181, 1101810, 918012, 828409, 1029613, 879284, 760637, 1004192, 747067, 1012464, 1090129, 667653, 829872, 863799, 901892, 825232, 763982, 973567, 950271, 624438, 908680, 934110, 899533, 659735, 745008, 781661, 1229525, 814136, 595396, 841010, 478292, 670017, 989187, 850815, 863774, 946428, 797887, 867579, 616251, 793849, 837753, 1017860, 434615, 590934, 756032, 764123, 690497, 649735, 571192, 911785, 794148, 971867, 652206, 715475, 460246, 702585, 877640, 709646, 449196, 829073, 686454, 810832, 666807, 743179, 827952, 729317, 789751, 697315, 729267, 739608, 555269, 626399, 683829, 481056, 799989, 692766, 559933]
13794E59933L01709l65997M7588m8136O109B13950L25104M27490B01051L70177
13784E71228P1935J20625C41687M21662q3520l28285K79060j33578J04271l7317
13774E63980k73441K55542j01017Q1093j30528K22365p829J51333k36153J37427
13764F62772N7245C25993L04236J35474l65871n4163M76039j29708j94774K68218
13754G65444L8344C62756J11732L87220D06173A11725L85620K90984C35299n827
13744C29472R5768K39048A99632K7360q774K63639o639q7793M0196q8393R781
13733C49009L3284J20509k34056A12389L99838J14302o2349j73430J6708J30039
13723E37497r6769n7483J36964O3356j77978O5876J47475B48748K01234J36241
$$ y = [559933, 861642, 495645, 543233, 495097, 501206, 213950, 539054, 966544, 201051, 571228, 643163, 763788, 341687, 763349, 679829, 351544, 630604, 497026, 601297, 563980, 290539, 546081, 445064, 526157, 395629, 617994, 610165, 761498, 525345, 662772, 720017, 325993, 630229, 765703, 399832, 345669, 821708, 692000, 497226, 765444, 803788, 362756, 474488, 861708, 406173, 111725, 497345, 788329, 335299, 329472, 425240, 664288, 199632, 226992, 218218, 481857, 475218, 387425, 427621, 339228, 349009, 382293, 502802, 268746, 112389, 512227, 626529, 564180, 390750, 407458, 537497, 440728, 383245, 520209, 583565, 405587, 471463, 618938, 248748, 449982, 586223]
13713E86223j51849J16861A17378K65203M6201J51857m4738M5002Q7746G3654
13702H68628C27403K53988B59546o1853L41588m1448o7717o2517L95105k44593
13692E18111p2927K21152l09505J59293k5210J0916M8179p700k00262J13743A64285
13680E42304B03039J27098l1015K56294j54985k879j50151K30209k14576o905
13670B56129K17284k09282K95661A50111K96080p8068r6965L25525q1490H6442
13659B74202L2951K31967A27440J07189L20108A63868J79933P8280n1673J34047
13649E04455K2372q7822j48945K14888f144C04690J69085j24247J42289o9164
13639D22653L20964l45795n5066G1834K40584L5112J27760K4065B27281J04315
$$ y = [586223, 434374, 551235, 117378, 382581, 428782, 580639, 535901, 580903, 668649, 73654, 868628, 327403, 581391, 259546, 197693, 539281, 497833, 430116, 367599, 762704, 518111, 445184, 666336, 356831, 516124, 490914, 501830, 550009, 542309, 342047, 455790, 164285, 542304, 203039, 330137, 299122, 555416, 400431, 397552, 247401, 477610, 263034, 256129, 473413, 264131, 559792, 150111, 446191, 368123, 271158, 596683, 515193, 86442, 274202, 307153, 539120, 127440, 234629, 554737, 163868, 343801, 422081, 370408, 504455, 526827, 439005, 290060, 504948, -6144, 304690, 473775, 349528, 491817, 422653, 743617, 397822, 342756, 71834, 312418, 347530, 475290, 499355, 227281, 331596]
13629C31596R0458A40601K26031j8320j02934K41566j80148J75326A08883M00799
13619E09682J17630k32458r0527E5100K08286K76592A98198P7084M7297K01158
13609E23737j41877j17607J67191j49101J01562p0657f9797C00292j24117M4308
13599B20483J86660A49815K21328J19343n5567A92915J27347j27110L3098n1922
13589A74328d5735B14237F3538J96310K24221g2615B57842D9716M06029k22644
13579B33101l4918e5635C78827g6303A86104J8146G4124L25779j79524L9205J94743
13568D54327j51300J98186j1965j79268K6112Q0520j43953k2392K29570a9399
13557E54884o8671j94542A39413C5204J78507J94936A88345J69079A35283Q1908
$$ y = [331596, 422054, 140601, 366632, 348312, 245378, 486944, 306796, 482122, 108883, 509682, 627312, 394854, 304327, 55100, 263386, 539978, 198198, 275282, 322579, 523737, 381860, 264253, 431444, 282343, 383905, 313248, -69797, 300292, 176175, 220483, 407143, 149815, 371143, 490486, 434919, 192915, 320262, 193152, 226250, 174328, -45735, 214237, 63538, 259848, 484069, -72615, 257842, 49716, 455745, 233101, 198183, -55635, 378827, -76303, 186104, 204250, 74124, 399903, 220379, 259584, 454327, 303027, 501213, 489248, 309980, 336092, 416612, 272659, 250267, 479837, -19399, 554884, 486213, 291671, 139413, 35204, 213711, 408647, 188345, 357424, 135283, 217191]
13547B17191R3714A23039L01573j99183J22404G661L17764J47359D6396g8781
13536B26521N9610j13694j5771J49800H7038L7076G02L04579b0059B94156J64877
13525D59033A95410q2046M6844k1289K0953L12153k04290b0598B8844O5393J33682
13514B27919Q5646K7875F6482d3013F6053J97588F637L83661K0932j0769A45373
13502C20550J7015j0105A01472a83753I4762J4051K27117A9478f0688A04962K9263
13491A34225K26039r994c07002B83129j02257K62098j10114a33031D52923A54302
13480A53629N4362K0037H0493M4137K22914d1233a3042C01069D4320K82708A49310
13468a33954a7761B57626a76102n51E72708k05001A68761J0776o3586J89200k2063
$$ y = [217191, 310905, 123039, 424612, 225429, 347833, 7661, 325425, 472784, 46396, -78781, 226521, 286131, 172437, 156666, 306466, 87038, 124114, 702, 305281, -20059, 294156, 459033, 195410, 113364, 160208, 138919, 159872, 472025, 267735, -20598, 28844, 94237, 227919, 313565, 341440, 66482, -43013, 66053, 263641, 6637, 390298, 411230, 400461, 145373, 320550, 337565, 327460, 101472, -183753, 94762, 108813, 335930, 19478, -60688, 104962, 134225, 360264, 350270, -307002, 283129, 180872, 442970, 332856, -133031, 452923, 154302, 153629, 207991, 228028, 80493, 124630, 347544, -41233, -13042, 301069, 44320, 327028, 149310, -133954, -17761, 257626, -176102, -176653, 572708, 367707, 168761, 179537, 115951, 305151, 283088]
13457B83088A10873e373A62687c6977F0772J65381j2241e8689D26986N3934A80516
13445D2210a08782B80809j14892L13075j47694j40206a51107C63457j61320r2081
13435A10056K27072h6177B25821r9980a45574e6993G5030J37245K248I1997Q2708
13424A74705o8896K06351Q0695j80295l6964k5154O7330n7631J2644O9429M2100
13413B84314D3488J99207p2754J15693f3962C74598a94581I6718a02526k41873
13403c44399A81677H9318J79120p0241J66595j55466M1919o4693h0259C60179
13392f2556C27359b7748B97753m8918J89664p4773a3953A09799g8442n6025B52618
13380E0804K6288J43960J10551A62481L0720I3349c9394C74219I7300J6473J65462
$$ y = [283088, 110873, -5373, 162687, -36977, 60772, 226153, 213912, -58689, 426986, 480920, 180516, 42210, -108782, 280809, 165917, 478992, 331298, 191092, -151107, 363457, 202137, 110056, 337128, -86177, 225821, 125841, -145574, -56993, 75030, 212275, 214523, 91997, 174705, 105809, 312160, 392855, 212560, 175596, 150442, 217772, 160141, 172785, 242214, 284314, 43488, 242695, 169941, 285634, -63962, 374598, -194581, 96718, -102526, -344399, 181677, 89318, 268438, 198197, 364792, 209326, 251245, 186552, -80259, 360179, -62556, 327359, -27748, 297753, 248835, 438499, 363726, -13953, 109799, -78442, -134467, 252618, 50804, 77092, 221052, 331603, 162481, 193201, 93349, -39394, 374219, 97300, 113773, 279235]
13369B79235J11279b94093b7522A26650J71074c756A40161O8795C9773c2156H3626
13357A63803l6205b11062B99886j13059B1025K64647p6621Q6849K58054l6211
13347E17743k25991J3563Q5128J08087r7608I8293j2840L6263K97456j09321p7923
13336B31928H3795N6804K86456q7799J48413j26226O415f5262A3130J84731E0632
13324A74974K59318G4555J24466E8463l245j5429J13072o5909R9664N289d2765
13312B55905h905B89354j22597q1103N68692E4639Q3502k5311O8536J67877F7445
13300A40851a17039B29251a64549B44595m7073G9720K5304f3744E240M3224a8353
13288C6282J93552c00864B48573J01610J3081R3142j89995i1946B05818d922H5782
$$ y = [279235, 390514, -294093, -27522, 126650, 297724, -3756, 140161, 208956, 39773, -32156, 83626, 163803, 127598, -211062, 299886, 186827, 21025, 285672, 209051, 295900, 553954, 517743, 291752, 305315, 390443, 498530, 400922, 98293, 85453, 121716, 419172, 309851, 231928, 83795, 140599, 427055, 339256, 487669, 361443, 367858, -65262, 13130, 197861, 50632, 174974, 434292, 74555, 199021, 58463, 55218, 39789, 152861, 86952, 186616, 191905, -42765, 255905, -8905, 289354, 166757, 85654, 654346, 54639, 138141, 112830, 181366, 349243, 67445, 140851, -117039, 229251, -164549, 244595, 197522, 79720, 105024, -63744, 5240, 48464, -18353, 36282, 229834, -300864, 248573, 350183, 363264, 456406, 266411, -91946, 205818, -4922, 85782]
13276B20030I4524b49913r2063F8702R6825M2988A489a32283B6599i7893B19567
13264A61173p8245C1300M55371A31823R1416K82890c9266B04535m5406j3323r679
13253A36127a72803D8283a19317C40417I2570a14588A96117a17148B73059b16003
13242I5703O2390o4753l9587b85277B54991a25407B19797P7194p160K424a13005
13230a11981B64699H8448b25668d9713B45257j5327j10611O5218b82351C47396
13219b3534E1985K8439a05143e633A08551a66807l8831A34564J00978a59543k178
13208a61721A18222g0673F7897P453J24495m4331K04283A55567a29579A6887K57310
13197B74197G6326M4698b89042C79230A08814L0314f4962J6326B19648I3438b31282
$$ y = [220030, 94524, -249913, -341976, 68702, 165527, 208515, 1489, -132283, 26599, -97893, 219567, 161173, 82928, 31300, 486671, 131823, 223239, 506129, -39266, 204535, 159129, 145806, 136127, -172803, 48283, -119317, 340417, 92570, -114588, 196117, -117148, 273059, -216003, 95703, 158093, 93340, 53753, -285277, 254991, -125407, 219797, 296991, 289831, 292255, -113005, -111981, 264699, 88448, -225668, -49713, 245257, 229930, 119319, 184537, -282351, 347396, -23534, 51985, 80424, -105143, -5633, 108551, -166807, -205638, 134564, 235542, -159543, -161721, 118222, -70673, 67897, 75350, 199845, 155514, 359797, 155567, -129579, 16887, 274197, 76326, 121024, -289042, 379230, 108814, 139128, -64962, -48636, 219648, 93438, -231282]
13185C84997a18289A8534b78493F7060d7637B77365a11572B26862b32381C9549
13174b81794A80138H3482q041J6861n506I733a08224A16707l4930b49554B34754
13162A11285C3543a08286j32567A83878i2022B24392R1035h7333A72145E0429
13151d4761A9319J6348L23814C2467C199N2817i590A96190P5409a72699B39095
13139e1147A0201L27274A68069a01180k7449G4124Q8261F312J4122L50411h3847
13127A67134h3950B23810c40854A2839a20867B64377j05347a328o2569A97557
13116B76893n5819d36493c9472D16020a91555g789B70186G18K10568b56568A21721
13104B04949Q1451a27755j05183j27092D4660L59925b60225g5000c722B00953
$$ y = [384997, -118289, 18534, -278493, 67060, -47637, 277365, -111572, 226862, -232381, 39549, -281794, 180138, 83482, 75441, 92302, 86796, 9733, -108224, 116707, 81777, -249554, 234754, 111285, 33543, -108286, -240853, 183878, -92022, 224392, 315427, -87333, 172145, 50429, -44761, 19319, 35667, 359481, 32467, 3199, 56016, -9590, 196190, 271599, -172699, 239095, -51147, 10201, 337475, 168069, -101180, -128629, 74124, 162385, 6312, 20434, 370845, -83847, 167134, -83950, 223810, -340854, 12839, -120867, 264377, 159030, -1328, -63897, 197557, 276893, 221074, -436493, -39472, 416020, -191555, -7789, 270186, 718, 211286, -256568, 121721, 204949, 286400, -127755, -232938, -360030, 44660, 404585, -260225, -75000, -3722, 200953]
13093A05820g709B69694q9530F7451b83336A04487A9230a39532e2585b4411C86102
13081A2258b42049A5678J09778Q3795a49343C315a21598l3515A30142o2585a62176
13069d9065A14254i4879b4230j55364P0596C04369i2905p0167a6818B13195n0661
13058A62534i0694C77994g0141j23c2298C08550d01440D34340E0220j8145K8985
13047F1060a8826C98029H2955J27732C8506j0735K67182o0010e858A51985N5145
13036B07130a5173C04148I7235R6330b4303h505B02315O7259q9709K46171A13633
13024B18234J27306p6958d2351F9149K84204G2289p554K91295a64533C19710F6642
13012A86463r0801M9084i3269c8932A82022l4098G0146b2202B95740l4182A9056
$$ y = [105820, -7709, 269694, 180164, 67451, -283336, 104487, 19230, -139532, -52585, -24411, 386102, 12258, -242049, 15678, 125456, 209251, -149343, 3315, -121598, -155113, 130142, 67557, -162176, -49065, 114254, -94879, -24230, -179594, -108998, 304369, -92905, -163072, -16818, 213195, 162534, -90694, 377994, -70141, -70264, -32298, 308550, -401440, 434340, 50220, 32075, 61060, -18826, 398029, 82955, 210687, 38506, 27771, 294953, 234943, -5858, 151985, 207130, -15173, 304148, 97235, 193565, -24303, -8505, 202315, 269574, 179865, 426036, 113633, 218234, 345540, 268582, -42351, 69149, 353353, 72289, 64735, 356030, -164533, 319710, 66642, 186463, 95662, 144746, -93269, -38932, 182022, 147924, 70146, -22202, 295740, 261558, 19056]
13000E8733P4939J57513a71896J4406C30491A45780n0597b9864m0487C31073a33373
12988H7150l1309J51692F2121B5741A0671R2584j7784M3976k5685P1940K1572
12977A97274d4671A28312a27601B49954H7873K9926b54538n2117a43515c2877
12966a55035B5502O0329d8460r8753A87624a75355A02071K27910a92305A25062
12955g6895B8296N33711a55276A29220j5804R132J35169A618a66220i472A39984
12943a6972m6115q8157f9270A03541C2188e5263C70941E6333R4120D3692P1187
12932A14879m8885h0394F7839B5410a59655l4146e8235A42319C298c5801a3054
12920c49506G5645a62065H6134J46401a28699B61888n0432A00044L01844e2619
$$ y = [58733, 133672, 291185, -171896, -157490, 330491, 145780, 95183, -29864, -70351, 331073, -133373, 87150, 55841, 207533, 62121, 25741, 10671, 103255, 85471, 129447, 103762, 175702, 197274, -44671, 128312, -127601, 249954, 87873, 117799, -254538, -306655, -143515, -32877, -155035, 25502, 85831, -48460, -147213, 187624, -175355, 102071, 329981, -192305, 125062, -76895, 28296, 562007, -155276, 129220, 113416, 122548, 257717, 1618, -166220, -9472, 139984, -16972, -63087, -151244, -69270, 103541, 32188, -55263, 370941, 56333, 150453, 43692, 114879, 65994, -80394, 67839, 25410, -159655, -193801, -58235, 142319, 3298, -35801, -13054, -349506, 75645, -162065, 86134, 232535, -128699, 261888, 211456, 100044, 401888, -52619]
12909I4213L6037E1704K07470d03403F7854i5930A47543G249O7674h193B27730
12897B15081d0353j8391A96573f9444A09898J05882r7030b12471D16792d09963
12886A36400N9322b25638a449I4397B4382h2120k32801E3938J43184L4600F3715
12874g7757A0450a0985j7638E8562g7575K4077A85420a05569C34087j49188h5068
12862B90021b17354j13027A42087g5407J7099m1083c2288m545B41193E1644a71151
12850c9637G7236J2679a15778I5052J44890a27158M1949q097D91798c36328A9655
12838A02397k5618N0128E7881a13234H8356C5031b27422A40524a6204r9009M4751
12827g0462n7887G8840K6133b08185A2707J08983a07061j8963p4631n7866A80390
$$ y = [94213, 130250, 51704, 259174, -403403, 67854, -95930, 147543, 7249, 74923, -8193, 227730, 215081, -40353, -58744, 196573, -69444, 109898, 215780, 118750, -212471, 416792, -409963, 136400, 195722, -225638, -1449, 94397, 24382, -82120, -314921, 53938, 197122, 231722, 63715, -77757, 10450, -10985, -28623, 58562, -77575, -53498, 185420, -105569, 334087, 184899, -85068, 290021, -217354, -330381, 142087, -75407, -58308, -99391, -32288, -36833, 241193, 51644, -171151, -39637, 77236, 89915, -115778, 95052, 239942, -127158, -85209, -93306, 491798, -336328, 19655, 102397, 76779, 126907, 57881, -113234, 88356, 35031, -227422, 140524, -16204, -115213, -70462, -128349, 78840, 104973, -208185, 12707, 121690, -107061, -126024, -200655, -258521, 180390]
12815B67493a36661K7290A7482h8114c5328I5100d4415j05084M4790B14764K9352
12804B44116f4986l9848k56856N2953B83187g1536l3386D6733J42056a41579d6865
12792A11922b28754E4729J60630j7026q8029i7590C0005J46369E9121K18629E9860
12780a37072p9742j4081J04738b6281q5357A96302e8447K8512B13891p7222g7617
12768e326l34332i9526b6856E9374g0282j68911A33743K4669a6440C0415N0003
12757H0418h724C8585O0792b82882B3617a18404c6995p4288q8755A32578M714
12746A37292r063i6773f592n084B65153A28355K41155b992A56760d9170A68733
12734A45048J99651j56546a00368k77554d3295E1103L9968k4864K9222c7130j80661
$$ y = [267493, -136661, -109371, 17482, -88114, -35328, 95100, -44415, -149499, -104709, 214764, 244116, -64986, -104834, -361690, -308737, 283187, -71536, -104922, 46733, 188789, -141579, -46865, 111922, -228754, 54729, 215359, 198333, 110304, -97590, 30005, 176374, 59121, 277750, 59860, -137072, -216814, -230895, -126157, -26281, -111638, 196302, -58447, -29935, 213891, 136669, -77617, -5326, -339658, -99526, -26856, 59374, -70282, -239193, 133743, 158412, -16440, 30415, 80418, -8724, 38585, 99377, -282882, 23617, -118404, -36995, -111283, -200038, 132578, 137292, 128229, -96773, -6592, -11676, 265153, 128355, 369510, -2992, 156760, -49170, 168733, 145048, 344699, 188153, -100368, -377922, -43295, 51103, 91071, 66207, 95429, -37130, -217791]
12723b17791A03768J29494J88345h4134i30j13415j08404b9542B91135a27938
12712i0769C10473C7106R7237h39A7445L39300G9255k5337O5963P463J62383j32286
12700A57441F640b9125k45035A02440m0218J24302O5586G5601R9499D0664a06104
12688D54629a13082j41237h4171r0999n1869B04668M7074C4131J74876E5654e7555
12676c0457r730A63416J9169a35789E35a1177C5479K1739J08164o9138O3780m3635
12664A16389q375e3741A31352J47781C6649O224k356J21959Q3496a12548C16907
12652G0256J08403M0764J32516c12961A58003A7835a74472B27216b27196C41474
12641c2843A73047H4499J42248b06762B42974g9694k1817c9891A12027K9691e5327
$$ y = [-217791, 103768, 233262, 421607, -84134, -930, -114345, -222749, -29542, 291135, -127938, -90769, 310473, 37106, 134343, -839, 17445, 356745, 79255, 53918, 119881, 127344, 289727, 157441, 6640, -29125, -274160, 102440, 62222, 186524, 252110, 75601, 175100, 40664, -106104, 454629, -113082, -254319, -84171, -175170, -227039, 204668, 251742, 34131, 209007, 55654, -57555, -30457, -40187, 163416, 182585, -135789, 535, -11177, 35479, 57218, 165382, 96244, 160024, 116389, 108014, -53741, 131352, 279133, 36649, 42873, 40517, 162476, 245972, -112548, 316907, 70256, 178659, 219423, 351939, -312961, 158003, 17835, -174472, 227216, -227196, 341474, -32843, 173047, 84499, 226747, -206762, 242974, -79694, -101511, -39891, 112027, 141718, -55327]
12629C13939A21225k7184k9908b7935E8295J85571G7489d2180H0700J25837p7136
12618A29401J07550P4867J34095h5C85492r0773F438b48889A44095a61880A47205
12606f7249i058D8821B0771K96124a22039C1465L59185b1445j13490C2265b33388
12594E9602L23530k2323a657G436K37874K0912J28352A66041a50231r1774j39005
12583c81010d8132A85076c47991h4369A34239b13617h132q1883B39260H5722q540
12572G7182A9739J71802n2048C4418J8808L7277J67660f6990B55226B549P3918
12561G6467i4078A29134p874D8891K20514n9529B1858a44520L0510a0053m2168
12550e2221C04237c3808q0982A60184a31761b3400A69496A2340a2364G7548j1731
$$ y = [313939, 121225, 94041, 64133, -27935, 58295, 243866, 77489, -42180, 80700, 206537, 129401, 236951, 311818, 445913, -85, 385492, 294719, 6438, -248889, 144095, -161880, 147205, -67249, -9058, 48821, 20771, 316895, -122039, 31465, 390650, -21445, -134935, 32265, -233388, 59602, 383132, 360809, -1657, 7436, 245310, 266222, 394574, 166041, -150231, -242005, -381010, -48132, 185076, -347991, -84369, 134239, -213617, -8132, -90015, 239260, 85722, 77182, 19739, 191541, 139493, 34418, 53226, 90503, 258163, -66990, 255226, 2549, 76467, -94078, 129134, 121260, 48891, 269405, 209876, 21858, -144520, -114010, -10053, -52221, 304237, -33808, -114790, 160184, -131761, -23400, 169496, 12340, -12364, 77548, 65817]
12539F5817c1044e31m5337l2073q4749B88996J1882I7516J81746H6391B507b65539
12526d6052C3479J60220i2266C43668c06892a8223B62376o2474e5526k14626A05033
12514B08644a83995g7743p0103c289k43961C9544R035K43233b63594G7811K75176
12503C52987B0791K36778J09041j17921B9404B157a70384e6800c312A25005C6637
12491b42292A23658c0689j8927A25888a29551d385l89996A33481k7939C4420c86908
12479a10446a0862p7485A81109a06672F4641b63360a11402k5456a8983A15943
12468A33449N2326K09957a47943o3161f1116J9088d704p3130j10720K8825A82082
12456B38013e7283j09892L6578l76400K44304A87545H0767O0149J25325a53941
$$ y = [65817, -31044, -531, -45868, -77941, -162690, 288996, 300878, 97516, 279262, 86391, 2507, -265539, -46052, 33479, 193699, -92266, 343668, -306892, -18223, 262376, 199902, -55526, -270152, 105033, 208644, -183995, -77743, -147846, -3289, -247250, 39544, 48579, 291812, -263594, 77811, 352987, 20791, 257569, 366610, 248689, 29404, 2157, -170384, -56800, -3312, 125005, 36637, -242292, 123658, -30689, -49616, 125888, -129551, -4385, -394381, 133481, 105542, 34420, -386908, -110446, -10862, -88347, 181109, -106672, 64641, -263360, -111402, -136858, -18983, 115943, 133449, 185775, 395732, -147943, -211104, -61116, -42028, -4704, -77834, -188554, -159729, 182082, 238013, -57283, -167175, -130597, -506997, -262693, 187545, 80767, 140916, 266241, -153941]
12445a83851B1490a20543L9142A05701b49464D8549a30260B15043C7473K13736
12435B51209b57135A17868a72135c3433C0655b31812n8179A49879d3021D0534
12424c628B07920e3941k32262d5491H9706g3753j21495g6287j89872iA26333D0376
12411D3976a26968e7225k76784A00364R294L3617a71753H5043C1363d18326D454
12399A29642n0446l4429K10509A05990C6444a56919e6651j73903c658A46354e1757
12387b2019k14640m6852A89727a20884A52704a4177I1972a67901K4327A36846
12376D0849A1812K49128c9544C0224J10928o911D7014L9279d9874k40634B0732
12364E0280a65383I3210h9900b1311B40352P6316c63816C3975d2877B6940M9506
$$ y = [-183851, 21490, -120543, -81401, 105701, -249464, 48549, -130260, 215043, 37473, 251209, -257135, 117868, -172135, -33433, 30655, -231812, -289991, 149879, -43021, 40534, -3628, 207920, -53941, -286203, -45491, 89706, -73753, -195248, -76287, -266159, -9, 126333, 40376, 43976, -126968, -57225, -334009, 100364, 109658, 143275, -171753, 85043, 31363, -418326, 4454, 129642, 79196, 44767, 255276, 105990, 36444, -156919, -56651, -230554, -3658, 146354, -51757, -22019, -236659, -283511, 189727, -120884, 152704, -14177, 91972, -167901, -143574, 136846, 40849, 11812, 260940, -39544, 30224, 141152, 134241, 47014, 86293, -49874, -290508, 20732, 50280, -165383, 93210, -89900, -21311, 240352, 316668, -363816, 33975, -42877, 26940, 76446]
12353G6446J15443H6536h0006L8913A18244i1999l6294K162j99215f6932l9160
12342a06092j20028E922b79117A75394c8754D7941f0074p4966D4862a49957f925
12330i7262j92671A95496R119F3265A6329h5494A08544D3791h0057B1018J7810
12319C8828P7731a78795r6746f752A50329e6318C5334B042J32385K26486g851
12307E766K0114a97405B46379f9935B09952A4059b27230A27811b39510A24399
12296a54061C2285K20148b45258G6765e603C72588A32184K3672o3666J5788H493
12284A9003K6550K04144D5396J59711C0552J53205M914b22191C17850o8543J12790
12273C62097N4244A96073r3874a51504A67245d39344D4864n462O6830K4752L4902
$$ y = [76446, 191889, 86536, -80006, -41093, 118244, -91999, -128293, -126131, -325346, -66932, -106092, -226120, 5922, -279117, 175394, -38754, 47941, -60074, -135040, 44862, -149957, -6925, -97262, -289933, 195496, 204615, 63265, 16329, -85494, 108544, 43791, -80057, 21018, 38828, 116559, -178795, -275541, -6752, 150329, -56318, 35334, 2042, 134427, 360913, -7851, 5766, 25880, -197405, 246379, -69935, 209952, 14059, -227230, 127811, -239510, 124399, -154061, 32285, 252433, -245258, 76765, -5603, 372588, 132184, 155856, 92190, 107978, 8493, 19003, 45553, 249697, 45396, 205107, 30552, 183757, 188671, -222191, 317850, 249307, 362097, 416341, 196073, 102199, -151504, 167245, -439344, 44864, 39402, 106232, 130984, 165886]
12262A65886K658f4030A56237a58735A75901B1949J11227K0550b06532C15667
12251a04934B59017j12600o9382J28115n8542F3639C0991L03739j48076M2524
12241B29178h9432j62324C46641F7446a19627A89784H0272C1671J91012p1653
12231A51030a7153C6077K55367n334A32009J02902m5003c3190C37936j42077m6154
12220A49705J83194l2468L08085B32924g2523A10446J40849p3020L228a94C82687
12208a599A66805J90077A39499K7993O0271A7248J36452b0016C37059a8424q8588
12197a07012A60380F4618F236J88704b00790A10030J33293G2902R5107L3752O857
12186B08618a69360e3038J4514A43983j4801M99773A29972R6138R8053j01752
$$ y = [165886, 168544, -64030, 156237, -158735, 175901, 21949, 133176, 153726, -206532, 315667, -104934, 259017, 146417, 77035, 205150, 146608, 63639, 30991, 334730, 186654, 229178, -89432, -251756, 346641, 67446, -119627, 189784, 80272, 31671, 222683, 151030, -17153, 36077, 291444, 286110, 132009, 234911, 189908, -33190, 337936, 195859, 149705, 332899, 300431, 608516, 232924, -72523, 110446, 251295, 178275, 181503, -194, 382687, -1599, 166805, 356882, 139499, 167492, 227763, 17248, 153700, -20016, 337059, -18424, -107012, 160380, 64618, 6236, 194940, -200790, 110030, 243323, 72902, 168009, 201761, 208618, -169360, -53038, -38524, 143983, 129182, 628955, 129972, 226110, 324163, 222411]
12176B22411M7074D3394o46J56397L04413A07258k0039K31340l3760E9432K6963
12165H6395J45573p9025P2048l9154d6368j35361A96956b65839A03148J3570m3212
12154G3506J2642R5016Q8818f1976j3050n4715B76971F0835d7350l9625j3254
12143a00229C5261i2156B02144h4807l03051a26236A05948d0491B75497r9224
12133A76273e3049j22221C3869M94666C9984b24356d6444A36912o5020a3093C19137
12121B08638b57713A31116O343J4169J83462I2429e9894B95223d5476G1903O4865
12110A36768R4327a03137k8232O5241k4576B28484a99164J439H2078R006r879
12099H1205a92612e8260B8312K25902C2398J02615D2166i6288A19742a34994d3761
$$ y = [222411, 269485, 43394, 42748, 199145, 503558, 107258, 87219, 318559, 284799, 59432, 86395, 231968, 152943, 224991, 185837, -46368, -181729, 196956, -265839, 103148, 116718, 73506, 86148, 181164, 269982, -61976, -75026, -129741, 276971, 60835, -47350, -86975, -100229, 35261, -92156, 202144, -84807, -387858, -126236, 105948, -40491, 275497, 176273, -53049, -175270, 33869, 528535, 39984, -224356, -46444, 136912, 71892, -13093, 319137, 208638, -257713, 131116, 137459, 151628, 335090, 92429, -59894, 295223, -45476, 71903, 136768, 231095, -103137, -131369, -66128, -90704, 228484, -199164, -197725, 82078, 91084, 81205, -192612, -58260, 28312, 254214, 32398, 135013, 42166, -96288, 119742, -134994, -43761]
12087A197N8068c71073R2459I8397d31106a6624l0185A59534J60915L71752J192566
12076A884767n85357F30936A51792d5486k03409I5251C6181b55847a2234j74861
12066a87095b9234Q864C79714b2706A09009O6541q6700B3626a72771i421m4745
12055e4166A13183J61709b2727o0526j2013A22320a37518H6601a35696a7585D5703
12043a39900B771b57471e5364j67600N3216m2788A65210P2063C927b10920j30286
12032c41206G706K420P0583c31944D3033j4076a27178q4863I8170N8934L4366
12021A91470l0026b55949A6863K27203k3841I2442B8125b63619A04753a56099
12010B6713g2999I2812a55847g3664q963I9810b72858P4049A97606E6193b30109
$$ y = [1197, 59265, -371073, -278614, 98397, -431106, -16624, -46809, 159534, 320449, 692201, 1884767, 1299410, 630936, 151792, -45486, -248895, 95251, 36181, -255847, -12234, -187095, -29234, -20370, 379714, -22706, 109009, 175550, 88850, 23626, -172771, -9421, -54166, 113183, 274892, -22727, -83253, -95266, 122320, -137518, 86601, -135696, -17585, 45703, -139900, 2771, -257471, -55364, -222964, -169748, -212536, 165210, 237273, 3927, -210920, -341206, 7706, 10126, 80709, -331944, 43033, 28957, -127178, -212041, 98170, 157104, 191470, 161444, -255949, 16863, 244066, 220225, 92442, 28125, -263619, 104753, -156099, 26713, -72999, 92812, -155847, -73664, -82627, 99810, -272858, -198809, 197606, 56193, -230109]
11998b63630D4700L8467b30453Q9601a8232A37633c04385A7656J38521J53235
11988C09412b33682K315A15627M1308N3684a90355e803A9836L0534a12185C14258
11976a47446E2321e7324G1515K15634a19857i352j21066b3719o2130l9773p9801
11965b05423Q7695l26928B01065b57450E3180L51232A17336d1445p328B67207
11954B45734b35790A3048R5927b4374j03780k01225g3976A35405m2122J84673
11944B77956d9405j04597f8647j01800q69e1236B55728q1717c4119H3236b90949
11932h6790M0086k28280J18358B31165a3640j49125A96165C9861J65940b02023
11921a38313H0186c92400i3477C69339a3002A6830g7094B21363E1171a40845d6702
$$ y = [-263630, 44700, 83167, -230453, -140852, -18232, 137633, -304385, 17656, 156177, 309412, -233682, -231367, 115627, 156935, 210619, -190355, -5803, 19836, 50370, -112185, 314258, -147446, 52321, -57324, 71515, 287149, -119857, -9352, -130418, -23719, -85849, -125622, -205423, -117728, -444656, 201065, -257450, 53180, 404412, 117336, -41445, -48773, 267207, 245734, -235790, 13048, 108975, -24374, -128154, -329379, -73976, 135405, 93283, 277956, -49405, -154002, -68647, -170447, -171316, -51236, 255728, 174011, -34119, 83236, -290949, -86790, -46704, -274984, -156626, 231165, -13640, -162765, 196165, 39861, 205801, -202023, -138313, 80186, -392400, -93477, 369339, -13002, 16830, -77094, 221363, 51171, -140845, -46702]
11909A5344b40821A71293a27989l6145D20060D9526a4341A38554f684j52656E0732
11897H6444g135A22875a00751j44357a5695j35712e7898k11398J12542A70975
11886a03937j07157q1508C88427A35334c16015C8441d80664A81912B2716P7557
11876A00273e0176A48118B0897a4242j12523b6157j66432A87829g8221K0636G0389
11864F97c53735a3352j89903O3214A00217K84963j15291A10544L816a8964j38180
11853a57144I9313c55697F0200b6560k08075Q6395M2474k05290c8375j46541C564
11841I0103g5795A21074a06529n7770j02532a19037j39209a9854A99941a53494
11830D224g8419m960B11684b58012F2882b65968A97413Q3046a43862E5888J12682
$$ y = [15344, -240821, 171293, -127989, -164134, 420060, 49526, -14341, 138554, -6684, -159340, 50732, 86444, -7135, 122875, -100751, -245108, -15695, -151407, -57898, -269296, -156754, 170975, -103937, -211094, -292602, 388427, 135334, -316015, 38441, -480664, 181912, 22716, 100273, -50176, 148118, 20897, -14242, -126765, -26157, -192589, 187829, -78221, -57585, 70389, 697, -353735, -13352, -203255, -140041, 100217, 385180, 269889, 110544, 114360, -18964, -157144, 99313, -355697, 60200, -26560, -234635, -148240, -105766, -311056, -38375, -184916, 3564, 90103, -75795, 121074, -106529, -164299, -266831, -119037, -258246, -19854, 199941, -153494, 4224, -78419, -83379, 211684, -258012, 62882, -265968, 197413, 280459, -143862, 55888, 168570]
11819A68570b10247A46562b50966H1326c78j83328k72076E5427k070a36092B76669
11807b20786K2277j2067B0590L4051M2490f8414j82463a17633A08948a01041b239
11795g4091I4033b32046P6772A51253Q6667L5946a5833k3481A43421Q297a4706
11783A10348i7582j1303A07364B9066a78703J8857l8290A12034d1172D045a9644
11771b76995l9059h919j66184c0257B64731b38641p0846a21481e1085l2158c280
11759a21530A33030d4629B3729e1934l94791d4696A19057N4230E2190K4628A3099
11747A97702a093j50364D754d2476B11132a21956o2516N0824H2283D441c30071
11735a78177B47824J58526a88238Q7874G1251K58486A6053J75221G4870C5496
$$ y = [168570, -210247, 146562, -250966, 81326, -378, -183706, -455782, 55427, 53357, -136092, 276669, -220786, -198509, -210576, 20590, 54641, 97131, -68414, -250877, -117633, 108948, -101041, -2239, -74091, 94033, -232046, -155274, 151253, 237920, 273866, -15833, -39314, 143421, 151718, -14706, 110348, -97582, -108885, 107364, 29066, -178703, -159846, -198136, 112034, -41172, 4045, -19644, -276995, -316054, -8919, -175103, -30257, 264731, -238641, -309487, -121481, -51085, -83243, -3280, -121530, 133030, -44629, 23729, -51934, -446725, -44696, 119057, 173287, 52190, 76818, 13099, 197702, -1093, -151457, 4754, -42476, 211132, -121956, -184472, -133648, 82283, 4441, -330071, -178177, 247824, 406350, -188238, -100364, 71251, 329737, 16053, 191274, 74870, 35496]
11724a29885A5853c00043C6703a85997G0679a29375A18683a12650B18550B694
11713f2337A77263a43658B62211a22675e143j18931A1554O2206d2576F6928c17810
11701a21803G929f1681B85259C6495Q6240C7169J31408f7867c713j5541B28530
11689a02739a8834j03044B31489K41138B10825b18825H6814d9305A18793C2607
11678A94048a78972B29978c15861E2781B5624a09353B84180A00438J78136j37173
11668A41401a4158B30997a10331a0625j66285J8587A28446h2162K696A8931O8616
11657H7547j8265b83581E8197J19980a07593A79707Q7806b8120j10469j7233m8428
11646b04250G3215a31472e8514E2388L66489a00159j774m0631A15125e0685H8644
$$ y = [-129885, 15853, -300043, 36703, -185997, 70679, -129375, 118683, -112650, 218550, 2694, -62337, 177263, -143658, 262211, -122675, -5143, -124074, 11554, 73760, -42576, 66928, -317810, -121803, 7929, -61681, 285259, 36495, 122735, 37169, 168577, -67867, -3713, -19254, 228530, -102739, -18834, -121878, 231489, 472627, 210825, -218825, 86814, -49305, 118793, 32607, 194048, -178972, 229978, -315861, 52781, 25624, -109353, 284180, 100438, 278574, 141401, -14158, 230997, -110331, -10625, -176910, -158323, 128446, -82162, -79466, 18931, 87547, 69282, -283581, 58197, 178177, -107593, 179707, 267513, -28120, -138589, -155822, -204250, 73215, -131472, -58514, 52388, 418877, -100159, -101933, -142564, 115125, -50685, 88644]
11634c71879A98948B3947a76157F6940R4275o3301C9445a91102C2959b54340A41899
11622H1523b30633D1568K21421e3642B33384e0549E7158K55168l7395a44448C6160
11610a50091a0297o2874J0048k99548B25559a21554A85307b5340l02738E5850
11599a00153A87231G7603P5290p5424c8657E5641J69306j8044a31904A30308a01543
11587e8052B43654I6424j6552h5096A6163L394J4078o893f7334j32559A74288
11575a9219B39663b80499A63406O0233R3179G5010B2754N2310a10917A58279R0635
11564B48914B958L32448a81857b3557G7285J90072b62895d1573C1644a88781I7614
11552A07279L00579j06136J96617I9271F532i3172N072B52648a5850A92481k4581
$$ y = [-371879, 198948, 23947, -176157, 66940, 161215, 97914, 39445, -191102, 32959, -254340, 141899, 81523, -230633, 41568, 262989, -53642, 233384, -50549, 57158, 312326, 274931, -144448, 36160, -150091, -10297, -73171, -63123, -362671, 225559, -121554, 185307, -25340, -328078, 55850, -100153, 187231, 77603, 152893, 77469, -38657, 55641, 224947, 206903, -131904, 130308, -101543, -58052, 243654, 96424, 79872, -85096, 16163, 19557, 33635, 26742, -67334, -199893, 174288, -19219, 239663, -280499, 163406, 223639, 316818, 75010, 22754, 75064, -110917, 158279, 248914, 2958, 335406, -181857, -23557, 77285, 267357, -262895, -41573, 31644, -188781, 97614, 107279, 407858, 301722, 498339, 99271, 6532, -93172, -88100, 252648, -15850, 192481, 167900]
11541A67900J3111G8822K0559J21838P4814a65208C95149A01280e0040A69794
11530B8172J0611b3851A49702F0374j2228g8138b7785A86644b10765G5329J24020
11519A99349e3585D95437k34682a82685B14361r9410K148K33731a43716f021B4540
11507a2784C05402k6512J1537r026n9619j06205a76708b2602q4636C66622h1148
11495B31122i551j7405A19768J77861i8619b9658B2601J74836J69790A18671J71415
11484B90086A01681a05846j45443B01598e1285I6322K235e8442A45183K51606
11474C96789b26053B50263N208q4570P1726a04673B32258J0910k0739A04103J08886
11463B12989d3268B49092a12380d069A44953J21104o1596C312J74197N3242A9598
$$ y = [167900, 181011, 78822, 99381, 221219, 296033, -165208, 395149, 101280, -50040, 169794, 28172, 38783, -23851, 149702, 60374, 48146, -78138, -27785, 186644, -210765, 75329, 199349, -53585, 495437, 260755, -182685, 214361, 114951, 117099, 350830, -143716, -6021, 24540, -12784, 305402, 278890, 290427, 281401, 221782, 115577, -176708, -22602, -107238, 366622, -81148, 231122, -9551, -26956, 119768, 297629, -98619, -29658, 22601, 197437, 367227, 118671, 290086, 101681, -105846, -251289, 201598, -51285, 96322, 98557, -58442, 145183, 396789, -226053, 250263, 255471, 170901, 242627, -104673, 232258, 243168, 222429, 104103, 212989, -43268, 249092, -112380, -4069, 144953, 266057, 204461, 3312, 177509, 230751, 19598]
11451a46352O5469B82379A34459c9922D73632A62445J84129e8884A8523K5750
11441D4273K4084C1857J73259A00172a08637A372a1949m0815G9084a46829f497
11429C073J7945J91521j05954d9908I6254Q6327G6937i2941C69104c707j7906
11418b1613k1003H0849K5387L1428H288L26296a75296B45966c92526F3521c04187
11406c89486J06130A23736a62210A3628J06146i8149j43842E6665K42671g4832
11395F4862b33944A61350G2799g0544j68448B00564m9506J27604d01j04255m3082
11384a47738A43841B2522a86456L0569D14070B6412M2583c2608D0781J05964l7430
11373A09315f3765C4681a83097A71188a9120G2350a16187a657m336j61251g7286
$$ y = [-146352, -80883, 282379, 134459, -39922, 473632, 162445, 346574, -58884, 18523, 44273, 68357, 31857, 205116, 100172, -108637, 1372, -11949, -52764, 79084, -146829, -6497, 3073, 21018, 212539, 106585, -49908, 96254, 182581, 76937, -92941, 369104, -3707, -21613, -42616, 80849, 106236, 137664, 8288, 334584, -175296, 245966, -392526, 63521, -304187, -389486, -283356, 123736, -162210, 13628, 119774, -98149, -241991, 56665, 299336, -74832, 64862, -233944, 161350, 72799, -70544, -238992, 200564, 151058, 278662, -401, -104656, -147738, 143841, 22522, -186456, -155887, 414070, 26412, 68995, -32608, 40781, 146745, 109315, -63765, 34681, -183097, 171188, -19120, 72350, -116187, -1657, -5993, -167244, -77286]
11361a21946f120A5179c0401B33675c2544F3628P8814L4555a57972f9068j15755
11350a84823a6325B9004a09314L4745k87980J29070h8143k4730A35247k5501m5361
11339F4385J98120a55755a0568A07754c5724D9342P8593A7585L94421d79825a72083
11327a33565N6132G3941J17014K12360a51652L2102e7403A60500l8649J77976
11317B99827g2535l0234I1458D3684K67307a07575C8835b02346K7691P4156k0690
11306a21189G9814C922K01966C3842R3612R4370K2755b0174j16577A44103a73083
11294c0685k05532A6006e7800q9881K8534B11792f5976Q510A10844l9611J01640
11283A72873G4300e6755j6154Q811D76858c85979A41986G004Q6358C8394b33280
$$ y = [-121946, -6120, 15179, -30401, 233675, -32544, 63628, 142442, 176997, -157972, -69068, -184823, -16325, 29004, -109314, -74569, -362549, -233479, -88143, -112873, 135247, 109746, 64385, 262505, -155755, -10568, 107754, -35724, 49342, 127935, 17585, 412006, -479825, -172083, -133565, -77433, 73941, 190955, 403315, -151652, -119550, -57403, 160500, 121851, 299827, -72535, -102769, 91458, 43684, 310991, -107575, 38835, -202346, -174655, -100499, -121189, 79814, 3922, 205888, 33842, 127454, 221824, 244579, -20174, -136751, 144103, -173083, -30685, -236217, 16006, -57800, -147681, -119147, 211792, -65976, -57466, 110844, 71233, 172873, 74300, -56755, -72909, -64098, 476858, -385979, 141986, 7004, 93362, 38394, -233280]
11271A41639c9819G6019d5151p1192E6771a15158m0559n8684a03811A47439b76386
11259F6207b62734b4502I5147a35536A60548a24754O2008j37906A1788h3706l3039
11248a16745l12789J53576a4961I1925a6875j52108o119a3814A5828a613j99310
11237b00923n6998c7192n3218I4594a12506j11377N9286B91378b06979D7016J24580
11226A71596f1337k50480B10036b42719I8745j5438l4940J00088P1810f472j00680
11215a07152n2308j22920A06807a08166I1867J41065B2768b9932o8160j11296
11205b09388d6698C40M7909J6706b47459K8738k3517A98146k9998A5196g6617
11193B28425R1218a68630a4596P177j68906P0619B27106h5983J5868g570H6777
$$ y = [141639, -39819, 76019, -45151, -116343, 56771, -115158, -155717, -214401, -103811, 147439, -276386, 66207, -262734, -24502, 95147, -135536, 160548, -124754, -62746, -200652, 11788, -83706, -116745, -429534, -275958, -14961, 91925, -16875, -168983, -175102, -13814, 15828, -1613, -200923, -257921, -37192, -90410, 94594, -112506, -223883, -164597, 291378, -206979, 47016, 171596, -61337, -311817, 210036, -242719, 98745, 83307, 48367, 148455, 220265, -6472, -107152, -159460, -282380, 106807, -108166, 91867, 232932, 22768, -29932, -98092, -209388, -46698, 340, 48249, 64955, -247459, -218721, -242238, 198146, 168148, 15196, -76617, 228425, 319643, -168630, -14596, -7419, -176325, -105706, 227106, -85983, -70115, -7570, 86777]
11181a87361H0275c13322q9216A23196c3315A287b28249A4022a38414J9410I0078
11169d1260N947l9837E6624A0355J63316J21888d0787o7471j8403D6072h438j7275
11157b5713I5580a9237A80998c5625j25143C36545a39507E1062a5757D9362f06249
11145A35216b95818P9452h0081j14524B59695a69615A22150n7200d6080A49629
11134a89303G4523a89243B49123H6990Q8011c2742l08273a23051A81062D9267
11123A39952Q045m5269M9052a08584k20012B25498A00512h4346B06149B6280M6328
11112G2608J59776M6848H9303L54361A60888J25039b6928B66015F6490N62323
11102F28813k94305F2564P8072K3325p4953J1812I55d2021A97626J01624K56385
$$ y = [-187361, 80275, -313322, -402538, 123196, -33315, 1287, -228249, 14022, -138414, -119004, 90078, -41260, -35313, -75150, 56624, 10355, 173671, 295559, -40787, -108258, -126661, 46072, -8438, -25713, 95580, -19237, 180998, -35625, -160768, 336545, -139507, 51062, -15757, 49362, -606249, 135216, -295818, -216366, -80081, -194605, 259695, -169615, 122150, 64950, -46080, 149629, -189303, 74523, -189243, 249123, 86990, 175001, -32742, -341015, -123051, 181062, 49267, 139952, 147997, 102728, 151780, -108584, -328596, 225498, 100512, -84346, 206149, 26280, 72608, 232384, 279232, 89303, 443664, 160888, 285927, -26928, 266015, 66490, 628813, 334508, 62564, 140636, 163961, 89008, 100820, 955, -42021, 197626, 299250, 555635]
11091E55635A92328k8741J41053j12239K66039k07466I8232B9723J78133E0818
11080F2644A6362L37282j08328L02124k25387J02303r6473p4986K38722K40935
11070G32554C24855q7738m6183O8259L6144o3303L21243j18222m3644J16457j91060
11059C16808O6871M16466r2438j0472J09282k19076K14415L57898m32816P2499
11049G99437N5648k44784M15329l57872K62389J7210l4768k197j55310j42855
11039F12227Q834r887K29587r7288j81177J92901j46140Q4555J1304k6224J33456
11028H12148j97162L58202j67733j85901l0639K69068k09646J1240K94208j68532
11018G85253j3706k85232L29386M0009k54174J02431k5866j55834K48420L568
$$ y = [555635, 192328, 163587, 304640, 192401, 458440, 250974, 98232, 29723, 207856, 50818, 62644, 16362, 353644, 245316, 547440, 322053, 424356, 327883, 252897, 491619, 732554, 324855, 237117, 190934, 259193, 295337, 232034, 553277, 435055, 391411, 507868, 316808, 383679, 800145, 707707, 697235, 806517, 587441, 801856, 1159754, 726938, 799437, 855085, 610301, 1025630, 667758, 930147, 947357, 912589, 910392, 755082, 612227, 621061, 611174, 840761, 743473, 562296, 755197, 609057, 693612, 704916, 678692, 812148, 614986, 973188, 805455, 619554, 588915, 857983, 648337, 659577, 953785, 785253, 771547, 486315, 815701, 855710, 601536, 703967, 678101, 522267, 770687, 774255]
11008G74255m0983J80117k93375J98546M7920n0741N4285j22633k18593K11071
10998G39869m2503R8980M5123K1369j89527j79259N1282L48449Q3048j07343J37987
10987A007475N4992l45185L36287M4285J17539K11883j21589m9851L97205J69042
10977A822083K55493J02270K20760P68233q4196N25753l49456L38087l6185l26282
10967C236560o43445J30761q61785L16602j81953l41320K88073n47611P33437
10958B129319k77504k66204j03765j17074k91099L86859F91206J21339j78039
10949F34506J0389k54892K96409B30119K24264A70118a52042B30024R0834j54948
10939A65910m2047M65927j53644C8721K42694c2953O069H2148f8915b3213k44952
$$ y = [774255, 733272, 913389, 620014, 818560, 866480, 815739, 870024, 747391, 528798, 739869, 697366, 796346, 841469, 862838, 673311, 494052, 545334, 893783, 976831, 869488, 1007475, 1062467, 717282, 1053569, 1097854, 1215393, 1427276, 1305687, 1255836, 1653041, 1822083, 2077576, 2179846, 2400606, 3168839, 3084643, 3610396, 3260940, 3599027, 3562842, 3236560, 2593115, 2723876, 1862091, 2178693, 1996740, 1655420, 1943493, 1395882, 2129319, 1851815, 1585611, 1481846, 1364772, 1073673, 1460532, 691206, 812545, 634506, 644895, 390003, 686412, 230119, 454383, 170118, -152042, 230024, 320858, 165910, 123863, 589790, 436146, 38721, 281415, -32953, -26884, 82148, -68915, -23213, -268165]
10928b68165R4628B29094Q6727j49316M9272j6799M9314J47886j74758Q331L1955
10917B61706a72659j96256J54449E6878N937l0108M1810a08543j70138k3608a49759
10905i8561o6089j19514e6722B69010c08880h2275b7377m7551j12736h726G0949
10893F8754a46742M4504a4184B10753E5424e6094B6792h5656j10074F0899L9423
10882A00322J02663a70732A46258F7065A3829b15682O5605A95252I3538M2021
10872A35559L512c80672a16314E0136J17096k9247J52107i0724G4809e1094k28427
10861b79521f3203r3892j72461L8170J23036j22356I5897e4920o5899j21691b8217
10849f8329A4173K15781a91709C36546b35042b3468D3709J05346m2002b0997j9761
$$ y = [-268165, -173537, 229094, 315821, 166505, 215777, 198978, 248292, 396178, 221420, 229751, 261706, -172659, -368915, -214466, 56878, 62815, 32707, 74517, -108543, -278681, -302289, -149759, -98561, -164650, -284164, -56722, 269010, -308880, -82275, -27377, -74928, -187664, -8726, 70949, 68754, -146742, -102238, -14184, 210753, 55424, -56094, 26792, -85656, -195730, 60899, 100322, 202985, -170732, 146258, 67065, 13829, -215682, -150077, 195252, 93538, 135559, 139071, -380672, -116314, 50136, 167232, 137985, 290092, -90724, 74809, -51094, -279521, -63203, -157095, -329556, -291386, -168350, -290706, 95897, -54920, -120819, -242510, -28217, -68329, 14173, 229954, -191709, 336546, -235042, -23468, 43709, 149055, 107053, -20997, -40758]
10838d0758j71019A40661F7890e9099E2445a16560A05502J04079I6819d1752A40393
10826A09036R6960c078B01576f4915j29989O8910m9042r0115Q0604M4205j08609
10815b48951C63772b01082m6371P4565r0634I996b91193H929J8654a48847C4950
10803b81511D1538P1994a20176d593G0624c05113c8992B24086G7432N9108D9020
10791a40808j08229j99807a44139P0536H446J29721L48756d24370c4906A49080
10780a06852A38167l1741J12119B126O027N8103L5540c650A59688F6415b6968
10768a66869A15401d1260D3178a73436A00683d45l68329a20107e945C99698A75962
10756a65320A8124J34289c1651j0852j14440G1646c8189F0066k5052J38354l9813
$$ y = [-40758, -211777, 140661, 67890, -59099, 52445, -116560, 105502, 209581, 96819, -41752, 140393, 109036, 205996, -3078, 201576, -64915, -194904, -125994, -175036, -265151, -184547, -140342, -248951, 363772, -201082, -247453, -172888, -263522, 9996, -291193, 8929, 27583, -148847, 34950, -281511, 41538, 113532, -120176, -4593, 70624, -305113, -38992, 224086, 77432, 136540, 49020, -140808, -249037, -448844, -144139, -73603, 8446, 138167, 486923, -424370, -34906, 149080, -106852, 138167, 106426, 218545, 2126, 8153, 66256, 101796, -3650, 159688, 66415, -26968, -166869, 115401, -41260, 43178, -173436, 100683, -445, -368774, -120107, -5945, 399698, 175962, -165320, 18124, 152413, -31651, -42503, -156943, 71646, -38189, 60066, 35014, 173368, 133555]
10745A33555C2844A2250L33916b55320K2346F1221b18435A81287b39063A96594
10734b31529B05469a02336A5615L864a40646r1109j07746J11828B015b9892l91559
10723d21451R4291A11654n3850c2131A44400D8469J48543q0322R132E5039c31362
10711b12737A1184L08740K3148o8458d35845a63855O897B5726c07663a01234B2209
10699B06690c3317p8570e4547b760j8032C14543b77092f1070l3332l5272j05707
10688b35381C94150a6120I4697P3261p1944J3498a39611B44447b02365c5762j97487
10677b33249B63344a39412M213c8498D22842d25225i6719C12803c01675a19909
10666a69643j73513a7079C30101a43505A47266O346G6132i7364k55264I5102j3917
$$ y = [133555, 32844, 12250, 346166, -255320, -232974, 61221, -218435, 181287, -239063, 196594, -231529, 205469, -102336, 15615, 19479, -140646, -231755, -339501, -227673, 2015, -29892, -421451, -327160, 111654, 57804, -32131, 144400, 48469, 197012, 116690, 125822, 55039, -331362, -212737, 11184, 319924, 343072, 274614, -435845, -163855, -156958, 25726, -307663, -101234, 22209, 206690, -33317, -111887, -54547, -2760, -20792, 314543, -277092, -61070, -94402, -129674, -235381, 394150, -16120, 94697, 167958, 96014, 109512, -139611, 244447, -202365, -35762, -233249, 263344, -139412, -135199, -38498, 422842, -425225, -96719, 312803, -301675, -119909, -169643, -343156, -17079, 330101, -143505, 147266, 153612, 76132, -97364, -352628, 95102, 81185]
10655H1185M4536a9094k0321B10060a2135J471j16514M5424B59778I7785a11484
10643b33230J16544O091A7983a22168p9650R3344c4071l04876c1954l7072C55510
10631C24303B7667J12400n3922j816A2236g4603q8867A61852c16203A32281a5948
10619A20532D9640b1771l15545e2945F1895a76224C7710L60847b57085h9183b2906
10607e6451j56544b8986j83527N948E1607g9158F5389B6489B717b18212h6602
10595A15692D6041c11682R6961B06042h030C93629f0836a0158E3016b02139B9288
10583F5663L7313g8832B4894a72497H9753A4968J02844f0211k1194A69062a68086
10571b79523A62552c4491G2378a24021A09902A0908Q3580i497A83188f3493j59478
$$ y = [81185, 125721, -19094, -39415, 210060, -12135, -10664, -127178, -81754, 259778, 97785, -111484, -233230, -116686, -110595, 17983, -122168, -201818, -108474, -34071, -338947, -31954, -69026, 355510, 324303, 27667, 140067, 86145, 84329, 12236, -74603, -163470, 161852, -316203, 132281, -15948, 120532, 49640, -21771, -337316, -52945, 61895, -176224, 37710, 398557, -257085, -89183, -22906, -56451, -212995, -28986, -212513, -206565, 51607, -79158, 65389, 26489, 2717, -218212, -86602, 115692, 46041, -311682, -214721, 206042, -8030, 393629, -60836, -10158, 53016, -202139, 29288, 65663, 102976, -78832, 24894, -172497, 89753, 14968, 117812, -60211, -81405, 169062, -168086, -279523, 162552, -34491, 72378, -124021, 109902, 10908, 94488, -9497, 183188, -63493, -222971]
10560b22971N1515B58244i1530n2289C3433b7046j58749b0948E178a0613B50948
10548a67542p5119O9165q3951b0305m129l6827k08484f5874H1061B9821J17052
10537A46873a56822d1056l1794r8246G5547a57493M7781E03603a81176P9560J9342
10526h2274c1223F0962c35802A18533K3014a98578N3347A36400a75206C2454b5851
10514a93666A54915l7904P3511c80875A1407R356b8800A92417g2660q6019J298
10503a57381a6319r8019D5573L615g1464A08020c7519J5952j14887A82788d782
10491a13158L3550F100a765k85646a21176e8249k06421I5670J00187a03845C7728
10479A71055C1600K7777c7732A87872R5963b16501A42993d8833C34322m4987a87650
$$ y = [-222971, -171456, 258244, -91530, -143819, 33433, -27046, -185795, -20948, 5178, -10613, 250948, -167542, -242661, -173496, -257447, -20305, -24434, -61261, -269745, -65874, 81061, 29821, 146873, -156822, -41056, -72850, -171096, 75547, -157493, -109712, 503603, -181176, -101616, -82274, -31223, 60962, -335802, 118533, 141547, -198578, -145231, 136400, -175206, 32454, -25851, -193666, 154915, 117011, 190522, -380875, 11407, 20763, -28800, 192417, -72660, -158679, -157381, -16319, -114338, 45573, 49188, -71464, 108020, -37519, -21567, -136454, 182788, -4782, -113158, -79608, 6100, -1765, -287411, -121176, -58249, -264670, 95670, 195857, -103845, 37728, 171055, 31600, 59377, -37732, 187872, 283835, -216501, 142993, -48833, 334322, 289335, -187650]
10467B51450C0454K648L677J05518d0803g422k88381i385l6563B3543a13175l9163
10455a52338e6191j09159B35282a98577M6082P6094A8441b1248k3724l6318C99953
10443A53820D5115K18521J6822F7510a59559A69667c76915J21121J06911j61869
10433c10752b4151B51208b22119B40458a61284P5359l89372a67845B32128c44929
10422b5407j63402d3285G7341C5310j983b55237B27585L3755i7974H5326c2716
10410a14114k9183H4555k7110e2942B26214a9135q2331H6315c36387O5826J10736
10399a59825c2641B77863C4440d8643B96796Q5902j11869M2485H1659h1268A74407
10387C3949P5847O4898B5159H322M8039O0541C4081O53824j56842A55732k2695
$$ y = [251450, 30454, 33102, 36779, 142297, -40803, -7422, -295803, -9385, -45948, 23543, -113175, -152338, -56191, -165350, 235282, -198577, -152495, -76401, 18441, -21248, -44972, -81290, 399953, 153820, 45115, 263636, 280458, 67510, -159559, 169667, -376915, -255794, -148883, -310752, -24151, 251208, -222119, 240458, -161284, -85925, -475297, -167845, 232128, -344929, -25407, -188809, -43285, 77341, 35310, 33327, -255237, 227585, 261340, -97974, 85326, -32716, -114114, -143297, 84555, 57445, -52942, 226214, -19135, -101466, 86315, -336387, -270561, -159825, -32641, 277863, 34440, -48643, 296796, 382698, 270829, 313314, 81659, -81268, 174407, 33949, 109796, 174694, 25159, 8322, 56361, 116902, 34081, 687905, 531063, 155732, 133037]
10376A33037J72449q4199m1972K179P7101J25551F3593L72133j76662Q5685K30162
10365E74911A53036M77673A83006M54609A00804K5572L19928j13486A14022J82452
10355B96474n0394q6349K69180J01227L3631B36201L15401k03442K15926B58074
10344G07822G1162L15320A55412n0139K39945j16821r4306l8072J58879G3586
10333b12243A39824D0047a17794B97216j17459q697h0985K0281E59429F7466a5939
10321A30903M09887r6284c87o6896b8294j5472B76615j06696f4804B43552a36598
10309B8175J06370P8458a32573C9681b58674E40562A2779J39746O6215A2554b25690
10297f7413C6620d8424l88803a72212B39792j05743P0308C5295j5925b29202P7156
$$ y = [133037, 305486, 221287, 179315, 181494, 258595, 384146, 63593, 435726, 259064, 344749, 574911, 153036, 630709, 183006, 637615, 100804, 126376, 446304, 332818, 114022, 296474, 246080, 159731, 428911, 530138, 563769, 236201, 551602, 348160, 564086, 258074, 707822, 71162, 386482, 155412, 105273, 345218, 228397, 134091, 96019, 254898, 73586, -212243, 139824, 40047, -117794, 297216, 179757, 171060, -80985, -60704, 559429, 67466, -15939, 130903, 540790, 444506, -387, -67283, -28294, -43766, 276615, 169919, -64804, 243552, -136598, 28175, 134545, 213003, -132573, 39681, -258674, 540562, 12779, 152525, 218740, 12554, -225690, -67413, 36620, -48424, -437227, -172212, 239792, 134049, 204357, 35295, 19370, -229202, -152046]
10286a52046p3371I095g5144q9200A93479c4573k4021l0346A1165a17391N1734
10275f5657p7363b4683C47595b71487B5740R9674A7771J50934C7073G072L00063
10264C07135k2128j40641Q0697J08504A30473K16065J02410A95700b31234B7231
10253B7625J47409c13015B59494c09488A15061J0712c6666j04419E9303d0862
10242F4833K0703e2267j0772j5878m2789m3056O5219o8921A7656a07412B36180
10230B0830a55423d6445j23840L7217B26742e8553k8254c722m2334A7604b81921
10218a96387b2314A6942h4422C6375i6729k6749N0872p6684E3837b92564M0513
10207b52051G6383J82505b23136D7350K32682A08517a84414f4844j23132C14871
$$ y = [-152046, -225417, 9095, -75144, -164344, 193479, -34573, -58594, -88940, 11165, -117391, -65657, -143020, -24683, 347595, -271487, 25740, 125414, 17771, 168705, 37073, 7072, 307135, 285007, 144366, 225063, 333567, 130473, 346538, 448948, 195700, -231234, 27231, 27625, 175034, -313015, 259494, -309488, 115061, 125773, -36666, -141085, 59303, -40862, 64833, 85536, -52267, -63039, -78917, -121706, -164762, -99543, -168464, 17656, -107412, 236180, 20830, -155423, -46445, -170285, -133068, 226742, -58553, -86807, -3722, -46056, 17604, -281921, -196387, -22314, 16942, -84422, 36375, -96729, -123478, -72606, -149290, 53837, -292564, -252051, 76383, 258888, -223136, 47350, 280032, 108517, -184414, -64844, -187976, 314871]
10196a76885p3400a06230L7731Q354j48040k3837B64580A4046M8354B883a11361
10184A3117b12876b424A39594N9334B0048J13132b34217R6714f7621F6223a15928
10172I9704a63758A85151a47768j05347G9300i0857A30501h0116A014a55133n3204
10161b08337j05915A38071g419k21523g1395j05022j00441b6055B26461a04221
10150G3259J53353n3375c24213J32250L0207j0352B6754a50915a4224B68597F7847
10138f1780E4857a64491O162H1450e6958A41509a84342p2343B4369r175J12680
10127A27874c56482D7401D98L6686a67079O3713c4687G8411a56483K5830j42137
10116b72790N847A72934c4611k6433l69511I2740i9855A65648J70813c21327G4872
$$ y = [-176885, -250285, -106230, -68499, -60145, -208185, -232022, 264580, 14046, 62400, 2883, -111361, 13117, -212876, -2424, 139594, 198928, 20048, 133180, -234217, -137503, -67621, 66223, -115928, 99704, -163758, 185151, -147768, -253115, 79300, -90857, 130501, -80116, 1014, -155133, -208337, -314252, 138071, -7419, -228942, -71395, -176417, -276858, -26055, 226461, -104221, 73259, 226612, 173237, -324213, -191963, -161756, -172108, 26754, -150915, -14224, 268597, 67847, -61780, 54857, -164491, -158329, 81450, -56958, 141509, -184342, -256685, 24369, 15194, 127874, -356482, 47401, 498, 37184, -167079, -103366, -34687, 78411, -156483, -130653, -272790, -266943, 172934, -34611, -61044, -430555, 92740, -99855, 165648, 336461, -321327, 74872]
10104a00022A30838a4470B2725a51104B32991p122q0975h087A1343J80377a75660
10092G854a82919o1744a17952n8714k5933j77971a83375l5661H0549A4419K99579
10081C13998a28775H0663a45848A31107b04137j44000G8210d97395a66583Q2976
10071h3607q7163h1348H5219c12215B3809L37670H4382i0456A11868d7943a0773
10059h5169j02184A44925J67053j02107f3947j36600A0844h6109a4787k6936A5545
10047A78268d5995q424m2967E642P7600a74113c1383j35222o2961j43292B8411
10035I3798b68175A1475d85745D7153f8921B996J39029k5794n3372d8074D280
10023d4520B13296a95456a0778j00881l111M0686l314j69159d7169D30537e5734
$$ y = [-100022, 130838, -14470, 22725, -151104, 232991, 225869, 144894, -8087, 11343, 191720, -175660, 7854, -182919, -244663, -117952, -176666, -202599, -380570, -183375, -219036, 80549, 14419, 313998, -128775, 80663, -145848, 131107, -204137, -348137, 78210, -497395, -166583, -83607, -170770, -81348, 85219, -312215, 23809, 361479, 84382, -90456, 111868, -47943, -10773, -85169, -187353, 144925, 311978, 209871, -63947, -200547, 10844, -86109, -14787, -41723, 15545, 178268, -45995, -54419, -97386, 5642, 83242, -174113, -31383, -166605, -229566, -372858, 28411, 93798, -268175, 11475, -485745, 47153, -68921, 2996, 142025, 116231, 62859, -48074, 4280, -44520, 213296, -195456, -10778, -111659, -114770, -74084, -77398, -246557, -47169, 430537, -55734]
10011b6492j94743a2992C23779A16746E1523e720j07026J7386j95211B7030J19813
10000A46843p1443a22416e9579F5020i4512G9402a15334o3780j79443a02069p2226
9989a74295a9565B30822B6463K1527c1327l0852j67079B29870a46350A32728g2348
9977b03131g1884K3835A50858b9923k35500C60893A18718m3600k2643P9418f2585
9965a10398A35556F0981b75809e5044j5370A80415a477p0268B3848D572e5977
9953B11353J26179c72151G3316Q6014J32895b3815C36681i6351b5551B02889b93056
9941b50714a06179H0307c67314A47367k7493B0820b4577k13048B13184a64740
9930b05368I9753A4694a04663l27077B5553b35708H9165j7265d7473q9872M9301
$$ y = [-26492, -221235, -12992, 323779, 116746, 51523, -5720, -112746, -95360, -290571, 27030, 146843, 75400, -122416, -59579, 65020, -94512, 79402, -115334, -179114, -358557, -102069, -174295, -19565, 230822, 26463, 47990, -31327, -62179, -229258, 229870, -146350, 132728, -72348, -203131, -71884, -48049, 150858, -29923, -265423, 360893, 118718, 75118, 52475, 131893, -62585, -110398, 135556, 60981, -275809, -55044, -70414, 180415, -1477, -71745, 23848, 4572, -55977, 211353, 337532, -372151, 73316, 159330, 292225, -23815, 336681, -96351, -25551, 202889, -293056, -250714, -106179, 80307, -367314, 147367, 119874, 20820, -24577, -237625, 213184, -164740, -205368, 99753, 14694, -104663, -431740, 25553, -235708, 89165, 71900, -47473, -137345, -88044]
9919h8044l77666A10812d0632A4894M9507M4374b84355R6957b8881B21554a20878
9907c66104a80938e6980A27535h4590l0933D0672M0721b06527f7694A05925f860
9895b3144k4437I3235a27644K5384d9705A49606a9473j6726n886j42998K8356
9884a56727j86572J2159B21473c22062M8265A03000d6416A12421a55457c0100
9873b10115g2397D1540b67179i72B64183b47860N6557e6933p6736a02p8987j13321
9861a92410b1651k10261G9911g5489B2380P7342J74028D2816a28402N6092k246
9850g4556k02790j04029A66993a22297I1692h016p989A5991b90252a43648N6361
9839h7287F1501h2821p9556E4303b06726e8971k51681d642l25969A06756c63653
$$ y = [-88044, -465710, 110812, -40632, 14894, 64401, 108775, -284355, -187398, -28881, 221554, -120878, -366104, -180938, -56980, 127535, -84590, -115523, 40672, 81393, -206527, -67694, 105925, -6860, -23144, -47581, 93235, -127644, -102260, -49705, 149606, -19473, -36199, -42085, -185083, -156727, -343299, -331140, 221473, -322062, -273797, 103000, -46416, 112421, -155457, -30100, -210115, -72397, 41540, -267179, -972, 264183, -247860, -191303, -56933, -133669, -102, -79089, -192410, -21651, -231912, 79911, -75489, 22380, 99722, 273750, 42816, -128402, -72310, -74556, -277346, -381375, 166993, -122297, 91692, -8016, -16005, 15991, -290252, -143648, -87287, 61501, -82821, -162377, 54303, -206726, -58971, -310652, -4642, -330611, 106756, -363653]
9827A99582a31759l3809J1023A96244c9877j80166K8204f0845F1099b39283i0199
9815D2576h9795C57503j07802b87290c0018r0838a7907k51191B34692h1063L5308
9804d5755h214j42803j30917A51164f9908r1290G7409k7960a51776A04168J9377
9793A23545J26380c58289f7082c1485A37720a22571D5767N3837i5634p8226A6189
9781a59630j5716m8531A09927m1835b05932c8614r2591b8554m3759c2811j74989
9770b07800A4254i256A07203A3548f2212A18257d07608K00734A21543a3901p1850
9759h5751A33637L00481A60178G5655F801K04223F5273b76978O7044a6641j63533
9748a80174a915m03547a49963j86346E7668a51175p239A0067a84628B43213j05520
$$ y = [199582, -131759, -165568, -154545, 196244, -39877, -220043, -191839, -60845, 61099, -239283, -90199, 42576, -89795, 357503, 249701, -287290, -30018, -120856, -17907, -269098, 234692, -81063, -45755, -8214, -151017, -281934, 151164, -69908, -161198, 77409, 49449, -151776, 104168, 123545, 249925, -358289, -67082, -31485, 137720, -122571, 45767, 99604, -95634, -173860, 16189, -159630, -175346, -223877, 109927, 68092, -205932, -38614, -131205, -28554, -72313, -32811, -207800, 14254, -9256, 107203, 13548, -62212, 118257, -407608, -206874, 121543, -13901, -85751, 133637, 434118, 160178, 75655, 6801, 211024, 65273, -276978, -209934, -16641, -180174, -1915, -405462, -149963, -336309, 57668, -151175, -158414, 10067, -184628, 243213, 137693]
9737A37693q919O244K9683h4604b9697D41016a85270M1800A37255a58940K0858
9726a38082j42279H0523j4512a35401F0733J36461i0581l6110k591A29288a73117
9714b17731C1000e42156c8709j48626K7458A94668c9973j90467f7989B54747I5617
9702f2718c0249n02131A54525b54548J13339E2525b78160h0482k8499a2447j61393
9691a73840E435a2923j84921b3258c398m54878A27001i4571B42385Q7010A58239
9679D4768O5636f598A89125D3537e9001q3945O6963j6286A21783c03586C36763
9667a23170A58381p7647f2651l6845C4207j6974c0645C185a020A5232J22743D1970
9654a14224E5377a90173m2646j74933b7525j01116c0716j02102r8438A21955G586
$$ y = [137693, 128774, 135018, 164701, -84604, -29697, 441016, -185270, -143470, 137255, -158940, -138082, -280361, 80523, 66011, -135401, 60733, 197194, -90581, -126691, -129282, 129288, -173117, -217731, 31000, -542156, -38709, -187335, -159877, 194668, -39973, -230440, -67989, 254747, 95617, -62718, -30249, -532380, 154525, -254548, -141209, 52525, -278160, -80482, -108981, -12447, -173840, 5435, -12923, -197844, -23258, -3398, -458276, 127001, -94571, 242385, 329395, 158239, 44768, 110404, -6598, 189125, 43537, -59001, -142946, -75983, -92269, 121783, -303586, 336763, -123170, 158381, 80734, -62651, -99496, 34207, 17233, -30645, 3185, -1020, 15232, 137975, 41970, -114224, 55377, -190173, -232819, -407752, -27525, -128641, -30716, -132818, -231256, 121955, 7586]
9642b95053D3127L9216b90165K0059K790B88088E9975j0609B867b28730J1717
9631b17013i5766P786B50287a89977i3638A16041a40469B23555I0587K2185d12940
9619b06931d531A35716B203a83316c7037A2389J60941k9822a6029B54282H9160
9607e2552o0455d8718A9775h9833O059n8841B00382a77598B67913a7708A36968
9595c71937a65035C0226k577a61942f7023k4039I2653e71276D4963J7133a12847
9583c58836A17772b00371M2607N8522F6301c68929J14647g0249k10949i4956C77848
9571C5347J65058a20525b0536m13317a36901e1347H2982b77059b2330A02608K52845
9560C55453a58443B1906a27725A23282a41213O9447k6616l034D6242a10630j49324
$$ y = [-295053, 43127, 82343, -290165, -270106, -267316, 288088, 59975, 49366, 2867, -228730, -217013, -95766, -87980, 250287, -189977, -93638, 116041, -140469, 223555, 90587, 112772, -412940, -206931, -4531, 135716, 2203, -183316, -37037, 12389, 173330, 143508, -16029, 254282, 89160, -52552, -113007, -48718, 19775, -89833, -83774, -142615, 200382, -177598, 267913, -17708, 136968, -371937, -165035, 30226, 27649, -161942, -67023, -91062, 92653, -571276, 44963, 62096, -112847, -358836, 117772, -200371, -157764, -99242, 66301, -368929, -254282, -70249, -281198, -94956, 377848, 35347, 200405, -120525, -20536, -433853, -136901, -51347, 82982, -277059, -22330, 102608, 355453, -158443, 21906, -127725, 123282, -141213, -71766, -98382, -101416, 46242, -110630, -259954]
9549b59954d0673C1298a58347g6535C9812J8504a39717F2961J59107b74602A26669
9537h026n4016l24789I4180a78108A25641c4157A9373g6547h086k92408e8449
9525a24631l17847c2200o4518j06135C03073a92145d7366C52376e1238A62b5150
9513b60794J06973E072a27877j2432A85962b41333F8850J6778b47534A12907k7361
9502H5546A2508f4054r5554k7051j6045A9442J490a40367A93726J26871A8255
9490A80629b25097f5307q0022H2064a29021r6012e6988E6500l081a6758j57981
9479a74739k79837a70464C9089b18592j0111J13750j61724a25243j20933d6344
9468A20318h6243k97576J58982f4976H7803e9746j30821D2843h9094A22356a11050
$$ y = [-259954, -40673, 31298, -158347, -76535, 39812, 58316, -139717, 62961, 222068, -274602, 126669, -8026, -62042, -386831, 94180, -178108, 125641, -34157, 19373, -76547, -8086, -300494, -58449, -124631, -442478, -32200, -96718, -202853, 303073, -192145, -47366, 352376, -51238, 162, -25150, -260794, -153821, 5072, -127877, -140309, 185962, -241333, 68850, 85628, -247534, 112907, 85546, 12508, -64054, -159608, -186659, -202704, 19442, 20932, -140367, 193726, 320597, 18255, 180629, -225097, -65307, -145329, 82064, -129021, -225033, -56988, 56500, 53419, -16758, -174739, -454576, -170464, 39089, -218592, -228703, -114953, -276677, -125243, -246176, -46344, 120318, -86243, -383819, -224837, -64976, 87803, -59746, -190567, 42843, -89094, 122356, -111050]
9456D3314a52644r2536A00601b62874R8576d5237q753m7438A0791d9342A78732
9444c06236C46956e9909r1361r5272j32061a4936J226B3786a17831B9453d14630
9432b80658l2593J5882E4639C169d77282J78937K7237g1887j9348A18663b17873
9420A8373J58598G3526d24687R9054b5966o5346E5304c3575a0491B4339b18301
9408C6905a10068j26415A00273b38707C6697f5767j46068h6318J4012l0622I1131
9396i0264K0560A49192g0115I964b0180G8962R2352k4312g9267k08926J23923
9385a64270B9035a7408j81006c7004B7176g086F8915c51344c7041k96407C4542
9373i8193A64775c57395B01146f7940C5741b58012P989K9271C14153b62275J22427
$$ y = [43314, -152644, -245180, 100601, -262874, -164298, -45237, -53990, -101428, 10791, -49342, 178732, -306236, 346956, -59909, -151270, -246542, -378603, -14936, -13710, 23786, -117831, 29453, -414630, -280658, -313251, -297369, 54639, 3169, -477282, -298345, -271108, -71887, -91235, 118663, -217873, 18373, 176971, 73526, -424687, -325633, -25966, -91312, 55304, -33575, -10491, 24339, -218301, 36905, -110068, -236483, 100273, -238707, 36697, -65767, -211835, -86318, -72306, -102928, 91131, -90264, -69704, 149192, -70115, 9964, -20180, 78962, 171314, 147002, -79267, -288193, -164270, 29035, -17408, -198414, -37004, 27176, -7086, 68915, -351344, -37041, -333448, 34542, -98193, 164775, -357395, 201146, -67940, 35741, -258012, -250023, -220752, 314153, -262275, -139848]
9362a39848A5608d3712E0330Q6926b43453A3805a5466F7851e9338a0435B865J5912
9350A8777a73639A81760D4366d30589A11962O9599a24925A50790d2420j35785
9340a78205A23577j0396a61441k1697k1696J5588C215b5352B3000b19144k25768
9329d44912i8086j62032H0191B6397K5723J05356b81351b8292k46927a2006k22230
9318b34236I5794h8410j6139c6512G4998c19567O6363J5109B5096c5476I6024
9306E7058K79627F2587c82965J58653A17145K4018a92068A46319C4598i9630A30147
9294a89127j08441i999l7791k27395P1611P0191A24028c25665C15429C6564d8941
9282e3822k23533k7042L6557B78179c16259A04745D8127f6379E9973k0218J28765
$$ y = [-139848, 15608, -43712, 50330, 137256, -243453, 13805, -15466, 67851, -59338, -10435, 2865, 18777, -173639, 181760, 44366, -430589, 111962, 181561, -124925, 150790, -42420, -178205, 123577, 113181, -161441, -183138, -204834, -189246, 3215, -25352, 23000, -219144, -444912, -98086, -260118, 80191, 26397, 52120, 157476, -281351, -28292, -275219, -12006, -234236, 95794, -88410, -104549, -36512, 74998, -319567, -253204, -238095, 25096, -35476, 96024, 57058, 336685, 62587, -382965, -224312, 117145, 141163, -192068, 146319, 34598, -99630, 130147, -189127, -297568, -9999, -47790, -275185, -203574, -133383, 124028, -325665, 315429, 36564, -48941, -53822, -277355, -304397, -267840, 278179, -316259, 104745, 48127, -66379, 59973, 39755, 168520]
9271A68520m8860A4607d03B81430D5644b20709I7174a0943A40464a56013g6923
9259I2888b34856O0965j37822J36785A91362K18854c3825C20307C4011a58906
9248a46410j08083j07844M4016B06162B7264J28512C3105a49274n7306B6117Q0944
9237A07061l8419a24538j67497i6546j20952O4441A71990J53813c52251D5353
9226a69014h1626j33657G8453b56873f8244A00404a40285j93750a52229F8811
9215b49047g9169p718J3397A16515b13155A54942a77485a4180L588C2851a62887
9203H5793i0413b3764j30061A20664d7820A3418d9473j61255E8548h5975j59834
9192b45809G4756b60779a13435A02375k6328j1740b13091B74597E2322n971b28808
$$ y = [168520, 119660, 14607, -403, 281430, 45644, -220709, 97174, -10943, 140464, -156013, -76923, 92888, -234856, -173891, -311713, -174928, 191362, 410216, -33825, 320307, 34011, -158906, -146410, -254493, -362337, -318321, 206162, 27264, 155776, 33105, -149274, -206580, 26117, 107061, 68642, -124538, -292035, -96546, -217498, -153057, 171990, 325803, -352251, 45353, -169014, -81626, -215283, 78453, -256873, -68244, 100404, -140285, -334035, -152229, 68811, -249047, -79169, -86887, -73490, 116515, -213155, 154942, -177485, -14180, -10592, 32851, -162887, 85793, -90413, -23764, -153825, 120664, -47820, 13418, -49473, -210728, 58548, -85975, -245809, 74756, -260779, -113435, 102375, 76047, 64307, -213091, 274597, 52322, 46351, -228808]
9180b59075J05230N6923m6027c3842F6567a46596A5929g2510j11642F5000J04597
9169A69597b48337f5979H7522I557a62059A921a68134r0773g1965a847j04938
9158a06785j3502Q150k43306c5966A236Q0616B0295g3961l3951E1336e0159j4895
9146f5054j35600L8183P1834C4199K35327r139F734L7346J01546i1281r4571D2347
9133H9445Q558a50592I5021a06784j07473P3067D377P9728l7884O7378C4936b74997
9120d76054A91780a25658C56895a59332B91294b27509q0437A4760a19002j35875
9110b54877Q6585r211f6154k10901d2131k10895G251b98084j803A46933a7775
9098G2999b3344p5640k09722b6298A13530a88696A11823a07569J9331C3404a73869
$$ y = [-259075, -153845, -96922, -142949, -33842, 66567, -146596, 15929, -72510, -184152, 65000, 169597, -248337, -65979, 87522, 9557, -162059, 1921, -168134, -258907, -71965, -1847, -106785, -120287, -112137, -355443, -35966, 1236, 81852, 20295, -73961, -107912, 51336, -50159, -65054, -200654, -162471, -90637, 34199, 269526, 260387, 6734, 44080, 145626, -91281, -185852, 42347, 89445, 98003, -150592, 95021, -106784, -214257, -141190, 4377, 84105, 46221, 113599, 34936, -274997, -476054, 191780, -125658, 356895, -159332, 291294, -227509, -307946, 14760, -119002, -254877, -168292, -177503, -66154, -277055, -42131, -253026, 7251, -298084, -299887, 146933, -17775, 72999, -23344, -98984, -308706, -26298, 113530, -188696, 111823, -107569, -88238, 33404, -173869]
9086a20216C0150e335A068c50532J70377g2144m1378r5616K8431j28988R3624
9075b16071j058A17716a86138A19320a00222k9564J1746c996j48407J6461M9075
9064h6867k56150A81146J49762H8967m0681b1076A40a97217Q5087D39345a93216
9052i4128a2634F0288K14572c0797k35902H311N2359k6004a74386A7794N6239
9041G4033b85210A17598D4193a42229C1177N9722a90859C26869b28521F895b77559
9029d2124k43278J32459A62876b35072I597J55489a57586E2727q846K9994J52859
9018B26734q7967J38930a40700c0598k27856a27399j77952J00425e2594F2814
9007A49179k892K5752j1395c31740d8125d366o2817G1785i7006j80530a09254
$$ y = [-120216, 30150, -5335, 1068, -350532, -180155, -72144, -113522, -209138, -180707, -309695, -216071, -217129, 117716, -186138, 119320, -100222, -129786, -118040, -3996, -152403, -135942, -86867, -343017, 181146, 330908, 88967, 48286, -21076, 140, -197217, -112130, 439345, -193216, -94128, -12634, 60288, 274860, -30797, -266699, 8311, 60670, 34666, -174386, 17794, 74033, -285210, 117598, 44193, -142229, 31177, 90899, -190859, 326869, -228521, 6895, -277559, -42124, -285402, -152943, 162876, -235072, 9597, 165086, -157586, 52727, 43881, 73875, 226734, 138767, 277697, -140700, -30598, -258454, -127399, -305351, -204926, -52594, 62814, 149179, 146287, 172039, 160644, -331740, -48125, -4366, -67183, 71785, -97006, -277536, -109254]
8995a51447O7215q411B3600h392j19358m24873a90533B19222h509r0074A47081
8983h2236j34002E5940Q5710J91492a45292q4264Q6619A396a43093A54277d889
8971A84678a58975M7037j03098o1714L7366H4000B9121K46154a19239b1145p9625
8960a00770A45590A1967a2837p0763j75965P4212P0481K2781B09874H62R4107
8949I4969b57912d1796J6547j74501o4805D7094b33962c3790B10782D1122d0504
8937a35714a6080A54415R0143J7728j22489a79829Q8905A09944d8481I0626J753
8926I2379N14683L37183J826319L856742J0174917q271488C194504A079447A64554
8916D22289J3681a17972C59200A4522J96640J13725h6398B47360q7701P5210e7135
$$ y = [-151447, -84232, -92643, 23600, -8392, -127750, -552623, -190533, 219222, -8509, -98583, 147081, -82236, -216238, 55940, 141650, 333142, -145292, -229556, -142937, 1396, -143093, 154277, -4889, 184678, -158975, -111938, -215036, -276750, -239384, 84000, 29121, 275275, -119239, -21145, -100770, 145590, 11967, -12837, -83600, -259565, -185353, -114872, -92091, 209874, 862, 94969, -257912, -41796, -25249, -199750, -264555, 47094, -233962, -33790, 210782, 41122, -40504, -135714, -16080, 154415, 244558, 262286, 139797, -179829, -90924, 109944, -48481, 90626, 92379, 607062, 944245, 2770564, 6627306, 16802223, 8530735, 3194504, 1079447, 164554, 422289, 435970, -117972, 359200, 14522, 211162, 324887, -86398, 247360, 159659, 234869, -57135]
8904c95344B18373b13651N4384A75326d23429e5583N773B87753A0444J6411a33911
8892c28996E2967a24363j71471i7447F5144b3218A12958d9835D3762Q6688F4338
8880E87J95895c9852r0065C76938b50079r5666A54808A0929g750C8982a56828
8868f0997A26006h2432k8985M3529B71187b49228a3918E6080d7575j27387E1682
8856a45017e5887j9240m6895I707c00497J07929N2364B6932a27291e2840A0000
$$ y = [-395344, 218373, -213651, -159267, 175326, -423429, -55583, -49810, 287753, 10444, 26855, -133911, -328996, 52967, -124363, -295834, -97447, 65144, -23218, 112958, -49835, 43762, 130450, 64338, 587, 196482, -39852, -129917, 376938, -250079, -345745, 154808, 10929, -7750, 38982, -156828, -60997, 126006, -82432, -111417, -67888, 271187, -249228, -13918, 56080, -47575, -174962, 51682, -145017, -55887, -75127, -122022, 9707, -300497, -192568, -140204, 26932, -127291, -52840, 10000]
$$ [...]
##END NTUPLES=NMR SPECTRUM
##END=
