##TITLE=AC1774_ZAMWASH_9683880_mo20mlyxms
##JCAMPDX= 6.0         $$ Bruker NMR JCAMP-DX V2.0
##DATA TYPE= NMR SPECTRUM
##DATA CLASS= NTUPLES
##ORIGIN= BRUKER
##OWNER= Administrator
$$ 1.72 TOPSPIN		Version 2.1
$$ 2016-04-30 13:12:17.333 -0700  Administrator@X
$$ Compression mode = diff/dup
##.OBSERVE FREQUENCY= 400.02188249412
##.OBSERVE NUCLEUS= ^1H
##.ACQUISITION MODE= SIMULTANEOUS (DQD)
##.ACQUISITION SCHEME= undefined
##.AVERAGES= 64
##.DIGITISER RES= 22
##SPECTROMETER/DATA SYSTEM= spect
##.PULSE SEQUENCE= noesygpps1d.comp
##.SOLVENT NAME= COFFEE_meoh
##.SHIFT REFERENCE= INTERNAL, COFFEE_meoh, 1, 14.96069
##AUDIT TRAIL= $$ (NUMBER, WHEN, WHO, WHERE, PROCESS, VERSION, WHAT)
$$ ##TITLE= Audit trail, TOPSPIN		Version 2.1
$$ ##JCAMPDX= 5.01
$$ ##ORIGIN= Bruker BioSpin GmbH
$$ ##OWNER= Administrator
$$ $$ E:\/data/COFFEE/nmr/AC1774_ZAMWASH_9683880_mo20mlyxms/12/pdata/1/auditp.txt
$$ ##AUDIT TRAIL=  $$ (NUMBER, WHEN, WHO, WHERE, PROCESS, VERSION, WHAT)
(   1,<2016-04-16 21:34:55.720 -0700>,<Administrator>,<X>,<go>,<TOPSPIN 2.1>,
      <created by zg
	started at 2016-04-16 21:23:26.189 -0700,
	POWCHK enabled, PULCHK disabled,
       configuration hash MD5:
       21 0F 79 D6 B3 7B B4 F6 88 20 88 DB 03 48 BD 9F
       data hash MD5: 64K
       F3 9B 36 A0 60 58 30 5E 10 F6 94 76 44 89 62 AB>)
(   2,<2016-04-16 21:34:58.861 -0700>,<Administrator>,<X>,<proc1d>,<TOPSPIN 2.1>,
      <Start of raw data processing
       efp LB = 0.3 FT_mod = 6 PKNL = 1 PHC0 = 0 PHC1 = 0 SI = 128K 
       data hash MD5: 128K
       98 6C 7F E6 FF DF BF D5 90 43 63 FC 52 19 24 3F>)
(   3,<2016-04-16 21:34:59.736 -0700>,<Administrator>,<X>,<proc1d>,<TOPSPIN 2.1>,
      <pk PHC0 = -89.01123 PHC1 = 0 
       data hash MD5: 128K
       DB 5F A8 B9 BA DD 5D 61 D1 99 16 2C 1E 70 CE C2>)
(   4,<2016-04-16 21:35:00.095 -0700>,<Administrator>,<X>,<proc1d>,<TOPSPIN 2.1>,
      <abs ABSG = 1 
       data hash MD5: 128K
       75 6B 72 29 E0 91 9D FB 22 F3 7F CD 75 5B D9 EC>)
(   5,<2016-04-16 21:35:00.204 -0700>,<Administrator>,<X>,<proc1d>,<TOPSPIN 2.1>,
      <abs ABSG = 2 
       data hash MD5: 128K
       6C 60 3A FE D6 CB EE 58 82 D3 FE 10 5C D4 48 19>)
(   6,<2016-04-16 21:35:00.283 -0700>,<Administrator>,<X>,<proc1d>,<TOPSPIN 2.1>,
      <abs ABSG = 3 
       data hash MD5: 128K
       0C 30 0E E5 4A DF B3 FB 1F 57 8E F7 EF A0 74 FD>)
(   7,<2016-04-16 21:35:00.376 -0700>,<Administrator>,<X>,<proc1d>,<TOPSPIN 2.1>,
      <abs ABSG = 4 
       data hash MD5: 128K
       1D B4 7E 22 1B 3A 8F E6 95 4B 4E C9 3C F4 74 05>)
(   8,<2016-04-16 21:35:00.470 -0700>,<Administrator>,<X>,<proc1d>,<TOPSPIN 2.1>,
      <abs ABSG = 5 
       data hash MD5: 128K
       25 57 42 96 94 59 C9 B4 C6 F9 3A BB 72 9B 15 32>)
(   9,<2016-04-16 21:35:02.408 -0700>,<Administrator>,<X>,<audit>,<TOPSPIN 2.1>,
      <user comment:
       ICON-NMR User ID: COFFEE
       data hash MD5: 128K
       25 57 42 96 94 59 C9 B4 C6 F9 3A BB 72 9B 15 32>)
$$ ##END=
$$ 
$$ $$ hash MD5
$$ [...]
##$TP07= 0
##$TPNAME0= <>
##$TPNAME1= <>
##$TPNAME2= <>
##$TPNAME3= <>
##$TPNAME4= <>
##$TPNAME5= <>
##$TPNAME6= <>
##$TPNAME7= <>
##$TPOAL= (0..7)
0.5 0.5 0.5 0.5 0.5 0.5 0.5 0.5
##$TPOFFS= (0..7)
0 0 0 0 0 0 0 0
##$TUNHIN= 0
##$TUNHOUT= 0
##$TUNXOUT= 0
##$USERA1= <user>
##$USERA2= <user>
##$USERA3= <user>
##$USERA4= <user>
##$USERA5= <user>
##$V9= 5
##$VALIST= <valist>
##$VCLIST= <CCCCCCCCCCCCCCC>
##$VD= 0
##$VDLIST= <DDDDDDDDDDDDDDD>
##$VPLIST= <PPPPPPPPPPPPPPP>
##$VTLIST= <TTTTTTTTTTTTTTT>
##$WBST= 2048
##$WBSW= 25
##$XGAIN= (0..3)
0 0 0 0
##$XL= 0
##$YL= 0
##$YMAX_a= 6391338
##$YMIN_a= -11580635
##$ZGOPTNS= <>
##$ZL1= 120
##$ZL2= 120
##$ZL3= 120
##$ZL4= 120
##$ABSF1= 14.96069
##$ABSF2= -5.597492
##$ABSG= 5
##$ABSL= 3
##$ALPHA= 0
##$AQORDER= 0
##$ASSFAC= 0
##$ASSFACI= 0
##$ASSFACX= 0
##$ASSWID= 0
##$AUNMP= <proc_prof1d_extract.lims>
##$AXLEFT= 0
##$AXNAME= <>
##$AXNUC= <1H>
##$AXRIGHT= 0
##$AXTYPE= 0
##$AXUNIT= <>
##$AZFE= 0.1
##$AZFW= 0.1
##$BCFW= 0
##$BC_mod= 0
##$BYTORDP= 0
##$COROFFS= 0
##$CY= 15
##$DATMOD= 1
##$DC= 0
##$DFILT= <>
##$DTYPP= 0
##$F1P= 0
##$F2P= 0
##$FCOR= 0.5
##$FTSIZE= 131072
##$FT_mod= 6
##$GAMMA= 0
##$GB= 0
##$INTBC= 1
##$INTSCL= 1
##$ISEN= 128
##$LB= 0.3
##$LEV0= 0
##$LPBIN= 0
##$MAXI= 10000
##$MC2= 0
##$MEAN= 0
##$ME_mod= 0
##$MI= 0
##$NCOEF= 0
##$NC_proc= -2
##$NLEV= 6
##$NOISF1= 0
##$NOISF2= 0
##$NSP= 0
##$NTH_PI= 0
##$NZP= 0
##$OFFSET= 14.96069
##$PC= 1
##$PHC0= -89.01123
##$PHC1= 0
##$PH_mod= 1
##$PKNL= yes
##$PPARMOD= 0
##$PPDIAG= 0
##$PPIPTYP= 0
##$PPMPNUM= 2147483647
##$PPRESOL= 1
##$PSCAL= 4
##$PSIGN= 0
##$PYNMP= <proc.py>
##$REVERSE= no
##$SF= 400.020009762217
##$SI= 131072
##$SIGF1= 0
##$SIGF2= 0
##$SINO= 400
##$SIOLD= 131072
##$SPECTYP= <>
##$SREGLST= <1H.CDCl3>
##$SSB= 0
##$STSI= 131072
##$STSR= 0
##$SW_p= 8223.68421052631
##$SYMM= 0
##$S_DEV= 0
##$TDeff= 65536
##$TDoff= 0
##$TI= <>
##$TILT= no
##$TM1= 0
##$TM2= 0
##$TOPLEV= 0
##$USERP1= <user>
##$USERP2= <user>
##$USERP3= <user>
##$USERP4= <user>
##$USERP5= <user>
##$WDW= 1
##$XDIM= 131072
##$YMAX_p= 390963161
##$YMIN_p= -95991
##$CURPLOT= <Network HP LaserJet P1505>
##$CURPRIN= <$Network HP LaserJet P1505>
##$DFORMAT= <normdp>
##$LAYOUT= <+/1D_H.xwp>
##$LFORMAT= <normlp>
##$PFORMAT= <normpl>
##$SURQMSG= 1
$$ End of Bruker specific parameters
$$ ---------------------------------
##NTUPLES= NMR SPECTRUM
##VAR_NAME=  FREQUENCY,     SPECTRUM/REAL,   SPECTRUM/IMAG
##SYMBOL=    X,             R,               I
##VAR_TYPE=  INDEPENDENT,   DEPENDENT,       DEPENDENT
##VAR_FORM=  AFFN,          ASDF,            ASDF
##VAR_DIM=   131072,        131072,          131072
##UNITS=     HZ,            ARBITRARY UNITS, ARBITRARY UNITS
##FACTOR=    0.0627417313425164, 1,          1
##FIRST=     8223.62146879497, -828,         -67670
##LAST=      0,             2059,            -68112
##MIN=       0,             -95991,          0
##MAX=       8223.62146879497, 390963161,    0
$$ Real data points
##PAGE= N=1
##DATA TABLE= (X++(R..R)), XYDATA
$$ [...]
$$ plain form
63927 4510445 4533240 4524014 4482146 4408312 4304881 4175140 4022262 3849294 3660001 3459130
63917 3459130 3251648 3041924 2833595 2629808 2433216 2245900 2069577 1905829 1755908
63908 1755908 1620296 1498601 1389903 1293098 1206983 1130238 1061506 999537 943374 892572 847213
63897 847213 807461 772934 742593 715312 690386 667389 645818 625192 605404 586670 569144
63886 569144 552926 538336 525720 514847 504874 495233 486286 478930 473808 471096 470696 472231 475041
63873 475041 478595 482843 487926 493686 499772 506053 512639 519633 527206 535681 545049 554500 562942 570051
63859 570051 576402 582580 588529 593712 597460 599120 598336 595345 590728 584879 577995 570394 562248 553115
63845 553115 542394 530294 517620 504562 490500 475310 460037 445820 432850 420779 409412
$$ packed form
63927D510445K2795r226m1868p3834j03431j29741j52878j72968j89293k00871
63917C459130k07482k09724k08329k03787j96592j87316j76323j63748j49921
63908A755908j35612j21695j08698r6805q6115p6745o8732o1969n6163n0802m5359
63897H47213l9752l4527l0341k7281k4926k2997k1571k0626j9788j8734j7526
63886E69144j6218j4590j2616j0873r973r641q947p356n122k712m00J535K810
63873D75041L554M248N083N760O086O281O586O994P573Q475R368R451Q442P109
63859E70051O351O178N949N183L748J660p84k991m617n849o884p601q146r133
63845E53115j0721j2100j2674j3058j4062j5190j5273j4217j2970j2071j1367
$$ plain form
63834 409412 398383 386981 375127 363980 354637 346646 338673 330226 321753 313374 304746 296231 288992
63821 288992 283553 279159 274922 270832 267218 263961 260765 257651 254607 251312 247801 245013 243971 244572
63807 244572 245678 246309 246320 246083 246015 246373 247040 247401 246821 245369 243769 242532 241376 239674 237220 234385 231615
63790 231615 229074 226735 224625 222853 221479 220432 219548 218591 217339 215732 213976 212354 210964 209769 208827
63775 208827 208230 207753 206935 205709 204677 204420 204754 205018 204957 204892 205087 205416 205711 206011 206290 206312 205985 205587 205426
63756 205426 205462 205487 205504 205691 206101 206625 207195 207859 208630 209408 210119 210865 211868 213210 214651 215870 216940 218459
63738 218459 221037 224743 229121 233576 237613 240953 243793 246830 250677 255292 260285 265606 271433 277527
63724 277527 283362 289012 295307 302792 311069 319434 327672 335775 343320 349655 354402 357390 358397 357510
$$ packed form
63834D09412j1029j1402j1854j1147r343p991p973q447q473q379q628q515p239
63821B88992n439m394m237m090l614l257l196l114l044l295l511k788j042O01
63807B44572J106O31J1k37o8L58O67L61n80j452j600j237j156j702k454k835k770
63790B31615k541k339k110j772j374j047q84r57j252j607j756j622j390j195r42
63775B08827n97m77q18j226j032k57L34K64o1o5J95L29K95L00K79K2l27l98j61
63756B05426L6K5J7J87M10N24N70O64P71P78P11P46J003J342J441J219J070J519
63738B18459K578L706M378M455M037L340K840L037L847M615M993N321N827O094
63724B77527N835N650O295P485Q277Q365Q238Q103P545O335M747K988J007q87
$$ plain form
63710 357510 355451 352917 349651 344788 338133 330586 323187 316285 309862 304222 299909 297073 295164 293277
63696 293277 290794 287842 285215 283769 283833 285172 287350 289937 292510 294763 296659 298326 299814 301125 302422
63681 302422 303919 305574 307130 308487 309820 311290 312922 314818 317254 320424 324221 328353 332558 336715
63667 336715 340998 345878 351693 358064 363939 368294 370591 370541 367896 362813 356180 349099 342045 334778 327108
63652 327108 319438 312413 306218 300436 294593 288728 283376 279068 275944 273776 272223 270985 269910 269143
63638 269143 269077 269993 271781 274085 276596 279128 281642 284456 288199 293132 298555 303382 307369 311473 316916
63623 316916 324216 333116 342981 353116 363093 373069 383576 395007 407635 422007 438589 456861
63611 456861 475577 494363 514332 536566 560723 585975 612504 640818 669908 697454 721930
$$ packed form
63710C57510k059k534l266m863o655p547p399o902o423n640m313k836j909j887
63696B93277k483k952k627j446O4J339K178K587K573K253J896J667J488J311J297
63681C02422J497J655J556J357J333J470J632J896K436L170L797M132M205M157
63667C36715M283M880N815O371N875M355K297n0k645n083o633p081p054p267p670
63652C27108p670p025o195n782n843n865n352m308l124k168j553j238j075p67
63638B69143o6R16J788K304K511K532K514K814L743M933N423M827L987M104N443
63623C16916P300Q900R865J0135R977R976J0507J1431J2628J4372J6582J8272
63611D56861J8716J8786J9969K2234K4157K5252K6529K8314K9090K7546K4476
$$ plain form
63600 721930 743310 761441 775031 782954 785616 784285 779775 772620 763903 754856 745786 736150 725596
63587 725596 714257 702051 688355 672545 654526 634732 613970 593229 573234 554186 536229
63576 536229 520070 506619 496015 487474 480249 474377 470347 468368 468187 469381 471632 474798 478826 483550
63562 483550 488618 493852 499582 506382 514439 523419 532957 543014 553762 565477 578640 593849 611417
63549 611417 631268 653334 677848 705124 735260 768146 803521 840720 878373 914402 946232
63538 946232 971220 987470 994754 994674 989704 981980 972895 963434 954457 946489 939302 931862 922820 911230
63524 911230 896837 879616 859172 834852 806501 774898 741394 707302 673644 641242 610780
63513 610780 582754 557355 534433 513749 495394 479777 466887 455828 445563 436036 427986 421618
$$ packed form
63600G21930K1380J8131J3590P923K662j331m510p155q717r047r070r636j0554
63587G25596j1339j2206j3696j5810j8019j9794k0762k0741j9995j9048j7957
63576E36229j6159j3451j0604q541p225n872m030j979j81J194K251L166M028M724
63562D83550N068N234N730O800Q057Q980R538J0057J0748J1715J3163J5209J7568
63549F11417J9851K2066K4514K7276L0136L2886L5375L7199L7653L6029L1830
63538I46232K4988J6250P284q0m970p724r085r461q977p968p187p440r042j1590
63524I11230j4393j7221k0444k4320k8351l1603l3504l4092l3658l2402l0462
63513F10780k8026k5399k2922k0684j8355j5617j2890j1059j0265r527q050o368
$$ plain form
63501 421618 416162 410941 406188 402308 398871 395032 390713 386807 384346 383867 385320 387962 390431 391584
63487 391584 391456 391098 391408 392446 393922 395855 398560 402204 406631 411524 416723 422405 428837 435805 442421
63472 442421 447703 451218 453013 453170 451802 449179 445375 439922 432386 423243 413641 404323 395370 386984
63458 386984 379707 373590 367918 362332 357618 354726 353350 352266 350916 349931 350082 351387 353463 356169 359559
63443 359559 363554 368125 373654 380738 389570 399750 410787 422659 435839 450929 468410 488615
63431 488615 511681 537335 564738 592566 619177 642788 661916 676123 686453 694985 703775 714117
63419 714117 726525 741110 757978 777517 800384 826965 856767 888431 920312 950807 978216
63408 978216 1000815 1017397 1027536 1031207 1028506 1020087 1007579 993042 977907 962646 947205 931321
$$ packed form
63501D21618n456n221m753l880l437l839m319l906k461m79J453K642K469J153
63487C91584j28l58L10J038J476J933K705L644M427M893N199N682O432O968O616
63472D42421N282L515J795J57j368k623l804n453p536r143r602r318q953q386
63458C86984p277o117n672n586m714k892j376j084j350r85J51J305K076K706L390
63443C59559L995M571N529P084Q832J0180J1037J1872J3180J5090J7481K0205
63431D88615K3066K5654K7403K7828K6611K3611J9128J4207J0330Q532Q790J0342
63419G14117J2408J4585J6868J9539K2867K6581K9802L1664L1881L0495K7409
63408I78216K2599J6582J0139L671k701q419j2508j4537j5135j5261j5441j5884
$$ plain form
63396 931321 914415 895730 874888 852061 827508 801210 773273 744446 715889 688463 662470
63385 662470 638035 615449 595075 577159 561859 549239 539122 531100 524947 520916 519380 520203 522727
63372 522727 526445 531481 538274 546988 557375 569011 581451 594296 607450 621326 636594 653623
63360 653623 672293 692280 713396 735680 759472 785454 814260 845756 878708 911322 942079
63349 942079 970016 994357 1014105 1028021 1035001 1034673 1027893 1016640 1003115 988686 973632 957834
63337 957834 941539 925313 909314 892798 874454 853302 829331 803370 776358 748756 720715
63326 720715 692804 666346 642732 622405 604817 589509 576878 567606 561640 558132 556185 555035
63314 555035 553473 549809 542828 532502 519557 504789 489139 473955 460429 448828 438724 429926
$$ packed form
63396I31321j6906j8685k0842k2827k4553k6298k7937k8827k8557k7426k5993
63385F62470k4435k2586k0374j7916j5300j2620j0117q022o153m031j536Q23K524
63372E22727L718N036O793Q714J0387J1636J2440J2845J3154J3876J5268J7029
63360F53623J8670J9987K1116K2284K3792K5982K8806L1496L2952L2614L0757
63349I42079K7937K4341J9748J3916O980l28o780j1253j3525j4429j5054j5798
63337I57834j6295j6226j5999j6516j8344k1152k3971k5961k7012k7602k8041
63326G20715k7911k6458k3614k0327j7588j5308j2631r272n966l508j947j150
63314E55035j562l664o981j0326j2945j4768j5650j5184j3526j1601j0104q798
$$ plain form
63302 429926 422692 417045 412430 408266 404515 401523 399536 398394 397469 395855 392923 388853 384377 379893
63288 379893 375067 369418 363072 356791 351423 347356 344314 341580 338604 335541 333014 331308 329992 328415
63274 328415 326348 324010 321705 319649 318015 316961 316556 316721 317191 317580 317664 317634 317955 318905 320336 321870 323258
63257 323258 324564 326156 328388 331179 334033 336686 339506 342919 346689 350197 353369 356797 360999 366082
63243 366082 372129 379270 387275 395678 404532 414392 425295 436498 447710 459953 474520 491422 509449
63230 509449 527449 544932 561743 577865 593601 609453 625786 642833 660770 679405 698036
63219 698036 716117 733858 751697 769444 786526 802844 818555 832979 844486 851765 854757 854216
63207 854216 850866 845088 836864 825729 811310 794226 776137 758598 742201 726978 713125 700965
$$ packed form
63302D29926p234n647m615m164l751k992j987j142r25j614k932m070m476m484
63288C79893m826n649o346o281n368m067l042k734k976l063k527j706j316j577
63274C28415k067k338k305k056j634j054m05J65M70L89Q4l0L21R50J431J534J388
63257C23258J306J592K232K791K854K653K820L413L770L508L172L428M202N083
63243C66082O047P141Q005Q403Q854R860J0903J1203J1212J2243J4567J6902J8027
63230E09449J8000J7483J6811J6122J5736J5852J6333J7047J7937J8635J8631
63219F98036J8081J7741J7839J7747J7082J6318J5711J4424J1507P279K992n41
63207H54216l350n778q224j1135j4419j7084j8089j7539j6397j5223j3853j2160
$$ plain form
63195 700965 690581 682011 675612 671804 670564 671570 674761 680419 688716 699422 712075 726222 741626
63182 741626 758452 777143 797798 819697 841779 863610 885649 908511 932239 956329 980067
63171 980067 1002686 1023493 1042259 1059290 1074763 1087984 1097563 1102280 1101505 1094874 1082129 1063497
63159 1063497 1039870 1012278 981398 947824 912485 876370 840094 804160 769450 736881 706686
63148 706686 678646 653014 630466 610988 593584 577511 563134 551052 540914 531813 523454 516165
63136 516165 509960 504412 499423 495400 492476 490085 487646 485350 484041 484508 486928 490774 495210 499769
63122 499769 504619 510005 515601 520799 525462 529870 533942 537100 539120 540585 542185 543869 544999 545131
63108 545131 544401 543356 542637 542620 543062 543237 542653 541593 540774 540516 540389 539700 538210 536440 535278 535207 535822 536152
$$ packed form
63195G00965j0384q570o399l808j240J006L191N658Q297J0706J2653J4147J5404
63182G41626J6826J8691K0655K1899K2082K1831K2039K2862K3728K4090K3738
63171I80067K2619K0807J8766J7031J5473J3221R579M717p75o631j2745j8632
63159A063497k3627k7592l0880l3574l5339l6115l6276l5934l4710l2569l0195
63148G06686k8040k5632k2548j9478j7404j6073j4377j2082j0138r101q359p289
63136E16165o205n548m989m023k924k391k439k296j309M67K420L846M436M559
63122D99769M850N386N596N198M663M408M072L158K020J465J600J684J130J32
63108E45131p30j045p19j7M42J75n84j060q19k58j27o89j490j770j162p1O15L30
$$ plain form
63090 536152 535508 534037 532484 531489 531084 530777 530131 529302 528866 529039 529329 529230 529089 529854 531951 534828 537717
63073 537717 540506 543664 547617 552459 558130 564575 571800 579885 588976 599207 610657 623363 637266
63060 637266 652225 668287 685995 706179 729248 754780 781903 810069 839465 870790 904646
63049 904646 941011 979221 1018455 1058212 1098344 1138828 1179675 1220891 1262280 1303381 1343882
63038 1343882 1384010 1424247 1464691 1504938 1544549 1583237 1620523 1655445 1686659 1712629 1731850
63027 1731850 1743308 1746761 1742258 1729421 1707676 1677372 1640234 1598408 1553341 1505839 1456953 1408446
63015 1408446 1362359 1320256 1282790 1249964 1221890 1199214 1182640 1172182 1167358 1168114 1175011 1188337
63003 1188337 1207495 1231570 1260092 1292792 1328990 1367693 1408184 1450069 1492851 1535909 1579004
$$ packed form
63090E36152o44j471j553r95m05l07o46q29m36J73K90r9j41P65K097K877K889
63073E37717K789L158L953M842N671O445P225Q085R091J0231J1450J2706J3903
63060F37266J4959J6062J7708K0184K3069K5532K7123K8166K9396L1325L3856
63049I04646L6365L8210L9234L9757M0132M0484M0847M1216M1389M1101M0501
63038A343882M0128M0237M0444M0247L9611L8688L7286L4922L1214K5970J9221
63027A731850J1458L453m503j2837k1745l0304l7138m1826m5067m7502m8886m8507
63015A408446m6087m2103l7466l2826k8074k2676j6574j0458m824P56O897J3326
63003A188337J9158K4075K8522L2700L6198L8703M0491M1885M2782M3058M3095
$$ plain form
62992 1579004 1622422 1666442 1710751 1754446 1796543 1836382 1873553 1907467 1937029 1960730 1976916
62981 1976916 1983952 1980463 1965797 1940236 1904480 1859116 1804995 1743955 1678394 1609949 1539169 1466756
62969 1466756 1394480 1324378 1257559 1194372 1135337 1081140 1031816 986630 944867 906317 870923
62958 870923 838480 808805 781765 756952 733621 711270 690043 670334 652098 634839 618205
62947 618205 602334 587475 573458 559785 546255 533201 520990 509530 498526 488092 478772 470933
62935 470933 464378 458619 453278 448220 443507 439241 435310 431382 427357 423615 420436 417413 414018 410644
62921 410644 408317 407194 406104 403873 400550 396928 393505 390383 387660 385288 382872 380151 377401 374942
62907 374942 372644 370414 368790 368350 368784 369172 369060 368699 368418 368365 368719 369463 369991 369614 368562 367900 368340 369557
$$ packed form
62992A579004M3418M4020M4309M3695M2097L9839L7171L3914K9562K3701J6186
62981A976916P036l489j4666k5561l5756m5364n4121o1040o5561o8445p0780p2413
62969A466756p2276p0102o6819o3187n9035n4197m9324m5186m1763l8550l5394
62958H70923l2443k9675k7040k4813k3331k2351k1227j9709j8236j7259j6634
62947F18205j5871j4859j4017j3673j3530j3054j2211j1460j1004j0434r320p839
62935D70933o555n759n341n058m713m266l931l928m025l742l179l023l395l374
62921D10644k327j123j090k231l323l622l423l122k723k372k416k721k750k459
62907C74942k298k230j624m40M34L88j12l61k81n3L54P44N28l77j052o62M40J217
$$ plain form
62889 369557 370708 371129 370511 368988 367245 366090 365688 365534 365238 364948 364923 365143 365539 366215 367232 368388 369389
62872 369389 370025 370161 369855 369491 369440 369492 368951 367473 365563 364171 363974 365023 366730 368182 368767 368607 368188
62855 368188 367726 367265 367248 368264 370081 371557 371895 371609 371912 373455 375863 378248 379879 380685 381354 382711
62839 382711 384750 386511 387137 386803 386386 386474 386985 387473 387520 387003 386298 386118 386876 388280 389743 391048 392362
62822 392362 393779 395173 396468 397744 399013 400119 400991 401886 403266 405385 408028 410785 413603 416857 420712
62807 420712 424622 427866 430501 433378 437205 442005 447548 453830 460869 468460 476447 484965 494137 503851
62793 503851 514160 525619 538856 553956 570618 588754 608665 630818 655838 684516 717381
62782 717381 754232 794491 838031 885368 936974 992714 1051929 1113672 1176748 1239849 1301906
$$ packed form
62889C69557J151M21o18j523j743j155m02j54k96k90k5K20L96O76J017J156J001
62872C69389O36J36l06l64n1N2n41j478j910j392j97J049J707J452N85j60m19
62855C68188m62m61j7J016J817J476L38k86L03J543K408K385J631Q06O69J357
62839C82711K039J761O26l34m17Q8N11M88M7n17p05j80P58J404J463J305J314
62822C92362J417J394J295J276J269J106Q72Q95J380K119K643K757K818L254L855
62807D20712L910L244K635K877L827M800N543O282P039P591P987Q518R172R714
62793E03851J0309J1459J3237J5100J6662J8136J9911K2153K5020K8678L2865
62782G17381L6851M0259M3540M7337N1606N5740N9215O1743O3076O3101O2057
$$ plain form
62771 1301906 1362106 1419281 1471467 1516357 1552300 1578699 1595454 1602243 1598536 1584247 1560115 1527378
62759 1527378 1487189 1440453 1388093 1331341 1271806 1211310 1151466 1093158 1036572 981950 930205
62748 930205 882409 838800 798704 761472 727044 695496 666577 640026 615977 594683 576071
62737 576071 559843 545745 533492 522702 513242 505393 499366 494877 491539 489364 488460 488492 488923 489655
62723 489655 490918 492755 495164 498571 503464 509623 516444 524061 533331 544528 556908 570056 584891
62710 584891 602688 623704 647546 674443 705256 740344 779290 821774 868076 918603 973592
62699 973592 1033432 1098615 1168960 1243286 1320206 1398908 1478938 1559558 1639604 1717577 1791448
62688 1791448 1858728 1917121 1964938 2000555 2021900 2027186 2016161 1990100 1950643 1899119 1837018
$$ packed form
62771A301906O0200N7175N2186M4890L5943K6399J6755O789l707j4289k4132l2737
62759A527378m0189m6736n2360n6752n9535o0496n9844n8308n6586n4622n1745
62748I30205m7796m3609m0096l7232l4428l1548k8919k6551k4049k1294j8612
62737E76071j6228j4098j2253j0790r460p849o027m489l338k175r04L2M31P32
62723D89655J263J837K409L407M893O159O821P617R270J1197J2380J3148J4835
62710E84891J7797K1016K3842K6897L0813L5088L8946M2484M6302N0527N4989
62699I73592N9840O5183P0345P4326P6920P8702Q0030Q0620Q0046P7973P3871
62688A791448O7280N8393M7817L5617K1345N286j1025k6061l9457n1524o2101
$$ plain form
62677 1837018 1766377 1689420 1608172 1524614 1440731 1358091 1277762 1200882 1128810 1062251 1000644
62666 1000644 943091 889690 841309 798125 759155 723449 691109 662649 637828 615681 595532
62655 595532 577366 561155 546362 532422 519371 507586 497051 487318 478202 470108 463455 458063
62643 458063 453364 449018 445037 441467 438266 435456 433106 431196 429740 428915 428758 428837 428695 428495 428682 428907
62627 428907 427996 425323 421728 418648 416671 415376 414245 413246 412623 412510 412793 413225 413817 415114 417690 421274
62611 421274 424921 428320 432330 437752 444223 450947 457988 465927 474658 483560 492766 503300 515843 530223
62597 530223 546254 564284 584676 607437 632563 660022 689084 718346 746852 774649 801945
62586 801945 828240 852555 873845 890788 901871 906426 905201 899368 889235 874439 855090 832163
$$ packed form
62677A837018p0641p6957q1248q3558q3883q2640q0329p6880p2072o6559o1607
62666A000644n7553n3401m8381m3184l8970l5706l2340k8460k4821k2147k0149
62655E95532j8166j6211j4793j3940j3051j1785j0535r733r116q094o653n392
62643D58063m699m346l981l570l201k810k350j910j456q25j57P9j42k00J87K25
62627D28907r11k673l595l080j977j295j131r99o23j13K83M32N92J297K576L584
62611D21274L647L399M010N422O471O724P041P939Q731Q902R206J0534J2543J4380
62597E30223J6031J8030K0392K2761K5126K7459K9062K9262K8506K7797K7296
62586H01945K6295K4315K1290J6943J1083M555j225n833j0133j4796j9349k2927
$$ plain form
62574 832163 806913 780351 753146 725587 697705 669803 642750 617472 594251 572829 553025
62563 553025 534944 518691 504202 491323 479865 469658 460727 453259 447195 442050 437350 433137 429839
62550 429839 427754 426763 426399 426043 425321 424434 423977 424323 425366 426868 428672 430527 432180 433806 435900 438503
62534 438503 441066 443384 446118 449943 454648 459642 464957 471158 478575 487230 497295 509086 522755
62521 522755 538553 557150 579080 603992 631127 660515 693054 729356 769101 811575 856284
62510 856284 902829 950609 998840 1046583 1092647 1135779 1175049 1209791 1239190 1262248 1278172
62499 1278172 1286593 1287529 1281542 1269867 1253935 1234815 1213460 1191399 1170639 1152879 1139334 1131309
62487 1131309 1130255 1136894 1150783 1171097 1197553 1230303 1269256 1313837 1363264 1416814 1473860 1533614
$$ packed form
62574H32163k5250k6562k7205k7559k7882k7902k7053k5278k3221k1422j9804
62563E53025j8081j6253j4489j2879j1458j0207q931p468o064n145m700m213l298
62550D29839k085r91l64l56p22q87m57L46J043J502J804J855J653J626K094K603
62534D38503K563K318K734L825M705M994N315O201P417Q655J0065J1791J3669
62521E22755J5798J8597K1930K4912K7135K9388L2539L6302L9745M2474M4709
62510H56284M6545M7780M8231M7743M6064M3132L9270L4742K9399K3058J5924
62499A278172Q421R36n987j1675j5932j9120k1355k2061k0760j7760j3545q025
62487A131309j054O639J3889K0314K6456L2750L8953M4581M9427N3550N7046N9754
$$ plain form
62475 1533614 1594512 1653710 1707422 1752035 1784961 1804762 1811101 1804754 1787063 1758757 1719250 1667429
62463 1667429 1603253 1528754 1447719 1364383 1281908 1201648 1123724 1048330 976406 909221 847696
62452 847696 792318 743366 700935 664800 634410 608932 587271 568318 551442 536675 524232
62441 524232 513950 505334 498078 492283 488037 484920 482130 479193 476433 474500 473475 472742 471778 470670
62427 470670 469629 468372 466486 464127 461818 459664 457361 454951 452906 451242 449103 445650 441029 436148
62413 436148 431758 428097 425185 422985 421264 419560 417429 414725 411705 408896 406761 405378 404463 403710 402990
62398 402990 402325 401854 401847 402611 404262 406673 409546 412454 414961 417006 419032 421414 423879 425935 427869 430749
62382 430749 435189 440599 446018 451375 457492 464987 473538 482232 490353 497840 505169 512965 521673 531561
$$ packed form
62475A533614O0898N9198N3712M4613L2926J9801O339o347j7691k8306l9507n1821
62463A667429o4176p4499q1035q3336q2475q0260p7924p5394p1924o7185o1525
62452H47696n5378m8952m2431l6135l0390k5478k1661j8953j6876j4767j2443
62441E24232j0282q616p256n795m246l117k790k937k760j933j025p33r64j108
62427D70670j041j257j886k359k309k154k303k410k045j664k139l453m621m881
62413D36148m390l661k912k200j721j704k131k704l020k809k135j383r15p53p20
62398D02990o65m71pP64J651K411K873K908K507K045K026K382K465K056J934K880
62382D30749M440N410N419N357O117P495Q551Q694Q121P487P329P796Q708R888
$$ plain form
62368 531561 542845 555707 570265 586641 604961 625081 646586 669407 694435 723009 755748
62357 755748 792212 831752 874215 919693 968026 1018823 1071445 1124616 1176375 1224813 1268593
62346 1268593 1306422 1336451 1356856 1367106 1368208 1361721 1348784 1329999 1305734 1276313 1242226 1204426
62334 1204426 1164309 1123205 1081891 1040653 999815 960074 922285 887037 854591 825172 798973
62323 798973 775695 754376 734130 714926 697213 680852 665002 649219 634090 620397 608063
62312 608063 596389 585100 574650 565628 558256 552437 547923 544379 541569 539557 538535 538428 538751 538880
62298 538880 538435 537520 536666 536365 536414 535925 534205 531593 529176 527705 527008 526417 525542 524601 524159 524606 525816
62281 525816 527356 529060 531201 533942 536874 539492 541999 545172 549387 554251 559495 565802 574233 584881
$$ packed form
62368E31561J1284J2862J4558J6376J8320K0120K1505K2821K5028K8574L2739
62357G55748L6464L9540M2463M5478M8333N0797N2622N3171N1759M8438M3780
62346A268593L7829L0029K0405J0250J102o487j2937j8785k4265k9421l4087l7800
62334A204426m0117m1104m1314m1238m0838l9741l7789l5248l2446k9419k6199
62323G98973k3278k1319k0246j9204j7713j6361j5850j5783j5129j3693j2334
62312F08063j1674j1289j0450r022p372n819m514l544k810k012j022j07L23J29
62298E38880m45r15q54l01M9m89j720k612k417j471o97n91q75r41m42M47J210
62281E25816J540J704K141K741K932K618K507L173M215M864N244O307Q431J0648
$$ plain form
62267 584881 596601 608230 619793 632282 646551 662797 681054 701763 725637 753246 784952
62256 784952 821015 861504 906135 954455 1006076 1060489 1116608 1172646 1226394 1275522 1317855
62245 1317855 1351742 1376258 1390925 1395479 1390243 1376547 1356203 1330327 1298975 1262050 1220217 1174863
62233 1174863 1127557 1079707 1032365 986033 940898 897450 856649 819296 785510 755037 727835
62222 727835 704091 683765 666375 651155 637416 624943 614063 605095 597700 591111 585021 579719
62210 579719 575228 570960 566644 563032 561073 560696 561036 561656 562905 565147 568311 572306 577388 583884 591899
62195 591899 601382 612204 624058 636540 649507 663164 677696 692900 708255 723304 737976 752560
62183 752560 767307 782035 796216 809383 821209 831253 839102 844984 849752 853931 857147 858986 860043
$$ packed form
62267E84881J1720J1629J1563J2489J4269J6246J8257K0709K3874K7609L1706
62256G84952L6063M0489M4631M8320N1621N4413N6119N6038N3748M9128M2333
62245A317855L3887K4516J4667M554n236j3696k0344k5876l1352l6925m1833m5354
62233A174863m7306m7850m7342m6332m5135m3448m0801l7353l3786l0473k7202
62222G27835k3744k0326j7390j5220j3739j2473j0880q968p395o589o090n302
62210E79719m491m268m316l612j959l77L40O20J249K242L164L995N082O496Q015
62195E91899R483J0822J1854J2482J2967J3657J4532J5204J5355J5049J4672J4584
62183G52560J4747J4728J4181J3167J1826J0044P849N882M768M179L216J839J057
$$ plain form
62170 860043 861655 864872 870295 878716 891184 908317 930062 956133 986213 1019685 1055680 1093401
62158 1093401 1131845 1169104 1202621 1230478 1252046 1267208 1275534 1276675 1271121 1259989 1244178 1224087
62146 1224087 1199973 1172182 1141096 1107210 1071329 1034486 997704 961951 928182 897146 869144
62135 869144 844138 822069 802929 786596 772821 761363 751937 744087 737355 731726 727688 725675 725548
62122 725548 726770 729032 732443 737116 742832 749273 756335 763893 771345 777814 782842 786592 789222 790490
62108 790490 790320 789429 788814 788526 787354 783898 777827 769970 761372 752519 743546 734939 727685 722576 719530
62093 719530 717872 717211 717719 719562 722587 726745 732372 739617 747899 756487 765514 775974 788675 803549
62079 803549 820008 837630 856355 876240 897177 918819 940831 963254 986303 1009608 1031957
$$ packed form
62170H60043J612L217N423Q421J2468J7133K1745K6071L0080L3472L5995L7721
62158A093401L8444L7259L3517K7857K1568J5162Q326J141n554j1132j5811k0091
62146A224087k4114k7791l1086l3886l5881l6843l6782l5753l3769l1036k8002
62135H69144k5006k2069j9140j6333j3775j1458r426p850o732n629m038k013j27
62122G25548J222K262L411M673N716O441P062P558P452O469N028L750K630J268
62108G90490j70q91o15k88j172l456o071p857q598q853q973q607p254n109l046
62093G19530j658o61N08J843L025M158N627P245Q282Q588R027J0460J2701J4874
62079H03549J6459J7622J8725J9885K0937K1642K2012K2423K3049K3305K2349
$$ plain form
62068 1031957 1052293 1070796 1088506 1105984 1123022 1139710 1156969 1175530 1194913 1214050 1232611
62057 1232611 1251004 1269051 1285290 1297936 1306192 1310240 1310156 1305384 1295445 1280721 1262127 1240103 1214373
62044 1214373 1184694 1151443 1115289 1076744 1036328 994926 953567 913027 873923 836989 802885
62033 802885 771813 743633 718230 695492 675184 657333 642555 631394 623323 616932 611169 605873
62021 605873 600964 595791 589684 582744 575638 568807 562228 555746 549243 542570 535654 528781 522599 517795
62007 517795 514799 513819 515054 518767 524967 533032 541883 550790 559883 569621 579932 590124 599484 607451
61993 607451 613257 615978 615233 611603 606137 599608 592261 583950 574321 563111 550487 536999 523176
61980 523176 509365 495964 483497 472325 462509 453993 446680 440295 434509 429380 425352 422711 421279
$$ packed form
62068A031957K0336J8503J7710J7478J7038J6688J7259J8561J9383J9137J8561
62057A232611J8393J8047J6239J2646Q256M048q4m772r939j4724j8594k2024k5730
62044A214373k9679l3251l6154l8545m0416m1402m1359m0540l9104l6934l4104
62033H02885l1072k8180k5403k2738k0308j7851j4778j1161q071o391n763n296
62021F05873m909n173o107o940p106o831o579o482o503o673o916o873o182m804
62007E17795k996r80J235L713O200Q065Q851Q907R093R738J0311J0192R360P967
61993F07451N806K721p45l630n466o529p347q311r629j1210j2624j3488j3823
61980E23176j3811j3401j2467j1172r816q516p313o385n786n129m028k641j432
$$ plain form
61967 421279 420705 420707 420936 421022 421024 421519 422969 425233 427860 430563 433222 435804 438591 442173 446829 452122 457439
61950 457439 462800 468893 476525 486325 498680 513523 530278 548406 567966 589382 612861 638448
61938 638448 666517 697682 731983 768425 805500 842044 877529 911684 944023 973850 1000813
61927 1000813 1025302 1047957 1068617 1086006 1098671 1106026 1108327 1105986 1099418 1089402 1077034 1063197
61915 1063197 1048457 1033711 1020613 1011045 1006160 1006115 1010680 1019923 1034136 1053133 1075839 1100745 1126610
61902 1126610 1152443 1176846 1197821 1213483 1222790 1225431 1221359 1210790 1194455 1173456 1148802 1121243
61890 1121243 1091438 1060086 1028005 996311 966269 938631 913149 889073 866036 844066 822828
61879 822828 801481 779542 757526 736354 716337 697102 678439 660893 645431 632677 622538
$$ packed form
61967D21279n74KK29Q6KM95J450K264K627K703K659K582K787L582M656N293N317
61950D57439N361O093P632R800J2355J4843J6755J8128J9560K1416K3479K5587
61938F38448K8069L1165L4301L6442L7075L6544L5485L4155L2339K9827K6963
61927A000813K4489K2655K0660J7389J2665P355K301k341o568j0016j2368j3837
61915A063197j4740j4746j3098r568m885m5M565R243J4213J8997K2706K4906K5865
61902A126610K5833K4403K0975J5662R307K641m072j0569j6335k0999k4654k7559
61890A121243k9805l1352l2081l1694l0042k7638k5482k4076k3037k1970k1238
61879H22828k1347k1939k2016k1172k0017j9235j8663j7546j5462j2754j0139
$$ plain form
61868 622538 614487 608146 603696 601748 602826 606923 613600 622482 633545 646958 662859 681526 703705
61855 703705 730355 761928 798016 837888 881209 928047 978389 1031923 1088167 1146427 1205551
61844 1205551 1264022 1320374 1373367 1421776 1464239 1499354 1525765 1542273 1548332 1544566 1532634 1514578
61832 1514578 1492519 1468774 1445680 1425043 1408123 1396196 1390581 1391834 1399379 1412198 1429444 1449912
61820 1449912 1471347 1490891 1506192 1515717 1518234 1512446 1497201 1471885 1436772 1393241 1343440 1289437
61808 1289437 1232823 1175222 1118647 1064807 1014314 967067 923160 882858 845903 811621 779778
61797 779778 750720 724490 700365 677480 655573 634930 615948 598901 583827 570408 558172
61786 558172 546898 536708 527753 520052 513563 508073 503076 498187 493680 490180 487716 485541 483055 480451
$$ packed form
61868F22538q051o341m450j948J078M097O677Q882J1063J3413J5901J8667K2179
61855G03705K6650L1573L6088L9872M3321M6838N0342N3534N6244N8260N9124
61844A205551N8471N6352N2993M8409M2463L5115K6411J6508O059l766j1932j8056
61832A514578k2059k3745k3094k0637j6920j1927n615J253P545J2819J7246K0468
61820A449912K1435J9544J5301R525K517n788j5245k5316l5113m3531m9801n4003
61808A289437n6614n7601n6575n3840n0493m7247m3907m0302l6955l4282l1843
61797G79778k9058k6230k4125k2885k1907k0643j8982j7047j5074j3419j2236
61786E58172j1274j0190q955p701o489n490m997m889m507l500k464k175k486k604
$$ plain form
61772 480451 478238 476575 475392 474766 474735 474985 475123 475157 475467 476424 478270 481155 484941 489129 493288 497483
61756 497483 501969 506626 511064 515261 519578 524043 527958 530474 531318 530735 528913 525818 521570 516655 511545
61741 511545 506253 500490 494275 488225 483130 479331 476594 474535 472995 472009 471598 471732 472442 473820 475865
61726 475865 478389 481141 484042 487277 491107 495565 500347 505080 509663 514300 519187 524216 529016 533160
61712 533160 536232 537771 537412 535217 531696 527192 521322 513372 503448 492951 483622 476260 470501 465602
61698 465602 460995 456234 450960 445195 439403 434094 429463 425342 421294 416850 412047 407703 404689 402861
61684 402861 401211 399175 397164 395573 393971 391796 389290 387054 385061 382900 380788 379539 379491 380080 380610
61669 380610 380868 380877 380638 380371 380590 381626 383270 385085 386823 388415 389784 390939 392167 394030 397089 401553
$$ packed form
61772D80451k213j663j183o26l1K50J38L4L10R57J846K885L786M188M159M195
61756D97483M486M657M438M197M317M465L915K516Q44n83j822l095m248m915n110
61741E11545n292n763o215o050n095l799k737k059j540r86m11J34P10J378K045
61726D75865K524K752K901L235L830M458M782M733M583M637M887N029M800M144
61712E33160L072J539l59k195l521m504n870p950r924j0497r329p362n759m899
61698D65602m607m761n274n765n792n309m631m121m048m444m803m344l014j828
61684D02861j650k036k011j591j602k175k506k236j993k161k112j249m8N89N30
61669C80610K58Rk39k67K19J036J644J815J738J592J369J155J228J863L059M464
$$ plain form
61653 401553 407098 413136 419384 426039 433255 440732 447988 454743 460746 465646 469553 473444 478318 484059
61639 484059 489699 494589 498631 501547 502901 503039 502999 503115 502482 500372 497432 494874 492988 491131 488778
61624 488778 485943 482889 480069 478162 477473 477376 476871 475563 473638 471103 467787 464109 461051 458999 457064
61609 457064 453918 449029 442790 435708 427871 419148 409655 399880 390449 381800 374100 367392 361714 356968
61595 356968 352746 348455 343701 338572 333611 329501 326665 325024 324116 323426 322606 321457 319942 318288 316928
61580 316928 316168 315976 316113 316360 316560 316633 316636 316708 316818 316714 316159 315105 313586 311712 309898 308829 308877 309623 310230
61561 310230 310252 309909 309661 309741 310108 310698 311609 313079 315189 317518 319261 319897 319716 319591 320250 321859 324153
61544 324153 326749 329340 331781 334043 336066 337740 339160 340865 343655 348031 353743 359835 365201 369275
$$ packed form
61653D01553N545O038O248O655P216P477P256O755O003M900L907L891M874N741
61639D84059N640M890M042K916J354J38m0J16o33k110k940k558j886j857k353
61624D88778k835l054k820j907o89r7n05j308j925k535l316l678l058k052j935
61609D57064l146m889o239p082p837q723r493r775r431q649p700o708n678m746
61595C56968m222m291m754n129m961m110k836j641r08o90q20j149j515j654j360
61580C16928p60j92J37K47K00P3LP2J10j04n55j054j519j874j814j069M8P46O07
61561C10230K2l43k48Q0L67N90R11J470K110K329J743O36j81j25O59J609K294
61544C24153K596K591K441K262K023J674J420J705K790M376N712O092N366M074
$$ plain form
61530 369275 372274 374666 376459 377167 376462 374541 371784 368440 364896 361879 359899 358582 356978 354574 351724
61515 351724 349117 347136 345837 345227 345296 345803 346188 345796 344342 342307 340789 340674 341841 343244 343824 343305
61499 343305 342237 341461 341548 342524 343976 345458 346875 348465 350470 352884 355428 357653 359096 359520 359058 358036
61483 358036 356692 355217 354037 353838 355119 357777 361226 364946 368842 373041 377416 381398 384343 386008
61469 386008 386581 386280 385094 382964 380026 376571 372907 369379 366351 363968 362013 360206 358564 357285 356327
61454 356327 355394 354396 353705 353771 354616 355784 356763 357386 357898 358760 360380 362967 366471 370592 374865 378939 382926
61437 382926 387352 392654 398732 405071 411201 416861 421749 425460 427806 429156 430279 431798 433784 435845
61423 435845 437609 439152 440932 443294 446085 448854 451362 453744 456175 458560 460641 462246 463229 463298 462134
$$ packed form
61530C69275K999K392J793P08p05j921k757l344l544l017j980j317j604k404k850
61515C51724k607j981j299o10O9N07L85l92j454k035j518j15J167J403N80n19
61499C43305j068p76Q7R76J452J482J417J590K005K414K544K225J443M24m62j022
61483C58036j344j475j180j99J281K658L449L720L896M199M375L982K945J665
61469C86008N73l01j186k130k938l455l664l528l028k383j955j807j642j279r58
61454C56327r33r98o91O6Q45J168R79O23N12Q62J620K587L504M121M273M074L987
61437C82926M426N302O078O339O130N660M888L711K346J350J123J519J986K061
61423D35845J764J543J780K362K791K769K508K382K431K385K081J605R83O9j164
$$ plain form
61408 462134 459761 456634 453241 449748 446087 442242 438270 434157 429903 425721 421932 418626 415660 413067
61394 413067 411123 409891 409005 408228 407938 408682 410377 412394 414345 416314 418313 420042 421389 422733 424391
61379 424391 426116 427484 428567 429810 431285 432451 432763 432309 431759 431734 432290 432982 433367 433354 433005 432219 430932
61362 430932 429596 429077 429878 431727 434022 436434 438929 441597 444804 449252 455445 463131 471589 480383 489540
61347 489540 499075 508676 517960 526759 535143 543346 551676 560300 569064 577673 586058 594410 602863 611234
61333 611234 619015 625435 629700 631490 631226 629595 626815 622634 617004 610402 603387 596193 588951 582034
61319 582034 575849 570458 565688 561595 558517 556641 555683 555178 555018 555595 557338 560144 563371 566466 569513
61304 569513 572992 577023 581028 584223 586213 586944 586261 583851 579614 573832 566883 559076 550901 543101 536108
$$ packed form
61408D62134k373l127l393l493l661l845l972m113m254m182l789l306k966k593
61394D13067j944j232q86p77k90P44J695K017J951J969J999J729J347J344J658
61379D24391J725J368J083J243J475J166L12m54n50k5N56O92L85j3l49p86j287
61362D30932j336n19Q01J849K295K412K495K668L207M448O193P686Q458Q794R157
61347D89540R535R601R284Q799Q384Q203Q330Q624Q764Q609Q385Q352Q453Q371
61333F11234P781O420M265J790k64j631k780m181n630o602p015p194p242o917
61319E82034o185n391m770m093l078j876r58n05j60N77J743K806L227L095L047
61304E69513L479M031M005L195J990P31o83k410m237n782o949p807q175p800o993
$$ plain form
61289 536108 529646 523353 517706 513703 511461 509830 507865 506143 505908 507220 508837 509925 511063 513253
61275 513253 516648 520701 525086 529921 535338 541243 547375 553312 558650 563477 568482 574341 581195 589001
61261 589001 598026 608565 620367 632867 645849 659457 673576 687668 701234 714090 726156 737304
61249 737304 747439 756450 764048 769857 773558 774715 772706 767368 759590 750697 741127 730211 717422
61236 717422 703347 689188 675738 663121 651216 639969 629499 620176 612434 606324 601415 597309
61224 597309 593993 591518 589595 587778 585874 583907 581822 579570 577345 575489 574159 573362 573224 573899 575161
61209 575161 576321 576652 575841 574027 571591 568955 566482 564514 563495 563979 566431 571018 577619 585932 595540
61194 595540 606066 617501 630194 644185 658541 671744 682899 692322 700791 708509 715058 720187
$$ packed form
61289E36108o462o293n647m003k242j631j965j722k35J312J617J088J138K190
61275E13253L395M053M385M835N417N905O132N937N338M827N005N859O854P806
61261E89001R025J0539J1802J2500J2982J3608J4119J4092J3566J2856J2066J1148
61249G37304J0135R011P598N809L701J157k009n338p778q893r570j0916j2789
61236G17422j4075j4159j3450j2617j1905j1247j0470r323p742o110m909m106
61224E97309l316k475j923j817j904j967k085k252k225j856j330p97j38O75J262
61209E75161J160L31q11j814k436k636k473j968j019M84K452M587O601Q313R608
61194E95540J0526J1435J2693J3991J4356J3203J1155R423Q469P718O549N129
$$ plain form
61182 720187 724237 727752 730969 733790 736072 737827 739290 740863 742831 745021 746835 747705 747485 746424 744917
61167 744917 743278 741536 739313 736095 731783 726824 721697 716476 710966 704995 698390 690992 683031 675237
61153 675237 668267 662211 656980 652827 649994 648150 646783 645898 645541 644782 642130 637115 630584 623195 614552
61138 614552 604407 593835 584405 576694 570403 565477 562254 560714 560450 561447 564196 568828 574649 580742
61124 580742 586793 593210 600614 609296 619190 630360 643336 658518 675312 692514 709784 728034
61112 728034 747964 768919 789825 810654 832158 854613 877694 901161 924727 947456 968299
61101 968299 987192 1004747 1020893 1034728 1045758 1054420 1061223 1066227 1069570 1071731 1073101 1073995 1075187
61088 1075187 1077611 1081354 1085794 1090876 1097307 1105174 1113523 1121897 1131331 1142927 1156163 1169547 1182530
$$ packed form
61182G20187M050L515L217K821K282J755J463J573J968K190J814Q70k20j061j507
61167G44917j639j742k223l218m312m959n127n221n510n971o605p398p961p794
61153F75237o970o056n231m153k833j844j367q85l57p59k652n015o531p389q643
61138F14552j0145j0572r430p711o291m926l223j540k64R97K749M632N821O093
61124E80742O051O417P404Q682R894J1170J2976J5182J6794J7202J7270J8250
61112G28034J9930K0955K0906K0829K1504K2455K3081K3467K3566K2729K0843
61101I68299J8893J7555J6146J3835J1030Q662O803N004L343K161J370Q94J192
61088A075187K424L743M440N082O431P867Q349Q374R434J1596J3236J3384J2983
$$ plain form
61075 1182530 1195787 1209803 1223934 1236944 1248047 1257372 1265626 1273151 1279246 1282747 1283298 1281583 1278175
61062 1278175 1272887 1265531 1256513 1246114 1233910 1219628 1204042 1188271 1172643 1156958 1141471 1126822
61050 1126822 1113265 1100748 1089541 1080075 1072323 1065992 1061148 1058022 1056462 1056286 1057901 1061746 1067282
61037 1067282 1073558 1080738 1090147 1102578 1117431 1133838 1151802 1171732 1193532 1216774 1241410 1267783
61025 1267783 1296061 1325991 1357144 1389446 1423744 1461945 1506223 1557940 1617558 1685615 1763480
61014 1763480 1853223 1957433 2079479 2223726 2395332 2600032 2844005 3133544 3475100 3876596
61004 3876596 4349070 4906780 5565810 6342833 7253227 8305735 9494527 10794071 12158430
60995 12158430 13519232 14781025 15828191 16559327 16938318 17022488 16937509 16814612 16737510
$$ packed form
61075A182530J3257J4016J4131J3010J1103R325Q254P525O095L501N51j715l408
61062A278175n288p356r018j0399j2204j4282j5586j5771j5628j5685j5487j4649
61050A126822j3557j2517j1207r466p752o331m844l126j560j76J615L845N536
61037A067282O276P180R409J2431J4853J6407J7964J9930K1800K3242K4636K6373
61025A267783K8278K9930L1153L2302L4298L8201M4278N1717N9618O8057P7865
61014A763480Q9743J04210J22046J44247J71606K04700K43973K89539L41556M01496
61004C876596M72474N57710O59030P77023R10394J052508J188792J299544J364359
60995A2158430J360802J261793J047166P31136L78991Q4170q4979j22897p7102
$$ plain form
60986 16737510 16727893 16755416 16745768 16588052 16163850 15399965 14310562 12992995 11580572 10190050
60976 10190050 8896247 7735171 6717704 5840496 5092593 4459985 3928248 3483237 3111415
60967 3111415 2800692 2540872 2322983 2138536 1979898 1841360 1719418 1611934 1517146 1433429
60957 1433429 1359489 1294312 1236926 1186477 1142486 1104604 1071951 1042967 1016115 990596 966260
60946 966260 943087 921011 900019 880108 861231 843446 826919 811514 796616 781683 766838
60935 766838 752549 738837 725158 711065 696676 682574 669478 657855 647507 637618 627614 617944
60923 617944 609565 602691 596503 590111 583353 576558 570062 564195 559323 555575 552704 550358 548271 546153
60909 546153 543791 541447 539820 539315 539558 539792 539537 538771 537740 536809 536148 535365 533689 530739 526861 522536
$$ packed form
60986A6737510r617K7523r648j57716m24202p63885j089403j317567j412423j390522
60976A0190050j293803j161076j017467q77208p47903o32608n31737m45011l71822
60967C111415l10723k59820k17889j84447j58638j38538j21942j07484r4788q3717
60957A433429p3940o5177n7386n0449m3991l7882l2653k8984k6852k5519k4336
60946I66260k3173k2076k0992j9911j8877j7785j6527j5405j4898j4933j4845
60935G66838j4289j3712j3679j4093j4389j4102j3096j1623j0348r889j0004r670
60923F17944q379o874o188o392o758o795o496n867m872l748k871k346k087k118
60909E46153k362k344j627n05K43K34k55p66j031r31o61p83j676k950l878m325
$$ plain form
60893 522536 517848 512800 507766 503134 498659 493616 487545 480585 473223 466049 459573 453832 448219 442182
60879 442182 436122 431131 427720 425240 422750 420071 417668 415828 414445 413511 413346 414203 415908 418068 420484
60864 420484 423206 426341 429929 433931 438132 442115 445482 448124 450195 451909 453542 455544 458268 461462
60850 461462 464306 466172 467157 467692 467919 467744 467308 466963 466764 466329 465264 463474 461078 458228 455010 451254
60834 451254 446512 440562 433948 427608 421970 416763 411821 407514 404150 401451 398985 396744 394769 392583
60820 392583 389569 385796 381912 378259 374666 371207 368490 366840 365574 363543 360278 356368 352840 350464
60806 350464 349473 349514 349739 349291 347982 346457 345528 345419 345789 346380 347316 348664 349986 350716 350941 351431 352710
60789 352710 354372 355584 356153 356744 358052 360070 362257 364142 365515 366247 366270 365719 364814 363630 362208 360918
$$ packed form
60893E22536m688n048n034m632m475n043o071o960p362p174o476n741n613o037
60879D42182o060m991l411k480k490k679k403j840j383r34j65Q57J705K160K416
60864D20484K722L135L588M002M201L983L367K642K071J714J633K002K724L194
60850D61462K844J866R85N35K27j75m36l45j99m35j065j790k396k850l218l756
60834D51254m742n950o614o340n638n207m942m307l364k699k466k241j975k186
60820C92583l014l773l884l653l593l459k717j650j266k031l265l910l528k376
60806C50464r91M1K25m48j309j525r29j09L70N91R36J348J322P30K25M90J279
60789C52710J662J212N69N91J308K018K187J885J373P32K3n51r05j184j422j290
$$ plain form
60773 360918 360353 360698 361449 361976 362137 362074 361634 360443 358521 356382 354476 352925 351931 351914 352848 353783 353542 351923
60755 351923 349857 348374 347709 347432 347170 346974 347158 347931 349232 350815 352465 354110 355728 357206 358350 358963
60739 358963 358883 357981 356191 353545 350203 346525 343032 340140 337907 336212 335127 334870 335380 336264 337267 338406
60723 338406 339559 340319 340585 340893 341743 342913 343901 344787 346064 347768 349398 350689 351882 353091 353939 354020
60707 354020 353400 352481 351700 351456 351954 352934 353854 354441 354735 354530 353308 350994 348338 346174 344618 343328 342223
60690 342223 341420 340674 339429 337512 335379 333619 332473 331952 332103 332942 334240 335601 336838 338148 339823
60675 339823 341777 343529 344770 345819 347267 349147 350711 351137 350360 349112 348248 348009 347862 347064 345531 344071
60659 344071 343572 344027 344629 344771 344595 344515 344641 344912 345469 346626 348607 351451 354891 358232 360627 361778 362163
$$ packed form
60773C60918n65L45P51N27J61o3m40j191j922k139j906j551r94j7R34R35k41j619
60755C51923k066j483o65k77k62j96J84P73J301J583J650J645J618J478J144O13
60739C58963q0r02j790k646l342l678l493k892k233j695j085k57N10Q84J003J139
60723C38406J153P60K66L08Q50J170R88Q86J277J704J630J291J193J209Q48Q1
60707C54020o20r19p81k44M98R80R20N87K94k05j222k314k656k164j556j290j105
60690C42223q03p46j245j917k133j760j146n21J51Q39J298J361J237J310J675
60675C39823J954J752J241J049J448J880J564M26p77j248q64k39j47p98j533j460
60659C44071m99M55O02J42j76q0J26K71N57J157J981K844L440L341K395J151L85
$$ plain form
60642 362163 362380 362475 362087 360996 359200 356693 353517 349975 346529 343553 341290 339838 338894 337774 336055
60627 336055 334138 332861 332609 333056 333613 333826 333489 332816 332480 332999 334001 334506 334125 333611 333994 335420 337076
60610 337076 338090 338239 337933 337819 338400 339743 341408 342732 343353 343487 343706 344463 345812 347537 349414 351330
60594 351330 353150 354640 355576 355960 356144 356678 357873 359436 360648 361079 361003 360965 361071 361075 361066 361630 363158 365366
60576 365366 367715 370008 372334 374770 377448 380682 384648 389088 393706 398708 404592 411480 419024 426898
60562 426898 434886 442467 448747 453001 455053 455032 453094 449566 445050 440122 435083 430204 426045 423268 422161
60547 422161 422524 424071 426840 431191 437365 445035 453357 461624 469856 478622 488344 498999 510434 522562
60533 522562 535028 546984 557434 565628 570951 572810 571166 567053 561997 556723 550848 543998 536770
$$ packed form
60642C62163K17R5l88j091j796k507l176l542l446k976k263j452r44j120j719
60627C36055j917j277k52M47N57K13l37o73l36N19J002N05l81n14L83J426J656
60610C37076J014J49l06j14N81J343J665J324O21J34K19P57J349J725J877J916
60594C51330J820J490R36L84J84N34J195J563J212M31p6l8J06MrN64J528K208
60576C65366K349K293K326K436K678L234L966M440M618N002N884O888P544P874
60562D26898P988P581O280M254K052k1j938l528m516m928n039m879m159k777j107
60547D22161L63J547K769M351O174P670Q322Q267Q232Q766R722J0655J1435J2128
60533E22562J2466J1956J0450Q194N323J859j644m113n056n274n875o850p228
$$ plain form
60520 536770 530193 524576 519409 514347 509711 505931 502939 500432 498481 497554 498022 499866 502791 506401 510378
60505 510378 514835 520590 528904 540717 556163 574812 596266 620451 647398 676869 708280 741039
60493 741039 774810 809256 843490 876076 905778 932107 954764 972647 983835 986675 980699 966456
60481 966456 944827 916679 882950 844753 803508 761110 719787 681469 647135 616717 589511
60470 589511 564716 541849 521013 502808 487791 475890 466328 458168 450903 444534 439085 434131 428975
60457 428975 423346 417703 412681 408324 404143 399852 395741 392206 389211 386394 383571 380904 378636 376827
60443 376827 375416 374487 374365 375269 376831 378185 378665 378267 377271 375717 373621 371486 370084 369704 370000 370554
60427 370554 371115 371306 370718 369493 368320 367634 367278 367173 367760 369385 371665 373915 375851 377499 378790 379676
$$ packed form
60520E36770o577n617n167n062m636l780k992k507j951r27M68J844K925L610L977
60505E10378M457N755Q314J1813J5446J8649K1454K4185K6947K9471L1411L2759
60493G41039L3771L4446L4234L2586K9702K6329K2657J7883J1188K840n976j4243
60481I66456k1629k8148l3729l8197m1245m2398m1323l8318l4334l0418k7206
60470E89511k4795k2867k0836j8205j5017j1901r562q160p265o369n449m954n156
60457D28975n629n643n022m357m181m291m111l535k995k817k823k667k268j809
60443C76827j411r29j22R04J562J354M80l98r96j554k096k135j402l80K96N54
60427C70554N61J91n88j225j173o86l56j05N87J625K280K250J936J648J291Q86
$$ plain form
60411 379676 380348 380935 381267 381386 381930 383448 385585 387508 388926 390139 391343 392576 394217 396692 399619
60396 399619 401961 403252 404153 405551 407648 410105 412565 414744 416464 417960 419777 422119 424591 426833
60382 426833 428998 431299 433493 435252 436757 438470 440502 442620 444741 446969 449198 451112 452643 454114
60368 454114 455776 457489 458962 460108 461098 462171 463493 465024 466500 467693 468799 470427 473069 476669
60354 476669 480832 485370 490456 496261 502606 509032 515082 520443 524929 528401 530638 531199 529603 525842
60340 525842 520627 514907 509138 503296 497571 492632 488986 486347 483966 481457 479022 476908 474961 472738
60326 472738 469941 466631 463168 459956 457217 455004 453433 452748 453081 454254 455998 458269 461212 464918 469448
60311 469448 475034 481956 490152 499122 508337 517635 527103 536664 545944 554575 562549 570099 577145 582972
$$ packed form
60411C79676O72N87L32J19N44J518K137J923J418J213J204J233J641K475K927
60396C99619K342J291R01J398K097K457K460K179J720J496J817K342K472K242
60382D26833K165K301K194J759J505J713K032K118K121K228K229J914J531J471
60368D54114J662J713J473J146R90J073J322J531J476J193J106J628K642L600
60354D76669M163M538N086N805O345O426O050N361M486L472K237N61j596l761
60340E25842n215n720n769n842n725m939l646k639k381k509k435k114j947k223
60326D72738k797l310l463l212k739k213j571o85L33J173J744K271K943L706M530
60311D69448N586O922Q196Q970R215R298R468R561R280Q631P974P550P046N827
$$ plain form
60297 582972 586655 587761 586439 582796 576528 567426 556200 544563 534372 526525 520548 515268 510094
60284 510094 505643 502898 501828 501244 500110 498485 496952 495560 493829 491495 488679 485431 481635 477419
60270 477419 473313 469882 467338 465413 463450 460788 457387 453939 451043 448443 445503 442305 439695 438186
60256 438186 437310 436276 434896 433651 433129 433573 434754 436081 437086 437962 439435 441897 444783 447006 447949
60241 447949 447923 447690 447686 447722 447403 446741 446256 446496 447615 449395 451483 453453 454955 456094 457490 459667 462502
60224 462502 465592 468996 473193 478280 483648 488576 492952 497271 502113 507643 513482 519126 524597 530615
60210 530615 537929 546571 555949 565464 574729 583417 591376 598888 606384 613939 621375 628770 636315 643658
60196 643658 650008 655067 659344 663261 666442 668260 668748 668434 667454 665328 661715 657081 652351 647902 643089
$$ packed form
60297E82972L683J106j322l643o268r102j1226j1637j0191p847n977n280n174
60284E10094m451k745j070n84j134j625j533j392j731k334k816l248l796m216
60270D77419m106l431k544j925j963k662l401l448k896k600k940l198k610j509
60256D38186q76j034j380j245n22M44J181J327J005Q76J473K462K886K223R43
60241D47949k6k33mL6l19o62m85K40J119J780K088J970J502J139J396K177K835
60224D62502L090L404M197N087N368M928M376M319M842N530N839N644N471O018
60210E30615P314Q642R378R515R265Q688P959P512P496P555P436P395P545P343
60196F43658O350N059M277L917L181J818M88l14r80k126l613m634m730m449m813
$$ plain form
60181 643089 636964 629457 621572 614279 607527 600656 593519 586669 580587 575267 570590 566587 563188 560170
60167 560170 557530 555556 554347 553594 552966 552370 551703 550752 549561 548619 548462 549258 550815 552723 554431 555590
60151 555590 556432 557492 558879 560186 561155 561939 562589 562893 563068 564091 566902 571548 577439 584093 591251 598623
60135 598623 605984 613386 620942 628589 636362 644576 653333 662034 669761 676019 680836 684440 687208 689705
60121 689705 692250 694517 695956 696519 696602 696413 695917 695376 695447 696558 698487 700641 702436 703319 702813 700891 698198
60104 698198 695630 693578 691576 688651 684106 678078 671405 664946 659032 653542 648350 643553 639316 635660
60090 635660 632453 629583 627112 625198 623883 623021 622487 622318 622487 622692 622613 622371 622451 623150 624343 625757 627112
60073 627112 627912 627466 625390 621912 617487 612301 606348 599813 593165 586852 581022 575577 570486 565984 562283
$$ packed form
60181F43089o125p507p885p293o752o871p137o850o082n320m677m003l399l018
60167E60170k640j974j209p53o28n96o67r51j191r42j57P96J557J908J708J159
60151E55590Q42J060J387J307R69P84O50L04J75J023K811M646N891O654P158P372
60135E98623P361P402P556P647P773Q214Q757Q701P727O258M817L604K768K497
60121F89705K545K267J439N63Q3j89m96n41P1J111J929K154J795Q83n06j922k693
60104F98198k568k052k002k925m545o028o673o459n914n490n192m797m237l656
60090F35660l207k870k471j914j315q62n34j69J69K05p9k42Q0O99J193J414J355
60073F27112Q00m46k076l478m425n186n953o535o648o313n830n445n091m502l701
$$ plain form
60058 562283 559075 555698 551967 548479 545711 543297 540834 539045 539182 541267 543900 546059 548232 551419
60044 551419 555827 561049 566843 573079 579452 585800 592307 598966 605298 611041 616529 621828 626089 628474
60030 628474 629195 628929 627652 624956 621118 616839 612036 605826 597683 587810 576457 563866 550980 539193
60016 539193 529002 519675 510617 502346 495651 490432 485965 481859 478103 474475 470583 466478 462727 459798
60002 459798 457693 456264 455562 455677 456386 457223 457979 458967 460636 463038 465897 469135 472971 477439 482166 486869
59986 486869 491692 496812 502063 507316 512875 518943 524877 529498 532141 532976 532462 530974 528915 526606 523927
59971 523927 520496 516389 512317 509026 506831 505747 505696 506463 507815 509809 512662 516181 519680 522628 525141
59956 525141 527660 530338 532894 534914 536132 536540 536320 535643 534626 533533 532769 532384 531798 530441 528558 526902
$$ packed form
60058E62283l208l377l731l488k768k414k463j789J37K085K633K159K173L187
60044E51419M408N222N794O236O373O348O507O659O332N743N488N299M261K385
60030F28474P21k66j277k696l838m279m803o210q143r873j1353j2591j2886j1787
60016E39193j0191r327r058q271o695n219m467m106l756l628l892m105l751k929
60002D59798k105j429p02J15P09Q37P56R88J669K402K859L238L836M468M727M703
59986D86869M823N120N251N253N559O068N934M621K643Q35n14j488k059k309k679
59971E23927l431m107m072l291k195j084n1P67J352J994K853L519L499K948K513
59956E25141K519K678K556K020J218M08k20o77j017j093p64l85n86j357j883j656
$$ plain form
59940 526902 525617 523999 521476 518307 515056 511908 508939 506723 506125 507497 510420 514271 518798 524120
59926 524120 530260 536732 542551 546745 548943 549445 548693 546868 544152 541218 539112 538475 539014 539963 541048
59911 541048 542762 545569 549154 552769 556126 559451 562709 565420 567455 569432 571823 574048 575029 574392 572567
59896 572567 569894 566347 562250 558607 556317 555336 554874 554357 554049 554776 557070 560598 564517 568399 572570
59881 572570 577404 582635 587739 592730 598125 604173 610487 616374 621218 624643 626718 628005 629097 630045
59867 630045 630490 630250 629449 628212 626580 624702 622798 620971 619306 618031 617235 616651 616131 616194 617595 620438
59851 620438 624150 628230 632560 637067 641623 646186 650524 653873 655549 655890 655944 656171 656122 655460 654557 653819
59835 653819 653092 652025 650421 647931 644034 638784 633125 628103 624136 621257 619436 618237 616729 614313
$$ packed form
59940E26902j285j618k523l169l251l148k969k216n98J372K923L851M527N322
59926E24120O140O472N819M194K198N02p52j825k716k934k106o37N39R49J085
59911E41048J714K807L585L615L357L325L258K711K035J977K391K225R81o37j825
59896E72567k673l547m097l643k290r81m62n17l08P27K294L528L919L882M171
59881E72570M834N231N104M991N395O048O314N887M844L425K075J287J092R48
59867F30045M45k40q01j237j632j878j904j827j665j275p96n84n20O3J401K843
59851F20438L712M080M330M507M556M563M338L349J676L41N4K27m9o62r03p38
59835F53819p27j067j604k490l897n250n659n022l967k879j821j199j508k416
$$ plain form
59821 614313 611281 608159 604890 601139 596972 592727 588580 584782 581973 580633 580411 580568 580916 581719 582834
59806 582834 583644 583862 583809 583791 583725 583519 583320 583116 582444 580862 578516 576002 573763 571820 569960 567928 565444
59789 565444 562293 558604 555009 552258 550517 549148 547347 544942 542327 539745 537033 534207 531912 530900
59775 530900 531158 531838 532121 532027 532356 533901 536712 540121 543477 546759 550390 554560 558984 563342 567679 572311
59759 572311 577473 583191 589396 596094 603493 611904 621393 631563 641831 651931 662015 672389 683272
59746 683272 694668 706168 716970 726409 734465 741493 747531 752194 755131 756235 755452 752855 748965 744552
59732 744552 739990 735153 729955 724610 719298 714032 709016 704680 701161 698084 694974 691559 687632 683094
59718 683094 678301 673945 670398 667569 665434 664152 663521 663008 662674 663462 666076 670098 674676 679592 685054
$$ packed form
59821F14313l032l122l269l751m167m245m147l798k809j340k22J57L48Q03J115
59806E82834Q10K18n3j8o6k06j99k04o72j582k346k514k239j943j860k032k484
59789E65444l151l689l595k751j741j369j801k405k615k582k712k826k295j012
59775E30900K58O80K83r4L29J545K811L409L356L282L631M170M424M358M337M632
59759E72311N162N718O205O698P399Q411R489J0170J0268J0100J0084J0374J0883
59746F83272J1396J1500J0802R439Q056P028O038M663K937J104p83k597l890m413
59732G44552m562m837n198n345n312n266n016m336l519l077l110l415l927m538
59718F83094m793m356l547k829k135j282o31n13l34P88K614M022M578M916N462
$$ plain form
59703 685054 690918 696787 702681 708938 715580 722296 728860 735026 740216 744004 746875 749855 753226 756112
59689 756112 757492 757098 755152 751757 747005 741417 735806 730672 725953 721339 716628 711655 706086 699579
59675 699579 692276 684962 678476 672904 667500 661531 655086 648967 643903 639957 636691 633724 630990 628422
59661 628422 625702 622677 620020 618904 619758 621782 624109 627000 631261 636834 642806 648666 654616 660470
59647 660470 665216 668116 669502 669955 669242 666678 662136 656131 649239 641908 634610 627610 620746 613848 607252
59632 607252 601512 596692 592317 588026 583995 580619 577902 575187 571540 566556 560757 554991 549573 544296
59618 544296 539134 534379 530119 526167 522593 519668 517134 514268 511018 508387 507233 507273 507774 508701 510531
59603 510531 513296 516344 518865 520267 520409 519851 519578 520147 521393 523132 525539 528513 531396 533845 536270
$$ packed form
59703F85054N864N869N894O257O642O716O564O166N190L788K871K980L371K886
59689G56112J380l94j946l395m752n588n611n134m719m614m711m973n569o507
59675F99579p303p314o486n572n404n969o445o119n064l946l266k967k734k568
59661F28422k720l025k657j116Q54K024K327K891M261N573N972N860N950N854
59647F60470M746K900J386M53p13k564m542o005o892p331p298p000o864o898o596
59632F07252n740m820m375m291m031l376k717k715l647m984n799n766n418n277
59618E44296n162m755m260l952l574k925k534k866l250k631j154M0N01R27J830
59603E10531K765L048K521J402J42n58k73N69J246J739K407K974K883K449K425
$$ plain form
59588 536270 538739 540253 540066 539123 539038 539922 540328 539192 536744 533488 529445 524758 520120 516135 512801 509926
59572 509926 507564 505708 504013 502128 500024 497841 495702 493781 492229 490934 489578 488022 486417 484944
59558 484944 483684 482690 481981 481562 481626 482554 484442 486821 489187 491568 494246 497235 500427 503991 508161 512891
59542 512891 518200 524585 532549 542065 553084 566175 581805 599260 617137 634691 651570 666253
59530 666253 676106 679666 678151 674265 670218 667300 666378 667718 670550 673622 676299 678685 680768 681910
59516 681910 681289 678564 673968 667857 660304 651210 640775 629686 618708 608196 598157 588603 579572
59503 579572 570953 562637 554778 547619 541120 535045 529385 524491 520809 518592 517683 517403 517026 516662 517243
59488 517243 519197 521563 523121 524025 525504 528092 531133 534118 537485 541688 546212 550175 553516 557097
$$ packed form
59588E36270K469J514j87r43q5Q84M06j136k448l256m043m687m638l985l334k875
59572E09926k362j856j695j885k104k183k139j921j552j295j356j556j605j473
59558D84944j260r94p09m19O4R28J888K379K366K381K678K989L192L564M170M730
59542E12891N309O385P964R516J1019J3091J5630J7455J7877J7554J6879J4683
59530F66253R853L560j515l886m047k918r22J340K832L072K677K386K083J142
59516F81910o21k725m596o111p553r094j0435j1089j0978j0512j0039r554r031
59503E79572q619q316p859p159o499o075n660m894l682k217r09k80l77l64N81
59488E17243J954K366J558R04J479K588L041K985L367M203M524L963L341L581
$$ plain form
59474 557097 561799 567766 574329 580411 585167 588420 590448 591452 591502 590919 590288 589976 589947 590088 590410 590867 591385
59457 591385 592184 593858 596965 601686 607812 614818 621948 628535 634343 639550 644484 649423 654250 658066
59443 658066 659591 658450 655691 652492 648711 643453 636815 630177 624686 620295 616457 613035 610184 607912
59429 607912 606087 604589 603341 602508 602619 604044 606473 609455 613407 619350 627656 637798 649410 662797
59415 662797 678116 694918 712907 732470 753931 776801 800196 823308 844721 861583 870479 869565
59403 869565 860010 845613 831160 820589 815884 817201 823827 834887 849100 864031 875842 880254
59391 880254 874545 859239 837824 814555 792505 773371 757966 746012 736107 727083 719333 713977
59379 713977 711044 709482 708776 709250 710674 711844 711997 711569 711088 710258 708719 706837 705081 703350 701463 699670
$$ packed form
59474E57097M702N967O563O082M756L253K028J004N0n83o31l12k9J41L22M57N18
59457E91385P99J674L107M721O126P006P130O587N808N207M934M939M827L816
59443F58066J525j141k759l199l781n258o638o638n491m391l838l422k851k272
59429F07912j825j498j248q33J11J425K429K982L952N943Q306J0142J1612J3387
59415F62797J5319J6802J7989J9563K1461K2870K3395K3112K1413J6862Q896r14
59403H69565r555j4397j4453j0571m705J317O626J1060J4213J4931J1811M412
59391H80254n709j5306k1415k3269k2050j9134j5405j1954r905r024p750n356
59379G13977k933j562p06M74J424J170J53m28m81q30j539j882j756j731j887j793
$$ plain form
59363 699670 698098 696376 694441 693144 693383 695114 697797 701311 705792 711016 716669 723025 730798 740447
59349 740447 751931 764922 778919 793435 808262 823350 838344 852703 866283 879154 890764
59338 890764 900132 907157 912806 917531 920365 920233 917356 912604 906239 898154 888723 878445 867154 854541
59324 854541 841186 828168 815864 803878 792005 780527 769669 759446 749965 741225 732763 724121
59312 724121 715572 707752 700686 693833 687106 681257 677182 675307 675676 678137 682368 688032 694915 702656
59298 702656 710353 716695 720352 720129 715164 705512 692483 678027 663845 651112 640535 632144 625267
59285 625267 619233 614067 610238 608010 607356 608238 610535 613947 618345 623964 630913 638810 647307 656643 667180
59270 667180 678688 690586 702620 714729 726484 737259 746849 755380 762609 767726 769887 768775 764895
$$ packed form
59363F99670j572j722j935j297K39J731K683L514M481N224N653O356P773R649
59349G40447J1484J2991J3997J4516J4827J5088J4994J4359J3580J2871J1610
59338H90764R368P025N649M725K834j32k877m752o365q085r431j0278j1291j2613
59324H54541j3355j3018j2304j1986j1873j1478j0858j0223r481q740q462q642
59312G24121q549p820p066o853o727n849m075j875L69K461M231N664O883P741
59298G02656P697O342L657k23m965r652j3029j4456j4182j2733j0577q391o877
59285F25267o034n166l829k228o54Q82K297L412M398N619O949P897Q497R336J0537
59270F67180J1508J1898J2034J2109J1755J0775R590Q531P229N117K161j112l880
$$ plain form
59257 764895 759570 754273 749570 744921 739822 734700 730315 726831 724070 722173 721272 720869 720405 720288 721561
59242 721561 724598 728740 733164 737481 741533 745234 748603 751487 753358 753944 753878 754027 754260 753570 751390 748132
59226 748132 744372 740191 735452 730034 723585 715600 706098 695866 685843 676558 668211 660871 654451 648785
59212 648785 643872 639742 636127 632574 628983 625735 623290 621862 621417 621652 622018 622164 622389 623406 625609
59197 625609 628748 632218 635439 638170 640805 644154 648576 653499 658188 662732 667818 673730 680152 686825
59183 686825 693747 700721 707305 713340 719039 724414 729045 732560 734986 736522 737312 737540 737405 736854 735570
59168 735570 733402 730642 727843 725450 723543 721852 720099 718385 716995 715699 713645 710243 705811 700955
59154 700955 695664 689498 682398 674785 667027 659335 652012 645271 638841 632247 625446 618812 612593 606793
$$ packed form
59257G64895n325n297m703m649n099n122m385l484k761j897r01m03m64j17J273
59242G21561L037M142M424M317M052L701L369K884J871N86o6J49K33o90k180l258
59226G48132l760m181m739n418o449p985r502j0232j0023r285q347p340o420n666
59212F48785m913m130l615l553l591l248k445j428m45K35L66J46K25J017K203
59197F25609L139L470L221K731K635L349M422M923M689M544N086N912O422O673
59183F86825O922O974O584O035N699N375M631L515K426J536P90K28j35n51j284
59168G35570k168k760k799k393j907j691j753j714j390j296k054l402m432m856
59154G00955n291o166p100p613p758p692p323o741o430o594o801o634o219n800
$$ plain form
59140 606793 601507 596870 592735 588800 584996 581483 578383 575901 574465 574323 575164 576543 578481 581284 585053
59125 585053 589848 595992 603659 612436 621884 632171 643501 655281 666783 678380 691143 705233
59113 705233 719689 733957 748647 764444 781094 797868 814296 830013 844471 857386 869158
59102 869158 880474 891701 902813 913523 923242 931282 937326 941502 943921 944515 943450 941326 938753
59089 938753 936052 933498 931526 930405 929823 928886 926462 921627 914099 904255 892584 879195 864101 847770
59075 847770 831056 814641 798938 784330 771010 758558 746189 733571 721135 709537 699067
59064 699067 689631 680994 672975 665500 658509 651806 645290 639396 634828 631534 628335 624061 618823 613788
59050 613788 609916 607295 605390 603564 601658 600439 601059 603637 606847 609384 611351 613572 616159 618601
$$ packed form
59140F06793n286m637m135l935l804l513l100k482j436j42Q41J379J938K803L769
59125E85053M795O144P667Q777R448J0287J1330J1780J1502J1597J2763J4090
59113G05233J4456J4268J4690J5797J6650J6774J6428J5717J4458J2915J1772
59102H69158J1316J1227J1112J0710R719Q040O044M176K419N94j065k124k573
59089I38753k701k554j972j121n82r37k424m835p528r844j1671j3389j5094j6331
59075H47770j6714j6415j5703j4608j3320j2452j2369j2618j2436j1598j0470
59064F99067r436q637q019p475o991o703o516n894m568l294l199m274n238n035
59050F13788l872k621j905j826j906j219O20K578L210K537J967K221K587K442
$$ plain form
59036 618601 620826 623293 626297 630046 635169 642305 651355 661805 673484 686347 700067 714757 731490
59023 731490 750987 772267 793939 816342 840836 867102 892861 916373 937461 955690 969353
59012 969353 977242 980140 979546 975942 969284 960376 950726 941508 933398 927006 922762 920645 920453 922058 925088
58997 925088 928755 932148 934313 934071 930505 923791 914809 903796 890264 874452 857887 841920 826499
58984 826499 810922 795122 779688 765255 752459 741891 733572 726872 721373 717388 715354 715228 716754
58971 716754 719738 723764 728263 733208 739133 746117 753328 759853 765379 769853 773190 775655 777760 779444
58957 779444 780051 779419 778060 775860 771621 764573 755541 745840 735804 725273 714910 705945 698827 692911
58943 692911 687419 682154 677458 673931 672051 671690 672165 672873 673582 674047 673900 673108 671967 670522 668645 666883
$$ packed form
59036F18601K225K467L004L749N123P136R050J0450J1679J2863J3720J4690J6733
59023G31490J9497K1280K1672K2403K4494K6266K5759K3512K1088J8229J3663
59012I69353P889K898n94l604o658q908r650r218q110o392m244k117j92J605L030
58997I25088L667L393K165k42l566o714q982j1013j3532j5812j6565j5967j5421
58984H26499j5577j5800j5434j4433j2796j0568q319o700n499l985k034j26J526
58971G16754K984M026M499M945N925O984P211O525N526M474L337K465K105J684
58957G79444O07o32j359k200m239p048r032r701j0036j0531j0363q965p118n916
58943F92911n492n265m696l527j880l61M75P08P09M65j47p92j141j445j877j762
$$ plain form
58927 666883 666274 666884 667371 666593 664888 663123 661232 658536 654964 651098 647319 643679 640381 637779 636103
58912 636103 635596 636584 638962 642003 645141 648621 652962 658205 664228 671378 680161 690463 701548 712705
58898 712705 723657 734506 745474 756454 766671 775204 781963 787774 793438 799305 805792 813531 822669
58885 822669 832654 842982 853460 863497 872025 878598 883834 888305 891658 893309 893278 891780 888699 884079
58871 884079 878533 872663 866583 860512 855116 850684 846531 841772 836165 829792 822576 814642 806529 798474
58857 798474 790112 781358 772866 765098 757686 750333 743565 737872 732733 727317 721623 716263 711582 707571
58843 707571 704099 700604 696101 690104 683080 675581 667563 658981 650276 641746 633268 625173 618476 613532
58829 613532 609419 605389 602022 600046 598934 597672 596200 595108 594623 594793 595895 597665 598828 598469 597275
$$ packed form
58927F66883o09O10M87p78j705j765j891k696l572l866l779l640l298k602j676
58912F36103n07R88K378L041L138L480M341N243O023P150Q783J0302J1085J1157
58898G12705J0952J0849J0968J0980J0217Q533O759N811N664N867O487P739R138
58885H22669R985J0328J0478J0037Q528O573N236M471L353J651l1j498l081m620
58871H84079n546n870o080o071n396m432m153m759n607o373p216p934q113q055
58857G98474q362q754q492p768p412p353o768n693n139n416n694n360m681m011
58843G07571l472l495m503n997p024p499q018q582q705q530q478q095o697m944
58829F13532m113m030l367j976j112j262j472j092m85J70J102J770J163l59j194
$$ plain form
58814 597275 596507 596442 596744 597516 598811 599889 600210 600522 601718 603185 603593 602802 601724 600759 599650 598481 597531
58797 597531 596507 595130 594057 593917 593867 592499 589884 587380 585675 584467 583835 584359 585843 587405 589015
58782 589015 591728 596164 601884 608326 615240 622039 627930 632924 637757 642557 646522 648990 649877 648971 645823
58767 645823 640663 634523 628187 621679 614909 608128 601670 595996 591992 590413 590879 592085 593130 594088 595365
58752 595365 597119 599325 601780 604046 605821 607219 608351 609046 609498 610602 612969 616173 619706 624030 629714
58737 629714 636197 642562 649006 656307 664274 672028 679536 687540 696106 704496 712351 719782 726417 731587
58723 731587 735415 738619 741297 743050 744123 745221 746370 747224 748396 751035 755086 759322 763199 767224
58709 767224 771262 773953 774317 772743 769838 765299 758420 748925 736964 722970 707719 691786 674922
$$ packed form
58814E97275p68o5L02P72J295J078L21L12J196J467M08p91j078r65j109j169r50
58797E97531j024j377j073j40n0j368k615k504j705j208o32N24J484J562J610
58782E89015K713M436N720O442O914O799N891M994M833M800L965K468Q87r06l148
58767F45823n160o140o336o508o770o781o458n674m004j579M66J206J045R58J277
58752E95365J754K206K455K266J775J398J132O95M52J104K367L204L533M324N684
58737F29714O483O365O444P301P967P754P508Q004Q566Q390P855P431O635N170
58723G31587L828L204K678J753J073J098J149Q54J172K639M051M236L877M025
58709G67224M038K691L64j574k905m539o879r495j1961j3994j5251j5933j6864
$$ plain form
58696 674922 656748 638009 620244 604229 589711 576575 565208 555682 547603 540818 535302 530426
58684 530426 525429 520532 516518 513346 510348 507634 505844 504546 502454 499505 497245 496768 497600 499033 501164
58669 501164 504087 507342 510872 515491 521743 529176 537236 545926 555107 563998 571788 577995 581987 583130
58655 583130 581790 579243 576188 572142 566650 560238 553818 547934 542886 538769 535074 531020 526550 522316
58641 522316 518606 515112 511854 509379 507838 506688 505588 504813 504667 505217 506600 508784 511048 512531 513254
58626 513254 513779 514078 513733 513010 512598 512447 512065 511798 512511 514082 515566 516905 519150 522840 527429 532351
58610 532351 537378 541937 545422 548274 551446 554794 557363 559227 561508 564507 567374 569677 571694 573057
58596 573057 572895 571629 570898 571289 571742 571558 571379 571850 573060 575682 580847 588269 596207 603886 612255 621799
$$ packed form
58696F74922j8174j8739j7765j6015j4518j3136j1367r526q079o785n516m876
58684E30426m997m897m014l172k998k714j790j298k092k949k260m77Q32J433K131
58669E01164K923L255L530M619O252P433Q060Q690R181Q891P790O207L992J143
58655E83130j340k547l055m046n492o412o420n884n048m117l695m054m470m234
58641E22316l710l494l258k475j541j150j100p75j46N50J383K184K264J483P23
58626E13254N25K99l45p23m12j51l82k67P13J571J484J339K245L690M589M922
58610E32351N027M559L485K852L172L348K569J864K281K999K867K303K017J363
58596E73057j62j266p31L91M53j84j79M71J210K622N165P422P938P679Q369R544
$$ plain form
58580 621799 631426 640350 649301 658927 668551 677480 686128 694945 703652 712379 722280 734170 747796 763058
58566 763058 780633 800795 823071 847642 875571 906964 940365 974581 1009545 1044702 1078172
58555 1078172 1108227 1134000 1154275 1167503 1173937 1175869 1174821 1170267 1162016 1151735 1140843 1128799
58543 1128799 1114883 1099849 1084253 1066768 1045806 1021542 994974 966348 935983 905385 876101
58532 876101 848463 822539 799094 778507 760086 743517 729618 718588 709060 700038 692229 686235
58520 686235 681053 675705 670760 666747 662735 658053 653831 651080 648718 645358 641794 639812 639550 639737 639631
58505 639631 639152 638106 636803 636499 637763 639385 640245 641102 643118 645825 648111 650094 652426 654840 657040
58490 657040 660040 665026 671739 679371 688123 698491 710096 722671 737188 754565 774189 795022
$$ packed form
58580F21799R627Q924Q951R626R624Q929Q648Q817Q707Q727R901J1890J3626J5262
58566G63058J7575K0162K2276K4571K7929L1393L3401L4216L4964L5157L3470
58555A078172L0055K5773K0275J3228O434J932j048m554q251j0281j0892j2044
58543A128799j3916j5034j5596j7485k0962k4264k6568k8626l0365l0598k9284
58532H76101k7638k5924k3445k0587j8421j6569j3899j1030r528r022p809n994
58520F86235n182n348m945m013m012m682m222k751k362l360l564j982k62J87j06
58505F39631m79j046j303l04J264J622Q60Q57K016K707K286J983K332K414K200
58490F57040L000M986O713P632Q752J0368J1605J2575J4517J7377J9624K0833
$$ plain form
58478 795022 817107 840672 864824 888420 911054 931974 949320 961780 969644 972947 970237 960821
58466 960821 946717 930666 913574 895612 878360 863914 853044 845866 842966 844144 847551 851926
58454 851926 858303 867723 878823 889684 900370 911339 920783 925964 926113 921847 913040 899575 883071
58441 883071 865524 847331 828822 812379 800393 792166 785382 779750 776655 776120 776917 779142 784051
58428 784051 791622 800550 810413 821835 834859 849008 864351 880669 896223 909093 918950 925896
58416 925896 928803 926779 921076 913379 903330 889980 874569 859522 845641 832514 820663 810973
58404 810973 802986 796037 791021 788842 788320 787959 788531 791501 796252 801388 807293 814650 821899 827210 831609
58389 831609 837003 842327 845002 845118 844751 844036 841507 837677 834751 833094 831328 829587 829414 830715 831981
$$ packed form
58478G95022K2085K3565K4152K3596K2634K0920J7346J2460P864L303k710r416
58466I60821j4104j6051j7092j7962j7252j4446j0870p178k900J178L407M375
58454H51926O377R420J1100J0861J0686J0969R444N181J49m266q807j3465j6504
58441H83071j7547j8193j8509j6443j1986q227o784n632l095n35P97K225M909
58428G84051P571Q928R863J1422J3024J4149J5343J6318J5554J2870R857O946
58416I25896K907k024n703p697j0049j3350j5411j5047j3881j3127j1851r690
58404H10973p987o949n016k179n22l61N72K970M751N136N905P357P249N311M399
58389H31609N394N324K675J16l67p15k529l830k926j657j766j741j73J301J266
$$ plain form
58374 831981 833313 836170 840371 844324 847980 852647 858228 863610 869371 877153 886722 896520 906640 918332
58360 918332 931210 943921 956908 971359 986091 998717 1009189 1018892 1027010 1031407 1032586 1033197 1034077
58347 1034077 1034243 1034249 1035854 1038845 1041894 1046069 1053706 1064198 1074786 1085187 1097552 1112151 1127145
58334 1127145 1142408 1159461 1177684 1194595 1209869 1225157 1240037 1252255 1261877 1271007 1279391 1284545
58322 1284545 1286363 1287375 1288295 1287585 1285597 1284844 1285886 1287134 1288880 1293248 1300052 1307055 1314418 1324374 1336460
58307 1336460 1347775 1358202 1370626 1385639 1400903 1416119 1433624 1453439 1472592 1490036 1507450
58296 1507450 1524710 1539500 1552029 1565176 1579292 1591856 1602841 1615324 1630233 1645640 1661736
58285 1661736 1680999 1702859 1723791 1743506 1765403 1790152 1814645 1838164 1863712 1892239 1921508
$$ packed form
58374H31981J332K857M201L953L656M667N581N382N761P782R569R798J0120J1692
58360I18332J2878J2711J2987J4451J4732J2626J0472R703Q118M397J179O11Q80
58347A034077J66OJ605K991L049M175P637J0492J0588J0401J2365J4599J4994
58334A127145J5263J7053J8223J6911J5274J5288J4880J2218R622R130Q384N154
58322A284545J818J012R20p10j988p53J042J248J746M368O804P003P363R956J2086
58307A336460J1315J0427J2424J5013J5264J5216J7505J9815J9153J7444J7414
58296A507450J7260J4790J2529J3147J4116J2564J0985J2483J4909J5407J6096
58285A661736J9263K1860K0932J9715K1897K4749K4493K3519K5548K8527K9269
$$ plain form
58274 1921508 1951638 1985644 2023441 2061507 2099582 2141347 2187289 2233459 2278644 2326244 2377666
58263 2377666 2430533 2484722 2543292 2605965 2668616 2730587 2795291 2862294 2926468 2986558 3046735
58252 3046735 3108040 3166652 3222601 3281706 3346475 3413542 3482452 3558196 3642417 3731004 3823236
58241 3823236 3924306 4035862 4153284 4275270 4406658 4548790 4696978 4850759 5016445
58232 5016445 5196196 5385176 5583031 5797120 6030672 6279211 6542657 6828920 7141304
58223 7141304 7474896 7830052 8216624 8640269 9098271 9593900 10140396 10745437 11406894
58214 11406894 12129889 12932291 13827672 14820361 15924363 17169740 18584376 20190356 22027757
58205 22027757 24164139 26677059 29654051 33218483 37525295 42715337 48898452 56193233
$$ packed form
58274A921508L0130L4006L7797L8066L8075M1765M5942M6170M5185M7600N1422
58263B377666N2867N4189N8570O2673O2651O1971O4704O7003O4174O0090O0177
58252C046735O1305N8612N5949N9105O4769O7067O8910P5744Q4221Q8587R2232
58241C823236J01070J11556J17422J21986J31388J42132J48188J53781J65686
58232E016445J79751J88980J97855K14089K33552K48539K63446K86263L12384
58223G141304L33592L55156L86572M23645M58002M95629N46496O05041O61457
58214A1406894P22995Q02402Q95381R92689J104002J245377J414636J605980J837401
58205B2027757K136382K512920K976992L564432M306812N190042O183115P294781
$$ plain form
58197 56193233 64757620 74779011 86484437 100187250 116288870 135212941 157354728
58190 157354728 183035082 212318381 244717065 279040856 313457630 345456976 371636724
58183 371636724 387943033 390963161 379680286 356189759 324650979 289409122 253760269
58176 253760269 219809275 188801459 161351439 137577531 117295890 100196930 85902636
58169 85902636 73986361 64041295 55734504 48785881 42938077 37977380 33753270 30148635
58161 30148635 27050366 24364482 22031874 20005510 18229647 16656701 15263774 14034739
58153 14034739 12942023 11960054 11079886 10295707 9591022 8950802 8373279 7857233 7390234
58144 7390234 6960786 6569760 6218741 5898500 5599473 5322646 5069846 4833466 4605750
$$ packed form
58197E6193233Q564387J0021391J1705426J3702813J6101620J8924071K2141787
58190A57354728K5680354K9283299L2398684L4323791L4416774L1999346K6179748
58183C71636724J6306309L020128j1282875k3490527l1538780l5241857l5648853
58176B53760269l3950994l1007816k7450020k3773908k0281641j7098960j4294294
58169H5902636j1916275r945066q306791o948623n847804m960697m224110l604635
58161C0148635l098269k685884k332608k026364j775863j572946j392927j229035
58153A4034739j092716r81969q80168p84179p04685o40220n77523n16046m66999
58144G390234m29448l91026l51019l20241k99027k76827k52800k36380k27716
$$ plain form
58135 4605750 4388877 4186647 3995261 3811035 3638392 3481499 3336075 3197465 3068694
58126 3068694 2952637 2844170 2738046 2637171 2545452 2459533 2375167 2295000 2222582 2154949
58116 2154949 2088218 2024568 1966890 1912333 1857719 1805702 1759175 1715073 1669995 1626563 1587967
58105 1587967 1551356 1512805 1473934 1437597 1401866 1364293 1327704 1295786 1266969 1238198 1210736
58094 1210736 1186895 1164979 1142700 1121782 1104201 1087653 1069688 1052547 1039057 1027401 1014683
58083 1014683 1001928 990835 979340 965205 950414 937188 923167 905445 886052 868509 852009
58072 852009 833873 814981 797981 782641 767403 753179 741423 730788 719558 708891 699984 690888
58060 690888 679909 669299 661583 655026 646682 637184 628494 619720 609353 599081 591191 584490 576770
$$ packed form
58135D605750k16873k02230j91386j84226j72643j56893j45424j38610j28771
58126C068694j16057j08467j06124j00875r1719q5919q4366q0167p2418o7633
58116B154949o6731o3650n7678n4557n4614n2017m6527m4102m5078m3432l8596
58105A587967l6611l8551l8871l6337l5731l7573l6589l1918k8817k8771k7462
58094A210736k3841k1916k2279k0918j7581j6548j7965j7141j3490j1656j2718
58083A014683j2755j1093j1495j4135j4791j3226j4021j7722j9393j7543j6500
58072H52009j8136j8892j7000j5340j5238j4224j1756j0635j1230j0667q907r096
58060F90888j0979j0610p716o557q344r498q690q774j0367j0272p890o701p720
$$ plain form
58047 576770 568981 563128 558410 553341 549240 547588 546294 542635 537698 533880 530313 525007 519309 515792
58033 515792 513458 509404 503737 498635 493965 487954 480991 474788 468876 461649 453792 447106 441060 434061
58019 434061 426934 421570 417267 411980 406162 401844 398832 395289 391298 388525 387098 385916 385244 386027 387500
58004 387500 388359 389264 391304 393180 393025 391879 392184 393813 394743 394731 395137 395861 395613 394566 393863 393247 391924
57987 391924 390849 391275 391993 390973 388796 387426 386548 384314 380962 378406 376748 374316 370781 367337 364247
57972 364247 361078 358810 358756 359805 359643 358310 357764 358413 358995 359431 360727 362321 362503 361345 360395 359648 357638
57955 357638 354449 351796 350149 348467 346675 345683 344970 343025 340284 338953 339673 340995 342366 344973 349262
57940 349262 354171 359268 365339 372380 379275 385888 393324 401705 409730 416843 423746 430337 435167 437516
$$ packed form
58047E76770p789n853m718n069m101j652j294l659m937l818l567n306n698l517
58033E15792k334m054n667n102m670o011o963o203n912p227p857o686o046o999
58019D34061p127n364m303n287n818m318l012l543l991k773j427j182o72P83J473
58004C87500Q59R05K040J876j55j146L05J629R30j2M06P24k48j047p03o16j323
57987C91924j075M26P18j020k177j370q78k234l352k556j658k432l535l444l090
57972C64247l169k268n4J049j62j333n46O49N82M36J296J594J82j158r50p47k010
57955C57638l189k653j647j682j792r92p13j945k741j331P20J322J371K607M289
57940C49262M909N097O071P041O895O613P436Q381Q025P113O903O591M830K349
$$ plain form
57926 437516 438209 437877 436029 432304 427128 420728 412888 403933 394804 386071 377876 370543 364088 357703 351008
57911 351008 345163 341272 338475 335303 332020 329756 328150 325921 323057 320308 317211 312920 308356 305166
57897 305166 303105 300806 298676 298391 299909 301632 303395 306612 311408 316220 320423 324871 329539 333094
57883 333094 335182 336890 338523 339134 338617 338229 338635 339375 340404 342185 344074 344763 344534 345103 347105 349716
57867 349716 352670 356371 359996 361963 362559 363767 366231 368773 371091 374253 378132 381127 383168 386329
57853 386329 391491 396916 401195 405160 409647 413673 416270 418023 419322 418940 415910 411291 406674 402303
57839 402303 397819 393517 389686 385952 382231 379186 376919 374523 371670 369286 367942 367034 366285 366536 368221
57824 368221 370537 372967 376136 380200 383910 386354 388265 390543 392759 394143 394805 394856 393461 389929 384834
$$ packed form
57926D37516O93l32j848l725n176o400p840q955r129q733q195p333o455o385o695
57911C51008n845l891k797l172l283k264j606k229k864k749l097m291m564l190
57897C05166k061k299k130k85J518J723J763L217M796M812M203M448M668L555
57883C33094K088J708J633O11n17l88M06P40J029J781J889O89k29N69K002K611
57867C49716K954L701L625J967N96J208K464K542K318L162L879K995K041L161
57853C86329N162N425M279L965M487M026K597J753J299l82l030m619m617m371
57839D02303m484m302l831l734l721l045k267k396k853k384j344r08p49K51J685
57824C68221K316K430L169M064L710K444J911K278K216J384O62N1j395l532n095
$$ plain form
57809 384834 379053 372587 365241 357649 350703 344593 339103 334183 329726 325488 321626 318561 316069 313450
57795 313450 310790 308982 308257 307805 307072 306262 305344 303961 302636 302662 304357 306752 309365 312828 317303 321792
57779 321792 325631 329361 333533 338052 343109 349269 355963 361392 364651 366595 367978 368243 366901 364537
57765 364537 361544 357285 351554 345597 340624 336397 332187 328108 324627 321747 319392 317666 316204 314416
57751 314416 312888 313222 315882 319527 323088 327027 331734 336265 339769 342862 346438 350203 353400 355987
57737 355987 358177 359865 361282 363142 365405 367097 368014 369196 370889 371599 370279 368087 366733 366298 365904
57722 365904 365321 364601 363264 361187 359316 358269 357174 355084 352558 350556 348754 346366 343788 341967 340694
57707 340694 338907 336260 333316 330703 329024 328996 330657 332944 334943 337007 339835 343190 346424 349511 352681
$$ packed form
57809C84834n781o466p346p592o946o110n490m920m457m238l862l065k492k619
57795C13450k660j808p25m52p33q10r18j383j325K6J695K395K613L463M475M489
57779C21792L839L730M172M519N057O160O694N429L259J944J383K65j342k364
57765C64537k993m259n731n957m973m227m210m079l481k880k355j726j462j788
57751C14416j528L34K660L645L561L939M707M531L504L093L576L765L197K587
57737C55987K190J688J417J860K263J692R17J182J693P10j320k192j354m35l94
57722C65904n83p20j337k077j871j047j095k090k526k002j802k388k578j821j273
57707C40694j787k647k944k613j679k8J661K287J999K064K828L355L234L087L170
$$ plain form
57692 352681 355705 358397 361075 363679 365231 365058 363791 362341 360773 359096 358191 358848 360735 363352 367224
57677 367224 373110 380913 390509 402872 419194 439630 464088 493480 528882 569954 615290 663580
57665 663580 712986 759583 797578 821100 825676 809391 774336 726565 673285 619806 569251 523845
57653 523845 484966 452410 424936 401567 381768 365014 351123 340480 333040 327620 323020 319173
57641 319173 316368 314183 312152 310669 310118 309792 308847 307599 306749 306054 305079 304534 305338 306792 307165 305946
57625 305946 304241 303103 302629 302496 302279 301373 299581 297609 296125 294708 292674 290449 289008 288314 287467 286181
57609 286181 284986 284132 283283 282183 280731 278596 275619 272358 269487 266973 264612 262833 262026 261523 260286
57594 260286 258237 255957 253516 250640 247638 245066 242781 240384 238263 237178 237022 237022 236899 236879 236844 236508 236180
$$ packed form
57692C52681L024K692K678K604J552j73j267j450j568j677r05O57J887K617L872
57677C67224N886P803R596J2363J6322K0436K4458K9392L5402M1072M5336M8290
57665F63580M9406M6597L7995K3522M576j6285l5055m7771n3280n3479n0555m5406
57653E23845l8879l2556k7474k3369j9799j6754j3891j0643p440n420m600l847
57641C19173k805k185k031j483n51l26r45j248q50o95r75n45Q04J454L73j219
57625C05946j705j138m74j33k17r06j792j972j484j417k034k225j441o94q47j286
57609B86181j195q54q49j100j452k135k977l261k871k514k361j779q07n03j237
57594B60286k049k280k441k876l002k572k285k397k121j085j56%j23k0l5l36l28
$$ plain form
57577 236180 236363 236765 236582 235547 233896 231689 229002 226433 224500 222883 221066 219258 217863 216675 215581
57562 215581 215309 216315 217548 217630 216753 216114 215998 215863 215958 217305 220219 224072 228307 232458 235540 236866
57546 236866 237222 237830 238394 237668 235788 234396 234394 235142 235996 237127 238521 239571 240066 240384 240442 239686 238364 237567
57528 237567 237661 237860 237717 237881 238896 240288 241337 241892 242013 241627 240988 240788 241412 242545 243642 244330 244486
57511 244486 244525 245395 247533 250076 251880 252970 253992 254701 254290 252991 251934 251429 250702 249455 248374 247880
57495 247880 247620 247417 247540 247738 247183 245711 244074 242715 241351 240004 239278 239210 238924 237939 236862 236389 236447
57478 236447 236672 236954 237194 237224 237153 237021 236142 233722 230219 227087 225079 223796 222894 222526 222375 221547 219889
57461 219889 218352 217696 217770 218331 219480 220997 222272 223251 224404 225486 225558 224593 223893 224312 225283 226096 226980
$$ packed form
57577B36180J83M02j83j035j651k207k687k569j933j617j817j808j395j188j094
57562B15581k72J006J233Q2q77o39j16j35R5J347K914L853M235M151L082J326
57546B36866L56O08N64p26j880j392kP48Q54J131J394J050M95L18N8p56j322p97
57528B37567R4J99j43J64J015J392J049N55J21l86o39k00O24J133J097O88J56
57511B44486L9Q70K138K543J804J090J022P09m11j299j057n05p27j247j081m94
57495B47880k60k03J23J98n55j472j637j359j364j347p26o8k86r85j077m73N8
57478B36447K25K82K40L0p1j32q79k420l503l132k008j283r02l68j51q28j658
57461B19889j537o56P4N61J149J517J275R79J153J082P2r65p00M19R71Q13Q84
$$ plain form
57444 226980 228200 229223 229634 230004 230994 232365 233617 234882 236450 238025 239190 240091 241008 241712 241813 241383
57428 241383 240874 240763 241482 243105 244932 246003 246213 246316 246749 247286 247916 249040 250553 251733 252414 253265 254514
57411 254514 255471 255894 256769 258978 262004 264731 266841 268684 270371 271681 272431 272406 271391 269678 268074 267047
57395 267047 266370 265857 265777 266303 267216 268515 270558 273266 275920 278135 280351 283039 286079 289223 292398 295266
57379 295266 297289 298626 300181 302418 304851 306961 308766 310138 310506 309691 308183 306194 303305 299493 295627
57364 295627 292468 290044 288360 287762 288057 288283 287910 287407 287111 286572 285622 285062 285510 286430 287021 287240 287311 287110
57346 287110 286704 286598 286739 286191 284556 282808 281926 281584 281019 280293 279839 279674 279930 281241 283538 285359 285564
57329 285564 285094 285859 288383 291584 294354 296296 297357 297835 298496 299791 301283 302490 303802 305730 307827
$$ packed form
57444B26980J220J023M11L70R90J371J252J265J568J575J165R01R17P04J01m30
57428B41383n09j11P19J623J827J071K10J03M33N37O30J124J513J180O81Q51J249
57411B54514R57M23Q75K209L026K727K110J843J687J310P50k5j015j713j604j027
57395B67047o77n13q0N26R13J299K043K708K654K215K216K688L040L144L175K868
57379B95266K023J337J555K237K433K110J805J372L68q15j508j989k889l812l866
57364B95627l159k424j684n98K95K26l73n03k96n39r50n60M48R20N91K19P1k01
57346B87110m06j06J41n48j635j748q82l42n65p26m54j65K56J311K297J821K05
57329B85564m70P65K524L201K770J942J061M78O61J295J492J207J312J928K097
$$ plain form
57314 307827 309280 310137 311049 312224 313499 315055 317105 319259 321008 322567 324421 326392 327887 328746 329185
57299 329185 329322 329408 330019 331268 332377 332794 333193 334521 336599 338552 340117 341592 342971 344145 345553 347666
57283 347666 350061 351946 353311 354772 356641 358985 362174 366385 370931 375052 379095 383961 389619 395092
57269 395092 399656 403175 405573 406976 408211 410147 412592 414677 416154 417523 419025 420383 421469 422425
57255 422425 423277 424147 425636 428171 431137 433490 435033 436382 437937 439793 442391 446205 450786 454976 458176
57240 458176 460734 463166 465760 468796 472385 476075 479298 482172 485292 488880 492716 496688 500764 504726
57226 504726 508624 513136 518704 524655 530020 534941 540421 546935 554172 561836 569716 577206 583809 590035
57212 590035 596848 604356 611982 619773 628428 638028 647861 657636 667841 678610 689157 698684 707199
$$ packed form
57314C07827J453Q57R12J175J275J556K050K154J749J559J854J971J495Q59M39
57299C29185J37Q6O11J249J109M17L99J328K078J953J565J475J379J174J408K113
57283C47666K395J885J365J461J869K344L189M211M546M121M043M866N658N473
57269C95092M564L519K398J403J235J936K445K085J477J369J502J358J086R56
57255D22425Q52Q70J489K535K966K353J543J349J555J856K598L814M581M190L200
57240D58176K558K432K594L036L589L690L223K874L120L588L836L972M076L962
57226E04726L898M512N568N951N365M921N480O514P237P664P880P490O603O226
57212E90035O813P508P626P791Q655R600R833R775J0205J0769J0547R527Q515
$$ plain form
57199 707199 715218 723254 731724 740768 750021 759088 768243 778244 789524 801979 815200 828392 840553
57186 840553 851538 862577 874868 888110 901359 914868 929782 946218 963030 979535 996248
57175 996248 1013723 1031844 1050532 1070069 1090406 1111013 1131775 1153248 1175838 1199440 1223992
57164 1223992 1249571 1275892 1302565 1329967 1358972 1389727 1421487 1453710 1486409 1519446 1552519
57153 1552519 1585982 1620636 1656493 1692712 1728905 1765487 1802627 1840047 1878099 1917797 1959258
57142 1959258 2001227 2042663 2083811 2125174 2166568 2208009 2250615 2295747 2343836 2394760 2448853
57131 2448853 2506830 2569121 2635791 2706856 2782405 2862800 2948831 3041126 3139294 3242352 3350145
57120 3350145 3463677 3584122 3712515 3850556 4000511 4163834 4340806 4531902 4738558
$$ packed form
57199G07199Q019Q036Q470R044R253R067R155J0001J1280J2455J3221J3192J2161
57186H40553J0985J1039J2291J3242J3249J3509J4914J6436J6812J6505J6713
57175I96248J7475J8121J8688J9537K0337K0607K0762K1473K2590K3602K4552
57164A223992K5579K6321K6673K7402K9005L0755L1760L2223L2699L3037L3073
57153A552519L3463L4654L5857L6219L6193L6582L7140L7420L8052L9698M1461
57142A959258M1969M1436M1148M1363M1394M1441M2606M5132M8089N0924N4093
57131B448853N7977O2291O6670P1065P5549Q0395Q6031R2295R8168J03058J07793
57120C350145J13532J20445J28393J38041J49955J63323J76972J91096K06656
$$ plain form
57111 4738558 4962351 5204718 5468165 5756636 6074170 6424552 6813362 7249626 7745032
57102 7745032 8313258 8971678 9743203 10655594 11739703 13028229 14553030 16340440 18409209
57093 18409209 20774004 23448906 26444960 29765508 33406471 37359107 41607279 46119800
57085 46119800 50842471 55680843 60460724 64886556 68556013 71066376 72163849 71830617
57077 71830617 70249330 67687961 64399297 60586617 56415806 52031403 47560145 43109660
57069 43109660 38769012 34609866 30687553 27043528 23707708 20698051 18019059 15662922
57061 15662922 13612810 11845065 10330248 9035635 7928901 6980392 6163577 5455681
57053 5455681 4838482 4297596 3820794 3397666 3020533 2684377 2385573 2121210 1889112
$$ packed form
57111D738558K23793K42367K63447K88471L17534L50382L88810M36264M95406
57102G745032N68226O58420P71525R12391J084109J288526J524801J787410K068769
57093A8409209K364795K674902K996054L320548L640963L952636M248172M512521
57085D6119800M722671M838372M779881M425832L669457K510363J097473l33232
57077G1830617j581287k561369l288664l812680m170811m384403m471258m450485
57069D3109660m340648m159146l922313l644025l335820l009657k678992k356137
57061A5662922k050112j767745j514817j294613j106734r48509q16815p07896
57053E455681o17199n40886m76802m23128l77133l36156k98804k64363k32098
$$ plain form
57044 1889112 1687117 1512045 1360156 1228492 1114844 1016595 930842 855769 790825 735411
57034 735411 688380 648913 616841 591911 573654 561939 556556 556058 557935 559803 559120 551844 533271
57021 533271 501298 458118 408241 355773 303753 254527 209450 168753 132403 100707 73829
57010 73829 51428 33103 18466 6510 -4215 -14479 -24134 -33206 -42161 -50828 -58268 -64267 -69837
56997 -69837 -75631 -80959 -85129 -88687 -92299 -95235 -95991 -93955 -89590 -83438 -75675 -66284 -55010 -41543
56983 -41543 -26302 -10828 2873 13015 18074 17241 11271 2240 -8029 -18702 -29025 -37846 -44632
56970 -44632 -49905 -53974 -56073 -55521 -52845 -48899 -43527 -35970 -26025 -13987 60 16210 34254 53752
56956 53752 73901 92859 107859 116651 118432 113287 101815 85865 68408 51614 35819 21092
$$ packed form
57044A889112k01995j75072j51889j31664j13648r8249q5753p5073o4944n5414
57034G35411m7031l9467l2072k4930j8257j1715n383m98J877J868o83p276j8573
57021E33271l1973m3180m9877n2468n2020m9226m5077m0697l6350l1696k6878
57010G3829k2401j8325j4637F510d215j0264r655r072q955q667p440n999n570
56997f9837n794n328m170l558l612k936p56K036M365O152P763R391J1274J3467
56983d1543J5241a0828B873J0142N059q33n970B240h029j0673j0323q821o786
56970d4632n273m069k099N52K676L946N372P557R945J2038F0J6150J8044J9498
56956E3752K0149J8958J5000Q792J781n145j1472j5950j7457j6794j5795j4727
$$ plain form
56944 21092 8770 315 -4492 -6884 -7109 -4276 2280 12582 26671 44637 66141 90672 117964
56931 117964 147259 176392 202276 222033 233196 233748 223293 204068 179842 153815 127971 103634
56919 103634 81425 60925 41510 23609 8370 -3827 -13797 -22588 -30779 -38523 -45534 -51124 -54927
56906 -54927 -57497 -59689 -61608 -62742 -62849 -62159 -60943 -59400 -57700 -55604 -52355 -47451 -41212 -34140 -26168
56891 -26168 -17045 -6949 3938 15991 29603 44451 59691 74233 86283 93473 94498 90293 82926
56878 82926 73877 64051 54657 46811 40736 36335 34188 35018 38597 44274 52272 63466 78138 96007
56864 96007 117201 142217 171030 203175 238301 275469 311830 342990 364858 374834 371960 357260
56852 357260 333956 306318 277992 251629 229306 212130 199772 191561 187962 190105 198207 211612
$$ packed form
56944B1092H770C15d492k392k25K833B280J0302J4089J7966K1504K4531K7292
56931A17964K9295K9133K5884J9757J1163N52j0455j9225k4226k6027k5844k4337
56919A03634k2209k0500j9415j7901H370c827r970q791q191p744p011n590l803
56906e4927k570k192j919j134j07O90J216J543J700K096L249M904O239P072P972
56891b6168R123f949C938J2053J3612J4848J5240J4542J2050P190J025m205p367
56878H2926r049r826r394p846o075m401k147Q30L579N677P998J1194J4672J7869
56864I6007K1194K5016K8813L2145L5126L7168L6361L1160K1868R976k874j4700
56852C57260k3304k7638k8326k6363k2323j7176j2358q211l599K143Q102J3405
$$ plain form
56840 211612 230187 254507 284852 321225 364265 414680 471364 530859 588588 639457 677408
56829 677408 696289 692567 667207 624905 572106 515352 459953 409087 364175 326117 295747 273291
56817 273291 258171 249515 246497 248524 255819 269545 290534 318028 350389 386651 426141 466604
56805 466604 503652 532136 547445 546144 527228 493389 450131 403059 356208 312358 273428 240117
56793 240117 212085 188900 170392 156287 146489 141649 142453 148302 157689 169936 185480 204370 225503
56780 225503 247408 268510 286268 297289 299071 291181 274738 251741 225072 197888 172219 148597
56768 148597 127208 108552 92802 79410 67703 57188 47216 37269 27829 20076 14506 10638 8102
56755 8102 6927 6559 5761 3920 1545 -864 -3395 -5818 -7294 -7556 -7471 -7859 -8583 -9299 -10176 -11279 -12084
$$ packed form
56840B11612J8575K4320L0345L6373M3040N0415N6684N9495N7729N0869L7951
56829F77408J8881l722k5360m2302n2799n6754n5399n0866m4912l8058l0370k2456
56817B73291j5120q656l018K027P295J3726K0989K7494L2361L6262L9490M0463
56805D66604L7048K8484J5309j301j8916l3839m3258m7072m6851m3850l8930l3311
56793B40117k8032k3185j8508j4105r798m840Q04N849R387J2247J5544J8890K1133
56780B25503K1905K1102J7758J1021J782p890j6443k2997k6669k7184k5669k3622
56768A48597k1389j8656j5750j3392j1707j0515r972r947r440p753n570l868k536
56755H102j175l68p98j841A545h64k531k423j476k62Q5l88p24p16q77j103q05
$$ plain form
56738 -12084 -12244 -12193 -12460 -13007 -13588 -14081 -14086 -13025 -11074 -9244 -8064 -6953 -5296 -3364 -1725 -506 346
56720 819 1319 2564 4538 6353 7556 8716 10218 11435 11742 11469 11213 10995 10793 11112 12277 13868 15524
56703 15524 17546 20032 22215 23488 24361 25526 26613 26881 26588 26640 27271 28023 28771 29808 31075 32207
56687 32207 33324 34936 37046 39059 40746 42663 45354 48547 51451 53661 55517 57516 59486 60573
56673 60573 60170 58647 56924 55518 54345 53217 52012 50570 48928 47559 46811 46359 45796 45469 45873 46414
56657 46414 45853 43969 41822 40323 39541 39482 40416 42110 43748 44972 46128 47285 48025 48437 49175 50146 50275
56640 50275 49102 47548 46527 45852 45181 45018 45898 47366 48573 49329 49933 50522 51116 51705 51960 51493 50734
56623 50734 50683 51417 51773 51026 49962 49712 50391 51430 52354 52656 51753 49776 47664 45984 44435 42926 42104
$$ packed form
56738a2084j60N1k67n47n81m93nJ061J951J830J180J111J657J932J639e06C46
56720H19N00J245J974J815J203J160J502J217L07k73k56k18k02L19J165J591J656
56703A5524K022K486K183J273Q73J165J087K68k93N2O31P52P48J037J267J132
56687C2207J117J612K110K013J687J917K691L193K904K210J856J999J970J087
56673F0573m03j523j723j406j173j128j205j442j642j369p48m52n63l27M04N41
56657D6414n61j884k147j499p82n9R34J694J638J224J156J157P40M12P38R71J29
56640E0275j173j554j021o75o71j63Q80J468J207P56O04N89N94N89K55m67p59
56623E0734n1P34L56p47j064k50O79J039R24L02r03j977k112j680j549j509q22
$$ plain form
56606 42104 42252 42705 43011 43656 44932 46175 46920 47803 49422 51259 52594 53574 54478 54874 54459 53902 53871 54035
56588 54035 53974 54207 55323 56864 58080 59027 60044 60906 61467 62273 63520 64227 63582 62381 62059 62963 64623
56571 64623 66924 69806 72532 74539 76543 79654 83911 88739 94251 100976 108806 117365 126935 137940
56557 137940 149832 161315 171202 178303 181350 180162 176219 171082 164957 157803 150856 145569 141734 138082
56543 138082 134256 130852 128052 125519 123222 121092 118442 115043 112191 111261 111676 111721 110895 109967 109206 108256
56527 108256 107498 107864 109280 110715 111684 112332 112269 110845 108592 106879 106026 105065 103484 101918 100921 100250 99518
56510 99518 98556 97095 95052 93125 92130 91859 91467 90706 89783 88498 86775 85628 86147 87710 88580 88154 87299
56493 87299 86733 86540 87146 89095 91705 93408 93682 93414 93277 93083 92840 93078 93888 94810 95867 97565 99763
$$ packed form
56606D2104J48M53L06O45J276J243P45Q83J619J837J335R80R04L96m15n57l1J64
56588E4035o1K33J116J541J216R47J017Q62N61Q06J247P07o45j201l22R04J660
56571F4623K301K882K726K007K004L111M257M828N512O725P830Q559R570J1005
56557A37940J1892J1483R887P101L047j188l943n137o125p154o947n287l835l652
56543A38082l826l404k800k533k297k130k650l399k852r30M15M5q26r28p61r50
56527A08256p58L66J416J435R69O48o3j424k253j713q53r61j581j566r97o71p32
56510I9518r62j461k043j927r95k71l92p61r23j285j723j147N19J563Q70m26q55
56493H7299n66j93O06J949K610J703K74k68j37j94k43K38Q10R22J057J698K198
$$ plain form
56476 99763 101667 102973 103883 104092 103145 101794 101606 103025 105051 106881 108546 109888 110409 110410 110903 112065 113022
56459 113022 113289 113169 112657 111419 110034 109735 110558 111189 111040 111039 111886 112975 113639 114133 114770 115301 115800 116985
56441 116985 119018 121008 122274 123103 123756 123748 122707 121050 119367 117940 117183 117593 118888 120100 120793 121272
56425 121272 121501 120954 119795 119020 119030 119133 118840 118576 118767 119268 119999 121104 122206 122607 122557 123194 124867 126644
56407 126644 127799 128629 129451 129923 129846 129596 129373 128993 128699 129063 129877 130262 130126 130336 131266 132427 133725 135646
56389 135646 137914 139398 139823 140197 141114 142066 142854 144120 145894 147144 147485 147915 149077 150167 150423 150368 150720
56372 150720 151273 151771 152696 154284 155769 156433 156534 156499 156185 155562 155142 155156 155258 155486 156403 157874 158982 159658
56354 159658 160981 163314 165505 166697 167506 168632 169660 170135 170521 171140 171368 170851 170444 171046 172469 174177
$$ packed form
56476I9763J904J306R10K09r47j351j88J419K026J830J665J342N21JM93J162R57
56459A13022K67j20n12j238j385k99Q23O31j49jQ47J089O64M94O37N31M99J185
56441A16985K033J990J266Q29O53qj041j657j683j427p57M10J295J212O93M79
56425A21272K29n47j159p75J0J03k93k64J91N01P31J105J102M01n0O37J673J777
56407A26644J155Q30Q22M72p7k50k23l80k94L64Q14L85j36K10R30J161J298J921
56389A35646K268J484M25L74R17R52P88J266J774J250L41M30J162J090K56n5L52
56372A50720N53M98R25J588J485O64J01l5l14o23m20J4J02K28R17J471J108O76
56354A59658J323K333K191J192Q09J126J028M75L86O19K28n17m07O02J423J708
$$ plain form
56338 174177 176110 178145 179814 181231 183111 185364 186988 187912 189444 192193 195101 197350 199635 202566
56324 202566 205365 207258 208676 209959 210362 209551 208663 208561 208380 207126 205432 204382 203809 203148 202868 203651
56308 203651 205144 206765 208702 210951 212520 212971 213666 216108 219951 223893 227529 231025 233967 235922 237429
56293 237429 239188 241046 242759 244792 247304 249397 250501 251498 253432 256156 259268 263171 268040 272914
56279 272914 277012 280808 284720 288037 290329 292504 295261 298003 300649 304812 311442 318778 324637 329433
56265 329433 334979 341512 348077 354892 363139 373000 383806 395597 408785 422902 437425 453217 471579
56252 471579 492494 515346 540626 569219 600693 633934 668854 705863 744384 783568 823845
56241 823845 866018 909288 951758 992376 1030915 1066613 1098359 1125674 1148129 1164422 1173439 1175638
$$ packed form
56338A74177J933K035J669J417J880K253J624R24J532K749K908K249K285K931
56324B02566K799J893J418J283M03q11q88j02j81j254j694j050n73o61k80P83
56308B03651J493J621J937K249J569M51O95K442L843L942L636L496K942J955J507
56293B37429J759J858J713K033K512K093J104R97J934K724L112L903M869M874
56279B72914M098L796L912L317K292K175K757K742K646M163O630P336N859M796
56265C29433N546O533O565O815Q247R861J0806J1791J3188J4117J4523J5792J8362
56252D71579K0915K2852K5280K8593L1474L3241L4920L7009L8521L9184M0277
56241H23845M2173M3270M2470M0618L8539L5698L1746K7315K2455J6293R017K199
$$ plain form
56229 1175638 1172100 1162987 1148207 1128742 1105946 1080285 1052038 1022217 991574 959869 927482 896270
56217 896270 867254 838862 809280 779181 750259 722591 695601 670217 647551 626556 605519
56206 605519 584937 566465 549860 533513 517318 502485 489085 476222 464173 454018 445633 438240
56194 438240 432348 428797 426523 423703 420631 419012 418896 418768 418267 418278 418684 418552 418314 419260 421033 422049
56178 422049 422304 423369 425694 428269 430848 434156 437911 441031 443828 447821 453321 459267 465336 472156
56164 472156 479582 486931 494643 503653 513420 522831 532681 544884 559510 575019 591227 609665 631153
56151 631153 655455 683135 715375 752029 792230 836794 887790 946007 1011206 1084453 1167596
56140 1167596 1260523 1361256 1468265 1580043 1692808 1801551 1903307 1996976 2080474 2151312
$$ packed form
56229A175638l538r113j4780j9465k2796k5661k8247k9821l0643l1705l2387l1212
56217H96270k9016k8392k9582l0099k8922k7668k6990k5384k2666k0995k1037
56206F05519k0582j8472j6605j6347j6195j4833j3400j2863j2049j0155q385p393
56194D38240n892l551k274k820l072j619j16j28n01J1M06j32k38R46J773J016
56178D22049K55J065K325K575K579L308L755L120K797L993N500N946O069O820
56164D72156P426P349P712R010R767R411R850J2203J4626J5509J6208J8438K1488
56151F31153K4302K7680L2240L6654M0201M4564N0996N8217O5199P3247Q3143
56140A167596R2927J00733J07009J11778J12765J08743J01756R3669Q3498P0838
$$ plain form
56130 2151312 2210033 2260217 2304766 2344478 2379675 2410113 2433336 2446170 2448081 2440647 2424308 2398637
56118 2398637 2365144 2326039 2280083 2223062 2152601 2069427 1974339 1867968 1754027 1639021 1527816
56107 1527816 1422391 1324961 1238522 1163626 1098205 1041356 994118 955977 924185 897243 875734
56096 875734 859122 845248 833661 825832 821298 817225 812638 809465 808488 807922 807017 807372 809519 811787
56082 811787 813754 817277 822877 828610 833770 840222 848726 857381 865050 873039 882141 891308 900444 911150
56068 911150 923533 935529 946480 958149 971288 984601 997869 1012597 1028819 1044856 1060802
56057 1060802 1078380 1096868 1113405 1127958 1143496 1160540 1176279 1189974 1204178 1219417 1232848
56046 1232848 1243849 1255853 1270788 1286592 1302073 1319284 1339143 1359583 1380077 1403128 1429331
$$ packed form
56130B151312N8721N0184M4549L9712L5197L0438K3223J2834J911p434j6339k5671
56118B398637l3493l9105m5956n7021p0461q3174r5088j06371j13941j15006j11205
56107A527816j05425r7430q6439p4896o5421n6849m7238l8141l1792k6942k1509
56096H75734j6612j3874j1587p829m534m073m587l173r77n66r05L55K147K268
56082H11787J967L523N600N733N160O452Q504Q655P669P989R102R167R136J0706
56068I11150J2383J1996J0951J1669J3139J3313J3268J4728J6222J6037J5946
56057A060802J7578J8488J6537J4553J5538J7044J5739J3695J4204J5239J3431
56046A232848J1001J2004J4935J5804J5481J7211J9859K0440K0494K3051K6203
$$ plain form
56035 1429331 1455853 1481715 1509545 1540282 1571490 1602801 1637409 1675965 1714596 1751269 1788433
56024 1788433 1827110 1864485 1899976 1937521 1978951 2021146 2062705 2107164 2156591 2208353 2261361
56013 2261361 2318866 2381638 2445190 2507608 2573378 2645606 2721251 2798127 2879500 2967382 3058264
56002 3058264 3150204 3247286 3352515 3463239 3577997 3700547 3832505 3969656 4110384 4259976
55992 4259976 4421810 4592575 4771223 4963858 5174328 5398988 5636520 5893498 6174330
55983 6174330 6475593 6796703 7145890 7528965 7943129 8388964 8877036 9415204 10001934
55974 10001934 10640625 11347773 12138187 13016086 13990839 15087671 16333380 17748259 19365205
55965 19365205 21243141 23453698 26076752 29223306 33039289 37665581 43210857 49779262
$$ packed form
56035A429331K6522K5862K7830L0737L1208L1311L4608L8556L8631L6673L7164
56024A788433L8677L7375L5491L7545M1430M2195M1559M4459M9427N1762N3008
56013B261361N7505O2772O3552O2418O5770P2228P5645P6876Q1373Q7882R0882
56002C058264R1940R7082J05229J10724J14758J22550J31958J37151J40728J49592
55992D259976J61834J70765J78648J92635K10470K24660K37532K56978K80832
55983F174330L01263L21110L49187L83075M14164M45835M88072N38168N86730
55974A0001934O38691P07148P90414Q77899R74753J096832J245709J414879J616946
55965A9365205J877936K210557K623054L146554L815983M626292N545276O568405
$$ plain form
55957 49779262 57505281 66553386 77124883 89499205 104044785 121163369 141237112
55950 141237112 164592925 191359590 221192821 253083258 285368310 315712309 340915549
55943 340915549 357055954 360612946 350222902 327662576 297081224 263095663 229250865
55936 229250865 197634088 169242639 144409556 123067047 104943462 89702850 76980576
55929 76980576 66383017 57534529 50128684 43917244 38677806 34222553 30417458 27161868
55921 27161868 24359123 21924376 19802499 17954322 16335479 14905078 13641566 12531469
55913 12531469 11551978 10679030 9901645 9213307 8598426 8040620 7535255 7080991 6667405
55904 6667405 6282899 5926627 5601008 5300199 5017043 4753795 4514808 4295229 4087407
$$ packed form
55957D9779262P726019R048105J0571497J2374322J4545580J7118584K0073743
55950A41237112K3355813K6766665K9833231L1890437L2285052L0343999K5203240
55943C40915549J6140405L556992j0390044k2560326l0581352l3985561l3844798
55936B29250865l1616777k8391449k4833083k1342509j8123585j5240612j2722274
55929G6980576j0597559q848488p405845o211440n239438m455253l805095l255590
55921B7161868k802745k434747k121877j848177j618843j430401j263512j110097
55913A2531469r79491q72948p77385o88338o14881n57806n05365m54264m13586
55904F667405l84506l56272l25619l00809k83156k63248k38987k19579k07822
$$ plain form
55895 4087407 3892159 3713565 3548661 3392151 3245776 3113437 2992049 2876325 2767890
55886 2767890 2670893 2582951 2498760 2418485 2344565 2274170 2202623 2130726 2061563 1993777 1924995
55875 1924995 1858136 1797369 1741248 1686401 1634340 1587918 1544587 1499966 1455025 1413291 1374006
55864 1374006 1334513 1296496 1263468 1234563 1206840 1181079 1159188 1138284 1113525 1084940 1055905
55853 1055905 1026956 996680 966665 939798 915113 889565 863528 839670 817899 796164 774780
55842 774780 755465 737559 719515 702400 687721 673697 658046 642524 630217 620165 609233
55831 609233 597585 587675 579372 570663 561914 554965 549113 542202 534597 527987 521413 512554 501861 491615
55817 491615 481987 471823 462047 454468 448358 441968 436162 432784 430775 427870 424888 424376 426111 427910
$$ packed form
55895D087407j95248j78594j64904j56510j46375j32339j21388j15724j08435
55886B767890r6997q7942q4191q0275p3920p0395p1547p1897o9163o7786o8782
55875A924995o6859o0767n6121n4847n2061m6422m3331m4621m4941m1734l9285
55864A374006l9493l8017l3028k8905k7723k5761k1891k0904k4759k8585k9035
55853A055905k8949l0276l0015k6867k4685k5548k6037k3858k1771k1735k1384
55842G74780j9315j7906j8044j7115j4679j4024j5651j5522j2307j0052j0932
55831F09233j1648r910q303q709q749o949n852o911p605o610o574q859j0693j0246
55817D91615r628j0164r776p579o110o390n806l378k009k905k982n12J735J799
$$ plain form
55803 427910 429857 433679 438879 443564 448301 455136 463404 470369 475449 480051 483835 485040 484048 482819
55789 482819 481110 476892 470208 463070 455968 448119 440809 436612 435220 433496 429740 424732 418846 411735
55775 411735 404957 401491 402343 406575 414475 427366 444224 461806 478238 493109 503826 505581 496103
55762 496103 477847 454942 430492 407048 386636 369283 353583 339205 326854 315949 304857
55751 304857 293509 283297 274353 265401 256359 248491 241888 235345 228847 223595 219481 215119 210521 207062
55737 207062 204620 201485 197453 194282 192613 191068 188929 187173 186247 185293 184207 184042 184680 184355 182214
55722 182214 179229 176059 172239 168019 164804 163051 161834 160984 161544 163552 165601 167237 169583 172919 175854
55707 175854 177728 179644 182156 183948 183872 182418 180180 176659 171720 166637 162537 159106 155723 152684 150499
$$ packed form
55803D27910J947L822N200M685M737O835Q268O965N080M602L784J205r92j229
55789D82819j709m218o684p138p102p849p310m197j392j724l756n008n886p111
55775D11735o778l466Q52M232P900J2891J6858J7582J6432J4871J0717J755r478
55762D96103j8256k2905k4450k3444k0412j7353j5700j4378j2351j0905j1092
55751C04857j1348j0212q944q952r042p868o603o543o498n252m114m362m598l459
55737B07062k442l135m032l171j669j545k139j756r26r54j086j65O38l25k141
55722A82214k985l170l820m220l215j753j217q50N60K008K049J636K346L336K935
55707A75854J874J916K512J792p6j454k238l521m939n083m100l431l383l039k185
$$ plain form
55692 150499 149162 148644 148989 149551 149374 148615 148268 148378 148101 147670 148506 151001 153948 156630 159700 163406 166680
55675 166680 168767 170216 171500 172098 171681 170928 170467 170091 169475 168544 166864 163900 160129 156632 153497 150026
55659 150026 146551 144401 143915 144196 145072 147502 151601 156021 159815 163302 166634 169192 170881 172352 173410
55644 173410 172930 170916 168864 167425 165445 162070 158051 154081 149594 144249 139063 134935 131359 127614
55630 127614 124030 121097 118521 116092 114375 113636 113107 112125 110971 109902 108448 106464 104769 103912 103264
55615 103264 102090 100645 99525 98739 98084 97643 97449 97307 97273 97529 97678 97087 95993 95203 94750 94090 93541 93984
55597 93984 95059 95285 94239 92977 92036 90784 89157 88157 87969 87384 85890 84642 84554 85099 85877 87580
55581 87580 90361 92881 94206 95240 97111 99564 102142 105549 110482 116221 121722 127139 133106 139465
$$ packed form
55692A50499j337n18L45N62j77p59l47J10k77m31Q36K495K947K682L070L706L274
55675A66680K087J449J284N98m17p53m61l76o16r31j680k964l771l497l135l471
55659A50026l475k150m86K81Q76K430M099M420L794L487L332K558J689J471J058
55644A73410m80k014k052j439j980l375m019l970m487n345n186m128l576l745
55630A27614l584k933k576k429j717p39n29r82j154j069j454j984j695q57o48
55615A03264j174j445j120p86o55m41j94j42l4K56J49n91j094p90m53o60n49M43
55597I3984J075K26j046j262r41j252j627j000j88n85j494j248q8N45P78J703
55581H7580K781K520J325J034J871K453K578L407M933N739N501N417N967O359
$$ plain form
55567 139465 145750 151972 157811 161967 163389 162383 159611 154987 148584 141662 135626 130667 126259 122249
55553 122249 118589 114832 110807 107085 104012 101098 98020 95304 93297 91430 89343 87796 87567 88323 89345
55538 89345 90497 91791 92912 93881 95201 96685 97220 96441 95493 95318 95367 94834 93927 92969 91510 89415 87634
55521 87634 86683 85473 82896 79578 76851 74899 73131 71429 69797 67679 64897 62451 61184 60428 59150
55506 59150 57616 56693 56378 56275 56695 57937 59216 59716 60018 61119 62621 63274 62806 61867 60694 59246 58178
55489 58178 58275 59149 59779 60053 60603 61397 61800 61858 62289 63248 64161 64728 65211 65780 66379 67118 68040 68719 68749 68383
55469 68383 68076 67777 67227 66468 65432 63678 61237 59053 57848 57215 56572 56190 56420 56781 56875 57330 58649
55452 58649 59850 59597 58125 56800 56280 56308 56742 57474 57775 57021 55778 55027 54726 54374 54464 55911 58245 59844
$$ packed form
55567A39465O285O222N839M156J422j006k772m624o403o922o036m959m408m010
55553A22249l660l757m025l722l073k914l078k716k007j867k087j547k29P56J022
55538H9345J152J294J121R69J320J484N35p79r48j75M9n33r07r58j459k095j781
55521H7634r51j210k577l318k727j952j768j702j632k118k782k446j267p56j278
55506E9150j534r23l15j03M20J242J279N00L02J101J502O53m68r39j173j448j068
55489E8178R7Q74O30K74N50P94M03N8M31R59R13N67M83N69N99P39R22O79L0l66
55469F8383l07k99n50p59j036j754k441k184j205o33o43l82K30L61R4M55J319
55452E8649J201k53j472j325n20K8M34P32L01p54j243p51l01l52R0J447K334J599
$$ plain form
55434 59844 59999 59579 59625 60311 61293 62134 62440 62412 62991 64625 66301 66753 66191 65754 65698 65393 64800 64605 64995
55415 64995 65552 66339 67925 70269 72587 74294 75186 74852 72976 70146 67430 65201 63229 61649 60829 60490
55399 60490 60029 59570 59699 60320 60788 60987 61281 61601 61634 61647 62030 62272 61565 60228 59393 59447 59939 60697 61765
55380 61765 62513 62268 61706 62103 63258 63719 63136 62760 63317 63984 63965 63568 63147 62372 61239 60488 60251 59462 57469
55361 57469 55244 54120 54102 54284 54235 54165 54194 54245 54361 54592 54820 54987 55221 55558 55829 55965 55982 55770 55321 55120
55341 55120 55604 56329 56373 55540 54461 53576 52834 52348 52405 52756 52850 52900 53725 55359 56776 57284 57247 57158 56976 56770
55321 56770 57011 57710 58068 57527 56483 55559 54893 54566 54929 55920 56727 56792 56610 56964 57832 58602 59039 59489 60299
55302 60299 61404 62351 62581 61932 60920 60271 60158 60228 60218 60104 59794 59265 58899 58989 59039 58332 57178 56724 57414
$$ packed form
55434E9844J55m20M6O86R82Q41L06k8N79J634J676M52n62m37n6l05n93j95L90
55415F4995N57P87J586K344K318J707Q92l34j876k830k716k229j972j580q20l39
55399F0490m61m59J29O21M68J99K94L20L3J3L83K42p07j337q35N4M92P58J068
55380F1765P48k45n62L97J155M61n83l76N57O67j9l97m21p75j133p51k37p89j993
55361E7469k225j124j8J82m9p0K9N1J16K31K28J67K34L37K71J36J7k12m49k01
55341E5120M84P25M4q33j079q85p42m86N7L51R4N0Q25J634J417N08l7q9j82k06
55321E6770K41O99L58n41j044r24o66l27L63R91Q07O5j82L54Q68P70M37M50Q10
55302F0299J105R47K30o49j012o49j13P0j0j14l10n29l66R0N0p07j154m54O90
$$ plain form
55283 57414 58482 59138 59366 59334 58858 57882 56810 56015 55529 55422 55826 56445 56755 56873 57436 58458 59178 59373
55265 59373 59908 61446 63396 64691 65013 64718 64100 63274 62367 61441 60609 60396 61363 63074 64240 64294 64132 64710
55247 64710 65667 66050 65804 65630 65646 65138 63721 62074 61252 61577 62382 62724 62258 61428 60888 60885 61261 61772 62182
55228 62182 62290 62218 62446 63216 64151 64827 65362 65911 66030 65292 64179 63514 63259 62787 62168 62146 62835 63517 63797
55209 63797 63977 64118 63798 63055 62600 62698 62741 62292 61704 61365 61186 61129 61428 61931 62097 61971 62239 63006 63467 63264
55189 63264 63130 63602 64070 63801 63019 62261 61501 60714 60448 60968 61505 61297 60795 60964 61910 63112 64453 65983
55171 65983 67077 66985 66131 65846 66710 68007 68931 69512 70088 70512 70413 69903 69610 69982 70780 71362 71412 71254 71358
55152 71358 71788 72336 72966 73696 74231 74226 73846 73503 73069 71957 70046 68024 66693 66365 66928 67930 68693 68952
$$ packed form
55283E7414J068O56K28l2m76r76j072p95m86j07M04O19L10J18N63J022P20J95
55265E9373N35J538J950J295L22k95o18q26r07r26q32k13R67J711J166N4j62N78
55247F4710R57L83k46j74J6n08j417j647q22L25Q05L42m66q30n40lL76N11M10
55228F2182J08p2K28P70R35O76N35N49J19p38j113o65k55m72o19k2O89O82K80
55209F3797J80J41l20p43m55R8M3m49n88l39j79n7K99N03J66j26K68P67M61k03
55189F3264j34M72M68k69p82p58p60p87k66N20N37k08n02J69R46J202J341J530
55171F5983J094r2q54k85Q64J297R24N81N76M24r9n10k93L72P98N82N0j58J04
55152G1358M30N48O30P30N35nl80l43m34j112j911k022j331l28N63J002P63K59
$$ plain form
55134 68952 69299 70293 71284 71031 69466 67835 66961 66474 65987 65890 66449 67114 67361 67381 67385 67056 66291 65704 65761 66088
55114 66088 66221 66322 66585 66699 66523 66601 67340 68288 68894 69323 69838 70018 69420 68493 68114 68577 69615 70947 72183
55095 72183 72677 72129 71010 69995 69417 69519 70493 71834 72516 72395 72567 73651 74640 74394 73442 73182 73912 74787
55077 74787 75259 75445 75365 74890 74282 73854 73262 71972 70258 68972 68463 68447 68695 69129 69499 69724 70312 71655
55059 71655 73121 73668 73263 72851 72991 73225 72893 71989 71110 70872 71326 71750 71348 70387 70122 71209 72810 73795
55041 73795 74146 74416 74486 73874 72907 72526 73035 73851 74414 74646 74662 74671 74994 75622 76012 75878 75752 76128 76510 76118
55021 76118 75174 74614 74838 75578 76713 78250 79678 80272 80044 79654 79482 79468 79677 80280 81106 81882 82675 83449
55003 83449 83604 82808 81888 81866 82386 82178 80968 79769 79354 79483 79771 80219 80683 80823 80838 81399 82552 83471 83569
$$ packed form
55134F8952L47R94R91k53j565j631q74m87m87r7N59O65K47K0Ml29p65n87N7L27
55114F6088J33J01K63J14j76P8P39R48O06M29N15J80n98r27l79M63J038J332J236
55095G2183M94n48j119j015n78J02R74J341O82j21J72J084R89k46r52k60P30Q75
55077G4787M72J86q0m75o08m28n92j290j714j286n09j6K48M34L70K25N88J343
55059G1655J466N47m05m12J40K34l32r04q79k38M54M24m02r61k65J087J601R85
55041G3795L51K70P0o12r67l81N09Q16N63K32J6RL23O28L90j34j26L76L82l92
55021G6118r44n60K24P40J135J537J428N94k28l90j72j4K09O03Q26P76P93P74
55003H3449J55p96r20k2N20k08j210j199m15J29K88M48M64J40J5N61J153R19R8
$$ plain form
54984 83569 83174 82885 82933 83359 84149 84932 85150 84796 84488 84683 85319 86277 87605 89128 90369 91026 91181 91010
54966 91010 90687 90485 90557 90723 90901 91416 92387 93122 92896 92060 91627 91889 92295 92516 92750 92995 92916 92528 92220 92023
54946 92023 91562 90722 89727 88633 87502 86870 87137 87616 87192 85938 85080 85331 86267 87457 89054 91015 92764
54929 92764 94023 95114 96147 96860 97542 99153 101998 105241 108179 111164 114701 118508 122153 125926 130327
54914 130327 135172 139801 143812 147060 149282 150111 149220 146297 141405 135592 130503 126929 124126 120900 116939
54899 116939 112848 109400 107076 105881 105243 104391 103079 101643 100327 99016 97691 96562 95650 94836 94459
54884 94459 95226 97341 100304 103715 107581 111684 115449 118757 122140 125870 129590 133205 137299 142135 146916
54869 146916 150685 153396 155513 156996 157302 156106 153501 149716 144989 139572 133676 127682 122365 118422
$$ packed form
54984H3569l95k89M8M26P90P83K18l54l08J95O36R58J328J523J241O57J55j71
54966I1010l23k02P2J66J78N15R71P35k26q36m33K62M06K21K34K45p9l88l08j97
54946I2023m61q40r95j094j131o32K67M79m24j254q58K51R36J190J597J961J749
54929I2764J259J091J033P13O82J611K845L243K938K985L537L807L645L773M401
54914A30327M845M629M011L248K222Q29q91k923m892n813n089l574k803l226l961
54899A16939m091l448k324j195o38q52j312j436j316j311j325j129r12q14l77
54884I4459P67K115K963L411L866M103L765L308L383L730L720L615M094M836M781
54869A46916L769K711K117J483L06j196k605l785m727n417n896n994n317l943
$$ plain form
54855 118422 115657 113182 110524 107993 105847 103839 101754 99693 97589 95214 92938 91666 91589 91716 91138
54840 91138 90083 89298 89075 89387 90233 91259 91684 91244 90691 90760 91127 90942 89926 88447 87003 86163 86442 87706
54822 87706 89121 90208 91436 93281 95274 96593 97061 96957 96365 95385 94554 94374 94726 95322 96266 97558 98525
54805 98525 98460 97578 96653 95995 95365 94624 93898 93351 93287 94089 95556 96668 96657 95973 95589 95686 95674 95213 94524 93870
54785 93870 93355 93090 93054 92979 92788 92901 93665 94831 96015 97251 98638 99930 101066 102555 104699 106985 109060
54768 109060 111699 115771 120665 124953 128388 132047 136482 140944 144733 148180 151795 155254 157807 159149
54754 159149 159398 158627 156841 154143 150586 146066 140627 134760 129216 124588 121084 118559 116724 115343 114159
54739 114159 112794 111109 109702 109457 110301 111008 110687 109931 109911 110823 111946 112870 113868 115253 117077 119297 121602
$$ packed form
54855A18422k765k475k658k531k146k008k085k061k104k375k276j272p7J27n78
54840I1138j055p85k23L12Q46J026M25m40n53O9L67j85j016j479j444q40K79J264
54822H7706J415J087J228J845J993J319M68j04n92r80q31j80L52N96R44J292R67
54805I8525o5q82r25o58o30p41p26n47o4Q02J467J112j1o84l84R7j2m61o89o54
54785I3870n15k65l6p5j91J13P64J166J184J236J387J292J136J489K144K286K075
54768A09060K639M072M894M288L435L659M435M462L789L447L615L459K553J342
54754A59149K49p71j786k698l557m520n439n867n544m628l504k525j835j381j184
54739A14159j365j685j407k45Q44P07l21p56k0R12J123R24R98J385J824K220K305
$$ plain form
54722 121602 123352 124419 125868 128996 133819 139281 144725 150173 155269 159072 161180 162063 161957 160280 156605
54707 156605 151465 145677 139525 133129 127130 122420 119405 117889 117344 117059 116350 115019 113402 111814 110243
54692 110243 108663 107294 106320 105707 105382 105276 105090 104464 103528 102800 102429 102093 101838 102306 103661 104894 104864 103648
54674 103648 102279 101389 100806 100301 100059 100278 100834 101476 102008 102201 101891 101278 100782 100497 100093 99448 99016 99261
54656 99261 99935 100309 100066 99589 99329 99264 99175 99148 99440 99973 100365 100428 100288 99950 99173 98017 97172 97331 98371 99459
54636 99459 99940 99850 99619 99560 99732 100083 100549 101113 101823 102707 103653 104400 104694 104416 103611 102420 101017 99677 98878
54617 98878 99112 100343 101745 102320 101877 101174 101006 101400 101824 101936 101902 102117 102751 103536 103948 103757 103350 103294 103627
54598 103627 103857 103709 103476 103544 103917 104405 104925 105373 105484 105063 104192 103145 102311 102211 103136 104576 105434 105101
$$ packed form
54722A21602J750J067J449L128M823N462N444N448N096L803K108Q83j06j677l675
54707A56605n140n788o152o396n999m710l015j516n45k85p09j331j617j588j571
54692A10243j580j369r74o13l25j06j86o26r36p28l71l36k55M68J355J233l0j216
54674A03648j369q90n83n05k42K19N56O42N32J93l10o13m96k85m04o45m32K45
54656I9261O74L74k43m77k60o5q9k7K92N33L92O3j40l38p77j156q45J59J040J088
54636I9459M81r0k31n9J72L51M66N64P10Q84R46P47K94k78q05j191j403j340p99
54617I8878K34J231J402N75m43p03j68L94M24J12l4K15O34P85M12j91m07n6L33
54598A03627K30j48k33O8L73M88N20M48J11m21q71j047q34j00R25J440Q58l33
$$ plain form
54580 105101 104045 103180 103018 103593 104729 106074 107273 108429 109978 111845 113222 113560 113334 113428 114174 115399
54564 115399 116886 118240 118757 118154 117080 116359 115973 115413 114710 114450 114907 115777 116669 117379 117839 118298 119287 120879
54546 120879 122258 122630 122317 122294 122912 123798 124800 126143 127629 128565 128636 128237 127821 127522 127505 128030 128951 129684
54528 129684 129850 129557 128988 128205 127395 126816 126418 126022 125869 126425 127563 128474 128569 127968 127083 126239 125810 126089 126781
54509 126781 127125 126724 125900 125112 124523 124219 124278 124399 124041 123229 122680 122791 122989 122551 121717 121443 122219 123578 124778
54490 124778 125638 126587 128032 129777 131143 131690 131704 131896 132702 134003 135348 136304 136749 137035 137635 138481 138981
54473 138981 138956 139124 140233 142100 143980 145537 146882 148052 149138 150587 152623 154609 155838 156669 157986
54458 157986 159693 160824 161083 161145 161290 160926 159818 158743 158380 158427 158338 158125 157874 157255 156151 155125 154598 154097
$$ packed form
54580A05101j056q65j62N75J136J345J199J156J549J867J377L38k26R4P46J225
54564A15399J487J354N17o03j074p21l86n60p03k60M57Q70Q92P10M60M59R89J592
54546A20879J379L72l13k3O18Q86J002J343J486R36P1l99m16k99j7N25R21P33
54528A29684J66k93n69p83q10n79l98l96j53N56J138R11R5o01q85q44m29K79O92
54509A26781L44m01q24p88n89l04N9J21l58q12n49J11J98m38q34k74P76J359J200
54490A24778Q60R49J445J745J366N47J4J92Q06J301J345R56M45K86O00Q46N00
54473A38981k5J68J109J867J880J557J345J170J086J449K036J986J229Q31J317
54458A57986J707J131K59O2J45l64j108j075l63M7q9k13k51o19j104j026n27n01
$$ plain form
54440 154097 152955 151346 150052 149490 149453 149451 148970 147741 146077 144604 143473 142371 141463 141508 142662 144025 144902
54423 144902 145708 146869 147652 147067 145403 143839 142865 142077 141260 140641 140120 139238 137992 136921 136298 135940 135867
54406 135867 136370 137249 137721 137410 136849 136754 137339 138556 140404 142608 144465 145547 146254 147252 148587 149754 150420
54389 150420 150636 150463 149902 149301 149358 150470 152207 153642 154068 153367 151919 150376 149343 148923 148664 148182 147795
54372 147795 148169 149398 150898 152268 153694 155299 156678 157566 158432 159818 161401 162377 162592 162649 163021 163700
54356 163700 164658 165889 166950 167120 166221 164823 163485 162288 161095 159717 157793 155142 152384 150497 149565
54341 149565 148598 146841 144595 142461 140496 138576 136975 136016 135593 135538 135999 136973 137880 138176 138045 137996 138017 137676
54323 137676 136859 135947 135396 135440 135991 136551 136535 136012 135794 136407 137313 137640 137372 137214 137447 137492 136736 135366 134180
$$ packed form
54440A54097j142j609j294n62l7km81j229j664j473j131j102r08M5J154J363Q77
54423A44902Q06J161P83n85j664j564r74p88q17o19n21q82j246j071o23l58p3
54406A35867N03Q79M72l11n61r5N85J217J848K204J857J082P07R98J335J167O66
54389A50420K16j73n61o01N7J112J737J435M26p01j448j543j033m20k59m82l87
54372A47795L74J229J500J370J426J605J379Q88Q66J386J583R76K15N7L72O79
54356A63700R58J231J061J70q99j398j338j197j193j378j924k651k758j887r32
54341A49565r67j757k246k134j965j920j601r59m23n5M61R74R07K96j31m9K1l41
54323A37676q17r12n51M4N51N60j6n23k18O13R06L27k68j58K33M5p56j370j186
$$ plain form
54304 134180 133745 133846 133793 133290 132882 133253 134205 134801 134545 133886 133374 132947 132360 131794 131601 131853 132509 133598 134832
54285 134832 135457 134980 133777 132617 131898 131689 132060 132956 134040 135117 136341 137676 138606 138833 138793 138978 139219
54268 139219 139210 139192 139456 139623 139276 138893 139260 140192 140748 140634 140484 140731 141105 141383 141847 142734 143852 144974 146063
54249 146063 146922 147141 146620 145692 144639 143542 142706 142599 143156 143609 143338 142546 141853 141624 141900 142610 143508 144089
54231 144089 143951 143117 141881 140502 139238 138517 138678 139477 140081 139830 139047 138819 139726 140952 141132 140012 138746
54214 138746 138419 138880 139343 139497 139454 139114 138308 137320 136562 135905 135027 134245 134254 135007 135583 135348 134617 133984 133575 133274
54194 133274 133174 133422 133858 134122 134030 133733 133686 134394 135926 137662 138822 139240 139337 139349 139038 138228 137257 136677 136753
54175 136753 137398 138403 139608 140966 142446 143741 144267 143720 142599 141788 141668 141919 142113 142085 141738 141000 140141
$$ packed form
54304A34180m35J01n3n03m08L71R52N96k56o59n12m27n87n66j93K52O56J089J234
54285A34832O25m77j203j160p19k09L71Q96J084J077J224J335R30K27m0J85K41
54268A39219rj8K64J67l47l83L67R32N56j14j50K47L74K78M64Q87J118J122J089
54249A46063Q59K19n21r28j053j097q36j07N57M53k71p92o93k29K76P10Q98N81
54231A44089j38q34j236j379j264p21J61P99O04k51p83k28R07J226J80j120j266
54214A38746l27M61M63J54m3l40q06r88p58o57q78p82RP53N76k35p31o33m09l01
54194A33274j00K48M36K64r2k97m7P08J532J736J160M18R7J2l11q10r71n80P6
54175A36753O45J005J205J358J480J295N26n47j121q11j20K51J94k8l47p38q59
$$ plain form
54158 140141 139751 140132 140926 141482 141380 140563 139262 137959 137138 136837 136568 135834 134663 133513 132795 132580 132671 132787
54140 132787 132645 132001 130840 129595 128973 129271 129973 130349 130374 130622 131266 131806 131956 132122 132638 133187 133569 134446
54122 134446 136532 139408 141939 143627 144767 145516 145788 146048 147245 149628 152366 154612 156330 157827 159184
54107 159184 160534 162289 164540 166592 167651 167769 167732 168146 168982 169865 170465 170608 170282 169615 168719 167533 165888
54090 165888 163758 161447 159452 158082 157200 156446 155647 154822 153873 152656 151436 150850 151221 152299 153803 155705
54074 155705 157716 159107 159596 159860 160592 161511 162004 162293 163074 164269 165104 165376 165752 166673 167728 168271 168103
54057 168103 167431 166694 166425 166762 167140 167034 166854 167466 168965 170779 172828 175663 179418 183565 187815 192275
54041 192275 196599 200102 203097 207005 212536 218762 224627 230426 236910 243759 250025 255568 260976 266208
$$ packed form
54158A40141l90L81P94N56j02q17j301j303q21l01k69p34j171j150p18k15R1J16
54140A32787j42o44j161j245o22K98P02L76K5K48O44N40J50J66N16N49L82Q77
54122A34446K086K876K531J688J140P49K72K60J197K383K738K246J718J497J357
54107A59184J350J755K251K052J059J18l7M14Q36Q83O00J43l26o67q96j186j645
54090A65888k130k311j995j370q82p54p99q25r49j217j220n86L71J078J504J902
54074A55705K011J391M89K64P32R19M93K89P81J195Q35K72L76R21J055N43j68
54057A68103o72p37k69L37L78j06j80O12J499J814K049K835L755M147M250M460
54041A92275M324L503K995L908N531O226N865N799O484O849O266N543N408N232
$$ plain form
54027 266208 270285 272488 273295 273950 275381 277441 279031 279172 278113 277095 276838 276686 275480 272847 269191
54012 269191 264891 260017 254616 248799 242717 236699 231163 226141 221262 216492 212463 209672 207720 205823
53998 205823 203769 201945 200644 199758 198910 197595 195493 192964 190879 189619 188591 187136 185460 184149 183198
53983 183198 182144 180954 180125 180061 180876 182598 185028 187534 189595 191448 193724 196565 199692 203187 207524
53968 207524 212751 218255 223510 228504 233182 236896 238723 238176 235519 231693 227997 225423 223962 222707
53954 222707 220850 218526 216583 215664 215685 216149 216758 217592 218751 220093 221496 223211 225622 228712 232095 235669
53938 235669 239809 244734 250013 254989 259476 263741 267998 272172 276073 279583 282748 285820 289105 292687
53924 292687 296441 300303 304261 308066 311442 314722 318814 324261 330705 337549 344693 352231 359868 367190
$$ packed form
54027B66208M077K203Q07O55J431K060J590J41j059j018k57j52j206k633l656
54012B69191m300m874n401n817o082o018n536n022m879m770m029k791j952j897
53998B05823k054j824j301q86q48j315k102k529k085j260j028j455j676j311r51
53983A83198j054j190q29o4Q15J722K430K506K061J853K276K841L127L495M337
53968B07524N227N504N255M994M678L714J827n47k657l826l696k574j461j255
53954B22707j857k324j943r19K1M64O09Q34J159J342J403J715K411L090L383L574
53938B35669M140M925N279M976M487M265M257M174L901L510L165L072L285L582
53924B92687L754L862L958L805L376L280M092N447O444O844P144P538P637P322
$$ plain form
53910 367190 374182 380920 386961 391616 394736 396705 397662 397287 395420 392432 388889 385184 381588 378214 374675
53895 374675 370102 363858 356321 348653 341638 334827 327126 318304 309513 301950 295345 288459 280949 273870
53881 273870 268123 263274 258455 253696 249640 246395 243469 240610 237963 235525 233036 230402 227714 224934
53867 224934 222015 219188 216624 214003 210971 207939 205760 204594 203695 202378 200615 198615 196460 194421
53853 194421 193046 192536 192386 192000 191367 190852 190549 190230 189787 189368 188998 188309 186902 184975 183422 183007 183468
53836 183468 183751 183266 182603 182684 183509 184196 184126 183588 183304 183770 185174 187482 190319 192928 194570 195075 195031 195427
53818 195427 196908 199231 201512 203116 204155 205057 205943 206773 207838 209629 212296 215615 219513 224204 229748
53803 229748 235811 242019 248292 254639 260848 266574 271666 276226 280377 284083 287265 290015 292567 294995
$$ packed form
53910C67190O992O738O041M655L120J969R57l75j867k988l543l705l596l374l539
53895C74675m573o244p537p668p015o811p701q822q791p563o605o886p510p079
53881B73870n747m849m819m759m056l245k926k859k647k438k489k634k688k780
53867B24934k919k827k564k621l032l032k179j166q99j317j763k000k155k039
53853A94421j375n10j50l86o33n15l03l19m43m19l70o89j407j927j553m15M61
53836A83468K83m85o63Q1Q25O87p0n38k84M66J404K308K837K609J642N05m4L96
53818A95427J481K323K281J604J039R02Q86Q30J065J791K667L319L898M691N544
53803B29748O063O208O273O347O209N726N092M560M151L706L182K750K552K428
$$ plain form
53789 294995 297100 298753 300189 301625 302708 302790 301845 300625 299714 298830 297280 294735 291303 287193 282640
53774 282640 277835 272684 266942 260837 255076 249982 245086 240047 235418 231934 229478 227389 225344 223232
53760 223232 220555 216933 213065 210248 208825 207888 206613 205160 204061 203414 202986 202622 202257 201861 201506 201180
53744 201180 200579 199546 198680 198845 200019 201214 201726 201870 202295 203173 204363 205788 207263 208392 209049 209647
53728 209647 210638 211986 213391 214663 215711 216489 217228 218370 220011 221727 223155 224412 225697 226885 227871
53713 227871 228982 230628 232788 235188 237803 240796 244082 247334 250393 253376 256477 259868 263718 268029
53699 268029 272432 276368 279536 282151 284811 288163 292490 297484 302483 306970 310760 313708 315546 316215
53685 316215 316123 315854 315672 315481 315166 314728 314132 313212 311895 310416 309209 308489 307959 307074 305677 304231 303283
$$ packed form
53789B94995K105J653J436J436J083Q2r45j220r11q84j550k545l432m110m553
53774B82640m805n151n742o105n761n094m896n039m629l484k456k089k045k112
53760B23232k677l622l868k817j423r37j275j453j099o47m28l64l65l96l55l26
53744B01180o01j033q66J65J174J195N12J44M25Q78J190J425J475J129O57N98
53728B09647R91J348J405J272J048P78P39J142J641J716J428J257J285J188R86
53713B27871J111J646K160K400K615K993L286L252L059K983L101L391L850M311
53699B68029M403L936L168K615K660L352M327M994M999M487L790K948J838O69
53685C16215r2k69j82j91l15m38n96r20j317j479j207p20n30q85j397j446r48
$$ plain form
53668 303283 302795 302222 301208 299932 298776 297904 297224 296590 295910 295233 294805 294895 295491 296259 296844 297118 297118 296926 296688
53649 296688 296651 296959 297406 297482 296835 295729 294908 294864 295411 296206 297481 299725 302678 305268 306871 308073 309765
53632 309765 311978 314121 316074 318359 321409 325155 329288 333398 337011 339901 342310 344549 346645 348775
53618 348775 351601 355449 359508 362719 365373 368820 373494 378217 381771 384367 387117 390731 395134 399748
53604 399748 403672 406190 407671 409536 412802 416965 420774 423688 426011 427940 429181 429513 429158 428472 427596
53589 427596 426522 425318 424160 423136 422030 420370 417927 415108 412603 410627 408811 406833 404764 402682
53575 402682 400361 397578 394420 391168 388125 385643 383923 382636 381139 379259 377453 376031 374712 373294
53561 373294 372276 372311 373327 374630 375637 376108 375872 374896 373672 373122 373860 375628 377531 378834 379606 380573
$$ packed form
53668C03283m88n73j014j276j156q72o80o34o80o77m28R0N96P68N85K74%j92k38
53649B96688l7L08M47P6o47j106q21m4N47P95J275K244K953K590J603J202J692
53632C09765K213K143J953K285L050L746M133M110L613K890K409K239K096K130
53618C48775K826L848M059L211K654L447M674M723L554K596K750L614M403M614
53604C99748L924K518J481J865L266M163L809K914K323J929J241L32l55o86q76
53589D27596j074j204j158j024j106j660k443k819k505j976j816j978k069k082
53575D02682k321k783l158l252l043k482j720j287j497j880j806j422j319j418
53561C73294j018L5J016J303J007M71k36r76j224n50P38J768J903J303P72R67
$$ plain form
53545 380573 382331 384835 387837 391557 396371 401912 407144 411621 416121 421748 428770 436696 445054 453669
53531 453669 462437 471314 480435 489966 499917 510299 521341 533397 546772 561648 577899 594936
53519 594936 612137 629572 647949 667682 688553 710406 733584 758237 783793 809662 836020
53508 836020 863333 891400 919521 947405 975335 1003559 1032067 1060909 1090168 1119586 1148624
53497 1148624 1176976 1204690 1231779 1257999 1283065 1306870 1329498 1351111 1371750 1391181 1409192
53486 1409192 1426146 1442905 1459959 1477056 1493977 1511254 1529572 1548726 1567667 1585405 1601425
53475 1601425 1615459 1627382 1637148 1644421 1648474 1649009 1646775 1642694 1636482 1626958 1613744 1597973 1581166
53462 1581166 1564069 1546750 1529004 1510216 1489396 1466026 1440669 1414383 1387741 1360734 1333334
$$ packed form
53545C80573J758K504L002L720M814N541N232M477M500N627P022P926Q358Q615
53531D53669Q768Q877R121R531R951J0382J1042J2056J3375J4876J6251J7037
53519E94936J7201J7435J8377J9733K0871K1853K3178K4653K5556K5869K6358
53508H36020K7313K8067K8121K7884K7930K8224K8508K8842K9259K9418K9038
53497A148624K8352K7714K7089K6220K5066K3805K2628K1613K0639J9431J8011
53486A409192J6954J6759J7054J7097J6921J7277J8318J9154J8941J7738J6020
53475A601425J4034J1923R766P273M053N35k234m081o212r524j3214j5771j6807
53462A581166j7097j7319j7746j8788k0820k3370k5357k6286k6642k7007k7400
$$ plain form
53451 1333334 1305707 1278023 1250473 1223451 1197355 1172186 1147621 1123555 1100362 1078510 1058122
53440 1058122 1039104 1021624 1006236 993454 983319 975451 969425 965002 962116 960883 961630 964695 970075
53427 970075 977444 986532 997271 1009507 1022840 1037037 1052437 1069710 1089236 1110842 1134094 1158743
53415 1158743 1184938 1213096 1243435 1275655 1309270 1344296 1381328 1420777 1462336 1505457 1550091
53404 1550091 1596664 1645556 1697000 1751253 1808317 1867466 1927582 1988184 2049831 2113250 2178271
53393 2178271 2243897 2309324 2374635 2440458 2507077 2573871 2639511 2702627 2762473 2819170 2873353
53382 2873353 2925513 2975673 3023698 3069671 3113568 3154632 3191645 3224046 3252326 3276914 3297056
53371 3297056 3311190 3317944 3316196 3304638 3282307 3249567 3207823 3158279 3101781 3039805 2974575 2907770
$$ packed form
53451A333334k7627k7684k7550k7022k6096k5169k4565k4066k3193k1852k0388
53440A058122j9018j7480j5388j2782j0135p868o026m423k886j233P47L065N380
53427I70075P369R088J0739J2236J3333J4197J5400J7273J9526K1606K3252K4649
53415A158743K6195K8158L0339L2220L3615L5026L7032L9449M1559M3121M4634
53404A550091M6573M8892N1444N4253N7064N9149O0116O0602O1647O3419O5021
53393B178271O5626O5427O5311O5823O6619O6794O5640O3116N9846N6697N4183
53382B873353N2160N0160M8025M5973M3897M1064L7013L2401K8280K4588K0142
53371C297056J4134O754j748j1558k2331l2740m1744m9544n6498o1976o5230o6805
$$ plain form
53359 2907770 2839864 2770942 2701299 2630930 2559484 2487448 2416591 2348453 2282939 2219023 2156134
53348 2156134 2094065 2032184 1969883 1907572 1846307 1786596 1728365 1671937 1618247 1568054 1521602
53337 1521602 1478933 1439858 1403699 1369817 1338439 1310399 1286028 1264891 1246461 1230333 1215659
53326 1215659 1201156 1186062 1170732 1156133 1143013 1131550 1121384 1111909 1102870 1094729 1088198 1083508
53314 1083508 1080506 1079215 1079786 1082016 1085507 1090318 1096907 1105418 1115519 1127026 1140175 1155166 1171918
53301 1171918 1190390 1210718 1232905 1256707 1281966 1308738 1337050 1366773 1397721 1429632 1462152
53290 1462152 1495114 1528573 1562140 1594617 1624895 1653091 1680196 1706744 1732475 1757122 1780614
53279 1780614 1802342 1821045 1835747 1846310 1852932 1855706 1854879 1850878 1843796 1833275 1819041 1801022
$$ packed form
53359B907770o7906o8922o9643p0369p1446p2036p0857o8138o5514o3916o2889
53348B156134o2069o1881o2301o2311o1265n9711n8231n6428n3690n0193m6452
53337A521602m2669l9075l6159l3882l1378k8040k4371k1137j8430j6128j4674
53326A215659j4503j5094j5330j4599j3120j1463j0166r475r039q141o531m690
53314A083508l002j291N71K230L491M811O589Q511J0101J1507J3149J4991J6752
53301A171918J8472K0328K2187K3802K5259K6772K8312K9723L0948L1911L2520
53290A462152L2962L3459L3567L2477L0278K8196K7105K6548K5731K4647K3492
53279A780614K1728J8703J4702J0563O622K774q27m001p082j0521j4234j8019
$$ plain form
53267 1801022 1778889 1752232 1721515 1688198 1653532 1617727 1580574 1542195 1502805 1462415 1421379
53256 1421379 1380775 1341616 1303988 1267430 1231866 1197586 1164557 1132247 1100086 1067713 1034929
53245 1034929 1001727 968235 934390 899957 865182 831126 798917 768777 740215 713014 687627
53234 687627 664612 644100 625890 609776 595634 583314 572530 562796 553526 544232 534625 524570
53222 524570 514059 503239 492254 481041 469506 457940 447000 437101 428048 419386 410926 402788
53210 402788 395093 387799 380813 374153 367985 362455 357355 352114 346337 340305 334629 329455 324330 318874
53196 318874 313257 307924 303116 298752 294559 290310 286143 282599 280023 278051 276045 273938 272085 270332
53182 270332 267940 264674 261353 258915 257386 256136 254731 253097 251166 248937 246806 245386 244933 245136 245450
$$ packed form
53267A801022k2133k6657l0717l3317l4666l5805l7153l8379l9390m0390m1036
53256A421379m0604l9159l7628l6558l5564l4280l3029l2310l2161l2373l2784
53245A034929l3202l3492l3845l4433l4775l4056l2209l0140k8562k7201k5387
53234F87627k3015k0512j8210j6114j4142j2320j0784r734r270r294r607j0055
53222E24570j0511j0820j0985j1213j1535j1566j0940r899r053q662q460q138
53210D02788p695p294o986o660o168n530n100n241n777o032n676n174n125n456
53196C18874n617n333m808m364m193m249m167l544k576j972k006k107j853j753
53182B70332k392l266l321k438j529j250j405j634j931k229k131j420m53K03L14
$$ plain form
53167 245450 245579 245691 246237 247410 248780 249632 249694 249299 248822 248294 247618 246833 246041 245364 245040 245230 245587 245385
53149 245385 244238 242462 240627 239038 237677 236330 234720 232904 231571 231460 232429 233665 234920 236832 239705
53134 239705 242667 244569 245282 245538 245925 246579 247514 248606 249444 249738 249783 250128 250968 252277 254303 257276 260658
53117 260658 263291 264456 264453 264073 263892 264204 265201 266807 268386 268988 268041 265814 263076 260305 257378 254083
53101 254083 250709 247886 245978 244980 244808 245247 245665 245347 244327 243404 243135 243222 243122 242748 242184 241117 239139
53084 239139 236495 234080 232600 232003 231738 231460 231387 231982 233311 234857 236082 236920 237415 237250 236207 234925
53068 234925 234401 234660 234679 233808 232488 231262 229906 228138 226483 225648 225460 225163 224530 224035 224013 224273 224526 224720
53050 224720 224886 224989 224993 224896 224804 225024 225848 227065 227922 227809 226776 225289 223810 222710 222210 222183 222322 222588 223009
$$ packed form
53167B45450J29J12N46J173J370Q52O2l95m77n28o76p85p92o77l24J90L57k02
53149B45385j147j776j835j589j361j347j610j816j333j11R69J236J255J912K873
53134B39705K962J902P13K56L87O54R35J092Q38K94M5L45Q40J309K026K973L382
53117B60658K633J165ll80j81L12R97J606J579O02r47k227k738k771k927l295
53101B54083l374k823j908r98j72M39M18l18j020r23k69Q7j00l74n64j067j978
53084B39139k644k415j480n97k65k78p3N95J329J546J225Q38M95j65j043j282
53068B34925n24K59J9q71j320j226j356j768j655q35j88k97o33m95k2K60K53J94
53050B24720J66J03Mr7r2K20Q24J217Q57j13j033j487j479j100n00k7J39K66M21
$$ plain form
53031 223009 223099 222244 220855 220259 220943 221760 221536 220671 220302 220567 220762 220748 221026 221588 221760 221240 220432 219669 218910
53012 218910 218251 217949 217791 217236 216416 216271 217300 218779 219625 219638 219475 219683 220220 220844 221577 222546 223473 223662
52994 223662 222819 221748 221731 223144 225141 226854 228295 229751 230959 231515 231618 231827 232371 233258 234628 236387
52978 236387 237946 238981 240061 241702 243196 243352 242193 240949 240443 240482 240766 241351 242020 242232 242070 242417 243835
52961 243835 245926 248067 250008 251438 251826 251183 250306 249700 248871 247291 245474 244347 243883 243184 241806 240282
52945 240282 239191 238289 236892 234820 232614 230821 229368 227833 226169 224830 224146 223959 224049 224509 225352 226065
52929 226065 226031 225233 224167 223275 222841 223141 224157 225281 225836 225742 225238 224239 222655 221107 220516 220924 221509 221796
52911 221796 222185 223095 224293 225284 225830 225855 225416 224895 224695 224588 223891 222465 220980 220042 219624 219506 219632 219801
$$ packed form
53031B23009R0q55j389n96O84Q17k24q65l69K65J95j4K78N62J72n20q08p63p59
53012B18910o59l02j58n55q20j45J029J479Q46J3j63K08N37O24P33R69R27J89
52994B23662q43j071j7J413J997J713J441J456J208N56J03K09N44Q87J370J759
52978B36387J559J035J080J641J494J56j159j244n06L9K84N85O69K12j62L47J418
52961B43835K091K141J941J430L88o43q77o06q29j580j817j127m64o99j378j524
52945B40282j091r02j397k072k206j793j453j535j664j339o84j87R0M60Q43P13
52929B26065l4p98j066q92m34L00J016J124N55r4n04r99j584j548n91M08N85K87
52911B21796L89R10J198R91N46K5m39n21k00j07o97j426j485r38m18j18J26J69
$$ plain form
52893 219801 219618 219115 218954 219704 221299 223385 225666 227753 229174 229860 230163 230255 230004 229575 229504 229981 230665 231448
52875 231448 232720 234531 236204 237226 237941 238872 239916 240698 241205 241610 241941 242400 243469 245163 246658 247229
52859 247229 247118 246964 246799 246249 245277 244062 242433 240066 237025 233549 229633 225390 221526 218741 216818
52844 216818 214997 213083 211508 210384 209303 208141 207358 207222 207260 206783 205646 204286 203233 202728 202655 202741 202931
52827 202931 203510 204706 206259 207593 208374 208750 209087 209641 210417 211182 211671 211830 211710 211213 210231 209116 208574
52810 208574 208867 209552 210282 211379 213144 214999 215976 215903 215570 215711 216312 216892 217073 216801 216315 215919 215598 214927
52792 214927 213626 212065 210967 210674 210907 211126 210893 210113 209231 209041 209938 211423 212551 212787 212259 211467 211013
52775 211013 211345 212329 213274 213774 214251 215248 216421 216866 216312 215333 214366 213223 211779 210563 210237 210792 211592
$$ packed form
52893B19801j83n03j61P50J595K086K281K087J421O86L03R2k51m29p1M77O84P83
52875B31448J272J811J673J022P15R31J044P82N07M05L31M59J069J694J495N71
52859B47229j11j54j65n50r72j215j629k367l041l476l916m243l864k785j923
52844B16818j821j914j575j124j081j162p83j36L8m77j137j360j053n05p3Q6J90
52827B02931N79J196J553J334P81L76L37N54P76P65M89J59j20m97r82j115n42
52810B08574K93O85P30J097J765J855R77p3l33J41O01N80J81k72m86l96l21o71
52792B14927j301j561j098k93K33K19k33p80q82j90Q97J485J128K36n28p92m54
52775B11013L32R84R45N00M77R97J173M45n54r79r67j143j444j216l26N55Q00
$$ plain form
52758 211592 212037 212003 211799 211925 212754 214262 216004 217362 217861 217449 216648 216308 216976 218487 220285 222005 223577
52741 223577 224935 225979 226768 227483 228188 228791 229242 229551 229681 229615 229465 229358 229315 229458 230163 231665 233557 234981
52723 234981 235370 234783 233597 232137 230626 229221 227974 226898 226114 225823 226133 226947 227914 228459 228073 226815
52707 226815 225355 224345 223876 223666 223552 223546 223646 223915 224565 225612 226565 226811 226253 225348 224616 224339 224503 224757
52689 224757 224665 224319 224421 225317 226265 226251 225400 224811 225039 225421 225104 224127 223167 222643 222406 222056 221364 220584 220442
52670 220442 221516 223544 225602 227040 227928 228553 228919 228899 228590 228297 228383 229143 230496 231794 232378 232434 232882 234219
52652 234219 235944 237308 238140 238578 238491 237703 236496 235393 234567 233912 233554 233842 234807 235982 236779 236810 235955 234527
52634 234527 233377 233426 234855 236926 238751 240159 241751 244267 247937 252298 256418 259311 260319 259304 256618
$$ packed form
52758B11592M45l4k04J26Q29J508J742J358M99m12q01l40O68J511J798J720J572
52741B23577J358J044P89P15P05O03M51L09J30o6j50j07m3J43P05J502J892J424
52723B34981L89n87j186j460j511j405j247j076p84k91L10Q14R67N45l86j258
52707B26815j460j010m69k10j14oJ00K69O50J047R53K46n58r05p32k77J64K54
52689B24757r2l46J02Q96R48j4q51n89K28L82l17r77r60n24k37l50o92p80j42
52670B20442J074K028K058J438Q88O25L66k0l09k93Q6P60J353J298N84N6M48J337
52652B34219J725J364Q32M38q7p88j207j103q26o55l58K88R65J175P97L1q55j428
52634B34527j150M9J429K071J825J408J592K516L670M361M120K893J008j015k686
$$ plain form
52619 256618 252905 248862 245029 241774 239385 238012 237436 237037 236261 235187 234466 234558 235134 235415 235078 234624 234760
52602 234760 235671 237127 239042 241461 243964 245679 246189 246088 246224 246615 246586 245849 244903 244291 243968 243642 243359
52585 243359 243418 243896 244581 245293 246081 247117 248530 250290 252174 253908 255416 256842 258234 259241 259249 257871
52569 257871 255391 252811 251318 251428 252533 253445 253469 252845 252184 251762 251531 251463 251504 251332 250592 249493 248831 249168
52551 249168 250139 250723 250169 248581 246710 245418 245235 246180 247797 249490 250914 252077 253040 253680 253862 253683
52535 253683 253366 252990 252562 252291 252483 253064 253504 253420 253096 253174 253921 254971 255746 255972 255806 255651 255837 256399 257151
52516 257151 258053 259421 261551 264186 266566 268191 269401 271046 273639 276958 280430 283645 286335 288082
52502 288082 288406 287196 284848 281853 278498 275051 271950 269541 267784 266417 265236 264025 262484 260599
$$ packed form
52619B56618l713m043l833l255k389j373n76l99p76j074p21R2N76K81l37m54J36
52602B34760R11J456J915K419K503J715N10j01J36L91k9p37r46o12l23l26k83
52585B43359N9M78O85P12P88J036J413J760J884J734J508J426J392J007Qj378
52569B57871k480k580j493J10J105R12K4o24o61m22k31o8M1j72p40j099o62L37
52551B49168R71N84n54j588j871j292j83R45J617J693J424J163R63O40J82j79
52535B53683l17l76m28k71J92N81M40q4l24P8P47J050P75K26j66j55J86N62P52
52516B57151R02J368K130K635K380J625J210J645K593L319L472L215K690J747
52502B88082L24j210k348k995l355l447l101k409j757j367j181j211j541j885
$$ plain form
52488 260599 258880 257863 257552 257684 258290 259395 260395 260519 259936 259627 260067 260807 261558 262752 264519 265996
52472 265996 266409 266277 266738 268084 269715 271228 272793 274663 277064 280395 284821 289699 294040 297544 300551
52457 300551 303074 304594 304891 304379 303408 301781 299230 295895 292155 288383 284964 282181 279937 277983 276426
52442 276426 275536 275039 274224 272918 271793 271334 271137 270664 270218 270512 271469 272085 271559 270153 268818 268254 268502
52425 268502 269263 270239 271100 271369 270768 269773 269443 270399 272203 274010 275599 277394 279715 282506 285737 289528
52409 289528 293894 298843 304773 312285 321457 331705 342360 352891 362502 370126 375062 377179 376367 372399
52395 372399 365720 357798 350150 343256 336780 330512 324634 319371 314887 311427 309165 307999 307796 308626 310393
52380 310393 312345 313484 313560 313351 313874 315526 318018 320889 324012 327668 332227 337692 343583 349307 354527
$$ packed form
52488B60599j719j017l11J32O06J105J000J24n83l09M40P40P51J194J767J477
52472B65996M13j32M61J346J631J513J565J870K401L331M426M878M341L504L007
52457C00551K523J520K97n12r71j627k551l335l740l772l419k783k244j954j557
52442B76426q90m97q15j306j125m59j97m73m46K94R57O16n26j406j335n64K48
52425B68502P61R76Q61K69o01r95l30R56J804J807J589J795K321K791L231L791
52409B89528M366M949N930P512R172J0248J0655J0531R611P624M936K117q12l968
52395C72399o679p922p648o894o476o268n878n263m484l460k262j166k03Q30J767
52380C10393J952J139P6k09N23J652K492K871L123L656M559N465N891N724N220
$$ plain form
52365 354527 359091 362691 364803 365014 363431 360822 358323 356772 356170 355869 355355 354736 354411 354573 355198 356284
52349 356284 357765 359257 360316 361018 361991 363703 365947 368272 370714 373752 377521 381591 385776 390795 397610
52334 397610 406188 415471 424662 434076 444564 456595 470172 485112 500865 516439 531246 545964
52322 545964 562003 579979 599112 618100 636180 653287 669638 685360 700346 714389 727549
52311 727549 740255 752806 764965 776368 787146 797678 807880 817242 825492 832706 838832 843739
52299 843739 847811 851847 856099 859909 862553 864003 864590 864222 862223 857834 850854 842075 832998 824730 817197
52284 817197 809885 803154 798157 795475 794654 795225 797389 801383 806934 813796 822172 832089 842922 854064
52270 854064 865591 877773 890396 903078 915739 928206 939796 950011 959330 968735 978670 988983
$$ packed form
52365C54527M564L600K112K11j583k609k499j551o02l01n14o19l25J62O25J086
52349C56284J481J492J059P02R73J712K244K325K442L038L769M070M185N019O815
52334C97610Q578R283R191R414J0488J2031J3577J4940J5753J5574J4807J4718
52322E45964J6039J7976J9133J8988J8080J7107J6351J5722J4986J4043J3160
52311G27549J2706J2551J2159J1403J0778J0532J0202R362Q250P214O126M907
52299H43739M072M036M252L810K644J450N87l68j999m389o980q779r077q268p533
52284H17197p312o731m997k682q21N71K164L994N551O862Q376R917J0833J1142
52270H54064J1527J2182J2623J2682J2661J2467J1590J0215R319R405R935J0313
$$ plain form
52258 988983 999522 1010061 1019881 1028130 1034729 1040441 1046041 1051753 1057419 1062726 1067247 1070511 1072045 1071324
52244 1071324 1068018 1062542 1055887 1048552 1040095 1030260 1020004 1010631 1002252 994024 985786 978470 972678 967751
52230 967751 962767 957896 954187 952309 951975 952537 953707 955547 957879 960096 961796 963547 966539 971282 976952
52215 976952 982348 987221 992283 998165 1004850 1011988 1019288 1026555 1033709 1040805 1047797 1054386 1060396 1066161
52201 1066161 1072190 1078506 1084702 1090601 1096441 1102387 1108245 1113822 1119353 1125381 1132212 1139441 1146035 1151175
52187 1151175 1155056 1158561 1161954 1164361 1164846 1163489 1160930 1157273 1152135 1145494 1137722 1128893 1118887 1108258
52173 1108258 1098249 1089660 1082221 1075323 1068941 1063527 1059335 1056161 1053549 1051218 1049416 1048891 1050209 1053108
52159 1053108 1056726 1060365 1063667 1066269 1067900 1068890 1069999 1071449 1072514 1072318 1070721 1068284 1065720 1063589
$$ packed form
52258I88983J0539J0539R820Q249O599N712N600N712N666N307M521L264J534p21
52244A071324l306n476o655p335q457r835j0256r373q379q228q238p316n792m927
52230I67751m984m871l709j878l34N62J170J840K332K217J700J751K992M743N670
52215I76952N396M873N062N882O685P138P300P267P154P096O992O589O010N765
52201A066161O029O316O196N899N840N946N858N577N531O028O831P229O594N140
52187A151175L881L505L393K407M85j357k559l657n138o641p772q829j0006j0629
52173A108258j0009q589p439o898o382n414m192l174k612k331j802n25J318K899
52159A053108L618L639L302K602J631R90J109J450J065j96j597k437k564k131
$$ plain form
52145 1063589 1062217 1061542 1061201 1061012 1061275 1062417 1064360 1066418 1067869 1068611 1069255 1070560 1072861 1076199 1080892
52130 1080892 1087528 1096262 1106641 1118458 1132290 1148625 1166849 1185833 1205416 1226538 1249776 1274334
52118 1274334 1298647 1321566 1342880 1363077 1382691 1401552 1418648 1433022 1444662 1454115 1461423 1466114
52106 1466114 1468140 1468152 1466790 1464371 1461340 1458230 1454996 1451140 1446792 1442895 1439914 1437035 1433188 1428193
52092 1428193 1422301 1415205 1406355 1395994 1385025 1373808 1361758 1348381 1334381 1321548 1311593 1305081
52080 1305081 1301402 1299770 1300106 1302753 1307588 1313976 1321600 1330669 1341079 1352085 1363206 1374897 1387724
52067 1387724 1401266 1414415 1426544 1437817 1448578 1458995 1469174 1479078 1488221 1495828 1501328 1504581
52055 1504581 1505780 1505415 1504102 1502048 1498800 1493814 1487120 1479078 1469623 1458133 1444017 1427158 1407939
$$ packed form
52145A063589j372o75l41j89K63J142J943K058J451P42O44J305K301L338M693
52130A080892O636Q734J0379J1817J3832J6335J8224J8984J9583K1122K3238K4558
52118A274334K4313K2919K1314K0197J9614J8861J7096J4374J1640R453P308M691
52106A466114K026J2j362k419l031l110l234l856m348l897k981k879l847m995
52092A428193n892p096q850j0361j0969j1217j2050j3377j4000j2833r955o512
52080A305081l679j632L36K647M835O388P624R069J0410J1006J1121J1691J2827
52067A387724J3542J3149J2129J1273J0761J0417J0179R904R143P607N500L253
52055A504581J199l65j313k054l248m986o694q042r455j1490j4116j6859j9219
$$ plain form
52042 1407939 1387134 1365613 1343791 1321500 1298741 1276381 1255694 1237334 1221144 1206777 1194012
52031 1194012 1182616 1172508 1164064 1157671 1152922 1148762 1144489 1140082 1135466 1130199 1124209 1118177 1112623
52018 1112623 1106979 1100113 1091574 1081834 1071476 1060679 1049528 1038306 1027234 1016065 1004152 990942
52006 990942 976451 961191 945557 929344 912135 894128 876163 858775 841672 824524 807805
51995 807805 792316 778205 765217 753759 744792 738411 733282 727871 721612 714464 706047 695998 684797
$$ packed form
52042A407939k0805k1521k1822k2291k2759k2360k0687j8360j6190j4367j2765
52031A194012j1396j0108q444o393m749m160m273m407m616n267n990o032n554
52018A112623n644o866q539r740j0358j0797j1151j1222j1072j1169j1913j3210
52006I90942j4491j5260j5634j6213j7209j8007j7965j7388j7103j7148j6719
51995H07805j5489j4111j2988j1458q967o381n129n411o259p148q417j0049j1201
$$ [...]
##END NTUPLES=NMR SPECTRUM
##END=
