
##TITLE=AC1162_Rove100-16_6524037_Ox7H4bluHI
##JCAMPDX= 6.0         $$ Bruker NMR JCAMP-DX V2.0
##DATA TYPE= NMR SPECTRUM
##DATA CLASS= NTUPLES
##ORIGIN= BRUKER
##OWNER= Administrator
$$ 1.72 TOPSPIN		Version 2.1
$$ 2012-07-14 16:58:15.890 -0500  Administrator@TOPSPIN
$$ Compression mode = diff/dup
##.OBSERVE FREQUENCY= 400.02188249412
##.OBSERVE NUCLEUS= ^1H
##.ACQUISITION MODE= SIMULTANEOUS (DQD)
##.ACQUISITION SCHEME= undefined
##.AVERAGES= 64
##.DIGITISER RES= 22
##SPECTROMETER/DATA SYSTEM= spect
##.PULSE SEQUENCE= noesygpps1d.comp
##.SOLVENT NAME= COFFEE_meoh
##.SHIFT REFERENCE= INTERNAL, COFFEE_meoh, 1, 14.96082
##AUDIT TRAIL= $$ (NUMBER, WHEN, WHO, WHERE, PROCESS, VERSION, WHAT)
$$ ##TITLE= Audit trail, TOPSPIN		Version 2.1
$$ ##JCAMPDX= 5.01
$$ ##ORIGIN= Bruker BioSpin GmbH
$$ ##OWNER= Administrator
$$ $$ C:\Bruker\TOPSPIN/data/COFFEE/nmr/AC1162_Rove100-16_6524037_Ox7H4bluHI/12/pdata/1/auditp.txt
$$ ##AUDIT TRAIL=  $$ (NUMBER, WHEN, WHO, WHERE, PROCESS, VERSION, WHAT)
(   1,<2012-07-14 16:58:11.406 -0500>,<Administrator>,<TOPSPIN>,<go>,<TOPSPIN 2.1>,
      <created by zg
	started at 2012-07-14 16:46:41.125 -0500,
	POWCHK enabled, PULCHK disabled,
       configuration hash MD5:
       6B 1B 68 BB D9 2E 58 E2 7F 35 AD 54 07 DF 0E 41
       data hash MD5: 64K
       DD 1A 03 78 28 22 25 1F 94 FA 9E CE 1F 7E DA 2A>)
(   2,<2012-07-14 16:58:14.093 -0500>,<Administrator>,<TOPSPIN>,<proc1d>,<TOPSPIN 2.1>,
      <Start of raw data processing
       efp LB = 0.3 FT_mod = 6 PKNL = 1 PHC0 = 0 PHC1 = 0 SI = 128K 
       data hash MD5: 128K
       9C 30 EB 42 B7 0E B1 88 C1 24 18 FF 41 19 DA D6>)
(   3,<2012-07-14 16:58:15.281 -0500>,<Administrator>,<TOPSPIN>,<proc1d>,<TOPSPIN 2.1>,
      <pk PHC0 = 1.576538 PHC1 = 0 
       data hash MD5: 128K
       51 D7 09 94 D2 01 90 DF 6A 17 5F B0 CB 95 0D B6>)
(   4,<2012-07-14 16:58:15.562 -0500>,<Administrator>,<TOPSPIN>,<proc1d>,<TOPSPIN 2.1>,
      <abs ABSG = 1 
       data hash MD5: 128K
       55 67 32 EA CB B8 C2 78 D4 25 87 55 81 83 EB 31>)
(   5,<2012-07-14 16:58:15.625 -0500>,<Administrator>,<TOPSPIN>,<proc1d>,<TOPSPIN 2.1>,
      <abs ABSG = 2 
       data hash MD5: 128K
       93 7C FD A4 01 48 D7 43 21 67 1D 0D 19 18 30 7A>)
(   6,<2012-07-14 16:58:15.687 -0500>,<Administrator>,<TOPSPIN>,<proc1d>,<TOPSPIN 2.1>,
      <abs ABSG = 3 
       data hash MD5: 128K
       21 DD DF 86 F2 B9 2B 54 40 8E 9E FA 0C 9E 2C 56>)
(   7,<2012-07-14 16:58:15.734 -0500>,<Administrator>,<TOPSPIN>,<proc1d>,<TOPSPIN 2.1>,
      <abs ABSG = 4 
       data hash MD5: 128K
       4B 91 8C BC EC E1 F2 EC 35 FB BC 43 6C A1 6C C7>)
(   8,<2012-07-14 16:58:15.796 -0500>,<Administrator>,<TOPSPIN>,<proc1d>,<TOPSPIN 2.1>,
      <abs ABSG = 5 
       data hash MD5: 128K
       D8 CF B2 37 57 DF 7A AB 98 F4 EF 90 8D D9 1B 6D>)
$$ ##END=
$$ 
$$ $$ hash MD5
$$ $$ 54 8B 9B 2D DE 78 24 1B CA C8 AC 92 52 FE 2E 9C
##$RELAX= 
##$RELAX= 
##$RELAX= 
##$RELAX= 
##$RELAX= 
##$RELAX= 
##$RELAX= 
##$RELAX= 
$$ Bruker specific parameters
$$ [...]
150 150 150 150 150 150 150 150
##$TP07= 0
##$TPNAME0= <>
##$TPNAME1= <>
##$TPNAME2= <>
##$TPNAME3= <>
##$TPNAME4= <>
##$TPNAME5= <>
##$TPNAME6= <>
##$TPNAME7= <>
##$TPOAL= (0..7)
0.5 0.5 0.5 0.5 0.5 0.5 0.5 0.5
##$TPOFFS= (0..7)
0 0 0 0 0 0 0 0
##$TUNHIN= 0
##$TUNHOUT= 0
##$TUNXOUT= 0
##$USERA1= <user>
##$USERA2= <user>
##$USERA3= <user>
##$USERA4= <user>
##$USERA5= <user>
##$V9= 5
##$VALIST= <valist>
##$VCLIST= <CCCCCCCCCCCCCCC>
##$VD= 0
##$VDLIST= <DDDDDDDDDDDDDDD>
##$VPLIST= <PPPPPPPPPPPPPPP>
##$VTLIST= <TTTTTTTTTTTTTTT>
##$WBST= 2048
##$WBSW= 25
##$XGAIN= (0..3)
0 0 0 0
##$XL= 0
##$YL= 0
##$YMAX_a= 10048446
##$YMIN_a= -7213458
##$ZGOPTNS= <>
##$ZL1= 120
##$ZL2= 120
##$ZL3= 120
##$ZL4= 120
##$ABSF1= 14.96082
##$ABSF2= -5.597362
##$ABSG= 5
##$ABSL= 3
##$ALPHA= 0
##$AQORDER= 0
##$ASSFAC= 0
##$ASSFACI= 0
##$ASSFACX= 0
##$ASSWID= 0
##$AUNMP= <proc_prof1d_extract.lims>
##$AXLEFT= 0
##$AXNAME= <>
##$AXNUC= <1H>
##$AXRIGHT= 0
##$AXTYPE= 0
##$AXUNIT= <>
##$AZFE= 0.1
##$AZFW= 0.1
##$BCFW= 0
##$BC_mod= 0
##$BYTORDP= 0
##$COROFFS= 0
##$CY= 15
##$DATMOD= 1
##$DC= 0
##$DFILT= <>
##$DTYPP= 0
##$F1P= 0
##$F2P= 0
##$FCOR= 0.5
##$FTSIZE= 131072
##$FT_mod= 6
##$GAMMA= 0
##$GB= 0
##$INTBC= 1
##$INTSCL= 1
##$ISEN= 128
##$LB= 0.3
##$LEV0= 0
##$LPBIN= 0
##$MAXI= 10000
##$MC2= 0
##$MEAN= 0
##$ME_mod= 0
##$MI= 0
##$NCOEF= 0
##$NC_proc= -2
##$NLEV= 6
##$NOISF1= 0
##$NOISF2= 0
##$NSP= 0
##$NTH_PI= 0
##$NZP= 0
##$OFFSET= 14.96082
##$PC= 1
##$PHC0= 1.576538
##$PHC1= 0
##$PH_mod= 1
##$PKNL= yes
##$PPARMOD= 0
##$PPDIAG= 0
##$PPIPTYP= 0
##$PPMPNUM= 2147483647
##$PPRESOL= 1
##$PSCAL= 4
##$PSIGN= 0
##$PYNMP= <proc.py>
##$REVERSE= no
##$SF= 400.02000971075
##$SI= 131072
##$SIGF1= 0
##$SIGF2= 0
##$SINO= 400
##$SIOLD= 131072
##$SPECTYP= <>
##$SREGLST= <1H.CDCl3>
##$SSB= 0
##$STSI= 131072
##$STSR= 0
##$SW_p= 8223.68421052631
##$SYMM= 0
##$S_DEV= 0
##$TDeff= 65536
##$TDoff= 0
##$TI= <>
##$TILT= no
##$TM1= 0
##$TM2= 0
##$TOPLEV= 0
##$USERP1= <user>
##$USERP2= <user>
##$USERP3= <user>
##$USERP4= <user>
##$USERP5= <user>
##$WDW= 1
##$XDIM= 131072
##$YMAX_p= 390044910
##$YMIN_p= -10968
##$CURPLOT= <Network HP LaserJet P1505>
##$CURPRIN= <$Network HP LaserJet P1505>
##$DFORMAT= <normdp>
##$LAYOUT= <+/1D_H.xwp>
##$LFORMAT= <normlp>
##$PFORMAT= <normpl>
##$SURQMSG= 1
$$ End of Bruker specific parameters
$$ ---------------------------------
##NTUPLES= NMR SPECTRUM
##VAR_NAME=  FREQUENCY,     SPECTRUM/REAL,   SPECTRUM/IMAG
##SYMBOL=    X,             R,               I
##VAR_TYPE=  INDEPENDENT,   DEPENDENT,       DEPENDENT
##VAR_FORM=  AFFN,          ASDF,            ASDF
##VAR_DIM=   131072,        131072,          131072
##UNITS=     HZ,            ARBITRARY UNITS, ARBITRARY UNITS
##FACTOR=    0.0627417313425164, 1,          1
##FIRST=     8223.62146879497, 1613,         -46924
##LAST=      0,             3109,            -47680
##MIN=       0,             -10968,          0
##MAX=       8223.62146879497, 390044910,    0
$$ Real data points
##PAGE= N=1
##DATA TABLE= (X++(R..R)), XYDATA
$$ [...]
65273 125354 124791 124071 123519 123654 124511 125486 125815 125183 123982 122999 122723 122944 123152 123250 123540 124045 124325 124217 124281
65254 124281 125079 126288 127046 127143 127357 128528 130618 132784 134091 134049 132729 130625 128437 126824 126230 126697
65238 126697 127696 128324 127922 126470 124304 121675 118869 116492 115058 114266 113224 111553 109914 109218 109649 110672
65222 110672 111600 111946 111527 110656 109992 109868 109895 109560 109047 109071 109926 111094 111796 111602 110488 108708 106822 105491
65204 105491 104979 104985 105132 105448 106121 106927 107280 106896 106194 105851 106106 106669 107217 107754 108386 108924 108945 108292 107321 106571
65184 106571 106255 106264 106567 107377 108769 110346 111531 112197 112798 113802 115130 116226 116584 116096 115094 114227 114093
65167 114093 114692 115317 115318 114967 115141 116086 116945 116829 115948 115241 115179 115386 115372 115084 114684 114277 114049 114327 115321 116945
65147 116945 119010 121331 123583 125394 126769 128242 130405 133490 137486 142347 147813 153309 158447 163550
65133 163550 169287 175715 181988 187162 191150 194736 198696 203033 207085 210290 212681 214622 216217 217235
65119 217235 217589 217666 218096 219281 221158 223154 224307 223753 221434 218229 215109 212174 208732 204301 199229
65104 199229 194162 189160 183640 177238 170433 164111 158641 153687 148865 144186 139672 135023 130148 125800
65090 125800 123040 121980 121557 120718 119429 118315 117726 117560 117746 118440 119742 121483 123285 124720 125517 125813
65074 125813 126080 126631 127271 127609 127607 127592 127733 127735 127141 125888 124536 123908 124360 125430 126271 126466 126234 125927 125616
65055 125616 125282 125075 125236 125975 127530 129958 132660 134487 134781 134097 133553 133609 133875 133886 133526 132678 131031 128537
65037 128537 125747 123397 121772 120665 119870 119427 119333 119178 118414 117075 115960 115797 116322 116580 116109 115356 114832
65020 114832 114424 113765 112793 111528 109765 107568 105724 105102 105616 106358 106701 106815 107193 108186 109984 112525 115220
65003 115220 117247 118316 118969 120013 121873 124471 127431 130330 133010 135683 138577 141484 143841 145179
64989 145179 145338 144485 143223 142457 142675 143466 144146 144672 145481 146616 147759 149070 151223 154377 157780 160726
64973 160726 163378 166243 169255 171767 173185 173324 172354 170665 168530 165761 161965 157300 152674 149018 146611
64958 146611 145169 144186 143019 141123 138582 136121 134341 133197 132396 131897 131753 131804 131874 131998 132179 132202 131914
64941 131914 131406 130643 129275 127152 124710 122587 121144 120569 120969 121936 122542 122301 121805 121823 122107 121800 120843
64924 120843 120203 120667 122043 123650 125037 126007 126416 126220 125501 124342 122891 121585 120984 121322 122381 123782
64908 123782 125120 125871 125591 124336 122714 121442 121015 121668 123307 125465 127618 129626 131674 133884 136296
64893 136296 139203 142999 147582 152289 156640 160925 165800 171513 177677 183655 188977 193479 197299 200815
64879 200815 204586 209203 214938 221376 227535 232536 236086 238214 238840 237944 235913 233236 229889 225528 220294
64864 220294 214897 209782 204760 199778 195528 192790 191424 190502 189338 187971 186637 185182 183173 180346
64850 180346 176774 172672 168217 163567 159032 155068 151941 149404 146883 144123 141486 139447 137952 136514
64836 136514 134888 133349 132230 131469 130793 130145 129691 129497 129488 129680 130144 130655 130695 129998 128917 128022 127536 127418
64818 127418 127781 128757 130049 131078 131731 132542 134022 136144 138669 141557 144747 147827 150348 152343 154207
64803 154207 156168 158233 160623 163921 168578 174319 180093 184718 187734 189661 191298 192764 193421 192657 190434
64788 190434 187132 183302 179608 176478 173610 170362 166910 164359 163291 162853 161952 160790 160378 160915 161618
64773 161618 162040 162606 163788 165515 167508 169481 170908 171344 171197 171541 172935 175051 177589 180831 184977
64758 184977 189713 194854 200693 207102 212888 216870 219342 221800 225308 229656 234028 237951 241564 245252
64744 245252 249186 253166 257003 260993 265599 270507 274434 276223 275819 273890 270866 266780 261667 255524
64730 255524 248100 239348 230025 221297 213733 207212 201769 197929 195944 195221 194859 194428 193874 192989 191438
64715 191438 189332 187352 186196 186139 187250 189745 193738 198697 203597 207839 211805 216233 221261 226367 231078
64700 231078 235223 238458 240083 239600 237216 233601 229307 224520 219124 212930 206063 199243 193362 188685
64686 188685 184734 181029 177531 174222 170807 167257 164251 162507 161852 161428 160697 159847 159292 159192 159541 160461
64670 160461 162295 165444 169906 174854 179047 182084 185024 189345 195340 201951 208045 213306 217789 221229
64656 221229 223175 223529 222580 220547 217354 212949 207701 202322 197366 192974 189227 186518 185200 184929 184857
64641 184857 184632 184765 185748 187297 188845 190341 192060 193953 195817 197963 201080 205456 210860 217168 224494
64626 224494 232648 240972 248930 256471 263679 270433 276501 281548 284899 285652 283306 278161 271041 262874
64612 262874 254433 246073 237590 228736 219964 212282 206226 201408 197238 193621 190636 188045 185609 183584
64598 183584 182301 181390 179918 177402 174236 171053 168010 165023 162415 160970 161183 162641 164314 165473 166215
64583 166215 167126 168567 170387 172236 174047 176307 179828 185072 191587 198415 205224 212705 221537 231381
64569 231381 241411 251513 262134 273003 282902 291038 297893 304205 309693 313370 314768 314188 311964
64556 311964 308122 302804 296480 289576 282194 274372 266393 258712 251706 245561 240325 235973 232391 229275
64542 229275 226185 222891 219725 217325 215949 215254 214852 214773 215189 215960 216735 217232 217070 215576 212326 207877
64526 207877 203480 199905 196871 193733 190329 186925 183714 180802 178561 177484 177552 178047 178214 177988 177823 177947
64510 177947 178128 178198 178447 179186 180141 180698 180687 180557 180730 181143 181594 182171 183104 184403 185994 188060 190950 194749
64492 194749 199168 203934 209119 214989 221502 227999 233543 237729 241110 244483 247735 249723 249578 247833
64478 247833 245948 244892 244591 244677 245269 246730 248878 250754 251299 250187 247923 245136 242010 238563 235256
64463 235256 232795 231297 230145 228959 228219 228535 229690 231001 232363 234290 236971 239976 242946 245872 248393
64448 248393 249507 248554 246259 244269 243746 244682 246401 248408 250754 253826 257809 262329 266806 271298 276673
64433 276673 283647 291955 300904 310536 321632 334641 349308 365588 384298 406409 432196 461678
64421 461678 495608 535350 581825 635165 695456 763157 838536 921083 1009712 1102963 1198553
64410 1198553 1293152 1383305 1466676 1542156 1609013 1666387 1713456 1749322 1772483 1780965 1773472 1750327
64398 1750327 1713174 1663975 1604479 1536293 1460902 1379467 1292853 1202157 1109338 1017340 929383
64387 929383 847912 774047 707886 649010 596571 549398 506675 468578 435763 408144 384610
64376 384610 363996 345888 330322 317294 306818 298896 292977 287856 282615 277375 272678 268503 264386
64363 264386 260143 255830 251234 246095 240686 235445 230109 223973 217089 210470 204905 200287 196331 193240
64349 193240 191210 189874 188787 188101 188262 189318 190957 192945 195161 197461 199945 203051 206894 210691 213326
64334 213326 214391 214278 213430 211978 210065 207996 206000 204252 203111 202859 203157 203253 202921 202718 203091 203677 203840
64317 203840 203504 203000 202340 201232 199806 198841 199076 200562 202800 205260 207582 209458 210605 210907 210512 209696
64301 209696 208608 207113 204944 202086 198934 195905 192968 189754 186207 182839 180180 178203 176512 174899
64287 174899 173384 171832 169963 167804 165770 164141 162717 161201 159688 158602 158322 159024 160671 162963 165475
64272 165475 168089 171098 174647 178329 181739 185211 189530 194940 200846 206481 211379 215151 217415 218267
64258 218267 218444 218635 218849 218749 218396 218315 218987 220569 222942 225695 228055 229171 228603 226448 223055 218775
64242 218775 214013 209313 205262 202243 200140 198326 196185 193770 191824 191022 191425 192836 195323 198996 203419
64227 203419 207799 211840 216060 221151 227345 234537 242673 251694 261335 271299 281610 292534 304166
64214 304166 316320 328760 341217 352978 362795 369654 373637 375669 376308 375156 371688 366279 359843
64201 359843 352677 344287 334398 323516 312255 300699 288827 277085 266002 255610 245797 236981
64189 236981 229815 224386 220273 217344 215818 215580 216115 217326 219756 223689 228590 233822 239441 245719 252125
64174 252125 257354 260356 261022 259912 257583 254189 249502 243316 235882 227898 220030 212576 205654 199451
64160 199451 194131 189673 185968 182886 180165 177460 174718 172250 170225 168270 165845 162897 160002 157992
64146 157992 157499 158549 160415 162178 163628 165297 167454 169660 171729 174466 178685 183879 188738 192790
64132 192790 196572 200163 202561 202813 200968 197572 193026 187983 183666 180956 179457 178077 176392 174978
64118 174978 174536 175156 176342 177383 177826 177959 178787 181208 185244 190147 195034 199238 202521 205415 209063
64103 209063 214133 220023 225605 230531 235198 239522 242612 243882 243790 243095 241954 240245 238458 237620 238379
64088 238379 240461 242991 245158 246632 247551 248066 247789 245923 242114 236961 231379 225614 219254 212178 205064
64073 205064 198881 194153 190829 188561 186895 185475 184349 183971 184550 185457 185616 184614 183153 182290 182449 183327
64057 183327 184434 185372 185805 185647 185289 185156 185021 184242 182879 182053 182735 184561 186313 187301 187697 187721 187326 186792
64039 186792 186899 187991 189276 189623 188905 188176 188535 190172 192511 194867 196750 197792 197828 197223 196875 197569 199263
64022 199263 201188 202718 203953 205401 207402 210105 213690 218169 223121 228060 232946 237865 242293 245291
64008 245291 246566 246671 246024 244361 241591 238476 235818 233446 230798 228233 226869 227121 228156 228970 229297
63993 229297 229242 228765 228044 227817 228718 230452 232139 233326 234184 234890 235407 236024 237562 240655 245103 250212 255578
63976 255578 261182 266884 272256 277031 281449 286031 291248 297493 305041 313734 322895 331868 340580 349271
63962 349271 357905 366301 374883 384634 396029 408433 421048 434164 448993 466335 485952 507315
63950 507315 530574 556503 585838 618963 656269 698644 747629 805143 873013 952650 1045102
63939 1045102 1151290 1272060 1407993 1559190 1725149 1904647 2095770 2296289 2504167
63930 2504167 2717553 2934037 3149813 3359649 3557743 3738609 3897341 4029517 4131559
63921 4131559 4201476 4239034 4244774 4218859 4161080 4071827 3952618 3805752 3634176 3442104 3235332
63910 3235332 3020249 2802362 2585803 2373767 2168860 1973186 1788728 1617654 1461728
63901 1461728 1321361 1195759 1084193 986603 902703 831074 769664 716928 671974 633830 601131
63890 601131 572596 547355 524767 504311 485805 469430 455239 442804 431498 420984 411300 402645
63878 402645 395254 389301 384587 380336 375639 370320 365282 361863 360843 362045 364737 368351 372896 378845
63864 378845 386620 396147 406953 418656 431263 445004 460103 476829 495462 515978 537953 561001
63852 561001 585117 610276 635916 661247 685873 709552 731453 750409 766113 779395 790936
63841 790936 800267 806397 808862 807623 802475 793354 781000 766491 750165 731517 710171 686378 660634
63828 660634 633505 605924 579014 553273 528333 503762 479717 456672 434870 414391 395491
63817 395491 378584 363996 351821 341853 333587 326472 320201 314554 308996 302806 295651 287740 279411
63804 279411 270993 263092 256407 250986 246101 241181 236543 232846 230154 227929 225748 223620 221627 219564
63790 219564 216988 213575 209546 205767 203145 201751 200734 199200 196966 194370 191767 189489 187926 187205
63776 187205 186930 186551 185899 185149 184418 183683 182976 182450 182303 182728 183674 184555 184497 183162 181134 179287 178060 177563
63758 177563 177954 179244 180990 182681 184280 185971 187517 188362 188345 187861 187330 186889 186636 186740 187177 187624 187756
63741 187756 187567 187385 187694 188803 190490 192073 193043 193545 194092 195012 196424 198476 201193 204265 207362 210548
63725 210548 213996 217481 220660 223786 227641 232687 238646 244932 251115 256910 262155 266930 271449 275770
63711 275770 279756 283181 285603 286374 285274 283004 280484 277761 274188 269634 264802 260212 255577 250505
63697 250505 245273 240583 236987 234792 234028 234193 234530 234911 235996 238165 240788 243029 244929 247122 249741
63682 249741 252239 254153 255508 256486 257131 257452 257491 257335 257269 257821 259394 261902 264985 268424 272104 275829
63666 275829 279598 283954 289543 296192 302794 308262 312409 315785 318859 321510 323185 323347 321742 318378
63652 318378 313471 307505 301142 294845 288643 282502 276780 271913 267715 263553 259391 256039 254113 253252
63638 253252 252840 252973 254085 255976 258015 260193 263270 267686 272895 277968 282498 286728 291119 295955 301242
63623 301242 306889 313069 320207 328366 336832 344775 352282 360299 369600 380255 392226 405882 421652
63610 421652 439529 459309 481142 505561 532935 562999 594903 627855 661931 698052 736738
63599 736738 776861 816014 852066 883843 910324 930048 941933 946205 944042 936630 925133 911184
63587 911184 896569 882252 868111 853533 837758 819761 798602 774313 748107 721458 695226
63576 695226 669844 645886 624036 604689 587912 573675 561866 552248 544728 539548 536827 536001 536167
63563 536167 536994 538918 542272 546690 551663 557299 564070 571940 580242 588453 596703 605503 615291 626329
63549 626329 638688 652207 666890 683587 703856 728742 757962 790758 827287 868508 914584
63538 914584 963932 1013892 1061599 1103858 1136926 1157563 1164713 1160021 1146791 1128643 1108771 1089561
63526 1089561 1072246 1056935 1043036 1029542 1015001 997809 976984 952573 925039 894476 860828
63515 860828 824740 787736 751377 716576 683787 653482 626087 601671 579995 560826 543949
63504 543949 529020 515712 504016 494165 486160 479538 473594 467691 461442 454895 448579 443041 438170
63491 438170 433206 427610 421720 416345 411869 408011 404388 401027 398273 396398 395354 394818 394427 394063 393965
63476 393965 394521 395967 398303 401418 405189 409400 413681 417519 420406 422040 422477 421991 420723 418516 415144
63461 415144 410642 405316 399540 393666 388033 382918 378437 374634 371584 369302 367558 365932 364094 362001
63447 362001 359900 358236 357494 357925 359446 361858 365102 369135 373738 378701 384206 390744 398577 407573 417673
63432 417673 429349 443465 460917 482546 509100 540804 576771 614932 652566 687076 716570
63421 716570 740127 757678 769728 777341 782449 787831 796294 809654 828554 853102 883359 919126
63409 919126 959580 1003280 1048223 1091733 1130649 1162222 1185009 1198842 1204154 1201754 1193096 1180090
63397 1180090 1164223 1146176 1126497 1106160 1085858 1064937 1041709 1014951 984680 951481 915801
63386 915801 878366 840783 804965 771932 741567 713633 688546 666966 648940 633792 620831
63375 620831 609927 601356 595280 591565 590017 590517 592840 596580 601530 608020 616524 626902 638360 650344
63361 650344 663173 677588 693970 712330 732864 756047 782155 811008 842296 875895 911808
63350 911808 950065 990739 1033695 1077934 1121284 1161033 1194981 1221852 1240830 1251157 1252471 1245520
63338 1245520 1232293 1215295 1196609 1177338 1157640 1137168 1115707 1093460 1070491 1045863 1017832
63327 1017832 985369 949281 911475 873360 835535 798790 764510 733820 707031 684241 665866
63316 665866 652123 642577 636728 634526 635554 637974 638919 635911 627571 613596 595009 574303 554328
63303 554328 536572 520820 506336 492733 479757 467096 454809 443393 433145 423799 414989 406596
63291 406596 398560 390798 383495 376979 371151 365535 360005 354908 350334 345913 341586 337815 334630 331215
63277 331215 327038 322743 319258 316563 314028 311486 309106 306600 303508 300191 297677 296477 296234 296467 296928
63262 296928 297203 296728 295446 293806 291982 289676 286925 284451 282885 282081 281477 280740 279847 278999 278696 279399
63246 279399 280739 281566 281190 280200 279553 279259 278592 277340 276149 275591 275534 275646 276003 276787 277654 277831 276872 275112
63228 275112 273306 272006 271310 271078 271155 271367 271473 271312 271017 270938 271257 271764 272057 271994 271876 272128 272773 273385 273740
63209 273740 274381 276174 279245 282737 285828 288578 291401 294090 296062 297466 299323 302387 306404 310749
63195 310749 315252 320003 324772 329175 333228 337301 341624 346289 351686 358518 367170 377250 387879 398353
63181 398353 408571 418987 430210 442548 455819 469489 482939 495660 507498 518789 530005
63170 530005 541100 551400 560325 567976 574734 580494 584747 587376 588887 589680 589346 586890 581515 573145
63156 573145 562396 550188 537190 523451 508642 492729 476342 460415 445628 432258 420346
63145 420346 409757 400184 391356 383305 376279 370381 365385 360947 356847 353061 349719 347066 345324 344480
63131 344480 344265 344421 344991 346305 348723 352334 356766 361199 364801 367401 369774 373060 377817 383737 390251
63116 390251 397155 404467 411924 418956 425235 431047 437019 443539 450531 457743 465092 472648 480335 487814
63102 487814 494793 501321 507600 513592 519148 524628 531038 539226 549025 559483 569816 579902 589950
63089 589950 600132 610558 621219 631750 641424 649484 655290 658199 657777 654336 648864 642040 633559
63076 633559 622874 610356 597193 584098 570691 556428 541742 527843 515511 504418 493711
63065 493711 483030 472825 463808 456270 450024 444807 440535 437114 434292 431931 430316 429849 430411 431289
63051 431289 431960 432810 434820 438597 443827 449679 455567 461487 467834 475057 483375 492530 501771 510284 517812
63036 517812 524784 531717 538642 545286 551685 558197 564858 571074 576143 579854 582381 583858 584403 584355 584047
63021 584047 583355 581807 579179 575684 571614 567155 562643 558551 555081 552079 549527 547662 546429 545347
63007 545347 544494 545167 548817 555430 563729 572962 583638 596252 610148 624345 638916 654740 672055
62994 672055 690019 707698 724832 741550 757893 773856 789381 804047 817239 829005 840396
62983 840396 852434 864865 876272 885311 891446 894628 894727 891436 884366 873113 857487 837888 815343
62970 815343 791035 765837 740255 714653 689477 665376 643087 622998 604796 587830 571892
62959 571892 557414 544737 533500 523030 513082 503825 495221 486864 478508 470306 462340 454230 445557
62946 445557 436462 427483 418758 409760 399934 389385 378764 368669 359390 351107 343974 337873 332317
62933 332317 326812 321260 315909 311021 306769 303364 300976 299445 298283 297063 295754 294597 293758 293204 292783
62918 292783 292325 291712 290966 290202 289450 288593 287635 286917 286857 287437 288103 288279 287908 287477 287595 288566 290257 292239
62900 292239 294134 295953 298150 301283 305579 310855 316800 323233 330067 337197 344629 352656 361626 371412
62886 371412 381229 390196 398000 404847 410851 415715 419036 420613 420320 417931 413436 407445 400945 394465
62872 394465 387667 379934 371294 362591 354670 347537 340457 332862 324999 317565 310872 304663 298725 293361
62858 293361 289010 285621 282764 280315 278714 278395 279153 280201 280712 280229 278802 276942 275340 274297 273387
62843 273387 271904 269721 267548 266217 265887 266083 266398 266875 267654 268484 268840 268523 268016 268061 268859 269788 270021 269425
62825 269425 268687 268522 268971 269683 270677 272373 274780 277069 278233 278052 277166 276350 275984 276069 276318 276143 274953
62808 274953 272719 270145 268093 266882 266272 265979 266037 266626 267711 268941 269931 270642 271367 272228 272836 272712 272081
62791 272081 271886 272735 274052 274564 273603 271684 269842 268676 268036 267374 266228 264629 263195 262682 263281 264485
62775 264485 265837 267570 270167 273402 276343 278477 280396 283005 286384 289860 293002 295926 298587 300411
62761 300411 300934 300421 299503 298486 297347 296093 294725 293089 291199 289540 288560 287970 287066 285683 284285 283097
62745 283097 281796 280193 278588 277164 275559 273462 271180 269192 267498 265883 264444 263391 262610 261928 261567
62730 261567 261759 262151 262252 262325 263133 264722 266195 266862 266980 267083 267222 267312 267709 268862 270644 272549 274414
62713 274414 276465 278847 281582 285055 289963 296637 304720 313719 323581 334462 346204 358459 371310
62700 371310 385425 401434 419393 439079 460630 484495 510698 538479 566916 595820 625795
62689 625795 657441 690562 724076 756580 787053 815113 840546 862606 880008 891701 897396 897066
62677 897066 890272 876525 856303 831216 802938 772298 739590 705494 671320 638319 606915 576690
62665 576690 547218 518915 492888 469792 449079 429730 411575 395317 381225 368472 356142
62654 356142 344426 334266 326023 319029 312483 306302 300925 296616 293235 290617 288830 287831 287019 285462
62640 285462 282743 279364 276104 273212 270586 268492 267469 267453 267608 267345 267060 267512 268868 270693 272515 273964
62624 273964 274653 274424 273598 272566 271307 269725 268208 267222 266460 265021 262576 259812 257559 255975 254819
62609 254819 254001 253485 252986 252221 251312 250611 250199 249843 249355 248715 247880 246738 245383 244212 243662 243874 244666 245732
62591 245732 246809 247722 248376 248782 249010 249104 249109 249296 250233 252305 255077 257439 258631 258926 259022 258959 258118 256281
62573 256281 254189 252767 252096 251511 250576 249604 249144 249207 249230 248777 248085 247717 247792 247806 247324 246604 246270 246498 246830
62554 246830 246819 246598 246698 247494 248928 250604 252012 252724 252536 251526 250022 248497 247362 246749 246557 246751 247433
62537 247433 248542 249716 250732 251908 253746 256224 258773 260963 262869 264759 266769 268967 271450 274228
62523 274228 277232 280486 284081 288010 292359 297630 304402 312488 320939 329208 338013 348686 361885 377239
62509 377239 394058 411937 430710 450179 470025 489858 509309 528091 545918 562366 576948
62498 576948 589317 599177 606040 609486 609768 607727 603851 597790 589195 578752 568029 558520 551166 546496
62484 546496 544662 545391 548357 553608 561455 572083 585620 602248 621738 643055 665084 687766 711900
62471 711900 737658 763722 787980 808618 824498 835111 840502 840867 835941 825106 808267 786199
62459 786199 759844 729761 696686 662182 628086 595402 564100 533893 504836 477250 451495
62448 451495 427936 406908 388572 372856 359510 348180 338561 330568 324235 319343 315325 311646 308111
62435 308111 304754 301675 299087 297208 295879 294545 292880 291184 289890 288987 288240 287711 287565 287550 287229 286664
62419 286664 286366 286489 286585 286283 285834 285759 286229 286959 287506 287588 287311 287194 287719 288783 289815 290405 290531 290157 289098
62400 289098 287528 286264 286154 287306 289089 290747 291881 292610 293525 295313 298130 301479 304886 308493 312714
62385 312714 317504 322349 326913 331335 335859 340516 345369 350788 357274 365004 373624 382542 391473 400776
62371 400776 411227 423357 437077 451959 467762 484601 502749 522458 543822 566632 590545
62360 590545 615715 643204 674424 710169 750472 795394 845510 901426 963141 1030097 1101507
62349 1101507 1176194 1252148 1326587 1396531 1459220 1512170 1553365 1581740 1597424 1601277 1594173 1576764
62337 1576764 1549843 1514621 1472401 1424072 1370267 1312187 1252059 1192464 1135201 1080975 1030094
62326 1030094 983141 940763 903069 869427 838830 810383 783562 758172 734062 710895 688323
62315 688323 666375 645428 625647 606683 588143 570195 553334 537616 522458 507314 492341
62304 492341 478296 465925 455496 446768 439274 432711 427135 422773 419672 417613 416286 415391 414637 413932
62290 413932 413590 414072 415388 417087 418979 421566 425368 430070 434818 439270 443808 448609 453111 456791 460087
62275 460087 464019 469007 474571 480172 485860 491956 498545 505607 513377 522178 532049 542945 555262 569821
62261 569821 587251 607644 630989 657753 688951 725705 768756 818211 873665 934687 1001164
62250 1001164 1072912 1148878 1226923 1304447 1378858 1447294 1506428 1553284 1586336 1605553 1611511
62239 1611511 1604868 1586587 1557992 1520255 1474175 1420720 1361441 1298043 1231796 1163784 1095588
62228 1095588 1029280 966655 908707 855807 808043 765270 727100 693064 662800 636049 612610
62217 612610 592325 574936 559882 546362 533818 522300 512264 503985 497198 491242 485526 479899
62205 479899 474661 470163 466321 462640 458818 455249 452658 451263 450609 450382 451081 453474 457500 462139 466564
62190 466564 471064 476561 483404 490984 498552 506155 514641 524837 536746 549502 562127 574353 586646
62177 586646 599384 612219 624392 635501 645652 654956 663333 670993 678899 688527 701226 717817
62165 717817 738624 763790 793667 828937 870137 917004 968450 1023214 1080214 1138011 1194158
62154 1194158 1245390 1288546 1321447 1343235 1354211 1355213 1346924 1329869 1305054 1274226 1239030 1200051
62142 1200051 1157046 1110131 1060412 1009515 958888 909699 863075 820141 781793 748378 719475
62131 719475 694101 671418 651374 634484 620937 610071 600839 592693 585946 581270 578831 577945 577684
62118 577684 577835 579015 581883 586619 593378 602648 614654 628813 644563 662516 683900 708789 735660
62105 735660 762739 788828 812520 831701 844815 852150 855194 855226 853263 850807 849342 848844 847479 842992
62091 842992 834055 820585 803625 785149 767212 750948 736706 725118 717313 713866 714282 717902 724743
62078 724743 734974 748157 763658 781432 801737 824362 848750 874699 902247 930943 959957
62067 959957 989042 1018816 1049902 1082289 1115728 1150341 1186521 1224550 1264568 1306554 1349944
62056 1349944 1393402 1435113 1473163 1505557 1530353 1546304 1553313 1551976 1542828 1526309 1503209 1474533
62044 1474533 1440836 1402102 1358438 1310635 1259982 1207833 1155421 1103767 1053567 1005433 960320
62033 960320 919312 882745 849855 819712 792265 768145 747629 730273 715444 702746 691850
62022 691850 682273 673527 665264 657257 649442 641991 635033 628259 621084 613255 605039 596712 588239 579576
62008 579576 571004 562993 555973 550369 546500 544204 542920 542404 543073 545360 549106 553999 560235 568017 576561
61993 576561 584341 590464 595230 599062 601496 601657 599435 595660 591200 586227 580403 573447 565351 556228
61979 556228 546153 535276 523990 512866 502330 492535 483553 475519 468413 461899 455666 449853 444816
61966 444816 440536 436588 432732 429155 426024 423128 420141 416971 413714 410617 408298 407585 408683 410683
61952 410683 412365 413432 414646 416803 420045 424184 429183 435004 441313 447818 454819 463118 473309 485430
61938 485430 499417 515623 534558 556182 579753 604480 630030 656211 682456 708040 732794
61927 732794 757150 781294 804556 825812 844318 859871 872361 881458 886733 887922 885049 878414
61915 878414 868478 855744 840933 825356 810865 799035 790334 784290 780498 779353 781860 788944 800921
61902 800921 817301 836832 857843 878769 898481 916151 930840 941295 946196 944765 937253 924821
61890 924821 908801 889996 868658 845044 819918 794550 770259 747821 727109 707337 687830
61879 687830 668644 650404 633613 618222 603726 589426 574664 559203 543618 529108 516640
61868 516640 506252 497291 489221 482063 476121 471576 468496 467085 467722 470651 475671 482275 490175 499674
61854 499674 511505 526296 544240 565212 589124 616126 646514 680426 717603 757472 799504
61843 799504 843392 888749 934673 979816 1022852 1062649 1097933 1127152 1148993 1162946 1169158 1167884
61831 1167884 1159441 1144748 1125600 1104253 1082827 1063116 1046654 1034657 1027926 1026922 1031843 1042422
61819 1042422 1057661 1075958 1095555 1114760 1131818 1144849 1152176 1152694 1145845 1131319 1108968 1079121
61807 1079121 1042932 1002285 959204 915202 871149 827763 786064 747191 711810 679956 651527
61796 651527 626674 605494 587503 571712 557270 543963 532143 522332 514716 508749 503297 497450
61784 497450 491245 485414 480476 476279 472406 468592 464695 460603 456419 452435 448742 445131 441575 438429
61770 438429 435870 433485 430907 428604 427429 427463 427879 428055 428269 429079 430507 432189 434048 436412 439533 443207
61754 443207 446849 449905 452401 455148 459113 464364 469870 474555 478222 481172 483274 484048 483546 482498 481406
61739 481406 480034 478073 475922 474413 473948 474221 474658 474815 474493 473883 473589 474128 475299 476288 476578 476508 476781
61722 476781 477584 478450 478935 479263 480230 482512 486031 489987 493561 496575 499349 501997 504188 505701 506887
61707 506887 508201 509460 509925 509168 507529 505667 503963 502425 500959 499545 498242 497114 496103 495003 493675
61692 493675 492265 491007 489891 488794 487859 487344 487073 486473 485292 483801 482076 479581 475931 471630 467493
61677 467493 463597 459393 454737 450202 446368 443412 441411 440440 440140 439737 438759 437367 435755 433765 431510
61662 431510 429834 429487 429988 430008 428924 427532 427062 427955 429787 431957 434053 435772 437027 438201 439953 442582
61646 442582 445781 449171 452834 457087 461866 466736 471501 476410 481592 486644 491080 494875 498211 500852
61632 500852 502194 501904 500184 497438 494063 490517 487129 483670 479535 474556 469366 464799 461193 458454
61618 458454 456422 454859 453349 451640 449952 448664 447755 446863 445731 444300 442450 439990 436837 432919 427985
61603 427985 421940 415427 409557 404819 400534 395739 390412 385470 381586 378342 374746 370435 366193 363226
61589 363226 361965 361652 361062 359551 357372 355103 353034 351082 349117 347139 345190 343188 340901 338097 334751
61574 334751 331140 327659 324487 321534 318708 316163 314146 312683 311579 310651 309762 308572 306552 303414 299448
61559 299448 295324 291668 288899 287239 286589 286523 286701 287217 288299 289772 291176 292334 293340 293952 293631 292409
61543 292409 291172 290679 290783 291069 291764 293283 295161 296284 296234 295753 295808 296794 298698 301291 303844 305311 305400
61526 305400 305125 305801 307627 309582 310542 310173 308869 307174 305296 303073 300398 297586 295110 292969 290714
61511 290714 288239 286145 285058 284872 284972 284968 284938 285115 285609 286323 286963 287342 287753 288691 290010 290761 290195 288588
61493 288588 286710 284887 283165 282034 282212 283625 285247 286151 286359 286537 287170 288187 289034 289012 287777 285740
61477 285740 283868 282972 283164 283896 284411 284252 283511 282605 281815 281222 281068 281760 283244 284727 285409 285257 284704 283916
61459 283916 282832 281634 280599 279624 278510 277601 277482 278059 278598 278771 279006 279635 280342 280763 281076 281610 282287
61442 282287 282814 283144 283457 283917 284616 285528 286432 287249 288467 290737 293900 297001 299553 302217 305797 310048
61426 310048 313916 316571 317771 317663 316831 316229 316453 317257 318273 319886 322765 326697 330620 333821 336448
61411 336448 338821 340925 342785 344723 346861 348771 349951 350312 349930 348689 346523 343732 340637 337124 332987
61396 332987 328682 325232 323178 321922 320348 317975 315248 312832 310993 309781 309454 310285 311965 313629 314681
61381 314681 315376 316378 317908 319580 320940 321869 322540 323292 324531 326413 328472 329863 330221 330113 330463 331611
61365 331611 333142 334520 335582 336426 337072 337477 337693 337795 337710 337392 337221 337957 340070 343173 346379 349264 352332
61348 352332 356468 362053 368706 375746 382816 390165 398499 408562 420591 433992 447526 459975 470753
61335 470753 479864 487347 492938 496455 498370 499689 501137 502630 503626 503720 502725 500431 496697 491839 486597
61320 486597 481607 476982 472468 467937 463651 460046 457238 454811 452324 450004 448562 448155 447939 447104 446048
61305 446048 445966 447363 449592 451861 454100 456664 459833 463976 469715 477389 486445 495682 503935 510341 514235
61290 514235 515261 513541 509423 503078 494664 484932 475350 467285 461007 455631 450243 445075 441329 439768
61276 439768 439859 440620 441918 444324 447885 451842 455701 459820 464633 469983 475731 482440 490796 500566 510734
61261 510734 520509 529789 538733 547364 555547 563093 570029 577047 585472 596410 609958 625408 641884
61248 641884 658441 673967 687590 699037 708120 714145 716484 715624 712863 708845 703082 695075 685265
61235 685265 674521 663314 651876 640850 631171 623371 617311 612530 608607 605223 602172 599372 596819
61222 596819 594544 592653 591290 590434 589840 589313 588980 589135 589833 590716 591292 591271 590549 588974 586418 583217 580311
61205 580311 578554 577847 577245 575969 573986 571487 568263 564036 559197 554770 551639 550084 550035 551472 554514
61190 554514 559338 566090 574861 585747 598951 614632 632517 651847 671742 691387 709774 725750
61178 725750 738769 749351 758409 766394 773485 780309 787765 796127 804828 813139 820563 826564 830551 832414
61164 832414 832638 831607 829073 824605 818341 811038 803438 795682 787242 777433 766107 753879 741590 729704
61150 729704 718362 707792 698251 689746 682269 676296 672500 670893 670739 671568 673767 677771 682926 687477
61136 687477 689577 688146 683019 674688 663993 651831 638983 626149 614071 603614 595569 590195 586876
61123 586876 584507 582472 581144 581306 583314 587077 592562 599865 608866 619226 630721 643272 656740
61110 656740 671080 686578 703557 721885 741160 761303 782512 804658 827222 849842 872436
61099 872436 894750 916319 936983 956960 976201 994073 1009814 1022895 1032765 1038638 1039854 1036255
61087 1036255 1028240 1016738 1003025 988036 971722 953523 933547 912802 892201 871872 851622
61076 851622 831591 812195 793866 777003 761729 747537 733693 720191 707876 697444 688841 681780
61064 681780 676231 672166 669423 668183 668983 671820 675814 680099 684556 689266 693939 698438 703323 709188
61050 709188 715846 722768 729979 737878 746561 755984 766512 778549 791752 805341 819178 833954 850262
61037 850262 868008 886825 906648 927753 950535 975367 1002452 1031706 1062814 1095406 1129180
61026 1129180 1164079 1200461 1238980 1280254 1324760 1372861 1424606 1479656 1537890 1599923 1666279
61015 1666279 1736031 1807022 1877719 1948315 2020222 2095595 2177605 2269959 2375406 2495401 2631393
61004 2631393 2785223 2957846 3149467 3362654 3605068 3888862 4228742 4641317 5144461
60995 5144461 5755900 6494450 7385496 8465749 9783959 11402471 13400617 15864304 18845703
60986 18845703 22306576 26084572 29906308 33433263 36318580 38279140 39191873 39177780
60978 39177780 38597827 37923934 37545875 37628490 38084216 38633990 38896223 38482128 37106728
60969 37106728 34695391 31423816 27651020 23781586 20141594 16924511 14201248 11958177
60961 11958177 10136956 8666217 7480243 6523920 5750951 5123029 4610046 4188004 3836041
60952 3836041 3536310 3275756 3045948 2840916 2656109 2488868 2338110 2202947 2082238
60943 2082238 1975236 1881533 1800070 1728711 1664802 1605523 1547948 1489642 1429543 1368005 1306051
60932 1306051 1244838 1185457 1128609 1074522 1023471 976063 932590 892527 855209 820655 789114
60921 789114 760152 732909 707044 682784 660187 638966 618984 600424 583614 569050 557220
60910 557220 547843 539663 531650 524140 518165 513996 511174 509665 509960 512006 514939 518067 521417 525105
60896 525105 528810 532102 534798 536849 538226 539012 539265 538902 538129 537657 537865 537894 536359 532889 528285 523209
60880 523209 517587 511289 504459 496921 488202 478544 469106 460649 452691 444442 435987 427990 420761 414170
60866 414170 408113 402524 397272 392479 388553 385423 382220 378370 374726 372895 373480 375564 377915 380160
60852 380160 382723 386128 390565 395831 401398 406674 411313 415286 418752 422028 425611 429992 435345 441453
60838 441453 447895 454187 459774 463996 466167 465843 463246 459401 455512 452070 448740 445236 441952 439457
60824 439457 437707 436201 434789 433785 433254 432628 431273 429142 426649 424089 421433 418561 415389 411770 407507
60809 407507 402585 397259 391810 386322 380790 375344 370161 365175 360075 354782 349846 346160 344140 343197
60795 343197 342103 339984 337040 334264 332444 331497 330773 329845 328757 327648 326504 325387 324611 324447 324809 325381
60779 325381 325878 326095 326029 326199 327525 330425 334128 337326 339541 341492 344091 347454 351061 354548 358119
60764 358119 362382 367982 375210 383699 392465 400415 406928 412082 416414 420489 424516 428310 431660 434653
60750 434653 437505 440082 441802 442144 441223 439808 438818 438725 439328 440080 440659 441088 441173 440070 436802 431256 424357
60733 424357 417165 410034 402814 395589 388816 382797 377305 371915 366605 361822 357975 355026 352719 351054
60719 351054 350177 349778 349052 347591 346073 345557 346170 346971 347246 347522 348939 351898 355721 359576 363383 367687
60703 367687 372890 378848 385131 391402 397482 403261 408836 414694 421456 429269 437539 445335 452037 457626
60689 457626 462551 467367 472349 477401 482450 487785 493715 499988 506051 511989 518635 526450 534922 543615
60675 543615 553256 565002 578881 593735 608668 623789 639411 655168 670152 683464 694521 703287
60663 703287 710289 715911 719500 719731 715991 708917 699391 687658 673796 658442 642515 626578 610920
60650 610920 595908 581741 568202 555222 543442 533603 525456 517887 510206 502792 496333 490798 485401
60637 485401 479366 472532 465342 458436 452247 446963 442792 440026 438709 438293 437856 436712 434884 433118 432400
60622 432400 433148 434733 436007 436511 436934 438126 439901 441161 441101 439927 438413 437083 435879 434363 432169
60607 432169 429365 426434 423834 421674 419866 418345 416908 415118 412768 410284 408169 406130 403350 399733
60593 399733 396272 393833 392108 390253 388186 386573 385685 385005 384155 383554 383692 384186 384110 383219 382313 382321 383398
60576 383398 385133 387307 390127 393905 398845 405089 412673 421370 430857 441213 453105 467395 484612
60563 484612 504874 528161 554453 583569 614892 647187 678548 706570 728886 743857 750937 750433
60551 750433 742954 729258 710600 688971 666646 645498 626915 612245 602884 599716 602733 611409
60539 611409 625261 643972 667378 695664 729322 768558 812812 860997 911662 962278 1008670
60528 1008670 1046149 1071667 1084754 1086482 1078099 1060829 1036458 1007695 977874 950032 925725 904668
60516 904668 885907 869250 855021 842638 830484 817659 805101 794464 786569 781543 779772 781725
60504 781725 787009 794530 803756 815325 830423 850096 875250 906893 946224 994655 1053619 1123956
60492 1123956 1205487 1297446 1399117 1509485 1626162 1745130 1861807 1972204 2073193 2162231
60482 2162231 2237282 2296913 2340201 2366408 2374694 2364056 2333615 2283033 2212678 2123525 2017343
60471 2017343 1897270 1767954 1634705 1502458 1375477 1257398 1150719 1056160 972985 900131
60461 900131 836769 781957 734387 692856 656690 625472 598484 574629 552886 532802 514585
60450 514585 498682 485163 473597 463593 455229 448690 443751 439962 437131 435144 433448 431336 428816
60437 428816 426677 425534 425285 425644 426598 427951 428949 428923 428044 426913 425466 422867 418529 412866 406787 400701
60421 400701 394325 387449 380617 374862 370698 367553 364390 360891 357857 356384 356752 358188 359614 360516 361069
60406 361069 361515 361616 360949 359681 358678 358617 359253 359891 360298 360714 361045 360713 359472 357917 356914 356751 357133
60389 357133 357754 358611 359879 361653 363742 365668 367039 367969 368902 369948 370744 371110 371468 372228 373071 373332 372999
60372 372999 372858 373528 374718 375662 376087 376513 377686 379857 382667 385622 388571 391627 394674 397156 398542
60357 398542 398934 398979 399112 399038 398129 396258 394088 392476 391744 391537 391280 390633 389684 388898 388839 389724 391270 393095
60339 393095 395202 397819 400898 404154 407516 411019 414226 416459 417839 419437 421842 424234 425534 425995
60325 425995 426756 428183 429640 430785 431969 433163 433569 432834 431889 432019 433619 436277 439491 442758 445590
60310 445590 448172 451651 457104 464407 472778 482194 493687 508377 526876 549633 577092 609206 645108
60297 645108 683397 722341 759574 791913 815901 828760 829077 816921 793546 761055 722283 680686
60285 680686 639782 602281 569694 542721 521584 505800 494115 485241 478537 473673 469926 466425
60273 466425 462962 459953 457493 454964 451777 448063 444377 441051 438067 435303 432637 429922 427088 424197
60259 424197 421373 418803 416823 415761 415556 415712 415714 415361 414598 413280 411334 409086 407183 406062 405504 404754
60243 404754 403196 400945 398715 397004 395608 394099 392624 391850 392134 393152 394441 395978 397905 399957 401552
60228 401552 402510 403395 405006 407629 410924 414529 418522 423086 427848 431923 434791 436828 438671 440288 441077
60213 441077 440850 440316 440463 441753 443959 446430 448413 449513 450114 451117 453012 455380 457572 459633 462201
60198 462201 465602 469422 473024 476172 479025 481752 484360 486788 488947 490683 491827 492398 492704 493107 493644
60183 493644 493946 493645 492757 491536 489987 487812 484986 482161 480207 479352 478984 478374 477409 476509 475984 475705 475412
60166 475412 475154 475249 475862 476779 477601 478082 478317 478764 480103 482826 486800 491317 495732 499910 503891 507294
60150 507294 509418 509946 509254 507937 506274 504256 501921 499472 497224 495597 495048 495873 498119 501734 506611
60135 506611 512402 518501 524484 530465 536784 543380 549625 554697 557939 558968 557860 555314 552321 549458
60121 549458 546599 543432 540055 536894 534288 532398 531443 531662 532982 534980 537289 539864 542813 546239 550431
60106 550431 555893 562812 570537 578002 584814 591670 599492 608299 617128 624922 631238 636071 639323 640694
60092 640694 640053 637706 634141 629604 624089 617811 611461 605816 601190 597516 594863 593541 593597 594540 595803
60077 595803 597233 598829 600166 600465 599293 596961 594110 590942 586944 581368 574079 565954 558274 551615
60063 551615 545537 539468 533590 528535 524449 520735 516682 511941 506430 500234 493719 487432 481734 476707
60049 476707 472312 468271 463883 458575 452844 448136 445413 444276 443822 443877 444809 446557 448602 450878 453919
60034 453919 457930 462281 466222 469724 473216 476773 479982 482598 484946 487492 490130 492071 492544 491452
60020 491452 489242 486214 482309 477652 472936 468938 465815 463152 460524 457722 454623 451304 448242 445948
60006 445948 444381 443088 441900 441017 440322 439246 437611 436091 435400 435427 435653 436119 437344 439319 441170 442007
59990 442007 441822 441398 441553 442524 443932 445256 446405 447785 449731 452059 454397 456820 459773 463348 466956
59975 466956 469819 471581 472400 472653 472652 472451 471872 470840 469647 468663 467843 466834 465619 464709 464581 465203 466309
59958 466309 467799 469660 471697 473639 475395 476951 478118 478568 478075 476643 474525 472244 470422 469408 469113
59943 469113 469251 469480 469297 468253 466572 465156 464485 463801 461938 458813 455477 452731 450375 447998 445830
59928 445830 444432 444006 444449 445758 447835 450094 451796 452830 453827 455437 457720 460244 462542 464407 465964
59913 465964 467611 469788 472634 475868 478999 481704 483973 485935 487540 488499 488648 488316 488101 488240 488375 488028
59897 488028 487108 485829 484342 482720 481213 480171 479698 479624 479915 480968 483397 487545 493140 499290 504937
59882 504937 509625 513865 518516 523711 528696 532886 536663 540741 544989 548457 550677 552365 554478 556971
59868 556971 558926 559765 559819 559643 559168 557750 554821 550318 544704 538781 533357 528898 525458 522899 520992
59853 520992 519281 517165 514381 511301 508597 506766 506013 506272 507068 507673 507857 508412 510604 515198 522334 532115
59837 532115 544715 559788 576243 592755 608111 621005 630067 634584 635175 633553 631748 631377 633152
59824 633152 636605 640278 642190 640232 632651 618974 600631 580104 559206 538571 518807 501240
59812 501240 486946 475599 465936 457092 448983 441843 436042 432077 429979 428829 427516 425936 424775 424101
59798 424101 422888 420191 416278 412342 409383 407508 405963 403701 400260 396273 392935 390926 390065 389876 390097
59783 390097 390582 391178 391858 392634 393227 393185 392424 391324 390115 388547 386336 383597 380623 377556 374488 371700
59767 371700 369531 368152 367503 367278 366968 366303 365740 366067 367401 368971 370145 371214 372790 374802 376603 377858
59751 377858 378877 380097 381662 383570 385913 388922 392861 397827 403477 408977 413437 416477 418361 419621
59737 419621 420571 421089 420865 419895 418654 417627 416831 416079 415525 415416 415361 414505 412654 410597 409043 407842 406629
59720 406629 405587 404871 403827 401683 398856 396771 396313 397047 398006 398626 398874 399040 399627 400996 402946 404912
59704 404912 406624 408248 409919 411645 413718 416662 420608 425170 430113 435605 441561 447258 452033 456054
59690 456054 460036 464487 469476 474730 479499 482730 484021 484248 484721 485762 486611 486646 486039 485148 483898 482190
59674 482190 480482 479403 478901 478195 476640 474365 471948 469680 467298 464396 460971 457493 454450 451884 449451
59659 449451 446968 444805 443650 443886 445296 447327 449545 451791 454104 456659 459738 463495 467658 471639
59645 471639 475034 477880 480292 481991 482445 481463 479400 476702 473442 469444 464719 459618 454606 450040 446170
59630 446170 443231 441355 440386 439861 439293 438512 437672 436894 436013 434772 433140 431320 429555 428183 427782 428785
59614 428785 430706 432022 431254 428134 423545 418454 413314 408441 404379 401532 399725 398609 398344 399402 401662
59599 401662 404125 405722 406099 405489 404197 402546 400990 399795 398702 397380 396147 395748 396350 397252 397788 398020
59583 398020 398222 398121 397184 395425 393404 391500 389572 387351 384784 381990 379208 376768 374754 372741 370254
59568 370254 367493 365130 363321 361522 359541 358182 358315 359642 361001 361677 361879 362000 362034 361873 361716 361901
59552 361901 362573 363622 364760 365563 365783 365769 366358 368114 370830 373892 376899 379822 382890 386624 391745 398708
59536 398708 407468 418057 431144 447493 466774 487337 507156 524504 537607 544472 543926 536855
59524 536855 525988 514374 504116 496255 491204 489038 489652 492900 498509 505797 513578 520543 525855 529525
59510 529525 532193 534374 535772 535456 532827 528151 521936 514211 504921 494809 485057 475896 466319 455630
59496 455630 444765 435472 428496 423135 418435 414209 410804 408364 406580 404999 403455 402212 401585 401320
59482 401320 400685 399500 398809 399924 402821 406107 408726 411125 414368 418548 422608 425575 427474 429023 430740
59467 430740 432493 433742 434129 433828 433275 432597 431536 430087 428947 429009 430444 432618 434945 437586 441240 446404
59451 446404 452995 460554 468666 477237 486511 496844 508378 520835 533603 546009 557525 567713
59439 567713 576028 581728 584103 582779 577828 569673 559079 547216 535391 524388 514115 504130 494527
59426 494527 486031 479166 473593 468525 463788 460256 459168 461005 465023 469903 474972 480888 489066 500467
59412 500467 515104 532796 554046 579658 609425 641560 673466 702641 726567 742306 747268 740938
59400 740938 725721 705948 686060 669507 658503 653897 654961 659564 664794 667500 664580 653494 633320
59387 633320 605613 574020 542581 513999 489265 468525 451921 439504 430694 424305 419177 414714
59375 414714 411004 408688 408529 410498 413141 414424 413643 412154 411787 412817 414056 414673 415141 416270 418032
59360 418032 419762 421020 421741 421877 421500 421212 421963 424290 427972 432452 437334 442473 447924 454070 461594
59345 461594 471059 482479 495394 509299 523965 539425 555873 573616 592875 613454 634564 655209
59333 655209 674756 693005 709621 723828 734983 743325 749655 754139 755863 753846 748191 739989 730339
59320 730339 719886 709010 697955 686763 675579 665050 655972 648403 641587 634911 628552 622981 618335
59307 618335 614525 611466 608783 605705 601838 597827 594681 592677 591429 590793 590940 591625 592275 593037 595006
59292 595006 599040 604902 611950 620201 630324 643108 659424 680218 705723 734620 764289 791607
59280 791607 813205 825595 826334 815591 796238 772218 746971 723115 702672 686913 676128 669878
59268 669878 667571 668765 673173 680531 690412 702156 715038 728498 742086 755184 766897 776179 782046
59255 782046 783914 781940 776831 769122 758836 746075 731590 716322 700680 684823 669437 655468
59243 655468 643125 631832 621275 611813 603685 596539 590075 584455 579721 575431 571450 568555 567567 568150
59229 568150 569142 569936 570961 572819 575438 578146 580292 581697 582585 583049 582524 580074 575333 568902 561640
59214 561640 553859 545381 536026 525769 514813 503875 494062 486011 479410 473707 468962 465484 462998
59201 462998 460807 458624 456636 454849 453013 451281 450256 450249 450881 451616 452332 453231 454555 456556 459508 463503
59185 463503 468359 473730 479232 484614 489968 495649 501712 507677 513197 518764 525217 532496 539423 544916
59171 544916 549093 552991 557412 562221 566691 570432 574037 578726 585292 593545 602808 612649 622903 633349
59157 633349 643798 654302 664938 675505 685709 695285 703529 709153 711340 710750 708832 706215 702418
59144 702418 696969 690021 681854 672570 662473 652145 641951 632058 622993 615408 609104 603081 596925
59131 596925 591490 587751 585608 584291 583400 583005 583191 584154 586442 590502 596095 602619 609921 618474 628857
59116 628857 641295 655536 670933 686790 702850 719265 735945 752248 767513 781630 794781
59105 794781 806832 817276 825757 832478 838187 843688 849100 853644 856515 857932 858829 859519 859286 857427
59091 857427 853980 849137 842756 835046 827121 820127 814175 808677 803259 797623 790928 782263 771712 760133
59077 760133 747848 734277 719037 702753 686426 670508 654975 639973 625937 613104 601246
59066 601246 589964 579148 569082 560128 552423 545957 540743 536722 533534 530729 528214 526206 524680
59053 524680 523143 521059 518201 514548 510283 506076 502871 501021 499867 498436 496326 493752 491118 488821
59039 488821 487156 486097 485424 485240 486009 487906 490558 493695 497530 502130 506957 511576 516324 521703 527455
59024 527455 532911 538010 543355 549472 556621 565106 575118 586343 598274 610822 624084 637649 650711
59011 650711 662758 673521 682351 688347 691206 691454 689775 686675 682824 679118 676132 673893 672400 672019
58997 672019 673178 675889 679675 683832 687817 691521 695034 698016 699651 699541 698211 696215 693115 688037
58983 688037 681006 672935 664354 654975 644635 633870 623343 613351 604165 596303 590062 585220 581459
58970 581459 578848 577714 578355 580937 585286 590660 596162 601523 607180 613517 620394 627439 634332 640764
58956 640764 646590 652088 657501 662200 664865 664716 661965 656915 649312 639118 627343 615459 604259
58943 604259 593735 583848 574847 566945 560162 554514 550061 546699 544113 542026 540416 539455 539150 538908 537639
58928 537639 534651 530489 526522 523575 521260 518713 515583 512070 508351 504351 500025 495615 491595 488326
58914 488326 485714 483277 480773 478655 477691 478216 480035 482863 486464 490504 494822 499815 505981 513070 520330
58899 520330 527701 536143 546535 558799 572324 586564 600796 613896 625019 634268 642391 650120
58887 650120 658089 666950 677144 688858 702530 718890 738007 758578 778690 797072 813271 827019
58875 827019 838063 846413 852149 854980 854459 850582 843812 834631 823479 810984 797805 784347 771081
58862 771081 759012 749132 741256 733908 725599 715969 705594 695032 684270 672765 659766 644871
58850 644871 628527 611903 596056 581255 567192 553683 541014 529682 520013 511992 505317 499562
58838 499562 494370 489576 485141 481025 477156 473531 470233 467303 464611 461958 459303 456836 454815 453327
58824 453327 452162 450871 449062 446818 444737 443356 442578 441905 441130 440433 439811 439019 438283 438456 439997 442230
58808 442230 444186 445784 447543 449477 451149 452757 455183 458709 462353 464858 465833 465628 464570 462795 460620
58793 460620 458641 457507 457623 458887 460675 462343 463788 465321 467085 469031 471404 474719 479105 484161
58779 484161 489656 495885 503059 510771 518424 525898 533478 541219 548564 554394 557480 557251 554349 550171
58765 550171 545699 540963 535607 529567 523028 516116 509007 502131 496088 491407 488358 486782 486139 485966 486239
58750 486239 487049 488138 489186 490396 492321 495265 499341 504868 511919 519609 526754 533351 540577 549236
58736 549236 559081 569767 581394 593717 605854 617379 628841 640673 652405 663643 674958 686902
58724 686902 698811 709465 718478 726273 733148 739180 744658 749808 754407 758397 762581 767926 774421 781351
58710 781351 788434 795930 803718 811024 817009 821078 822757 821857 818663 813393 805528 794265 779555 762225
58696 762225 743101 722478 700424 677229 653568 630421 608675 588585 569875 552571 537317
58685 537317 524593 514065 505073 497290 490549 484490 478808 473372 467799 461619 455322 450393 447544 445683
58671 445683 443488 441281 440321 440883 442305 444507 448161 453477 460005 467616 476603 486737 497119 506977
58657 506977 515837 522993 527767 530234 530864 529602 526209 521344 516241 511437 506883 503131 501071 500383 499593
58642 499593 497947 496018 494097 491375 487295 482568 478116 474005 470162 467156 465407 464323 463115 461939
58628 461939 461500 462012 463224 464936 466801 468056 468214 467742 467479 467658 468041 468608 469434 470126 470151 469719 469828 471406
58610 471406 474687 479337 484791 490470 495950 500960 505191 508276 510107 510980 511296 511293 511110 510860 510522 510066
58594 510066 509736 509847 510157 509935 509010 508387 509415 512528 517164 522669 528825 535557 542672 550199 558728 568974
58578 568974 580861 593241 604749 614757 623283 630303 635738 640115 644445 649093 653461 657241 661414
58565 661414 667400 675788 686618 700310 717320 737135 758606 781237 805280 830598 856240 881136
58553 881136 904418 925075 942156 955499 965591 972610 976256 976323 972612 964406 951207 934224 916050
58540 916050 898415 881104 863377 845502 828257 811721 795276 778321 760510 741764 722572
58529 722572 703962 686789 671251 657202 644490 632940 622559 613917 607653 603462 600167 597049
58517 597049 594470 592995 592547 592687 593053 593263 592976 592318 591698 591123 590437 590296 591891 595311 599069 601797 603605
58500 603605 605255 606786 607652 607663 607203 606814 606915 607434 607554 606489 604821 604277 605827 608725 611821 614869
58484 614869 617939 620513 622157 623615 626329 631061 637475 644844 652765 661495 671801 684074 697499
58471 697499 710675 723081 735034 746069 754500 759070 759981 757790 752506 744567 735488 726433 717046
58458 717046 706805 696694 688259 681672 676062 671427 668903 669282 672316 677401 683995 691401 699001 706654
58444 706654 714194 720662 724820 726301 725656 723377 719522 714197 707837 701100 694907 690294 687675 686442
58430 686442 685698 685167 685078 685709 687566 691466 697727 705603 714060 722809 732100 742038 752723 764493 777257
58415 777257 789995 801667 812318 822629 832705 841954 849726 855398 858147 857345 852938 845017 833577
58402 833577 819356 804287 790260 777797 766584 756788 748971 743193 739102 736594 735573 735430 735582
58389 735582 736220 737700 739539 740844 741431 741693 741662 741107 740346 740185 741187 743580 747480 752505 757586 761985
58373 761985 766186 771051 776573 782300 788470 795676 803691 811584 818868 825817 832957 840952 850530 861631
58359 861631 873019 883641 893928 904911 916645 928551 940779 953875 967285 979450 989436 997601
58347 997601 1004697 1011144 1016963 1021640 1024376 1025396 1026664 1030349 1036884 1045342 1055116 1066046 1077418 1088277
58333 1088277 1098670 1109447 1120949 1132911 1145380 1158628 1172368 1186159 1200335 1215393 1230701
58322 1230701 1244991 1257961 1270287 1282238 1293436 1303764 1313368 1321971 1329346 1336376 1344512 1354291
58310 1354291 1365296 1377140 1389454 1401456 1412834 1424599 1437770 1451769 1465524 1479527 1495076
58299 1495076 1511964 1528844 1545636 1563610 1583116 1603133 1623185 1643875 1665359 1687046 1709067
58288 1709067 1732323 1756782 1781443 1806271 1832496 1860626 1889737 1919091 1948929 1979315 2009855
58277 2009855 2040985 2074001 2109269 2145728 2182576 2220161 2258990 2299300 2341878 2387916 2437650
58266 2437650 2490379 2545983 2605162 2668254 2735241 2806813 2883804 2965556 3050418 3137734 3227540
58255 3227540 3318427 3407732 3493956 3577144 3656885 3732082 3802969 3871351 3938675 4005887 4075169
58244 4075169 4149508 4230161 4316749 4410083 4512578 4625527 4748376 4881067 5024751 5179770
58234 5179770 5345373 5521922 5711111 5913676 6129308 6358977 6604777 6867474 7147176
58225 7147176 7446498 7769751 8118813 8493375 8895722 9331401 9804541 10316712 10871564
58216 10871564 11476523 12138574 12862605 13655535 14528102 15491224 16555307 17735280 19052233
58207 19052233 20528816 22188839 24064766 26202018 28655576 31490874 34794272 38679019
58199 38679019 43277928 48735851 55214192 62900115 72013829 82823383 95669236 110978650
58191 110978650 129254477 151035970 176799027 206730806 240383562 276361674 312247472
58184 312247472 344842483 370643056 386448761 390044910 380828436 360101108 330785624
58177 330785624 296621667 261222045 227405760 196971377 170803772 149128710 131792337
58170 131792337 118490876 108880662 102546107 98904473 97167554 96399057 95612372 93873860
58162 93873860 90451709 85018910 77789510 69438066 60813736 52636126 45344456 39109924
58154 39109924 33916875 29644695 26136349 23245337 20849867 18846954 17151445 15701561
58146 15701561 14455237 13378195 12439399 11614919 10887024 10237665 9648033 9104544 8599741
58137 8599741 8126876 7678669 7251832 6847880 6468504 6113898 5785569 5486187 5215618
58128 5215618 4970725 4749535 4551789 4374707 4211848 4057170 3907224 3758966 3609147
58119 3609147 3457405 3307371 3163517 3028877 2906008 2797171 2702293 2618766 2544151 2477368
58109 2477368 2417026 2360838 2307395 2256722 2208656 2162360 2117525 2074130 2030929 1986220 1940198
58098 1940198 1894474 1849170 1802718 1754733 1706881 1660500 1615603 1572654 1533054 1497121 1463667
58087 1463667 1432311 1404283 1380126 1358444 1337787 1318111 1299504 1281038 1261807 1241845 1221294
58076 1221294 1199879 1177785 1155812 1134114 1111947 1089022 1065948 1043114 1020508 998880 979549
58065 979549 962644 947009 932233 919262 908477 898712 888876 879106 869633 859827 849170 838005
58053 838005 826610 814592 801874 789206 777050 764933 752506 740324 729069 718877 709813 702038
58041 702038 695124 688169 680953 673988 667172 659560 650877 642087 634010 626455 619087 612001 604920 596981
58027 596981 587882 578211 568221 557454 546119 535668 527227 520377 514110 508018 501982 495697 489249
58014 489249 483398 478705 475095 472585 471408 471010 470054 468042 465922 464535 463562 462637 462279 462809 463395 463279
57998 463279 463162 464301 466820 469833 472755 475664 478756 482148 485903 489731 493052 495701 498081 500347
57984 500347 502157 503490 504816 505978 505812 503510 499552 494710 489062 482743 476760 472049 468333 464790
57970 464790 461263 457984 454660 450818 446713 442996 439708 436352 432749 429186 425914 423073 420850 419144
57956 419144 417307 414656 411077 406822 402066 397043 392184 387662 383152 378440 373921 370138 367221 365119
57942 365119 363977 363910 364814 366675 369619 373433 377561 381912 387066 393380 400479 407970 415900 424101 431888
57927 431888 439031 446378 454794 463992 473024 481394 489026 495601 500689 504200 506193 506480 504871 501396
57913 501396 495876 487805 477205 465127 452791 440637 428694 417249 406486 395942 385016 373779
57901 373779 362749 352248 342488 333828 326323 319331 312132 304706 297519 290957 285322 280870 277412 274392
57887 274392 271785 270348 270524 271773 273501 275876 279060 282461 285587 288895 292875 296989 300575 304115
57873 304115 308333 312556 315365 316664 317689 318951 319476 318326 315766 312592 309210 305758 302403 299161
57859 299161 296044 293600 292704 293595 295623 298145 301115 304675 308710 313077 317862 323240 329322 336177 343662
57844 343662 351282 358598 365709 372887 379801 385575 389611 391955 392878 392496 390795 387587 382566 375840 368294
57829 368294 360969 354136 347422 340682 334193 328078 322196 316722 312292 309400 307983 307679 308206 309537 312018
57814 312018 316133 321736 327643 332543 336258 339667 343452 347377 350685 352616 352618 350751 347975 345384 342879
57799 342879 339033 332560 323593 313446 303459 294269 285851 278014 270923 265132 260940 257831 254894 251767
57785 251767 248891 246863 245760 245081 244116 242515 240731 239732 240021 241189 242655 244485 247076 250435 254356
57770 254356 258980 264421 270101 275226 279895 284936 290540 295838 299998 303047 305308 306655 306731 305497 303145
57755 303145 299690 294951 288843 281574 273657 265692 257991 250505 243326 237058 232294 228939 226471 224711
57741 224711 223857 223844 224266 224825 225326 225300 224343 222914 222125 222506 223486 224272 224697 224937 224916 224353 223154 221603 220382
57722 220382 220394 222166 225253 228573 231332 233246 233979 233085 230726 227846 225308 223274 221670 220711 220576 220979
57706 220979 221453 221826 222099 222176 222028 221865 221837 221774 221553 221509 222175 223758 226130 229192 232907 237000 240889 243987
57688 243987 245978 246836 246699 245826 244645 243708 243404 243725 244541 246209 249586 255246 263012 272647 284816 300969
57672 300969 322450 350156 384911 427763 480040 543400 619251 706946 801947 895924 978693
57661 978693 1040164 1071681 1067744 1028112 958520 869072 771423 676125 590548 517858 457850 409026
57649 409026 369914 338879 313784 292658 274577 259613 248096 239958 234415 230143 226120 222428
57637 222428 219824 218439 217454 216225 215135 214967 215936 217736 220132 222959 225754 227807 228614 228091 226594
57622 226594 224856 223643 223199 223135 222889 222088 220544 218359 216121 214527 213609 212733 211510 210190 209037 207902
57606 207902 206686 205629 204709 203372 201357 199341 198130 197609 197089 196411 196005 195981 195745 194596 192328 189293
57590 189293 186208 183779 182132 180613 178510 175944 173725 172405 171768 171265 170606 169845 169101 168351 167504 166612
57574 166612 165851 165135 163909 161669 158716 155938 153778 151828 149660 147522 145899 144791 143859 142985 142158
57559 142158 141085 139431 137449 135946 135569 136368 137969 139962 142147 144594 147369 150088 151999 152685 152518
57544 152518 152181 151941 151567 150770 149437 147668 145839 144459 143787 143803 144623 146456 148890 150762 151306 151049 150969
57527 150969 151122 150828 150059 149723 150457 151879 153340 154814 156549 158261 159159 158742 157302 155709 154808 154818 155108
57510 155108 154674 153079 150913 149182 148327 147978 147569 146864 145760 143995 141475 138836 137090 136468 135973 134437
57494 134437 131781 128823 126119 123576 121139 119177 118031 117633 117782 118385 119244 120092 121067 122718 125226 127951
57478 127951 130118 131657 133075 134755 136685 138631 140220 141000 140704 139432 137487 135211 133008 131181 129660
57463 129660 128235 127098 126674 126770 126522 125500 124307 123704 123735 124168 125119 126520 127472 127060 125648 124537 124434
57446 124434 124971 125679 126544 127378 127453 126370 124892 124345 125228 126776 127968 128706 129723 131441 133329 134597
57430 134597 135180 135515 135608 135014 133706 132247 131010 129959 129354 129754 130974 131942 132114 132178 132694 133004 132364 131303
57412 131303 130672 130050 128428 126092 124436 124040 124218 124486 125159 126265 127104 127382 127828 129168 131191 133165
57396 133165 134558 135050 134564 133584 132880 132643 132476 132323 132694 133808 135351 137296 140046 143345 146028 147512
57380 147512 148774 151012 153930 156186 157207 157632 158071 158247 157537 155838 153610 151313 149012 146558 144094
57365 144094 142211 141395 141383 141364 140818 139904 139053 138565 138569 139024 139717 140562 141802 143504 145095 145988 146559 147715
57347 147715 149488 150916 151477 151769 152462 153465 154568 156082 158187 160302 161797 162840 163908 164896 165368
57332 165368 165277 164810 163867 162370 160847 160012 159819 159489 158411 156654 154678 152914 151558 150514 149648 149143
57316 149143 149212 149316 148270 145626 142483 140404 139887 140313 140937 141247 140805 139511 137937 136757 135969 135256 134845
57299 134845 135313 136616 138048 139156 140081 140978 141759 142544 143776 145631 147718 149517 150794 151572 152045 152648
57283 152648 153834 155703 158044 160732 163781 167066 170387 173808 177595 181754 185920 189673 192788 195328
57269 195328 197778 200895 204960 209274 212822 215357 217405 219376 221209 222802 224140 224928 224764 223814 222788
57254 222788 222065 221408 220698 220337 220554 220845 220544 219642 218637 217861 217342 217072 217074 217308 217790 218592 219489 219891 219523
57235 219523 219043 219542 221401 223923 226144 227767 229282 231469 234845 239329 244149 248245 251113 253336 255995
57220 255995 259421 262828 265427 267551 270105 273109 275621 277310 279195 282215 285742 288441 290233 292477
57206 292477 296210 301135 306452 311881 317516 323367 329470 336025 343089 350479 358178 366411 375135 383994
57192 383994 393123 403433 415691 429771 445308 462560 481927 502944 524523 546073 567608 588761
57180 588761 608570 626670 644127 662510 682358 702969 723604 744424 766124 788917 812183
57169 812183 835113 857514 879821 902410 925187 947917 970636 993436 1015899 1037157 1056643
57158 1056643 1074531 1091260 1106790 1120609 1132400 1142426 1151123 1158611 1164851 1170149 1175166 1180393
57146 1180393 1185990 1192251 1199899 1209614 1221555 1235680 1252335 1272042 1294777 1319912 1347035 1376449
57134 1376449 1408645 1443557 1480534 1518815 1557866 1597418 1637440 1678012 1719073 1760272 1801012
57123 1801012 1840570 1878221 1913483 1946265 1976731 2005091 2031718 2057232 2082148 2106666 2131441
57112 2131441 2158571 2191141 2231508 2280478 2338269 2405361 2481893 2567042 2660160 2762478 2877045
57101 2877045 3007267 3156511 3329281 3532003 3772140 4056766 4391772 4781297 5226873
57092 5226873 5726980 6277649 6873404 7507344 8170110 8848379 9523922 10174362 10775837
57083 10775837 11306139 11747040 12086944 12325529 12477479 12568403 12620828 12638964 12604838 12488939
57073 12488939 12265894 11923772 11464293 10898910 10245487 9526133 8765166 7987177 7215442
57064 7215442 6470375 5767963 5118938 4529139 4000446 3531460 3118096 2754626 2435012
57055 2435012 2153775 1906052 1687275 1493035 1319319 1162871 1021368 893333 777913
57046 777913 674637 583019 502080 430252 365988 308510 257802 213824 175933 143094 114357
57035 114357 89065 66967 48414 34154 24548 19110 17075 18215 22742 30666 41818 56495 75506
57022 75506 99450 128614 163819 206848 259605 323411 399782 491593 602647 735890 892006
57011 892006 1068539 1257933 1444809 1606089 1716699 1758594 1727330 1632486 1493061 1331347
57001 1331347 1167648 1016561 885387 775176 683697 608208 546418 496084 454699 419922
56991 419922 390052 364045 341354 321896 305815 292874 282142 272598 263953 256525 250235 244106
56979 244106 236920 228048 217351 204645 189855 173730 157817 143407 130700 119292 109192 100984
56967 100984 95077 91284 89347 89602 92809 99366 108851 120394 133410 147892 163950 181014 197552
56954 197552 211691 222057 228019 229251 225484 216836 204176 188947 172661 156589 141711 128720
56942 128720 118087 110215 105389 103477 103890 106190 110720 118325 129433 143642 160262 178933 199396
56929 199396 220677 240667 256581 265952 267574 261841 250365 235099 217628 199097 180614 163416
56917 163416 148418 135645 124352 113877 104246 95865 88841 82906 77871 73734 70305 67208 64438
56904 64438 62562 62007 62407 62938 63141 63150 63339 64129 65994 69179 73420 78199 83298 88915 95435 103411 113617
56887 113617 126613 142105 159016 176077 192004 205196 213927 217144 214852 207726 196857 184011
56875 184011 171523 161261 153735 148417 144806 143052 143851 148095 156551 169611 187372 209959 237576
56862 237576 270127 307059 347706 391440 436898 480978 518941 545971 559115 558186 545103 522488
56850 522488 493009 459879 427157 398623 376135 359588 348581 343574 345306 353853 368876 390422
56838 390422 419000 455188 499650 553159 615723 685406 758050 827892 888177 931792 952701
56827 952701 947835 918069 867785 803622 732951 662277 596203 537615 488436 449717 421180 401452
56815 401452 389248 384227 386672 396746 414327 439342 471917 512014 558740 609637 660443 705663
56803 705663 739619 757471 756086 734944 696544 645693 588035 528931 472968 423393 381442 346538
56791 346538 317694 294813 278542 269129 265848 267577 273669 284162 299304 319051 342835 369395
56779 369395 396538 421182 440010 450354 450574 439970 418924 389365 354650 318420 283398 251128
56767 251128 222342 197135 175110 155976 140057 127864 119171 112889 107765 102850 97412 91060 84245
56754 84245 78145 73650 70519 67757 64692 61592 59316 58407 58435 58261 57097 55199 53316 51726 50268
56739 50268 49120 48796 49226 49483 48863 47736 46901 46488 46020 45308 44696 44467 44483 44519 44599 44901 45522 46445 47581
56720 47581 48817 50119 51596 53336 55156 56668 57653 58338 59226 60613 62213 63335 63501 62875 62004 61247
56704 61247 60584 59910 59232 58579 57971 57513 57313 57218 56888 56154 55102 53754 51948 49661 47166 44805 42859
56687 42859 41790 42218 44339 47542 50845 53592 55605 56918 57664 58094 58520 59237 60520 62405 64382 65644
56671 65644 65896 65662 65631 66026 66828 68090 69543 70292 69638 68075 66818 66337 65948 64937 63447 62069 61097
56654 61097 60519 60333 60482 60723 60898 61146 61606 62173 62866 64148 66389 69059 70925 71235 70422 69521 69198 69522
56636 69522 70387 71712 73267 74693 75858 76958 78119 79120 79769 80401 81653 83760 86356 89021 91695
56621 91695 94413 96907 98802 100071 101037 101894 102385 102070 100810 98995 97295 96188 95705 95587 95545 95307 94620
56604 94620 93520 92555 92342 92805 93105 92518 91158 89750 88955 89019 89726 90404 90304 89341 88337 88142 88672 89126
56586 89126 89025 88645 88440 88466 88526 88571 88774 89321 90222 91291 92309 93266 94385 95819 97490 99328 101436 103836
56568 103836 106263 108572 111100 114217 117672 120964 124352 128873 135179 142916 151542 161257 172619 185478
56554 185478 198760 211113 221352 228476 231972 232381 231166 229723 228636 227982 227890 228441 229228 229577 229224
56539 229224 228374 227025 224725 221318 217428 213739 210040 205636 200599 195926 192255 189052 185365 180947
56525 180947 176158 171216 166081 160952 156337 152559 149532 146970 144535 141850 138729 135500 132799 130932
56511 130932 129553 128047 126112 123922 121821 119891 117869 115622 113578 112369 111947 111495 110467 109336 108908
56496 108908 109242 109776 110258 110905 111723 112312 112493 112597 112911 113255 113369 113438 113966 115227 117005 118781 120108 120880
56478 120880 121272 121455 121574 121985 123117 124800 126157 126631 126771 127500 128889 130323 131576 132842 133828 133844 132972
56461 132972 132216 132159 132308 132216 132342 133191 134349 135175 135910 137282 139358 141607 143857 146394 149230 151989 154504
56444 154504 156856 158776 159638 159275 158334 157661 157618 158041 158457 158294 157297 155863 154636 153700 152524 150833 149114
56427 149114 148058 147837 148133 148601 148999 149136 149080 149344 150549 152824 155676 158359 160239 160940 160529 159655 159176
56410 159176 159342 159436 158478 156295 153720 151739 150702 150420 150693 151391 152142 152357 151742 150672 149949 150174 151313
56393 151313 152843 154316 155776 157483 159314 160754 161659 162584 164046 165730 166904 167395 167659 168025 168467 169069
56377 169069 170125 171622 173196 174756 176653 179038 181549 183871 186076 188107 189421 189500 188410 186520 184102
56362 184102 181528 179411 178066 177092 175898 174424 172992 171806 170977 170768 171279 172115 172802 173386 174239 175455
56346 175455 176878 178465 180174 181654 182596 183321 184531 186492 188834 191113 193207 195275 197705 200896 204611
56331 204611 207701 209129 209267 209611 211094 213267 215290 217106 219242 221863 224503 226651 228302 229905 231927
56316 231927 234424 236983 239017 240070 239828 238156 235393 232469 230401 229552 229525 229652 229458 228846 228110 227719
56300 227719 227845 228244 228725 229468 230574 231692 232533 233484 235109 237175 238821 239642 239984 240160 240044 239643 239497
56283 239497 240154 241649 243655 245804 247684 249002 249948 251023 252324 253469 254424 255853 258209 260930 263022
56268 263022 264193 264911 265597 266319 267207 268616 270707 273208 275753 278250 280826 283562 286398 289259 292201
56253 292201 295483 299459 304294 309780 315531 321424 327801 335171 343702 352985 362319 371226 379754 388375
56239 388375 397627 407731 418377 428932 438947 448436 457542 466037 473449 479554 484395 487800 489342
56226 489342 488926 486989 483944 479895 475133 470349 465884 461196 455629 449370 443144 437301 431840 427026
56212 427026 423133 419674 415749 411345 407607 405563 405042 405045 404664 403430 401276 398613 396229 394787 394446 394907
56196 394907 395616 395968 395727 395344 395603 396840 398711 400700 402582 404406 406312 408434 410801 413403 416425
56181 416425 420119 424140 427459 429429 430640 432134 434103 436110 438301 441375 445324 449177 452245 454798
56167 454798 457209 459272 460807 462304 464472 467612 471743 476841 482601 488450 494158 500061 506480 513400
56153 513400 520877 529122 537971 546987 556423 567282 579871 593026 605520 617736 631267 647348
56141 647348 666506 689348 716698 748962 786202 829055 879053 937910 1007009 1087749 1181902
56130 1181902 1291008 1415044 1551360 1694523 1837147 1971496 2091293 2193162 2277160 2346029
56120 2346029 2403552 2453096 2497058 2536614 2571086 2597743 2613181 2615591 2605792 2586383 2560285 2529696
56108 2529696 2495182 2455011 2405491 2342399 2262474 2164493 2050140 1924162 1793113 1663521
56098 1663521 1541083 1430647 1335503 1256253 1191142 1137843 1094531 1059561 1031307 1008765 991501
56087 991501 978705 969141 962242 958302 957210 957953 959825 963164 968270 974480 980994 987799 995093 1002550
56073 1002550 1009882 1017447 1025518 1033570 1041047 1048368 1056543 1066165 1077289 1089719 1102920 1116259 1129891
56060 1129891 1144833 1161656 1179733 1198193 1216898 1236022 1255463 1275279 1295866 1317170 1338509
56049 1338509 1359675 1381191 1402888 1423420 1442106 1460147 1478990 1498473 1517701 1536811 1556596
56038 1556596 1577207 1598474 1620781 1644415 1668680 1692900 1717752 1744478 1773444 1804576 1838465
56027 1838465 1875692 1915754 1958088 2003684 2054238 2110092 2170200 2233726 2300424 2369925 2442003
56016 2442003 2517149 2595677 2676569 2758360 2840674 2923741 3006968 3089268 3170403 3250915 3331314
56005 3331314 3412522 3496448 3584793 3677801 3775266 3877984 3987095 4103009 4226291 4358532
55995 4358532 4500861 4652863 4814639 4988585 5177064 5379530 5594229 5821622 6063742
55986 6063742 6321209 6593689 6882723 7191519 7522484 7877605 8260769 8677147 9130607
55977 9130607 9624187 10162651 10752201 11398451 12107490 12888436 13752580 14711164 15777025
55968 15777025 16967614 18303969 19808915 21510827 23449145 25674469 28247869 31247617
55960 31247617 34776994 38961061 43937296 49855799 56890116 65247569 75179458 86999278
55952 86999278 101100895 117956704 138082557 161945401 189762684 221183010 254969221
55945 254969221 288889214 319925857 344740015 360258504 364309028 356200327 337017313
55938 337017313 309395831 276799664 242635041 209594348 179400849 152880411 130196427
55931 130196427 111114158 95213733 82021814 71078930 61975029 54366460 47973625
55924 47973625 42568608 37967185 34024945 30628846 27686550 25122274 22877070 20905058
55916 20905058 19167011 17628757 16262943 15047446 13961909 12988492 12114486 11330267
55908 11330267 10624893 9986515 9406312 8878788 8398511 7959229 7555703 7183623 6837982
55899 6837982 6513947 6209067 5922469 5652470 5397205 5156812 4932359 4723008 4526667
55890 4526667 4342979 4173150 4017109 3873428 3741974 3624092 3520004 3428416 3349152 3284108
55880 3284108 3235293 3203899 3191605 3200583 3231196 3280842 3345000 3417549 3489604 3550119 3589016
55869 3589016 3599403 3577214 3520830 3431923 3315225 3176297 3020124 2852216 2679844 2510993
55859 2510993 2352136 2207051 2076988 1961420 1858936 1767853 1686339 1612708 1546239 1487184
55849 1487184 1435309 1388883 1345874 1305612 1268404 1234134 1202321 1172924 1145674 1119065 1091597
55838 1091597 1063962 1038450 1016039 995441 975224 955432 936648 918750 901310 884351 868028
55827 868028 852227 836990 822806 810121 798913 788930 779867 771256 762596 753624 744060 733369 721432
55814 721432 709172 697705 686976 676105 664979 654613 645845 638613 632647 628053 624932 623032 621976
55801 621976 621319 620433 618954 617361 616494 616468 616675 616791 617171 618328 620594 624174 628883 634002 639047 644348
55785 644348 650094 655196 658124 658692 657905 656067 652145 645034 634331 619746 600915 578276 553326
55772 553326 527687 502642 479631 460218 445195 434394 427447 423943 422797 422548 422556 423021 423694 423695 422940
55757 422940 422637 423747 425794 427687 428817 428836 427282 424119 419971 415159 409191 401702 393223 384475 375570
55742 375570 366515 357785 349720 341951 334126 326691 320231 314544 309132 304224 300536 298169 296403 294477
55728 294477 292024 288899 285116 281022 277164 273856 270912 267678 263378 257803 251750 246409 242233 238762
55714 238762 235566 232812 230824 229691 229505 230397 232064 233864 235669 238097 241619 245898 250177 253684 255517
55699 255517 254964 252311 248575 244057 237991 230159 221887 214647 208397 202272 196306 191410 188010 185746
55685 185746 184403 184144 184803 185776 186803 188273 190593 193649 196944 199913 202109 203419 204029 203932 202652 199807
55669 199807 195784 191478 187514 184005 180857 177937 175140 172653 170942 170118 169560 168570 167227 166184 165870
55654 165870 166346 167698 170032 173103 176395 179546 182444 185033 187392 189833 192612 195676 198980 202725
55640 202725 206824 210456 212692 213465 213395 212779 211290 208624 204830 199909 193606 185890 177363 169059 161949
55625 161949 156577 152906 150487 148928 148105 147797 147406 146441 145079 143883 143033 142189 141024 139538 137879 136218
55609 136218 134741 133502 132310 131016 129759 128606 127173 125018 122314 119709 117634 116200 115635 116208 117593
55594 117593 118839 119215 118796 118036 117112 115942 114677 113863 114021 115023 116013 116171 115681 115642 116792 118662 120340
55577 120340 121733 123520 126064 128997 131907 134872 138174 141975 146436 151775 158001 164812 171818 178520
55563 178520 184103 187706 189061 188581 186661 183260 178306 172174 165482 158617 151657 144581 137427 130398
55549 130398 123925 118397 113797 109844 106526 104162 102822 102057 101429 100980 100911 101111 101352 101769 102709 104182
55533 104182 105793 107184 108217 108743 108565 107807 106968 106369 105728 104525 102681 100617 98653 96726 94752 92944
55517 92944 91488 90177 88691 87163 86132 85904 86288 86938 87623 88123 88297 88376 88786 89406 89434 88410 86996
55500 86996 86263 86387 86615 86395 85965 85688 85389 84747 84041 84078 85327 87337 89118 90009 90095 89748 89009 87699
55482 87699 86054 84800 84432 84741 85272 85867 86465 86797 86800 87007 87923 89120 89681 89552 89730 90859 92241 92622
55464 92622 91568 89687 87852 86630 86240 86515 86881 86698 85768 84436 83225 82446 82052 81696 80991 79866 78680
55447 78680 77861 77511 77365 77130 76773 76576 76966 78169 79883 81407 82245 82583 83012 83853 84936 86073 87447
55430 87447 89331 91580 93654 95114 95844 95819 95023 93754 92663 92136 91845 91233 90295 89429 88687 87687 86320
55413 86320 84972 83893 82917 82062 81888 82787 84289 85474 85789 85103 83432 81208 79475 79062 79611 80059 80033
55396 80033 80118 80701 81302 81348 80973 80675 80611 80683 80965 81562 82207 82434 82184 81921 82109 82703 83183 83024 82157 81039
55376 81039 80237 79951 79985 80090 80166 80147 79990 79830 79911 80214 80390 80265 80180 80558 81253 81668 81581 81549 82291 83784 85203
55355 85203 85782 85538 85030 84588 84019 83081 81968 81175 80973 81151 81254 81069 80913 81366 82589 84002 84875 85140
55337 85140 85223 85195 84686 83780 83254 83506 83836 83415 82471 81780 81308 80350 78918 78060 78535 79899 81198 81955 82201
55318 82201 82064 81719 81336 80764 79697 78437 77982 78935 80665 81998 82412 82111 81294 80007 78654 78037 78679
55301 78679 80346 82311 83820 84339 83766 82619 81792 81828 82406 82715 82368 81910 82310 83958 86261 88264 89496
55284 89496 90098 90324 90260 89944 89404 88500 87063 85311 83826 82991 82739 82967 83777 85018 85936 85773 84567 82971
55266 82971 81403 79860 78555 78144 78956 80335 81193 81190 80996 81335 82082 82543 82438 82271 82683 83716 84812 85371
55248 85371 85164 84330 83164 81867 80476 79106 78241 78516 80053 82165 83951 85046 85638 85975 86117 86037 85673
55231 85673 84980 84164 83700 83869 84374 84677 84553 84068 83302 82508 82259 82886 83911 84582 84911 85545 86703 87898
55213 87898 88728 89219 89293 88685 87688 87219 87697 88442 88624 88284 87963 87870 87923 88163 88587 88923 89087 89459 90154 90436
55193 90436 89607 88142 87215 87226 87567 87743 87919 88269 88509 88420 88298 88506 88933 89125 88729 87671 86202 84893
55175 84893 84335 84607 85207 85597 85686 85719 85967 86592 87573 88583 89118 89035 88890 89532 91282 93486 94919 94746 93194
55156 93194 91305 90033 89697 90209 91466 93174 94528 94592 93145 90900 88771 87140 85932 85151 84992 85437
55140 85437 85974 85948 85251 84531 84596 85596 86940 87954 88433 88525 88330 87822 87045 86238 85781 86018 86912 87870 88165
55121 88165 87664 86916 86420 86126 85835 85704 86025 86755 87606 88390 88943 88938 88211 87172 86513 86586 87335 88626 90225
55102 90225 91687 92812 94126 96267 98885 100760 101173 100592 99806 98978 97915 96750 95842 95288 95028 95247
55086 95247 96174 97549 98682 99097 98850 98220 97378 96451 95623 94995 94482 94004 93723 93912 94544 95072 94769 93384
55068 93384 91433 89750 88711 87949 86906 85551 84452 84110 84398 84721 84693 84459 84348 84414 84525 84699 85046 85376
55050 85376 85290 84758 84356 84672 85651 86741 87493 87835 87980 88338 89320 90842 92090 92184 91155 89980 89606 90174
55032 90174 91224 92315 93262 94017 94558 94892 95051 95149 95440 96195 97398 98635 99327 99114 98133 96999 96425 96659
55014 96659 97304 97808 98070 98365 98774 98990 98744 98162 97568 97149 96915 96847 96856 96713 96188 95277 94199 93187 92385
54995 92385 91888 91796 92172 92954 93971 95029 96025 97012 98190 99753 101606 103217 103917 103516 102515 101609 101103
54978 101103 101020 101491 102569 103710 104081 103565 102957 102841 102789 102167 101299 101161 102051 103272 104149 104784 105551 106333
54960 106333 106651 106396 106130 106593 107932 109472 110354 110438 110390 110811 111523 111904 111588 110604 109135 107609 106735 106890
54942 106890 107560 107847 107452 106704 105838 104884 104189 104264 104961 105489 105498 105461 105704 105696 104858 103624 103136 104105 106365 109242
54922 109242 111983 114025 115342 116549 118454 121551 125974 131583 137952 144650 151807 159998 169237 178561
54908 178561 187015 194517 201094 205696 206820 204326 199747 194502 188506 181003 172173 163304 155585 149234
54894 149234 143787 138826 134360 130692 128036 126208 124733 123300 122015 121123 120585 120139 119720 119602 120074 121128
54878 121128 122573 124346 126549 129260 132515 136502 141506 147471 153799 159925 166133 173404 182255 191858
54864 191858 200613 207460 212338 215380 216094 213700 208128 200322 191468 182225 172871 163890 155987 149481
54850 149481 144077 139378 135330 131964 128932 125666 121934 117992 114293 111252 109176 108054 107380 106514 105289
54835 105289 104087 103315 103061 103272 103913 104708 105022 104346 102883 101455 100780 100905 101253 101163 100363 99024 97503
54818 97503 96171 95432 95561 96330 97036 97219 97214 97668 98650 99606 100104 100217 100216 100353 100991 102372 104112 105400 105922
54799 105922 106142 106410 106341 105474 104130 103152 103044 103813 105311 107184 108642 108932 108108 106930 105960 105146 104345
54782 104345 103830 104071 105248 107147 109352 111405 112893 113518 113160 111976 110513 109572 109682 110752 112344 114279
54766 114279 116778 120118 124374 129502 135390 141777 148374 155200 162637 170979 179984 188931 197114 204213
54752 204213 210233 215096 218315 219055 216612 210911 202693 193279 184027 175718 168344 161529 155167 149541
54738 149541 144935 141428 139120 138101 137947 137594 136226 134237 132851 132732 133310 133624 133534 133789 135042 137133
54722 137133 139389 141386 143182 144949 146791 149034 152355 157263 163553 170583 177907 185296 192228 197919
54708 197919 201929 204242 204549 202112 196744 189528 182014 174926 168091 161333 154868 148904 143438 138546
54694 138546 134448 131147 128354 125864 123700 121833 120072 118427 117328 117244 118138 119400 120299 120464 120017 119311
54678 119311 118590 117941 117493 117369 117382 117051 116146 114998 114099 113605 113503 113941 114950 116019 116463 116206 115754 115367
54660 115367 114702 113416 111731 110149 108906 107941 107220 106865 106987 107489 108017 108171 107921 107719 107949 108316 108112
54643 108112 107120 105958 105359 105408 105647 105729 105722 105875 106322 107018 107835 108672 109491 110273 111029 111885 112971 114058 114512
54624 114512 113947 112856 112267 112643 113443 113840 113583 112991 112376 111787 111195 110678 110335 110150 109980 109730 109514 109561 109902
54605 109902 110266 110427 110603 111241 112426 113702 114536 114816 114851 115006 115399 115836 116034 115952 115848 115951 116217 116554 117059
54586 117059 117790 118489 118941 119508 120806 122786 124551 125221 124667 123263 121400 119510 118200 117915 118516 119448
54570 119448 120271 120872 121283 121512 121593 121698 122141 123186 124730 126246 127187 127400 126969 125899 124359 123109 123043
54553 123043 124131 125367 125978 126206 126603 127121 127475 127963 129170 131044 132866 134151 134985 135467 135470 135156 135248 136427
54535 136427 138725 141669 144655 147039 148273 148482 148662 149846 152017 154209 155695 156698 157784 158908 159423
54520 159423 158950 157885 156964 156555 156540 156714 156954 156988 156302 154587 152224 150111 148937 148706 148968 149273 149261 148615
54502 148615 147338 146110 145906 146919 148067 147970 146373 144337 143014 142632 142724 142899 143077 143229 143323 143478 143911
54485 143911 144729 145828 146939 147650 147628 147036 146581 146874 147816 148837 149598 150255 151157 152567 154519 156671 158465
54468 158465 159858 161700 164878 169112 173166 176348 179205 182475 185838 188201 188967 188628 188169 188209 188721 189366
54452 189366 189943 190502 191056 191394 191329 191027 190800 190649 190288 189591 188675 187595 186310 184969 183805 182768 181679
54435 181679 180795 180630 181048 181087 180003 177998 175687 173366 171188 169564 168805 168675 168745 168892 169055 168864 168103
54418 168103 167232 166847 166814 166564 166120 166131 166872 167853 168527 168882 169141 169388 169695 170233 171026 171837 172492 173054 173572
54399 173572 173912 173982 173966 174201 174956 176288 177873 179016 179180 178592 178057 178049 178292 178332 178259 178553 179332 179971 179534 177679
54379 177679 175172 173405 173152 173831 174214 173719 172674 171457 169972 168208 166773 166354 166847 167397 167328 166762 166322
54362 166322 166417 166847 167069 166851 166721 167537 169488 171597 172520 171878 170633 170040 170331 170580 169818 168044 166049
54345 166049 164471 163361 162588 162195 162095 161761 160615 158629 156252 153915 151879 150409 149633 149296 149082 149111
54329 149111 149613 150080 149431 147343 144908 143479 143160 142923 142008 140747 139977 140090 140758 141408 141798 142116 142589
54312 142589 143082 143273 143144 142975 142792 142230 141148 140041 139551 139863 140919 142801 145314 147458 148043 146974
54296 146974 145411 144567 144779 145729 146965 148000 148516 148789 149431 150372 150618 149542 147860 146658 145783 144103
54280 144103 141368 138828 137712 137803 138000 137744 137317 137063 137029 137303 138103 139304 140278 140461 139905 139065 138183 137114
54262 137114 135741 134375 133570 133566 134070 134661 135298 136207 137338 138183 138266 137596 136575 135649 135179 135311 135685 135503
54244 135503 134314 132660 131595 131537 131941 132156 132188 132441 133010 133538 133649 133326 132858 132597 132746 133288 134023 134623
54226 134623 134640 133678 131765 129551 127920 127331 127581 128141 128532 128452 127830 126848 125787 124865 124347 124654 125993 127838
54208 127838 129172 129443 129073 128919 129401 130260 130953 131153 130955 130639 130190 129211 127553 125848 124981 125082 125560 126117
54190 126117 127132 128891 130999 132845 134168 134907 135017 134765 134693 134879 134746 134005 133221 132882 132482 131320 129751
54173 129751 128821 128861 129302 129693 129995 129905 128842 126888 124949 123689 122881 122098 121469 121387 121948 123021 124494 126128
54155 126128 127491 128281 128505 128200 127359 126286 125645 125862 126652 127354 127569 127410 127304 127552 127870 127522 126335 125372
54137 125372 125981 128151 130474 131788 132104 131757 130689 129108 128006 128106 128800 128910 128219 127510 127366 127695 128261
54120 128261 128947 129497 129697 129821 130304 131011 131430 131602 132099 132940 133323 132866 132425 133049 134510 135546 135431 134706
54102 134706 134301 134479 134889 135236 135446 135319 134525 133128 131835 131384 131783 132435 132927 133357 133899 134466 134996 135660
54084 135660 136486 137073 137068 136744 136748 137371 138435 139725 141053 141947 141846 140825 139733 139325 139529 139783 139897 140236
54066 140236 141117 142314 143304 143840 144132 144493 144962 145328 145438 145261 144724 143758 142586 141654 141131 140777 140522 140811
54048 140811 141970 143477 144461 144870 145564 147178 149442 151835 154278 156782 158896 160150 160917 162194 164453
54033 164453 167157 169653 172110 175283 179493 184296 189138 193984 199083 204349 209315 213662 217508 221092
54019 221092 224423 227389 229960 232103 233712 234859 235902 236991 237589 236969 235220 233301 231922 230720 228823
54004 228823 225922 222491 219153 216161 213374 210483 207309 204100 201426 199560 198097 196477 194751 193404
53990 193404 192494 191450 189837 187844 185788 183629 181386 179678 179205 179692 179880 178753 176488 174086 172386
53975 172386 171616 171565 171817 171841 171176 169745 168031 166856 166772 167531 168268 168454 168550 169372 170896 172227 172900 173608
53957 173608 175192 177434 179478 181163 183195 186005 189202 192271 195230 198323 201621 205326 210062 216378
53943 216378 224190 233003 242483 252495 262737 272644 281440 288001 291032 289943 285605 279859 274183 269021
53929 269021 264147 259214 253984 248530 243452 239562 237172 235940 235500 235938 237414 239599 241858 243954 246302
53914 246302 249480 253600 258210 262787 267294 272220 277961 284250 290341 295790 300792 305706 310525 315039
53900 315039 319252 323270 326789 329049 329432 327986 325333 322295 319610 317691 316359 314953 312883 310071
53886 310071 306756 303080 299121 295094 291089 286661 281175 274731 268303 262675 257663 252766 248205 244725
53872 244725 242510 240899 239256 237570 236063 234652 233061 231109 228638 225452 221593 217580 214110 211603
53858 211603 210042 209046 208037 206582 204657 202410 199769 196737 194035 192752 193029 193698 193652 193098 192912 193317
53842 193317 193892 194454 195014 195059 193885 191765 189912 188978 188347 187259 185922 184976 184434 183767 182745 181559 180342
53825 180342 179106 178126 177817 178119 178341 177839 176660 175406 174557 174058 173560 173031 172963 173819 175337 176704 177493
53808 177493 178168 179440 181381 183439 185219 186892 188879 191353 194155 197017 199783 202524 205532 209156
53794 209156 213576 218625 223785 228362 231877 234376 236347 238322 240552 242998 245410 247453 248959 250191
53780 250191 251651 253509 255406 256910 258000 258921 259774 260494 261090 261552 261543 260534 258434 255924 254066 253697
53764 253697 255204 258659 263837 270025 275959 280190 281660 280027 275499 268570 259952 250568 241260 232408
53750 232408 224040 216393 210096 205589 202583 200353 198498 197089 196105 195082 193506 191410 189375 188015
53736 188015 187583 187988 189060 190666 192574 194281 195175 195011 194208 193523 193373 193608 193940 194363 194963 195465 195305
53719 195305 194257 192746 191394 190407 189575 188762 188131 187872 187921 188045 188073 187989 187962 188328 189372 191004 192833 194660
53701 194660 196707 199148 201670 203824 205680 207775 210372 213123 215540 217493 219144 220583 221692 222283
53687 222283 222322 222147 222354 223241 224438 225429 226371 227924 230194 232388 233809 234703 235729 237070 238594 240491
53671 240491 243030 245829 248118 249758 251307 252833 253370 251951 248800 245041 241535 238397 235425 232488
53657 232488 229554 226752 224481 223143 222649 222404 221849 220852 219546 218012 216304 214690 213635 213442 213835 213995
53641 213995 213199 211633 210489 210963 213050 215460 216838 216951 216590 216578 217156 218249 219865 221974 224170 225788
53625 225788 226432 226295 225952 225962 226671 228186 230373 232906 235422 237663 239544 241184 242900 244987 247373 249632
53609 249632 251482 253212 255424 258379 261776 265144 268232 271006 273476 275604 277219 277988 277725 276852 276250
53594 276250 276400 276816 276609 275458 273765 272031 270448 269084 268032 267268 266599 265894 265154 264297 263161 261833
53578 261833 260747 260257 260271 260334 259874 258363 255698 252599 250272 249292 249078 248723 248072 247609 247649 248118 248901 249841
53560 249841 250505 250578 250506 251193 252936 255162 257293 259281 261168 262746 264052 265653 267942 270513 272697 274495
53544 274495 276514 279185 282457 286183 290406 295218 300574 306259 311953 317500 323222 329681 336972 344612
53530 344612 352417 361091 371478 383429 395925 408126 419894 431434 443008 454976 467671 481186
53518 481186 495609 511297 528504 546976 566465 587508 610867 636159 661853 686899 711619
53507 711619 736615 761538 785614 808883 832116 855674 879145 902122 924711 947076 968946
53496 968946 989917 1010097 1030154 1050690 1071693 1092674 1113282 1133563 1153588 1173057 1191530
53485 1191530 1208893 1225214 1240247 1253514 1265024 1275500 1285712 1295833 1305540 1314460 1322318 1328842
53473 1328842 1333658 1336139 1335459 1331199 1323951 1314890 1304633 1292857 1279096 1263335 1245730 1226482 1206313
53460 1206313 1186334 1166857 1146883 1125388 1102566 1079054 1054594 1028588 1001719 975748 951533
53449 951533 928334 905453 883507 863438 844992 827048 809122 791826 775932 761587 748529
53438 748529 736684 726405 718228 712358 708357 705489 703515 703025 704866 709409 716443 725498 736086 747883
53424 747883 760995 775944 793109 812266 832872 854643 877564 901444 925872 950756 976634
53413 976634 1004198 1033585 1064343 1096110 1129250 1164654 1202874 1243613 1286201 1330455 1376758
53402 1376758 1425324 1475839 1528039 1582277 1639024 1697901 1757620 1816973 1875600 1933803 1991938
53391 1991938 2050071 2107925 2164942 2220541 2274510 2326967 2377784 2426171 2471034 2511661 2547888
53380 2547888 2579662 2606697 2628685 2645746 2658548 2667902 2674144 2676901 2675543 2669830 2659877 2645396
53368 2645396 2625273 2598221 2563771 2522387 2474734 2421253 2362482 2299340 2232884 2164034 2093723
53357 2093723 2023060 1953053 1884303 1817133 1751839 1688634 1627526 1568559 1512028 1458127 1406415
53346 1406415 1355946 1306049 1256848 1209047 1163333 1119953 1078634 1038934 1000805 964786 931472
53335 931472 900830 872232 845180 819849 796971 777309 761160 748131 737432 728516 721364 715995
53323 715995 711954 708613 705865 704106 703669 704656 707268 711721 717773 724804 732533 741164 750707 760737
53309 760737 771212 783063 797472 814729 834160 854997 876967 900182 924809 950866 978159
53298 978159 1006419 1035560 1065622 1096488 1127903 1159835 1192409 1225331 1257792 1289226 1319745
53287 1319745 1349506 1377965 1404095 1427056 1446356 1461788 1473728 1483204 1491036 1496989 1500184 1500194 1497227
53274 1497227 1491401 1482476 1470417 1455722 1439009 1420648 1400883 1379964 1357933 1334418 1308774 1280438
53262 1280438 1249374 1216324 1182380 1147955 1112371 1074907 1036073 997339 959639 922664 885729
53251 885729 848925 813211 779689 748851 720233 692709 665388 638325 612158 587115 562769
53240 562769 538788 515509 493567 473212 454196 436196 419219 403610 389579 376751 364411
53229 364411 352418 341522 332439 324919 318200 312012 306489 301291 295726 289825 284492 280312 276853 273438
53215 273438 269960 266593 263232 259698 256119 252731 249600 246811 244505 242420 239834 236452 233000 230474
53201 230474 229027 228010 226921 225849 225048 224481 223832 222789 221334 219793 218440 216988 214797 211785 208822
53186 208822 207024 206839 207914 209442 210453 210243 208942 207398 206225 205288 204326 203513 202895 201880 200060 198263
53170 198263 197911 199336 201429 203004 203791 203968 203450 202147 200532 199407 199200 199687 200348 200815 201019 201050 200888
53153 200888 200361 199401 198236 197201 196443 196028 196151 196964 198183 199132 199269 198554 197358 196171 195288 194605 193757
53136 193757 192674 191844 191798 192488 193485 194604 195866 196911 197061 196196 195152 194902 195601 196677 197571 198013 197778
53119 197778 196685 194950 193220 192038 191356 190730 189889 188943 188066 187186 186110 184779 183279 181699 180214 179192
53103 179192 178880 178945 178650 177654 176405 175569 175363 175649 176396 177567 178719 179153 178611 177580 176783 176521 176535 176390
53085 176390 175920 175429 175418 176067 176997 177664 177908 178015 178285 178721 179087 179121 178699 177865 176684 175069 172898 170411
53067 170411 168172 166455 164883 163021 161167 160131 160265 161095 161979 162721 163389 163869 163929 163604 163242 163113 163101
53050 163101 162866 162314 161785 161643 161747 161630 161247 161159 161712 162398 162547 162405 162892 164258 165617 166007 165356 164056
53032 164056 162173 159751 157586 156886 157887 159333 159701 158758 157527 156901 156705 156283 155604 155359 155974 156949 157381
53015 157381 156996 156401 156370 157055 157979 158670 159105 159492 159798 159730 159248 158772 158652 158674 158471 158183 158215 158387 158073 157317
52995 157317 157074 157922 159131 159568 159052 158174 157219 156092 155079 154835 155500 156501 157314 157797 157783 157142 156470 156878
52977 156878 158623 160501 161140 160464 159375 158461 157653 156950 156683 156985 157519 157964 158461 159408 160998 163074 165303
52960 165303 167355 169012 170232 171100 171664 171792 171225 169846 167958 166174 164932 164138 163402 162558 161738 161003
52944 161003 160171 159129 158070 157266 156662 155828 154309 152039 149502 147454 146349 146032 146032 146050 146016 145849 145483 145080
52926 145080 144900 144935 144981 145029 145238 145479 145328 144660 143908 143552 143629 143936 144357 144753 144840 144506 144038 143729 143511 143261
52906 143261 143288 144056 145512 147069 148241 149015 149534 149736 149466 148800 148123 147881 148224 148816 149077 148741 148113 147777
52888 147777 148115 149162 150701 152268 153254 153341 152834 152366 152258 152271 151956 151046 149579 147880 146449 145617 145272
52871 145272 145140 145370 146540 148823 151405 153075 153400 153031 152839 153068 153492 154095 155124 156537 157823 158610
52855 158610 159202 160277 162193 164727 167300 169221 169882 169134 167594 166368 166304 167452 169062 169934 169032 166208
52839 166208 162448 159112 156792 155045 153174 150983 148704 146580 144805 143660 143417 144094 145446 147169 149040
52824 149040 150906 152622 154055 155257 156585 158384 160369 161610 161477 160402 159292 158357 157092 155393 153977
52809 153977 153426 153391 153119 152389 151630 151459 152454 154965 158654 162423 165259 167100 168566 169952 170772 170209 167818
52792 167818 163941 159682 156254 154067 152506 150719 148456 145999 143720 142020 141290 141420 141583 141012 139871
52777 139871 138888 138329 137898 137504 137454 137802 138159 138387 138959 140260 141870 142884 142781 141790 140600 139949 140285 141477
52759 141477 142824 143494 143080 141853 140557 139917 140133 140825 141547 142271 143209 144249 144918 144944 144572 144132 143564 142582
52741 142582 141241 140118 139855 140640 142177 144115 146364 148929 151540 153708 155162 156045 156595 156875 157010 157424
52725 157424 158472 159949 161269 162157 162869 163675 164337 164258 163139 161456 160184 159891 160100 159762 158456 156772
52709 156772 155401 154249 152832 151157 149689 148595 147595 146565 145789 145497 145536 145611 145582 145452 145352 145535 146138
52692 146138 146908 147417 147500 147244 146708 146072 145875 146532 147577 148001 147466 146657 146250 146157 146083 146236 146907 147796 148330
52673 148330 148459 148626 149055 149546 149949 150389 150929 151333 151345 151028 150672 150418 150060 149302 148248 147567 147973 149529
52655 149529 151540 153134 153874 153943 154007 154825 156605 158763 160643 162492 165206 169015 172958 175914 177642 178468
52639 178468 178410 177210 174967 172124 168919 165297 161399 157746 154910 153263 152882 153394 154014 154175 154149 154684
52623 154684 156031 157654 158978 160057 161317 162899 164422 165282 165062 163780 161861 159875 158292 157409 157279
52608 157279 157580 157754 157508 157103 156909 156855 156579 156007 155386 154783 153997 153065 152453 152565 153305 154277 155169 155765 155916
52589 155916 155782 155942 156916 158603 160390 161784 162726 163320 163546 163423 163245 163392 163923 164572 165218 166119 167459
52572 167459 168843 169617 169678 169611 169913 170401 170605 170411 169965 169185 167835 166110 164745 164426 165230 166605 167679
52555 167679 167653 166335 164385 162906 162612 163434 164755 165809 165986 165168 163837 162570 161452 160324 159524 159805
52539 159805 161315 163157 164311 164623 164568 164383 163912 163067 161972 160672 159168 157776 157134 157703 159303 161159
52523 161159 162347 162488 162154 162412 163693 165330 166436 166937 167307 167617 167561 167376 167925 169612 171818 173839 175854
52506 175854 178450 181485 184064 185552 186182 186652 187464 188706 190081 190997 190875 189633 187801 186050 184604
52491 184604 183197 181569 179920 178748 178273 178184 178111 178162 178677 179530 180104 180132 180115 180607 181452 182154 182772 183873 185629
52472 185629 187481 188834 189691 190402 191135 191844 192529 193254 193971 194546 195029 195784 197288 199646 202323 204473 205700
52455 205700 206301 206608 206350 204986 202478 199294 195763 191962 188255 185290 183276 181761 180390 179364 178876
52440 178876 178576 178052 177370 176698 175756 174248 172594 171609 171524 171807 171922 171835 171838 172321 173622 175640 177583 178531
52422 178531 178318 177565 176935 176709 176899 177252 177224 176535 175711 175497 175777 175785 175485 175883 177644 180132 182330 184094
52404 184094 185888 187813 189657 191662 194537 198675 203810 209401 214929 219861 223684 226026 226596 225245
52390 225245 222303 218609 214863 211094 207145 203422 200664 199105 198316 197853 197614 197592 197707 197921 198237 198559
52374 198559 198887 199471 200396 201173 201310 201257 202131 204384 207320 210133 212768 215448 217904 219607 220392 220372 219493
52357 219493 217696 215375 213220 211667 210793 210578 210870 211232 211260 211025 210814 210531 209857 209025 208836 209625 210668
52340 210668 211020 210674 210528 211336 213085 215303 217609 219819 221832 223643 225430 227520 230232 233683 237699
52325 237699 241916 246148 250617 255732 261604 267878 274032 279728 284868 289523 293856 297980 301754 304870
52311 304870 307190 308846 309913 310234 309824 309234 309199 309974 311301 312921 314789 316876 319194 322036 325704 329871
52295 329871 333649 336529 338841 341051 343027 344407 345309 346114 346708 346466 344993 342554 339826 337540 336188
52280 336188 335706 335542 335457 336080 338112 341120 343838 345763 347656 350182 352853 354915 356684 359142 362492
52265 362492 365948 368982 371947 375232 378436 380942 382948 385367 388655 392237 395275 397671 399950 402292
52251 402292 404183 405288 406296 408430 412165 416814 421378 425412 428931 431936 434343 436183 437585 438674
52237 438674 439647 440763 442081 443469 445062 447403 450784 454704 458399 461761 465240 468946 472396 475274
52223 475274 477957 481074 484871 489212 493933 498956 504126 509138 513654 517548 521130 524991 529390 533858
52209 533858 537727 540987 544298 548144 552371 556616 560792 564974 569201 573649 578666 584374 590404 596134
52195 596134 600972 604421 606396 607679 609532 612375 615331 617521 619413 622165 625958 629786 632849 635339
52181 635339 637656 639551 640465 640293 639439 638355 637217 635824 633622 630094 625315 619950 614617 609517 604720
52166 604720 600409 596618 593101 589773 587075 585597 585469 586316 587667 589209 590870 592831 595377 598529 601958
52151 601958 605264 608091 609898 610085 608693 606665 605009 603888 602907 602091 602126 603686 606829 610955 615010
52136 615010 617850 618897 618484 617310 615590 613079 609853 606651 604317 603222 603271 604190 605734 607951 611411
52121 611411 616919 624888 635084 646962 659992 673698 687695 701804 715801 728983 740275 748945
52109 748945 755023 758922 760895 760968 759078 755125 749143 741622 733453 725319 717329 709425 701920 695449 690521
52094 690521 687398 686248 687083 689579 693182 697471 702289 707501 712752 717524 721326 723763 724447 722978 719243
52079 719243 713842 708022 702954 699057 696106 693880 692445 691863 691975 692532 693321 694102 694645 694914 695141 695668
52063 695668 696753 698379 700060 701081 701250 701160 701264 700880 698807 694867 690137 685543 681092 676754 673248
52048 673248 671193 670073 668803 667034 665174 663329 660974 657720 653848 649974 646554 643764 641480 639314
52034 639314 636899 634206 631509 629155 627463 626675 626809 627855 630224 634545 640643 647163 652771 657516 662474
52019 662474 668376 675180 682708 690863 699163 706829 713533 719595 725315 730641 735578 740352 745006 749246
52005 749246 752834 755641 757165 756446 752709 745794 735992 723968 710893 697898 684971 670874 654543
51992 654543 636207 616901 597398 578062 559333 541738 525560 510980 498403 488216 480259 473830
51980 473830 468204 462976 458042 453484 449398 445644 441832 437679 433171 428269 422736 416496 409917 403446
51966 403446 397129 390869 385062 380667 378614 379257 382292 387026 392896 399914 408492 418647 429541 440063
51952 440063 449689 458549 466755 473978 479611 483115 484266 483297 480788 477282 473187 469144 466179 465141
51938 465141 466202 469298 474803 483226 494313 507050 520663 535112 550395 565873 580561 593720
51926 593720 604737 612728 616763 616492 612230 604356 592864 577587 558765 537354 514831 492630 471614
51913 471614 452004 433794 417134 402242 389089 377436 367201 358601 351823 346689 342752 339649
51901 339649 337256 335611 334825 335047 336421 339140 343581 350129 358553 367629 375840 382545 388161 393033 396546
51886 396546 397609 395658 390777 383172 373288 362521 353092 346686 343308 341702 340784 340518 341579 344496
51872 344496 349191 355213 362230 370148 378756 387502 395807 403424 410319 416363 421460 425764 429271 431205
51858 431205 430328 426155 419597 412229 405169 398772 393116 388479 385470 384846 387126 392282 399909 409619 420962
51843 420962 432952 443994 452476 457317 458061 454866 448470 439730 428981 416222 401962 387421 373709
51830 373709 361355 350870 343017 337971 334805 332503 331157 331425 333118 335160 336820 338147 339138 339323
51816 339323 338426 336805 334906 332825 330768 329359 329035 329492 330263 331586 334167 338164 342949 347937 353190
51801 353190 358858 364327 368330 369996 369507 367609 364725 360805 355995 351022 346796 343779 341840 340484
51787 340484 339071 337045 334225 330829 327095 323047 318796 314919 312237 311205 311536 312324 312520 311677 310456
51772 310456 310121 311181 312732 313420 312865 311799 311107 311240 312402 314671 317869 321834 326887 333501 341381
51757 341381 349402 356806 364042 372000 380567 388285 393397 395071 393703 390243 385291 378820 370765 361720
51743 361720 352838 345053 338611 333321 328996 325660 323591 323171 324452 326936 330172 334627 341448 351192
51729 351192 363225 376646 391184 406576 421426 433524 441608 446446 450087 454326 459957 466912 474536
51716 474536 481703 487023 489187 487274 481005 471059 459205 447802 438787 432921 429745 427880 425352 420243
51702 420243 411854 401399 391155 382703 376199 371278 368012 366608 366609 366997 366977 366288 364914 363041 361300
51687 361300 360612 361605 364306 368234 372484 375821 377215 376471 374068 370390 365511 359766 354099 349523 346515
51672 346515 345144 345604 348334 353622 361204 370229 379691 389087 398788 409732 422752 438156 455662
51659 455662 474372 492898 509811 524011 534424 539504 537530 527669 510646 488550 464203 440498
51647 440498 419658 402732 389908 381257 376893 376424 378653 381919 384494 384828 382047 376430 369008 360501
51633 360501 351050 340969 331136 322290 314457 307426 301295 296095 291332 286511 281954 278518 276573 275655
51619 275655 275113 274672 274335 274063 273742 273353 273069 273129 273523 273894 273992 274164 275007 276441 277562 277646 276919 276054 275293
51600 275293 274436 273436 272535 271945 271743 272002 272772 274077 276110 279205 283427 288472 294257 301227 309664 318953
51584 318953 327986 336054 342875 348024 350955 351606 350481 348205 345487 343442 343295 345572 350016 356428 365133
51569 365133 376436 390075 405504 422393 440535 459552 479089 499281 520788 544233 569595
51558 569595 596080 622652 648909 675567 704118 736000 771985 811846 854158 896373 935515
51547 935515 968953 994536 1010313 1014688 1007039 987865 958319 919964 875108 826773 777719 729508
51535 729508 682759 638220 597149 560635 528947 501843 479285 461382 447591 436446 426501 417400
51523 417400 409635 403293 397536 391509 385312 379680 374984 370987 367419 364287 361496 358585 355104 351114
51509 351114 347098 343454 340236 337436 335320 334244 333994 333552 331820 328573 324448 320111 315824 311792 308338
51494 308338 305478 302775 299969 297401 295532 294386 293762 293580 293617 293413 292961 293085 294499 296857 299340 301768
51478 301768 304250 306025 305790 303305 299804 296630 294293 293015 293107 294221 295087 294806 293889 293334 293090 292211
51462 292211 290299 287999 285987 284108 281829 279207 277078 276297 276907 278116 279014 279192 278629 277379 275806
51447 275806 274931 275878 278790 282714 286697 290595 294680 299066 303950 310029 318186 328788 341494 355504
51433 355504 369808 383423 395635 405933 413808 419102 422567 425456 428174 429801 429182 425948 420062
51420 420062 411205 399463 386288 373851 363438 355031 348282 343121 339400 336721 334904 334158 334567 335849
51406 335849 337731 340142 342857 345380 347424 349213 351025 352668 353644 353729 353261 352971 353527 355064 357125 359242
51390 359242 361589 364862 369496 375206 381361 387570 393880 400677 408558 418177 430069 444650 462428
51377 462428 484144 510747 543158 581784 626049 674629 726419 781085 838280 896405 952455
51366 952455 1002904 1044332 1073613 1088552 1088859 1076025 1051883 1017602 974227 923634 868394 810955
51354 810955 753315 697243 644316 595677 551963 513392 479774 450715 426036 405776 389587
51343 389587 376464 365394 355942 347770 339960 331540 322579 314124 306989 301148 296299 292333 289001 285811
51329 285811 282695 280291 279098 278711 278399 278132 278431 279369 280287 280541 280011 278825 277098 275131 273483 272592
51313 272592 272593 273596 275697 278478 280858 281929 281748 281001 280082 278975 277906 277489 278038 279108 280013 280547 280965
51296 280965 281466 282019 282637 283462 284529 285591 286232 286095 284997 283043 280723 278748 277588 277091 276635 275664
51280 275664 274094 272243 270544 269353 268829 268803 268854 268763 268855 269678 271305 273234 275056 276877 278833 280530 281403
51263 281403 281529 281682 282537 284140 286237 288720 291576 294630 297646 300562 303450 306236 308569 309976 310167
51248 310167 309195 307268 304393 300391 295381 290044 285113 280742 276733 273198 270527 268697 267206 265785
51234 265785 264660 263886 263050 261925 260942 260544 260521 260467 260519 261059 261944 262693 263218 263776 264316 264586 264907 266143 268684
51215 268684 271953 275058 277475 278967 279515 279659 280388 282175 284386 286078 287132 288239 289901 291902 293740
51200 293740 295265 296818 298903 301781 305260 308905 312455 315965 319539 323069 326282 328871 330543 331135
51186 331135 330763 329740 328322 326746 325419 324667 324193 323258 321650 320074 319248 318949 318369 317176 315729 314401
51170 314401 313163 311817 310235 308303 305968 303333 300528 297577 294687 292488 291533 291676 292423 293812 296292
51155 296292 299640 302771 304963 306683 308617 310329 310621 309093 306679 304559 303006 301447 299275 296354
51141 296354 293003 289725 286962 284925 283593 282770 282091 281131 279722 278114 276677 275502 274538 274079 274734 276692
51125 276692 279289 281608 283440 285427 288183 291482 294454 296546 298141 300176 303198 306914 310595 313762
51111 313762 316440 318942 321540 324251 326807 328922 330714 332706 335276 338248 341253 344242 347267 349975
51097 349975 351878 353206 354882 357444 360419 363005 364859 365820 365323 362803 358575 353787 349412 345611 341980
51082 341980 338068 333668 329057 324995 322193 320713 320118 320123 320711 321694 322657 323502 324639 326463 328866 331366
51066 331366 333458 334854 335749 336930 339193 342556 346487 351014 356987 364933 374162 383501 392465 401181
51052 401181 409455 416536 421767 425053 426797 427746 428827 430748 433758 437913 443309 449759 456584 463172
51038 463172 469499 475698 481463 486532 491457 497106 503381 509198 513764 517096 519103 518909 515477 508443
51024 508443 498137 485369 471504 458063 445723 434102 422895 412772 404731 399051 395401 393539
51012 393539 393324 394397 396500 399794 404221 408753 412130 414334 416643 420055 424283 428496 432449 436536
50998 436536 441085 445915 450389 453706 455379 455615 455096 454303 453248 451865 450344 448987 448038 447785 448537 450357
50982 450357 453093 456870 462229 469554 478608 488938 500522 513634 528096 542927 556753 568367
50970 568367 576988 582291 584279 582986 578293 570172 559183 546565 533711 521533 510294 499864 490071
50957 490071 480950 472869 466434 462133 459952 459449 460288 462638 466875 473009 480661 489689 500501 513598
50943 513598 528991 546322 565400 586376 609625 635793 665778 700006 737471 775759 812151
50932 812151 844551 871469 891787 905083 912068 914349 913676 911314 907793 903036 896868 889442 880894
50919 880894 870606 857423 841013 822512 803314 783584 762706 740928 719663 700041 681955
50908 681955 664852 648813 634343 621553 610125 599842 590688 582518 575035 568012 561205 554114 546216
50895 546216 537514 528639 520427 513498 508112 504027 500538 496940 493077 489248 485633 482165 478985 476525
50881 476525 474859 473324 471219 468700 466591 465335 464593 463900 463261 462843 462447 461724 460767 460067 459909 460140 460636
50864 460636 461659 463529 466141 469026 471760 474207 476528 479177 482704 487296 492569 498012 503543 509323
50850 509323 515145 520500 525315 530210 535724 541600 547222 552622 558622 565894 574111 582278 589916 597831
50836 597831 607509 619653 633463 647620 661874 677273 694859 714618 735962 758752 783404 810328
50824 810328 839837 872421 908489 947790 989623 1033778 1080744 1130761 1183025 1236118 1288843
50813 1288843 1340226 1388937 1433249 1471631 1503092 1526822 1541815 1547165 1542778 1529678 1509457 1483446
50801 1483446 1452475 1417386 1379477 1340296 1301217 1263501 1228522 1197353 1170005 1145561 1123462
50790 1123462 1104415 1089744 1079997 1074540 1072415 1073182 1076843 1083300 1092096 1102616 1114301 1126586 1138688
50777 1138688 1149580 1158320 1164451 1168038 1169340 1168602 1166141 1162288 1157007 1149703 1139724 1127015 1111977
50764 1111977 1094635 1074313 1050391 1023238 994087 963978 933169 901693 870256 840204 812631
50753 812631 787766 765208 744398 724749 705768 687603 671292 657976 647755 639648 632767 627146
50741 627146 623247 621083 620240 620605 622597 626577 632256 638860 645899 653673 662968 674163 686723 699625
50727 699625 712178 724273 735975 747230 758007 768416 778589 788678 798984 809778 820905
50716 820905 831924 842767 853832 865159 875899 885054 892549 899234 906024 913467 922038 932380 945037
50703 945037 960076 977073 995634 1016076 1039532 1066899 1097574 1129646 1161524 1192793 1223216
50692 1223216 1251702 1277053 1299132 1318324 1334200 1345887 1353794 1359834 1365624 1371380 1376996 1383269
50680 1383269 1391232 1400798 1410845 1420422 1429341 1437737 1445685 1453370 1461421 1471018 1483671 1500649 1522498
50667 1522498 1549261 1581041 1617776 1658368 1700642 1742552 1783048 1821534 1857226 1889713 1919658
50656 1919658 1948165 1975696 2002241 2028219 2054253 2080106 2104687 2127306 2148207 2167661 2185421
50645 2185421 2201561 2217296 2234302 2253569 2275445 2300480 2329582 2363364 2401805 2444541 2490974
50634 2490974 2539970 2589899 2639163 2686407 2730042 2767988 2798384 2820563 2835107 2843049 2845315 2842755
50622 2842755 2836112 2825542 2810274 2788873 2759645 2720781 2670821 2610011 2541644 2471781 2407218
50611 2407218 2353333 2313152 2287495 2275380 2274399 2281193 2291967 2302956 2310856 2312978 2307035 2290986
50599 2290986 2263548 2224928 2176676 2120618 2058106 1990316 1918731 1844925 1770179 1695737 1623263
50588 1623263 1554586 1490903 1432423 1378723 1329353 1284279 1243994 1209103 1179622 1154888 1134369
50577 1134369 1118235 1106784 1099608 1095870 1095353 1098682 1106411 1118277 1133449 1151063 1170359 1190633
50565 1190633 1211270 1231625 1250748 1267474 1280955 1291006 1298037 1302945 1307070 1311839 1318175 1326527
50553 1326527 1337623 1352955 1374255 1402634 1438243 1480452 1528125 1580031 1635315 1693505 1753820
50542 1753820 1814711 1874401 1931879 1987265 2041429 2095633 2151406 2210342 2273798 2342891 2418616
50531 2418616 2501626 2591885 2688962 2792893 2904553 3024927 3154164 3291483 3435840 3586432
50521 3586432 3742603 3903489 4067707 4233083 4396552 4554460 4703072 4838666 4957145
50512 4957145 5053933 5124640 5166021 5176340 5155100 5102762 5020771 4911667 4779085 4627724 4463276
50501 4463276 4292120 4120904 3956270 3804564 3671260 3560403 3474679 3415782 3384221 3378590
50491 3378590 3395554 3430816 3479635 3535996 3591802 3637893 3666259 3671338 3649802 3600276 3523723
50480 3523723 3423551 3304749 3172697 3032500 2888609 2744405 2602211 2463915 2331394
50471 2331394 2206102 2088588 1978848 1877068 1783639 1698505 1620948 1550135 1485543 1426709
50461 1426709 1372872 1323184 1277197 1234939 1196484 1161639 1130084 1101670 1076421 1054224 1034703
50450 1034703 1017526 1002784 990812 981459 973676 966108 958206 950546 943969 938642 934234 930847 929318
50437 929318 930407 934011 939403 946028 953760 962635 972838 984962 999844 1017907 1038925 1062523 1088557
50424 1088557 1116824 1146797 1178030 1210607 1244877 1280975 1319007 1359586 1403718 1452084 1504768
50413 1504768 1561720 1623203 1689690 1761536 1838798 1921175 2008002 2098389 2191384 2285971 2381049
50402 2381049 2475546 2568377 2658159 2743239 2822260 2894352 2958263 3011487 3050805 3073652 3078530
50391 3078530 3064409 3030693 2978031 2908534 2824902 2729991 2627501 2522299 2419289 2322208 2233870
50380 2233870 2156933 2093624 2044871 2010370 1989430 1981192 1984063 1995480 2012320 2031171 2048261 2059765
50368 2059765 2062498 2054228 2033443 1999358 1952379 1894352 1828152 1756963 1683603 1610015 1537258 1466121
50356 1466121 1397657 1332834 1271884 1214493 1160701 1111124 1066225 1025791 989263 956128 925815
50345 925815 897717 871685 848141 827427 809344 793672 780692 770595 762561 755068 747257 739566
50333 739566 732895 727409 722280 716356 708997 700485 691806 683935 677190 671253 665705 660354 655140 650068
50319 650068 645398 641690 639383 638336 637894 637487 637250 638085 641028 646342 653266 660778 668584 677184 687056
50304 687056 698088 709803 721719 733330 744155 754165 763896 773692 783004 790903 797247 802925 808879
50291 808879 815254 821547 827218 831965 835812 839148 842474 845894 849091 852039 855559 861040 869930 883750
50277 883750 904203 932507 968271 1009037 1050803 1088816 1118133 1134275 1134350 1118259 1089248 1053097
50265 1053097 1015949 981895 952028 925520 901411 879427 859653 842033 826280 811998 798937
50254 798937 787345 777954 771308 767049 764126 761631 759261 757111 755325 753948 752803 751612 750521 750292
50240 750292 751573 754078 756967 759924 763253 766966 770500 773507 776233 778734 780384 780646 779937 779158 778610
50225 778610 777746 775777 772223 767190 761430 755841 750545 744714 737594 729374 720747 712105 703688 696122
50211 696122 690092 685589 682022 678982 676388 674148 672329 671566 672575 675164 678346 681587 685389 690514
50197 690514 697179 705289 714944 726394 739922 756172 776259 801110 830768 864597 902129 943487
50185 943487 988987 1038337 1090105 1141916 1191334 1236663 1276941 1311468 1339784 1362258 1380352
50174 1380352 1396094 1411266 1426874 1442839 1457904 1470021 1477025 1476976 1468024 1448558 1417898 1376818
50162 1376818 1327348 1272261 1214705 1157758 1103709 1053691 1008213 968014 934142 907172 886602
50151 886602 871267 860368 853867 851704 852743 854818 855841 854601 850470 842974 832127 818819 804241
50138 804241 789068 773646 758683 744947 732306 719951 707821 697116 689094 683984 681393 681076
50126 681076 682670 685157 687291 688494 688975 689229 689707 690591 691487 691703 691239 691043 691730 692526 692270 691144 690491
50109 690491 691094 692627 694874 698409 703543 709459 715094 720430 726285 733122 740634 748323 755918 763269
50095 763269 770288 777063 783742 790289 796623 802972 809765 817120 824723 832305 840013 848257 857512 868462
50081 868462 881969 898473 917541 938536 961870 989158 1021872 1060181 1103589 1152460 1208248
50070 1208248 1272115 1343851 1422347 1506523 1595194 1686354 1777131 1864470 1945581 2018114 2080886
50059 2080886 2134895 2183096 2228584 2272783 2315282 2354894 2390306 2419678 2440071 2447675 2438931 2411839
50047 2411839 2366660 2305580 2231677 2148009 2057385 1962572 1866310 1771018 1678563 1590353 1507591
50036 1507591 1431338 1362337 1300845 1246697 1199589 1159246 1125316 1097181 1074045 1055254 1040408
50025 1040408 1028977 1019810 1011314 1002333 992870 983741 975523 967976 960486 952683 944389 935292 925139
50012 925139 914311 903681 893719 883947 873412 861431 847778 832520 816015 798836 781374 763610
50000 763610 745576 727853 711303 696408 683279 672271 664100 659266 657706 659161 663491 670413 679166
49987 679166 688755 698385 707429 715193 721084 725089 727812 729871 731340 731842 731045 728902 725385 720244 713270
49972 713270 704819 695816 687103 678919 671193 664185 658526 654688 652774 652930 655578 660944 668489 677189
49958 677189 686450 696614 708582 723203 741166 763308 790656 823991 863474 908865 960051 1017101
49946 1017101 1079694 1146630 1215988 1285506 1352630 1414545 1468865 1514686 1552874 1585257 1613573
49935 1613573 1639004 1662103 1682677 1699700 1711492 1715856 1710000 1690815 1655926 1604806 1538837 1460516
49923 1460516 1373133 1281250 1190559 1106125 1030352 962954 902961 850383 805796 768981 738699
49912 738699 713689 693200 676422 662062 648991 637097 627091 619562 614452 611261 609349 608063
49900 608063 606969 606193 606416 608484 613010 620111 629300 639756 651011 663256 676656 690379 702743
49887 702743 712399 719041 722955 724372 723588 721261 718078 714136 708908 701773 692416 680809 667059 651327
49873 651327 633863 615205 596303 578248 561774 547164 534639 524390 516095 508864 502200 496726
49861 496726 493467 492446 492515 492573 492532 493049 494763 497973 502636 508390 514818 521902 530057 539576 550327 562186
49845 562186 575455 590445 606697 622921 637656 649883 659191 665820 670535 674030 676229 676407 674207
49832 674207 670240 665363 659554 651959 642114 630737 619063 607759 596861 586646 577931 571313 566471
49819 566471 562598 559425 557468 557250 558622 560949 563794 567290 572030 578731 587799 598929 611135 623368
49805 623368 635154 646488 657152 666397 673467 678260 681312 683243 684468 685314 686013 686384 685700 683109
49791 683109 678170 670916 661549 650248 637196 622645 607036 591192 576315 563464 552983 544577
49779 544577 537967 533203 530288 528747 527760 526573 524693 521926 518505 515102 512510 511279 511674 513812 517571
49764 517571 522534 528317 535001 543036 552612 563265 574144 584564 594304 603491 612235 620326 627317
49751 627317 632997 637694 641899 645529 647728 647396 643855 637111 627747 616714 605026 593421 582295
49738 582295 571954 562820 555367 549910 546462 544552 543236 541651 539864 538946 539871 542408 545415 548206
49724 548206 551191 555042 559572 563844 567205 569818 572267 575045 578601 583484 590134 598684 609208 621988
49710 621988 637148 654118 671741 688828 704142 715892 722045 721798 716573 709107 701566 694706 688504
49697 688504 682976 678267 674355 670919 667404 663177 657775 651017 642834 633192 622501 611878 602558 595013
49683 595013 588950 584128 580711 578836 578331 579038 581001 584221 588651 594590 602593 612764 624687 638275
49669 638275 654059 672054 690743 707763 721276 730281 734236 733392 729441 724947 721885 721078 722829
49656 722829 727218 733701 741174 748774 755993 761769 764082 760922 751392 735788 715273 691831 667904
49643 667904 645373 625076 607482 593253 582626 574733 568320 562986 559194 557255 556897 557636 558955
49630 558955 560134 560546 560181 559444 558449 557032 555353 553831 552401 550479 547823 544823 541731 538245 534176
49615 534176 529967 526083 522499 519276 517104 516573 517254 518237 519377 521199 523660 525846 527127 527915 528998
49600 528998 530759 533404 537373 542788 548725 553666 556794 558545 559935 561603 563472 564985 565530 564946 563752
49585 563752 562764 562374 562296 562084 561710 561511 561716 562286 563243 564890 567503 570864 574355 577628 581035 585241 590500
49568 590500 596543 603124 610382 618531 627465 636838 646360 655748 664569 672417 679218 685041 689635 692462
49554 692462 693226 692068 689149 684351 677640 669561 661201 653766 648214 644963 643677 643521 643877 644714 646133
49539 646133 647811 649206 650116 650619 650616 649889 648642 647528 647032 647204 648136 650281 654032 659342 666039 674324
49523 674324 684624 697003 710937 725544 739892 753291 765483 776472 785974 793359 798446 802194
49511 802194 806124 811029 816563 822129 827763 834064 841572 850454 860538 871321 881912 891057 897280
49498 897280 899106 895484 886245 872171 854570 834902 814761 795824 779331 765479 753542 742748
49486 742748 733093 725238 719663 715976 713159 710484 708074 706443 705639 705105 704422 703825 703725 703890 703469 701898
49470 701898 699495 697047 694996 693200 691326 689301 687418 686250 686435 688251 691222 694313 696726 698478
49456 698478 700166 702258 704817 707726 710834 713766 715891 716701 716131 714362 711436 707267 701993 696093 690099
49441 690099 684330 678935 674037 669660 665595 661541 657533 654059 651581 649952 648597 647351 646832 647833
49427 647833 650572 654884 660852 668772 678604 690105 703639 720349 741457 768041 801681 844348
49415 844348 896585 955892 1017321 1075141 1123159 1154266 1161943 1143939 1104615 1053295 1000117 952722
49403 952722 915157 888276 870902 861297 858053 859837 864820 871005 877266 883729 890978 899049 907262
49390 907262 914790 921144 926200 929975 932453 933489 932738 929751 924365 917033 908573 899526 889999 880265
49376 880265 871138 863386 857007 851565 847178 844607 844337 846104 849478 854447 861079 868927 877101 884742
49362 884742 891248 896285 899809 901924 902600 901846 900238 898825 898149 897709 896826 895709 895104 895044 894562 892743
49346 892743 889643 886008 882466 879201 876250 873896 872718 873176 875108 877742 880366 882813 885131 887009
49332 887009 887974 888055 887770 887342 886285 883986 880447 876181 871538 866484 861089 855976 852031 849609 848189
49317 848189 846955 845677 844798 844693 845127 845603 846039 846815 848196 849915 851379 852221 852661 853293 854469 855966
49301 855966 857396 858790 860426 862145 863348 863884 864452 865866 868280 871496 875519 880292 885215 889642 893719
49286 893719 898155 903171 908182 912524 916055 919065 922062 925588 929739 933813 936958 939212 941404 943949
49272 943949 946338 947986 949055 950060 951115 951918 952250 952235 952307 953066 954873 957461 960258 963169 966624 970761
49256 970761 975107 979355 983916 989311 995648 1003255 1013360 1027252 1044898 1065094 1086977 1110619 1135842
49243 1135842 1161037 1183556 1201019 1211996 1215804 1212151 1201097 1183240 1159987 1133730 1107491 1083905
49231 1083905 1064240 1048373 1035719 1026091 1019626 1016019 1014093 1012121 1008460 1001990 992358 980102 966370
49218 966370 952316 938719 926181 915244 906032 898100 891132 885564 882025 880370 879960 880838 883779 888857
49204 888857 894749 899986 904379 908657 913113 917290 920756 923600 926212 929034 932426 936272 939779 942170
49190 942170 943582 944893 946648 948568 950152 951295 952173 952956 953866 955225 957151 959376 961573 963713 965940
49175 965940 968324 971019 974609 979964 987644 997625 1009837 1024963 1044514 1069914 1101423 1137840 1176936
49162 1176936 1215764 1250607 1277365 1292831 1296080 1288681 1273653 1254199 1233101 1212684 1194833 1180776
49150 1180776 1170773 1164062 1159222 1154686 1149059 1141314 1131153 1119326 1107262 1096040 1085735 1075850
49138 1075850 1066209 1057230 1049471 1043183 1038288 1034576 1031875 1030160 1029561 1030208 1032086 1035052 1038984 1043912
49124 1043912 1050016 1057407 1065785 1074485 1083137 1092204 1102468 1113999 1126123 1138527 1151815 1166665
49112 1166665 1182947 1200223 1218763 1239459 1262877 1289131 1318878 1354068 1397411 1451078 1515667
49101 1515667 1589988 1671711 1758349 1847631 1937091 2023874 2105516 2180579 2247745 2303908 2343507
49090 2343507 2360165 2349617 2312089 2252814 2180017 2101136 2019773 1935865 1848639 1759415 1672001
49079 1672001 1591079 1520322 1461366 1413881 1376436 1347435 1325475 1309218 1297288 1288300 1280935 1274243
49067 1274243 1268115 1263119 1259463 1256362 1252927 1249362 1246603 1244985 1244113 1244040 1245606 1249272 1254420 1260303 1266993
49052 1266993 1274874 1283820 1293567 1304456 1317056 1331227 1346136 1361120 1375974 1390501 1404332 1417276
49040 1417276 1429552 1441594 1453812 1466406 1479213 1491908 1504641 1518258 1533548 1550469 1568486
49029 1568486 1587485 1607823 1629554 1652142 1675008 1697803 1719931 1740237 1757520 1771214 1781488
49018 1781488 1788917 1794284 1798478 1802328 1806492 1811546 1818027 1826294 1836400 1848195 1861454 1875863 1891031
49005 1891031 1906684 1922847 1939702 1957182 1974683 1991239 2006034 2018753 2029455 2038199 2044984 2049958
48993 2049958 2053426 2055579 2056507 2056601 2056650 2057256 2058282 2059122 2059335 2058757 2057230 2054685 2051468 2048222 2045431 2043421
48977 2043421 2042716 2043832 2046577 2050021 2053547 2057574 2062859 2069290 2075743 2081039 2084731 2087061 2088532 2089573
48963 2089573 2090323 2090669 2090621 2090544 2090770 2091027 2090725 2089959 2089879 2091847 2096423 2103360 2112233 2122759 2134734 2148120
48947 2148120 2163205 2180315 2199402 2220253 2243135 2268802 2297616 2328924 2361611 2395081 2429473
48936 2429473 2465026 2501562 2538684 2576291 2614692 2654135 2694348 2734770 2775358 2816881 2860061
48925 2860061 2904522 2949085 2993166 3037460 3083052 3130313 3178956 3228740 3279654 3331648 3384548
48914 3384548 3438093 3491683 3544297 3595072 3643764 3690287 3734087 3774506 3811599 3846039 3878304
48903 3878304 3908577 3937303 3965046 3991561 4015703 4036678 4054918 4071420 4086615 4100231 4111806
48892 4111806 4120854 4126769 4129006 4127396 4122118 4113522 4102046 4088069 4071617 4052378 4030081 4004696
48880 4004696 3976226 3944717 3910612 3874777 3837866 3799849 3760248 3718593 3674573 3628128 3579601
48869 3579601 3529544 3478285 3425943 3372877 3319554 3265964 3211830 3157624 3104685 3053888 3004908
48858 3004908 2957287 2911607 2868877 2829357 2792744 2759142 2729029 2702536 2679507 2660018 2644034
48847 2644034 2630781 2619285 2609399 2601587 2595865 2591886 2589955 2590883 2594802 2601116 2609794 2621647 2636899
48834 2636899 2654493 2673390 2693730 2716041 2740036 2764896 2790238 2816004 2841886 2867627 2893631
48823 2893631 2920540 2948265 2976125 3003875 3032026 3061093 3090972 3121134 3151053 3180423 3209275
48812 3209275 3238019 3267230 3297348 3328537 3360610 3392929 3424764 3456036 3487439 3519484 3551701
48801 3551701 3583204 3613822 3644140 3674472 3704360 3733234 3761224 3789251 3818546 3850064 3883942
48790 3883942 3919285 3954648 3988841 4021256 4051577 4079428 4104221 4125075 4140859 4150654 4154254 4152020
48778 4152020 4144211 4130697 4111341 4086354 4056176 4021185 3981664 3937923 3890374 3839580 3786170
48767 3786170 3730574 3672917 3613355 3552402 3490645 3428252 3365124 3301494 3237928 3174744 3111959
48756 3111959 3050020 2990008 2932682 2877685 2824245 2772496 2723624 2678734 2638007 2601022 2567488
48745 2567488 2537449 2510939 2487616 2466717 2447455 2429620 2413745 2400488 2389821 2381021 2373390 2366807
48733 2366807 2361586 2358069 2356399 2356452 2357896 2360532 2364583 2370271 2376912 2382805 2386484 2387985 2388586 2389392 2390578
48718 2390578 2392014 2394115 2397698 2403072 2409608 2416332 2422954 2430246 2439293 2450302 2462258 2473906 2484996
48705 2484996 2496364 2508843 2522429 2536608 2551210 2566700 2583747 2602653 2623115 2644420 2666026
48694 2666026 2688065 2711166 2735644 2761033 2786607 2812152 2837947 2864135 2890488 2916742 2942726
48683 2942726 2968019 2991762 3013010 3031156 3045931 3057254 3065262 3070286 3072607 3072358 3069820 3065553 3059924
48670 3059924 3052554 3042505 3029001 3011821 2991093 2967061 2940119 2910746 2879296 2846013 2811435
48659 2811435 2776527 2742134 2708328 2674508 2640134 2605157 2569706 2533628 2496526 2458216 2418989
48648 2418989 2379504 2340516 2302701 2266576 2232495 2200733 2171564 2145129 2121216 2099319 2079023
48637 2079023 2060174 2042528 2025394 2007947 1989904 1971579 1953166 1934381 1915077 1895952 1878120
48626 1878120 1862030 1847227 1833216 1820062 1807936 1796505 1785169 1773544 1761272 1747688 1732442
48615 1732442 1716489 1701835 1689929 1680703 1673372 1667679 1663943 1662244 1662267 1663949 1667780 1674293 1683454 1694620
48601 1694620 1706799 1718921 1730103 1739796 1747635 1753255 1756540 1758084 1759117 1760814 1763791 1768147 1773620
48588 1773620 1779489 1784627 1788010 1789141 1787890 1784092 1777544 1768374 1757156 1744639 1731419 1717891 1704398
48575 1704398 1691366 1679283 1668539 1659281 1651456 1644921 1639547 1635366 1632740 1632194 1633841 1637048 1641009
48562 1641009 1645599 1651320 1658327 1665923 1673143 1679475 1684679 1688188 1689156 1687083 1682085 1674478 1664295 1651340
48548 1651340 1635739 1618457 1601194 1585562 1572266 1561079 1551461 1542847 1534342 1524655 1512772 1498564
48536 1498564 1482547 1465184 1446625 1426966 1406484 1385715 1365503 1346877 1330680 1317305 1306815
48525 1306815 1299104 1293888 1290846 1290063 1292142 1297559 1305952 1316070 1326180 1334374 1338884 1338624 1333538 1324390
48511 1324390 1312471 1299625 1287973 1279009 1272981 1269424 1268105 1269207 1273035 1280070 1291093 1306631 1326379
48498 1326379 1349563 1375669 1404179 1433736 1462216 1487679 1508634 1523505 1530758 1529975 1522346 1509980
48486 1509980 1495246 1480795 1469150 1461452 1456855 1453614 1450552 1447200 1443031 1437224 1429166 1418805 1406662
48473 1406662 1393708 1381036 1369256 1358227 1347547 1337145 1327269 1318125 1309808 1302311 1295358 1288454
48461 1288454 1281479 1275071 1270110 1266944 1265437 1265529 1267326 1270758 1275616 1281955 1289914 1298975 1307795 1315085
48447 1315085 1320412 1323825 1324960 1323012 1317769 1310321 1302372 1294962 1288076 1281500 1275597 1271006 1267826 1265495
48433 1265495 1263352 1260917 1257654 1252904 1246267 1237820 1227885 1216920 1205774 1195584 1187026 1179785 1173092
48420 1173092 1166671 1160842 1155740 1150893 1145720 1140171 1134681 1129630 1125052 1120798 1116756 1112873 1109143 1105683
48406 1105683 1102705 1100271 1098261 1096717 1096064 1096598 1097844 1098835 1099136 1099208 1099570 1099971 1099668 1098138 1095143 1090434
48390 1090434 1083859 1075651 1066219 1055750 1044346 1032411 1020548 1009124 998226 987862 977883 967906
48378 967906 957742 947750 938511 930379 923646 918597 914857 911154 906572 901738 897928 895281 892930 890691
48364 890691 889403 889450 890143 890922 892066 893713 895262 896428 897979 900596 903720 906345 908379 910396 912483
48349 912483 914163 915149 915475 915067 913857 912141 910332 908512 906695 905235 904479 904201 903809 902911 901354 899057
48333 899057 896278 893711 891839 890449 889194 888229 887784 887493 886728 885393 883812 882058 879943 877498 874895
48318 874895 872039 868739 865231 862046 859413 857080 854615 851638 847981 843878 839725 835432 830382 824258
48304 824258 817432 810249 802609 794779 787905 782868 779063 775139 770668 766322 762686 759763 757450 755658
48290 755658 753913 751582 748661 745818 743588 741841 739961 737224 733250 728508 724112 720763 718151 715803
48276 715803 714023 713396 713855 714913 716464 718746 721896 726294 732925 742521 754531 767636 780907 793706
48262 793706 804825 812721 816727 817472 816319 814925 814908 817154 821568 827909 836297 846388 856923 867079
48248 867079 877630 889865 904007 919803 937861 959159 983780 1011334 1042061 1076392 1114214
48237 1114214 1155960 1203720 1260025 1326492 1405215 1500430 1617112 1759174 1931080 2139932
48227 2139932 2393855 2700378 3070144 3521790 4081588 4782010 5664569 6775710 8140475
48218 8140475 9725185 11421068 13060053 14441720 15358219 15634645 15193802 14106663 12576541
48209 12576541 10858315 9170707 7652676 6365573 5314940 4474592 3807678 3279766
48201 3279766 2861639 2528004 2258482 2038861 1858825 1709014 1581602 1472048 1377920 1296329
48191 1296329 1223949 1158846 1100687 1049321 1004169 964585 929846 898923 870886 845259 821692
48180 821692 799814 779678 761627 745391 730121 715655 702844 692141 682762 673793 665302 657868
48168 657868 651803 647430 645293 645448 647186 649898 653489 657414 660181 660441 657886 652541 644097 632739
48154 632739 619958 607637 596718 587268 579285 572724 567221 562438 558457 555411 553183 551754 551291 551542
48140 551542 551791 551815 552091 552664 552739 552063 551739 552721 554228 554745 554103 553502 553824 554887 556185 557377 558174 558486
48122 558486 558694 559138 559531 559501 559468 560145 561311 561870 561258 560128 559539 559944 561055 562267 563156 563840 564851 566419
48104 566419 568029 568966 569140 569060 569264 570011 571262 572583 573411 573813 574610 576356 578542 580287 581385 582089 582319
48087 582319 581882 581176 580881 581040 581232 581481 582203 583266 583939 583922 583745 583919 584339 584792 585480 586731 588525 590570
48069 590570 592640 594754 597275 600811 605608 611079 616334 621218 626414 632574 639793 647918 656709 665494
48055 665494 673255 679365 683854 686754 687704 686610 684278 681776 679343 676385 672470 667813 662702 656908
48041 656908 650033 642366 634973 628874 624248 620546 617108 613371 608746 602846 596002 589123 582811 576986
48027 576986 571581 567126 564145 562297 560657 558747 556818 555150 553563 551675 549304 546535 543576 540547
48013 540547 537263 533398 529085 525068 521907 519245 516319 512976 509699 506823 504336 502372 501203 500673
47999 500673 500265 499867 499852 500247 500469 500198 499921 500148 500555 500449 499777 499221 499480 500825 503177 506148 509080 511442
47981 511442 513258 514925 516647 518277 519628 520718 521717 522855 524367 526292 528247 529617 530100 530029 530099 530736
47965 530736 531707 532310 532003 530878 529551 528575 527980 527336 526164 524278 521822 519080 516281 513519 510790 508076
47949 508076 505446 503086 501116 499252 496797 493262 488936 484506 480119 475328 470093 465213 461348 458106
47935 458106 454690 451133 448137 445864 443641 440941 437948 434988 432062 429217 426837 425163 423960 422988
47921 422988 422396 422325 422454 422283 421549 420009 417240 413203 408816 405339 403173 401683 400210 398816 397913 397539
47905 397539 397293 396873 396443 396440 397009 397658 397573 396397 394666 393382 393235 394290 396279 398886 401705 404111 405477
47888 405477 405627 405075 404665 404861 405411 405809 405989 406324 407013 407805 408409 408837 409145 409170 408794 408215 407646 406973 406163
47869 406163 405788 406573 408345 410036 410945 411528 412567 413982 415040 415507 415965 416866 417865 418431 418766 419726 421902
47852 421902 425072 428486 431455 433770 435813 438197 440986 443347 444353 444218 444276 445602 448049 450886 453908
47837 453908 457350 460993 464063 466139 467689 469424 471425 473122 473989 474013 473527 472787 471810 470611 469386 468299
47821 468299 467157 465638 463948 462821 462658 462991 463197 463433 464370 466235 468765 472004 476503 482651 490437
47806 490437 500044 512091 526957 544330 563725 584980 607880 631734 655778 679717 703465 726539
47794 726539 748141 767569 784158 796989 805124 808098 805950 798912 787391 772081 753741 733025
47782 733025 710890 688855 668190 648831 629676 610200 591336 574636 560982 550396 542636 537459
47770 537459 534413 532833 532256 532705 534416 537305 540741 543929 546525 548743 550884 553017 555352 558620 563595
47755 563595 570155 577186 583589 589068 593824 597832 600811 602736 603949 604625 604385 602599 599074 594392 589475
47740 589475 584818 580169 575086 569710 564756 560610 556685 551974 546185 540079 534636 530116 526083 522143
47726 522143 518316 514684 510951 506575 501291 495326 489093 482811 476436 469824 462811 455250 447125 438731
47712 438731 430725 423929 418890 415458 412772 409907 406673 403634 401271 399355 397447 395761 395021 395412 396156
47697 396156 396417 396273 396361 396786 396924 396341 395408 394761 394516 394366 394221 394316 394657 394776 394215 393074 391855 390925 390314
47678 390314 389959 389897 390155 390586 390969 391234 391520 391975 392629 393525 394953 397241 400195 402865 404213 404026 403015
47661 403015 402008 401335 401023 401170 401799 402601 403213 403683 404409 405637 407298 409235 411280 413091 414279 414790
47645 414790 414947 415103 415498 416461 418373 421223 424532 427970 431856 436798 442938 449822 456951 464209 471699
47630 471699 479431 487335 495590 504811 515829 529269 545356 564111 585587 609884 637103 667420
47618 667420 701017 737657 776397 815972 855497 894606 932985 969915 1004207 1034317 1058662
47607 1058662 1076223 1086833 1090659 1087488 1076871 1058874 1034168 1003464 967478 927468 885094 841469
47595 841469 797038 752692 710277 671302 635702 602531 571542 543396 518609 497065 478449
47584 478449 462429 448353 435449 423492 412866 403884 396382 390000 384437 379438 374970 371409 369090
47571 369090 367613 366046 363955 361798 360215 359303 358840 358765 359202 360218 361743 363602 365531 367330 369009
47556 369009 370570 371765 372431 372995 374178 376138 378309 380212 381963 383860 385934 388178 390810 394008 397575
47541 397575 401086 404144 406440 407839 408486 408539 407889 406607 405626 406169 408170 410001 410279 409356 408416 407717 406569
47524 406569 404767 403026 401955 401381 400889 400472 400323 400409 400533 400564 400459 400226 400005 400008 400265 400542 400517 399982 398975
47505 398975 397818 396876 396034 394630 392188 389029 385830 382685 379072 374689 369873 365159 360867 357191 354254
47490 354254 351853 349489 346887 344286 342106 340529 339537 339014 338719 338408 338211 338664 340133 342353 344609 346271
47474 346271 347096 347362 347838 349296 351766 354481 356761 358722 360873 363357 365944 368537 371144 373414 374756
47459 374756 375087 375084 375485 376331 377077 377232 376745 375922 375142 374583 374117 373525 372874 372593 373123 374621 377087 380588
47441 380588 385186 390787 397235 404506 412632 421473 430867 441040 452721 466651 483048 501490 521205
47428 521205 541468 561952 582754 603953 624983 644616 661717 675877 687157 695402 700110 700966
47416 700966 698187 692313 683954 673768 662398 650212 637255 623548 609257 594567 579766 565611
47404 565611 553245 543287 535220 528032 521305 515182 509428 503286 496516 490000 484804 480951 477596 474198
47390 474198 470970 468180 465627 462996 460317 457691 454905 451774 448677 446283 444668 443144 441145 438914
47376 438914 437035 435642 434494 433660 433605 434525 435956 437191 437864 438012 437768 437132 435933 433969 431346 428598
47360 428598 426150 423630 420112 415203 409542 404023 398940 394189 389897 386226 382805 378942 374486 370029
47346 370029 366177 363028 360367 357972 355589 352980 350226 347692 345493 343233 340494 337417 334647 332802
47332 332802 332064 332070 332125 331748 331185 331167 331957 332781 332451 330541 327847 325728 325088 325889 327437 328978 330032 330324
47314 330324 329707 328329 326663 325120 323748 322519 321684 321419 321254 320410 318757 316888 315111 312980 310153
47299 310153 307180 304946 303638 302714 301703 300548 299353 298238 297415 297035 296953 296870 296589 295941 294725 293081
47283 293081 291687 291153 291304 291500 291501 291533 291598 291359 290768 290268 290166 290326 290649 291398 292694 294055 294834 294915 294708
47264 294708 294618 294829 295462 296686 298633 301304 304432 307423 309676 311104 312127 313045 313709 314017 314368 315173
47248 315173 316078 316194 315149 313529 312163 311339 310952 311127 312286 314527 317286 319815 321898 323865 325949
47233 325949 327968 329839 332111 335491 339865 344241 347855 350990 354408 358269 362083 365653 369569 374530
47219 374530 380420 386286 391223 395167 398796 402737 406914 410665 413527 415790 418249 421440 425135 428543
47205 428543 430868 431691 430996 429007 426073 422622 419097 415817 412945 410563 408773 407696 407497 408474 411004
47190 411004 415249 420961 427756 435499 444149 453149 461240 467035 469697 469052 465382 459421 452420 445801
47176 445801 440508 436719 434192 432781 432546 433428 435035 436900 438869 441084 443557 446049 448496 451264 454621
47161 454621 458082 460702 462026 462365 462106 461219 459644 457705 455753 453624 450875 447409 443575 439686 435712
47146 435712 431465 426893 422180 417670 413663 410215 407233 404776 403033 401931 401047 400112 399292 398750 398298
47131 398298 397824 397719 398378 399469 400244 400493 400614 400768 400543 399625 398268 396835 395275 393356 391149 389007
47115 389007 387214 385838 384742 383598 382067 380091 377947 375987 374481 373576 373104 372412 370905 368827 367101
47100 367101 366183 365506 364333 362713 361210 360003 358741 357144 355316 353492 351783 350155 348433 346465 344447
47085 344447 342878 341942 341169 340026 338594 337325 336347 335472 334611 333625 331913 328921 325141 321921 319967 318565
47069 318565 316597 313840 310941 308554 306953 306112 305647 304803 303021 300461 297688 295064 292764 291125 290434
47054 290434 290400 290390 290217 290249 290672 291174 291561 292179 293378 294858 295918 296187 295872 295481 295569 296506 298159 299895
47036 299895 301213 302252 303433 304785 306006 307118 308472 310012 310999 310794 309631 308370 307632 307426 307437 307400
47020 307400 307264 307263 307797 309015 310497 311509 311659 311214 310754 310634 310830 311173 311682 312638 314362 316873 319699
47003 319699 322050 323282 323303 322590 321750 321016 320227 319288 318464 318028 317816 317453 316966 316831 317328 318219 319193 320249
46985 320249 321368 322124 322051 321306 320640 320749 321848 323768 326144 328555 330783 332968 335308 337655 339730 341746
46969 341746 344425 348129 352151 355235 356804 357542 358566 360144 361420 361480 360436 359192 358387 358038 358124 358771
46953 358771 359542 359243 357102 353781 350611 348086 345787 343609 342179 341902 342382 343086 344016 345322 346683 347513
46937 347513 347580 347171 346813 346980 347787 348814 349492 349792 350205 350887 351284 350863 349885 349120 349040 349592 350473 351256 351408
46918 351408 350606 349034 347209 345562 344294 343415 342748 342089 341538 341485 342088 343015 343870 344655 345571 346654 347890
46901 347890 349449 351517 354024 356764 359604 362402 365029 367711 371046 375325 380057 384483 388280 391488
46887 391488 394105 396229 398327 400795 403407 405672 407583 409478 411317 412707 413611 414421 415229 415615 415405
46872 415405 415125 415375 416004 416235 415483 413921 412347 411566 411826 412877 414564 417151 420780 424862 428370 430692
46856 430692 431893 432311 432323 432417 432976 433895 434757 435442 436232 437339 438694 440239 442030 443985 445867 447591 449279
46839 449279 451030 452930 455164 457703 459955 461184 461315 460849 460143 459337 458921 459508 460858 461916 462229 462649
46823 462649 464136 466467 468680 470301 471488 472325 472770 473197 474351 476647 479884 483668 487744 491844 495585
46808 495585 498735 501518 504552 508431 513239 518450 523389 527768 531640 534975 537604 539611 541449 543577
46794 543577 546252 549597 553422 557000 559606 561455 563543 566351 569261 571566 573386 575161 576840 578231
46780 578231 579624 581337 582974 583953 584655 586291 589570 594062 598882 603508 607857 612082 616455 621156 626074
46765 626074 631042 636217 641903 648060 654361 660705 667303 674214 681158 687863 694352 700906 707988 716111
46751 716111 725433 735374 744900 753262 760390 766712 772827 779204 785835 792139 797406 801314 803962 805662
46737 805662 806922 808260 809668 810471 810108 808860 807392 805900 804265 802784 801973 801687 801185 800228 799493 799671
46721 799671 800703 802079 803451 804667 805690 806770 808370 810576 812745 813922 813519 811673 809136 806708
46707 806708 804400 801256 796405 790095 783187 775831 767490 758248 749031 740161 730676 719787 708307 697794
46693 697794 688720 680283 671725 662995 654164 645039 635627 626503 618358 611365 605128 599124 593139 587392
46679 587392 582305 578170 574981 572390 569616 565635 559950 553202 546600 540652 534948 529214 523798 518866
46665 518866 513848 508276 502557 497273 492244 487065 482125 478179 475081 471844 467939 463684 459307 454555
46651 454555 449512 444957 441426 438468 435318 431901 428738 426213 424373 423262 422990 423505 424487 425457 425906
46636 425906 425543 424602 423771 423664 424471 426107 428409 431080 433832 436801 440530 445172 449998 454094 457445
46621 457445 460927 465176 469848 474134 477701 480894 484091 487092 489216 489972 489603 489023 489244 490818 493591
46606 493591 496808 499507 501098 501761 502278 503390 505278 507617 509980 512191 514393 516836 519544 522270 524863
46591 524863 527558 530656 533987 537008 539497 541761 544010 545920 547159 548094 549500 551605 553800 555294
46577 555294 555750 555253 554065 552629 551515 551049 551069 551218 551399 551736 552211 552575 552688 552674 552642 552433 551879 551281 551384
46558 551384 552752 555220 558017 560388 562073 563318 564618 566406 568738 571154 573006 574043 574607 575233 576188
46543 576188 577567 579591 582472 585999 589673 593350 597408 602059 606833 611190 615473 620775 627779 636130
46529 636130 645111 654509 664492 674917 685292 695430 705768 716903 729049 742083 755832 770104
46517 770104 784549 798848 813053 827516 842368 857121 870905 883011 893177 901457 907967 912778
46505 912778 915913 917336 917027 915190 912418 909528 907125 905290 903648 901760 899465 896912 894235 891217
46491 891217 887442 882944 878489 874881 871946 868585 864060 858887 854150 850215 846390 841672 835384 827254
46477 827254 817498 806965 796733 787218 777932 768273 758246 748230 738452 729062 720465 713060 706655
46464 706655 700552 694319 688324 683445 680415 679414 680143 682294 685960 691431 698438 705847 712456 718026
46450 718026 723247 728788 734777 741185 748124 755473 762571 768668 773526 777291 779946 781301 781496 781099 780472
46435 780472 779259 776745 772651 767366 761406 754905 747787 740235 732576 724669 715828 705687 694926 684701
46421 684701 675423 666516 657416 648308 639627 631297 622933 614693 607445 602012 598491 596283 594576 592754
46407 592754 590643 588539 586939 586192 586423 587628 589604 591910 594251 596930 600590 605418 610981 617025 623970
46392 623970 632181 641076 649550 657205 664579 672049 679133 685210 690461 695494 700207 703593 704802 704008
46378 704008 702094 699765 697153 694060 690317 685995 681529 677644 674968 673675 673461 673836 674336 674641 674816
46363 674816 675525 677672 681625 686880 692700 698985 706270 714978 724986 736017 748084 761330 775640
46350 775640 790724 806482 822990 840154 857606 874947 891845 907953 923053 937398 951486
46339 951486 965215 977526 987232 994124 998901 1002004 1002920 1000780 995404 987481 977851 966940 954978
46326 954978 942430 929908 917693 905659 893836 882800 873201 865014 857627 850719 844752 840393 837711
46313 837711 836170 835293 835101 835953 838124 841516 845698 850290 855351 861276 868222 875811 883566 891491 900055
46298 900055 909698 920485 932141 944233 956450 968788 981356 993912 1005876 1016951 1027371 1037287
46286 1037287 1046324 1054183 1061249 1067888 1073318 1076050 1075585 1072984 1069539 1065427 1059925 1052367 1042513 1030539
46272 1030539 1017170 1003521 990340 977578 964981 952794 941535 931385 922238 914155 907304 901588
46260 901588 896816 893150 890939 890072 889932 890086 890767 892531 895628 899798 904489 909164 913513 917456 921010
46245 921010 924251 927358 930526 933691 936557 939069 941699 945023 949069 953252 956922 959891 962519 965444
46231 965444 969058 973190 977416 981718 986530 991961 997320 1001793 1005427 1009057 1013303 1017883 1021855 1024349
46217 1024349 1025196 1025134 1025345 1026634 1029057 1032322 1036143 1040031 1043212 1045334 1046995 1049105 1051851 1054801 1057832
46202 1057832 1061295 1065259 1069204 1072637 1075519 1077961 1080016 1081991 1084466 1087580 1090624 1092729 1093854 1094851
46188 1094851 1096637 1099449 1102790 1105987 1108858 1111862 1115502 1119662 1123790 1127686 1131749 1136359 1141331 1146156
46174 1146156 1150520 1154451 1158172 1162033 1166490 1171895 1178309 1185503 1193067 1200520 1207517 1214033 1220286 1226555
$$ [...]
##END NTUPLES=NMR SPECTRUM
##END=
