
##TITLE=AC1164_Rove100-18_6524191_ucSu4Vestq
##JCAMPDX= 6.0         $$ Bruker NMR JCAMP-DX V2.0
##DATA TYPE= NMR SPECTRUM
##DATA CLASS= NTUPLES
##ORIGIN= BRUKER
##OWNER= Administrator
$$ 1.72 TOPSPIN		Version 2.1
$$ 2012-07-14 19:24:22.187 -0500  Administrator@TOPSPIN
$$ Compression mode = diff/dup
##.OBSERVE FREQUENCY= 400.02188249412
##.OBSERVE NUCLEUS= ^1H
##.ACQUISITION MODE= SIMULTANEOUS (DQD)
##.ACQUISITION SCHEME= undefined
##.AVERAGES= 64
##.DIGITISER RES= 22
##SPECTROMETER/DATA SYSTEM= spect
##.PULSE SEQUENCE= noesygpps1d.comp
##.SOLVENT NAME= COFFEE_meoh
##.SHIFT REFERENCE= INTERNAL, COFFEE_meoh, 1, 14.96066
##AUDIT TRAIL= $$ (NUMBER, WHEN, WHO, WHERE, PROCESS, VERSION, WHAT)
$$ ##TITLE= Audit trail, TOPSPIN		Version 2.1
$$ ##JCAMPDX= 5.01
$$ ##ORIGIN= Bruker BioSpin GmbH
$$ ##OWNER= Administrator
$$ $$ C:\Bruker\TOPSPIN/data/COFFEE/nmr/AC1164_Rove100-18_6524191_ucSu4Vestq/12/pdata/1/auditp.txt
$$ ##AUDIT TRAIL=  $$ (NUMBER, WHEN, WHO, WHERE, PROCESS, VERSION, WHAT)
(   1,<2012-07-14 19:24:17.484 -0500>,<Administrator>,<TOPSPIN>,<go>,<TOPSPIN 2.1>,
      <created by zg
	started at 2012-07-14 19:12:47.125 -0500,
	POWCHK enabled, PULCHK disabled,
       configuration hash MD5:
       6B 1B 68 BB D9 2E 58 E2 7F 35 AD 54 07 DF 0E 41
       data hash MD5: 64K
       BF A7 37 B7 90 13 75 10 90 7C C7 DB F0 DF 9A 13>)
(   2,<2012-07-14 19:24:20.312 -0500>,<Administrator>,<TOPSPIN>,<proc1d>,<TOPSPIN 2.1>,
      <Start of raw data processing
       efp LB = 0.3 FT_mod = 6 PKNL = 1 PHC0 = 0 PHC1 = 0 SI = 128K 
       data hash MD5: 128K
       95 46 0A 73 45 DA CB 27 89 56 EF F2 B4 6B 52 88>)
(   3,<2012-07-14 19:24:21.453 -0500>,<Administrator>,<TOPSPIN>,<proc1d>,<TOPSPIN 2.1>,
      <pk PHC0 = -2.757568 PHC1 = 0 
       data hash MD5: 128K
       56 17 35 8E 53 26 09 D2 FC 59 ED 36 D7 BD 4B 27>)
(   4,<2012-07-14 19:24:21.687 -0500>,<Administrator>,<TOPSPIN>,<proc1d>,<TOPSPIN 2.1>,
      <abs ABSG = 1 
       data hash MD5: 128K
       9D 73 24 88 F0 17 B1 67 8D 90 52 9D 28 0B ED A5>)
(   5,<2012-07-14 19:24:21.765 -0500>,<Administrator>,<TOPSPIN>,<proc1d>,<TOPSPIN 2.1>,
      <abs ABSG = 2 
       data hash MD5: 128K
       EF C2 19 42 63 33 44 E0 9D 68 5A 6C DC 7A 70 85>)
(   6,<2012-07-14 19:24:21.812 -0500>,<Administrator>,<TOPSPIN>,<proc1d>,<TOPSPIN 2.1>,
      <abs ABSG = 3 
       data hash MD5: 128K
       C2 61 C3 42 7A 65 BF 4F 3D B4 F8 92 D4 7C 7B C2>)
(   7,<2012-07-14 19:24:22.046 -0500>,<Administrator>,<TOPSPIN>,<proc1d>,<TOPSPIN 2.1>,
      <abs ABSG = 4 
       data hash MD5: 128K
       06 8C A3 80 CC 7E 62 6F 26 4B E8 DB 43 97 E2 91>)
(   8,<2012-07-14 19:24:22.093 -0500>,<Administrator>,<TOPSPIN>,<proc1d>,<TOPSPIN 2.1>,
      <abs ABSG = 5 
       data hash MD5: 128K
       CB 30 32 4E 55 5F 79 69 F3 AE C2 5A 53 16 98 10>)
$$ ##END=
$$ 
$$ $$ hash MD5
$$ $$ 10 FB DE EE 87 9E 80 CE 23 6D 3A 34 B7 95 1A A5
##$RELAX= 
##$RELAX= 
##$RELAX= 
##$RELAX= 
##$RELAX= 
##$RELAX= 
##$RELAX= 
##$RELAX= 
$$ Bruker specific parameters
$$ [...]
##$TP07= 0
##$TPNAME0= <>
##$TPNAME1= <>
##$TPNAME2= <>
##$TPNAME3= <>
##$TPNAME4= <>
##$TPNAME5= <>
##$TPNAME6= <>
##$TPNAME7= <>
##$TPOAL= (0..7)
0.5 0.5 0.5 0.5 0.5 0.5 0.5 0.5
##$TPOFFS= (0..7)
0 0 0 0 0 0 0 0
##$TUNHIN= 0
##$TUNHOUT= 0
##$TUNXOUT= 0
##$USERA1= <user>
##$USERA2= <user>
##$USERA3= <user>
##$USERA4= <user>
##$USERA5= <user>
##$V9= 5
##$VALIST= <valist>
##$VCLIST= <CCCCCCCCCCCCCCC>
##$VD= 0
##$VDLIST= <DDDDDDDDDDDDDDD>
##$VPLIST= <PPPPPPPPPPPPPPP>
##$VTLIST= <TTTTTTTTTTTTTTT>
##$WBST= 2048
##$WBSW= 25
##$XGAIN= (0..3)
0 0 0 0
##$XL= 0
##$YL= 0
##$YMAX_a= 10713422
##$YMIN_a= -8366629
##$ZGOPTNS= <>
##$ZL1= 120
##$ZL2= 120
##$ZL3= 120
##$ZL4= 120
##$ABSF1= 14.96066
##$ABSF2= -5.597522
##$ABSG= 5
##$ABSL= 3
##$ALPHA= 0
##$AQORDER= 0
##$ASSFAC= 0
##$ASSFACI= 0
##$ASSFACX= 0
##$ASSWID= 0
##$AUNMP= <proc_prof1d_extract.lims>
##$AXLEFT= 0
##$AXNAME= <>
##$AXNUC= <1H>
##$AXRIGHT= 0
##$AXTYPE= 0
##$AXUNIT= <>
##$AZFE= 0.1
##$AZFW= 0.1
##$BCFW= 0
##$BC_mod= 0
##$BYTORDP= 0
##$COROFFS= 0
##$CY= 15
##$DATMOD= 1
##$DC= 0
##$DFILT= <>
##$DTYPP= 0
##$F1P= 0
##$F2P= 0
##$FCOR= 0.5
##$FTSIZE= 131072
##$FT_mod= 6
##$GAMMA= 0
##$GB= 0
##$INTBC= 1
##$INTSCL= 1
##$ISEN= 128
##$LB= 0.3
##$LEV0= 0
##$LPBIN= 0
##$MAXI= 10000
##$MC2= 0
##$MEAN= 0
##$ME_mod= 0
##$MI= 0
##$NCOEF= 0
##$NC_proc= -2
##$NLEV= 6
##$NOISF1= 0
##$NOISF2= 0
##$NSP= 0
##$NTH_PI= 0
##$NZP= 0
##$OFFSET= 14.96066
##$PC= 1
##$PHC0= -2.757568
##$PHC1= 0
##$PH_mod= 1
##$PKNL= yes
##$PPARMOD= 0
##$PPDIAG= 0
##$PPIPTYP= 0
##$PPMPNUM= 2147483647
##$PPRESOL= 1
##$PSCAL= 4
##$PSIGN= 0
##$PYNMP= <proc.py>
##$REVERSE= no
##$SF= 400.020009773491
##$SI= 131072
##$SIGF1= 0
##$SIGF2= 0
##$SINO= 400
##$SIOLD= 131072
##$SPECTYP= <>
##$SREGLST= <1H.CDCl3>
##$SSB= 0
##$STSI= 131072
##$STSR= 0
##$SW_p= 8223.68421052631
##$SYMM= 0
##$S_DEV= 0
##$TDeff= 65536
##$TDoff= 0
##$TI= <>
##$TILT= no
##$TM1= 0
##$TM2= 0
##$TOPLEV= 0
##$USERP1= <user>
##$USERP2= <user>
##$USERP3= <user>
##$USERP4= <user>
##$USERP5= <user>
##$WDW= 1
##$XDIM= 131072
##$YMAX_p= 384128782
##$YMIN_p= -13801
##$CURPLOT= <Network HP LaserJet P1505>
##$CURPRIN= <$Network HP LaserJet P1505>
##$DFORMAT= <normdp>
##$LAYOUT= <+/1D_H.xwp>
##$LFORMAT= <normlp>
##$PFORMAT= <normpl>
##$SURQMSG= 1
$$ End of Bruker specific parameters
$$ ---------------------------------
##NTUPLES= NMR SPECTRUM
##VAR_NAME=  FREQUENCY,     SPECTRUM/REAL,   SPECTRUM/IMAG
##SYMBOL=    X,             R,               I
##VAR_TYPE=  INDEPENDENT,   DEPENDENT,       DEPENDENT
##VAR_FORM=  AFFN,          ASDF,            ASDF
##VAR_DIM=   131072,        131072,          131072
##UNITS=     HZ,            ARBITRARY UNITS, ARBITRARY UNITS
##FACTOR=    0.0627417313425164, 1,          1
##FIRST=     8223.62146879497, -1473,        -49223
##LAST=      0,             -1534,           -50588
##MIN=       0,             -13801,          0
##MAX=       8223.62146879497, 384128782,    0
$$ Real data points
##PAGE= N=1
##DATA TABLE= (X++(R..R)), XYDATA
$$ [...]
61604E04018n474o444o910p112p234p071o498n769n177m675m080l450l022k967
61590D28135l279l770m023l599k516j437j125j671k436k769k664k591k791l003
61576C90461k822k163j265m95k88r67k291l373l462k711j860j262p81m77p26j460
61560C64058j954j760j324j247j389j223p68n22o22o09j73L58M37Ql66j31N46
61543C53319Q32J93p92r64j4J110J334O33k06n21j62O61J521J957J922J841J985
61526C64649K040J599P18k96j281k038k157j577r45q64j154j408j866k864l729
61511C48827l240j364M57J024O61M32O68Q91P23L15J8oJ03kn86j445j994j824
61493C43658j133n16m60j018j751j966j314k39L93K30j96j95K48N67L88j11n29
$$ y = [504018, 498544, 492100, 485190, 478078, 470844, 463773, 457275, 451506, 446329, 441654, 437574, 434124, 431102, 428135, 424856, 421086, 417063, 413464, 410948, 409511, 408386, 406715, 404279, 401510, 398846, 396255, 393464, 390461, 387639, 385476, 384211, 383716, 383428, 382461, 380170, 376797, 373335, 370624, 368764, 367502, 366721, 366244, 365518, 364058, 362104, 360344, 359020, 357773, 356384, 355161, 354393, 353871, 353249, 352640, 352467, 352825, 353262, 353270, 352904, 352773, 353319, 354151, 354344, 353552, 352588, 352574, 353684, 355018, 355651, 355445, 354924, 354762, 355423, 356944, 358901, 360823, 362664, 364649, 366689, 368288, 369006, 368710, 367429, 365391, 363234, 361657, 360712, 359848, 358694, 357286, 355420, 352556, 348827, 345587, 344223, 344680, 345704, 346365, 346797, 347465, 348356, 349079, 349394, 349412, 349406, 349509, 349507, 348921, 347476, 345482, 343658, 342525, 342009, 341549, 340531, 338780, 336814, 335500, 335261, 335654, 335884, 335688, 335493, 335741, 336308, 336696, 336585, 336056]
61476C36056o61m76O4Q58J401J056r9r98o33O81J559J182J11o86j052j336j465
61459C35562j016q4O53P62M37K9l12m72l30l0N8j81m96o28m95%Q79J701J812J209
61439C39058P74J184K000K269J863J589K009K711L063L192L616M136L837K466
61425C73767J107Q77J462J663J193R37J433K089K304K391K765L041K738K294K435
61410D02496K981L211L064L036L047K458J182k05j488k942m326m785m146l418
61396D00165l455l899l982l736l697l920l920l384k384j182j92J17k55o45m58
61381C65173J15M27K45j58m64n37k98J41M09K95K17P79J846K460J912O54r8L43
61363C73461J413K001J747J360J493J813J602J047J114K092L095L305L087L284
$$ y = [336056, 335395, 334919, 334983, 335841, 337242, 338298, 338199, 337201, 336568, 337249, 338808, 339990, 340101, 339415, 338363, 337027, 335562, 334546, 334462, 335115, 335877, 336314, 336343, 336031, 335559, 335229, 335199, 335257, 335076, 334580, 333952, 333457, 333457, 334336, 336037, 337849, 339058, 339832, 341016, 343016, 345285, 347148, 348737, 350746, 353457, 356520, 359712, 363328, 367464, 371301, 373767, 374874, 375751, 377213, 378876, 380069, 381006, 382439, 384528, 386832, 389223, 391988, 395029, 397767, 400061, 402496, 405477, 408688, 411752, 414788, 417835, 420293, 421475, 421270, 419782, 416840, 412514, 407729, 403583, 400165, 396710, 392811, 388829, 385093, 381396, 377476, 373556, 370172, 367788, 366606, 366414, 366531, 366276, 365631, 365173, 365288, 365715, 365960, 365802, 365338, 364801, 364503, 364644, 365053, 365348, 365565, 366344, 368190, 370650, 372562, 373216, 373118, 373461, 374874, 376875, 378622, 379982, 381475, 383288, 384890, 385937, 387051, 389143, 392238, 395543, 398630, 401914]
61349D01914L961M597N163O177P733R170R956J0358J0932J1763J2454J2668J2331
61336E19177J1498J0297Q982P742O468M883L045J519Q38P82M83o53k257l481m015
61321E65308m398n267o523p431p443o797o164n825n361m323k986k126k022k108
61307D96534j769j095n58k68O0N79J169J735K356L188M384N897P291P929P653
61292E35085O838N631L616P25k097l826m525m909n162n090n025n437n790n024
61278E05010l276j869j346p38O90K170K682K523K712L499M398N250O383P919R597
61263E45604J1055J1811J1381R905Q352P550P381P403P788Q948J0711J2517J4205
61250F74611J5844J7054J7248J6365J4776J2542R509O035K879L72j834m177o830
$$ y = [401914, 405875, 410472, 415635, 421812, 429545, 438715, 448671, 459029, 469961, 481724, 494178, 506846, 519177, 530675, 540972, 549954, 557696, 564164, 569047, 572092, 573611, 574449, 575231, 575714, 575061, 572804, 569323, 565308, 560910, 555643, 549120, 541689, 534246, 527449, 521285, 515460, 510099, 505776, 502790, 500664, 498642, 496534, 494765, 493670, 493112, 492844, 492904, 493483, 494652, 496387, 498743, 501931, 506315, 512212, 519503, 527432, 535085, 541923, 547554, 551170, 551895, 549798, 545972, 541447, 536538, 531376, 526286, 521261, 515824, 510034, 505010, 501734, 499865, 498519, 497781, 498471, 500641, 503323, 505846, 508558, 512057, 516455, 521705, 528088, 536007, 545604, 556659, 568470, 579851, 589756, 598108, 605658, 613039, 620442, 628230, 637178, 647889, 660406, 674611, 690455, 707509, 724757, 741122, 755898, 768440, 777949, 783984, 786863, 787235, 785401, 781224, 774394]
61237G74394r801j2711j4617j4780j3708j2710j2238j1424r525p204n765n557
61225F44354n756n566n006m454l881k927j580l21M82J045J750K483K738K310J425
61210F27096K28j287k672k991j769L13K072K863K749K092J325P95L84l83j465
61195F29350j934r44J210L578N763Q081J0685J3237J5447J7366J9108K0606K1778
61182G63331K2542K2702K2053K0565J8326J5534J2756J0855J0255J0489J0837
61171I40245J1069J1110J0421Q443N495K599M05j163k362l394m635o433q562j0424
61157I52814j1885j3380j5117j6645j7405j7307j6705j6128j6003j6174j5747
61146G80318j3969j1292q944p387n821l458o58J578K656K505J098j429m386o855
$$ y = [774394, 764593, 751882, 737265, 722485, 708777, 696067, 683829, 672405, 662880, 655676, 649911, 644354, 638598, 633032, 628026, 623572, 619691, 616764, 615184, 614863, 615345, 616390, 618140, 620623, 623361, 625671, 627096, 627324, 626037, 623365, 620374, 618605, 618918, 620990, 623853, 626602, 628694, 630019, 630814, 631198, 630815, 629350, 627416, 626472, 627682, 631260, 637023, 645104, 655789, 669026, 684473, 701839, 720947, 741553, 763331, 785873, 808575, 830628, 851193, 869519, 885053, 897809, 908664, 918919, 929408, 940245, 951314, 962424, 972845, 981288, 986783, 989382, 989787, 988624, 986262, 982868, 978233, 971800, 963238, 952814, 940929, 927549, 912432, 895787, 878382, 861075, 844370, 828242, 812239, 796065, 780318, 766349, 755057, 746113, 738726, 732905, 729447, 728789, 730367, 733023, 735528, 736626, 735197, 730811, 723956]
61132G23956q516r739j0760j1164j0409q587o324m060j858J50J593K448L297M633
61118F64660O217P659R278J1612J4356J6638J8336K0129K2077K3330K3594K3886
61106H61772K5099K6733K7804K8262K8609K8828K8629K8241K7985K7453K6046
61095A165461K3958K1732J9142J5486J0752N590L49m893r566j2914j5104j7158
61083A202835j9594k1909k3407k3987k4055k4186k4782k5597k5799k5016k3886
61072I40617k3026k2004k0115j7663j5573j4031j2470j0645q821p146n662m577
61060G78884l784k582o96J028J876K464L605M848N478O092P613R445J0463J1139
61046H35873J2730J4861J6049J6375J7383J9465K1596K3628K6479K9845L2150
$$ y = [723956, 715440, 705701, 694941, 683777, 673368, 664781, 658457, 654397, 652539, 652689, 654282, 656730, 660027, 664660, 670877, 678536, 687814, 699426, 713782, 730420, 748756, 768885, 790962, 814292, 837886, 861772, 886871, 913604, 941408, 969670, 998279, 1027107, 1055736, 1083977, 1111962, 1139415, 1165461, 1189419, 1211151, 1230293, 1245779, 1256531, 1262121, 1262470, 1257577, 1248011, 1235097, 1219993, 1202835, 1183241, 1161332, 1137925, 1113938, 1089883, 1065697, 1040915, 1015318, 989519, 964503, 940617, 917591, 895587, 875472, 857809, 842236, 828205, 815735, 805090, 796269, 789123, 783461, 778884, 775100, 772518, 771822, 772850, 774726, 777190, 780795, 785643, 791121, 797213, 804826, 814271, 824734, 835873, 848603, 863464, 879513, 895888, 913271, 932736, 954332, 977960, 1004439, 1034284, 1066434]
61035A066434L3250L4797L7410L9813M1391M3248M5886M8306N0214N2858N6554
61024A550161N9749O1714O3956O7645P1678P4494P5831P5766P4356P3338P5728
61013B324416Q2487R1850J02823J16387J32143J47296J60787J75159J92825K14573
61003C740746K43824K87568L49901M29541N27468O51715Q10086J004342J237016
60994I282207J515383J839524K196082K576048K978909L357100L550039L330717
60986C0626009K588601J483658L85397l69643o64914n75020k22237K74031P24853
60977C4250735Q50912M31356n01870j646194k626103l216391l403248l292210
60969B0846987l002340k628380k241903j887113j577439j309783j081750q92452
$$ y = [1066434, 1099684, 1134481, 1171891, 1211704, 1253095, 1296343, 1342229, 1390535, 1440749, 1493607, 1550161, 1609910, 1671624, 1735580, 1803225, 1874903, 1949397, 2025228, 2100994, 2175350, 2248688, 2324416, 2406903, 2498753, 2601576, 2717963, 2850106, 2997402, 3158189, 3333348, 3526173, 3740746, 3984570, 4272138, 4622039, 5051580, 5579048, 6230763, 7040849, 8045191, 9282207, 10797590, 12637114, 14833196, 17409244, 20388153, 23745253, 27295292, 30626009, 33214610, 34698268, 35083665, 34714022, 34049108, 33474088, 33251851, 33525882, 34250735, 35101647, 35533003, 35031133, 33384939, 30758836, 27542445, 24139197, 20846987, 17844647, 15216267, 12974364, 11087251, 9509812, 8200029, 7118279, 6225827]
60961F225827p36059o04903m96562m11454l46087k94402k53527k22863j99171
60952B660799j77711j57214j39282j23680j08270r2814p8971o7025n6198m7592
60942A612042m3316m2881m3583m4193m5233m6082m5108m2676m0940m0392l9434
60931A138204l7548l6094l5667l5274l4542l4229l4125l2890l0431k8218k6730
60920G72456k4892k2487k0779k0090j9027j6946j5067j4220j3472j1989j0460
60909E83027r635r057q179p301o538n306l614k423j944j093N03J600J363P86J021
60894E33210J589J534J048P45K98q02k053k658k869l483m524n397n860o068o078
60879D98632n933n822n619m855l618k752k677k821k666k519k592k337j422m90
$$ y = [6225827, 5489768, 4884865, 4388303, 3976849, 3630762, 3336360, 3082833, 2859970, 2660799, 2483088, 2325874, 2186592, 2062912, 1954642, 1861828, 1782857, 1715832, 1659634, 1612042, 1568726, 1525845, 1482262, 1438069, 1392836, 1346754, 1301646, 1258970, 1218030, 1177638, 1138204, 1100656, 1064562, 1028895, 993621, 959079, 924850, 890725, 857835, 827404, 799186, 772456, 747564, 725077, 704298, 684208, 665181, 648235, 633168, 618948, 605476, 593487, 583027, 573392, 564335, 556156, 548855, 542317, 537011, 533397, 530974, 529030, 527937, 528440, 530040, 531403, 532189, 533210, 534799, 536333, 537381, 538126, 538424, 537622, 535569, 532911, 530042, 526559, 522035, 516638, 510778, 504710, 498632, 492699, 486877, 481258, 476403, 472785, 470033, 467356, 464535, 461869, 459350, 456758, 454421, 452999, 452509]
60865D52509q1L14J193J871J504O26M72J185J806J847J746J817J677Q78n27k171
60849D66666l656m589m712m068k879j440j96M10L91J37k45j122k602m123n009
60834D32963n088m541l671l001k947l107k567j178J53Q78J566K792M039M472M148
60819D24911L723L494L473L827M479M716M026K968K444K421K143J364N78K34L63
60804D65164Q40J421J644J253N65K4m08r71j577k116k888m125n347n883n818n764
60788D36014n952o177o423o795o985o500n451m501m017l780l543l305l085k824
60774C66676k576k411k176j714j215r40p21j43Q31J841K592K984K971K662K435
60759C71096K541K730K637K366K250K340K539L015L897M702M705L873L036L020
$$ y = [452509, 452428, 452742, 453935, 455806, 457310, 457936, 458408, 459593, 461399, 463246, 464992, 466809, 468486, 469364, 468837, 466666, 463010, 458421, 453709, 449641, 446762, 445322, 445126, 445536, 445927, 446064, 445819, 444697, 442095, 437972, 432963, 427875, 423334, 419663, 416662, 413715, 410608, 408041, 406863, 407016, 407894, 409460, 412252, 416291, 420763, 424911, 428634, 432128, 435601, 439428, 443907, 448623, 452649, 455617, 458061, 460482, 462625, 463989, 464567, 464801, 465164, 466004, 467425, 469069, 470322, 470887, 470911, 470503, 469532, 467955, 465839, 462951, 458826, 453479, 447596, 441778, 436014, 430062, 423885, 417462, 410667, 403682, 397182, 391731, 387230, 383213, 379433, 375890, 372585, 369500, 366676, 364100, 361689, 359513, 357799, 356584, 355644, 354923, 354780, 355611, 357452, 360044, 363028, 365999, 368661, 371096, 373637, 376367, 379004, 381370, 383620, 385960, 388499, 391514, 395411, 400113, 404818, 408691, 411727, 414747]
60745D14747L950N345O624P542Q274Q892Q810P274M591K204J096P57K14n74j159
60730D78587j685k488l037k480j139l68r03k208l492m420m813m607m325m667n432
60715D32523n734n412n365o038o601o197n238m746m894n001m637m085l738l564
60701C61273l262k721k163j817j497p59M00J351J674J859K589L621M076L734L269
60686C71627L262L711M481N485O197N924M839M055M240M809M899M446L853L111
60672D34939J846mk016l622m471m668m765n116n278m535k991j574q49n94o59j344
60656C94299k563l526l744l625l558l109j802n7J319K081K403K386K340K867L929
60641C89640M427L585K179J476J447J110K71l13l21j96o7M50J208J446J093J133
$$ y = [414747, 418697, 424042, 430666, 438208, 446482, 455374, 464184, 471458, 476049, 478253, 479349, 480106, 480320, 479746, 478587, 476902, 474414, 471377, 468897, 467758, 467390, 466487, 464279, 460787, 456367, 451554, 446947, 442622, 437955, 432523, 426789, 421377, 416012, 409974, 403373, 397176, 391938, 387192, 382298, 377297, 372660, 368575, 364837, 361273, 358011, 355290, 353127, 351310, 349813, 349054, 349454, 350805, 352479, 354338, 356927, 360548, 364624, 368358, 371627, 374889, 378600, 383081, 388566, 394763, 400687, 405526, 409581, 413821, 418630, 423529, 427975, 431828, 434939, 436785, 436781, 434765, 431143, 426672, 422004, 417239, 412123, 406845, 402310, 399319, 397745, 396896, 396302, 395643, 394299, 391736, 388210, 384466, 380841, 377283, 374174, 372372, 372315, 373634, 375715, 378118, 380504, 382844, 385711, 389640, 394067, 397652, 399831, 401307, 402754, 403864, 404135, 403822, 403501, 403305, 403238, 403688, 404896, 406342, 407435, 408568]
60625D08568K123L314L830L946M457N319N801N674N518N834O423O779O747O733
60611D81066P292Q562J0051J1122J1588J1650J1403J0798J0104R785R826R613
60599F02860Q795P799P232P117P047O722O071N222M733N394P269R333J0553J1115
60585G07262J1911J3008J3454J2620J1157J0217J0232J0620J0459R242P253N341
60573H32776M094L189J860Q6j144r54M29K141L782N622P862J0176J2015J3075
60559H95009J3304J2558J0397O303K82o802j3684j9498k3879k6412k6597k4607
60547G96374k1485j8061j4100r070l398J782N977R746J3837J8610K4151L0032
60535H34395L4822L6769L5429L1888K7014K0281J1060L62r579j7175k2119k4482
$$ y = [408568, 410691, 414005, 417835, 421781, 426238, 431557, 437358, 443032, 448550, 454384, 460807, 467586, 474333, 481066, 488358, 496920, 506971, 518093, 529681, 541331, 552734, 563532, 573636, 583421, 593247, 602860, 611655, 619454, 626686, 633803, 640850, 647572, 653643, 658865, 663598, 668992, 676261, 685594, 696147, 707262, 719173, 732181, 745635, 758255, 769412, 779629, 789861, 800481, 810940, 820182, 827435, 832776, 836870, 840059, 841919, 842005, 840861, 839907, 840336, 842477, 846259, 851881, 859743, 869919, 881934, 895009, 908313, 920871, 931268, 937571, 937853, 931051, 917367, 897869, 873990, 847578, 820981, 796374, 774889, 756828, 742728, 733658, 730260, 732042, 738019, 747765, 761602, 780212, 804363, 834395, 869217, 905986, 941415, 973303, 1000317, 1020598, 1031658, 1032020, 1022441, 1005266, 983147, 958665]
60523I58665k4247k1838j8391j4990j2001r353p130n646n063n074m972m128k506
60510H23326o20J129K823M647O412P816Q903R949J1193J3057J6286K1331K7768
60497I54020L4919M2850N2140O2664P3299Q2970R1385R8536J03942J06548J05075
60486A808348R8458Q6523P0311N1272L0013O388j9008m4106o6568q5232r9916
60475A836483j10319j15814j16284j12540j05829r7205q7442p7244o7370n8497
60465H87939n0965m4717l9497l5095l1283k7729k4260k1161j8856j7339j6173
60454E60864j5047j3881j2472j0535q271o421n474n128m771m149l402k734k246
60441D66333j977j860j844k030k422k554j842m30P54J030O11O0m86j234k225l225
$$ y = [958665, 934418, 912580, 894189, 879199, 867198, 857845, 850715, 845069, 840006, 834932, 829960, 825832, 823326, 822706, 823835, 826658, 831305, 837717, 845533, 854436, 864385, 875578, 888635, 904921, 926252, 954020, 988939, 1031789, 1083929, 1146593, 1219892, 1302862, 1394247, 1492783, 1596725, 1703273, 1808348, 1906806, 1993329, 2063640, 2114912, 2144925, 2151313, 2132305, 2088199, 2021631, 1936399, 1836483, 1726164, 1610350, 1494066, 1381526, 1275697, 1178492, 1091050, 1013806, 946436, 887939, 836974, 792257, 752760, 717665, 686382, 658653, 634393, 613232, 594376, 577037, 560864, 545817, 531936, 519464, 508929, 500658, 494237, 488763, 483635, 478864, 474715, 471313, 468579, 466333, 464356, 462496, 460652, 458622, 456200, 453646, 451804, 451374, 452128, 453158, 453769, 453829, 453343, 452109, 449884, 446659]
60425D46659l932m074l605l001k938l416l650l087k173j642j468j067k57M99P72
60410D13620O33M19L74M62L90p3o20n35M26J549J926J443O76Mo11j066r28J4J281
60391D19384K051J901J169O12O94J137J281Q47K18n4K09Q07J415J684J423Q62
60375D35640N20N98P86Q11R29J553K615L531L736L121K099J262Q67O25J79l08
60359D58564m36l00l15m08o5O79J093Q71N95O83O93K45j11K70J012J265R37N93
60341D65865M79M10L84N55P82Q87J138J847K664K969K761K510K366K164K034K250
60325D92065K551K350J560O04k49r59j249q16QN33O09P28J266K268L788N754P666
60308E18477R123J0618J3008J6407K0272K4505K9531L5426M1708M7705N2022N2088
$$ y = [446659, 442727, 438653, 435048, 432047, 429109, 425693, 422043, 418956, 416783, 415141, 413673, 412606, 412349, 412848, 413620, 414253, 414672, 415046, 415508, 415898, 415825, 415205, 414670, 415096, 416645, 418571, 420014, 420690, 420694, 420083, 419017, 418089, 418103, 419384, 421435, 423336, 424505, 425117, 425811, 426948, 428229, 429076, 429294, 429240, 429449, 430256, 431671, 433355, 434778, 435640, 436160, 436758, 437544, 438355, 439284, 440837, 443452, 446983, 450719, 453840, 455939, 457201, 458068, 458693, 458872, 458564, 458128, 457828, 457513, 457105, 457040, 457719, 458812, 459683, 460278, 460961, 461654, 461899, 461788, 462058, 463070, 464335, 465272, 465865, 466344, 466754, 467138, 467693, 468475, 469362, 470500, 472347, 475011, 477980, 480741, 483251, 485617, 487781, 489815, 492065, 494616, 496966, 498526, 499130, 498881, 497922, 496673, 495857, 495865, 496398, 497007, 497735, 499001, 501269, 505057, 510811, 518477, 527600, 538218, 551226, 567633, 587905, 612410, 641941, 677367, 719075, 766780, 818802, 870890]
60296H70890M5968L4894K2428J0495k250j7195l2376m3709m8924m8953m6018m1680
60284G03570l6703l1521k6331k1216j6455j2483r499p335n667m194k847j826j316
60271E26177j071o82k03l1j89l37o00j552l094m151m036l345k893k528j750q92
60255D98823p39j332j993k382k673k884k787k495k375k421k279j890j512j115
60241D69946m25L82O79K91j64j26J80K11m8j25K20P15J062J404K065K890L200
60224D82357K618J756J619K361L050K832J863R10M59N43R95J475J580J339J277
60209E07034J621J849J562J362K134L559M268L572K334J820K272K962L340L558
60195E43247L958M427M456L745K625J716J246R28N60M19P85J320J309M70q29k046
$$ y = [870890, 916858, 951752, 974180, 984675, 982425, 965230, 932854, 889145, 840221, 791268, 745250, 703570, 666867, 635346, 609015, 587799, 571344, 558861, 549362, 542027, 536360, 532166, 529319, 527493, 526177, 525106, 524424, 524221, 524190, 524001, 523664, 523064, 521512, 518418, 514267, 510231, 506886, 503993, 501465, 499715, 498823, 498084, 496752, 494759, 492377, 489704, 486820, 484033, 481538, 479163, 476742, 474463, 472573, 471061, 469946, 469521, 469903, 470582, 470873, 470709, 470583, 470763, 470974, 470926, 470801, 471021, 471736, 472798, 474202, 476267, 479157, 482357, 484975, 486731, 488350, 490711, 493761, 496593, 498456, 499366, 499825, 500368, 501363, 502838, 504418, 505757, 507034, 508655, 510504, 512066, 513428, 515562, 519121, 523389, 526961, 529295, 531115, 533387, 536349, 539689, 543247, 547205, 551632, 556088, 559833, 562458, 564174, 565420, 566348, 566908, 567327, 568112, 569432, 570741, 571211, 570382, 568336]
60179E68336k852l106k815k220j619j097n77j20J42L06O22J029J189J068J127
60164E59413J604J936J334r4j287j450j003r93j791k754l179l119l048l070k864
60149E39635k282j559r42l96K13R62J906L084M370N533O449P145P666Q116Q796
60134E88696R963J1430J2596J2902J2079J0129P380M404J495j630n194q557j0599
60121F45094j0887r937q372o546m889l762k832j413L40J424J496J437J989K757
60107F05899L227L774M788N640N529M815M404M279L811L151L037L296K774J027
60093F59451r80k148k420k267j846j084p2J066K354L713M837N537N906O044N959
60078F84050N733N402M615K913N12j676k978l632m360n598p247q791r577r339
$$ y = [568336, 565484, 562378, 559563, 557343, 555724, 554627, 554050, 553930, 554072, 554378, 555000, 556029, 557218, 558286, 559413, 561017, 562953, 564287, 564193, 562906, 561456, 560453, 559460, 557669, 554915, 551736, 548617, 545569, 542499, 539635, 537353, 535794, 534852, 534456, 534669, 535631, 537537, 540621, 544991, 550524, 556973, 564118, 571784, 579900, 588696, 598659, 610089, 622685, 635587, 647666, 657795, 665175, 669579, 671074, 669444, 664250, 655693, 645094, 634207, 624270, 615898, 609352, 604463, 600701, 597869, 596456, 596796, 598220, 599716, 601153, 603142, 605899, 609126, 612900, 617688, 623328, 628857, 633672, 638076, 642355, 646166, 649317, 652354, 655650, 658424, 659451, 658471, 656323, 653903, 651636, 649790, 648706, 648634, 649700, 652054, 655767, 660604, 666141, 672047, 678091, 684050, 689783, 695185, 699800, 702713, 703225, 701549, 698571, 694939, 690579, 684981, 677734, 668943, 659366, 650027]
60064F50027q582q132q219q375q240p951p588o836n625m606m475n022n367n046
60050E55963m376l787l241k591k096k133k479k390j580o99m13l09N62K177L351
60035E35959L331K842L010L881M616M830M901N120N209M768L697K162M47j165
60021E83608k669m239n644o208n849n658o661q328r208q873q275q179q250p875
60007D87692p004n831m429l088k357k338k496k440k266j892q74O27J511J035m7
59992D55803m13K51J288K262L253M116M416M202M110M393M426L601K366J831K436
59977D98341L367L442K414J135N29O43P70L11p04j766k341k239j825j726k152
59962D98199k604k503j900j249p03j50K22K7o00j029r76p78o71m08J35M84J90
$$ y = [650027, 641445, 633313, 625094, 616719, 608479, 600528, 592940, 586104, 580479, 575873, 571398, 566376, 561009, 555963, 551587, 547800, 544559, 541968, 539872, 537739, 535260, 532870, 531290, 530591, 530178, 529869, 530431, 532608, 535959, 539290, 542132, 545142, 549023, 553639, 558469, 563370, 568490, 573699, 578467, 582164, 584326, 584773, 583608, 580939, 576700, 571056, 564848, 558999, 553341, 546680, 538352, 529144, 520271, 511996, 503817, 495567, 487692, 480688, 474857, 470428, 467340, 464983, 462645, 460149, 457709, 455443, 453551, 452677, 453304, 454815, 455850, 455803, 455390, 455641, 456929, 459191, 462444, 466560, 470976, 475178, 479288, 483681, 488107, 491708, 494074, 495905, 498341, 501708, 505150, 507564, 508699, 509228, 509871, 510641, 510952, 510248, 508482, 506141, 503902, 502077, 500351, 498199, 495595, 493092, 491192, 489943, 489240, 489090, 489312, 489339, 488739, 487710, 486734, 485956, 485285, 484877, 485012, 485496, 485686]
59945D85686m96r71j004p49l32J90O03P09O13N82O68P12O49N87O47Q04Q71O34
59927D90403J48j73M1N86R21R05R11J125J174P13Mm24m15j95N5L81P87J088J080
59908D99115Q53Q51J464K374K603J621J62n29k20J86N2k00Q3Q38J554J979K147
59891E14933K113K072K388L100L716L862L805M000M416M691M702M625M639M819
59877E67881N117N238M922M506M692N480N865N114L772K781K054Q13j039k752
59863F14444l895m795n682o215o136n734n373n039m664m435m361l971k854j322
59849E49968q3O09J155K040L428N328P757J0564J3329J5551J6757J6359J3735
59836F56497Q923L203j412l493k975p71K022M453N718N203K595j952p464j2116
$$ y = [485686, 485190, 484219, 483215, 482466, 482134, 482324, 482927, 483636, 484249, 484831, 485499, 486211, 486860, 487447, 488094, 488898, 489769, 490403, 490551, 490378, 490419, 491005, 491926, 492831, 493742, 494867, 496041, 496754, 496758, 496334, 495919, 495724, 495779, 496160, 496947, 498035, 499115, 499968, 500819, 502283, 504657, 507260, 508881, 509043, 508514, 508294, 508480, 508532, 508332, 508415, 509253, 510807, 512786, 514933, 517046, 519118, 521506, 524606, 528322, 532184, 535989, 539989, 544405, 549096, 553798, 558423, 563062, 567881, 572998, 578236, 583158, 587664, 592356, 597836, 603701, 608815, 612587, 615368, 617422, 618235, 617196, 614444, 610549, 605754, 600072, 593857, 587721, 581987, 576614, 571575, 566911, 562476, 558115, 554144, 551290, 549968, 549885, 550494, 551649, 553689, 557117, 562445, 570202, 580766, 594095, 609646, 626403, 642762, 656497, 665420, 668623, 667211, 663718, 660743, 659972, 661994, 666447, 672165, 677368, 679963, 678011, 670547, 658431]
59822F58431j4367j4421j3945j3959j3718j2298j0390r401r346q998p979p188
59810E22421p029o619n332l895l205l039k742k372k261k089j387n34l11p11r94
59795D79901q01n51p93j701l043m207m449l609k441j784j696j655j362q75l41
59780D50593l3l18j082j523j111m03l13q92j467j690j691j404o30L18P39M92J32
59763D39717P5J67K13L33N65O29L19j39l30m8N62J138J369J348J495J993K454
59746D51860K473K244K269K654L109L450L676L649L097K012P09l41o80j41P45
59731D80785J033M28l44n80n33p33r95q80p13j158j947k125j504r76j131j498
59715D67129j384q15k42J29L56N43Q17J184J378J229J112J569K406K828K555K247
$$ y = [658431, 644064, 629643, 615698, 601739, 588021, 575723, 565333, 555932, 546586, 537588, 529609, 522421, 515392, 508773, 503441, 499546, 496341, 493302, 490560, 488188, 485927, 483838, 482451, 481917, 481606, 480895, 479901, 479100, 478549, 477756, 476055, 473012, 468805, 464356, 460747, 458306, 456522, 454826, 453171, 451809, 450934, 450593, 450560, 450242, 449160, 447637, 446526, 446123, 445810, 444918, 443451, 441761, 440070, 438666, 438036, 438354, 439093, 439585, 439717, 439792, 439959, 440172, 440505, 441070, 441699, 442018, 441879, 441549, 441501, 442063, 443201, 444570, 445918, 447413, 449406, 451860, 454333, 456577, 458846, 461500, 464609, 468059, 471735, 475384, 478481, 480493, 481202, 480861, 480181, 480040, 480785, 481818, 482246, 481902, 481322, 480789, 480056, 479061, 478181, 477468, 476310, 474363, 472238, 470734, 469758, 468627, 467129, 465745, 464930, 464688, 464817, 465173, 465716, 466533, 467717, 469095, 470324, 471436, 473005, 475411, 478239, 480794, 483041]
59699D83041K614L534M291M317L614K744K462L017L837M244M212M018L424K031
59685E31400K54r18j234j359j665j725j267p87p22p51m12J75O35Q70Q04K05q02
59668E22701j557j712j778k291k854k685j797r66o72o31m29r8Ml34r26j303j103
59651E01569l77N53J439K139K384K042J537J520J871J657L56j379k528k879k943
59636E06961l008k935k676k467k404k270j858j288q26n29j82L97J049J363J212
59621D90539R90J152J613J891J779J483J158O26l86j889l545m684m660l524k216
59606D80327j535j166k79J029J757J454Q28N52L35l01j030j161o93l14n50j317
59590D77936k154k502k024r62J5N37Q88J369J673J294K83p63j425j787k208k935
$$ y = [483041, 485655, 489189, 493480, 497797, 501411, 504155, 506617, 509634, 513471, 517715, 521927, 525945, 529369, 531400, 531654, 530736, 529502, 528143, 526478, 524753, 523486, 522699, 521977, 521226, 520814, 520989, 521624, 522494, 523298, 523503, 522701, 521144, 519432, 517654, 515363, 512509, 509824, 508027, 507061, 506389, 505758, 505329, 505231, 505235, 504901, 503975, 502672, 501569, 501192, 501745, 503184, 505323, 507707, 509749, 511286, 512806, 514677, 516334, 516690, 515311, 512783, 509904, 506961, 503953, 501018, 498342, 495875, 493471, 491201, 489343, 488055, 487229, 486700, 486518, 486915, 487964, 489327, 490539, 491529, 492681, 494294, 496185, 497964, 499447, 500605, 501231, 500845, 498956, 495411, 490727, 486067, 482543, 480327, 478792, 477626, 477347, 478376, 480133, 481587, 482415, 482967, 483302, 483001, 481971, 480810, 480117, 479803, 479253, 477936, 475782, 473280, 471256, 470294, 470309, 470846, 471734, 473103, 474776, 476070, 476353, 475590, 474165, 472378, 470170, 467235]
59574D67235l910m740m910m196k914j755j289j510j767j459q72r40j825k294j215
59559D31639P51J854J492P41O98J276J854K127J966J302N00J64K76L02L20J045
59543D48307K450L454L462L226L645M771O557R295J2569J5135J6896J9451K3079
59530E72297K4493J9896R929n41p459j0579j1413j0473p642l630K38L195N194
59517E83505O419P217Q025Q843R130Q500P133N338L249J151m90j689l088n099
59503F38144p351r221j0551j1489j2068j2263j2149j1728j0863r619q323p166
59491E15353o032m897m023l536l168k641k067j676j454j212q42k77N64J646K772
59476D88510L782M678N459O013O268O301O219O028N647M975M019K987K136J405
$$ y = [467235, 463325, 458585, 453675, 449479, 446565, 444810, 443521, 442011, 440244, 438785, 437913, 436973, 435148, 432854, 431639, 432390, 434244, 435736, 436477, 437175, 438451, 440305, 442432, 444398, 445700, 446200, 446364, 446640, 446942, 447262, 448307, 450757, 454211, 457673, 460899, 464544, 469315, 475872, 485167, 497736, 512871, 529767, 549218, 572297, 596790, 616686, 626615, 626074, 618615, 608036, 596623, 586150, 578508, 574878, 575116, 578311, 583505, 589924, 597141, 605166, 614009, 623139, 631639, 638772, 644110, 647359, 648510, 648020, 646331, 643243, 638144, 630793, 621572, 611021, 599532, 587464, 575201, 563052, 551324, 540461, 530842, 522519, 515353, 509321, 504424, 500401, 496865, 493697, 491056, 488989, 487313, 485859, 484647, 483805, 483528, 484092, 485738, 488510, 492292, 496970, 502429, 508442, 514710, 521011, 527230, 533258, 538905, 543880, 547899, 550886, 553022, 554427]
59462E54427N09m70r48o05J22P93J718L346N276O803Q202J0396J3298J5563J6411
59447F34841J6810J8252K0979K3910K5792K5769K3332J8379J1349L028n615j3303
59435H03523j8759k1566k2465k2404k1681k0293j8657j7350j6391j5263j3559
59424E95135j1277q623n959l755k206r41O11K727N406Q589J2038J5304J8132K0706
59410F45887K3235K5818K8849L2603L5511L3863K4910J0438m045j3931j8422j8968
59398H05748j6751j2577p600k577K664P385Q310K035j0559k3952l2700l5463l4171
59385F49792l0911k6839k2875j9689j7103j4507j1846r460p357n408l956l299
59373D76542k805j582P2R91R23Q67J375J711J178K40l23n36p57q15m94k46n11
$$ y = [554427, 554936, 554466, 553518, 552913, 553035, 553828, 555546, 558892, 564168, 570971, 579173, 589569, 602867, 618430, 634841, 651651, 669903, 690882, 714792, 740584, 766353, 789685, 808064, 819413, 822441, 816826, 803523, 784764, 763198, 740733, 718329, 696648, 676355, 657698, 640348, 623957, 608694, 595135, 583858, 575235, 569276, 565521, 563315, 562374, 562985, 565712, 571118, 579707, 591745, 607049, 625181, 645887, 669122, 694940, 723789, 756392, 791903, 825766, 850676, 861114, 857069, 843138, 824716, 805748, 788997, 776420, 768820, 766243, 768907, 776292, 784602, 786637, 776078, 752126, 719426, 683963, 649792, 618881, 592042, 569167, 549478, 532375, 517868, 506022, 496562, 489205, 483797, 479841, 476542, 473737, 472155, 472227, 473218, 474141, 475008, 476383, 478094, 479272, 479512, 479189, 478653, 477896, 477081, 476587, 476341, 475830]
59356D75830p66j89J009J881K229K895M472O506Q189R274J0078J1043J2456J4221
59342E59128J5855J6999J7993J9490K1402K2727K2632K1373J9863J8539J6974
59331G72975J4511J1099P415M188J452j416m843q476j1484j3374j4326j4899j5500
59318G27322j6039j6030j5117j3607j2236j1335j0530r333p749o103m660l597
59306F00986k990k599k018j250p10m48J38J458L177M851O615Q708J0944J3201
59292F40063J5882J9194K2569K5429K7728K8644K5642J6659L304r651j8403k2671
59280G74389k4064k3555k1379j8139j4679j1241p655m074r38J606L711N501P170
59267F66653R119J1556J4106J6167J7465J7988J7647J6319J4092J1187P829M346
$$ y = [475830, 475064, 474875, 475884, 477765, 479994, 482889, 487361, 493867, 502056, 511330, 521408, 532451, 544907, 559128, 574983, 591982, 609975, 629465, 650867, 673594, 696226, 717599, 737462, 756001, 772975, 787486, 798585, 806000, 810188, 811640, 810224, 805381, 796905, 785421, 772047, 757721, 742822, 727322, 711283, 695253, 680136, 666529, 654293, 642958, 632428, 623095, 615346, 609243, 604583, 600986, 597996, 595397, 593379, 592129, 591419, 590971, 591109, 592567, 595744, 600595, 607210, 615918, 626862, 640063, 655945, 675139, 697708, 723137, 750865, 779509, 805151, 821810, 825114, 815463, 797060, 774389, 750325, 726770, 705391, 687252, 672573, 661332, 653677, 649603, 648665, 650271, 653982, 659483, 666653, 675772, 687328, 701434, 717601, 735066, 753054, 770701, 787020, 801112, 812299, 820128, 824474]
59255H24474J135j658m232o763r142j1188j2806j3800j3876j3123j2162j1490
59243G15369j0899r796p981n916m306l534l328l004k147j049k15M62J602L327
59229F68585M847N317M779M005L603L536L293K406Q30j082l095n372q012j0463
59215F73177j1886j2060j1541j0987j0705j0810j1162j1164j0263q799p752p423
59203E48625p074o131n027m408m130l653k969k505k358k249k025j725j290o14
59189E02467J45O70R26J192J751K662L721M537M814M701M612M671M535L972L258
59174E48634K776K578K565K830L503M463N443O339P209Q105R031R960J0803J1495
59160F35734J2131J2802J3390J3748J3943J4002J3526J2075R824P309M688J934
$$ y = [824474, 825609, 823951, 819719, 812956, 803814, 792626, 779820, 766020, 752144, 739021, 726859, 715369, 704470, 694674, 686693, 680777, 676471, 672937, 669609, 666605, 664458, 663409, 663194, 663656, 665258, 668585, 673432, 678749, 683528, 687533, 691136, 694672, 697965, 700371, 701201, 700119, 697024, 691652, 683640, 673177, 661291, 649231, 637690, 626703, 615998, 605188, 594026, 582862, 572599, 563800, 556048, 548625, 541551, 535420, 530393, 525985, 521855, 518202, 515233, 512728, 510370, 508121, 506096, 504371, 503081, 502467, 502612, 503282, 504208, 505400, 507151, 509813, 513534, 518071, 522885, 527586, 532198, 536869, 541404, 545376, 548634, 551410, 553988, 556553, 559383, 562886, 567349, 572792, 579131, 586340, 594445, 603476, 613436, 624239, 635734, 647865, 660667, 674057, 687805, 701748, 715750, 729276, 741351, 751175, 758484, 763172, 765106]
59148G65106m80j986l027m713p118q981r529r490r608r339p982o206n270n226
59134F76151n060m298l431k910k724k873l282l331k316m87J179K245L172M327
59120F56362N468O406P470R048J1053J3114J4925J6236J6894J6931J6401J5237
59108H05545J3666J2493J2371J2869J2896J2005J0635R192P676O354N854O146
59096I27702O186N154L510K251J534O64p39k200l019k954k354j885k142l171m368
59081I24169n141n725o986r306j1942j3773j4549j5002j5826j6884j7572j7598
59069G73865j7071j6103j4789j3469j2524j1869j1017r772q449p304o169m948
59057F40381l996l729m061m544m871m917m550l785k999k677k992l688m242m103
$$ y = [765106, 764626, 762640, 759613, 754900, 747782, 738801, 729272, 719782, 710174, 700835, 692853, 686647, 681377, 676151, 671091, 666793, 663362, 660452, 657728, 654855, 651573, 648242, 645926, 645439, 646618, 648863, 652035, 656362, 661830, 668236, 675706, 684754, 695807, 708921, 723846, 740082, 756976, 773907, 790308, 805545, 819211, 831704, 844075, 856944, 869840, 881845, 892480, 901672, 909348, 915702, 921556, 927702, 933888, 939042, 942552, 944803, 946337, 947001, 946262, 944062, 941043, 938089, 935735, 933850, 931708, 928537, 924169, 919028, 913303, 906317, 897011, 885069, 871296, 856747, 841745, 825919, 809035, 791463, 773865, 756794, 740691, 725902, 712433, 699909, 688040, 677023, 667251, 658802, 651498, 645329, 640381, 636385, 632656, 628595, 624051, 619180, 614263, 609713, 605928, 602929, 600252, 597260, 593572, 589330, 585227]
59043E85227l133j929j372j588j777j279l53M20J017J708K364K638K643K830L344
59028E90760M011M764N654O492P068P603Q529R864J1217J2358J3329J4114J4676
59015G10439J5193J5761J5957J5188J3484J1463R527P544N289K793K39j993l307
59002H17577l371k580j591m93J037K845M238M878N148N461N729N650N033L748
58988H53309J837j93j684k542l218m042n096o693r177j2015j3935j4359j4018
58975G68174j3737j3264j1893r701p402n346l385j478K19J810L570N373O769P635
58961G27344Q401R477J0768J1773J1907J0781Q526N846L503J653j06k076m132
58948H03665o137q304j0839j3354j4911j4845j3405j1536j0033q953p903o689
$$ y = [585227, 582094, 580165, 578793, 577205, 575428, 574149, 573796, 574216, 575233, 576941, 579305, 581943, 584586, 587416, 590760, 594771, 599535, 605189, 611681, 618749, 626352, 634881, 644745, 655962, 668320, 681649, 695763, 710439, 725632, 741393, 757350, 772538, 786022, 797485, 807012, 814556, 819845, 822638, 822877, 820884, 817577, 814206, 811626, 810035, 809542, 810579, 813424, 817662, 822540, 827688, 833149, 838878, 844528, 849561, 853309, 855146, 854953, 853269, 850727, 847509, 843467, 838371, 831678, 822501, 810486, 796551, 782192, 768174, 754437, 741173, 729280, 719579, 712177, 706831, 703446, 701968, 702187, 703997, 707567, 712940, 719709, 727344, 735745, 745222, 755990, 767763, 779670, 790451, 798977, 804823, 808326, 809979, 809873, 807797, 803665, 797528, 789224, 778385, 765031, 750120, 735275, 721870, 710334, 700301, 691348, 683445, 676756]
58936F76756n515m631m077l801l823m117m514m905n311n642n543m739l507k520
58922F14111k257k675l404m025m234m013l721l721l817l373k191r50m07l61J05
58907E75067J463L280M986O505P904Q974R654J0455J1844J3423J4389J4641J4769
58894F97354J4918J4443J2943J1008R517Q746Q613R325J1173J3930J6968J9882
58882H48820K2550K4684K5838K5842K4851K2939J9969J5972J1325O455J594l041
58870A047798p090j0290j2833j5247j7753j9810k0489j9473j7512j5715j4553
58859H77033j3807j3303j3198j3528j4054j4673j5560j6615j7267j7119j6493
58848G11416j5985j5732j5383j4550j3107j1327r851r098q622p490n633m192m084
$$ y = [676756, 671241, 666610, 662533, 658732, 654909, 650792, 646278, 641373, 636062, 630420, 624877, 620138, 616631, 614111, 611854, 609179, 605775, 601750, 597516, 593503, 589782, 586061, 582244, 578871, 576680, 575730, 575323, 574962, 575067, 576530, 579810, 584796, 591301, 599205, 608179, 617833, 628288, 640132, 653555, 667944, 682585, 697354, 712272, 726715, 739658, 750666, 760183, 768929, 777542, 786867, 798040, 811970, 828938, 848820, 871370, 896054, 921892, 947734, 972585, 995524, 1015493, 1031465, 1042790, 1049245, 1050839, 1047798, 1040708, 1030418, 1017585, 1002338, 984585, 964775, 944286, 924813, 907301, 891586, 877033, 863226, 849923, 836725, 823197, 809143, 794470, 778910, 762295, 745028, 727909, 711416, 695431, 679699, 664316, 649766, 636659, 625332, 615481, 606383, 597761, 590271, 584638, 580446, 576362]
58835E76362m743m920m285l544l223l107k905k772l001l549m034m009l273k165
58821E26832j363j174j204r69n92n21p80r44p11j65M38Q33Q91Q33J070J610J904
58804E25988J626J182J051J070Q67N98O05O34J35p85j414j332p46jP15J212J385
58787E32790J395J442J451J358J489K195L354M639N980P290Q097Q077P618P174
58773E94349O429M880K937J517P08k11j539k775l608m304n023n478n476n140m464
58758E72802l378k273j697j432p03N72J594J969K339L297M418M900M688M427M700
58743E96223N607O815P751Q145Q409R174J0344J1198J1441J1566J1930J2172J1885
58730G22660J1406J1418J2063J2846J3189J2905J2149J1111R752Q001O292N468
$$ y = [576362, 571619, 566699, 562414, 558870, 555647, 552540, 549635, 546863, 543862, 540313, 536279, 532270, 528997, 526832, 525469, 524295, 523091, 522122, 521530, 521009, 520229, 519285, 518574, 518409, 518847, 519680, 520571, 521404, 522474, 524084, 525988, 527614, 528796, 529847, 530917, 531784, 532382, 532987, 533621, 533756, 532971, 531557, 530225, 529479, 529478, 530193, 531405, 532790, 534185, 535627, 537078, 538436, 539925, 542120, 545474, 550113, 556093, 563383, 571480, 579557, 587175, 594349, 600778, 605658, 608595, 610112, 610820, 610609, 609070, 606295, 602687, 598383, 593360, 587882, 582406, 577266, 572802, 569424, 567151, 565454, 564022, 563319, 563891, 565485, 567454, 569793, 573090, 577508, 582408, 587096, 591523, 596223, 601830, 608645, 616396, 624541, 632950, 642124, 652468, 663666, 675107, 686673, 698603, 710775, 722660, 734066, 745484, 757547, 770393, 783582, 796487, 808636, 819747, 829499, 837500, 843792, 849260]
58718H49260N806O489O568O113N853O031O386O951P946Q969R289Q880Q315P553
58704I50409N826K915m34l650p011j0773j4378j7099j8970k0609k2461k4367k5714
58691G93684k5973k5386k4837k4532k3340k0297j6378j3508j2091j0832r059p689
58679E79762p471p698p377o532n654m821m086l806l875l443k058l57R98K266L837
58664E29685N324O286P091Q293R662J0557J0725J0109Q489O019L571J734P6j924
58650F15697l732m401l929l141k522j955j433j237j436j788k120k435k717k937
58636E79914l070k993k606k178k153k456k442j762p47J90R79J499J498J171J160
58621E66004J580J692R76q0o80n81J71J683L838N962P381P959P907P568P500Q024
$$ y = [849260, 855066, 861555, 868123, 874236, 880089, 886120, 892506, 899457, 907403, 916372, 925661, 934541, 942856, 950409, 956235, 959150, 958716, 955066, 948055, 937282, 922904, 905805, 886835, 866226, 843765, 819398, 793684, 767711, 742325, 717488, 692956, 669616, 649319, 632941, 619433, 607342, 596510, 587451, 579762, 572291, 564593, 557216, 550684, 545030, 540209, 536123, 532317, 528442, 524999, 522941, 522584, 523582, 525848, 529685, 535009, 541295, 548386, 556679, 566341, 576898, 587623, 597732, 606221, 612240, 615811, 617545, 617621, 615697, 611965, 607564, 603635, 600494, 597972, 596017, 594584, 593347, 591911, 590123, 588003, 585568, 582851, 579914, 576844, 573851, 571245, 569067, 566914, 564458, 562016, 560254, 559507, 559697, 560676, 562175, 563673, 564844, 566004, 567584, 569276, 570252, 570172, 569492, 568911, 569082, 570765, 574603, 580565, 587946, 595905, 603812, 611380, 618880, 626904]
58605F26904Q434P479N004K304M76p08j850k803l105k780k113j357j031j716k979
58590F30159l419k386p57M67J438K616L768M638N774P656R743J1115J1546J1230
58576F93588J0292R188Q702Q826Q551P509O693O732O678N747N069O244Q988J1738
58562H04545J3932J6171J8652K0968K3050K4898K5668K4485K1998J9774J8182
58551A032323J6049J2454P779K924j540n355q532j1423j4249j6650j8167j8836
58539I76777j8854j8235j7324j6970j7394j7688j7269j6988j7729j8659j8283
58528G81384j6511j4431j2521j0530q691p550o728n277l197j369o2J256K647L381
58514G01801L047K054J009L33L43R11J289J046P89J121J528J299R72J579K848
$$ y = [626904, 635338, 642817, 647821, 650125, 650601, 649893, 648043, 645240, 642135, 639355, 637242, 635885, 634854, 633138, 630159, 626740, 624354, 623597, 624064, 625502, 628118, 631886, 636524, 642298, 649954, 659697, 670812, 682358, 693588, 703880, 713068, 721770, 730596, 739147, 746656, 753349, 760081, 766759, 772506, 777575, 783819, 792807, 804545, 818477, 834648, 853300, 874268, 897318, 922216, 947884, 972369, 994367, 1014141, 1032323, 1048372, 1060826, 1068605, 1071529, 1069989, 1064634, 1056102, 1044679, 1030430, 1013780, 995613, 976777, 957923, 939688, 922364, 905394, 888000, 870312, 853043, 836055, 818326, 799667, 781384, 764873, 750442, 737921, 727391, 718700, 711150, 704422, 699145, 695948, 694579, 694517, 695773, 698420, 701801, 704848, 706902, 707911, 708244, 708587, 709498, 710787, 711833, 712622, 713743, 715271, 716570, 717542, 719121, 721969]
58499G21969L556L349K958K754K345J611R43N02J07k18m48r06j571j628p43p9
58483G34501o71j518q80J069K612L200L894N271O711P933R427J0977J1401J0248
58469H04175Q442O780N062L020R36j139l594o291q294q924q411p334o234n633
58455G72561n586n326m150k461r82M94K409M086M494M015L845L945L229J596P5
58440G82244r92k185l313l323k121p90J76J251K277K348J699J893L460N010N357
58425G92991N096N323O181P338Q714J0015J0678J0817J1195J1901J2172J1815
58413I04236J1428J0797Q604M394l76l952n886o521o062m946m119m171m749n133
58399H93544m885l830k282j157r33o66Q45L070M309M116L588L317K704J555O97
$$ y = [721969, 725525, 728874, 731832, 734586, 736931, 738542, 739485, 739987, 740094, 739876, 739428, 738522, 736951, 735323, 734580, 734501, 733830, 732312, 731432, 732501, 735113, 738313, 742207, 747478, 754189, 762122, 771549, 782526, 793927, 804175, 812617, 819397, 824459, 827479, 828415, 827276, 823682, 817391, 809097, 800173, 791762, 784428, 778194, 772561, 766975, 761649, 757499, 755038, 754056, 754550, 756959, 761045, 765539, 769554, 773399, 777344, 780573, 782169, 782244, 781252, 779067, 775754, 772431, 770310, 769520, 769696, 770947, 773224, 775572, 777271, 779164, 782624, 787634, 792991, 798087, 803410, 809591, 816929, 825643, 835658, 846336, 857153, 868348, 880249, 892421, 904236, 915664, 926461, 935065, 939459, 939083, 935131, 929245, 922724, 916662, 911716, 907597, 903426, 898677, 893544, 888659, 884829, 882547, 881390, 880457, 879791, 880636, 883706, 888015, 892131, 895719, 899036, 901740, 903295, 903992]
58384I03992N37M92K94M52J019J236Q03L06J60K87R07K268L600L907L739M517
58368I28516O049O641N857N228N820O985Q034R239J0624J1523J1929J2616J3466
58355A042527J3464J2724J2632J3414J3621J2565J1310J0500R325P488O196O087
58343A171853O122N529N155N825P014Q135R497J1084J2077J2489J3539J5518J6988
58330A300825J7009J6480J6377J6394J6234J6446J7029J7006J6315J6285J7217
58319A483617J7424J5839J3738J2714J2608J2691J3124J4071J4770J4730J4500
58308A639826J4478J4337J4284J5125J6603J7468J7845J9323K2048K4022K4224
58297A839583K4042K4594K4927K4233K3485K3524K3601K3222K3404K4701K5963
$$ y = [903992, 904529, 905021, 905315, 905767, 906786, 908022, 908825, 909131, 909291, 909578, 910485, 912753, 916353, 920260, 923999, 928516, 934565, 941206, 947063, 952291, 958111, 965096, 973130, 982369, 992993, 1004516, 1016445, 1029061, 1042527, 1055991, 1068715, 1081347, 1094761, 1108382, 1120947, 1132257, 1142757, 1152082, 1159570, 1165766, 1171853, 1177975, 1183504, 1188659, 1194484, 1201498, 1209633, 1219130, 1230214, 1242291, 1254780, 1268319, 1283837, 1300825, 1317834, 1334314, 1350691, 1367085, 1383319, 1399765, 1416794, 1433800, 1450115, 1466400, 1483617, 1501041, 1516880, 1530618, 1543332, 1555940, 1568631, 1581755, 1595826, 1610596, 1625326, 1639826, 1654304, 1668641, 1682925, 1698050, 1714653, 1732121, 1749966, 1769289, 1791337, 1815359, 1839583, 1863625, 1888219, 1913146, 1937379, 1960864, 1984388, 2007989, 2031211, 2054615, 2079316, 2105279]
58286B105279K6398K6930K8387L0188L1896L4083L6677L8578L9769M1515M3766
58275B483466M4858M4742M5679M8648N1862N4002N6056N8711O0939O2546O5144
58264C076653O9108P2548P4757P7510Q1480Q4630Q5940Q7442R0696R4390R7225
58253C992379R9930J02710J04088J04095J05153J07997J10335J11415J13952J19508
58243E071562J25988J32020J39670J50227J61406J71457J82071J94491K06755
58234F535647K17610K29163K42875K57001K70597K85908L04175L23427L42982
58225I009385L65440L91763M19389M47779M80416N18626N59263O01421O49287
58216A3442769P05217P66357Q31615R05407R91072J087454J195480J321008J467822
$$ y = [2105279, 2131677, 2158607, 2186994, 2217182, 2249078, 2283161, 2319838, 2358416, 2398185, 2439700, 2483466, 2528324, 2573066, 2618745, 2667393, 2719255, 2773257, 2829313, 2888024, 2948963, 3011509, 3076653, 3145761, 3218309, 3293066, 3370576, 3452056, 3536686, 3622626, 3710068, 3800764, 3895154, 3992379, 4092309, 4195019, 4299107, 4403202, 4508355, 4616352, 4726687, 4838102, 4952054, 5071562, 5197550, 5329570, 5469240, 5619467, 5780873, 5952330, 6134401, 6328892, 6535647, 6753257, 6982420, 7225295, 7482296, 7752893, 8038801, 8342976, 8666403, 9009385, 9374825, 9766588, 10185977, 10633756, 11114172, 11632798, 12192061, 12793482, 13442769, 14147986, 14914343, 15745958, 16651365, 17642437, 18729891, 19925371, 21246379, 22714201]
58207B2714201J635675J828779K058038K331753K653416L032519L488272M040424
58199D3783077M708142N521609O523009P753902R254652J1075339J3265196J5840769
58191A17725695J8770972K1981397K5343335K8650114L1591856L3664117L3999522
58184C11727008L1389091K4831138J4419055J762490j0629417k0562426k6963160
58177C25973779k9840054k9823208k7785817k4582939k0837438j6950942j3390586
58170A62762795j0837220r832021j0254905j1308931j2097563j2176107j1589456
58163H4666592j0573354r343846q073560o892682n858163m966179m206068l576304
58155C1176436l060503k628312k262581j960473j710786j494496j305841j151551
$$ y = [22714201, 24349876, 26178655, 28236693, 30568446, 33221862, 36254381, 39742653, 43783077, 48491219, 54012828, 60535837, 68289739, 77544391, 88619730, 101884926, 117725695, 136496667, 158478064, 183821399, 212471513, 244063369, 277727486, 311727008, 343116099, 367947237, 382366292, 384128782, 373499365, 352936939, 325973779, 296133725, 266310517, 238524700, 213941761, 193104323, 176153381, 162762795, 151925575, 142093554, 131838649, 120529718, 108432155, 96256048, 84666592, 74093238, 64749392, 56675832, 49783150, 43924987, 38958808, 34752740, 31176436, 28115933, 25487621, 23225040, 21264567, 19553781, 18059285, 16753444, 15601893]
58147A5601893j030045r29030q41988p70840p13522o63056o17530n78633n42226
58138H915023n01776m58892m19966l84968l49515l14886k85820k61133k36593
58129E701474k14698k01848j97508j95067j91755j89220j86031j78330j67064
58120C979953j56785j48015j37847j26923j18758j12991j06098r8121r2347q8900
58110B793168q4750p9565p5741p3099o9050o3676n9567n7002n4081n1108n0026
58099B075503n0083m8670m6014m4644m4694m4013m2356m1248m0220l7335l3136
58088A603090l0143k8687k6924k4585k3155k2669k1852k1020k1587k3004k3364
58077A336100k2567k2022k1836k1191k0795k1855k3443k3714k3028k3018k3485
$$ y = [15601893, 14571848, 13642818, 12800830, 12029990, 11316468, 10653412, 10035882, 9457249, 8915023, 8413247, 7954355, 7534389, 7149421, 6799906, 6485020, 6199200, 5938067, 5701474, 5486776, 5284928, 5087420, 4892353, 4700598, 4511378, 4325347, 4147017, 3979953, 3823168, 3675153, 3537306, 3410383, 3291625, 3178634, 3072536, 2974415, 2882068, 2793168, 2708418, 2628853, 2553112, 2480013, 2410963, 2347287, 2287720, 2230718, 2176637, 2125529, 2075503, 2025420, 1976750, 1930736, 1886092, 1841398, 1797385, 1755029, 1713781, 1673561, 1636226, 1603090, 1572947, 1544260, 1517336, 1492751, 1469596, 1446927, 1425075, 1404055, 1382468, 1359464, 1336100, 1313533, 1291511, 1269675, 1248484, 1227689, 1205834, 1182391, 1158677, 1135649, 1112631, 1089146]
58066A089146k3078k2018k1205j9761j6611j3431j2665j3473j3002j0974r630
58055I13298r755j0115j0473j1770j3456j3819j2909j2272j1994j0852r132q352
58043G78399q347p531n933n146n307n004m169m274n436o023n530n365o353p730
58029F96251q900j0091j1057j1125j0725j0934j1456j0969r453q215p646o927
58017E78753n967n658o015n936m987l867l083k636k757l406l476k150o44p49k039
58002E25383k448j293J72J031J598K104K287K327K667L048L053L214M144N100
57988E52387M963M010L113K022K25j351j509r73j322k417l039l389m598o250o819
57973E35053o327o198o675o693o192o226o791o696n644m378k906p35J253J449
$$ y = [1089146, 1066068, 1044050, 1022845, 1003084, 986473, 973042, 960377, 946904, 933902, 922928, 913298, 903543, 893428, 882955, 871185, 857729, 843910, 831001, 818729, 806735, 795883, 786751, 778399, 770052, 762521, 756588, 751442, 746135, 741131, 736962, 732688, 727252, 721229, 715699, 710334, 703981, 696251, 687351, 677260, 666203, 655078, 644353, 633419, 621963, 610994, 601541, 593326, 585680, 578753, 572786, 567128, 561113, 555177, 550190, 546323, 543240, 540604, 537847, 534441, 530965, 528815, 528171, 527422, 525383, 522935, 521642, 521814, 522845, 524443, 526547, 528834, 531161, 533828, 536876, 539929, 543143, 547287, 552387, 557350, 561360, 564473, 566495, 566720, 565369, 563860, 562887, 561565, 559148, 556109, 552720, 548122, 541872, 535053, 528726, 522528, 515853, 509160, 502968, 496742, 489951, 483255, 477611, 473233, 470327, 469592, 470845, 472294]
57959D72294J25q12p26p20j237j460j285j606k369k437j761j566k105k273j721
57944D50341j314j268p99O9M11L83J094K320K518J523R88J598K158K059K340L473
57928D67894M228L796L122L121L250K876K434K331K151J702J436J208P6k047m072
57913D93506n519p003q515r018q404q023q543r077r059r137r419q803p139o099
57899C79748o646p314o421m513l246l066l295l397l083k087q38k96m35n5J205
57884C36261K117J977J912K988M460N199N471N967O202N395M080L399L477L634
57870C92539L537L045J685n88k740l831m218m741n338n456n212n080m915m243
57856C54444l114j913p12N34J544K113K521L052L604M159N025O152O858O740O221
$$ y = [472294, 472419, 471607, 470881, 470161, 468924, 467464, 466179, 464573, 462204, 459767, 458006, 456440, 454335, 452062, 450341, 449027, 447759, 446960, 447029, 447440, 447823, 448917, 451237, 453755, 455278, 456266, 457864, 460022, 462081, 464421, 467894, 472122, 475918, 479040, 482161, 485411, 488287, 490721, 493052, 495203, 496905, 498341, 499549, 499625, 497578, 493506, 487987, 480984, 472469, 463451, 455047, 447024, 438481, 429404, 420345, 411208, 401789, 392986, 385847, 379748, 373102, 365788, 359367, 354854, 351608, 348542, 345247, 341850, 338767, 336680, 335842, 335546, 335111, 335056, 336261, 338378, 340355, 342267, 345255, 349715, 354914, 360385, 366352, 372554, 377949, 382029, 385428, 388905, 392539, 396076, 399121, 400806, 400218, 397478, 393647, 389429, 384688, 379350, 373894, 368682, 363602, 358687, 354444, 351330, 349417, 348705, 349239, 350783, 352896, 355417, 358469, 362073, 366232, 371257, 377409, 384267, 391007, 397228]
57841C97228N787N372M869M449L972K884J216j27o57j045k053l470m585n062m826
57826D03952l948l051k985l640l872l061j881j095n83j6M73R20J798L063L825
57811C89899L552K762K041J377Q87J040J446O21k176n799q671j0411j1266j1115
57797C54187j0029q910q508q469q167p718p329o570n179l868l366l407l353l152
57783B66162k856k103q54J61N45R22J734K346K229K018K399K963L299M123N957
57768B89045P603P578O415N942O635P242O813N681M463L324K327J496N31q07k116
57753C52172k895l342l867m142l617k619k003j942j957j882j903j864j492j084
57739C17563j067j175r36p22j289k376k833k173j085l76k64o72j354j572n80J322
$$ y = [397228, 403015, 408387, 413256, 417705, 421677, 424561, 425777, 425650, 424993, 423948, 421895, 418425, 413840, 408778, 403952, 400004, 396953, 393968, 390328, 386456, 383395, 381514, 380419, 379836, 379820, 380293, 381213, 383011, 386074, 389899, 393451, 396213, 398254, 399631, 400518, 401558, 403004, 403625, 401449, 395650, 386979, 376568, 365302, 354187, 344158, 335248, 326740, 318271, 310104, 302386, 295057, 288487, 283308, 279440, 276074, 272667, 269314, 266162, 263306, 261203, 260349, 260510, 261055, 261977, 263711, 266057, 268286, 270304, 272703, 275666, 278965, 283088, 289045, 296648, 304226, 310641, 316583, 323218, 330460, 337273, 342954, 347417, 350741, 353068, 354564, 355095, 354288, 352172, 349277, 345935, 342068, 337926, 334309, 331690, 329687, 327745, 325788, 323906, 322003, 320139, 318647, 317563, 316496, 315321, 314385, 313663, 312374, 309998, 307165, 304992, 303907, 303531, 303267, 302595, 301241, 299669, 299089, 300411]
57723C00411K803K921J990R61M19L59N24O80P55Q11Q00N11p5o03p62o58n67n91
57705C10689p06q58q02k77N34J120J420J859K524K971L110L437M057M325L933
57690C37336L436L122K373R16k69l22J06r4o94o43K43J341K648M801P804J1001
57674C73105J4352J8664K4425L1352L9288M8581N9315P0776Q1983R1934R8672
57663I52447R8304Q5858N8462J8901k3995n9762q2360r2184r2764q6999p6909
57652F98999o5043n3930m4504l6371k9430k4071k0075j6639j3481j0963r092p413
57640C67987n871m803m099l198j973q09J58J108J838J894J461J309J731K143J964
57625C60840J270M68j40m12m37n60r89j411j393r89n75l44l25n91r89j005m82
$$ y = [300411, 303214, 306135, 308125, 309086, 309505, 309864, 310388, 311068, 311823, 312634, 313434, 313945, 313870, 313267, 312505, 311847, 311280, 310689, 309983, 309125, 308323, 308046, 308580, 309700, 311120, 312979, 315503, 318474, 321584, 325021, 329078, 333403, 337336, 340772, 343894, 346267, 347183, 346914, 346592, 346698, 346604, 345910, 345267, 345510, 346851, 349499, 354300, 362104, 373105, 387457, 406121, 430546, 461898, 501186, 549767, 609082, 679858, 761841, 853775, 952447, 1050751, 1136609, 1195071, 1213972, 1189977, 1130215, 1047855, 955671, 862907, 775908, 698999, 633956, 580026, 535522, 499151, 469721, 445650, 425575, 408936, 395455, 384492, 375400, 367987, 362116, 357313, 353214, 350016, 348043, 347234, 347392, 348500, 350338, 352232, 353693, 355002, 356733, 358876, 360840, 362110, 362578, 362438, 362026, 361589, 361029, 360040, 358629, 357236, 356247, 355672, 355328, 355003, 354412, 353423, 352418, 351936]
57608C51936q6m36j130j265o25L10J180J807J864J194L18m3K24P41J159J080Q1
57591C58309j466k316j888j204j329j696j177j26J74l36n33j19K2m34o84k15N07
57574C45489J008J239R19k32j366j101M21J446J123O46J104J703J206J01r7R54
57558C54563K180K678K491J956J293R27J438K858M433N265N061M187L146K110
57544C94586R81j04o22k28P02J449J739J861K146K676L320L694L300K197J301
57529D18998J417K148K405J898J422J657K364K927L067K924K809L073L798M592
57515D55499M915M630L995L413L426M463O120P100O604N393M757M831M763M251
57501E24160L807L644L376K915K739L021L265K983K251J490J200J772K911L542
$$ y = [351936, 351850, 351414, 350284, 349019, 348394, 348704, 349884, 351691, 353555, 354749, 355067, 355024, 355248, 355989, 357148, 358228, 358309, 356843, 354527, 352639, 351435, 350106, 348410, 347233, 347107, 347281, 346945, 346412, 346293, 346315, 345881, 345197, 344982, 345489, 346497, 347736, 348655, 348423, 347057, 345956, 346377, 347823, 348946, 349592, 350696, 352399, 353605, 353706, 353609, 354563, 356743, 359421, 361912, 363868, 365161, 366088, 367526, 370384, 374817, 380082, 385143, 389330, 392476, 394586, 395567, 395463, 394841, 394613, 395315, 396764, 398503, 400364, 402510, 405186, 408506, 412200, 415500, 417697, 418998, 420415, 422563, 424968, 426866, 428288, 429945, 432309, 435236, 438303, 441227, 444036, 447109, 450907, 455499, 460414, 465044, 469039, 472452, 475878, 480341, 486461, 493561, 500165, 505558, 510315, 515146, 519909, 524160, 527967, 531611, 534987, 537902, 540641, 543662, 546927, 549910, 552161, 553651, 554851, 556623, 559534, 563076]
57487E63076K963J909J584K029K366K347K470K673K344J635J495K128K695K875
57473E94589L339M206M339L037J399R85J871K858L137K886K590K471K473K412
57459F32592K266K382L101M111M640M484M276M651N564O560P289P636P706P633
57445G04891P159N780L777K556L134M704N694N811N853N984N639M988M923N469
57431G76362N759N739O269P229P261N998M922N173O040O511O814P369P559O871
57417H65876O121O291O973P204O987O872O796O516O459O971P374O951O334O687
57403I60412P914Q869R011Q810Q705Q704Q800Q959Q842Q311P953Q336R042R217
57389A081885Q819Q581Q936R692J0516J1156J1369J1199J1069J1117J0926J0349
$$ y = [563076, 566039, 567948, 569532, 571561, 573927, 576274, 578744, 581417, 583761, 585396, 586891, 589019, 591714, 594589, 597928, 602134, 606473, 609510, 610909, 611894, 613765, 616623, 619760, 622646, 625236, 627707, 630180, 632592, 634858, 637240, 640341, 644452, 649092, 653576, 657852, 662503, 668067, 674627, 681916, 689552, 697258, 704891, 712050, 717830, 721607, 724163, 727297, 732001, 737695, 743506, 749359, 755343, 760982, 765970, 770893, 776362, 782121, 787860, 794129, 801358, 808619, 814617, 819539, 824712, 830752, 837263, 844077, 851446, 859005, 865876, 871997, 878288, 885261, 892465, 899452, 906324, 913120, 919636, 926095, 933066, 940440, 947391, 953725, 960412, 968326, 977195, 986206, 995016, 1003721, 1012425, 1021225, 1030184, 1039026, 1047337, 1055290, 1063626, 1072668, 1081885, 1090704, 1099285, 1108221, 1117913, 1128429, 1139585, 1150954, 1162153, 1173222, 1184339, 1195265, 1205614]
57377A205614R975J0138J0156R384Q396Q179Q674R047R049R042R084Q970Q915
57364A324623R259R662R558R236R482J0348J1172J1751J2420J3037J2913J1973
57352A455434J1163J1334J2331J3353J3810J3681J3461J3704J4311J4468J3777
57341A600827J2993J3075J3864J4446J4539J4594J4769J4720J4457J4457J4832
57330A757573J5164J5267J5366J5452J5258J4997J5283J6094J6531J6018J5133
57319A928136J4871J5516J6519J7101J6812J5895J5230J5527J6469J7105J7096
57308B106277J7024J7309J7616J7620J7724J8360J9034J8802J7604J6543J6595
57297B300508J7526J8354J8598J8641J8878J9069J8853J8521J8688J9396K0101
$$ y = [1205614, 1215589, 1225727, 1235883, 1245267, 1253663, 1261842, 1270516, 1279563, 1288612, 1297654, 1306738, 1315708, 1324623, 1333882, 1343544, 1353102, 1362338, 1371820, 1382168, 1393340, 1405091, 1417511, 1430548, 1443461, 1455434, 1466597, 1477931, 1490262, 1503615, 1517425, 1531106, 1544567, 1558271, 1572582, 1587050, 1600827, 1613820, 1626895, 1640759, 1655205, 1669744, 1684338, 1699107, 1713827, 1728284, 1742741, 1757573, 1772737, 1788004, 1803370, 1818822, 1834080, 1849077, 1864360, 1880454, 1896985, 1913003, 1928136, 1943007, 1958523, 1975042, 1992143, 2008955, 2024850, 2040080, 2055607, 2072076, 2089181, 2106277, 2123301, 2140610, 2158226, 2175846, 2193570, 2211930, 2230964, 2249766, 2267370, 2283913, 2300508, 2318034, 2336388, 2354986, 2373627, 2392505, 2411574, 2430427, 2448948, 2467636, 2487032, 2507133]
57286B507133K0552K1075K1785K2210K1920K1140K0374J9911J9903K0457K1287
57275B737747K1847K2063K2447K3166K3668K3563K3244K3126K3056K2998K3505
57264B990430K4747K5874K6255K6624K7879K9398K9850K9291K9080K9763L0453
57253C299644L0457L0260L0479L0905L1019L0747L0265K9666K9094K8662K8137
57242C629335K7265K6461K6417K6992K7231K6798K6443K6784K7369K7474K7206
57231C925775K7206K7655K8090K7926K6856K4939K2642K0667J9471J9069J9233
57220D189529J9605J9673J9077J8044J7150J6605J6205J5957J6211J6988J7730
57209D382774J8051J8302J9047K0239K1261K1566K1138K0369J9721J9385J9243
$$ y = [2507133, 2527685, 2548760, 2570545, 2592755, 2614675, 2635815, 2656189, 2676100, 2696003, 2716460, 2737747, 2759594, 2781657, 2804104, 2827270, 2850938, 2874501, 2897745, 2920871, 2943927, 2966925, 2990430, 3015177, 3041051, 3067306, 3093930, 3121809, 3151207, 3181057, 3210348, 3239428, 3269191, 3299644, 3330101, 3360361, 3390840, 3421745, 3452764, 3483511, 3513776, 3543442, 3572536, 3601198, 3629335, 3656600, 3683061, 3709478, 3736470, 3763701, 3790499, 3816942, 3843726, 3871095, 3898569, 3925775, 3952981, 3980636, 4008726, 4036652, 4063508, 4088447, 4111089, 4131756, 4151227, 4170296, 4189529, 4209134, 4228807, 4247884, 4265928, 4283078, 4299683, 4315888, 4331845, 4348056, 4365044, 4382774, 4400825, 4419127, 4438174, 4458413, 4479674, 4501240, 4522378, 4542747, 4562468, 4581853, 4601096]
57198D601096J9178J9339J9799K0150J9801J8716J7528J6849J6764J6954J7048
57187D803222J6762J5961J4772J3479J2353J1637J1447J1495J1182J0325R448
57176D942083Q976Q441P158N399M053L217K039J76j425j758j148p67j244k356
57162D972844l906o111q947j1668j3385j4046j4480j5441j6924j8406j9473j9875
57150D810182j9402j8232j7222j7100j7311j6434j4008j1278r746r637j0225j1020
57138D638567j1874j2531j2900j3522j4970j6969j8758k0103k1314k2351k2654
57127D450621k1817j9883j7080j3716j0210o751l027J168N346Q750J1222J3103
57115D397726J4636J6019J7815K0740K5260L1844M1155N3361O7733Q3792J02497
$$ y = [4601096, 4620274, 4639613, 4659412, 4679562, 4699363, 4718079, 4735607, 4752456, 4769220, 4786174, 4803222, 4819984, 4835945, 4850717, 4864196, 4876549, 4888186, 4899633, 4911128, 4922310, 4932635, 4942083, 4951059, 4959500, 4966658, 4972057, 4976110, 4979327, 4981366, 4981542, 4980117, 4978359, 4977211, 4976444, 4975200, 4972844, 4968938, 4962827, 4953880, 4942212, 4928827, 4914781, 4900301, 4884860, 4867936, 4849530, 4830057, 4810182, 4790780, 4772548, 4755326, 4738226, 4720915, 4704481, 4690473, 4679195, 4669449, 4659812, 4649587, 4638567, 4626693, 4614162, 4601262, 4587740, 4572770, 4555801, 4537043, 4516940, 4495626, 4473275, 4450621, 4428804, 4408921, 4391841, 4378125, 4367915, 4361164, 4358137, 4359305, 4364651, 4373401, 4384623, 4397726, 4412362, 4428381, 4446196, 4466936, 4492196, 4524040, 4565195, 4618556, 4686289, 4770081, 4872578]
57104D872578J25507J53712J87461K27975K77502L38259M12204N01702O09214
57095G706114P36309Q83694J051931J240660J446690J663463J882303K093358
57087A8704522K285812K448860K573209K651136K675041K636329K524930K329281
57079C8829120K039240J653766J187908O70332J31804m04194r20404j399081j819474
57070C9969017k162021k413952k571849k640919k632381k560306k439364k283935
57062B0264290k107382j920822j732657j549351j375936j215509j069237r37612
57054H355784q21183p19703o31512n54653m88037m30886l81753l38953l01533
57045C687571k69142k41253k17123j96104j77511j60548j44823j30516j17724
$$ y = [4872578, 4998085, 5151797, 5339258, 5567233, 5844735, 6182994, 6595198, 7096900, 7706114, 8442423, 9326117, 10378048, 11618708, 13065398, 14728861, 16611164, 18704522, 20990334, 23439194, 26012403, 28663539, 31338580, 33974909, 36499839, 38829120, 40868360, 42522126, 43710034, 44380366, 44512170, 44107976, 43187572, 41788491, 39969017, 37806996, 35393044, 32821195, 30180276, 27547895, 24987589, 22548225, 20264290, 18156908, 16236086, 14503429, 12954078, 11578142, 10362633, 9293396, 8355784, 7534601, 6814898, 6183386, 5628733, 5140696, 4709810, 4328057, 3989104, 3687571, 3418429, 3177176, 2960053, 2763949, 2586438, 2425890, 2281067, 2150551, 2032827]
57036B032827j06204r5924q7116p9478p2123o4720n7724n1099m3903l5623k6817
57025A312096j7771p612M610J9169L6541N7336Q0690J04752J29382J54473J72372
57014B046038J65697J19843L9636n0108j22541j65736j82913j82083j69617j50819
57004A347397j30572j11695r4609p9344o6457n5900m6699l8352l1402k6208k2161
56993F43998j8675j6048j4682j4070j3241j1827j0202q696p197n490l624j958
56981E18288j027j282k766n086p819j0814j3893j6420j7574j7138j5700j3935
56969C94834j2032j0012q182o795n451l407n04K658N525Q047J0271J2003J3161
56956D00116J3939J4184J3020R622M286j728p228j1591j4490j5739j5635j4893
$$ y = [2032827, 1926623, 1830699, 1743583, 1664105, 1591982, 1527262, 1469538, 1418439, 1374536, 1338913, 1312096, 1294325, 1286713, 1291323, 1310492, 1347033, 1404369, 1485059, 1589811, 1719193, 1873666, 2046038, 2211735, 2331578, 2371214, 2321106, 2198565, 2032829, 1849916, 1667833, 1498216, 1347397, 1216825, 1105130, 1010521, 931177, 864720, 808820, 762121, 723769, 692367, 666159, 643998, 625323, 609275, 594593, 580523, 567282, 555455, 545253, 536557, 529360, 523870, 520246, 518288, 517261, 515979, 513213, 508127, 500308, 489494, 475601, 459181, 441607, 424469, 408769, 394834, 382802, 372790, 364608, 357813, 352362, 348955, 348451, 351109, 356634, 364681, 374952, 386955, 400116, 414055, 428239, 441259, 450881, 455167, 453439, 446211, 434620, 420130, 404391, 388756, 373863]
56944C73863j3941j2484j0090p080m408k626j239O48L287O280R416J2918J6666
56931C71210J9825K1635K2008K0749J6852R631L54q316j4651j8720k0981k1308
56919C98288j9927j8117j6953j6089j4645j2727j1120r878q386o626n402n140
56907B53278n283n164m765m314l638k479j143l18j92r4O75J889K706K968L648
56892B37774N531Q006R889J1113J2595J4578J6184J6824J6833J6222J3959R350
56880C88858L355k263o504r144j0095r694q940q395p342n008k065L08K337N271
56866C30679R392J3827J8237K3200K8658L3487L7105M0119M2572M2619L7946K8027
56854F85868J4406m81j4115k4283k9894l1441l0122k6758k1905j6451j1247o261
$$ y = [373863, 359922, 347438, 337348, 330268, 325860, 323234, 321995, 322643, 325930, 332210, 341626, 354544, 371210, 391035, 412670, 434678, 455427, 472279, 481910, 482264, 473948, 459297, 440577, 419596, 398288, 378361, 360244, 343291, 327202, 312557, 299830, 288710, 278832, 270446, 263820, 258418, 253278, 247995, 242831, 238066, 233752, 230114, 227635, 226492, 226174, 225982, 225888, 226563, 228452, 231158, 234126, 237774, 243305, 251311, 261200, 272313, 284908, 299486, 315670, 332494, 349327, 365549, 379508, 388858, 392213, 389950, 383446, 374302, 364207, 354513, 345573, 337178, 329836, 324828, 322763, 323071, 325408, 330679, 340071, 353898, 372135, 395335, 423993, 457480, 494585, 534704, 577276, 619895, 657841, 685868, 700274, 699793, 685678, 661395, 631501, 600060, 569938, 543180, 521275, 504824, 493577, 487316]
56842D87316p97N476J2290J9488K7262L5522M3673N1258N8343O4675O8652O7630
56830I40788N9450M3690K1882k920k6731m5738n7808o3193o3620o0610n4876m7077
56818F43237l8444l0278k3056j6279r143j232P220J5640K3609L1065L7892M3482
56806F83713M6874M7148M3231L3795J8363j150k0738l6606m7026n2080n2600m9849
56794F13075m5346m0149l4505k8583k2925j7688j2234o238n81L726P046J0532
56782D26130J4455J8106K0974K2710K2109J7507Q698k400j3222k2077k8234l1618
56770D53138l2829l2687l1367k8555k4655k0967j8319j6256j4043j1744r816q301
56758B03599p058o284o138o138n548m188k517j154o12j126k254k959k576j600
$$ y = [487316, 486519, 491995, 504285, 523773, 551035, 586557, 630230, 681488, 739831, 804506, 873158, 940788, 1000238, 1043928, 1065810, 1062890, 1036159, 990421, 932613, 869420, 805800, 745190, 690314, 643237, 604793, 574515, 551459, 535180, 526037, 524805, 532025, 547665, 571274, 602339, 640231, 683713, 730587, 777735, 820966, 854761, 873124, 871974, 851236, 814630, 767604, 715524, 662924, 613075, 567729, 527580, 493075, 464492, 441567, 423879, 411645, 405407, 404826, 408552, 415598, 426130, 440585, 458691, 479665, 502375, 524484, 541991, 550689, 548289, 535067, 512990, 484756, 453138, 420309, 387622, 356255, 327700, 303045, 282078, 263759, 247503, 233460, 221716, 211900, 203599, 196541, 190257, 184119, 177981, 172433, 168245, 165728, 164574, 163962, 162836, 160582, 157623, 155047, 153447]
56744A53447j080j425k149k619k601k135j378o14j37k5j77n26r29j024m93M91
56728A36626J297J476J179Q31N63J87l58p20m77K98R62R04J66o17q15l96O6p2
56710A41100q16j404j038J50J108R84O0n92k98O00J173Q45n8o05k11O62R80L76
56692A43016m54p04m88m98j022j661j917j664j139p95j001j630j999j538m35N83
56676A26654R30N19l65j173j336q08j79J0j28j85j06m4J12N62J130J484J710K142
56658A30929K759L187L199K806K029J132Q58J734L182L981L763L375L595M092
56644A70621L960K935J661R25Q62R26N59j23m88k84J4k0j25P2J98l52j283j526
56626A78532n91Q38J799K018J803J448J043O07K34J05L28O69P13M57L61N27M05
$$ y = [153447, 152367, 150942, 148793, 146174, 143573, 141438, 140060, 139446, 139309, 139284, 139107, 138581, 137652, 136628, 136135, 136626, 137923, 139399, 140578, 141409, 141972, 142159, 141801, 141081, 140604, 140902, 141864, 142768, 142934, 142317, 141502, 141106, 141172, 141100, 140284, 138880, 137842, 137992, 139100, 140084, 140144, 139552, 139254, 139854, 141027, 141872, 141814, 141209, 140998, 141660, 142640, 143016, 142562, 141858, 141370, 140872, 139850, 138189, 136272, 134608, 133469, 132674, 131673, 130043, 128044, 126506, 126071, 126654, 127584, 128103, 127738, 126565, 125229, 124421, 124242, 124252, 124124, 123939, 123833, 123789, 123901, 124463, 125593, 127077, 128787, 130929, 133688, 136875, 140074, 142880, 144909, 146041, 146899, 148633, 151815, 155796, 159559, 162934, 166529, 170621, 174581, 177516, 179177, 180102, 180964, 181890, 182449, 182326, 181838, 181554, 181568, 181548, 181423, 181495, 181693, 181341, 180058, 178532, 177941, 178779, 180578, 182596, 184399, 185847, 186890, 187497, 187731, 187836, 188164, 188833, 189546, 190003, 190364, 190891, 191296]
56609A91296k34n63K00J407J690Q21j17l66k76l14l21o0K61M21N25N94M38J56
56591A95558J56M64N99M02L58P96J403J782J953J950J551Q06L33N93J261J707
56575B11672J781J718J585J212N05l53r09o42N77K190L425M085M516M955N418
56560B41735O120P362Q932J0263J1246J2166J2723J2000R692O743M343K902K355
56547C48582K671L484L804K936J421M35L52L92l69j974l606m397m195l623l402
56532C42511l725m352n066n691n959n775n513n538n650n521n374n581n839n581
56518B67346n030m888n012m571l516k783k702k459j582q11p70q63l75J75k02j437
56502B30520k560k991k807k154j199m34k78m79m99k86j59j47j6K34M00M50M57
$$ y = [191296, 191062, 190499, 190699, 192106, 193796, 194617, 194500, 194134, 193858, 193544, 193223, 193163, 193424, 193845, 194370, 194964, 195402, 195558, 195714, 196178, 196777, 197179, 197537, 198333, 199736, 201518, 203471, 205421, 206972, 207778, 208111, 208704, 209965, 211672, 213453, 215171, 216756, 217968, 218473, 218120, 217211, 216569, 217146, 219336, 222761, 226846, 231362, 236317, 241735, 247855, 255217, 264149, 274412, 285658, 297824, 310547, 322547, 332239, 338982, 343325, 346227, 348582, 351253, 354737, 358541, 361477, 362898, 363333, 363685, 364077, 363708, 361734, 358128, 353731, 349536, 345913, 342511, 338786, 334434, 329368, 323677, 317718, 311943, 306430, 300892, 295242, 289721, 284347, 278766, 272927, 267346, 262316, 257428, 252416, 247845, 244329, 241546, 238844, 236385, 234803, 233992, 233222, 232359, 231984, 232159, 231957, 230520, 227960, 224969, 222162, 220008, 218809, 218375, 218097, 217618, 217119, 216833, 216674, 216527, 216511, 216745, 217145, 217595, 218052]
56485B18052L23J0j72L1L11J43m88j023r38k45N47P41Q7q11r65j36Q79J239J045
56466B18630J029J581K404K837K354J013l81q17k5J356K449K742K165J141N61
56451B39039J004J870J943R64n5k72M2K43K10Q0j45k76Q9P90R39J42p38o62K04
56432B45411P82L99o54j556j589p03K69L83k71p24n34k40k20l6O00J145J128R81
56414B44571J262J730J886J773J623J316Q50O93R79J034M21k19j42L75O72Q20
56398B59644J190J515J347R41P46N23k0k83M33J512J678Q37J81M24J029J200P81
56381B73678M9o19p18nR97J495J422J430J847K291K314J873J152L93q9j20N7P9
56363B87526l8NL68R96J708K155J961J245O12L12n4o56r02m17R8k06r67j050j17
$$ y = [218052, 218375, 218385, 218213, 218244, 218555, 218698, 218210, 217187, 216249, 216004, 216551, 217292, 217379, 216568, 215603, 215467, 216346, 217585, 218630, 219659, 221240, 223644, 226481, 228835, 229848, 229467, 228650, 228625, 229981, 232430, 235172, 237337, 238478, 239039, 240043, 241913, 243856, 244820, 244765, 244493, 244535, 244778, 244988, 245068, 244923, 244647, 244736, 245526, 246465, 246607, 245869, 245207, 245411, 246193, 246592, 245938, 244382, 242793, 242090, 242359, 242742, 242471, 241747, 241213, 240973, 240753, 240717, 241317, 242462, 243590, 244571, 245833, 247563, 249449, 251222, 252845, 254161, 255011, 255704, 256683, 257717, 258138, 257919, 257777, 258152, 258824, 259644, 260834, 262349, 263696, 264637, 265383, 265906, 265886, 265603, 266036, 267548, 269226, 270063, 270244, 270668, 271697, 272897, 273678, 273727, 273108, 272390, 272385, 273382, 274877, 276299, 277729, 279576, 281867, 284181, 286054, 287206, 287599, 287510, 287390, 287447, 287526, 287488, 287493, 287861, 288857, 290565, 292720, 294681, 295926, 296538, 296850, 296796, 296140, 295238, 294821, 294919, 294713, 293746, 292696, 292579]
56344B92579J026J549J421J145J221J782K355K206J299O03R81K062K698K258J157
56329C16342L14M66J642K973L433L002K653K924L213K828J950J118M77J27L96
56314C43858J082J189J67j251k110k378k373j891q33Q3K33O6K73O03N14L49P57
56297C38338J534K043K310K685K916K519J684R22L14j06M7P48J119P39N13J183
56281C59508J940J782J308J672K573K857K466K154J935J457J301K134L091K836
56267C89014J908K032L317M153L843L360L340L240K794K578K725K662K464K894
56253D30324L839M269M059M253N140N746N629N636O260O833O969P329Q261R064
56239E13611R292R447R769R581Q747Q365R116R997R677Q159O251M324K456J077
$$ y = [292579, 293605, 295154, 296575, 297720, 298941, 300723, 303078, 305284, 306583, 307186, 308167, 310229, 312927, 315185, 316342, 316656, 317122, 318764, 321737, 325170, 328172, 330825, 333749, 336962, 339790, 341740, 342858, 343335, 343462, 343858, 344940, 346129, 346296, 345045, 342935, 340557, 338184, 336293, 335460, 335543, 335776, 335842, 336115, 336718, 337232, 337581, 338338, 339872, 341915, 344225, 346910, 349826, 352345, 354029, 354951, 355265, 355159, 355206, 355954, 357073, 357812, 358325, 359508, 361448, 363230, 364538, 366210, 368783, 371640, 374106, 376260, 378195, 379652, 380953, 383087, 386178, 389014, 390922, 392954, 396271, 400424, 404267, 407627, 410967, 414207, 417001, 419579, 422304, 424966, 427430, 430324, 434163, 438432, 442491, 446744, 451884, 457630, 463259, 468895, 475155, 481988, 488957, 496286, 504547, 513611, 522903, 532350, 542119, 551700, 560447, 568812, 577928, 587925, 597602, 605761, 612012, 616336, 618792, 619869]
56225F19869M25o1j014k211l029l422l803m334m826n106n160n054m906m671m093
56210E68604l148k392k358k833l211l270l090k556j666q63l66L18J358J811R87
56195E47325j02J8J198K221K880L787M556M111K805K290L086L978M140M171M584
56180E91048M853M544M060L742L379K979K936L261L658M359N627O634O217M762
56166F52059L770L658L658L776M845O562P452P270P412Q420R038Q524Q011Q655
56152G43110R983J1045J1772J2395J2816J3267J4364J5992J7402J8774K1215K4838
56140I26973K8414L1430L4839L9194M3800M8485N4645O3641P5403Q9138J04003
56129A539965J18501J30553J38565J41232J36610J23622J04926Q6024P0755N9479
$$ y = [619869, 620294, 620233, 619219, 617008, 613979, 610557, 606754, 602420, 597594, 592488, 587328, 582274, 577368, 572697, 568604, 565456, 563064, 560706, 557873, 554662, 551392, 548302, 545746, 544080, 543217, 542851, 543169, 544527, 546338, 547325, 547223, 547241, 548439, 550660, 553540, 557327, 561883, 565994, 568799, 571089, 574175, 578153, 582293, 586464, 591048, 595901, 600445, 604505, 608247, 611626, 614605, 617541, 620802, 624460, 628819, 634446, 641080, 647297, 652059, 655829, 659487, 663145, 666921, 671766, 678328, 685780, 693050, 700462, 708882, 717920, 726444, 734455, 743110, 753093, 764138, 775910, 788305, 801121, 814388, 828752, 844744, 862146, 880920, 902135, 926973, 955387, 986817, 1021656, 1060850, 1104650, 1153135, 1207780, 1271421, 1346824, 1435962, 1539965, 1658466, 1789019, 1927584, 2068816, 2205426, 2329048, 2433974, 2519998, 2590753, 2650232]
56119B650232N1739M7790M6306M3265L5214K2360P364p092j8597k5133k7013k7631
56107B798804l1025l9454n3523p2406r2857j10053j21002j25907j25550j19513
56097A907514j08151r4103q0080o6702n3949m2947l4593k7945k1593j5497j0278
56086A351676o020k866j341r58m4K040M077N278O494Q211R424R731J0445J2236
56072A408383J3757J4131J4670J6499J8520J9526K0369K2101K3773K4069K3501
56061A619299K3155K2809K2045K1731K2631K3965K4949K6185K8085K9501K9528
56050A893883K9018K8855K8413K7204K6298K6529K7066K7161K7565K8855L0249
56039B201096L1361L3091L5532L7204L7702L8717M1120M3492M4960M6816M9799
$$ y = [2650232, 2701971, 2749761, 2796067, 2839332, 2874546, 2896906, 2904270, 2897178, 2878581, 2853448, 2826435, 2798804, 2767779, 2728325, 2674802, 2602396, 2509539, 2399486, 2278484, 2152577, 2027027, 1907514, 1799363, 1705260, 1625180, 1558478, 1504529, 1461582, 1426989, 1399044, 1377451, 1361954, 1351676, 1345656, 1342790, 1341449, 1340491, 1340447, 1342487, 1346564, 1351842, 1358336, 1366547, 1375971, 1385702, 1396147, 1408383, 1422140, 1436271, 1450941, 1467440, 1485960, 1505486, 1525855, 1547956, 1571729, 1595798, 1619299, 1642454, 1665263, 1687308, 1709039, 1731670, 1755635, 1780584, 1806769, 1834854, 1864355, 1893883, 1922901, 1951756, 1980169, 2007373, 2033671, 2060200, 2087266, 2114427, 2141992, 2170847, 2201096, 2232457, 2265548, 2301080, 2338284, 2375986, 2414703, 2455823, 2499315, 2544275, 2591091, 2640890]
56028B640890N2604N4607N7164O0622O3175O4416O6609P0542P3670P4552P5515
56017C354366P8417Q1498Q3146Q5075Q8898R3061R6257J00166J05812J10939J14272
56006D391907J18485J25534J32987J38611J44575J53126J62176J69440J77098
55997E713939J87910K00419K12221K24275K37765K50781K62389K75669K92204
55988G857572L08283L21327L35136L53672L74899L96459M21827M54547M91702
55979A1315424N29845N72141O22694O79252P38753Q04550Q80757R65288J056392
55970A8165096J159871J281943J421885J580378J767377J992361K255604K560125
55962C2184640K923394L365928L899214M539219N321569O288619P473952Q916624
$$ y = [2640890, 2693494, 2748101, 2805265, 2865887, 2929062, 2993478, 3060087, 3130629, 3204299, 3278851, 3354366, 3432783, 3514281, 3597427, 3682502, 3771400, 3864461, 3960718, 4060884, 4166696, 4277635, 4391907, 4510392, 4635926, 4768913, 4907524, 5052099, 5205225, 5367401, 5536841, 5713939, 5901849, 6102268, 6314489, 6538764, 6776529, 7027310, 7289699, 7565368, 7857572, 8165855, 8487182, 8822318, 9175990, 9550889, 9947348, 10369175, 10823722, 11315424, 11845269, 12417410, 13040104, 13719356, 14458109, 15262659, 16143416, 17108704, 18165096, 19324967, 20606910, 22028795, 23609173, 25376550, 27368911, 29624515, 32184640, 35108034, 38473962, 42373176, 46912395, 52233964, 58522583, 65996535, 74913159]
55954G4913159J0675152J2801940J5308995J8168876K1319942K4636534K7905771
55947B05730369L0829578L2941356L3406537L1011593K4704285J4483088J839853
55940C74946659j0791545k1190766k8191420l1734702l2427989l1107657k8586107
55933A90916473k5514830k2327285j9272831j6488828j4038840j1925150j0118024
55926G1230685q588231p308262o239734n341886m588050l960431l436005k991101
55918B8776985k613198k295527k025541j789879j584972j411531j263293j131139
55910A4661905j013516r12853q25695p45708o72970o11329n59481n12550m69863
55901H337940m33644m02544l73334l46613l24445l04672k83640k62190k43200
$$ y = [74913159, 85588311, 98390251, 113699246, 131868122, 153188064, 177824598, 205730369, 236559947, 269501303, 302907840, 333919433, 358623718, 373106806, 374946659, 364155114, 342964348, 314772928, 283038226, 250610237, 219502580, 190916473, 165401643, 143074358, 123801527, 107312699, 93273859, 81348709, 71230685, 62642454, 55334192, 49094458, 43752572, 39164522, 35204091, 31768086, 28776985, 26163787, 23868260, 21842719, 20052840, 18467868, 17056337, 15793044, 14661905, 13648389, 12735536, 11909841, 11164133, 10491163, 9879834, 9320353, 8807803, 8337940, 7904296, 7501752, 7128418, 6781805, 6457360, 6152688, 5869048, 5606858, 5363658]
55892E363658k25689k06900j87874j71392j56608j40841j24508j09188r3078p3445
55882C874135n1493k9863p346J8879M7528P4449R7828J17223J28690J25583J03934
55871D499547O3968Q365n6808j21085j74196k11858k34794k44096k40941k28972
55861C059130k12707j94238j74288j54899j37918j22471j07234r3630q3615p5974
55851A702156o8233o0629n4881n0632m6505m3125m1601m0541l8078l5317l4227
55840A188387l3608l1046k7489k5879k6161k5712k4000k2851k2468k1030j8292
55829I09851j6024j4811j3584j2388j2485j3582j3874j3092j2836j3772j4887
55818G58516j5556j5962j5695j4232j2579j2145j2284j1298r413q256p779o394
$$ y = [5363658, 5137969, 4931069, 4743195, 4571803, 4415195, 4274354, 4149846, 4040658, 3947580, 3874135, 3822642, 3792779, 3785433, 3804312, 3851840, 3926289, 4024117, 4141340, 4270030, 4395613, 4499547, 4563515, 4571880, 4515072, 4393987, 4219791, 4007933, 3773139, 3529043, 3288102, 3059130, 2846423, 2652185, 2477897, 2322998, 2185080, 2062609, 1955375, 1861745, 1778130, 1702156, 1633923, 1573294, 1518413, 1467781, 1421276, 1378151, 1336550, 1296009, 1257931, 1222614, 1188387, 1154779, 1123733, 1096244, 1070365, 1044204, 1018492, 994492, 971641, 949173, 928143, 909851, 893827, 879016, 865432, 853044, 840559, 826977, 813103, 800011, 787175, 773403, 758516, 742960, 726998, 711303, 697071, 684492, 672347, 660063, 648765, 639352, 631096, 623317, 616923]
55806F16923m042k412k069j814j081o25o38l20M53R61J214J840K561K629K591
55791F16171L662N580P022P876R006J0000R388P077M556K668R35j012l366p186
55777F72377j3322k0300k5274k7248k7438k6669k4533k1234j8008j5306j2373
55766D40672r067o333m633l496k832l046l709l708k934k321k101j644j050j270
55752C92528k396l404l819m218m997n971p267r085j0603j0589r267q108p674p131
55738B97999n930m587l560k752k239k319k743k974l088l346l291k559k075k903
55724B53633m364m939m683m871n540n440m351l457l264l051k580k468k538j624
55710B00463M39K348L279L736M057L722K688J828J470Q55l80j562k345l344m860
$$ y = [616923, 612881, 610469, 608400, 606586, 605505, 604880, 604242, 603922, 604375, 605336, 606550, 608390, 610951, 613580, 616171, 619833, 625413, 632435, 640311, 649317, 659317, 668705, 675782, 680338, 683006, 683941, 682929, 679563, 672377, 659055, 638755, 613481, 586233, 558795, 532126, 507593, 486359, 468351, 453045, 440672, 431605, 425272, 420639, 417143, 414311, 411265, 407556, 403848, 400914, 398593, 396492, 394848, 393798, 392528, 390132, 386728, 382909, 378691, 373694, 367723, 360456, 351371, 340768, 330179, 320912, 312804, 305130, 297999, 292069, 287482, 283922, 281170, 278931, 276612, 273869, 270895, 267807, 264461, 261170, 258611, 256536, 253633, 249269, 244330, 239647, 234776, 229236, 223796, 219445, 215988, 212724, 209673, 207093, 204625, 202087, 200463, 200902, 203250, 206529, 210265, 214322, 218044, 220732, 222560, 224030, 224885, 224505, 222943, 220598, 217254, 212394]
55695B12394o158o592o408n922n004l752k715k063j497j133j449k202k501k136
55681A62862j686j285m46P26J372J217R19Q45N65k50j428k813m204m899m396l381
55665A43718k845k500j482k23N2m72m19M14P84L57L76J489K710L197L340L520
55649A52016L328K734K543K997L324L277L599M436M749M096L501L730M068L624
55635B02022K571J236p16l312n563o744p371q134q749q584p565n942m021k558
55621A36570k320k837k735j708q96r30j007n41k24o59j286j551j831k346k422
55606A13277j787j355j720k064j611r62q94r70n46j28m30r46p27O3N74O03M90
55589A00867K78n0r7K75L90j75o41j04J028J695J685J588J654J738J970K594L403
$$ y = [212394, 206236, 199644, 193236, 187314, 182310, 178558, 175843, 173780, 172283, 171150, 169701, 167499, 164998, 162862, 161176, 159891, 159445, 160171, 161543, 162760, 163679, 164524, 165089, 164839, 163411, 160598, 156394, 151495, 147099, 143718, 140873, 138373, 136891, 136668, 136720, 136248, 135829, 136243, 137027, 137384, 137760, 139249, 141959, 145156, 148496, 152016, 155344, 158078, 160621, 163618, 166942, 170219, 173818, 178254, 183003, 187099, 190600, 194330, 198398, 202022, 204593, 205829, 205113, 201801, 196238, 189494, 182123, 173989, 165240, 156656, 149091, 143149, 139128, 136570, 134250, 131413, 128678, 126970, 126074, 125144, 124137, 123596, 123372, 122713, 121427, 119876, 118045, 115699, 113277, 111490, 110135, 108415, 106351, 104740, 103778, 102884, 101914, 101368, 101240, 100810, 99864, 99137, 99200, 99774, 100377, 100867, 101145, 101095, 100998, 101273, 101663, 101488, 100847, 100743, 101771, 103466, 105151, 106739, 108393, 110131, 112101, 114695, 118098]
55572A18098M038M575N167N557N507N321N351N383N011M153K781P47j718l888
55558A66083n408o537p258o987n776m784m852n364n314m693m037l475k984k897
55544I5717l267l384k790k118k101k359k080j289n77o3M64Q73R55R39J033Q87
55528H0840J97o64j274j750k126j838p23K48J35o33j032r17p59m99K36J110J372
55511G1923R50L99n0n53r52q13p7Q27J383J184K17p19n62N35J081J85j200j716
55493G2042j354q86m89m8k1p44j440j241o33o35j060r28k11K37K94N93J080J031
55475F5587N04M38J037J395J055O82P81Q36L15l85o04m05l01m66o77p03n09k32
55457F8348j01j79k74k97m12n24j06R23J615J135N0l95n8Q6m08r47j121j333j875
$$ y = [118098, 122136, 126711, 131878, 137435, 142942, 148263, 153614, 158997, 164008, 168161, 170942, 171689, 169971, 166083, 160675, 154138, 146880, 139893, 134117, 129333, 124481, 119117, 113803, 109110, 105073, 101598, 98614, 95717, 92450, 89066, 86276, 84158, 82057, 79698, 77618, 76329, 75752, 75689, 76153, 77026, 77981, 78920, 79953, 80840, 81037, 80373, 79099, 77349, 75223, 73385, 72662, 72910, 73045, 72412, 71380, 70463, 69704, 69205, 69441, 70551, 71923, 72873, 73272, 73222, 72669, 71717, 70904, 70827, 71654, 73037, 74221, 74438, 73719, 73157, 73692, 74773, 74958, 73758, 72042, 70688, 69802, 69313, 69265, 69244, 68500, 67060, 65819, 65186, 64551, 63491, 62563, 62352, 62589, 62883, 63476, 64556, 65587, 66091, 66529, 67566, 68961, 70016, 70698, 71479, 72315, 72630, 72245, 71641, 71236, 70935, 70469, 69792, 69089, 68580, 68348, 68247, 68068, 67794, 67497, 67085, 66561, 66455, 67378, 68993, 70128, 70178, 69783, 69725, 69811, 69403, 68456, 67335, 66002, 64127]
55438F4127k247j865p61O98K197L241L235K266J271R50R60N92j25n37l93j61l09
55421G3139o58o79k17L56P07R38J201J306J108J029J500K020J591J94j016j368
55405H1151j550k307l104k956j890o92L34J340K065J982J224N52L77M75N66N53
55389G8120K88l11r86j479j862k064j551j80R94P43o63j730j645j027p04o10k46
55372F5087M51J059J206R16N26L06P6m71j048r07k7N33J05n05k27N77P38J85R
55353F8589P27J613J871J527R17K29l59o86r38j298j362o19N23J063P76M39M99
55336G3511N08R4l18j81L95R48J162Q42p7j212j882j854j568j439j359j005l20
55319F6245M91J087J157P18K14mr4k77k71K32Q40R26N73L09J56k48p45q00m97
$$ y = [64127, 61880, 60015, 59254, 59952, 62149, 65390, 68625, 70891, 72162, 73112, 74072, 74664, 74539, 74002, 73609, 73448, 73139, 72481, 71802, 71585, 71941, 72648, 73586, 74787, 76093, 77201, 78230, 79730, 81750, 83341, 83535, 82519, 81151, 79601, 77294, 74190, 71234, 69344, 68652, 68986, 70326, 72391, 74373, 75597, 76149, 76526, 77001, 77567, 78120, 78408, 78097, 77111, 75632, 73770, 71706, 70155, 69975, 70969, 71712, 71049, 69319, 67674, 66647, 65943, 65333, 65087, 65538, 66597, 67803, 68719, 69245, 69551, 69627, 69156, 68108, 67201, 67174, 67707, 67812, 67307, 67080, 67657, 68395, 68580, 68589, 69316, 70929, 72800, 74327, 75244, 75473, 75114, 74428, 73490, 72192, 70830, 70211, 70734, 71797, 72573, 73012, 73511, 74019, 74113, 73795, 73614, 74009, 74957, 76119, 76961, 76884, 75672, 73790, 71936, 70368, 68929, 67570, 66565, 66245, 66736, 67823, 68980, 69698, 69912, 69908, 69814, 69537, 69266, 69498, 70338, 71264, 71837, 72146, 72302, 72054, 71309, 70509, 70012]
55300G0012m01m62o8P12J055P51N43P20M92o06j690j679p80M8M46P65J087J089
55282G2034P09L17J61P3j21k14K21J241K187K175J117mk35K54N91M13N9k40n93
55263H0145r22r39o69l97q4M70R37P35N7k21J58N27M80M88R38J382J244O56J33
55244H5118j03k8L39O90N60Mm25o17j106j945k224j296J51Q99O57R9j67n9K33
55225H0780M60M14K09K20M94O14L39m7k71m41o03m69j5K04j25m94l24J09J34l33
55205H0855q09r07n26L33J360J896J617R58L90k75j273k061j939j218q43r90q94
55188G5674j70O05R17J099J639K230K084R99l52j124j007l28L22N60M58L28K62
55171H4196K4n20j038j027m12L45P96R25R61R51Q06O07O22R97J621K252K536K064
$$ y = [70012, 69611, 69149, 69081, 69793, 70848, 71599, 72142, 72862, 73354, 72748, 71058, 69379, 68599, 68647, 69093, 69858, 70945, 72034, 72743, 73060, 73221, 73294, 73173, 72959, 73180, 74421, 76608, 78783, 79900, 79896, 79661, 79915, 80506, 80919, 80978, 80738, 80145, 79223, 78284, 77615, 77218, 77134, 77604, 78541, 79276, 79333, 79112, 79270, 79797, 80277, 80765, 81703, 83085, 84329, 84985, 85118, 85015, 84987, 85326, 86016, 86576, 86580, 86155, 85538, 84432, 82487, 80263, 78967, 79118, 80017, 80674, 80773, 80606, 80547, 80780, 81240, 81654, 81863, 82083, 82577, 83191, 83530, 83483, 83212, 82771, 82168, 81699, 81684, 81888, 81763, 81269, 80945, 81054, 81188, 80855, 80046, 79139, 78613, 78946, 80306, 82202, 83819, 84777, 85167, 84892, 83619, 81558, 79619, 78401, 77558, 76568, 75674, 75504, 76109, 77026, 78125, 79764, 81994, 84078, 85077, 84725, 83601, 82594, 82266, 82588, 83148, 83606, 83934, 84196, 84220, 83700, 82662, 81635, 81223, 81568, 82364, 83289, 84250, 85201, 86007, 86614, 87236, 88233, 89854, 92106, 94642, 96706]
55153I6706Q49l74q71q91j259j939j911q38J49P2m25k07M33L58m29p20j0Q69J147
55134I0709R78O04j34j052j399q81j55J43P1j49n07o97k05N68L54j104k180j356
55116H3608O30J696J029k95j040j093r71q75n99qO35Q43M87J42M87J335J779J450
55098H9240R73Q91Q98N44Q8m1M2Q4L16R21J364J026J92l22l08k16k72l08l05m57
55078I4350o96p80p72q80r23n54R1N39O93P67O16j69j392k110j662l96P96J316
55060H8834J081L68l45o30m39m6L82Q71J316J359Q03n6p06r28r11q67p28k92L65
55041H9431Q66R74Q98R42J055J012Q75Q26O98J30p54j374j446j191p09J56J137
55024I3526J426P07k78o22l48o9r6l45p69j243j320p11J31M51J65r1J44O00O90
$$ y = [96706, 97555, 97181, 96310, 95419, 94160, 92221, 90310, 89472, 89621, 89693, 89268, 89061, 89494, 89852, 89423, 88703, 88693, 89562, 90709, 91687, 92291, 92157, 91105, 89706, 88825, 88670, 88813, 88884, 88735, 88228, 87531, 87326, 87894, 88248, 87144, 84964, 83608, 84238, 85934, 86963, 86668, 85628, 84535, 83564, 82689, 82090, 82082, 82717, 83560, 84047, 84189, 84676, 86011, 87790, 89240, 90213, 91104, 92002, 92546, 92634, 92593, 92635, 92719, 93035, 93956, 95320, 96346, 96538, 96216, 95908, 95692, 95420, 95112, 94807, 94350, 93654, 92874, 92102, 91222, 90299, 89745, 89836, 90375, 91068, 91835, 92451, 92282, 90890, 88780, 87118, 86722, 87518, 88834, 89915, 90283, 89938, 89308, 88869, 88823, 89205, 90076, 91392, 92751, 93554, 93498, 92792, 91864, 90953, 90086, 89358, 89066, 89431, 90297, 91271, 92169, 93111, 94166, 95178, 96053, 96879, 97577, 97707, 96953, 95579, 94133, 92942, 92233, 92389, 93526, 94952, 95659, 95381, 94759, 94411, 94342, 94246, 93901, 93132, 91889, 90569, 89858, 89989, 90440, 90605, 90514, 90658, 91258, 91948]
55005I1948K28k65k1J115K319K573J855J076Q45R07R29J076J417J448Q02j26p45
54988A07381r91r57m45N12J191J038M94K66K59rk99L2Q90J529J632J483J162M99
54970A15667k46n71n63o99q03j96R68J530Q53l25j021j157j115r04l89J27L11
54953A11467M32R11J457J321L63o33q77m01J28J14n13j357j844j602p53J65O97
54936A09075Q53Q92Q32N26K00M31J226J669J028q7m65L8M72M32O11J379J957J775
54918A22844J738L071N402P152P581P482P883Q915J0082J0865J0836R728P707
54905B21286N212K449o36l855o578q236q796q710q484q227p644o561n491n116
54891A50613n221m796l480k181j793j974j890j541j377j170k62J245K534L253
$$ y = [91948, 92176, 91911, 91890, 93005, 95324, 97897, 99752, 100828, 101673, 102580, 103509, 104585, 106002, 107450, 108252, 108126, 107381, 106390, 105433, 104988, 105500, 106691, 107729, 108223, 108489, 108748, 108739, 108440, 108472, 109362, 110891, 112523, 114006, 115168, 115667, 115421, 114850, 114287, 113588, 112785, 112589, 113557, 115087, 115940, 115615, 114594, 113437, 112322, 111418, 111029, 111156, 111467, 111899, 112810, 114267, 115588, 115951, 115318, 114441, 114040, 114168, 114282, 113769, 112412, 110568, 108966, 108213, 108378, 109075, 109928, 110820, 111652, 112178, 112378, 112809, 114035, 115704, 116732, 116645, 116180, 116218, 116690, 117122, 117733, 119112, 121069, 122844, 124582, 127653, 133055, 140207, 147788, 155270, 163153, 172068, 182150, 193015, 203851, 213579, 221286, 226498, 228947, 228311, 224456, 217878, 209642, 200846, 192136, 183652, 175425, 167781, 161220, 155729, 150613, 145392, 140596, 137116, 134935, 133142, 131168, 129278, 127737, 126360, 125190, 124928, 126173, 128707, 131960]
54877A31960L687L900L602L025K973L738M761N612O619Q157R850J0883J0737R428
54863B18932P346M971K516k02l225n970p746q654r358j0083j0389r963q973p608
54849A51594n899m178l094k917l218l407l251k774k161j803j984k404k422j822
54835A10260j010m26j24l3j54m17n95m33K14J190J866J580N65q3J64M23k72j427
54817A11288j784j141l57J09N37Q95P63L67N34J330J825J460O49j55r49j423q96
54800A13052M82J509J435P89K63j99o76o95j30K77Q7o1L60O85J87m84k09P35J004
54781A18411J93n98k88R26K005K227J704J126J035J257J190P59O68J488K848L959
54765A38910M438M407M201M331N156O238O656O396O673Q239J0060J0509R264P158
$$ y = [131960, 135647, 139547, 143149, 146174, 149147, 152885, 157646, 163258, 169877, 178034, 187884, 198767, 209504, 218932, 226278, 231249, 233765, 233563, 230338, 224368, 216622, 207968, 198610, 188527, 178138, 168175, 159202, 151594, 145695, 141517, 138423, 135506, 132288, 128881, 125630, 122856, 120695, 118892, 116908, 114504, 112082, 110260, 109250, 108824, 108700, 108667, 108513, 108096, 107501, 107068, 107282, 108472, 110338, 111918, 112483, 112400, 112564, 112987, 112715, 111288, 109504, 108363, 108006, 108115, 108652, 109547, 110310, 110677, 111211, 112541, 114366, 115826, 116475, 116320, 115371, 113948, 113052, 113534, 115043, 116478, 117267, 117530, 117331, 116655, 115960, 115830, 116107, 116194, 116133, 116493, 117178, 117365, 116881, 116672, 117407, 118411, 118604, 118006, 117718, 118644, 120649, 122876, 124580, 125706, 126741, 127998, 129188, 129947, 130615, 132103, 134951, 138910, 143348, 147755, 151956, 156287, 161443, 167681, 174337, 180733, 187406, 195645, 205705, 216214, 225478, 232636]
54751B32636M705J867j092l655n843p910r344r249p902o754o640o815o273n124
54737A62607m096l285k251r99j54j50o85j132j171r28o87n76n42n01m02j34M61
54720A45375J387K416L346M235N193O124O847P433Q142Q959R362Q674O640L652
54706B27785M12k573n176p393r080r953r731q347o258m547m142m663m672l512
54692A48150k321k454l463l741k878k060k030k097j600j065j129j331r38j79K13
54677A21077J52k8l66r64j280p65J27M75J91n4pK9N4M27R70J006M31p6j23j08
54657A21168l08l03L00J115J461J176N36k68j098j574j368p26k94l36m65k32K63
54640A19047N93O38P39J069J279R73L42j13k64k91k5R27K290L001K463J316N07
$$ y = [232636, 237341, 239208, 238116, 234461, 228618, 220708, 211364, 202115, 194213, 187459, 180819, 174004, 167731, 162607, 158511, 155226, 152975, 151976, 151822, 151672, 150987, 149855, 148684, 147756, 147069, 146493, 145951, 145450, 145048, 144914, 145375, 146762, 149178, 152524, 156759, 161952, 168076, 174923, 182356, 190498, 199457, 208819, 217493, 224133, 227785, 228197, 225624, 220448, 213055, 203975, 194022, 184291, 175944, 169686, 165139, 160997, 156334, 151662, 148150, 145829, 143375, 139912, 136171, 133293, 131233, 129203, 127106, 125506, 124441, 123312, 121981, 121043, 120864, 121077, 121229, 121201, 120835, 119871, 118591, 117826, 117953, 118428, 118619, 118565, 118558, 118587, 118641, 119068, 120038, 121044, 121475, 121399, 121276, 121168, 120860, 120557, 120857, 121972, 123433, 124609, 125145, 124877, 123779, 122205, 120837, 120111, 119817, 119481, 119016, 118784, 119047, 119640, 120278, 121017, 122086, 123365, 124338, 124680, 124567, 124303, 124012, 123987, 124914, 127204, 130205, 132668, 133984, 134491]
54623A34491O3n63j359j723j473j174j284j526j350o88j2K90L88P91J582K078
54607A28531J547K21q38r62n09j08J07K26J04l41q03j011j118j203r24j70M04
54590A23153K16k83k13M13Q20P10N56P15J019J317J632J748J359P63O61J093J218
54573A36897N39l57o58l81j05L6M31J281K183K553K187J372N43o0m14n36m14j69
54555A44928o1j99m03m48l00k6K68L35m2n53n28J66P78O15Kj45N66J771K833L192
54535A52749K599J528J022J563K410K571K008J243L57p18j346p86M55J096Q83
54520A67634P74J176J265M71m88p76o40o95p82m72j27m18j108j253n63K04L33
54503A64535j1k42j54l8k02o45j116j348j265j018q79j022j295j229m50P06J349
$$ y = [134491, 134554, 133991, 132632, 130909, 129436, 128262, 126978, 125452, 124102, 123414, 123402, 123692, 124080, 124871, 126453, 128531, 130078, 130299, 129461, 128499, 127990, 127882, 127989, 128215, 128319, 127978, 127175, 126164, 125046, 123843, 122919, 122749, 123153, 123369, 123086, 122873, 123286, 124106, 124816, 125372, 126087, 127106, 128423, 130055, 131803, 133162, 133925, 134586, 135679, 136897, 137436, 137079, 136421, 136040, 135935, 135971, 136402, 137683, 139866, 142419, 144606, 145978, 146521, 146461, 146047, 145511, 145097, 144928, 144867, 144668, 144265, 143817, 143517, 143491, 143759, 144094, 144052, 143499, 142971, 143137, 143915, 144530, 144532, 144387, 144953, 146724, 149557, 152749, 155348, 156876, 157898, 159461, 161871, 164442, 166450, 167693, 168050, 167332, 165986, 165200, 165655, 166751, 167634, 168408, 169584, 170849, 171320, 170832, 170056, 169416, 168721, 167939, 167467, 167340, 166922, 165814, 164561, 163998, 164202, 164535, 164524, 164282, 164128, 164090, 163888, 163243, 162127, 160779, 159514, 158496, 157617, 156595, 155300, 154071, 153621, 154327, 155676]
54486A55676R98K32K8O15J404J838J808J312M14l84l56N58J493J641J160Q95J425
54469A70757K549L496L529K623J633J505K171K594K042R26K18L43R10J234R09
54454A97439R5n22l09N62J169Q72K5n22l90J46O83J037J175J050O07j52j093j877
54436A99995k114j752j237j110j445j776j661j198q58q52q49n23j45k62p99j046
54420A82368o95l35n63j059j038l50M40Q66R21Q03O59N87M78N6o45j079q32j92
54402A80390L43P24J018Q76O4q01q61j57N73J011J343J520J330J086J203J336
54386A90998R04L12M06Q65N31n78j146p74p09j695k624k339j428j084j196q70
54370A79573lQ30J415J730J338J37q80p41M2K68j44l20p9k3k23o2N05P60M36Q4
$$ y = [155676, 156674, 156906, 156934, 157549, 158953, 160791, 162599, 163911, 164325, 163941, 163585, 164143, 165636, 167277, 168437, 169332, 170757, 173306, 176802, 180331, 182954, 184587, 186092, 188263, 190857, 192899, 193825, 194043, 194386, 195296, 196530, 197439, 197534, 197012, 196703, 197265, 198434, 199306, 199331, 198809, 198419, 198565, 199248, 200285, 201460, 202510, 203117, 202965, 201872, 199995, 197881, 196129, 194892, 193782, 192337, 190561, 188900, 187702, 186844, 185992, 185143, 184620, 184475, 184213, 183414, 182368, 181673, 181338, 180775, 179716, 178678, 178328, 178768, 179634, 180555, 181358, 182017, 182604, 183082, 183138, 182493, 181414, 180582, 180390, 180733, 181457, 182475, 183351, 183415, 182614, 181753, 181596, 182169, 183180, 184523, 186043, 187373, 188459, 189662, 190998, 191902, 192214, 192620, 193485, 194016, 193438, 192292, 191518, 190809, 189114, 186490, 184151, 182723, 181639, 180443, 179573, 179570, 180400, 181815, 183545, 184883, 185020, 184140, 183399, 183441, 183709, 183565, 183245, 183166, 183143, 182920, 182858, 183363, 184123, 184559, 184643]
54350A84643lk32p80j167j161j284j921k595k613j955j188p78q24j114j278j162
54334A64588j087j391j803j752j293j100j404j616j230n73k27j79M6N92R83O60
54318A53214l17j150r79J56J250J433Q31J04m96r53q52K35J783K637K423J791
54302A61110J216M79l64n74J26Q64P43J16j36J5q2n43p90n45j73l7j45m67r97
54283A59816j434j368q85n05l90j66K73L88k22j057j189l94N92Q56J63r16j549
54266A52013j398r42r07j338j439o20O21J168O40j64k10O41J529J481L32r86j165
54249A49256J66J802K033N09j324j931j381r12j125j365q64J42Q26Q36N65N22
54233A47755P59R30O64j50j255k129k294j628m82N56J099J217J206J111O74k00
$$ y = [184643, 184640, 184408, 183628, 182461, 181300, 180016, 178095, 175500, 172887, 170932, 169744, 168966, 168142, 167028, 165750, 164588, 163501, 162110, 160307, 158555, 157262, 156162, 154758, 153142, 151912, 151339, 151112, 150933, 150979, 151571, 152554, 153214, 152897, 151747, 150768, 150924, 152174, 153607, 154438, 154542, 154046, 153093, 152241, 152476, 154259, 156896, 159319, 161110, 162326, 162805, 162441, 161867, 161993, 162857, 163600, 163716, 163580, 163595, 163513, 162970, 162180, 161635, 161462, 161425, 161280, 160813, 159816, 158382, 157014, 156129, 155624, 155234, 155068, 155341, 155729, 155507, 154450, 153261, 152867, 153459, 154315, 154478, 153562, 152013, 150615, 149673, 148766, 147428, 145989, 145369, 145990, 147158, 147798, 147634, 147424, 148065, 149594, 151075, 151407, 150421, 149256, 149422, 151224, 153257, 153766, 152442, 150511, 149130, 148218, 147093, 145728, 144864, 145006, 145832, 146668, 147233, 147755, 148514, 149444, 150108, 149958, 148703, 146574, 144280, 142652, 142170, 142726, 143825, 145042, 146248, 147359, 148033, 147833]
54217A47833j151j772k041k089j776r70q1K62P9M4M68Q14M76l88j123j324r43
54200A36318o1J013J631J347N41J40N75J283J342M48p81j406j029r4O31P55M18
54183A43071p4n37q23q52p57p84r31r78q65p52o51l36J86N45N47M71N87O70L40
54164A38077l71j059j351j056k45N87P56J47n06m76J61Q46J296J526J426R49N07
54147A41214N62Q75P88K15k30j87l4j93m80m68j60Q9J11N4O9Q4n1l59o54o85l40
54126A40220K62Q94J301J217M55p62j722j735p66N36J467J797J797J831J973J927
54110A50692J445Q21P09J320K026K052J385O65K56j73j048k192k909k712j811
54095A50526r32o32q38j025p80j31O04J064J031N90J93K26M99M66Km07l94j73
$$ y = [147833, 146682, 144910, 142869, 140780, 139004, 138034, 137953, 138215, 138294, 138338, 138806, 139620, 140096, 139708, 138585, 137261, 136318, 136257, 137270, 138901, 140248, 140789, 140929, 141504, 142787, 144129, 144577, 143796, 142390, 141361, 141267, 141898, 142653, 143071, 142997, 142460, 141637, 140785, 140028, 139244, 138313, 137335, 136470, 135718, 135067, 134731, 134917, 135462, 136009, 136480, 137067, 137737, 138077, 137706, 136647, 135296, 134240, 133995, 134582, 135338, 135485, 134979, 134503, 134664, 135510, 136806, 138332, 139758, 140707, 141214, 141776, 142651, 143439, 143654, 143424, 143237, 143203, 143010, 142530, 142062, 141902, 141991, 142102, 142156, 142225, 142309, 142258, 141899, 141245, 140560, 140220, 140482, 141376, 142677, 143894, 144349, 143587, 141865, 140130, 139364, 139900, 141367, 143164, 144961, 146792, 148765, 150692, 152137, 152958, 153667, 154987, 157013, 159065, 160450, 161115, 161371, 161198, 160150, 157958, 155049, 152337, 150526, 149594, 148962, 148124, 147099, 146319, 146188, 146792, 147856, 148887, 149477, 149670, 149896, 150395, 150861, 150863, 150456, 150062, 149889]
54077A49889j3K83R40J642J883J671J344R41L18k66k69K99P83P58M79K57j21r08
54059A59910j677j650p54J77M38K78L79P76Q82N83N58J194J806J596R16P86J396
54042A67594J961K022J943K010K020K041K638L795M539M282L758L948M753N472
54028B12776N908O164N961N133M296M050L928L171K130J801K209K444K203K068
54014B64242K241K100J310K41q85k266l624m167l841l687m306m930m670l849l299
53999B30610l036k582k119k355l289l991l692k562j351o94p96j379j792j535q33
53984A98604m85r30j654j801j315j036j421j685q43O06J018j58j466j393l27L28
53968A86042K59K23M22K31l94o37j35M86P84J125J775K282K292K092J848J185
$$ y = [149889, 149876, 150159, 151099, 152741, 154624, 156295, 157639, 158580, 158898, 158632, 158363, 158662, 159445, 160203, 160682, 160939, 160818, 159910, 158233, 156583, 155829, 156006, 156444, 156722, 157101, 157877, 158759, 159342, 159900, 161094, 162900, 164496, 165412, 166198, 167594, 169555, 171577, 173520, 175530, 177550, 179591, 182229, 186024, 190563, 194845, 198603, 202551, 207304, 212776, 218684, 224848, 230809, 235942, 240238, 244288, 248216, 251387, 253517, 255318, 257527, 259971, 262174, 264242, 266483, 268583, 269893, 270134, 269249, 266983, 263359, 259192, 255351, 251664, 247358, 242428, 237758, 233909, 230610, 227574, 224992, 222873, 220518, 217229, 213238, 209546, 206984, 205633, 204939, 204143, 202764, 200972, 199437, 198604, 198119, 197189, 195535, 193734, 192419, 191383, 189962, 188277, 187434, 188040, 189058, 188900, 187434, 186041, 185714, 186042, 186301, 186524, 186946, 187177, 186783, 186146, 186011, 186497, 187281, 188406, 190181, 192463, 194755, 196847, 198695, 199880]
53952A99880J07m22L41J805K742K725K157J385N79J68O29J816L008L627L608L243
53936B27398K926K960L337L876M552N379O027O033N462M812M136L051J718R75
53922B82642J103J323J042P35R63J384J554J939L109M477M957M595M414M928N722
53907C24887O438P100P451O903N437L748K370J241L04k03l17n38j157j786j922
53892C59956j632j451j804k719l878m842n395n690o013o453o904p162o888n819
53878B93306m296l196k987l156l014k642k419k145j448p60q04j218q21N57J609
53863B66566J494J265K510N255Q108J0185J1920J3936J5915J6784J5565J1734
53851C81237N388k407r645j4458j6472j6802j6532j5582j3428j0482p953o414
$$ y = [199880, 199987, 199565, 199906, 201711, 204453, 207178, 209335, 210720, 211299, 211467, 212096, 213912, 216920, 220547, 224155, 227398, 230324, 233284, 236621, 240497, 245049, 250428, 256455, 262488, 267950, 272762, 276898, 279949, 281667, 282642, 283745, 285068, 286110, 286845, 287808, 289192, 290746, 292685, 295794, 300271, 305228, 309823, 314237, 319165, 324887, 331325, 338425, 345876, 352779, 358216, 361964, 364334, 365575, 365879, 365676, 365359, 364821, 363664, 361878, 359956, 358324, 356873, 355069, 352350, 348472, 343630, 338235, 332545, 326532, 320079, 313175, 306013, 299125, 293306, 289010, 285814, 282827, 279671, 276657, 274015, 271596, 269451, 268003, 267243, 266439, 265221, 264400, 264957, 266566, 268060, 269325, 271835, 277090, 285198, 295383, 307303, 321239, 337154, 353938, 369503, 381237, 386625, 384218, 374573, 360115, 343643, 326841, 310309, 294727, 281299, 270817, 262864, 256450]
53839B56450n333m275l690l985m515m321l445k731k537k456k237k182k457k716
53825B09570k587k122j560j082q50r73j272j403j225p48P4J132J857J700Q74J05
53809B01490k48l05j6P97J731K015J704J797K822M091M832N269N919O492O365
53794B44755N749N421N526N427M759L845L022K248J528J157J255J496J566J569
53780B89323J677J698J315N59k20q03j316j955k731l446l856l852l544l197l082
53765B66570l334l888m461m691m424l906l548l434l278k908k571k539k591k208
53751B18789j345n83l83n32n89n43o56q23o52r3M11N19K89j42p45j234j081k36
53733B10371N91P78O32Q66J494J829J487P84J54l41p47q88o16j31J80J09k54o18
$$ y = [256450, 251117, 246842, 243152, 239167, 234652, 230331, 226886, 224155, 221618, 219162, 216925, 214743, 212286, 209570, 206983, 204861, 203301, 202219, 201369, 200396, 199124, 197721, 196496, 195748, 195822, 196954, 198811, 200511, 201385, 201490, 201242, 200937, 200921, 201718, 203449, 205464, 207168, 208965, 211787, 215878, 220710, 225979, 231898, 238390, 244755, 250504, 255925, 261451, 266878, 271637, 275482, 278504, 280752, 282280, 283437, 284692, 286188, 287754, 289323, 291000, 292698, 294013, 294572, 294352, 293549, 292233, 290278, 287547, 284101, 280245, 276393, 272849, 269652, 266570, 263236, 259348, 254887, 250196, 245772, 241866, 238318, 234884, 231606, 228698, 226127, 223588, 220997, 218789, 217444, 216861, 216478, 215946, 215357, 214814, 214158, 213335, 212683, 212590, 213001, 213520, 213809, 213667, 212922, 211688, 210607, 210371, 210962, 211740, 212372, 213238, 214732, 216561, 218048, 218832, 218986, 218645, 217898, 217010, 216394, 216263, 216443, 216552, 216298, 215680]
53715B15680o17m5Q37J395J164L95m2N62J951K961K602J152k0J47J429K765L388
53698B35704L218K552J814J516J952K857L575L603K936J958J188R11Q55N28J4
53683B65181Q8J137K387K766K263J716J493J191O54M08Q35J592K228K762L419
53668B90120M215N194O586Q432J0406J2386J4752J7745K0645K1902K0020J4430
53656D46833N956l336j1252j6692j9725k0577j9319j6612j3898j2177j1133r991
53644B98077q718p704o841n702m359l192k103p58M86Q28K82q1N39J739K590K713
53628B67796K348J825J353J071R23O75K61o9j31n1%J61O71J491K299K797K907
53611B86327K818K883L292L802L948L580L000K506K074J564R61K98l74p85n73
$$ y = [215680, 215063, 215018, 215855, 217250, 218414, 218809, 218767, 219329, 221280, 224241, 226843, 227995, 227975, 228122, 229551, 232316, 235704, 238922, 241474, 243288, 244804, 246756, 249613, 253188, 256791, 259727, 261685, 262873, 263784, 264639, 265167, 265181, 265269, 266406, 268793, 271559, 273822, 275538, 277031, 278222, 278876, 279284, 280119, 281711, 283939, 286701, 290120, 294335, 299529, 306115, 314547, 324953, 337339, 352091, 369836, 390481, 412383, 432403, 446833, 452789, 449453, 438201, 421509, 401784, 381207, 361888, 345276, 331378, 319201, 308068, 298077, 289359, 281655, 274814, 269112, 264753, 261561, 259458, 258700, 259186, 260014, 260296, 260215, 260754, 262493, 265083, 267796, 270144, 271969, 273322, 274393, 275316, 275991, 276252, 276183, 276052, 276001, 276001, 276162, 276833, 278324, 280623, 283420, 286327, 289145, 292028, 295320, 299122, 303070, 306650, 309650, 312156, 314230, 315794, 316755, 317053, 316679, 315894, 315321]
53596C15321K18J018J329J156O39k74j425k142j890j054m80m08l67r3R6r7m98
53579C11049q69j247j649j818j547r98n33m45q55j534j847j380o01l12l79R0J143
53562B96268J624J004M96J280K519K566J560J129J682J803P44j77L73J673K125
53547C16669J600J328J951K912L582L945M167M333M670N354O044O222N995O062
53533C74834O812Q030R341J0454J1026J0882J0490J0667J1616J2740J3458J3810
53521E04160J4161J4750J5648J6774J7834J8587J9257K0292K1732K3194K4508
53510G10897K5815K6995K7563K7364K6863K6509K6171K5497K4427K3172K2066
53499I93339K1619K2217K3466K4310K4205K3815K4082K4935K5410K4865K3569
$$ y = [315321, 315539, 316557, 317886, 319042, 319681, 319407, 317982, 315840, 313950, 312896, 312416, 312008, 311641, 311548, 311644, 311547, 311049, 310180, 308933, 307284, 305466, 303919, 302921, 302388, 301943, 301088, 299554, 297707, 296327, 295726, 295414, 295035, 295125, 296268, 297892, 298896, 299392, 300672, 303191, 305757, 307317, 308446, 310128, 311931, 312675, 312498, 312871, 314544, 316669, 318269, 319597, 321548, 324460, 328042, 331987, 336154, 340487, 345157, 350511, 356555, 362777, 368772, 374834, 381646, 389676, 399017, 409471, 420497, 431379, 441869, 452536, 464152, 476892, 490350, 504160, 518321, 533071, 548719, 565493, 583327, 601914, 621171, 641463, 663195, 686389, 710897, 736712, 763707, 791270, 818634, 845497, 872006, 898177, 923674, 948101, 971273, 993339, 1014958, 1037175, 1060641, 1084951, 1109156, 1132971, 1157053, 1181988, 1207398, 1232263, 1255832]
53488A255832K2140K0861J9645J8363J7083J6077J5504J5083J4280J3007J1807
53477A439682J1192J0934J0364R124P247M750J659j581m325o515q855j1916j5380
53464A446380j8470k0843k2721k4324k5630k6682k7672k8510k8757k8251k7508
53453A167012k7116k6944k6481k5717k5116k4676k3749k2063k0204j8706j7245
53442I08995j5333j3312j1859j0851r533p642n619l830k330j344j036p71M80K735
53428H28750M869O232P574R803J2646J5175J7086J8693K0199K1674K3394K5458
53416A011553K7373K8719K9936L1716L3863L5572L6710L8008L9951M2256M4564
53405A400221M6872M9091N0927N2506N4513N7183N9717O1219O1804O2252O2855
$$ y = [1255832, 1277972, 1298833, 1318478, 1336841, 1353924, 1370001, 1385505, 1400588, 1414868, 1427875, 1439682, 1450874, 1461808, 1472172, 1481296, 1488543, 1493293, 1494952, 1493371, 1489046, 1482531, 1473676, 1461760, 1446380, 1427910, 1407067, 1384346, 1360022, 1334392, 1307710, 1280038, 1251528, 1222771, 1194520, 1167012, 1139896, 1112952, 1086471, 1060754, 1035638, 1010962, 987213, 965150, 944946, 926240, 908995, 893662, 880350, 868491, 857640, 848107, 840465, 834846, 831016, 828686, 827342, 826306, 825535, 826015, 828750, 833619, 839851, 847425, 857228, 869874, 885049, 902135, 920828, 941027, 962701, 986095, 1011553, 1038926, 1067645, 1097581, 1129297, 1163160, 1198732, 1235442, 1273450, 1313401, 1355657, 1400221, 1447093, 1496184, 1547111, 1599617, 1654130, 1711313, 1771030, 1832249, 1894053, 1956305, 2019160]
53394B019160O3212O3089O2850O2860O2899O2446O1332N9756N7735N4867N0841
53383B681047M6041M1343L7232L3333K8977K4034J8944J4073R407M925P80l076
53371B937060p150j1993j7671k3952l0794l8201m5686n2361n7809o2441o6703
53360B522299p0233p2309p2923p2860p2597p1747o9880o7466o5428o4004o2621
53349A760231o0868n9058n7626n6483n5319n4133n3070n1810m9714m6696m3542
53338A171912m1088l9228l7113l4269l1160k8488k6315k4123k1584j8865j6257
53327H53422j3912j1901j0146q267n942l484j573l13R11K370L533M078M655O006
53313H19437P803R235J0285J1553J3021J4096J4808J5956J7869J9938K1652K3301
$$ y = [2019160, 2082372, 2145461, 2208311, 2271171, 2334070, 2396516, 2457848, 2517604, 2575339, 2630206, 2681047, 2727088, 2768431, 2805663, 2838996, 2867973, 2892007, 2910951, 2925024, 2934431, 2939356, 2940136, 2937060, 2929910, 2917917, 2900246, 2876294, 2845500, 2807299, 2761613, 2709252, 2651443, 2589002, 2522299, 2452066, 2379757, 2306834, 2233974, 2161377, 2089630, 2019750, 1952284, 1886856, 1822852, 1760231, 1699363, 1640305, 1582679, 1526196, 1470877, 1416744, 1363674, 1311864, 1262150, 1215454, 1171912, 1130824, 1091596, 1054483, 1020214, 989054, 960566, 934251, 910128, 888544, 869679, 853422, 839510, 827609, 817463, 809196, 803254, 799770, 798197, 797884, 798795, 801165, 804698, 808776, 813431, 819437, 827240, 836475, 846760, 858313, 871334, 885430, 900238, 916194, 934063, 954001, 975653, 998954]
53301I98954K5276K7389K9310L1043L2598L3735L4403L4873L5164L4909L4140
53290A351794L3517L3324L2814L1139K8482K5687K3173K0679J7773J4175R923
53279A622480N649K267K9j784l864o089q087r997j2167j4562j7049j9742k2513
53266A514571k4723k6114k7436k9494l1996l4124l5733l7188l8460l9355m0228
53255A149720m1408m2216m1668l9953l8157l6665l4961l3035l1622l0912l0205
53244G48918k9183k8377k7976k7355k6286k5513k5433k5177k3840k1765j9789
53233D68224j7927j5800j3689j2201j1195j0038q712p782p409p199o986o953o974
53220C35359o605n887n472n682n919n434m321l448l495m253m859m633l766l111
$$ y = [998954, 1024230, 1051619, 1080929, 1111972, 1144570, 1178305, 1212708, 1247581, 1282745, 1317654, 1351794, 1385311, 1418635, 1451449, 1482588, 1511070, 1536757, 1559930, 1580609, 1598382, 1612557, 1622480, 1628129, 1630396, 1630425, 1628641, 1624777, 1618688, 1610601, 1600604, 1588437, 1573875, 1556826, 1537084, 1514571, 1489848, 1463734, 1436298, 1406804, 1374808, 1340684, 1304951, 1267763, 1229303, 1189948, 1149720, 1108312, 1066096, 1024428, 984475, 946318, 909653, 874692, 841657, 810035, 779123, 748918, 719735, 691358, 663382, 636027, 609741, 584228, 558795, 533618, 509778, 488013, 468224, 450297, 434497, 420808, 408607, 397412, 387374, 378662, 370880, 363471, 356272, 349286, 342333, 335359, 328754, 322867, 317395, 311713, 305794, 300360, 296039, 292591, 289096, 284843, 279984, 275351, 271585, 268474]
53206B68474l233l768l881l262k406j949k031k317k465k430k371k387k342j992
53192B31640j334o56k91l13n81r26j216j355j320j173r42o27l05j56k61m43m15
53175B19326o6L60M17j19q64j064m88J78J55l69n02M4N72M93J46J80O00R43J002
53156B20944Q69M60l30j133j304p49n7K00O4m1J73O84J233J500J357J046R25J051
53138B26892J201J269J385J577J558J073K52m67p46n40l4N32R73J180J138R20
53122B38163O50L84M3m00p17n77k5M09L21p6l06l70o52j201j500j176n11m0Q3
53103B32502J3k02o55j221j597j637j441j177j016j176j669k120k127j851j794
53088B12832j977j851j195n90n87q92q73n69m99p04o55j54L43N09N55O15K91o59
$$ y = [268474, 265241, 261473, 257592, 254330, 251924, 249975, 247944, 245627, 243162, 240732, 238361, 235974, 233632, 231640, 230306, 229650, 229359, 229046, 228465, 227539, 226323, 224968, 223648, 222475, 221533, 220906, 220601, 220445, 220184, 219741, 219326, 219260, 219620, 220037, 219918, 219054, 217990, 217502, 217680, 217835, 217466, 216964, 217008, 217580, 218073, 218219, 218399, 218999, 219942, 220944, 221813, 222273, 221943, 220810, 219506, 218757, 218700, 218900, 218964, 218923, 219096, 219780, 221013, 222513, 223870, 224916, 225841, 226892, 228093, 229362, 230747, 232324, 233882, 234955, 235207, 234740, 233994, 233454, 233420, 233952, 234925, 236105, 237243, 238163, 238813, 239197, 239240, 238840, 238123, 237546, 237521, 237930, 238251, 238175, 237869, 237499, 236847, 235646, 234146, 232970, 232459, 232419, 232502, 232515, 232313, 231658, 230437, 228840, 227203, 225762, 224585, 223569, 222393, 220724, 218604, 216477, 214626, 212832, 210855, 209004, 207809, 207219, 206632, 205740, 204867, 204298, 203799, 203095, 202440, 202286, 202629, 203138, 203693, 204308, 204599, 203940]
53070B03940j610j664q03M4L9p57j585j741j132l75k93j065j938j992j173l41
53054A87554l28j140k055k278j513j49J047J502J221O52K63K19L40K85o9m02l22
53037A84827J1l8p07j395j435r43n31l82j27M40R91J140Q71M02j21o26r39p88
53019A80650r8P83J248J076P94J041J629J711R60K8m17m81m45j25N75J065Q22
53002A90816K79Q2r3r45k045k146j086j43k07p35q75o36l38J82J042J658J434
52985A86244O91K61M28Q60J245J485J508J389J356J313Q04j52o20R6J289J608
52969A99805Q02o7j52K26L55J53Q5M73J228J985K310J930R94pp29j269j875k483
52951B03764k732k406j754j254j106j060q07m55l77p38j323j851k124k005j472
$$ y = [203940, 202330, 200666, 199863, 199907, 199946, 199189, 197604, 195863, 194731, 194356, 194063, 192998, 191060, 189068, 187895, 187554, 187226, 186086, 184031, 181753, 180240, 180091, 181138, 182640, 183861, 184513, 184776, 184995, 185335, 185620, 185551, 185149, 184827, 184838, 184800, 184093, 182698, 181263, 180320, 179789, 179407, 179280, 179720, 180711, 181851, 182722, 183124, 183003, 182377, 181438, 180650, 180552, 181335, 182583, 183659, 184453, 185494, 187123, 188834, 189794, 189822, 189405, 188924, 188479, 188354, 188929, 189994, 190816, 191095, 191177, 191084, 190139, 188094, 185948, 184862, 184719, 184512, 183777, 182902, 182266, 181928, 182110, 183152, 184810, 186244, 186935, 187196, 187624, 188484, 189729, 191214, 192722, 194111, 195467, 196780, 197584, 197432, 196812, 196908, 198197, 199805, 200607, 200540, 200388, 200614, 200969, 201122, 201207, 201680, 202908, 204893, 207203, 209133, 210127, 210120, 209391, 208122, 206247, 203764, 201032, 198626, 196872, 195618, 194512, 193452, 192645, 192190, 191813, 191075, 189752, 187901, 185777, 183772, 182300]
52936A82300q00l35r6J10K02q5n78p08l74j56l53l81L13J242J452Q13O1l39o12
52917A81676r69j155r46n73l53j91J65O53R49R47R14J055J107N85m76j328j252
52900A80808m39K49L45J25q9m11q62r15j89P77J042M42l48p75q71o82J5J155K046
52881A81423K032J286N32J44j38o01j070j209j019p85o32m77l76m95o07j32R43
52864A78819J627J052k02p35j80L74P6n23m34M19J429K272K852K792J888P81L57
52847A92664N02L03n70j420j607j271q28l86k0m6n90j261j603j617j537j413j199
52830A78101j010r37p87l42K41O15Q22J282K192L081L207K344J099L07J85J47
52814A90547m24j392k041j949j424r52n05L28J573K543K509J613Q88J281K706
$$ y = [182300, 181500, 181165, 181069, 181179, 181381, 181296, 180718, 180010, 179636, 179480, 179127, 178746, 179059, 180301, 181753, 182566, 182627, 182288, 181676, 180707, 179552, 178606, 178033, 177680, 177489, 177654, 178307, 179256, 180203, 181117, 182172, 183279, 183864, 183388, 182060, 180808, 180369, 180618, 180963, 181088, 180999, 180588, 179726, 178811, 178622, 179399, 180441, 180883, 180535, 179760, 178889, 178207, 178222, 179377, 181423, 183455, 184741, 185273, 185417, 185279, 184678, 183608, 182399, 181380, 180595, 179963, 179486, 179110, 178615, 178008, 177876, 178819, 180446, 181498, 181296, 180561, 180381, 180755, 180831, 180308, 179874, 180293, 181722, 183994, 186846, 189638, 191526, 192307, 192664, 193166, 193469, 192899, 191479, 189872, 188601, 187773, 187387, 187367, 187321, 186731, 185470, 183867, 182250, 180713, 179300, 178101, 177091, 176154, 175367, 175025, 175266, 175881, 176703, 177985, 180177, 183258, 186465, 188809, 189908, 190215, 190400, 190547, 190123, 188731, 186690, 184741, 183317, 182365, 181860, 182188, 183761, 186304, 188813, 190426, 191314, 192595, 195301]
52799A95301M155M582L608J571p90k732l937m627n130n368n026m122l030j945
52785A72510p68M12J185J357J178Q63L09m67j062j122p06O3J110J937J688L18
52769A78805r00p95J77N78j10j115j672j768j562j005l12j1j91k41K59R39J169
52752A72245Q48L52J0n1J19K99K81J74K49M81N77N63P88J229J284O55o5j04M72
52733A80406Q92O39m8n53l86M97J582K089J681Q67L96L17K6p68j505j486p90j40
52715A83716j1k07m23p08j149j430j195p28p23j351j957j870j092oJ098J854J708
52698A75526M98r90j665j244l90J47J51j29k93j06J86L1o23r73k87J041J925J962
52680A74767J691J587J499J193Q29O02M07L8n42j275j894j819p24P41J438J149
$$ y = [195301, 199456, 204038, 207646, 209217, 208427, 205695, 201758, 197131, 192001, 186633, 181607, 177485, 174455, 172510, 171742, 172154, 173339, 174696, 175874, 176737, 177046, 176579, 175517, 174395, 173689, 173752, 174862, 176799, 178487, 178805, 177905, 177110, 177287, 177865, 177755, 176640, 174968, 173200, 171638, 170633, 170321, 170310, 170119, 169878, 170137, 171076, 172245, 173093, 173445, 173455, 173404, 173523, 173822, 174103, 174277, 174526, 175007, 175584, 176147, 176935, 178164, 179448, 180103, 180038, 179934, 180406, 181298, 181937, 181889, 181336, 180950, 181447, 183029, 185118, 186799, 187666, 188062, 188379, 188405, 187637, 186132, 184646, 183856, 183716, 183705, 183498, 183075, 182367, 181218, 179788, 178593, 177865, 177142, 175791, 173834, 171964, 170872, 170866, 171964, 173818, 175526, 176024, 175034, 173369, 172125, 171735, 171882, 172033, 171904, 171611, 171505, 171691, 171722, 171099, 170126, 169839, 170880, 172805, 174767, 176458, 178045, 179544, 180737, 181566, 182168, 182575, 182613, 182071, 180796, 178902, 177083, 176359, 177100, 178538, 179687]
52664A79687Q19J159J629J328L09o03r01p46m08k3K23J44q9P1J011K536L987M700
52646A94833M533L973L567L160K019j36k502l950m198l885l589l215k456j499
52632A86655r02q92j091j029o93l29O8P46J637K295K449K287J966J277J22j051
52616A93515j684j752j541j124n23q8j38m09m16j68M2K54O24P92L43k59j17P14
52598A88065J151N59n42j355j543r39M90K033K523J722O49J34q5m05m56J47R51
52581A93099J282J055L98o86j633j265N55K084J745L15k46M09R49P22N34Q79J014
52564B01210L65m63p48p06q11q86o42m54p61j247j291q96m66j8O60J261J196N11
52546A95814q0j83j59l17k75L66J138J066m2j215j407o84j7j03p43j253j140l93
$$ y = [179687, 180506, 181665, 183294, 184622, 184931, 184328, 183427, 182681, 182273, 182250, 182473, 182617, 182528, 182599, 183610, 186146, 190133, 194833, 199366, 203339, 206906, 210066, 212085, 211949, 209447, 205497, 201299, 197414, 193825, 190610, 188154, 186655, 185753, 184861, 183770, 182741, 182048, 181719, 181787, 182533, 184170, 186465, 188914, 191201, 193167, 194444, 194566, 193515, 191831, 190079, 188538, 187414, 186891, 186803, 186665, 186256, 185840, 185672, 185714, 185968, 186592, 187384, 187727, 187468, 187351, 188065, 189216, 189775, 189233, 187878, 186335, 185396, 185886, 187919, 190442, 192164, 192813, 192947, 192862, 192457, 192001, 192148, 193099, 194381, 195436, 195834, 195148, 193515, 192250, 192805, 194889, 196634, 196949, 196703, 197112, 198061, 198783, 199317, 200196, 201210, 201575, 201112, 200364, 199658, 198847, 197961, 197319, 196865, 196104, 194857, 193566, 192670, 192204, 192186, 192846, 194107, 195303, 195814, 195734, 195551, 195392, 195075, 194800, 195166, 196304, 197370, 197328, 196113, 194706, 194022, 194005, 193902, 193159, 191906, 190766, 190373]
52528A90373O00J249J185O21J51J46M78Q33R68O94M1m59j62Q38J615J514Q96N38
52510B02119O62R81J275J452J373J133J254K017K841K890K154J304N44o18k277
52495B19104l573l574k365r28j86l21q66j151q66k88P2P0N6L43P56Q11L08l47
52477B07055m64K32J271J975K236K433K598K189R98j82l21N83J565J843J532J210
52461B26753J199J414J578J524J384J406J480J108O4j140j779j697j274r34r76
52446B30110j596k532k966k365j258o59q60j350j722j998k100j794j212p71n41
52431B06386k99j78n07r34o26L48P61j43j512j980j292j99O86J190J159O24J81
52414B03665M16J017J184Q78R70J922L031L323K831K475K944M055N167N919O384
$$ y = [190373, 190973, 192222, 193407, 194028, 194179, 194325, 194803, 195636, 196604, 197298, 197339, 196880, 196718, 197556, 199171, 200685, 201581, 202119, 202781, 203762, 205037, 206489, 207862, 208995, 210249, 212266, 215107, 217997, 220151, 221455, 221999, 221381, 219104, 215531, 211957, 209592, 208664, 208478, 208157, 207291, 206140, 205274, 204986, 205058, 205128, 205184, 205527, 206283, 207094, 207402, 207055, 206591, 206823, 208094, 210069, 212305, 214738, 217336, 219525, 220523, 220341, 220020, 220603, 222168, 224011, 225543, 226753, 227952, 229366, 230944, 232468, 233852, 235258, 236738, 237846, 237910, 236770, 234991, 233294, 232020, 231086, 230110, 228514, 225982, 223016, 220651, 219393, 218734, 217874, 216524, 214802, 212804, 210704, 208910, 207698, 206927, 206386, 206087, 205909, 205402, 204468, 203842, 204190, 204951, 204808, 203296, 201316, 200024, 199825, 200511, 201701, 202860, 203484, 203665, 204081, 205098, 206282, 207160, 208130, 210052, 213083, 216406, 219237, 221712, 224656, 228711, 233878, 239797, 246181]
52399B46181O733O856O421N197L265R77j260l126m459n203n283m589l259j897
52385B46554j215j329j640j569j177q89p94n74p3M09M94J99j52l07j67L73J362
52368B39505K502L227L266K900K460J874J035L11J41K47j04r84j671j808j892
52353B51009k219k109r96M08Q96M10q2r5k7m9K91J127J788J713J203Q84R87J492
52335B56631K413L506M191M229M066M162M345M258M060M244M942N827O481O705
52321C20060O617O642P056P432P037N875M788M272L885L269K930L249L439K482
52307C89033P49l98m57j76o2L85J550K749L036K367J463R04Q70J383K226K786
52291D08408K488J398J94n24o59n21n29r18j502j760j337l91O47J534K182K443
$$ y = [246181, 252914, 259770, 266191, 271388, 274653, 275630, 274370, 271244, 266785, 261582, 256299, 251710, 248451, 246554, 245339, 244010, 242370, 240801, 239624, 238735, 237941, 237367, 237294, 237703, 238197, 238396, 238244, 237937, 237770, 238143, 239505, 242007, 245234, 248500, 251400, 253860, 255734, 256769, 257080, 257221, 257468, 257364, 256380, 254709, 252901, 251009, 248790, 246681, 245685, 246093, 246989, 247399, 247317, 247222, 247195, 247146, 247437, 248564, 250352, 252065, 253268, 254152, 255139, 256631, 259044, 262550, 266741, 270970, 275036, 279198, 283543, 287801, 291861, 296105, 301047, 306874, 313355, 320060, 326677, 333319, 340375, 347807, 354844, 360719, 365507, 369779, 373664, 376933, 379863, 383112, 386551, 389033, 389782, 389384, 388927, 388751, 388689, 389074, 390624, 393373, 396409, 398776, 400239, 401143, 402013, 403396, 405622, 408408, 410896, 412294, 412488, 411964, 411305, 410784, 410255, 409337, 407835, 406075, 404738, 404347, 404994, 406528, 408710, 411153]
52275D11153K241J991K378L492M506M555L785L170L359M053M546M486L943L109
52261D60767K274J859K102K774L515M234M899N135M595L719L502M281N289N674
52247E14619N507N439N709N951N710M779L281J772J015J231J741J857J887K656
52233E63154M135N250N222M505M076M246M552M558M319M206M525N191N679N484
52219F29102M767M311M559N049N121M869M928N366N508M980M437M706N586N983
52205F99272N286M172L887M923O577P670P489O168M408K939K107J793J679J615
52191G59985J748K220K816L022K560J756J192J027R24O55M85O58P77J65j135k311
52175G76544k817l029l549m251m603m620m800n088m694l345k080k156l410m343
$$ y = [411153, 413394, 415385, 417763, 421255, 425761, 430316, 434101, 437271, 440630, 444683, 449229, 453715, 457658, 460767, 463041, 464900, 467002, 469776, 473291, 477525, 482424, 487559, 492154, 495873, 499375, 503656, 508945, 514619, 520126, 525565, 531274, 537225, 542935, 547714, 550995, 552767, 553782, 555013, 556754, 558611, 560498, 563154, 567289, 572539, 577761, 582266, 586342, 590588, 595140, 599698, 604017, 608223, 612748, 617939, 623618, 629102, 633869, 638180, 642739, 647788, 652909, 657778, 662706, 668072, 673580, 678560, 682997, 687703, 693289, 699272, 704558, 708730, 712617, 717540, 724117, 731787, 739276, 745444, 749852, 752791, 754898, 756691, 758370, 759985, 761733, 763953, 766769, 769791, 772351, 774107, 775299, 776326, 777250, 777905, 778390, 779048, 779825, 779990, 778855, 776544, 773727, 770698, 767149, 762898, 758295, 753675, 748875, 743787, 739093, 735748, 733668, 731512, 728102, 723759]
52161G23759l910k528j158L2J489L061L763K950J281P5j36%m17j474k435k489
52145G21863j456Q9J284J724J759J951K255K070J151O1n04n92p70j260j692j723
52129G26210j501j394j425j124O7K204M581O203O764P003P906R652J1550J2949
52115G89645J3766J4152J4004J3060J1323R193P178N499L976K286L43j669l542
52102H79214n132o158o263n488m414l541k768j715l18J228K832M425N706O405
52088H64013O700O900O913O467N649M636L165R43j490l056l385l014k403j489
52074H90549l71M87J010J664K445K574J685N57L0n0j16P6Q00J343P76n60j453
52057I01446j577j861l047m802o461p784q633q685p903o871o136n653n096m417
$$ y = [723759, 719849, 717321, 716163, 716195, 717684, 720745, 724508, 727458, 728739, 728814, 728678, 728678, 728261, 726787, 724352, 721863, 720407, 720496, 721780, 723504, 725263, 727214, 729469, 731539, 732690, 732751, 732247, 731655, 730885, 729625, 727933, 726210, 724709, 723315, 721890, 720766, 720833, 723037, 727618, 733821, 740585, 747588, 755494, 765146, 776696, 789645, 803411, 817563, 831567, 844627, 855950, 865143, 872321, 877820, 881796, 884082, 884425, 882756, 879214, 874082, 867924, 861661, 856173, 851759, 848218, 845450, 843735, 843417, 844645, 847477, 851902, 857608, 864013, 870713, 877613, 884526, 890993, 896642, 901278, 904443, 905386, 903896, 900840, 897455, 894441, 892038, 890549, 890178, 890665, 891675, 893339, 895784, 898358, 900043, 900600, 900630, 900580, 900464, 900540, 901340, 902683, 903459, 902899, 901446, 899869, 898008, 894961, 890159, 883698, 875914, 867281, 858596, 850693, 843822, 837686, 832033, 826937, 822520]
52043H22520l786l279k923k807k850k745k312j791j477j229o63L00J302K038K677
52028H02975L594M851O018O675O951P319P914Q383Q492Q447Q327P643N992L943
52014H97524K597K282K297K044J771J928K351K473K037J099m38k849o137r803
52000H99176j3064j5158j5672j4954j4104j4278j5816j8150k0523k2491k3768
51989G11198k3968k2865k0867j8849j7341j5980j4024j1375q833p176o257n318
51977E38345m073l083k933l420l905m221m790n872p058p730p717p265o504n295
51963D64479l643j938n65N99K090M172O461Q290R375R965J0417J0747J0709J0129
51949E41287Q953P053M287R24k236m466n743o446o574n629l398m04K613N336P834
$$ y = [822520, 818734, 815455, 812532, 809725, 806875, 804130, 801818, 800027, 798550, 797321, 796658, 796958, 798260, 800298, 802975, 806569, 811420, 817438, 824113, 831064, 838383, 846297, 854680, 863172, 871619, 879946, 887589, 893581, 897524, 900121, 902403, 904700, 906744, 908515, 910443, 912794, 915267, 917304, 918403, 917965, 915116, 908979, 899176, 886112, 870954, 855282, 840328, 826224, 811946, 796130, 777980, 757457, 734966, 711198, 687230, 664365, 643498, 624649, 607308, 591328, 577304, 565929, 557096, 549920, 543663, 538345, 534272, 531189, 528256, 524836, 520931, 516710, 511920, 506048, 498990, 491260, 483543, 476278, 469774, 464479, 460836, 458898, 458333, 458932, 461022, 465194, 471655, 479945, 489320, 499285, 509702, 520449, 531158, 541287, 550240, 557293, 561580, 562504, 560268, 555802, 550059, 543613, 537039, 531410, 528012, 527608, 530221, 535557, 543391]
51934E43391J0195J2418J4379J5649J5720J4738J3592J2730J1314Q175L379j906
51922F73774o897j1692j6239j9798k1822k2607k2655k1992k0566j8728j6798j4665
51910D59315j2298j0232q969q164p069n505l942k796k074j526p58N57K201L462
51896D02202M094M847O512Q775J0701J1979J2856J2972J1235P085J304m591r243
51883D80728j1830j2329j1616j0729r785q144n667l132j125O56K634M573O163
51870D20397P703R507J1109J1818J1749J1528J1159J0019P946N546L270Q79j926
51857E20704m941p838j0539j2812j3943j3392j1525r270p186n294l562k081q22
51844D17499K14O80K06q52j583j570j286j236j327j383j714k566l431l551k899
$$ y = [543391, 553586, 566004, 580383, 596032, 611752, 626490, 640082, 652812, 664126, 672301, 675680, 673774, 666877, 655185, 638946, 619148, 597326, 574719, 552064, 530072, 509506, 490778, 473980, 459315, 447017, 436785, 427816, 419652, 412583, 407078, 403136, 400340, 398266, 396740, 395982, 396539, 398740, 402202, 406296, 411143, 417655, 426430, 437131, 449110, 461966, 474938, 486173, 493258, 494562, 489971, 480728, 468898, 456569, 444953, 434224, 424439, 416295, 410628, 407496, 406371, 407027, 409661, 414234, 420397, 428100, 437607, 448716, 460534, 472283, 483811, 494970, 504989, 512935, 518481, 521751, 522630, 520704, 515763, 507925, 497386, 484574, 470631, 457239, 445714, 436444, 429258, 423964, 420402, 418321, 417499, 417713, 418393, 418599, 417747, 416164, 414594, 413308, 412072, 410745, 409362, 407648, 405082, 401651, 398100, 395201]
51829C95201k020j092J57J699L084M105N053O117P200Q259R289R847R409Q376
51815D64684P948Q542R061Q217N961L048l4k985n059n599m999m235l495k157k01
51800D78697J171P28j506m440o993q720r612r715q994p546n860m684m415m800
51786D03311n308n619n637n339m909m636m344l287j085J472L094L332K726J842
51772C75613P80m28j500k164k272j759p91J17O44J220K480M265N806O851P883
51757C96745R113J0069J0364J0144R359P427M202P05j912l747n779q244j0196
51744D28250j0742j0070q919p567n832l827k104r20K52K111M703P493J0131J2720
51730D15679J5279J7431J8714J8838J7503J4554J0646P222N400N187O022P421
$$ y = [395201, 393181, 392089, 392246, 393945, 397029, 401134, 406187, 412304, 419504, 427763, 437052, 446899, 456308, 464684, 472632, 481174, 490235, 498452, 504413, 507461, 507427, 504442, 499383, 493784, 488785, 484550, 481055, 478898, 478697, 479868, 480596, 479090, 474650, 467657, 458937, 449325, 439610, 430616, 423070, 417210, 412526, 408111, 403311, 398003, 392384, 386747, 381408, 376499, 371863, 367519, 364232, 363147, 364619, 367713, 371045, 373771, 375613, 376393, 375965, 374465, 372301, 370029, 368270, 367479, 367596, 368240, 369460, 371940, 376205, 382011, 388862, 396745, 405858, 415927, 426291, 436435, 445794, 453221, 457423, 458128, 456216, 452469, 446690, 438446, 428250, 417508, 407438, 398519, 390952, 385120, 381293, 379189, 378269, 378521, 380632, 385335, 392828, 402959, 415679, 430958, 448389, 467103, 485941, 503444, 517998, 528644, 535866, 541266, 546453, 552475, 559896]
51718E59896Q500P620L680k322p875j1179j2109j1241q972n853k968j474k029
51705E13674m600q264j1267j2085j0706q364n970l428o02J938L443L618K477K51
51691D60115k141l256k386k29K026L823N114N683N164L481R28j984m613o532p861
51676D57332q787q792p123m221j697l64P50K887N893Q877J1622J4278J6406J7577
51662E04638J8490K0147K1995K2157J9578J4856Q714J043p956j6631k2883k5866
51650E58282k6085k4195k0455j5332r888n318k166j63J200J893J246j190m738
51637D53091p787r199r297r286r819j0394j0189r109p793o722n777m713l637k772
51623C46597k001j150m52k65l65j97J86J02o35j259j225j124j798k927l361k689
$$ y = [559896, 568396, 576016, 579696, 577374, 569499, 558320, 546211, 534970, 525998, 520145, 517177, 515703, 513674, 509074, 500810, 489543, 477458, 466752, 458388, 452418, 448990, 448388, 450326, 453769, 457387, 459864, 460115, 457974, 454718, 452332, 452103, 454129, 457952, 463066, 468749, 473913, 477394, 478322, 476338, 471725, 465193, 457332, 448545, 439753, 432630, 428409, 426712, 426348, 427098, 429985, 435878, 444755, 456377, 470655, 487061, 504638, 523128, 543275, 565270, 587427, 607005, 621861, 630575, 631618, 623662, 607031, 584148, 558282, 532197, 508002, 487547, 472215, 462327, 457009, 454843, 454680, 455880, 457773, 459019, 457829, 453091, 445304, 436105, 426808, 417522, 407703, 397309, 387120, 378011, 370218, 363496, 357719, 353006, 349369, 346597, 344596, 343446, 342994, 342729, 342364, 342167, 342353, 342455, 341820, 340561, 339336, 338212, 336414, 333487, 330126, 327437]
51607C27437j696j178r94n64K00Q69J066P68K25j65NP92J742K262K323K577L640
51590C39309N368P033Q182Q956R483R381Q185O073L714J581j86j361j636j033
51576D03049J63J903M245O745Q713J0333J2740J6542K0765K3786K4992K5104K5267
51563E84347K6252K8165L0286L1458L1195L0388L0547L2491L6048M0694M5934
51552I47805N1080N5237N7475N6748N1787M1740K7195J0301o389k1247l3934m4725
51540A193073n3653o0295o4262o5671o4893o2072n7314n1291m5057l9131l3204
51529E96230k6978k0882j5706j2007r983r371r220q348o546m799l984l878l907
51516D60621m136m780n302m928l796k724k098j761j856k774m228n202n112m524
$$ y = [327437, 325741, 324563, 323569, 323005, 323205, 324074, 325140, 325908, 326133, 325968, 325973, 326765, 328507, 330769, 333092, 335669, 339309, 344677, 351710, 359892, 368848, 378331, 387712, 395897, 401970, 405684, 407265, 407079, 405718, 404082, 403049, 403212, 405115, 409360, 416105, 424818, 435151, 447891, 464433, 485198, 508984, 533976, 559080, 584347, 610599, 638764, 669050, 700508, 731703, 762091, 792638, 825129, 861177, 901871, 947805, 998885, 1054122, 1111597, 1168345, 1220132, 1261872, 1289067, 1299368, 1292979, 1271732, 1237798, 1193073, 1139420, 1079125, 1014863, 949192, 884299, 822227, 764913, 713622, 668565, 629434, 596230, 569252, 548370, 532664, 520657, 510674, 501303, 492083, 483735, 477189, 472390, 468406, 464528, 460621, 456485, 451705, 446403, 441475, 437679, 434955, 432857, 431096, 429240, 426466, 422238, 417036, 411924, 407400]
51502D07400m399m979n586n425m489l748m132n282n790m931l530k586j856n84
51488C50083R88J954K277K702L292L201K176J115Q01R24P67J59o92j597k264k377
51472C63509k150k263k980l858m550n210n779n629m448k914j920j592j513j498
51458C17205j561j518j138n27J03P24J219J206O10J13L63J020J278J221J829L548
51442C25695N607P189Q579J0572J3138J5520J7507J9621K1706K2119J9240J3487
51430D99980P142K211p89k096j912r25p12k676o624j0983j4157j5381j4649j2541
51416D25888j0035p919o354n160m206l158j499O67K238K387J810J886K812L555
51402D02912L466K942K442J918J421J420K082K963L700M381N076N567N815O025
$$ y = [407400, 403001, 398022, 392436, 387011, 382522, 378774, 374642, 369360, 363570, 358639, 355109, 352523, 350667, 350083, 351071, 353025, 355302, 358004, 361296, 364497, 366673, 367788, 368589, 369513, 370280, 370439, 369747, 368150, 365886, 363509, 361359, 359096, 356116, 352258, 347708, 342498, 336719, 331090, 326642, 323728, 321808, 320216, 318703, 317205, 315644, 314126, 312988, 312461, 312564, 313288, 314507, 315713, 316323, 316436, 316799, 317819, 319097, 320318, 322147, 325695, 331302, 338491, 347070, 357642, 370780, 386300, 403807, 423428, 445134, 467253, 486493, 499980, 507122, 509333, 508544, 506448, 504536, 503611, 502899, 500223, 493599, 482616, 468459, 453078, 438429, 425888, 415853, 407934, 401580, 396420, 392214, 389056, 387557, 388224, 390462, 392849, 394659, 396545, 399357, 402912, 406378, 409320, 411762, 413680, 415101, 416521, 418603, 421566, 425266, 429647, 434723, 440290, 446105, 452130]
51388D52130O159O037O054O993Q875J0870J2707J5313J9562K5125L1086L7054
51376F37965M3105M9170N5110O0922O6373P0804P3687P4746P3133O7264N6331
51365A328610M1651K5674R834n952k1906l7179n0281o0232o7191p1984p4987p5585
51353I40472p3082o8034o2072n6234n0225m3560l6701l0531k5357k1105j7902
51342D55669j5751j4080j2304j0600r432q682p886p025o363n755m779l543k634
51329C46835k325k361k430k420k345k451l160m438n412n214m005k618j425k83
51315C05948O53Q30J35q55j552j764j439o37K09N92N76O34Q55Q99Q13J201K337
51298C09435L671M576N027N247N095M259K760R86o35j822k508k874l101k990k198
$$ y = [452130, 458289, 464326, 470380, 477373, 486248, 497118, 509825, 525138, 544700, 569825, 600911, 637965, 681070, 730240, 785350, 846272, 912645, 983449, 1057136, 1131882, 1205015, 1272279, 1328610, 1370261, 1395935, 1405769, 1399817, 1377911, 1340732, 1290451, 1230219, 1163028, 1091044, 1016057, 940472, 867390, 799356, 737284, 681050, 630825, 587265, 550564, 520033, 494676, 473571, 455669, 439918, 425838, 413534, 402934, 393502, 384820, 376934, 369909, 363546, 357791, 353012, 349469, 346835, 344510, 342149, 339719, 337299, 334954, 332503, 329343, 324905, 319493, 314279, 310274, 307656, 306231, 305948, 306601, 307431, 307566, 306711, 305159, 303395, 301956, 301319, 301528, 302120, 302696, 303330, 304185, 305084, 305897, 307098, 309435, 313106, 317682, 322709, 327956, 333051, 337310, 340070, 341056, 340421, 338599, 336091, 333217, 330116, 327126, 324928]
51283C24928q75K92R34J422K156K860K947K359J510O59k38j092j602j630j307
51268C33323p20N6N24o4j642k887k468o21J110J780J939K360K595J619m12j996
51252C34496j993q80Qk8o25j047r22m37o7JJ76J010K401L561L887L475K746J982
51234C47744J365R49L75r06k719l976l870k909k259k392k904l306l374k928j875
51219C17015o30J01lo46j253j308n90N39J235J058N38N28J112J674J818J641J261
51202C24090P52N32J144K417L439L620L302L169L430L861M198M233L816L026K121
51187C67150J213K46n84q04k20P07J398J793K215K766L156L096K603J875J009
51172C87619k5j166k140k724l148l887m980n771n673m970m455m360m091l143j809
$$ y = [324928, 324053, 324345, 325279, 326701, 328857, 331717, 334664, 337023, 338533, 339192, 338954, 337862, 336260, 334630, 333323, 332603, 332659, 333183, 333119, 331477, 328590, 326122, 325501, 326611, 328391, 330330, 332690, 335285, 336904, 336492, 334496, 332503, 331623, 331631, 331603, 330978, 329931, 329009, 328572, 328505, 328506, 328682, 329692, 332093, 335654, 339541, 343016, 345762, 347744, 349109, 350058, 350433, 349527, 346808, 342832, 338962, 336053, 333794, 331402, 328498, 325192, 321818, 318890, 317015, 316385, 316486, 316483, 315837, 314584, 313276, 312686, 313225, 314460, 315518, 316056, 316584, 317696, 319370, 321188, 322829, 324090, 324842, 325374, 326518, 328935, 332374, 335994, 339296, 342465, 345895, 349756, 353954, 358187, 362003, 365029, 367150, 368363, 368609, 368025, 367221, 367001, 367708, 369106, 370899, 373114, 375880, 379036, 382132, 384735, 386610, 387619, 387594, 386428, 384288, 381564, 378416, 374529, 369549, 363778, 358105, 353135, 348680, 344320, 340229, 337086, 335277]
51157C35277p85l43k04o6L7j07n09r12j017p21j25N98J218J496J463J522J954
51140C38776K398K237J529J019J017R39K82n19q27q63j298k105k629k630k495
51125C34831k463k345k058j768j465j000o23p30j052p69L60J711K835M022N468
51110C34954O649P020O749O235N451M369L471L178L105K674K119K135K576K427
51096C93112J201l42j189j238j126j284j630j951k102j865r77M96J995K880K968
51081C88948K519J806Q85p7o16m74j90p11k207l669m047l482k999l023k837j675
51065C68151N3J194J265J028J506K850M423N684O667P701Q974J0238J0737R553
51051D40024O653L549K274L351N242O151N926N664N907O068N611M852M279L705
$$ y = [335277, 334492, 334149, 333945, 333879, 333916, 333809, 333300, 332388, 331371, 330650, 330525, 331123, 332341, 333837, 335300, 336822, 338776, 341174, 343411, 344940, 345959, 346976, 347915, 348197, 347678, 346851, 345988, 344690, 342585, 339956, 337326, 334831, 332368, 330023, 327965, 326197, 324732, 323732, 323109, 322379, 321327, 320558, 320918, 322629, 325464, 329486, 334954, 341603, 348623, 355372, 361607, 367058, 371427, 374898, 378076, 381181, 383855, 385974, 388109, 390685, 393112, 394313, 393971, 392782, 391544, 390418, 389134, 387504, 385553, 383451, 381586, 380609, 381105, 383100, 385980, 388948, 391467, 393273, 394158, 394081, 393465, 392991, 392801, 392090, 389883, 386214, 382167, 378685, 375686, 372663, 369826, 368151, 368204, 369398, 370663, 371691, 373197, 376047, 380470, 386154, 392821, 400522, 409496, 419734, 430471, 440024, 446677, 450226, 452500, 455851, 461093, 467244, 473170, 478834, 484741, 490809, 496420, 501272, 505551, 509256]
51037E09256K729J674J501K712M783O729P919Q119P050M480P52l120o256q560
51023E39768j0334j1548j1954j1710j1281j0658r403p582n941m789l425j241J203
51010D41105K847L479L728L993M191M338M637M992N114N162N606O441P094P170
50996E09897O707N706M057K109N69l56j174k153k779k578j999j922k457k746j948
50981E08933q6K124M167O238Q713J1282J3032J3446J2852J1509Q984N164J365
50968F07723o85q90p98j442k292k608k757l453m500n089m928m360l624k612j173
50953E66512P29K971N115O533P045P197P661Q622R990J1874J4489J7775K1349
50940F87862K4741K7655L0317L3482L7366M0382L9846L4574K6360J8238J1813
$$ y = [509256, 511985, 513659, 515160, 517872, 522655, 529384, 537303, 545422, 552472, 556952, 557704, 554584, 548328, 539768, 529434, 517886, 505932, 494222, 482941, 472283, 462880, 455298, 449357, 444568, 441143, 439902, 441105, 443952, 447431, 451159, 455152, 459343, 463681, 468318, 473310, 478424, 483586, 489192, 495633, 502727, 509897, 516604, 522310, 526367, 528476, 529045, 528689, 527515, 525362, 522583, 520005, 518006, 516084, 513627, 510881, 508933, 508847, 510971, 515138, 521376, 530089, 541371, 554403, 567849, 580701, 592210, 601194, 606358, 607723, 607038, 606148, 605350, 603908, 601616, 599008, 596251, 592798, 588298, 583209, 578281, 573921, 570297, 567685, 566512, 567241, 570212, 575327, 581860, 588905, 596102, 603763, 612385, 622375, 634249, 648738, 666513, 687862, 712603, 740258, 770575, 804057, 841423, 881805, 921651, 956225, 982585, 1000823, 1012636]
50929A012636O840K841n1j815l175m969p311r697j1768j3734j6043j8744k1252
50916I13758k2925k3721k4009k3874k3096k1775k0346j8865j6960j4757j3063
50905F90367j2232j1556j0389r205q801r001r009q689q541q725q841q566p795
50892E69017o377m510l113k899l207k734j434o24j073k002k333k042j721j536
50878E33412j258q21l40J22M34L58k1k58j75j45m38p64p88o74o73n44P4J035J906
50859E30442K553L093L415L390L329L727M543N230N527N726O096O482O705O985
50845E97243P626Q514R183R337R147R069R497J0554J2061J3635J4958J5974J6891
50832G43689J8044J9703K1943K4595K7318K9866L2261L4669L7132L9568M2064
$$ y = [1012636, 1019476, 1022317, 1022266, 1020451, 1017276, 1012307, 1004996, 995299, 983531, 969797, 953754, 935010, 913758, 890833, 867112, 843103, 819229, 796133, 774358, 754012, 735147, 718187, 703430, 690367, 678135, 666579, 656190, 646985, 638184, 629183, 620174, 611485, 602944, 594219, 585378, 576812, 569017, 562640, 558130, 555017, 552118, 548911, 546177, 544743, 544119, 543046, 541044, 538711, 536669, 534948, 533412, 532154, 531333, 530993, 531115, 531549, 531907, 531886, 531628, 531453, 531308, 530870, 530106, 529318, 528644, 527971, 527427, 527501, 528536, 530442, 532995, 536088, 539503, 542893, 546222, 549949, 554492, 559722, 565249, 570975, 577071, 583553, 590258, 597243, 604869, 613383, 622566, 631903, 641050, 650119, 659616, 670170, 682231, 695866, 710824, 726798, 743689, 761733, 781436, 803379, 827974, 855292, 885158, 917419, 952088, 989220, 1028788, 1070852]
50821A070852M4968M8513N2368N5830N8431O0149O0992O0653N8718N5030M9586
50810A676090M2337L3371K3294J3085L467n424j3770k1658k8904l5045l9415m1480
50798A605948m1301l9551l6904l3573k9593k5386k1662j8693j5982j2888r359
50787A321056n758k188J581N387Q358R731R668Q936P909O379M250J912k12k046
50773A374963l668n140o728q788j1248j3550j5535j7883k1188k4983k8299l0980
50761A186973l3665l6400l8073l7627l5421l2940l1268l0179k8660k6174k3231
50750H33335k0752j8940j7099j4710j2246j0462r186p509n167k967j548m33J230
50737G13546L429N387O683P667Q900J0592J2584J4453J5603J5688J5001J4224
$$ y = [1070852, 1115820, 1164333, 1216701, 1272531, 1330962, 1391111, 1452103, 1512756, 1571474, 1626504, 1676090, 1718427, 1751798, 1775092, 1788177, 1791644, 1786220, 1772450, 1750792, 1721888, 1686843, 1647428, 1605948, 1564647, 1525096, 1488192, 1454619, 1425026, 1399640, 1377978, 1359285, 1343303, 1330415, 1321056, 1315298, 1313110, 1314691, 1320078, 1328436, 1338167, 1347835, 1356771, 1364680, 1371059, 1375309, 1377221, 1377009, 1374963, 1371295, 1366155, 1359427, 1350639, 1339391, 1325841, 1310306, 1292423, 1271235, 1246252, 1217953, 1186973, 1153308, 1116908, 1078835, 1041208, 1005787, 972847, 941579, 911400, 882740, 856566, 833335, 812583, 793643, 776544, 761834, 749588, 739126, 729940, 722431, 717264, 714297, 712749, 712316, 713546, 716975, 722362, 729045, 736712, 745612, 756204, 768788, 783241, 798844, 814532, 829533, 843757]
50725H43757J3718J3273J2559J1531J0368R371Q949R469J0859J2530J3839J4560
50713I84783J4875J5056J5193J5180J4951J4825J5426J7019J9070K0862K2385
50702A169625K4163K6221K7993K9400L1209L3772L6105L7014L6544L5537L4005
50691A521588L1135K6816K2186J8330J5353J3089J1932J2367J4134J6353J8184
50680A721467J9028J8542J6858J4578J2214R968Q165P432Q159J0317J4055J9796
50668A880579K7193L4610M0247M3434M4358M3300M0834L8094L5784L3277K9755
50657B291465K5915K3382K2556K2201K1238J9806J8354J6724J4660J2289R725
50646B498315O907M315L089L956O532J0057J4191J8716K3133K7196L1250L5442
$$ y = [843757, 857475, 870748, 883307, 894838, 905206, 914577, 923526, 932995, 943854, 956384, 970223, 984783, 999658, 1014714, 1029907, 1045087, 1060038, 1074863, 1090289, 1107308, 1126378, 1147240, 1169625, 1193788, 1220009, 1248002, 1277402, 1308611, 1342383, 1378488, 1415502, 1452046, 1487583, 1521588, 1552723, 1579539, 1601725, 1620055, 1635408, 1648497, 1660429, 1672796, 1686930, 1703283, 1721467, 1740495, 1759037, 1775895, 1790473, 1802687, 1812655, 1820820, 1828252, 1836411, 1846728, 1860783, 1880579, 1907772, 1942382, 1982629, 2026063, 2070421, 2113721, 2154555, 2192649, 2228433, 2261710, 2291465, 2317380, 2340762, 2363318, 2385519, 2406757, 2426563, 2444917, 2461641, 2476301, 2488590, 2498315, 2505222, 2509537, 2512626, 2516582, 2523114, 2533171, 2547362, 2566078, 2589211, 2616407, 2647657, 2683099]
50634B683099L8868M0141L8640L4899K9963K4710J9573J4471R154L770q91m011
50622B932386n716p796j3339k4790m1305n8192o9886p3690p0330o1673m9291l5082
50610B421296k1357r441P42R102J4461J5883J3801Q985J427q722k0130l1336m2113
50597B352598n2652o2074o9029p3332p5796p6774p6038p3853p0938o7501o3288
50586A591323n8524n3767m8975m3721l8267l3369k9022k4409j9209j3968r076
50575A219016m299M30M714Q426J2030J5832J9604K3076K6169K8490K9390K8718
50563A411596K7007K4738K1999J8993J6190J3770J1607R977R723J1404J4842J9648
50551A611494K5624L2392L9195M5325N0400N4150N6490N7824N8705N8990N7988
$$ y = [2683099, 2721967, 2762108, 2800748, 2835647, 2865610, 2890320, 2909893, 2924364, 2933518, 2937288, 2936397, 2932386, 2926670, 2918874, 2905535, 2880745, 2839440, 2781248, 2711362, 2637672, 2567342, 2505669, 2456378, 2421296, 2399939, 2390498, 2391240, 2400342, 2414803, 2430686, 2444487, 2453472, 2454899, 2446177, 2426047, 2394711, 2352598, 2299946, 2237872, 2168843, 2095511, 2019715, 1942941, 1866903, 1793050, 1722112, 1654611, 1591323, 1532799, 1479032, 1430057, 1386336, 1348069, 1314700, 1285678, 1261269, 1242060, 1228092, 1219016, 1214717, 1215147, 1219861, 1228287, 1240317, 1256149, 1275753, 1298829, 1324998, 1353488, 1382878, 1411596, 1438603, 1463341, 1485340, 1504333, 1520523, 1534293, 1545900, 1555877, 1565600, 1577004, 1591846, 1611494, 1637118, 1669510, 1708705, 1754030, 1804430, 1858580, 1915070, 1972894, 2031599, 2090589, 2148577]
50540B148577N5719N3418N2503N3503N6186O0208O5187P0601P5994Q1222Q6459
50529B859577R2066R8396J05360J12400J19218J26258J33755J40678J45505J47949
50519D081162J48901J48569J45651J38641J27062J11098R1031O7569M1868J4696
50509E116248j3839m3199p1839r8225j21683j41550j56269j64283j65471j60871
50499C979019j51200j36473j16895r3419o7381m0103j2969J2456L4444N1232O1373
50488C520084O4132N9347M6920K7014J033k8141n7320q4184j07198j25128j37344
50477C179215j44270j46962j46317j42991j37747j31338j24147j16258j07778
50468A981407r8834q9651q0749p2770o5721n8957n2262m6507m2602m0198l8022
$$ y = [2148577, 2204296, 2257714, 2310217, 2363720, 2419906, 2480114, 2545301, 2615902, 2691896, 2773118, 2859577, 2951643, 3050039, 3155399, 3267799, 3387017, 3513275, 3647030, 3787708, 3933213, 4081162, 4230063, 4378632, 4524283, 4662924, 4789986, 4901084, 4992115, 5059684, 5101552, 5116248, 5102409, 5059210, 4987371, 4889146, 4767463, 4625913, 4469644, 4305361, 4139890, 3979019, 3827819, 3691346, 3574451, 3481032, 3413651, 3373548, 3360579, 3373035, 3407479, 3458711, 3520084, 3584216, 3643563, 3690483, 3717497, 3718530, 3690389, 3633069, 3548885, 3441687, 3316559, 3179215, 3034945, 2887983, 2741666, 2598675, 2460928, 2329590, 2205443, 2089185, 1981407, 1882573, 1792922, 1712173, 1639403, 1573682, 1514725, 1462463, 1415956, 1373354, 1333156, 1295134]
50457A295134l5299l2222k9209k6391k3804k1528j9509j7535j5468j3325j1219
50446A049625r483q512q178p683o398m694l389k581j521L74K885N452P775R847
50432A023519J1716J3530J5628J8364K1765K5313K8199L0028L1349L3155L5685
50421A288251L8052L9363L9932M0983M3318M6715N0538N4478N8542O2715O6950
50410A829837P1343P6087Q1097Q5691Q8879R0072Q9498Q7765Q5148Q1534P6883
50399B743834P1281O4524N6127M5839L3741J9728L445j4908l4076n2350o8398
50388B868787q1306r0351r5150r5917r3176q7389p8974o8446n6313m3159k9927
50377B048679j7651o680L323J2229J8812K1770K0911J6747R343j530j5156k9536
$$ y = [1295134, 1259835, 1227613, 1198404, 1172013, 1148209, 1126681, 1107172, 1089637, 1074169, 1060844, 1049625, 1040142, 1031630, 1023452, 1015769, 1009371, 1004677, 1001288, 998707, 997186, 997560, 1000445, 1005897, 1013672, 1023519, 1035235, 1048765, 1064393, 1082757, 1104522, 1129835, 1158034, 1188062, 1219411, 1252566, 1288251, 1326303, 1365666, 1405598, 1446581, 1489899, 1536614, 1587152, 1641630, 1700172, 1762887, 1829837, 1901180, 1977267, 2058364, 2144055, 2232934, 2323006, 2412504, 2500269, 2585417, 2666951, 2743834, 2815115, 2879639, 2935766, 2981605, 3015346, 3035074, 3038519, 3023611, 2989535, 2937185, 2868787, 2787481, 2697130, 2601980, 2506063, 2412887, 2325498, 2246524, 2178078, 2121765, 2078606, 2048679, 2031028, 2024348, 2027671, 2039900, 2058712, 2080482, 2101393, 2118140, 2127483, 2125953, 2110797, 2081261]
50365B081261m2651n3623o2542o9479p4026p5755p4912p2501o9535o6294o2504
50354A357439n8126n3549m8985m4252l9388l5044l1882k9910k8649k7647k6546
50343I33461k4986k2812k0235j7568j5065j2974j1398r981q232o281m755l819
50331G75355l098k668l137m226m423k944j217j200k853m390m722m315l819l145
50317G29198k143j126k96O47J960L439M810O075P367Q801J0491J2270J3542J3878
50303H08913J3600J3271J2736J1439R507P748O569N691N017M832M985M807M163
50290I13278L787M044M131L179J520J72n11r51j378j471r38J79J899M451P902
50275I39293J2024J6765K2326K8075L1395K8648J8201K729j2122k1787k5512k5323
$$ y = [2081261, 2038610, 1984987, 1922445, 1852966, 1778940, 1703185, 1628273, 1555772, 1486237, 1419943, 1357439, 1299313, 1245764, 1196779, 1152527, 1113139, 1078095, 1046213, 1016303, 987654, 960007, 933461, 908475, 885663, 865428, 847860, 832795, 819821, 808423, 798442, 790210, 783929, 779174, 775355, 772257, 769589, 766452, 762226, 757803, 754859, 753642, 752442, 749589, 745199, 740477, 736162, 732343, 729198, 727055, 725929, 725633, 726280, 728240, 731679, 736489, 742564, 749931, 758732, 769223, 781493, 795035, 808913, 822513, 835784, 848520, 859959, 869466, 877214, 883783, 889474, 894491, 899323, 904308, 909115, 913278, 917065, 921109, 925240, 928419, 929939, 930111, 929600, 928649, 927271, 925800, 924862, 925041, 926940, 931391, 939293, 951317, 968082, 990408, 1018483, 1049878, 1078526, 1096727, 1099456, 1087334, 1065547, 1040035, 1014712]
50263A014712k3247k0098j6409j3244j1532j1126j1028j0489r562q525p146m973
50251H67333k433r78j539l103l637k440p34J26J47l6k29l28K36J677L115L674
50235H60851L865M872O845Q933J0668J2136J2971J2408J0418P653M213l91n832
50222I49610j0642j3761j5532j6719j7399j7268j6366j5070j3853j3251j3393
50211G86356j3457j2386j0328q519p504o548n139m011l930m467m805m916n012
50198F95334m618l247j542n42j83M44J446J883J226K15o8O63J895K908L157K547
50182G01518J589R89R61J109J070R55J083J542K178K813L393L985M695N490O172
50167G39542O621P022P631Q389R018R546J0500J2350J4935J7615K0108K2884K6536
$$ y = [1014712, 991465, 971367, 954958, 941714, 930182, 919056, 908028, 897539, 887977, 879452, 872306, 867333, 864900, 863922, 862383, 859280, 855643, 853203, 852469, 852595, 852742, 852706, 852477, 852149, 852385, 854062, 857177, 860851, 864716, 869588, 876433, 885366, 896034, 908170, 921141, 933549, 943967, 951620, 955833, 955442, 949610, 938968, 925207, 909675, 892956, 875557, 858289, 841923, 826853, 813000, 799749, 786356, 772899, 760513, 750185, 741666, 734162, 727614, 722475, 718464, 714534, 710067, 705262, 700346, 695334, 690716, 687469, 685927, 685385, 685202, 685646, 687092, 688975, 690201, 690416, 690348, 691011, 692906, 695814, 698971, 701518, 703107, 704096, 705057, 706166, 707236, 708191, 709274, 710816, 712994, 715807, 719200, 723185, 727880, 733370, 739542, 746163, 753185, 760816, 769205, 778223, 787769, 798269, 810619, 825554, 843169, 863277, 886161, 912697]
50154I12697L0900L5179L9025M3074M8051N3615N8476O1539O2513O1461N8209
50143A464739N2456M4343L4876K5771J8590J3810J0805Q862P876P792P886P031
50131A704837M352p72q768j9132k9997l9408m6875n2935n7413n9322n8429n5688
50119A280450n1876m6944m1124l5508l0783k6395k1641j6813j2545q775n232k309
50107I80505n75O9j18j541m612q532j1653j2983j2692j1353r456p565o132n061
50093H88301m094l563m083n435o433o174m918l533k492j648p63J00O64R30J442
50078H48301K769M630N914N941N292M974M994M507L197J877J501K113K993L531
50064I02534L640L590L667M002M578N293N974O361O280N969O022O780P960R013
$$ y = [912697, 943597, 978776, 1017801, 1060875, 1108926, 1162541, 1221017, 1282556, 1345069, 1406530, 1464739, 1517195, 1561538, 1596414, 1622185, 1640775, 1654585, 1665390, 1674252, 1682128, 1689920, 1697806, 1704837, 1709189, 1708417, 1699649, 1680517, 1650520, 1611112, 1564237, 1511302, 1453889, 1394567, 1336138, 1280450, 1228574, 1181630, 1140506, 1104998, 1074215, 1047820, 1026179, 1009366, 996821, 988046, 982814, 980505, 979930, 979999, 979881, 978340, 973728, 965196, 953543, 940560, 927868, 916515, 907059, 899494, 893362, 888301, 884207, 880644, 876561, 871126, 864693, 858519, 853601, 850068, 847576, 845928, 845165, 845265, 845929, 846859, 848301, 851070, 855700, 861614, 867555, 872847, 877821, 882815, 887322, 890519, 892396, 893897, 896010, 899003, 902534, 906174, 909764, 913431, 917433, 922011, 927304, 933278, 939639, 945919, 951888, 957910, 964690, 972650, 981663]
50050I81663R733J0271J0792J1349J2100J3328J5225J7766K0788K4175K7974L2354
50038A187518L7375M2861M8731N5228O2543P0270P7639Q4219Q9763R3437R3982
50027A943566R1013Q5550P8897P1648O4198N7595N3003N0594M9502M8601M6822
50016B640989M3005L6103K5588J1412o003k5294m4225o0961p5222q7573r7889
50005B359930j05174j08827j09348j07798j05067j01628r7339r1492q3694p4682
49995A374881o5717n7092m7910l7621k7172j8311j2034p992n184k960j462j259
49983A090167k569m873p320r297j0549j1160j1796j3492j6565j9918k2059k2717
49971I37852k2816k2966k2757k1641j9771j7633j5461j3367j1607j0265r048p679
$$ y = [981663, 991396, 1001667, 1012459, 1023808, 1035908, 1049236, 1064461, 1082227, 1103015, 1127190, 1155164, 1187518, 1224893, 1267754, 1316485, 1371713, 1434256, 1504526, 1582165, 1666384, 1756147, 1849584, 1943566, 2034579, 2120129, 2199026, 2270674, 2334872, 2392467, 2445470, 2496064, 2545566, 2594167, 2640989, 2683994, 2720097, 2745685, 2757097, 2751094, 2725800, 2681575, 2620614, 2545392, 2457819, 2359930, 2254756, 2145929, 2036581, 1928783, 1823716, 1722088, 1624749, 1533257, 1449563, 1374881, 1309164, 1252072, 1204162, 1166541, 1139369, 1121058, 1109024, 1101032, 1095848, 1092888, 1091426, 1090167, 1087598, 1082725, 1075405, 1066108, 1055559, 1044399, 1032603, 1019111, 1002546, 982628, 960569, 937852, 915036, 892070, 869313, 847672, 827901, 810268, 794807, 781440, 769833, 759568, 750520, 742841]
49959G42841o270n054m023l045k069r90L54J795K841L394M207O102Q939J1827
49945G60849J4218J6317J8355K0117K1357K2194K2567K1759J9111J5136J1187
49934I63167Q000N192K455K92j044k537n366r201j2584j4774j6041j6223j4439
49921H86897j0625o089j805K794Q523J4982K1390K8002L5358M2712M8571N2539
49909A123249N5366N7286N7539N5647N2021M7094M0992L4467K9156K6338K5916
49898A605071K6993K8819L0841L2306L2270K9680K3468J3055r37j6854l2947m7798
49886A723967n9989o8271p2292p2647p0072o5217n9344n4296n1184m9534m8169
49875A052952m6516m4759m3161m1715m0081l7657l4031k9613k5389k1812j8419
$$ y = [742841, 736571, 731517, 727494, 724449, 722380, 721390, 721744, 723539, 726380, 729774, 733981, 740083, 749022, 760849, 775067, 791384, 809739, 829856, 851213, 873407, 895974, 917733, 936844, 951980, 963167, 971167, 976359, 978814, 979106, 978062, 975525, 970159, 960958, 948374, 933600, 917559, 901336, 886897, 876272, 870183, 868378, 871172, 879695, 894677, 916067, 944069, 979427, 1022139, 1070710, 1123249, 1178615, 1235901, 1293440, 1349087, 1401108, 1448202, 1489194, 1523661, 1552817, 1579155, 1605071, 1632064, 1660883, 1691724, 1724030, 1756300, 1785980, 1809448, 1822503, 1821566, 1804712, 1771765, 1723967, 1663978, 1595707, 1523415, 1450768, 1380696, 1315479, 1256135, 1201839, 1150655, 1101121, 1052952, 1006436, 961677, 918516, 876801, 836720, 799063, 765032, 735419, 710030, 688218, 669799]
49864F69799j4765j1188q318o376n216m598l945k482j76J947K973L202L581M453
49850F28891N555O858Q643J0827J2934J4750J6376J7604J7811J6608J4226J1058
49838G82141P349L518M15j177j406j478k778n708r397j2563j4602j5703j6105
49825G12506j5689j4373j2478j0437q427o505m772l188j498L93K220L761N152
49812F46665O580Q018R573J1661J4330J6729J7771J7275J5937J4357J2582J0570
49800H02048Q500O517M607K848J410J53j447l731o453r095j1466j3797j6343j8911
$$ y = [669799, 655034, 643846, 635528, 629152, 623936, 619338, 615393, 612911, 612735, 614682, 617655, 620857, 624438, 628891, 634446, 641304, 649947, 660774, 673708, 688458, 704834, 722438, 740249, 756857, 771083, 782141, 789490, 793008, 793423, 792246, 790840, 789362, 786584, 780876, 771479, 758916, 744314, 728611, 712506, 696817, 682444, 669966, 659529, 651102, 644597, 639825, 636637, 635139, 635532, 637752, 641513, 646665, 653245, 661263, 670836, 682497, 696827, 713556, 731327, 748602, 764539, 778896, 791478, 802048, 810548, 817065, 821672, 824520, 825930, 826083, 824636, 820905, 814452, 805357, 793891, 780094, 763751, 744840]
$$ [...]
##END NTUPLES=NMR SPECTRUM
##END=
