
##TITLE=AC1161_Rove100-15_6524134_1AGbEbFMrR
##JCAMPDX= 6.0         $$ Bruker NMR JCAMP-DX V2.0
##DATA TYPE= NMR SPECTRUM
##DATA CLASS= NTUPLES
##ORIGIN= BRUKER
##OWNER= Administrator
$$ 1.72 TOPSPIN		Version 2.1
$$ 2012-07-14 18:11:28.343 -0500  Administrator@TOPSPIN
$$ Compression mode = diff/dup
##.OBSERVE FREQUENCY= 400.02188249412
##.OBSERVE NUCLEUS= ^1H
##.ACQUISITION MODE= SIMULTANEOUS (DQD)
##.ACQUISITION SCHEME= undefined
##.AVERAGES= 64
##.DIGITISER RES= 22
##SPECTROMETER/DATA SYSTEM= spect
##.PULSE SEQUENCE= noesygpps1d.comp
##.SOLVENT NAME= COFFEE_meoh
##.SHIFT REFERENCE= INTERNAL, COFFEE_meoh, 1, 14.9608
##AUDIT TRAIL= $$ (NUMBER, WHEN, WHO, WHERE, PROCESS, VERSION, WHAT)
$$ ##TITLE= Audit trail, TOPSPIN		Version 2.1
$$ ##JCAMPDX= 5.01
$$ ##ORIGIN= Bruker BioSpin GmbH
$$ ##OWNER= Administrator
$$ $$ C:\Bruker\TOPSPIN/data/COFFEE/nmr/AC1161_Rove100-15_6524134_1AGbEbFMrR/12/pdata/1/auditp.txt
$$ ##AUDIT TRAIL=  $$ (NUMBER, WHEN, WHO, WHERE, PROCESS, VERSION, WHAT)
(   1,<2012-07-14 18:11:23.656 -0500>,<Administrator>,<TOPSPIN>,<go>,<TOPSPIN 2.1>,
      <created by zg
	started at 2012-07-14 17:59:53.468 -0500,
	POWCHK enabled, PULCHK disabled,
       configuration hash MD5:
       6B 1B 68 BB D9 2E 58 E2 7F 35 AD 54 07 DF 0E 41
       data hash MD5: 64K
       CD 70 55 26 C3 A3 33 DF 73 EB 2B B5 1B 28 58 31>)
(   2,<2012-07-14 18:11:26.484 -0500>,<Administrator>,<TOPSPIN>,<proc1d>,<TOPSPIN 2.1>,
      <Start of raw data processing
       efp LB = 0.3 FT_mod = 6 PKNL = 1 PHC0 = 0 PHC1 = 0 SI = 128K 
       data hash MD5: 128K
       8D 71 E3 40 5F 9D BD 17 A9 6E 3E A2 89 FF 91 31>)
(   3,<2012-07-14 18:11:27.609 -0500>,<Administrator>,<TOPSPIN>,<proc1d>,<TOPSPIN 2.1>,
      <pk PHC0 = -0.8184814 PHC1 = 0 
       data hash MD5: 128K
       F7 5F 00 29 F1 B7 FD 5B D4 99 02 F0 E6 3C E9 F8>)
(   4,<2012-07-14 18:11:27.843 -0500>,<Administrator>,<TOPSPIN>,<proc1d>,<TOPSPIN 2.1>,
      <abs ABSG = 1 
       data hash MD5: 128K
       B8 1C 60 3F 54 A4 81 9E 88 5E EF 02 D4 D5 63 0B>)
(   5,<2012-07-14 18:11:27.921 -0500>,<Administrator>,<TOPSPIN>,<proc1d>,<TOPSPIN 2.1>,
      <abs ABSG = 2 
       data hash MD5: 128K
       2F 67 58 26 7D 13 1C 96 39 8E A3 59 06 B6 49 D4>)
(   6,<2012-07-14 18:11:28.000 -0500>,<Administrator>,<TOPSPIN>,<proc1d>,<TOPSPIN 2.1>,
      <abs ABSG = 3 
       data hash MD5: 128K
       69 BE 28 99 71 1B 26 C2 63 05 B0 B5 BE 2E 7F 5C>)
(   7,<2012-07-14 18:11:28.203 -0500>,<Administrator>,<TOPSPIN>,<proc1d>,<TOPSPIN 2.1>,
      <abs ABSG = 4 
       data hash MD5: 128K
       79 A5 E4 B8 68 A0 5D 56 99 EB 12 E9 D7 23 1A CF>)
(   8,<2012-07-14 18:11:28.265 -0500>,<Administrator>,<TOPSPIN>,<proc1d>,<TOPSPIN 2.1>,
      <abs ABSG = 5 
       data hash MD5: 128K
       8F 24 30 94 7F CE C8 ED AC DA 22 E1 D7 74 3E 35>)
$$ ##END=
$$ 
$$ $$ hash MD5
$$ $$ 4B 2E 6E 97 B4 B1 19 D8 67 41 D7 4B 35 EC 7D 94
##$RELAX= 
##$RELAX= 
##$RELAX= 
##$RELAX= 
##$RELAX= 
##$RELAX= 
##$RELAX= 
##$RELAX= 
$$ Bruker specific parameters
$$ [...]
150 150 150 150 150 150 150 150
##$TP07= 0
##$TPNAME0= <>
##$TPNAME1= <>
##$TPNAME2= <>
##$TPNAME3= <>
##$TPNAME4= <>
##$TPNAME5= <>
##$TPNAME6= <>
##$TPNAME7= <>
##$TPOAL= (0..7)
0.5 0.5 0.5 0.5 0.5 0.5 0.5 0.5
##$TPOFFS= (0..7)
0 0 0 0 0 0 0 0
##$TUNHIN= 0
##$TUNHOUT= 0
##$TUNXOUT= 0
##$USERA1= <user>
##$USERA2= <user>
##$USERA3= <user>
##$USERA4= <user>
##$USERA5= <user>
##$V9= 5
##$VALIST= <valist>
##$VCLIST= <CCCCCCCCCCCCCCC>
##$VD= 0
##$VDLIST= <DDDDDDDDDDDDDDD>
##$VPLIST= <PPPPPPPPPPPPPPP>
##$VTLIST= <TTTTTTTTTTTTTTT>
##$WBST= 2048
##$WBSW= 25
##$XGAIN= (0..3)
0 0 0 0
##$XL= 0
##$YL= 0
##$YMAX_a= 9650604
##$YMIN_a= -7220681
##$ZGOPTNS= <>
##$ZL1= 120
##$ZL2= 120
##$ZL3= 120
##$ZL4= 120
##$ABSF1= 14.9608
##$ABSF2= -5.597382
##$ABSG= 5
##$ABSL= 3
##$ALPHA= 0
##$AQORDER= 0
##$ASSFAC= 0
##$ASSFACI= 0
##$ASSFACX= 0
##$ASSWID= 0
##$AUNMP= <proc_prof1d_extract.lims>
##$AXLEFT= 0
##$AXNAME= <>
##$AXNUC= <1H>
##$AXRIGHT= 0
##$AXTYPE= 0
##$AXUNIT= <>
##$AZFE= 0.1
##$AZFW= 0.1
##$BCFW= 0
##$BC_mod= 0
##$BYTORDP= 0
##$COROFFS= 0
##$CY= 15
##$DATMOD= 1
##$DC= 0
##$DFILT= <>
##$DTYPP= 0
##$F1P= 0
##$F2P= 0
##$FCOR= 0.5
##$FTSIZE= 131072
##$FT_mod= 6
##$GAMMA= 0
##$GB= 0
##$INTBC= 1
##$INTSCL= 1
##$ISEN= 128
##$LB= 0.3
##$LEV0= 0
##$LPBIN= 0
##$MAXI= 10000
##$MC2= 0
##$MEAN= 0
##$ME_mod= 0
##$MI= 0
##$NCOEF= 0
##$NC_proc= -2
##$NLEV= 6
##$NOISF1= 0
##$NOISF2= 0
##$NSP= 0
##$NTH_PI= 0
##$NZP= 0
##$OFFSET= 14.9608
##$PC= 1
##$PHC0= -0.8184814
##$PHC1= 0
##$PH_mod= 1
##$PKNL= yes
##$PPARMOD= 0
##$PPDIAG= 0
##$PPIPTYP= 0
##$PPMPNUM= 2147483647
##$PPRESOL= 1
##$PSCAL= 4
##$PSIGN= 0
##$PYNMP= <proc.py>
##$REVERSE= no
##$SF= 400.020009716632
##$SI= 131072
##$SIGF1= 0
##$SIGF2= 0
##$SINO= 400
##$SIOLD= 131072
##$SPECTYP= <>
##$SREGLST= <1H.CDCl3>
##$SSB= 0
##$STSI= 131072
##$STSR= 0
##$SW_p= 8223.68421052631
##$SYMM= 0
##$S_DEV= 0
##$TDeff= 65536
##$TDoff= 0
##$TI= <>
##$TILT= no
##$TM1= 0
##$TM2= 0
##$TOPLEV= 0
##$USERP1= <user>
##$USERP2= <user>
##$USERP3= <user>
##$USERP4= <user>
##$USERP5= <user>
##$WDW= 1
##$XDIM= 131072
##$YMAX_p= 364885133
##$YMIN_p= -24313
##$CURPLOT= <Network HP LaserJet P1505>
##$CURPRIN= <$Network HP LaserJet P1505>
##$DFORMAT= <normdp>
##$LAYOUT= <+/1D_H.xwp>
##$LFORMAT= <normlp>
##$PFORMAT= <normpl>
##$SURQMSG= 1
$$ End of Bruker specific parameters
$$ ---------------------------------
##NTUPLES= NMR SPECTRUM
##VAR_NAME=  FREQUENCY,     SPECTRUM/REAL,   SPECTRUM/IMAG
##SYMBOL=    X,             R,               I
##VAR_TYPE=  INDEPENDENT,   DEPENDENT,       DEPENDENT
##VAR_FORM=  AFFN,          ASDF,            ASDF
##VAR_DIM=   131072,        131072,          131072
##UNITS=     HZ,            ARBITRARY UNITS, ARBITRARY UNITS
##FACTOR=    0.0627417313425164, 1,          1
##FIRST=     8223.62146879497, 2263,         -46595
##LAST=      0,             3157,            -46388
##MIN=       0,             -24313,          0
##MAX=       8223.62146879497, 364885133,    0
$$ Real data points
##PAGE= N=1
##DATA TABLE= (X++(R..R)), XYDATA
$$ [...]
63933A860958J81417J89155J95044J98793J99453J96275J89114J77844J61985
$$ 1860958 2042375 2231530 2426574 2625367 2824820 3021095 3210209 3388053 3550038
63924C550038J41238J16125Q7831N7706K7043l100l2318o0891q9021j16128j41118
$$ 3550038 3691276 3807401 3895232 3952938 3979981 3976881 3944563 3883672 3794651 3678523 3537405
63913C537405j63023j80930j93637k00279k01460j99129j94918j88957j80566
$$ 3537405 3374382 3193452 2999815 2799536 2598076 2398947 2204029 2015072 1834506
63904A834506j69600j56758j42938j28855j15078j01889q9152p6743o5173n5313
$$ 1834506 1664906 1508148 1365210 1236355 1121277 1019388 930236 853493 788320 733007
63894G33007m7496m1229l5848l1066k6842k3111j9966j7694j6369j5564j4738
$$ 733007 685511 644282 608434 577368 550526 527415 507449 489755 473386 457822 443084
63883D43084j3725j2650j1494j0113q549p143o183n606n071m251l119j932r64
$$ 443084 429359 416709 405215 395102 386553 379410 373227 367621 362550 358299 355180 353248 352284
63870C52284j81O93J888L415N139O860Q393R773J1333J3224J4972J5998J6622
$$ 352284 352103 352796 354684 358099 363238 370098 378491 388264 399597 412821 427793 443791 460413
63857D60413J7893K0172K2481K3705K3975K4182K4605K4715K4196K3304K2190
$$ 460413 478306 498478 520959 544664 568639 592821 617426 642141 666337 689641 711831
63846G11831K0618J8490J6084J3469J0334O645K948l53l570p125j0791j4026j6762
$$ 711831 732449 750939 767023 780492 790826 797471 800419 800066 796496 789371 778580 764554 747792
63833G47792j9319k1628k3207k3935k4343k4859k5193k4812k3778k2736k2021
$$ 747792 728473 706845 683638 659703 635360 610501 585308 560496 536718 513982 491961
63822D91961k1230j9785j7794j6007j5033j4796j4778j4543j3970j3192j2481
$$ 491961 470731 450946 433152 417145 402112 387316 372538 357995 344025 330833 318352
63811C18352j1957j1309j0056q295o869o443o663o647o088n389m851m344l789
$$ 318352 306395 295086 285030 276735 269866 263423 256760 250113 244025 238636 233785 229441 225652
63798B25652l360l059k604j940j383j104r90j177k107l611m566m034k460j150
$$ 225652 222292 219233 216629 214689 213306 212202 211212 210035 207928 204317 199751 195717 193257 192107
63784A92107p67r09j026j063j213j476j699j794j818j946k287k586k332j383l23
$$ 192107 191340 190431 189405 188342 187129 185653 183954 182160 180342 178396 176109 173523 171191 169808 169485
63769A69485J43L7n0J70L23j6p22j184q90L2Q55R50N97P08J519K036J248m32j601
$$ 169485 169628 169665 169615 169785 170108 170092 169370 168186 167296 167328 168183 169133 169730 170438 171957 173993 175241 174809 173208
63750A73208j564q67j81N12J366K036K063J543R92P26O83O02K60k74n00P3J179
$$ 173208 171644 170777 170596 171108 172474 174510 176573 178116 179108 179834 180517 181119 181379 181105 180605 180678 181857
63733A81857J920J839J500J675K344K881K988K942K985K967K706K489K924M299
$$ 181857 183777 185616 187116 188791 191135 194016 197004 199946 202931 205898 208604 211093 214017 218316
63719B18316O090P225P020N819M539L742L397L367L547L472K494P10q61j520j816
$$ 218316 224406 231631 238651 244470 249009 252751 256148 259515 263062 266534 269028 269738 268877 267357 265541
63704B65541k698m097n034m924m100l145k363j917j888k043k047j949j979j846
$$ 265541 262843 258746 253712 248788 244688 241543 239180 237263 235375 233332 231285 229336 227357 225511
63690B25511r10P03J911J973J498J594K436L259L459L113K505J803J227J022J105
$$ 225511 224601 225304 227215 229188 230686 232280 234716 237975 241434 244547 247052 248855 250082 251104 252209
63675B52209J145J093J279J758K017J719J366J812L138M446M865M493M155M393
$$ 252209 253354 254447 255726 257484 259501 261220 262586 264398 267536 271982 276847 281340 285495 289888
63661B89888M853M648L309J294m43j440k123l156m570n780o375o533o580o506
$$ 289888 294741 299389 302698 303992 303549 302109 299986 296830 292260 286480 280105 273572 266992 260486
63647B60486o180n742n335m670l303j390K14Q28O38L58M29P87J271J963L009M228
$$ 260486 254306 248564 243229 238559 235256 233866 234080 234908 235546 235904 236333 237120 238391 240354 243363 247591
63631B47591N101N225M779M401M544N088N679O163O489O521O361O615P733R173
$$ 247591 252692 257917 262696 267097 271641 276729 282408 288571 295060 301581 307942 314557 322290 331463
63617C31463R958J0141J0868J2709J4823J6336J7705J9773K2184K3892K4983K6635
$$ 331463 341421 351562 362430 375139 389962 406298 424003 443776 465960 489852 514835 541470
63605E41470K9214L1704L3361L4750L6375L7299L6160L2964K8819K4133J8205
$$ 541470 570684 602388 635749 670499 706874 744173 780333 813297 842116 866249 884454
63594H84454J0708K709m150r030j2166j4163j5426j6107j6377j6609j7203j8171
$$ 884454 895162 897871 893721 884691 872525 858362 842936 826829 810452 793843 776640 758469
63582G58469j9124j9891k0904k2544k4244k4816k3760k1795j9856j8009j5683
$$ 758469 739345 719454 698550 676006 651762 626946 603186 581391 561535 543526 527843
63571E27843j2674r507o867m935l376j794j10J447K724L885N191O582P724Q453
$$ 527843 515169 505662 498795 493860 490484 488690 488580 490027 492751 496636 501827 508409 516133 524586
63557E24586Q904R211R378R559J0093J0993J1781J2132J2553J3946J6601J9993
$$ 524586 533490 542701 552079 561638 571731 582724 594505 606637 619190 633136 649737 669730
63545F69730K3560K7259L1256L5435L9422M2827M5195M5836M4061L9543L2355
$$ 669730 693290 720549 751805 787240 826662 869489 914684 960520 1004581 1044124 1076479
63534A076479K2718J1110j234j2220j9788k3164k3146k1236j8667j6346j5221
$$ 1076479 1099197 1110307 1109073 1096853 1077065 1053901 1030755 1009519 990852 974506 959285
63523I59285j6003j8475k1525k4232k6607k9056l1450l3106l3569l2953l1585
$$ 959285 943282 924807 903282 879050 852443 823387 791937 758831 725262 692309 660724
63512F60724k9686k7443k5033k2472j9756j7185j5228j3907j2696j1175r543q212
$$ 660724 631038 603595 578562 556090 536334 519149 503921 490014 477318 466143 456600 448388
63500D48388p196o259n419m936m804m700m502m502m899n352n292m625l829l363
$$ 448388 441192 434933 429514 424578 419774 415074 410572 406070 401171 395819 390527 385902 382073 378710
63486C78710l217l154l125l117k761j559L22J897K373K055J911K380L096L683
$$ 378710 375493 372339 369214 366097 363336 361777 362099 363996 366369 368424 370335 372715 375811 379494
63472C79494M160M464M159K998J406M5q79j555k107k571l125l963m942n674n934
$$ 379494 383654 388118 392277 395275 396681 396726 395847 394292 392185 389614 386489 382526 377584 371910 365976
63457C65976n811n543n323n177m861m098l052k231j760j139q7Q40J048R65J555
$$ 365976 360165 354622 349299 344122 339261 335163 332111 329880 328120 326981 326894 327734 328782 329747 331302
63442C31302K967M367N166N697O497P608Q819J0066J1328J2562J4012J6189J9300
$$ 331302 334269 338636 343802 349499 355996 363604 372423 382489 393817 406379 420391 436580 455880
63429D55880K2968K6651L0015L2707L4142L3664L0766K5367J8425J2120Q541P976
$$ 455880 478848 505499 535514 568221 602363 636027 666793 692160 710585 722705 731246 739222
63417G39222R165J1353J5051K0443K6241L1081L5071L8905M2016M2894M0939L6809
$$ 739222 748387 759740 774791 795234 821475 852556 887627 926532 968548 1011442 1052381 1089190
63405A089190L1023K3425J4202M429m666j2311j8009k1530k3304k4141k4358k3885
$$ 1089190 1120213 1143638 1157840 1162269 1157603 1145292 1127283 1105753 1082449 1058308 1033950 1010065
63393A010065k3249k3636k5587k8358l0877l2673l3628l3567l2551l0979k8970
$$ 1010065 986816 963180 937593 909235 878358 845685 812057 778490 745939 714960 685990
63382F85990k6224k2816j9476j6651j3967j1167q752p060n424l140o56J186K538
$$ 685990 659766 636950 617474 600823 586856 575689 566937 559877 554453 551313 550657 551843 554381
63369E54381M116N796O837P411Q575J0592J2443J3427J4215J5804J8246K0959
$$ 554381 558497 564293 571130 578541 587116 597708 610151 623578 637793 653597 671843 692802
63357F92802K3628K6181K8491L0635L2997L5567L7631L8728L9388M0184M0393
$$ 692802 716430 742611 771102 801737 834734 870301 907932 946660 986048 1026232 1066625
63346A066625L8439L3543K6343J8007R368R91o675j3303j8590k2079k3544k3508
$$ 1066625 1105064 1138607 1164950 1182957 1192325 1193316 1186641 1173338 1154748 1132669 1109125 1085617
63334A085617k2914k2311k1952k2441k4491k7766l0885l2921l4248l5345l5549
$$ 1085617 1062703 1040392 1018440 995999 971508 943742 912857 879936 845688 810343 774794
63323G74794l3828l0413k6699k3605k0846j7816j4421j0780o866k860M74K207
$$ 774794 740966 710553 683854 660249 639403 621587 607166 596386 589520 586660 587134 589341
63311E89341J858o00m915j0414j5831j9746k1330k0737j8889j6881j5273j3753
$$ 589341 591199 590599 585684 575270 559439 539693 518363 497626 478737 461856 446583 432830
63299D32830j1665q948o375m837m620n413o596p414p297o392n519n294n556n821
$$ 432830 421165 412217 405842 401005 396385 390972 384376 376962 369665 363273 357754 352460 346904 341083
63285C41083n925n898n610n023m449m069l579k827k433l053m180m513l534j937
$$ 341083 335158 329260 323650 318627 314178 310109 306530 303703 301270 298217 294037 289524 285990 284053
63271B84053n43M53R93P93j15j057j424j242q55n07m95j107k072k590k387k111
$$ 284053 283510 283963 284956 285749 285634 284577 283153 281911 281056 280549 280054 278947 276875 274285 271898 269787
63255B69787k263k338j687p25m02p25o89K75J521J960J221p8r28p67l9K57k60
$$ 269787 267524 265186 263499 262774 262372 261647 260958 261233 262754 264714 265935 265857 264929 264162 264123 264380 264120
63238B64120q74q16l18j19k38m2O45J265J426J332J180Q05J88k35j36K64N76P11
$$ 264120 263246 262430 262112 261993 261755 261713 262358 263623 265049 266381 267561 268366 268554 268319 268183 268447 269023 269734
63220B69734P31O30M58M29O61J019J363J656J811J680J353J146J225J529J994
$$ 269734 270465 271095 271553 271982 272643 273662 275025 276681 278492 280172 281525 282671 283896 285425 287419
63205B87419K504K660K132J326J148J885K819L230L256L445L912M338M469M297
$$ 287419 289923 292583 294715 296041 297189 299074 301893 305123 308379 311824 315736 320074 324543 328840
63191C28840M039M156N058O460P561Q103Q792J0181J1649J2146J1593J0913J0847
$$ 328840 332879 337035 342093 348553 356114 364217 373009 383190 394839 406985 418578 429491 440338
63178D40338J1343J2076J2908J3778J4483J4737J4301J3164J1735J0584R728Q567
$$ 440338 451681 463757 476665 490443 504926 519663 533964 547128 558863 569447 579175 587742
63166E87742O844N178M179L414J992k11k640n097p829j0645j2914j4534j6029
$$ 587742 594586 599764 603943 607357 609349 609138 606498 601401 593572 582927 570013 555479 539450
63153E39450j7435j8025j7474j6537j6021j5711j4928j3579j2051j0489q852p389
$$ 539450 522015 503990 486516 469979 453958 438247 423319 409740 397689 387200 378348 370959
63141C70959o326n294l750j982r62j099j658j736j351j129j271j265o51L77J275
$$ 370959 364633 359339 355589 353607 352645 351546 349888 348152 346801 345672 344401 343136 342485 342862 344137
63126C44137J844K299K796L195L346L387L603M125M926N866O621O780O346N882
$$ 344137 345981 348280 351076 354271 357617 361004 364607 368732 373658 379524 386145 392925 399271 405153
63112D05153N899O246O464O539O799P175P179O734O461O870P698Q308Q457Q380
$$ 405153 411052 417298 423762 430301 437100 444275 451454 458188 464649 471519 479217 487525 495982 504362
63098E04362Q436Q884R767J0751J1357J1543J1829J2562J3270J3103J1724R564
$$ 504362 512798 521682 531449 542200 553557 565100 576929 589491 602761 615864 627588 637152
63086F37152P315N432L971K621R03j479m411p454j0038j1677j2300j2464j2913
$$ 637152 644467 649899 653870 656491 657394 655915 651504 644050 634012 622335 610035 597571 584658
63073E84658j3778j4487j4529j3987j3185j2320j1553j1102j0790r979q310o287
$$ 584658 570880 556393 541864 527877 514692 502372 490819 479717 468927 458948 450638 444351
63061D44351m707l779l120k362j316J19J701K708K631J941J675K275L317M269
$$ 444351 439644 435865 432745 430383 429067 429186 430887 433595 436226 438167 439842 442117 445434 449703
63047D49703N048N750O293O514O409O202O243O736P450P947Q239Q800R639R863
$$ 449703 454751 460501 466794 473308 479717 485919 492162 498898 506348 514295 522534 531334 540973 550836
63033E50836Q790P061N951N750N624M930L861K832J974J395J173R49J87j003j967
$$ 550836 559626 566687 572638 578388 584012 588942 592803 595635 597609 599004 600177 601126 601313 600310 598343
63018E98343k537l210m074m467m066l483l198k692j327M64J753K487L488N245
$$ 598343 595806 592596 588522 584055 579989 576506 573308 570616 569289 569753 571506 573993 577481 582726
63004E82726P437R611J1652J3544J5152J6408J7399J8216J8862J9324J9553J9503
$$ 582726 590163 599774 611426 624970 640122 656530 673929 692145 711007 730331 749884 769387
62992G69387J9307J9194J9071J8517J7421J6278J5545J4955J3909J2292J0425
$$ 769387 788694 807888 826959 845476 862897 879175 894720 909675 923584 935876 946301
62981I46301Q402N967K971m26m031p817j1849j6182k0647k4594k7174k8228k8515
$$ 946301 954703 960670 963641 963215 959184 951367 939518 923336 902689 878095 850921 822693 794178
62968G94178k8744k8714k7868k6301k4581k2866k0936j8913j7237j5868j4296
$$ 794178 765434 736720 708852 682551 657970 635104 614168 595255 578018 562150 547854
62957E47854j2441j0831r753q842p847p150p212p921q805r548r981r988r691r487
$$ 547854 535413 524582 514829 505987 498140 490990 483778 475857 467052 457504 447523 437535 427844 418357
62943D18357r588r784r795r601r169q318p147o228n965n992n626m791m061l881
$$ 418357 408769 398985 389190 379589 370420 362102 354955 348727 342762 336770 331144 326353 322292 318411
62929C18411m078m162l868l297k727k334k080j811j530j394j428j387j047n27
$$ 318411 314333 310171 306303 303006 300279 297945 295865 294054 292524 291130 289702 288315 287268 286741
62915B86741k00l27p65r99n01P48K089K684K327J622J280J461J838K088K187K322
$$ 286741 286541 286214 285449 284450 283949 284697 286786 289470 291797 293419 294699 296160 297998 300086 302273 304595
62899C04595K706L415M304N106N668O072O536P213Q077Q872R289R314R274R319
$$ 304595 307301 310716 315020 320126 325794 331866 338402 345615 353692 362564 371853 381167 390441 399760
62885C99760R029P830N742L365J145q93k726m137n114o003p013p865q222q151
$$ 399760 408789 416619 422361 425726 426871 425978 423252 419115 414001 407998 400985 393120 384898 376747
62871C76747p984p933q020q147q049p470o610o038n961n904n435m786m354l955
$$ 376747 368763 360830 352810 344663 336614 329144 322534 316496 310535 304631 299196 294410 290056 286101
62857B86101l144k103j570j804k144j781o87M10Q35N49N2k04k49m05p51j015r78
$$ 286101 282957 280854 279284 277480 275336 273555 272868 273278 274113 274662 274714 274510 274261 273856 273105 272090 271112
62840B71112p28l40L22J205J761J446M42m89q25p28o60q03r06o36k1M78M79K06
$$ 271112 270384 270044 270366 271571 273332 274778 275220 274731 273906 273178 272518 271715 270809 270173 270152 270630 271109 271315
62822B71315K18N56O31J07n46p13m16m6L00O62P79M03j29l34m07r64j938k508
$$ 271315 271533 272089 272720 272827 272281 271568 271152 271106 271406 272068 272847 273250 273121 272787 272380 271416 269478 266970
62804B66970k258j673j279q91j74N96Q73O55M65O03P95O21J01k41J26J133K051
$$ 266970 264712 263039 261760 260869 260695 261291 262164 262819 263284 263887 264682 265303 265404 265163 265289 266422 268473
62787B68473K191J601R17O15O78R06J176J414J561J663J736J682J595K016L342
$$ 268473 270664 272265 273182 273797 274475 275381 276557 277971 279532 281195 282931 284613 286208 288224 291566
62772B91566N056O098O073N543N041M511L890L495L385K960J862O96J58j08r84
$$ 291566 296622 302720 308793 314336 319377 323888 327778 331273 334658 337618 339480 340176 340334 340226 339242
62757C39242k411l357l275k792k698k945l028k889k885l155l428l501l536l813
$$ 339242 336831 333474 330199 327407 324709 321764 318736 315847 312962 309807 306379 302878 299342 295529
62743B95529m319m690m526l762k742j968j743k015k445k605k288j655j008l73
$$ 295529 291210 286520 281994 278232 275490 273522 271779 269764 267319 264714 262426 260771 259763 259390
62729B59390M91J574K386K435J752P42l06j241j710j320j51J218K361L313M157
$$ 259390 259881 261455 263841 266276 268028 268770 268464 267223 265513 264193 264042 265260 267621 270934 275091
62714B75091M690M812M937N537O421O987P246Q038R909J2170J3620J4082J4618
$$ 275091 279781 284593 289530 295067 301488 308475 315721 323759 333668 345838 359458 373540 388158
62701C88158J6116J8230K0097K1641K3558K6155K8849L0988L2664L4341L6000
$$ 388158 404274 422504 442601 464242 487800 513955 542804 573792 606456 640797 676797
62690F76797L7071L7166L6537L5677L4592L2629K9060K3774J7299J0237K920m301
$$ 676797 713868 751034 787571 823248 857840 890469 919529 943303 960602 970839 973759 969458
62678I69458j0907j6648k1859k6862l1259l4360l6212l7476l8262l7847l5887
$$ 969458 958551 941903 920044 893182 861923 827563 791351 753875 715613 677766 641879
62667F41879l3236l1027k9470k8033k6419k4671k2633k0070j7283j4985j3459
$$ 641879 608643 577616 548146 520113 493694 469023 446390 426320 409037 394052 380593
62656C80593j2290j0999r611q460p811p655p624p177o117m922m236m115m112l999
$$ 380593 368303 357304 347693 339233 331422 323767 316143 308966 302849 297927 293691 289576 285464 281465
62642B81465l890l743l238k368j635j449j627j683j314n12M65J123J034L50k70
$$ 281465 277575 273832 270594 268226 266591 265142 263515 261832 260518 260006 260471 261594 262628 262978 262708
62627B62708m25l60m72p82j121j468j785j810j439j097j314j977k340j891q97
$$ 262708 262283 261923 261451 260669 259548 258080 256295 254485 253046 251949 250635 248658 246318 244427 243530
62612B43530r3N2l13o52n88k04J94N47J014J502J600J140O03N74J027J433J420
$$ 243530 243437 243489 243176 242524 241936 241732 241926 242473 243487 244989 246589 247729 248332 248906 249933 251366 252786
62595B52786J040N14P2j0L53P69P33L65M22J295K336K543J761Q44O18R89J211
$$ 252786 253826 254340 254412 254402 254755 255524 256257 256622 257044 258339 260675 263218 264979 265823 266441 267430 268641
62578B68641Q22J18l28l92n06j043j793k145j774j001m64n72j302k289l037l125
$$ 268641 269463 269581 269253 268861 268355 267312 265519 263374 261600 260599 260135 259563 258261 255972 252935 249810
62562B49810k533j690j059o08M1R40J522J257L84l17m30k48k12l01k01J94O39
$$ 249810 247277 245587 244528 243920 243961 244901 246423 247680 248064 247747 247317 247069 246857 246556 246355 246549 247188
62545B47188P66L26n79j356j277k48Q97J251Q70O65J301K495L435L601L070K305
$$ 247188 247954 248280 247701 246345 245068 244820 245717 246968 247838 248503 249804 252299 255734 259335 262405 264710
62529B64710J755J547J535J721K403L603M625M701M111M065N256P089Q586R576
$$ 264710 266465 268012 269547 271268 273671 277274 281899 286600 290711 294776 300032 307121 315707 325283
62515C25283J0558J1836J3314J4918J6649J8298J9570K0485K1301K2069K2526
$$ 325283 335841 347677 360991 375909 392558 410856 430426 450911 472212 494281 516807
62504E16807K2419K1688K0373J8607J6594J4312J1401P651L512k91l462o152q329
$$ 516807 539226 560914 581287 599894 616488 630800 642201 649852 653364 653073 649611 643459 635130
62491F35130r730j0326j0357r824q450o301l846j208K049O071J0179J3638J6608
$$ 635130 625400 615074 604717 594893 586443 580142 576296 575088 577137 583208 593387 607025 623633
62478F23633J9772K3251K6375K8455K9318K9230K8664K8068K7370K5758K2333
$$ 623633 643405 666656 693031 721486 750804 780034 808698 836766 864136 889894 912227
62467I12227J7110J0979M717j542p743j3417j8237k2726k7790l3419l8353m1186
$$ 912227 929337 940316 945033 943491 935748 922331 904094 881368 853578 820159 781806 740620
62455G40620m1660m0653l9116l7359l5285l2888l0240k7256k3799k0040j6492
$$ 740620 698960 658307 619191 581832 546547 513659 483419 456163 432364 412324 395832
62444C95832j3615j1522j0019q771p502o198n149m581m257l738k968k306k000
$$ 395832 382217 370695 360676 351905 344403 338205 333056 328475 324218 320480 317512 315206 313206
62431C13206j958k115k529k929k715j739p30m54p80j051j088j234j551j612j178
$$ 313206 311248 309133 306604 303675 300960 299221 298491 298037 297257 296206 295118 293884 292333 290721 289543
62416B89543n57j77j62m55r41j350j386j100q61q57q68n86J9P20J177J088N52
$$ 289543 288986 288809 288647 288192 287251 285901 284515 283415 282554 281697 280829 280243 280262 280982 282159 283247 283799
62399B83799J27K09M29J91k62l0J126K331K743K541K406K667L351M506N830O468
$$ 283799 283926 284135 284564 284755 284493 284463 285589 287920 290663 293204 295610 298277 301628 306134 311964 318432
62383C18432N885M657L819L709M012M608N684P130Q553R878J1280J2536J3070
$$ 318432 324317 328974 332793 336502 340514 345122 350806 357936 366489 376367 387647 400183 413253
62370D13253J2801J2436J2751J3924J5615J7335J8709J9856K1503K4294K7969
$$ 413253 426054 438490 451241 465165 480780 498115 516824 536680 558183 582477 610446
62359F10446L1694L5117L8683M2864M7644N2767N7924O2607O6331O9052P0753
$$ 610446 642140 677257 715940 758804 806448 859215 917139 979746 1046077 1115129 1185882
62348A185882P0636O7535O1288N2819M2619L0308J6260K536q887j8145k6634l4621
$$ 1185882 1256518 1324053 1385341 1438160 1480779 1511087 1527347 1529883 1520996 1502851 1476217 1441596
62336A441596m0996m5235m8283n1172n3750n5222n5191n3719n0928m7051m2554
$$ 1441596 1400600 1355365 1307082 1255910 1202160 1146938 1091747 1038028 987100 940049 897495
62325H97495l7894l3403k9576k6978k5520k4250k2338k0050j8364j7744j7735
$$ 897495 859601 826198 796622 769644 744124 719874 697536 677486 659122 641378 623643
62314F23643j7697j7446j7095j6662j6108j5565j5249j5103j4774j3936j2607
$$ 623643 605946 588500 571405 554743 538635 523070 507821 492718 477944 464008 451401
62303D51401j1024r409p952o910o390o047n243l703j867n07mj64n23o68l70L99
$$ 451401 440377 430968 423016 416106 409716 403669 398426 394723 392856 392349 392345 392181 391658 390990 390620 391019
62287C91019J463K489L090L086K815L081M427O407P856P962O932N565M546M209
$$ 391019 392482 394971 398061 401147 403962 407043 411470 417877 425733 433695 440627 446192 450738 454947
62273D54947M576N332O057O735P745R191J0568J1430J2047J3050J4718J6959J9700
$$ 454947 459523 464855 470912 477647 485392 494583 505151 516581 528628 541678 556396 573355 593055
62260E93055K2913K6474L0425L5069M0434M5955N1116N6071O1146O6019O9985
$$ 593055 615968 642442 672867 707936 748370 794325 845441 901512 962658 1028677 1098662
62249A098662P2614P3466P1535O5965N7243M6750L5133K2076P867n921j7781k7586
$$ 1098662 1171276 1244742 1316277 1382242 1439485 1486235 1521368 1543444 1551311 1545390 1527609 1500023
62237A500023l6105m3818n0661n6379o0643o3169o4108o3901o2575n9710n5418
$$ 1500023 1463918 1420100 1369439 1313060 1252417 1189248 1125140 1061239 998664 938954 883536
62226H83536n0676m6232m1787l6854l1853k7685k4543k1852j9174j6580j4292
$$ 883536 832860 786628 744841 707987 676134 648449 623906 602054 582880 566300 552008
62215E52008j2449j1149j0268r417q400p537p116o787n976m695l543k925k758
$$ 552008 539559 528410 518142 508725 500325 492788 485672 478885 472909 468214 464671 461746 458988
62202D58988k740k595k192j721j555j569r65P32K775L913L868L529L742M499N385
$$ 458988 456248 453653 451461 449740 448185 446616 445651 446383 449158 453071 456939 460468 464210 468709 474094
62187D74094O199O993P841Q806R861J0882J1806J2727J3561J3869J3389J2535
$$ 474094 480293 487286 495127 503933 513794 524676 536482 549209 562770 576639 590028 602563
62175F02563J1905J1443J0640R477Q673Q917J0259J2312J4727J7519K1177K6234
$$ 602563 614468 625911 636551 646028 654701 663618 673877 686189 700916 718435 739612 765846
62163G65846L2388L8350M3107M6938N0499N3281N3919N1864M7647M1496L3017
$$ 765846 798234 836584 879691 926629 977128 1030409 1084328 1136192 1183839 1225335 1258352
62152A258352K2659J2202L002n376j3851k1958k8366l2810l6384l9971m3352m5896
$$ 1258352 1281011 1293213 1296215 1290839 1276988 1255030 1226664 1193854 1157470 1117499 1074147 1028251
62140A028251m7364m7630m6327m3199l8658l3661k9101k5335k2192j9327j6562
$$ 1028251 980887 933257 886930 843731 805073 771412 742311 716976 694784 675457 658895
62129F58895j3904j1340q864o650m964l773k740j621m17R65K741M719O241O977
$$ 658895 644991 633651 624787 618137 613173 609400 606660 605039 604622 605587 608328 613047 619288 626265
62115F26265P475Q515J0191J2013J3650J5145J6483J7352J7231J5565J2092P325
$$ 626265 633740 642255 652446 664459 678109 693254 709737 727089 744320 759885 771977 779302
62103G79302K418j694m792o798p269o128m442l713m479o167q149j0196j1954j2832
$$ 779302 781720 780026 775234 768436 761167 755039 750597 746884 742405 736238 728089 717893 705939 693107
62089F93107j2599j1511r648o766k982J010M564P480R615J0843J1679J3179J5665
$$ 693107 680508 668997 659349 652583 649601 650611 655175 662655 672270 683113 694792 707971 723636
62076G23636J8169J9764K0874K2599K5076K7388K8841K9614L0101L0419L0694
$$ 723636 741805 761569 782443 805042 830118 857506 886347 915961 946062 976481 1007175
62065A007175L1278L2327L3571L4736L5870L7107L8387L9529M0238L9844L7398
$$ 1007175 1038453 1070780 1104351 1139087 1174957 1212064 1250451 1289980 1330218 1370062 1407460
62054A407460L2364K5112J6533P397j789j0453j7935k3843k8376l2191l5981m0004
$$ 1407460 1439824 1464936 1481469 1488866 1487077 1476624 1458689 1434846 1406470 1374279 1338298 1298294
62042A298294m3896m6992m8880m9553m9065m7335m4448m1017l7838l5238l2949
$$ 1298294 1254398 1207406 1158526 1108973 1059908 1012573 968125 927108 889270 854032 821083
62031H21083l0626k8155k5476k2424j9078j5979j3645j1918j0152q182o650o103
$$ 821083 790457 762302 736826 714402 695324 679345 665700 653782 643630 635448 628798 622695
62019F22695o135n919n419n399o156o915o935o561o541o717o314n386m923n234
$$ 622695 616560 610641 605222 599823 593667 586752 579817 573256 566715 559998 553684 548298 543375 538141
62005E38141n208l797j514L00J236J918K704L322L732M415N416N962N466M333
$$ 538141 532933 529136 527622 527922 529158 531076 533780 537102 540834 545249 550665 556627 562093 566426
61991E66426L251K230R15n65j784k850m307o157p608q058p931q196r268j0620
$$ 566426 569677 571907 572822 572257 570473 567623 563316 557159 549551 541493 533562 525366 516098 505478
61977E05478j1377j1096r999q666p583o934o669o572o362n846n105m428l986l729
$$ 505478 494101 483005 473006 464340 456757 449823 443154 436582 430220 424374 419269 414841 410855 407126
61963D07126l581l510l328k710j630n93j56l06n05k64M96J500K312K593K412K310
$$ 407126 403545 400035 396707 393997 392367 391774 391618 391312 390807 390543 391039 392539 394851 397444 399856 402166
61947D02166K797L880N220O615Q012R274J0326J1459J3024J4801J6155J6931J7818
$$ 402166 404963 408843 414063 420678 428690 437964 448290 459749 472773 487574 503729 520660 538478
61934E38478J9392K1218K2233K1956K0940J9996J9324J8533J7320J5774J3958
$$ 538478 557870 579088 601321 623277 644217 664213 683537 702070 719390 735164 749122
61923G49122J1577Q400M867J805n33k750n413q260j0598j2124j2874j2756j1652
$$ 749122 760699 769099 773966 775771 775238 772488 767075 758815 748217 736093 723219 710463 698811
61910F98811r870p854n464k159K013O157R501J2190J4782J7244J8748J8412J6101
$$ 698811 688941 681087 675623 673464 675477 681634 691135 703325 718107 735351 754099 772511 788612
61897G88612J2594Q923N480J873k234o416r989j2830j5176j6832j7406j7201j7085
$$ 788612 801206 810129 815609 817482 815248 808832 798843 786013 770837 754005 736599 719398 702313
61884G02313j7362j7512j7210j6713j6045j4699j2714j1157j0883j1439j1932
$$ 702313 684951 667439 650229 633516 617471 602772 590058 578901 568018 556579 544647
61873E44647j2265j2757j3064j2526j1279j0060r062p828o192m531l034j498R4
$$ 544647 532382 519625 506561 494035 482756 472696 463634 455806 449614 445083 442049 440551 440645
61860D40645J506K875M735P238R890J2255J4400J6490J8485K0456K2682K5212
$$ 440645 442151 445026 449761 456999 466889 479144 493544 510034 528519 548975 571657 596869
61848E96869K7708K9938L1992L3841L5154L5830L6230L6474L5807L3258K8826
$$ 596869 624577 654515 686507 720348 755502 791332 827562 864036 899843 933101 961927
61837I61927K3527J8192J2599O108j106p863j3170j7102k0078k1623k0714j7382
$$ 961927 985454 1003646 1016245 1022353 1021247 1013384 1000214 983112 963034 941411 920697 903315
61825I03315j3017q635l810J974P748J2047J4859J7188J8890J8445J5168J0205
$$ 903315 890298 881663 877853 879827 887575 899622 914481 931669 950559 969004 984172 994377
61813I94377M786j193q067j4988k0791k5545l0015l4015l6437l6876l6121l4910
$$ 994377 999163 997970 989903 974915 954124 928579 898564 864549 828112 791236 755115 720205
61801G20205l3036l0088k6487k3291k1183j9889j8506j6396j3797j1575j0287
$$ 720205 687169 657081 630594 607303 586120 566231 547725 531329 517532 505957 495670
61790D95670r667r108q424p846p502p283p080o841o454n890n350n001m585l675
$$ 495670 486003 476895 468471 460625 453123 445840 438760 431919 425465 419575 414225 409224 404639 400964
61776D00964k278r64l34n40j243j819j710q43K12P22M63j37m43j20O74J424J692
$$ 400964 398686 397722 397388 396848 395605 393786 392076 391233 391445 392167 392630 392493 392050 391930 392604 394028 395720
61759C95720J602J776K607L764M629N045N363N839O330O625O751O819O768O330
$$ 395720 397322 399098 401705 405469 410098 415143 420506 426345 432675 439300 446051 452870 459638 465968
61745D65968N279L671J879L23q56j767k393k512k027j265p06n76p93j070j022
$$ 465968 471247 474918 476797 477120 476264 474497 472104 469592 467565 466300 465594 465018 464225 463155 462133
61730D62133m59K96N93K07l92o85o31l13M86J819L051L422L007K582K614K901
$$ 462133 461674 461970 462563 462770 462378 461693 461062 460749 461235 463054 466105 469527 472534 475116 477730 480631
61714D80631L161L406L608L543L127K548J921J073j98j854l578m828n059m289
$$ 480631 483792 487198 490806 494349 497476 500024 501945 503018 502820 500966 497388 492560 487501 483212
61700D83212l330l106l747m708n552o160o326n843n044m594m582m376l577k535
$$ 483212 479882 476776 473029 468321 462769 456609 450283 444440 439396 434802 430220 425844 422267 419732
61686D19732j757j309j149j417k077k693k970l054l052k699j946j376j498k005
$$ 419732 417975 416666 415517 414100 412023 409330 406360 403306 400254 397555 395609 394233 392735 390730
61672C90730k214j984j653j278o01L58J199J648J771J686J434J121Q87P23N13
$$ 390730 388516 386532 384879 383601 383000 383358 384557 386205 387976 389662 391096 392217 393104 393827 394340
61657C94340K47M7O0M47J244K123K599K717L086L984M786M797M223L785L713L758
$$ 394340 394587 394634 394694 395141 396385 398508 401107 403824 406910 410894 415680 420477 424700 428485 432198 435956
61641D35956L910M355M816M733M157L751L781L788L322K441J276j70j533k071
$$ 435956 439866 444221 449037 453770 457927 461678 465459 469247 472569 475010 476286 476116 474583 472512
61627D72512j591r35j065k017l082l663l674l334k924k560k092j441j075j558
$$ 472512 470921 469986 468921 466904 463822 460159 456485 453151 450227 447667 445575 444134 443059 441501
61613D41501k539k902k287j724k197l257l897m197n004o256o834o241n424n439
$$ 441501 438962 436060 433773 432049 429852 426595 422698 418501 413497 407241 400407 394166 388742 383303
61599C83303o069o325n761m798m021l695l790l992l824l093k278k130k861l831
$$ 383303 377234 370909 365148 360350 356329 352634 348844 344852 341028 337935 335657 333527 330666 326835
61585C26835m154l544k540j908j892k130k276k423k725k914k578j838j256j085
$$ 326835 322681 319137 316597 314689 312797 310667 308391 305968 303243 300329 297751 295913 294657 293572
61571B93572j100j180j497j913j823j058l91n81j314j751j790j925j997j155N90
$$ 293572 292472 291292 289795 287882 286059 285001 284610 284029 282715 280964 279174 277249 275252 274097 274687
61556B74687J776J201m00j225o09M74R92R56Q14N96K28N8L68O86L74l07l81N11
$$ 274687 276463 277664 277264 276039 275430 275904 276896 277852 278666 279262 279490 279548 279916 280602 280976 280669 280288 280799
61538B80799J606K042J827J456J093O72M54Q87J877K673K663J954J147P46Q56
$$ 280799 282405 284447 286274 287730 288823 289495 289949 290836 292713 295386 298049 300003 301150 301896 302752
61523C02752J204J272N93q91k676l994m310l700k814k320k282k202j736j119p02
$$ 302752 303956 305228 305821 304930 302254 298260 293950 290250 287436 285116 282834 280632 278896 277777 277075
61508B77075l55K37Q68R21K22o23r08n16J11M39K17l09m65J60J066J288N80k72
$$ 277075 276720 276957 277825 278746 278968 278345 277437 276921 277032 277471 277688 277379 276914 277074 278140 279428 280008 279736
61490B79736m97k00N5N7o4j97k29k3J55l22j480k297j929r98p62j238j221j99
$$ 279736 279239 279039 279094 279151 279087 278890 278661 278638 278793 278471 276991 274694 272765 271767 271005 269767 268546 268347
61472B68347P97P54J12j7N06Q31M17l27p01m67P0M58L92j00p29j177j271r90m68
$$ 268347 269144 269898 270010 269993 270499 271330 271747 271420 270719 270252 270322 270780 271172 271072 270343 269166 267895 266905 266437
61453B66437k9N3o9K1L98P19Q23J037J581K084K054J597J245J251J472J721J846
$$ 266437 266408 266461 266392 266413 266811 267530 268353 269390 270971 273055 275109 276706 277951 279202 280674 282395 284241
61436B84241J628J066O72R80J764K249K136J939K130K455K333J640P84K43J78
$$ 284241 285869 286935 287607 288587 290351 292600 294736 296675 298805 301260 303593 305233 306017 306260 306438
61421C06438M16N98N13L81O10J255J922K310K545K848L135L163K780J893M61j236
$$ 306438 306854 307452 307965 308346 308956 310211 312133 314443 316988 319836 322971 326134 328914 330807 331268 330032
61405C30032k534l014k961k878k725k107j205q13j306j994k001j445j253j827
$$ 330032 327498 324484 321523 318645 315920 313813 312608 311795 310489 308495 306494 305049 303796 301969
61391C01969k411k047p84M47R86J051J092J047N94n1k29K61Q07Q31N65O76J336
$$ 301969 299558 297511 296727 297174 298160 299211 300303 301350 301944 301893 301664 301925 302732 303563 304128 304804 306140
61374C06140K145K780L248L462L142K321J481R22L85l22p15k81M84M17p64j911
$$ 306140 308285 311065 314313 317775 320917 323238 324719 325641 326026 325704 324989 324708 325192 325609 324845 322934
61358C22934j836p45K07M89O53J289K192K864L296L800M397M869N317O169P527
$$ 322934 321098 320353 320560 321049 321702 322991 325183 328047 331343 335143 339540 344409 349726 355895 363422
61343C63422Q938R963J0632J1117J1306J0977J0183R044P380N044K615J136R54
$$ 363422 372360 382323 392955 404072 415378 426355 436538 445582 452962 458006 460621 461757 462711
61330D62711J266J137N57K9n06j578l064l926l473k330j734k107k845l289l352
$$ 462711 463977 465114 465671 465700 465194 463616 460552 456626 453153 450823 449089 446982 444137 440848 437496
61315D37496l232l006k710k464k301k092j780j460j055k16J138K413K863K549
$$ 437496 434264 431258 428548 426084 423783 421691 419911 418451 417396 417180 418318 420731 423594 426143
61301D26143K422L331N101O736P385P025O307N824N541M831L141N90k085m173
$$ 426143 428565 431896 436997 443733 451118 458143 464450 470274 475815 480646 483787 484377 482292 478119
61287D78119n518o431p225p901q144p552n997l940k262j592j728j827j264j57
$$ 478119 472601 466170 458945 451044 442900 435348 429351 425411 423149 421557 419829 418002 416738 416581
61273D16581R68J885K837M060N342O236O576O662O912P416P928Q166Q054P755
$$ 416581 417549 419434 422271 426331 431673 437909 444485 451147 458059 465475 473403 481569 489623 497378
61259D97378P579P789Q342Q827Q901Q837R390J0891J2683J3739J3734J3146J2271
$$ 497378 504957 512746 521088 529915 538816 547653 557043 567934 580617 594356 608090 621236 633507
61246F33507J0731Q087M637J194j666l795n183n948o519p315q147q380p799o853
$$ 633507 644238 652325 656962 658156 656490 652695 647512 641564 635045 627730 619583 611203 603404 596551
61232E96551n962n024l853k708j999j742j708j853k257k732k909k603j820o56
$$ 596551 590589 585565 581712 579004 577005 575263 573555 571702 569445 566713 563804 561201 559381 558725
61218E58725N44J154R02L06o9n56j841l567m369l667k510k149k474k570k257k162
$$ 558725 559269 560423 561325 561631 561562 561006 559165 555598 551229 547562 545052 542903 540429 537859 535602 533440
61202E33440k477k617k239j844j984k474k707k395j579k51J594L709N756P686
$$ 533440 530963 528346 526107 524263 522279 519805 517098 514703 513124 512873 514467 518176 523932 531618
61188E31618R630J1475J2986J4344J6072J8049J9037J7743J4394J0777Q499P562
$$ 531618 541248 552723 565709 580053 596125 614174 633211 650954 665348 676125 684624 692186
61176F92186O887N839M766M246M304M489M338L652K616J687J101M73p41k350l454
$$ 692186 699073 704912 709678 713924 718228 722717 727055 730707 733323 735010 736111 736584 735843 733493 730039
61161G30039l585l353l687m804o254p537q339q501q318q514r374j0096r676q272
$$ 730039 726454 723101 719414 714610 708356 700819 692480 683979 675661 667147 657773 647677 638001 629729
61147F29729o975o271n526m124k304n43J173K884M013L841K408L71j855m359p159
$$ 629729 622754 616483 610957 606833 604529 603986 605159 608043 612056 615897 618305 618676 616821 612462 605303
61132F05303r801j1545j1801j0549q553o902n970n064l510j733o85m20r3P04J440
$$ 605303 595502 583957 572156 561607 553054 546152 540182 535118 531608 529875 529190 528770 528677 529381 530821
61117E30821J818K518M262O689Q858J0456J1842J3286J4770J6375J8107J9436
$$ 530821 532639 535157 539419 546108 554966 565422 577264 590550 605320 621695 639802 659238
61105F59238J9729J9186J8649J8438J8050J7178J6261J5676J5108J4231J3314
$$ 659238 678967 698153 716802 735240 753290 770468 786729 802405 817513 831744 845058
61094H45058J2553J1287Q709N058J334j978n149q291j1026j3194j5054j6533j6916
$$ 845058 857611 868898 877607 882665 883999 882021 876872 868581 857555 844361 829307 812774 795858
61081G95858j5773j3807j2289j1928j2460j3173j3524j3433j3200j3114j3049
$$ 795858 780085 766278 753989 742061 729601 716428 702904 689471 676271 663157 650108
61070F50108j2636j1749j0540r051p200n229l722k894k327j583p26j6N61J141
$$ 650108 637472 625723 615183 606132 598932 593703 589981 587087 584760 583177 582451 582435 582996 584137
61056E84137J716K275K953L721M310M631N044N843O781P511Q134Q950R897J0665
$$ 584137 585853 588128 591081 594802 599112 603743 608787 614630 621411 628922 637056 646006 655903 666568
61042F66568J1209J1750J2468J3505J5097J7221J9336K0930K2244K3940K6154
$$ 666568 677777 689527 701995 715500 730597 747818 767154 788084 810328 834268 860422
61031H60422K8294K9879L1130L2626L4717L7347M0246M3135M5899M8634N1510
$$ 860422 888716 918595 949725 982351 1017068 1054415 1094661 1137796 1183695 1232329 1283839
61020A283839N4572N7663O0412O2360O3406O4149O5572O8334P2717P9194Q8429
$$ 1283839 1338411 1396074 1456486 1518846 1582252 1646401 1711973 1780307 1853024 1932218 2020647
61009B020647J00511J14768J30557J47799J66853J88909K16975K55382L07234
$$ 2020647 2121158 2235926 2366483 2514282 2681135 2870044 3087019 3342401 3649635
61000C649635L72899M51710N44579O54424P85742R46097J147315J400944J707818
$$ 3649635 4022534 4474244 5018823 5673247 6458989 7405086 8552401 9953345 11661163
60991A1661163K050056K394053K702487K941503L071032L027294K729322K131726
$$ 11661163 13711219 16105272 18807759 21749262 24820294 27847588 30576910 32708636
60983C2708636J295812M09030k89806o35635o15145l45807J239K57876K76278
$$ 32708636 34004448 34413478 34123672 33488037 32872892 32527085 32528324 32786200 33062478
60974C3062478m9055p26837j624518k500377l115920l351061l237673k901317
$$ 33062478 33013423 32286586 30662068 28161691 25045771 21694710 18457037 15555720
60966A5555720k474432k046556j662870j341103j082502q77681p14300n83407
$$ 15555720 13081288 11034732 9371862 8030759 6948257 6070576 5356276 4772869
60958D772869m79378l97016l31636k80659k42397k13740j90941j72016j56444
$$ 4772869 4293491 3896475 3564839 3284180 3041783 2828043 2637102 2465086 2308642
60949B308642j42960j29636j15986j03067r1365q0215o9496o0372n3911n0109
$$ 2308642 2165682 2036046 1920060 1816993 1725628 1645413 1575917 1515545 1461634 1411525
60939A411525m8579m8998n0499n1623n1366m9694m6981m3690m0622l8468l6939
$$ 1411525 1362946 1313948 1263449 1211826 1160460 1110766 1063785 1020095 979473 941005 904066
60928I04066l5076l2573l0014k7845k5919k4100k2404k0580j8464j6722j6196
$$ 904066 868990 836417 806403 778558 752639 728539 706135 685555 667091 650369 634173
60917F34173j6433j6005j4408j2567j1258j0245r303q830q832q448p146n478m035
$$ 634173 617740 601735 587327 574760 563502 553257 543954 535124 526292 517844 510698 505220 501185
60904E01185k587r79J41L74N09J416K651L091K539J829J671K172L151M160M483
$$ 501185 498598 497619 497760 498134 498643 500059 502710 505801 508340 510169 511840 514012 517163 521323 525806
60889E25806L759K413J002n12k259l786m654n303o507q174r493j0103j0371j0543
$$ 525806 529565 531978 532980 532468 530209 526423 521769 516466 509959 501785 492292 482189 471818 461275
60875D61275j0388r762q924q185p681p489p472p125o106m884m297m400m357l554
$$ 461275 450887 441125 432201 424016 416335 408846 401374 394249 388143 383259 378962 374562 370205 366651
60861C66651k288j114q0J039K073K586K588K729L593M887N630N212M200L773M391
$$ 366651 364363 363249 363169 364208 366281 368867 371455 374184 377777 382664 388294 393506 397706 401479 405870
60846D05870N324N601N122M630M779N511O229O308N528M141K522Q49p04j729k005
$$ 405870 411194 416795 421917 426547 431326 436837 443066 449374 454902 459043 461565 462414 461710 459981 457976
60831D57976k125k965m328m837l738k104j572k293k990k782k097j766k050k770
$$ 457976 455851 452886 448558 443721 439983 437879 436307 434014 431024 428242 426145 424379 422329 419559
60817D19559l722m666n312n621n844o061o030n632n213n207n583n919n859n399
$$ 419559 415837 411171 405859 400238 394394 388333 382303 376671 371458 366251 360668 354749 348890 343491
60803C43491m756m114l497k849k182j594j133p95o88j016j694k200k039j336o88
$$ 343491 338735 334621 331124 328275 326093 324499 323366 322571 321883 320867 319173 316973 314934 313598 312910
60788C12910m68m40j82L46P42P11M94O53J402K371L128L715M325M749M592L960
$$ 312910 312442 312002 311820 312166 312908 313619 314113 314766 316168 318539 321667 325382 329707 334456 339048 343008
60772C43008L396L133L042L283M250N630O378O116N786O222O826O512N415M610
$$ 343008 346404 349537 352579 355862 360112 365742 372120 378236 384022 390244 397070 403582 408997 413607
60758D13607M386L966K962K020J689J601J218P36O52Q49P10m4j058j748j775j162
$$ 413607 417993 421959 424921 426941 428630 430231 431449 432185 432837 433686 434396 434352 433294 431546 429771 428609
60742D28609k14O18R54O08l36j500k440l081l790m822n857o427o548o502o142
$$ 428609 428395 429013 429967 430575 430239 428739 426299 423218 419428 414606 408749 402322 395774 389272 383130
60727C83130n029l285j722r34o44k35M49J102J484J743K309L495N083O322O666
$$ 383130 378101 374816 373094 372160 371516 371281 371730 372832 374316 376059 378368 381863 386946 393268 399934
60712C99934O517O831P903R068R765J0408J1748J3679J5280J5962J6165J6796
$$ 399934 406451 413282 421185 430253 440018 450426 462174 475853 491133 507095 523260 540056
60700E40056J8269K0209K1821K2454K1929K0568J8981J7719J6942J6379J5540
$$ 540056 558325 578534 600355 622809 644738 665306 684287 702006 718948 735327 750867
60689G50867J3947J1225P209K230k798o965j0182j3114j6247j9213k1255k2033
$$ 750867 764814 776039 783248 785478 782680 775715 765533 752419 736172 716959 695704 673671
60677F73671k1743k0782j9602j8618j7881j7041j5962j5129j4984j5051j4332
$$ 673671 651928 631146 611544 592926 575045 558004 542042 526913 511929 496878 482546
60666D82546j2504j0204q176o689n809n660o142o798p206p218o825o109n421n122
$$ 482546 470042 459838 451662 444973 439164 433504 427362 420564 413358 406140 399315 393206 387785 382663
60652C82663n031m486l233j841j031q39o51O0J259K439L107L227L132K919K216
$$ 382663 377632 373146 369913 368072 367041 366202 365551 365611 366870 369309 372416 375643 378775 381694 383910
60637C83910R32j75k88K89N22K22K77J112J921K013K002K775L911M165L302K378
$$ 383910 384842 384667 384379 384668 385190 385412 385689 386801 388722 390735 392737 395512 399423 403588 406890 409268
60621D09268K169K231J821R32K8p54j542k213k455k357k448l049l736l770k959
$$ 409268 411437 413668 415489 416421 416449 415695 414153 411940 409485 407128 404680 401631 397895 394125 391166
60606C91166j873j128o50PP83R33j0j483k434k521k347k446k497j851n58N24P09
$$ 391166 389293 388165 387515 387522 388305 389238 389228 387745 385311 382790 380443 377997 375500 373649 373091 373615 374324
60589C74324J36o46j353j870j900j253m32k22n73n09N52K020L071L741M436M961
$$ 374324 374460 373814 372461 370591 368691 367438 367006 366784 366211 365702 366254 368274 371345 375086 379522 384483
60573C84483M921M827N744P869J0235J2015J3385J4820J6404J8126K0272K2941
$$ 384483 389404 394231 399975 407844 418079 430094 443479 458299 474703 492829 513101 536042
60561E36042K5539K7150K7235K5778K2933J8775J3215O274j356q233j3224j6444
$$ 536042 561581 588731 615966 641744 664677 683452 696667 702941 701585 693352 680128 663684
60549F63684j8487j8935j6701j1929o370j486K885P402J1893J5996K0206K5169
$$ 663684 645197 626262 609561 597632 591262 589776 592661 600063 611956 627952 648158 673327
60537F73327L0510L5366L9591M3408M6225M6858M4798M0251L3190K3438J1800
$$ 673327 703837 739203 778794 822202 868427 915285 960083 1000334 1033524 1056962 1068762
60526A068762l8j0848k0243k7521l1326l1065k8015k4291k1147j8564j6168j3915
$$ 1068762 1068724 1057876 1037633 1010112 978786 947721 919706 895415 874268 855704 839536 825621
60514H25621j2147j1246j1141j1004r799p282m188j246J623M845Q369J1722J4774
$$ 825621 813474 802228 791087 780083 770284 763002 758814 757568 759191 764036 772405 784127 798901
60501G98901J8050K2312K8001L5128M3431N2569O2163P1718Q0684Q8731R5784
$$ 798901 816951 839263 867264 902392 945823 998392 1060555 1132273 1212957 1301688 1397472
60490A397472J01561J05189J05622J02472R6085Q6889P5172O1593M7322L3169
$$ 1397472 1499033 1604222 1709844 1812316 1908401 1995290 2070462 2132055 2179377 2212546
60480B212546J8817L352j3652l1833n0637o9518q7447j02774j14017j20688j23028
$$ 2212546 2231363 2234715 2221063 2189230 2138593 2069075 1981628 1878854 1764837 1644149 1521121
60469A521121j21281j15640j06921r6675q6278p6201o6426n7231m9105m2121l5956
$$ 1521121 1399840 1284200 1177279 1080604 994326 918125 851699 794468 745363 703242 667286
60458F67286l0583k6349k3253k0656j7926j5116j2763j1291j0721j0617j0185
$$ 667286 636703 610354 587101 566445 548519 533403 520640 509349 498628 488011 477826
60447D77826q878p047n633n010m625l957l288l093l242l236k880k242j368n05
$$ 477826 468948 461901 456268 451258 446633 442676 439388 436295 433053 429817 426937 424695 423327 422822
60433D22822j20k33k28J50J48q82k351l299l909n027o416o833n836m410l515l071
$$ 422822 422702 422469 422241 422391 422539 421657 419306 416007 412098 407071 400655 393822 387986 383576 380061 376990
60417C76990k718k506k363j739m42P51R60K32o74j059n81O40J802J892Q12l83
$$ 376990 374272 371766 369403 367664 367222 367973 368933 369165 368491 367432 366851 367491 369293 371185 371997 371614
60401C71614p24l18K31O48Q00M01l42m04Q35K407K752J679M79J78N47R31J138
$$ 371614 370890 370572 370803 371451 372251 372652 372310 371906 372741 375148 377900 379579 380058 380236 380783 381714 382852
60384C82852J175Q54K06j99P8O11N90k1l40K85J401K031J930J747K002K451K705
$$ 382852 384027 384881 385087 384888 384966 385577 386167 386146 385806 386091 387492 389523 391453 393200 395202 397653 400358
60367D00358K979L653M392M422L630K681K016J430Q74Q48J476J961J568P35L96
$$ 400358 403337 406990 411382 415804 419434 422115 424131 425561 426435 427283 428759 430720 432288 433023 433419
60352D33419N50L46m62j025n48P16J957K788L385L966M551N158N854O598P095
$$ 433419 433969 434315 433853 432828 432280 432996 434953 437741 441126 445092 449643 454801 460655 467253 474348
60337D74348O966O116M913L866L077K116O16j098k288k653k642k806l075k967
$$ 474348 481314 487430 492343 496209 499286 501402 502018 500920 498632 495979 493337 490531 487456 484489
60323D84489k415j996k242k984l606l737l426k733j641l96O34J566K942M762O247
$$ 484489 482074 480078 477836 474852 471246 467509 464083 461350 459709 459313 459947 461513 464455 469217 475464
60308D75464P094Q270J0738J3929J6573J8703K1550K5456K9320L2426L5235L7525
$$ 475464 482558 490828 501566 515495 532068 550771 572321 597777 627097 659523 694758 732283
60296G32283L7077L1712K1984J0604m72j1157k1598l0765l7061l9561l8316l4128
$$ 732283 769360 801072 823056 833660 833188 822031 800433 769668 732607 693046 654730 620602
60284F20602k8360k2529j7580j3669j0620q388p032o583o912p589p957p689p117
$$ 620602 592242 569713 552133 538464 527844 519456 512424 505841 498929 491340 483383 475694 468577
60271D68577o643o029m766l103k084k344l348m011l800k921j818p94l8L14K93
$$ 468577 461934 455905 451139 448036 445952 443608 440260 436249 432449 429528 427710 426916 426878 427192 427485
60256D27485J41Q2mn21j582k614k902k495k203k592l351l762l394k206n04R88
$$ 427485 427626 427708 427704 427183 425601 422987 420085 417590 415387 412795 409444 405682 402288 400082 399578 400566
60240D00566J523J187Q95J187J569J470J183J193J222Q06L69P00J672K411K576
$$ 400566 402089 403276 404171 405358 406927 408397 409580 410773 411995 412801 413170 413870 415542 417953 420529
60225D20529K530K406K046J832K458L671M282L736K783K224J833J087J42m45m94
$$ 420529 423059 425465 427511 429343 431801 435472 439754 443490 446273 448497 450330 451417 451559 451114 450620
60210D50620j92L30J016J771K529L136L211K666K216K626L429L383K333J547J884
$$ 450620 450428 450758 451774 453545 456074 459210 462421 465087 467303 469929 473358 476741 479074 480621 482505
60195D82505K704L167L403L606L058J303n00p34M95J539J422P59M32M17K09l19
$$ 482505 485209 488376 491779 495385 498443 499746 499246 498512 499007 500546 501968 502727 503159 503576 503785 503466
60179E03466q96j252j320j271j344j559j729j906k316k679k230r50m6m05j158
$$ 503466 502570 501318 499998 498727 497383 495824 494095 492189 489873 487194 484964 484014 483968 483563 482405
60164D82405q02O23J710J732J355J269J370J544K153L279M356M963N199M919L558
$$ 482405 481603 482226 483936 485668 487023 488292 489662 491206 493359 496638 500994 505957 511156 516075 519633
60149E19633J233q07j575j530j706k218k353j679m04J055K187K436J859J417J937
$$ 519633 520866 520059 518484 516954 515248 513030 510677 508998 508594 509649 511836 514272 516131 517548 519485
60134E19485K977L476L258L081L239L060K016N45o06j327j929k488k875l136l344
$$ 519485 522462 525938 529196 532277 535516 538576 540592 541137 540531 539204 537275 534787 531912 528776 525432
60119E25432l194k243n61J188K372K870K904K714K567K817L641M746N647O277
$$ 525432 522238 519995 519434 520622 522994 525864 528768 531482 534049 536866 540507 545253 550900 557177
60105E57177P070Q281R453R842R242Q155P115O184N152L915K472P33j349l531
$$ 557177 564247 572528 581981 591823 601065 609220 616335 622519 627671 631586 634058 634791 633442 629911
60091F29911n326o345o565o254n804n474n222m720l671k137n45O30J193J239Q63
$$ 629911 624585 618240 611675 605421 599617 594143 588921 584201 580530 578393 577848 578478 579671 580910 581773
60076E81773m0j539l201m180m010l224k837l231l957m530m984n457n704n422m722
$$ 581773 581733 580194 576993 572813 568803 565579 562742 559511 555554 551024 546040 540583 534879 529457 524735
60061E24735l940l201k602k564l423m728n453n139m423m236m801n616o145o196
$$ 524735 520795 517594 514992 512428 509005 504277 498824 493685 489262 485026 480225 474609 468464 462268
60047D62268n794n023m063l115k261j511r67p24n78l5J118K387K998K790K399
$$ 462268 456474 451451 447388 444273 442012 440501 439534 438810 438232 438197 439315 441702 444700 447490 449889
60032D49889K440K790K943K805K656K496J996J183N89M47K14o50j861k713l007
$$ 449889 452329 455119 458062 460867 463523 466019 468015 469198 469787 470234 470448 469798 467937 465224 462217
60017D62217l086l142l135l237l676m098l792k738j806j584j574r17M02J539J747
$$ 462217 459131 455989 452854 449617 445941 441843 438051 435313 433507 431923 430349 429432 429834 431373 433120
60002D33120J043J76J13J274K989M021L917L452L429L554L121K331K092K569K886
$$ 433120 434163 434339 434452 435726 438715 442736 446653 450105 453534 457088 460209 462540 464632 467201 470087
59987D70087K414J635J326J482J495J065M19j45n12n93k91L26R45J139O66l05
$$ 470087 472501 474136 475462 476944 478439 479504 479923 479778 479266 478673 478382 478708 479653 480792 481458 481153
59971D81153j211j606j624j779k255k632k402j534m38M20P86P20N91P27J054J256
$$ 481153 479942 478336 476712 474933 472678 470046 467644 466110 465672 466092 466878 467598 468189 468916 469970 471226
59955D71226J381J811K538K920K495J679J232J292J346R89K76n40j222j459j024
$$ 471226 472607 474418 476956 479876 482371 484050 485282 486574 487920 488909 489185 488645 487423 485964 484940
59940D84940r8P54J010N18m53j362j714j576j614k355l506m300m316l698k751
$$ 484940 484842 485596 486606 487124 486671 485309 483595 482019 480405 478050 474544 470244 465928 462230 459479
59925D59479j734r70o29m19R1Q17J179Q55J91j66K33J379K647L035K180J066J079
$$ 459479 457745 456775 456146 455727 455818 456635 457814 458669 458860 458694 458927 460306 462953 465988 468168 469234 470313
59908D70313K275L291L217K675K651L026K972K315J592J003K25p04j031j74J423
$$ 470313 472588 475879 479096 481771 484422 487448 490420 492735 494327 495330 495555 494851 493820 493646 495069
59893D95069K641K728J885J005Q85J613K597L241L432L399L294L086K723K223
$$ 495069 497710 500438 502323 503328 504213 505826 508423 511664 515096 518495 521789 524875 527598 529821
59879E29821J672J234J050J026R97J132J843L047L873L530K195P11l96j171j735
$$ 529821 531493 532727 533777 534803 535800 536932 538775 541822 545695 549225 551420 552131 551735 550564 548829
59864E48829k077k370k861l406l474k847j954j357j154j114j136j288j511j540
$$ 548829 546752 544382 541521 538115 534641 531794 529840 528483 527329 526215 525079 523791 522280 520740
59850E20740j246q80p48o20K68K330M932O986Q190R184J0462J1717J2458J2590
$$ 520740 519494 518614 517866 517246 517514 519844 524776 531762 539952 549136 559598 571315 583773 596363
59836E96363J1961J0030O650K762m18k528l754l881k663q67J42j93j529l898p804
$$ 596363 608324 618354 625004 627766 627348 624820 621066 617185 614522 613655 613797 613604 612075 608177 600373
59821F00373j2716j6683j8212j7786j6834j5839j4258j1855r268p363o495o339
$$ 600373 587657 570974 552762 534976 518142 502303 488045 476190 466922 459559 453064 446725
59809D46725o117n221l893l021k993l180k815j955j139n60j04J31r9p28j480k228
$$ 446725 440608 435387 431494 428473 425480 422300 419485 417530 416391 415831 415727 415858 415759 415031 413551 411323
59793D11323k888l214l018k468j776r88l02j95o74r22k69P62J044K07j118k210
$$ 411323 408435 405221 402203 399735 397959 396971 396669 396474 395800 394878 394609 395371 396415 396622 395504 393294
59777C93294k787k896k823k912k978k353j021j63o29j443j064K69Q45J20n18K0
$$ 393294 390507 387611 384788 381876 378898 376545 375524 375361 374732 373289 372225 372494 373339 373459 372941 372961
59761C72961J002J266R13P08Q14J019J486K291K846K661K273K511L278L894M257
$$ 372961 373963 375229 376142 376850 377664 378683 380169 382460 385306 387967 390240 392751 396029 399923 404180
59746D04180M810N550N982N907N507M748L499K158J392J215J027N62J31j34n73
$$ 404180 408990 414540 420522 426429 431936 436684 440183 442341 443733 444948 445975 446537 446668 446534 445961
59731D45961j324k054k511k820k992k713j938j216j069j413j881k288k495k195
$$ 445961 444637 442583 440072 437252 434260 431547 429609 428393 427324 425911 424030 421742 419247 417052
59717D17052j277k09K97k5p80j351j363q98l60l6K64R49K001K833K909K403K075
$$ 417052 415775 415566 415863 415838 415058 413707 412344 411446 411086 411050 411314 412263 414264 417097 420006 422409 424484
59700D24484K571L863N243N891N562M851M540M812N247N523N723N960O051N711
$$ 424484 427055 430918 436161 442052 447614 452465 457005 461817 467064 472587 478310 484270 490321 496032
59686D96032M784L244J286m72j303j134o34l69j81K75Q16R23M44l33j167k010
$$ 496032 500816 504060 505346 504874 503571 502437 501803 501434 501253 501528 502344 503267 503711 503378 502211 500201
59670E00201k722l059k974k699k491k501k782l169l183k421j134r1K57K46M60
$$ 500201 497479 494420 491446 488747 486256 483755 480973 477804 474621 472200 471066 470975 471232 471478 471938
59655D71938R46J263J226J215J663K428K952L041L122L645M343M416L418J754
$$ 471938 472884 474147 475373 476588 478251 480679 483631 486672 489794 493439 497782 502198 505616 507370
59641E07370J88q96j679k492l414m264m885n381n957o529o618n895m702l712l123
$$ 507370 507558 506662 504983 502491 499077 494813 489928 484547 478590 472061 465443 459548 454846 451134 448011
59626D48011k495j500m13K69L79K9o28j271j410r35m94q76k011l064l486l546
$$ 448011 445516 444016 443603 443872 444251 444280 443652 442381 440971 440036 439542 438666 436655 433591 430105 426559
59610D26559l698l850l569k816k058j674j532j302r77q30q77p79l65J2j0k27k05
$$ 426559 422861 419011 415442 412626 410568 408894 407362 406060 405083 404253 403376 402597 402232 402244 402234 402007 401802
59593D01802l8k55r46j562j684j435r40QJ326K235K011Q47m16j175j383j320j451
$$ 401802 401764 401509 400563 399001 397317 395882 394942 394950 396276 398511 400522 401369 400953 399778 398395 397075 395624
59576C95624k105k855k794j820j125j652k717l127l041l398l836k901n54J148
$$ 395624 393519 390664 387870 386050 384925 383273 380556 377429 374388 370990 367154 364253 363699 364847
59562C64847P15p65j253m24M89P70P89Q04M97j39m77j25N43J038J408J909K496
$$ 364847 365562 364797 363544 363120 363609 364379 365168 365972 366469 366330 365853 365728 366271 367309 368717 370626 373122
59545C73122K965L340L810M334M598M413M089M291N483P529R954J2431J4783J6633
$$ 373122 376087 379427 383237 387571 392169 396582 400671 404962 410445 417974 427928 440359 455142 471775
59531D71775J7442J6875J4650J0156L152m867j0882j2836j1494r148o991m732
$$ 471775 489217 506092 520742 530898 534050 529183 518301 505465 493971 484823 477832 473100
59519D73100k286m28M90J237K504L808M314M067L664L084J771k67k174l257l752
$$ 473100 470814 470386 470876 472113 474617 478425 482739 486806 490470 493554 495325 495058 492884 489627 485875
59504D85875m314n176o051o650o925o934o750o563o585o737o522n465l687j919
$$ 485875 481561 476385 470334 463684 456759 449825 443075 436512 429927 423190 416668 411203 407516 405597
59490D05597q48n68o89q42r04q47n38J24R69J491J221L02l91J2J489L189M357
$$ 405597 404749 404181 403492 402650 401746 400899 400361 400485 401454 402945 404166 404468 404077 404089 405578 408767 413124
59473D13124M872M867M358L554L062L220L487L050J902P55J2n12q80p74k41Lm96
$$ 413124 417996 422863 427221 430775 433837 437057 440544 443594 445496 446251 446263 445751 444871 444097 443856 443859 443363
59456D43363j108p99O02K326L709M761N741O680P590Q653R887J0810J0915J0363
$$ 443363 442255 441456 442058 444384 448093 452854 458595 465275 472865 481518 491405 502215 513130 523493
59442E23493R817R448Q522O260K877o30l579o008q021r309r594r139q428p609
$$ 523493 533310 542758 551280 557540 560417 559787 556208 550200 542179 532870 523276 514137 505709 498100
59428D98100o700n988n778n837n588m836l824k642j075Q82K876M702O584Q777
$$ 498100 491400 485412 479634 473797 468209 463373 459549 456907 455832 456714 459590 464292 470876 479653
59414D79653J1133J3341J5306J7189J9212K1437K3551K4828K4544K2338J7901
$$ 479653 490786 504127 519433 536622 555834 577271 600822 625650 650194 672532 690433
59403F90433J0713J001r003j5818j7438j4917j0848o839l003O59L403M130J909
$$ 690433 701146 702147 693144 677326 659888 644971 634123 627284 624281 624940 628343 632473 634382
59390F34382l734j2143k0963k7075k8733k6639k2873j9130j5991j3262j0505p591
$$ 634382 630648 618505 597542 570467 541734 515095 492222 473092 457101 443839 433334 425743
59378D25743n083l835l885m034l024r52R05J630J514J341J431J609J768J954K088
$$ 425743 420660 416825 412940 408906 405882 404930 405835 407465 408979 410320 411751 413360 415128 417082 419170
59363D19170J996J733J608J799K164K462K598K566K396K196K197K565L278M198
$$ 419170 421166 422899 424507 426306 428470 430932 433530 436096 438492 440688 442885 445450 448728 452926
59349D52926N151N950O516P049P934R314J0906J2311J3415J4389J5381J6345J7028
$$ 452926 458077 464027 470543 477592 485526 494840 505746 518057 531472 545861 561242 577587 594615
59336E94615J7061J6271J5059J4170J3899J3626J2480J0322P798N494L356R39
$$ 594615 611676 627947 643006 657176 671075 684701 697181 707503 715301 720795 724151 725090
59324G25090j905m763o928q032q389q567q661q279p378o551o225o034n481m772
$$ 725090 723185 718422 711494 703462 695073 686506 677845 669566 662188 655637 649412 643378 637897 633125
59310F33125m412m329m079l703l567l534l091k332j907j907j625o65N37J596K753
$$ 633125 628713 624384 620305 616602 613035 609501 606410 604078 602171 600264 598639 597974 598511 600107 602860
59295F02860M166N429O370P701J0179J3517J6745J9258K0974K1719K0902J7648
$$ 602860 607026 612455 618825 626526 636705 650222 666967 686225 707199 728918 749820 767468
59283G67468J1150J475r539j8812k4057k5131k3247j9596j5198j1097p692m345
$$ 767468 778618 780093 770554 751742 727685 702554 679307 659711 644513 633416 625724 621379
59271F21379n25L036N301O586Q163J0289J1837J1931J1048J0159R655R269Q523
$$ 621379 620854 623890 629191 635777 643940 654229 666066 677997 689045 699204 708859 718128 726651
59258G26651O989M671K161k2k152m720p427r514j0960j2312j3411j3488j2667
$$ 726651 733640 738311 740472 740450 738298 733578 726151 716637 705677 693365 679954 666466 653799
59245F53799j2120j2276j2088j0815r303q570q124o901n192m237m265m183l308
$$ 653799 641679 629403 617315 606500 597197 588627 580503 573602 568410 564173 559908 555725 552417
59232E52417k203j572j285q88l92r6l3n3j21k69m99r27j825l242m766n831o220
$$ 552417 550214 548642 547357 546469 546077 545981 545948 545895 545774 545505 545006 544079 542254 539012 534246 528415 522195
59215E22195o146n968n960o287o919p459p224n861l949k672k597k998k798j985
$$ 522195 516049 510081 504121 497834 490915 483456 476232 470371 466422 463750 461153 458155 455357 453372
59201D53372j499j802k232k012j182j26J141K585L564L503K868K687L152L553
$$ 453372 451873 450071 447839 445827 444645 444519 445660 448245 451809 455312 458180 460867 464019 467572
59187D67572L610L994N120O275O542O136O103O910P876Q078P336O254N525N291
$$ 467572 471182 475176 480296 486571 493113 499249 505352 512262 520138 528216 535552 541806 547331 552622
59173E52622N031M153K811J929K131K856L023K508K379L480N352O935P848Q418
$$ 552622 557653 561806 564617 566546 568677 571533 574556 577064 579443 582923 588275 595210 603058 611476
59159F11476Q797Q815Q593Q534Q570Q109P022N910N059L776J420j398l507m688
$$ 611476 620273 629088 637681 646215 654785 662894 669916 675826 680885 684661 686081 684683 681176 676488
59145F76488n760p215q593r312r389r121q671q125p520o607n149l596k839l054
$$ 676488 670728 663513 654920 645608 636219 627098 618427 610302 602782 596175 591026 587430 584591 581537
59131E81537l264k612j448o79l62L25J808L477M480M813N328O716Q647J0113J0634
$$ 581537 578273 575661 574213 573534 573172 573497 575305 578782 583262 588075 593403 600119 608766 618879 629513
59116F29513J0842J1590J2752J3558J3833J4099J4362J3837J2317J0905J0563
$$ 629513 640355 651945 664697 678255 692088 706187 720549 734386 746703 757608 768171
59105G68171J0717J0130Q638O995N452L710K135J598J920J674N2k056l437m175
$$ 768171 778888 789018 797656 804651 810103 813813 815948 817546 819466 821140 821192 819136 815699 811524
59091H11524n096o275p095p332p300p007o154n070m797n848p458q535q951r427
$$ 811524 806428 800153 793058 785726 778426 771419 765265 760195 755398 749550 742092 733557 724606 715179
59077G15179j0439j1704j2694j3202j3290j3122j2939j2931j2902j2363j1192
$$ 715179 704740 693036 680342 667140 653850 640728 627789 614858 601956 589593 578401
59066E78401r954r228q780p894o391m869l810l051k357k005k301k876l009k552
$$ 578401 568447 559219 550439 542545 536154 531285 527475 524424 522067 520062 517761 514885 511876 509324
59052E09324k037j858j823j613j268j079j225j661k136k205j564m73L53M83K30
$$ 509324 507287 505429 503606 501993 500725 499646 498421 496760 494624 492419 490855 490382 490735 491218 491448
59037D91448J59M03P18R63J215J380J231R18J079K117L583M641N012N129N425
$$ 491448 491607 492010 492728 493691 494906 496286 497517 498435 499514 501631 505214 509855 514867 519996 525421
59022E25421N953O703P777Q985R725R757R721J0305J1118J1068R803Q095O669
$$ 525421 531374 538077 545854 554839 564564 574321 584042 594347 605465 616533 626336 634431 641100
59009F41100N318L501J259q60k434l326l463k945k149j451r55n68j22P29K255
$$ 641100 646418 649919 651178 650318 647884 644558 641095 638150 636001 634550 633595 633027 632905 633634 635889
58994F35889M011M924M458L298K370J589J95j868l730m748n155n460n802o188
$$ 635889 639900 644824 649282 652580 654950 656539 656734 654866 651136 646388 641233 635773 629971 623783
58980F23783o815p711q393q351p755p327p373p219n844l118j56J820K762L603
$$ 623783 616968 609257 600864 592513 584758 577431 570058 562839 556995 553877 553721 555541 558303 561906
58966E61906M830N913O307O341O632P136P397P350P159O599N341L753K640K136
$$ 561906 566736 572649 578956 585297 591929 599065 606462 613812 620971 627570 632911 636664 639304 641440
58952F41440J519K24j643l807o188q522j0277j1252j1741j1886j1413j0265q990
$$ 641440 642959 643183 641540 637733 631545 623023 612746 601494 589753 577867 566454 556189 547199
58939E47199q095p415o493n267m025k964k125j558j254j152j324j894k693l284
$$ 547199 539104 531689 525196 519929 515904 512940 510815 509257 508003 506851 505527 503633 500940 497656
58925D97656l498l552l475k974k095j543j807k436k636k304j939j784j557r40
$$ 497656 494158 490606 487131 484157 482062 480519 478712 476276 473640 471336 469397 467613 466056 465116
58911D65116J55J626L006L446K544J215R99K344M099N039N315N954P391R183J0988
$$ 465116 465271 466897 469903 473349 475893 477108 478107 480451 484550 489589 494904 500858 508249 517432 528420
58896E28420J2916J4656J5104J3545J0886Q908Q330Q356Q171Q078Q726R991J1347
$$ 528420 541336 555992 571096 584641 595527 604435 612765 621121 629292 637370 646096 656087 667434
58883F67434J2766J4454J5961J6520J6152J5543J4741J2902R640N842K696M81
$$ 667434 680200 694654 710615 727135 743287 758830 773571 786473 796113 801955 804651 805132
58871H05132j265k951m768o819q917j0489j1182j1308j1342j1250j0737r862r052
$$ 805132 803867 800916 796148 789329 780412 769923 758741 747433 736091 724841 714104 704242 695190
58858F95190q663q841r625j0845j2082j2959j3369j3265j2627j1787j1349j1473
$$ 695190 686527 677686 668061 657216 645134 632175 618806 605541 592914 581127 569778 558305
58846E58305j1581j1155j0407r734q956p687o194n188m849m666m213l602l128
$$ 558305 546724 535569 525162 515428 506472 498785 492591 487403 482554 477888 473675 470073 466945
58833D66945k885k834k909k999k989k849k558k096j707j857k621l360l348k605
$$ 466945 464060 461226 458317 455318 452329 449480 446922 444826 443119 441262 438641 435281 431933 429328
58819D29328j736j157q36o42m87k17K62Q07J226J487J541J253Q59J081K201L409
$$ 429328 427592 426435 425599 424957 424470 424253 424515 425322 426548 428035 429576 430829 431688 432769 434970 438379
58803D38379L702L202K886L065K965J860j4j785k652k187o56Q34J117K18o62n51
$$ 438379 442081 445283 448169 451234 454199 456059 456045 454260 451608 449421 448765 449599 450716 450934 450272 449721
58787D49721L78J422K183K544K470K314K811M235N887O893P183P262P266O896
$$ 449721 450099 451521 453704 456248 458718 461032 463843 468078 473965 480858 488041 495303 502569 509465
58773E09465O096N302M805M286L138J182j063k787l606l872m171m605m824m724
$$ 509465 515561 520863 525668 529954 533092 534274 533211 530424 526818 522946 518775 514170 509346 504622
58759E04622m709n106n603n578m758l373j872p07j72j68j89J68P68J247J585K164
$$ 504622 499913 494807 489204 483626 478868 475495 473623 472916 472744 472576 472387 472555 473323 474570 476155 478319
58743D78319L168M296N078N363N369N416N705O266O957P558P987Q407R017R700
$$ 478319 481487 485783 490861 496224 501593 507009 512714 518980 525937 533495 541482 549889 558906 568606
58729E68606J0059R920R618R462R180Q253O822N631M980M315L207K177K007K631
$$ 568606 578665 588585 598203 607665 616845 625098 631920 637551 642531 646846 650053 652230 654237 656868
58715F56868L417M180N166O201O763O917P325Q063Q188O877M450J884j98j745
$$ 656868 660285 664465 669631 675832 682595 689512 696837 704900 713088 719965 724415 726299 726101 724356
58701G24356l063m749p356j0613j3462j5250j6481j7838j8997j9174j8534j8072
$$ 724356 721293 716544 709188 698575 685113 669863 653382 635544 616547 597373 578839 560767
58689E60767j8131j7917j6701j4823j2993j1261r242p070n470m880m946n021m833
$$ 560767 542636 524719 508018 493195 480202 468941 459699 452629 447159 442279 437333 432312 427479
58676D27479m513m132l589k859k106j399m72R32K604L917M469M472M454M693N170
$$ 427479 422966 418834 415245 412386 410280 408881 408409 409341 411945 415862 420331 424803 429257 433950 439120
58661D39120N861O818P895Q623Q571P611N780L044m02l657n506n606m963m785
$$ 439120 444981 451799 459694 468317 476888 484499 490279 493323 492921 489264 483758 478152 473189 468404
58647D68404n092m981m051k883k059j523j270j752l059m271m484m040l927m218
$$ 468404 463312 458331 454280 451397 449338 447815 446545 444793 441734 437463 432979 428939 425012 420794
58633D20794m099l288k457k037j574o13M33Q36M25m36j286j586q10R34K702L629
$$ 420794 416695 413407 410950 408913 407339 406726 407159 407995 408420 407984 406698 405112 404302 405236 407938 411567
58617D11567L892M383N562O967P788P650O916O356O426O752O520N462M158L248
$$ 411567 415459 419842 425404 432371 440159 447809 454725 461081 467507 474259 480779 486241 490399 493647
58603D93647K684K028J124J59p43j571k099j996j296n20j87k95l74n0N64J062
$$ 493647 496331 498359 499483 499642 498899 497328 495229 493233 491937 491417 491230 490935 490561 490511 491075 492137
58587D92137J260J423J849K546L389M412N666O982Q158R164R890R952R204Q171
$$ 492137 493397 494820 496669 499215 502604 507016 512682 519664 527822 536986 546876 556828 566032 574203
58573E74203P424O816N918M966M554M559M353M072M658O417Q556J0548J2840J5630
$$ 574203 581627 588443 594361 599327 603881 608440 612793 616865 621523 627940 636496 647044 659884 675514
58559F75514J8012J9106J9334J9576J9737J9098J7582J5650J3279J0091O368K950
$$ 675514 693526 712632 731966 751542 771279 790377 807959 823609 836888 846979 853347 856297
58547H56297Q7k798o061r254j1706j3126j3505j2990j2070j1438j1475j2055j2907
$$ 856297 856384 853586 847525 838271 826565 813439 799934 786944 774874 763436 751961 739906 726999
58534G26999j3869j4761j5330j5425j5079j4426j3670j2995j2347j1412r989q207
$$ 726999 713130 698369 683039 667614 652535 638109 624439 611444 599097 587685 577696 569489
58522E69489o292m396k688j323j89R28J765J774J058M88N04N10j6n58l99J69L46
$$ 569489 563197 558801 556113 554790 554601 555529 557294 559068 560126 560614 561118 561628 561612 561054 560655 560824 561170
58505E61170R3j7J74L72O00J086J603J724J527J270O24q27k502l273k955k359
$$ 561170 561263 561246 561420 561792 562392 563478 565081 566805 568332 569602 570226 569399 566897 563624 560669 558310
58489E58310j889j157o9P95J127J272J431J394J419K323M220O030O855P104P712
$$ 558310 556421 555264 555195 555990 557117 558389 559820 561214 562633 564956 569176 575206 582061 589165 596877
58474E96877Q922J0347J1621J2316J1828R980P468N154L201J282p55k823m782
$$ 596877 605799 616146 627767 640083 651911 661891 669359 674513 677714 678996 678241 675418 670636
58461F70636o295o868o442n621m892m024k644j007K95J146J908K796L766M794
$$ 670636 664341 657473 651031 645410 640518 636494 633850 632843 633138 634284 636192 638988 642754 647548
58447F47548N824O519O475N697M475K846O05k046m177m871m224l333l040k962
$$ 647548 653372 659891 666366 672063 676538 679384 679989 677943 673766 668895 664671 661338 658298 655336
58433F55336k136n61O14O98M49R17J929K680L223M253N594O279O233O622Q116
$$ 655336 653200 652639 653253 653951 654400 655317 657246 659926 663149 667402 672996 679275 685508 692130 700246
58418G00246R918J1068J1599J1728J0950Q875O219L967K016l54l084n342o690
$$ 700246 710164 721232 732831 744559 755509 764384 770603 774570 776586 776232 773148 767806 761116
58405G61116p387p641p370o730o149n700n033m024k987k156j305j36J258K448
$$ 761116 753729 746088 738718 731988 725839 720139 715106 711082 708095 705939 704634 704498 705756 708204
58391G08204L065L159L185L526M014M082L479K536J645Q50K30J96R78J971K218
$$ 708204 711269 714428 717613 721139 725153 729235 732714 735250 736895 737745 737975 738171 739149 741120 743338
58376G43338J544R21J385K780L815L528K546K374L464M636M806M541N044O245
$$ 743338 744882 745803 747188 749968 753783 757311 759857 762231 765695 770331 775137 779678 784722 790967
58362G90967P099P482Q301R632J0315R869R420R897J0595J0461R736R151Q491
$$ 790967 798066 805548 813849 823481 833796 843665 853085 862982 873577 884038 893774 902925 911416
58349I11416P254O018N760O274O485O084N591N166M653M641O047Q497J0425J1124
$$ 911416 918670 924688 930448 936722 943207 949291 954882 960048 964701 969342 975389 983886 994311 1005435
58335A005435J1494J2352J3208J3356J3182J3419J3830J3677J3128J3136J3952
$$ 1005435 1016929 1029281 1042489 1055845 1069027 1082446 1096276 1109953 1123081 1136217 1150169
58324A150169J4625J4314J3400J2805J2639J2183J1088R894R161Q749Q394Q358
$$ 1150169 1164794 1179108 1192508 1205313 1217952 1230135 1241223 1251117 1260278 1269027 1277421 1285779
58312A285779Q923R588R630R263R343J0069J0924J1848J3352J5207J6266J6134
$$ 1285779 1294702 1304290 1313920 1323183 1332526 1342595 1353519 1365367 1378719 1393926 1410192 1426326
58300A426326J5956J6850J8459J9755K0435K0686K0395J9544J8761J8571J8630
$$ 1426326 1442282 1459132 1477591 1497346 1517781 1538467 1558862 1578406 1597167 1615738 1634368
58289A634368J8448J8350J8890J9905K0979K2228K3784K5157K6063K7214K9206
$$ 1634368 1652816 1671166 1690056 1709961 1730940 1753168 1776952 1802109 1828172 1855386 1884592
58278A884592L1295L2453L3068L4306L6217L7825L8862M0065M1806M3686M5407
$$ 1884592 1915887 1948340 1981408 2015714 2051931 2089756 2128618 2168683 2210489 2254175 2299582
58267B299582M7029M8456M9674N1309N3865N6675N8779O0498O2852O5659O7746
$$ 2299582 2346611 2395067 2444741 2496050 2549915 2606590 2665369 2725867 2788719 2854378 2922124
58256B922124O8953P0420P2761P5346P7592P9569Q1136Q1926Q2556Q4454Q8018
$$ 2922124 2991077 3061497 3134258 3209604 3287196 3366765 3447901 3529827 3612383 3696837 3784855
58245C784855R2104R5833R9782J04967J11703J19818J28988J38426J47323J55992
$$ 3784855 3876959 3972792 4072574 4177541 4289244 4409062 4538050 4676476 4823799 4979791
58235D979791J65622J76655J88378K00365K13162K27266K42544K58985K76977
$$ 4979791 5145413 5322068 5510446 5710811 5923973 6151239 6393783 6652768 6929745
58226F929745K96492L17075L38943L63117L90175M19946M52537M88626N28761
$$ 6929745 7226237 7543312 7882255 8245372 8635547 9055493 9508030 9996656 10525417
58217A0525417N73588O24703O83717P50525Q24228R05971R99133J106597J230049
$$ 10525417 11099005 11723708 12407425 13157950 13982178 14888149 15887282 16993879 18223928
58208A8223928J372573J540031J739304J977418K263782K612030L039180L564150
$$ 18223928 19596501 21136532 22875836 24853254 27117036 29729066 32768246 36332396
58200C6332396M206067M980194N894395O953337Q169853R573400J1210736J3142824
$$ 36332396 40538463 45518657 51413052 58366389 66536242 76109642 87320378 100463202
58192A00463202J5433807J8115317K1125035K4255675K7158849K9402505L0526819
$$ 100463202 115897009 134012326 155137361 179393036 206551885 235954390 266481209
58185B66481209L0051174K7463727K2300800J4393131M195092p056231j7584534
$$ 266481209 296532383 323996110 346296910 360690041 364885133 357828902 340244368
58178C40244368k5683211l0343933l1517928k9908800k6529788k2333393j8040682
$$ 340244368 314561157 284217224 252699296 222790496 196260708 173927315 155886633
58171A55886633j4116332j0815909q281987o644102o024033o404970p484367q701328
$$ 155886633 141770301 130954392 122672405 116028303 110004270 103599300 96114933 87413605
58163H7413605r482912r527779q897198p870391o728859n644265m691357l895632
$$ 87413605 77930693 68402914 59505716 51635325 44906466 39262201 34570844 30675212
58155C0675212l254020k741696k328387j993054j721711j499363j311945j152300
$$ 30675212 27421192 24679496 22351109 20358055 18636344 17136981 15825036 14672736
58147A4672736j018014r05443q10278p31179o67734o16123n70923n30063m94254
$$ 14672736 13654722 12749279 11939001 11207822 10540088 9923965 9353042 8822979 8328725
58138H328725m62465m31602m00099l68494l36931l05156k74732k48204k25962
$$ 8328725 7866260 7434658 7034559 6666065 6329134 6023978 5749246 5501042 5275080
58129E275080k06519j89854j77848j71145j67845j65762j63851j61135j56332
$$ 5275080 5068561 4878707 4700859 4529714 4361869 4196107 4032256 3871121 3714789
58120C714789j49303j41248j32954j24178j15053j06637r9669r3956q9202q5195
$$ 3714789 3565486 3424238 3291284 3167106 3052053 2945416 2845747 2751791 2662589 2577394
58110B577394q1192p6488p1766o8528o6874o5225o2508n9338n6625n4319n2033
$$ 2577394 2496202 2419714 2347948 2279420 2212546 2147321 2084813 2025475 1968850 1914531 1862498
58099A862498m9811m7729m5623m3585m1866m0121l7694l4873l2787l1772l0894
$$ 1862498 1812687 1764958 1719335 1675750 1633884 1593763 1556069 1521196 1488409 1456637 1425743
58088A425743k9469k7949k6789k5510k3655k1840k1049k1324k1795k1656k0780
$$ 1425743 1396274 1368325 1341536 1316026 1292371 1270531 1249482 1228158 1206363 1184707 1163927
58077A163927j9626j8866j8792j8959j8781j8367j8231j8300j8006j7331j6934
$$ 1163927 1144301 1125435 1106643 1087684 1068903 1050536 1032305 1014005 995999 978668 961734
58066I61734j7069j7196j6841j6047j4819j3053j1314j0710j1429j2170j1679
$$ 961734 944665 927469 910628 894581 879762 866709 855395 844685 833256 821086 809407
58055H09407j0230r112r123j0120j1495j2566j2868j2544j2183j2041j1741j0945
$$ 809407 799177 790065 780942 770822 759327 746761 733893 721349 709166 697125 685384 674439
58043F74439r859q759p580o309n334m992n159n586o194o743o693n810m645m043
$$ 674439 664580 655821 648241 641932 636598 631606 626447 620861 614667 607924 601231 595421 590776 586733
58029E86733m430n695p371q753r323r365r603j0128j0173r265p951o966o272n485
$$ 586733 582303 576608 569237 560484 551161 541796 532193 522065 511892 502627 494676 487710 481438 475953
58015D75953m705m373m525m757m674m073k995j927j607k248l274m047m459m515
$$ 475953 471248 466875 462350 457593 452919 448846 445851 443924 442317 440069 436795 432748 428289 423774
58001D23774m036l181k632k614k342j177J44L81m36j059p49PN26P79R32Q72N95
$$ 423774 419738 416557 413925 411311 408969 407792 407936 408317 407881 406822 406073 406080 406606 407385 408317 409189 409784
57984D09784N49J094J907K285J877R25n5o19o37l33o8k7j69m43q78j451k009k320
$$ 409784 410333 411427 413334 415619 417496 418421 418366 417747 417110 416777 416709 416682 416513 416070 415192 413741 411732 409412
57966D09412k182j593r10o71j024j545j778j836k105k591k927l030l301m044n008
$$ 409412 407230 405637 404727 404056 403032 401487 399709 397873 395768 393177 390250 387220 383919 379875 374867
57951C74867n669n788n543n245n032m787m268l366k259j236m49J09M49O18Q56
$$ 374867 369198 363410 357867 352622 347590 342803 338535 335169 332910 331674 331225 331334 331783 332401 333257
57936C33257J564K920M602N969O651O938P465Q457R429R767R452Q949Q478P777
$$ 333257 334821 337741 342343 348312 354963 361901 369366 377823 387252 397019 406471 415420 423898 431675
57922D31675O612N196L975L206K812K376J305o49l012n043o576p952r172r770
$$ 431675 438287 443483 447458 450664 453476 455852 457157 456508 453496 448453 441877 433925 424753 414983
57908D14983r768r902j0539j0974j0427r243q397q267q495q783r050r016q364
$$ 414983 405215 395313 384774 373800 363373 354130 345733 337466 328971 320188 311138 302122 293758
57895B93758p262o183n254m346l570l138k842k295j532q44j82N55R76P35N07J329
$$ 293758 286496 280313 275059 270713 267143 264005 261163 258868 257336 256492 256310 256865 257841 258576 259083 260412
57879B60412K979M062L917L344L112K836K000J081P81P99L13q36k121l159l854
$$ 260412 263391 267453 271370 274714 277826 280662 282662 283743 284524 285323 285636 284800 282679 279520 275666
57864B75666m084l922l856m134m216l504k269j168k18Q87J814K025K048L148N455
$$ 275666 271582 267660 263804 259670 255454 251950 249681 248513 248295 249182 250996 253021 255069 258217 263672
57849B63672P554Q297Q222Q465R035R004P997O647N610M839L973K993K138J423
$$ 263672 271226 279523 287745 296210 305245 314249 322246 328893 334503 339342 343315 346308 348446 349869
57835C49869M89r31k612m056n145o233p484q392q355p480o449n697n188m849m625
$$ 349869 350358 349427 346815 342759 337614 331381 323897 315505 307150 299670 293221 287524 282336 277487 272862
57820B72862m098k745q71M50O70N13R92K157L331M120M565M545L827K656J720
$$ 272862 268764 266019 265148 265598 266268 266781 267773 269930 273261 277381 281946 286491 290318 292974 294694
57805B94694J336J095L43j269l650o239q147q762q274p295o026m296k429j392
$$ 294694 296030 297125 297468 296199 292549 286310 278163 269401 261127 253832 247806 243510 241081 239689
57791B39689j742k853l620l621l245k923k708k457k111j714j419j436j744j893
$$ 239689 237947 235094 231474 227853 224608 221685 218977 216520 214409 212695 211276 209840 208096 206203
57777B06203j431n10J35nn21m08R44L102M950N703N525N166N126N276N157M393
$$ 206203 204772 204262 204397 204392 203871 203463 204407 207509 212459 218162 223687 228853 233979 239255 244412 248805
57761B48805K886Q96r96k241k780l001l155l139k922k831l096l392l235k640k040
$$ 248805 251691 252587 251591 249350 246570 243569 240414 237275 234353 231522 228426 225034 221799 219159 217119
57746B17119j618j202p79o99j166j864k208j874r49J09O96M60k68p16n10n0J14
$$ 217119 215501 214299 213520 212821 211655 209791 207583 205709 204760 204869 205565 206025 205757 205041 204531 204481 204595
57729B04595L8K22Q15J383J488J192Q00M20J0l07k82R5M76N88M98L44l6q16j634
$$ 204595 204633 204855 205670 207053 208541 209733 210533 210953 210963 210656 210374 210469 210945 211533 212031 212375 212339 211523 209889
57710B09889j695p08N80J061M13o67j292j177o41j33J13J55K68P31J593K571L286
$$ 209889 208194 207486 208066 209127 209540 208873 207581 206404 205763 205630 205743 205898 206166 206897 208490 211061 214347
57693B14347L555L520L426L269K708J477j65j578k409k859l151l061k250q33Q00
$$ 214347 217902 221422 224848 228117 230825 232302 232137 230559 228150 225291 222140 219079 216829 215996 216796
57678B16796K611M909P708J0583J3304J6264K0106K5202L1660L9445M8183N6988
$$ 216796 219407 224316 232024 242607 255911 272175 292281 317483 349143 388588 436771 493759
57666D93759O4755P0473P3063P1041O2697M6802K3428n334l5120o0327p6469q2277
$$ 493759 558514 628987 702050 773091 835788 882590 906018 900684 865564 805237 728768 646491
57654F46491p9671p1765o1106m9519l8712l0183k4373k0458j7264j4281j1634
$$ 646491 566820 495055 433949 384430 345718 315535 291162 270704 253440 239159 227525
57643B27525r374p259n226l611k660k134j670j266j073r14m89M6J49l43q93r22
$$ 227525 218151 210892 205666 202055 199395 197261 195591 194325 193252 192338 191849 191895 192044 191701 190808 189886
57627A89886m36Q4K39j5l73m91l53l74q54j473j662j435j339j559j757j844k252
$$ 189886 189450 189534 189773 189758 189385 188894 188541 188167 187313 185840 184178 182743 181404 179845 178088 176244 173992
57610A73992k976l125k041l91N74N23J20j35l47n74o15n19o56j022j087o28k07
$$ 173992 171016 167891 165850 165459 166033 166556 166676 166541 166194 165620 165005 164486 163830 162808 161721 161093 160886
57593A60886m74j348k210k655k704k529k320k321k686l248l565l304k547j757
$$ 160886 160412 159064 156854 154199 151495 148966 146646 144325 141639 138391 134826 131522 128975 127218
57579A27218j389j454j539j343j070j048j208j193r77q83j060j292j435j609j834
$$ 127218 125829 124375 122836 121493 120423 119375 118167 116974 115997 115114 114054 112762 111327 109718 107884
57564A07884j834j513j229j321j575j512j062o16m90n92o58n58l17LM40J145K163
$$ 107884 106050 104537 103308 101987 100412 98900 97838 97222 96732 96140 95482 94924 94607 94610 95050 96195 98358
57547I8358L157L459K611Q90q28j799j948j701j394r65k40O58J391J766J811J540
$$ 98358 101515 104974 107585 108475 107647 105848 103900 102199 100805 99840 99600 100258 101649 103415 105226 106766
57531A06766R74M63M89Q97Q16j60j113p88O85J871J873J353J393K029K425K077
$$ 106766 107740 108203 108692 109589 110405 110245 109132 108344 109029 110900 112773 114126 115519 117548 119973 122050
57515A22050J292O41M84R00J636K145J981J279O36M92P29P68M6j481l095l806
$$ 122050 123342 123983 124467 125367 127003 129148 131129 132408 133044 133536 134265 135033 135079 133598 130503 126697
57499A26697l272k207j608j721j989j958j880k260l022l414k862j772j148j304
$$ 126697 123425 121218 119610 117889 115900 113942 112062 109802 106780 103366 100504 98732 97584 96280
57485I6280j348l20J361K244J633M14j19K28O56N14j32q70j363j504j495j716
$$ 96280 94932 94612 95973 98217 99850 100264 100145 100373 101029 101543 101411 100541 99178 97674 96179 94463
57469I4463k248k642k443j781j170q20m83O9P15J131J071O08J80K35O46P52J95
$$ 94463 92215 89573 87130 85349 84179 83359 82876 82945 83660 84791 85862 86470 86650 86885 87531 88283 88478
57452H8478n55q56p24n99n94n14l98m53n34k95J79M70N13N06K42o76j795j901
$$ 88478 87923 87067 86343 85744 85150 84636 84238 83785 83251 82956 83135 83605 84118 84624 84866 84190 82395 80494
57434H0494n96Q99J168K50p07j035r54o71J1J046J752J486L76q52j516j327l84
$$ 80494 79898 80797 81965 82215 81508 80473 79519 78848 78859 79905 81657 83143 83519 82667 81151 79824 79440
57417G9440Q07J481J133L7r30j143p95n55o99q79o81j79K49M03L31M5m97j148
$$ 79440 80247 81728 82861 82898 81968 80825 80030 79475 78776 77897 77216 77037 77286 77689 78020 78065 77568 76420
57399G6420j522j281l64R26J911J889Q80j14n4R00J647J581J231J247J486J558
$$ 76420 74898 73617 73253 74179 76090 77979 78859 78745 78691 79591 81238 82819 84050 85297 86783 88341
57383H8341J694K354L263L648L360L017K892K369Q84j052k343k548k182j849j638
$$ 88341 90035 92389 95652 99300 102660 105677 108569 110938 111822 110770 108427 105879 103697 101848 100210
57368A00210j471j553k087k785l032k542j559m76M02P06J24j074k012k041j357
$$ 100210 98739 97186 95099 92314 89282 86740 85181 84705 85107 85813 85937 84863 82851 80810 79453
57353G9453n62J42Q36J289J112N31L13P99J439J517R37J49l14q9P75J582J429
$$ 79453 78891 79033 79869 81158 82270 82801 83114 83913 85352 86869 87806 87955 87641 87552 88327 89909 91338
57336I1338K38j037j541j447j340j207o27K86Q73Q56O74P40Q45N46k14j062j604
$$ 91338 91576 90539 88998 87551 86211 85004 84377 84663 85536 86392 87066 87806 88651 89197 88983 87921 86317
57319H6317j662j261n79J07N33N97M93N78R52J192Q17K6m15j66K08J08k30j64
$$ 86317 84655 83394 82815 82922 83455 84052 84545 85123 86075 87267 88084 88110 87695 87529 87737 87845 87615 87451
57301H7451L41P71Q88R63J158J292J239J127R88O48N8n73j061j332j250p17l0
$$ 87451 87792 88563 89451 90414 91572 92864 94103 95230 96218 96866 96924 96351 95290 93958 92708 91991 91961
57284I1961K95J58o9j86l38m71j22Q56J815J982J347N70J88K86O99J178J404J244
$$ 91961 92256 92414 92345 92159 91821 91350 91228 92084 93899 95881 97228 97798 97986 98272 98971 100149 101553 102797
57266A02797R24P82Q63R90J105J294J546J691J612J340R40M49n3m16m36J8Q58
$$ 102797 103721 104503 105366 106356 107461 108755 110301 111992 113604 114944 115884 116333 116280 115864 115428 115446 116304
57249A16304J677J985J655J051O40N43N59M60K30P8K87Q98J536J809J845K199
$$ 116304 117981 119966 121621 122672 123312 123855 124414 124874 125104 125182 125469 126367 127903 129712 131557 133756
57233A33756L015L671L480K536J553J025Q40O38K39k72o13m54K97J245J767J608
$$ 133756 136771 140442 143922 146458 148011 149036 149876 150514 150753 150481 149868 149414 149711 150956 152723 154331
57217A54331J173J135J735K487K672K150J519J363J577J723J874K508L608M489
$$ 154331 155504 156639 158374 160861 163533 165683 167202 168565 170142 171865 173739 176247 179855 184344
57203A84344M740M773N070N395N258M757M402M341M376M515M974N704O506P464
$$ 184344 189084 193857 198927 204322 209580 214337 218739 223080 227456 231971 236945 242649 249155 256619
57189B56619Q620R344Q801P207N872N744O490P298Q006Q860R726J0214J0385J0710
$$ 256619 265239 274583 283384 290591 296463 302207 308697 315995 324001 332861 342587 352801 363186 373896
57175C73896J1392J2149J2747J3298J3940J4522J4803J4832J4940J5335J5797
$$ 373896 385288 397437 410184 423482 437422 451944 466747 481579 496519 511854 527651
57164E27651J5879J5429J4858J4733J5200J5935J6582J6981J7031J6670J6089
$$ 527651 543530 558959 573817 588550 603750 619685 636267 653248 670279 686949 703038
57153G03038J5680J5609J5699J5854J6221J6810J7249J7257J7035J6925J6864
$$ 703038 718718 734327 750026 765880 782101 798911 816160 833417 850452 867377 884241
57142H84241J6606J6258J6205J6520J6888J7111J7348J7790J8403J9020J9477
$$ 884241 900847 917105 933310 949830 966718 983829 1001177 1018967 1037370 1056390 1075867
57131A075867J9681J9709J9884K0455K1257K1984K2750K3998K5771K7531K8913
$$ 1075867 1095548 1115257 1135141 1155596 1176853 1198837 1221587 1245585 1271356 1298887 1327800
57120A327800L0317L2437L5443L8958M2660M6555N0729N5214O0102O5513P1395
$$ 1327800 1358117 1390554 1425997 1464955 1507615 1554170 1604899 1660113 1720215 1785728 1857123
57109A857123P7630Q4410R2408J02497J15521J32310J53647J80072K11948K50094
$$ 1857123 1934753 2019163 2111571 2214068 2329589 2461899 2615546 2795618 3007566 3257660
57099C257660K96271L52820M21721N04015N99854P08724Q29465R60261J098666
$$ 3257660 3553931 3906751 4328472 4832487 5432341 6141065 6970530 7930791 9029457
57090I029457J241207J382541J514824J628140J711875J756416J755056J706332
$$ 9029457 10270664 11653205 13168029 14796169 16508044 18264460 20019516 21725848
57082B1725848J616427J499884J376393J262589J161258J054183R05528O77391
$$ 21725848 23342275 24842159 26218552 27481141 28642399 29696582 30602110 31279501
57074C1279501L50184o4558n26955r84344j389063j709052j929485k049494k078325
$$ 31279501 31629685 31565127 31038172 30053828 28664765 26955713 25026228 22976734 20898409
57065B0898409k032021j929829j790538j630175j461620j294991j137512r93274
$$ 20898409 18866388 16936559 15146021 13515846 12054226 10759235 9621723 8628449
57057H628449q63954p50239o52539n70477n02403m45828l98226l57411l21633
$$ 8628449 7764495 7014256 6361717 5791240 5288837 4843009 4444783 4087372 3765739
57048C765739k89905k62008k37758k16320j96670j78567j62512j48578j35892
$$ 3765739 3475834 3213826 2976068 2759748 2563078 2384511 2221999 2073421 1937529
57039A937529j23532j11530j00423r0207q0352p0786o2184n4998m8668m2227l5438
$$ 1937529 1813997 1702467 1602044 1511837 1431485 1360699 1298515 1243517 1194849 1152622 1117184
57028A117184k8813k2575j6193r105j403O764J6213K8526M4645O3959Q4922J06125
$$ 1117184 1088371 1065796 1049603 1040498 1039095 1045859 1062072 1090598 1135243 1199202 1284124 1390249
57016A390249J26329J43532J54160J52960J33813R2167K9030m6082j17033j68185
$$ 1390249 1516578 1660110 1814270 1967230 2101043 2193210 2222240 2176158 2059125 1890940
57006A890940j91909j90804j73712j49790j25136j02753q3846o8697n6971m7997
$$ 1890940 1699031 1508227 1334515 1184725 1059589 956836 872990 804293 747322 699325
56996F99325m1030l5416l0595k6155k1991j8327j5449j3326j1573r862q265o987
$$ 699325 658295 622879 592284 566129 544138 525811 510362 497036 485463 475601 467336 460349
56984D60349n833m248k124l05mj714m845q350j1379j3426j4309j4243j3663j2745
$$ 460349 454516 450268 448144 447839 447835 446121 441276 432926 421547 408121 393812 379569 365906 353161
56970C53161j1234r038o685m896l694k366k88K460N368Q066J0413J2317J3632
$$ 353161 341927 332889 326204 321308 317614 315248 314960 317420 322788 330854 341267 353584 367216
56957C67216J4294J4345J3835J2615J0196O016J49o256j1594j5044j6906j7663
$$ 367216 381510 395855 409690 422305 432501 438517 438666 432410 420816 405772 388866 371203
56945C71203j7198j5306j2588j0144q389o704m388j512J408M225P202J0438J3685
$$ 371203 354005 338699 326111 315967 307578 300874 296486 294974 296382 300607 307809 318247 331932
56932C31932J6644J9077K0524K0275J7871J3436P357m3q120j5378k0067k1611
$$ 331932 348576 367653 388177 408452 426323 439759 447116 447073 438953 423575 403508 381897
56920C81897k1097k0042j9008j7705j6029j4273j2504j0495q414o884o115n528
$$ 381897 360800 340758 321750 304045 288016 273743 261239 250744 242330 235446 229331 223803
56908B23803m635l714l215k922k381j755j578j777j631p62M39J472K262K961L689
$$ 223803 219168 215454 212239 209317 206936 205181 203603 201826 200195 199433 199872 201344 203606 206567 210256
56893B10256M668O145Q010R787J1230J2600J4190J5856J7163J7601J6626J3938
$$ 210256 214924 221069 229079 238866 250096 262696 276886 292742 309905 327506 344132 358070
56881C58070R950N572J257l245p863j1406j2470j0944q035n005k336rK166M634
$$ 358070 368020 373592 374849 371604 363741 352335 339865 328921 320886 315881 313545 313536 315702 320336
56867C20336P942J2134J6640K0951K5173K9614L4108L7989M0535M1082L8840L3046
$$ 320336 328278 340412 357052 378003 403176 432790 466898 504887 545422 586504 625344 658390
56855F58390K3610J1491j616j3956k4164l1236l4479l3738k9691k3751j7366j1287
$$ 658390 682000 693491 691875 677919 653755 622519 588040 554302 524611 500860 483494 472207
56843D72207n404P30P327J4257K1349K8658L6298M4152N1791N8605O3768O5996
$$ 472207 466803 467533 474860 489117 510466 539124 575422 619574 671365 729970 793738 859734
56831H59734O3680N5631M1739K2839L74k3387m5067o1080o9444p0549o6142n8020
$$ 859734 923414 979045 1020784 1043623 1043997 1020610 975543 914463 845019 774470 708328 650308
56819F50308m7895l7610k8438k0257j2140l778M192J1318J7994K4807L1654L7868
$$ 650308 602413 564803 536365 516108 503968 500190 504382 515700 533694 558501 590155 628023
56807F28023M2704M5394M5021M0727L1994J8749J731j6950l4026m6611n3596n5543
$$ 628023 670727 716121 761142 801869 833863 852612 854343 837393 803367 756756 703160 647617
56795F47617n3521m8573m1926l4909k8303k2100j6066j0292n016k32M256Q562
$$ 647617 594096 545523 503597 468688 440385 418285 402219 391927 386911 386679 390935 399497
56783C99497J2665J6553K0066K2618K3274K1297J6581R530O40r512j9806k8455
$$ 399497 412162 428715 448781 471399 494673 515970 532551 542081 542721 533209 513403 484948
56771D84948l3814l5507l4543l2221k9159k5492k1654j8395j6078j4365j2703
$$ 484948 451134 415627 381084 348863 319704 294212 272558 254163 238085 223720 211017
56760B11017j0877q983p168n574m410l866l944m385m718m441l371j903p65m22
$$ 211017 200140 191157 183989 178415 174005 170139 166195 161810 157092 152651 149280 147377 146612 146190
56746A46190p54j343j889k247k305j983j359o89k78k66n13p02p08p10q16p26j44
$$ 146190 145436 144093 142204 139957 137652 135669 134310 133621 133343 133077 132564 131862 131154 130444 129628 128902 128758
56729A28758N90P77L34ML07Q31Q84M56M9p3P0N08J108J224L61q72j260n10M04
$$ 128758 129348 130125 130459 130463 130770 131601 132485 132941 132990 132917 132987 133495 134603 135827 136188 135316 134056 133546 133950
56710A33950O28M29M37N97M32r5n88q06p69m60N4M17K88j89o21r15j211j411j202
$$ 133950 134578 135007 135444 136041 136473 136378 135790 134984 134215 133755 133809 134226 134514 134325 133704 132789 131578 130167 128965
56691A28965n61J52O03P37O52M43J90j14m98p74n94K2N15N22M21O94J031P66J5
$$ 128965 128404 128556 129159 129896 130548 130991 131181 131067 130569 129795 129201 129223 129738 130260 130681 131375 132406 133172 133187
56672A33187l29J47Q52J080Q09L91Pl17n15n65m52M0J040K073K396K083K044K715
$$ 133187 132858 133005 133857 134937 135746 136137 136144 135827 135312 134747 134295 134335 135375 137448 139844 141927 143971 146686
56654A46686L318L001K032J256Q88N40J23p6l7o8k31l35m47q59j513j945j890
$$ 146686 150004 153005 155037 156293 157181 157721 157844 157768 157731 157663 157432 157097 156650 155791 154278 152333 150443
56637A50443j528j117p75n80m92j52P66J978K733K613J838Q16j54o95m53L80J043
$$ 150443 148915 147798 147023 146443 145951 145799 146565 148543 151276 153889 155727 156543 156389 155694 155241 155621 156664
56620A56664R74L20l78p34n98MP46J156J110R81J126J429J604J691J878K033J668
$$ 156664 157638 157958 157580 156846 156248 156252 156998 158154 159264 160245 161371 162800 164404 166095 167973 170006 171674
56603A71674M86j164k420k572j691o01n4n1j50k66o80j320j632j386j032r41p17
$$ 171674 172160 170996 168576 166004 164313 163712 163658 163607 163457 163191 162511 161191 159559 158173 157141 156200 155483
56586A55483J91J426J909J124j97q63l72P57J632J725J099K12l92l21M39J429
$$ 155483 155674 157100 159009 160133 159936 159073 158701 159458 161090 162815 163914 164126 163734 163413 163852 165281
56570A65281K064K204K224K371K359J988J835K684M386N934O818P599Q916J0525
$$ 165281 167345 169549 171773 174144 176503 178491 180326 183010 187396 193330 200148 207747 216663 227188
56556B27188J1792J2474J2437J1108Q052M004N42j413k264k833l303l260k454
$$ 227188 238980 251454 263891 274999 283051 287055 287597 286184 283920 281087 277784 274524 272070
56543B72070j223k82j70q30j707k286k519k657k850l084l326l500l476l288l257
$$ 272070 270847 270565 270395 269565 267858 265572 263053 260396 257546 254462 251136 247636 244160 240872 237615
56528B37615l598m018m061l715l365l229l146k971k763k552k217j721j251j075
$$ 237615 234017 229999 225938 222223 218858 215629 212483 209512 206749 204197 201980 200259 199008 197933
56514A97933j375k149l065l541l301k759k486k393j925j006k48m0m0J33K26j34
$$ 197933 196558 194409 191344 187803 184502 181743 179257 176864 174939 173933 173685 173645 173605 173738 173964 173830
56498A73830o65p22k28K43L17K55M34Q01J040J042R37P42L08l61r25j029p18l57
$$ 173830 173165 172443 172215 172458 172775 173030 173464 174265 175305 176347 177284 178026 178334 177973 177048 176019 175301 174944
56480A74944j12K27P99J275J218O99K35J36K33K90L28M01L43mm51o12l57N2K73
$$ 174944 174832 175059 175858 177133 178351 179050 179285 179421 179654 179944 180272 180673 181016 181012 180561 179949 179592 179644 179917
56461A79917K72L90J027K096K920K837J972J169J106J629K071K011J562J102Q84
$$ 179917 180189 180579 181606 183702 186622 189459 191431 192600 193706 195335 197406 199417 200979 202081 202965
56446B02965Q79Q66P48P37J064J545J669J206M97J9j24j68l13n75p63o13p8L78
$$ 202965 203844 204710 205458 206195 207259 208804 210473 211679 212176 212195 212071 211903 211590 211015 210252 209639 209561 209939
56428B09939J64o56j305j256q66p19o97k85M08O05q2j022j226l96Q67J657J520
$$ 209939 210103 209447 208142 206886 206020 205301 204604 204319 204727 205332 205250 204228 203002 202606 203473 205130 206650
56411B06650P33Qj88j4M9k31o96j028r31k95N36Q46K47p56j278j092p45p00q31
$$ 206650 207383 207391 207203 207189 207238 207007 206311 205283 204352 204057 204593 205439 205686 204930 203652 202560 201815 201115 200284
56392B00284q32o88n45n14p33j238j633j321l36M97N49K28M11J354K573L597M357
$$ 200284 199452 198764 198219 197705 196972 195734 194101 192780 192444 192941 193490 193718 194129 195483 198056 201653 206010
56375B06010M926N329N669O051O346O266N710M790L609K296J214P23O84N92K39
$$ 206010 210936 216265 221934 227985 234331 240597 246307 251097 254706 257002 258216 258939 259623 260215 260454
56360B60454q9k68o35j360j887j530m41M44N30J61M5M01R00J214J311J263J025
$$ 260454 260365 260097 259462 258102 256215 254685 254244 254688 255218 255379 255424 255825 256725 257939 259250 260513 261538
56343B61538N12j64o60o79k53K44M89N33O83J114J681K147K420K548K635K779
$$ 261538 262050 261886 261226 260547 260294 260538 261027 261560 262243 263357 265038 267185 269605 272153 274788 277567
56327B77567K959K898K346J606J460K253L276L461K575J309L07l57p30o95m19
$$ 277567 280526 283424 285770 287376 288836 291089 294365 297826 300401 301710 302017 301660 300930 300235 299816
56312B99816m82j129j780j768j210o64k60K02N97N70K67K97Q39J466J922K486
$$ 299816 299334 298205 296425 294657 293447 292783 292523 292725 293322 293892 294159 294456 295295 296761 298683 301169
56296C01169L218L551K971J743N68k02o67r63j163j348j448j165l31P71J675K168
$$ 301169 304387 307938 310909 312652 313220 313018 312351 311388 310225 308877 307429 306264 305933 306704 308379 310547
56280C10547K327K291K211K236K363K463K546K731K901K741K315K138K385K558
$$ 310547 312874 315165 317376 319612 321975 324438 326984 329715 332616 335357 337672 339810 342195 344753
56266C44753K333K273L015M134M558L973L161K942L421M262N119N688N883O085
$$ 344753 347086 349359 352374 356508 361066 365039 368200 371142 374563 378825 383944 389632 395515 401600
56252D01600O757P755Q503Q948R732J1228J2947J4224J5053J5850J6782J7680
$$ 401600 408357 416112 424615 433563 443295 454523 467470 481694 496747 512597 529379 547059
56240E47059J8392J8857J8999J8831J8557J8300J7831J6771J5021J2854J0584
$$ 547059 565451 584308 603307 622138 640695 658995 676826 693597 708618 721472 732056
56229G32056Q238N545K310j143m067o010p303q587j0016j1257j2104j2613j2696
$$ 732056 740294 745839 748149 747006 742939 736929 729626 721039 711023 699766 687662 675049 662353
56216F62353j2186j1347j0803j0770j0786j0359r491q443p523p158p590q223p913
$$ 662353 650167 638820 628017 617247 606461 596102 586611 578168 570645 563487 555897 547674 539761
56203E39761o357m630l873l948l945l558l243l195l032k439j611q50j80N03J148
$$ 539761 533404 528774 524901 520953 517008 513450 510207 507012 503980 501541 499930 499080 498900 499403 500551
56188E00551J586J704J546J279J030P84N20M63Q36J470J953K285K843L607L927
$$ 500551 502137 503841 505387 506666 507696 508480 509000 509463 510299 511769 513722 516007 518850 522457 526384
56173E26384L452K736K466K537K420K114K081K491L066L602M131M594M802M758
$$ 526384 529836 532572 535038 537575 539995 542109 544190 546681 549747 553349 557480 562074 566876 571634
56159E71634M713M900N411O187O932P331P528Q159R583J1369J2836J3775J4391
$$ 571634 576347 581247 586658 592845 599777 607108 614636 622795 632378 643747 656583 670358 684749
56146F84749J4964J5947J7876K0691K3595K6109K8817L2502L6999M1737M6960
$$ 684749 699713 715660 733536 754227 777822 803931 832748 865250 902249 943986 990946
56135I90946N3516O1715P1271Q2207R4707J07968J19997J28764J32937J31590
$$ 990946 1044462 1106177 1177448 1259655 1354362 1462330 1582327 1711091 1844028 1975618
56125A975618J24158J11182R4691P7563O2530N1356M4156L9360L4820K8950K0846
$$ 1975618 2099776 2210958 2305649 2383212 2445742 2497098 2541254 2580614 2615434 2644384 2665230
56114B665230J0097k588j5025k4970l1931l6906m0971m5326n2279o4204q0773
$$ 2665230 2675327 2672739 2657714 2632744 2600813 2563907 2522936 2477610 2425331 2361127 2280354
56103B280354r8401j12902j21901j24610j20890j11577r8779q4786p0965n7996
$$ 2280354 2181953 2069051 1947150 1822540 1701650 1590073 1491294 1406508 1335543 1277547
56093A277547m6415l6458k8042k1369j6815j3893j1198p908m517j636R76L516
$$ 1277547 1231132 1194674 1166632 1145263 1128448 1114555 1103357 1095449 1090932 1089296 1090272 1093788
56081A093788N351O017O226O902P865Q370Q418Q531Q638Q197P240O418O165O456
$$ 1093788 1099139 1105156 1111382 1118284 1126149 1134519 1142937 1151468 1160106 1168303 1175543 1181961 1188126 1194582
56067A194582P259Q595J0175J1530J2508J3347J4364J5764J7468J9003J9931K0519
$$ 1194582 1201841 1210436 1220611 1232141 1244649 1257996 1272360 1288124 1305592 1324595 1344526 1365045
56055A365045K1448K2782K3875K4446K4901K5302K5023K3900K2786K2366K2188
$$ 1365045 1386493 1409275 1433150 1457596 1482497 1507799 1532822 1556722 1579508 1601874 1624062
56044A624062K1584K0751K0259K0242K0788K2304K4698K6970K8453K9768L1661
$$ 1624062 1645646 1666397 1686656 1706898 1727686 1749990 1774688 1801658 1830111 1859879 1891540
56033A891540L3675L4897L5414L6056L7168L8576M0294M2341M4289M5711M6764
$$ 1891540 1925215 1960112 1995526 2031582 2068750 2107326 2147620 2189961 2234250 2279961 2326725
56022B326725M7724M8609M9732N1836N4942N8007O0472O3126O6577P0028P2703
$$ 2326725 2374449 2423058 2472790 2524626 2579568 2637575 2698047 2761173 2827750 2897778 2970481
56011B970481P5374P9129Q3558Q7642R1532R5966J00657J04827J08732J13274
$$ 2970481 3045855 3124984 3208542 3296184 3387716 3483682 3584339 3689166 3797898 3911172
56001C911172J18607J24458J31118J38831J46996J55321J64833J76284J88611
$$ 3911172 4029779 4154237 4285355 4424186 4571182 4726503 4891336 5067620 5256231
55992E256231K00601K12980K26984K42036K56959K72425K89791L08501L27329
$$ 5256231 5456832 5669812 5896796 6138832 6395791 6668216 6958007 7266508 7593837
55983G593837L47483L71635M00313M32049M66808N06359N51316O00783O55240
$$ 7593837 7941320 8312955 8713268 9145317 9612125 10118484 10669800 11270583 11925823
55974A1925823P17012P87613Q67214R57080J060125J179003J316411J477512J669651
$$ 11925823 12642835 13430448 14297662 15254742 16314867 17493870 18810281 20287793 21957444
55965B1957444J899827K175709K509726K919664L424846M043251M790323N676466
$$ 21957444 23857271 26032980 28542706 31462370 34887216 38930467 43720790 49397256
55957D9397256O707161P891999R257116J0848805J2727244J4954185J7563767
$$ 49397256 56104417 63996416 73253532 84102337 96829581 111783766 129347533
55950A29347533K0505808K3588784K6475309K8739252K9923909K9546179K7085858
$$ 129347533 149853341 173442125 199917434 228656686 258580595 288126774 315212632
55943C15212632K2071855J4325576M267226o938956j7597729k6036149l1212082
$$ 315212632 337284487 351610063 355877289 348938333 331340604 305304455 274092373
55936B74092373l3012054l2088658k9419929k5911802k2218974j8739869j5670516
$$ 274092373 241080319 208991661 179571732 153659930 131440956 112701087 97030571
55929I7030571j3064790j0897355r115087p659747o472231n498834m698508m040157
$$ 97030571 83965781 73068426 63953339 56293592 49821361 44322527 39624019 35583862
55921C5583862l495504l039644k655506k331734k057249j821706j618779j444094
$$ 35583862 32088358 29048714 26393208 24061474 22004225 20182519 18563740 17119646
55913A7119646j291576j155785j035889r32745q43436p62939o89852o25934n70715
$$ 17119646 15828070 14672285 13636396 12703651 11860215 11097276 10407424 9781490 9210775
55904I210775n20927m75065m34406l99259l67798l39075l13968k92495k72957
$$ 9210775 8689848 8214783 7780377 7381118 7013320 6674245 6360277 6067782 5794825
55895E794825k54340k37151k21406k05990j90521j75707j61495j46749j31178
$$ 5794825 5540485 5303334 5081928 4875938 4685417 4509710 4348215 4201466 4070288
55886D070288j15713j00673q5200o8855n2048l4580j5468N308K6250M5774O2724
$$ 4070288 3954575 3853902 3768702 3699847 3647799 3613219 3597751 3603059 3629309 3675083 3737807
55875C737807P5137Q0004P4888N8909L2138m534m8444r5002j39052j75944k01884
$$ 3737807 3812944 3892948 3967836 4026745 4058883 4054349 4005905 3910903 3771851 3595907 3394023
55864C394023k14885k15783k07498j92974j74440j54213j34790j17723j03189
$$ 3394023 3179138 2963355 2755857 2562883 2388443 2234230 2099440 1981717 1878528
55855A878528r0764p9987p0368o1722n4498m9034m4829m1312l8820l7759l7265
$$ 1878528 1787764 1707777 1637409 1575687 1521189 1472155 1427326 1386014 1347194 1309435 1272170
55844A272170l5994l3941l2174l0958k9538k7682k6057k4883k3595k1989k0585
$$ 1272170 1236176 1202235 1170061 1139103 1109565 1081883 1055826 1030943 1007348 985359 964774
55833I64774j9637j8808j7959j7232j6326j4786j3095j2270j2325j2303j1925
$$ 964774 945137 926329 908370 891138 874812 860026 846931 834661 822336 810033 798108
55822G98108j1938j2616j3230j3371j3586j4234j4754j4560j3706j2322j0369
$$ 798108 786170 773554 760324 746953 733367 719133 704379 689819 676113 663791 653422
55811F53422q277o891o368n986n332m705m166l290k173j599j686j493m92O09J106
$$ 653422 645145 638254 631886 625900 620568 615863 611697 608407 606234 604635 602949 601456 600964 601573 602679
55796F02679J334J733J915J522J170J693L012M489N811O792O915N833L967J983
$$ 602679 604013 605746 607661 609183 610353 612046 615058 619547 625358 632150 639065 644898 648865 650848
55782F50848O1j843l514m941o813r915j4156j8599k2184k4107k4001k2214j9607
$$ 650848 650909 649066 645552 640611 633798 623883 609727 591128 568944 544837 520836 498622 479015
55769D79015j6725j3423r646o101l707k701k644l033l586m142m545m552l935k907
$$ 479015 462290 448867 439221 433120 429413 426712 424068 421035 417449 413307 408762 404210 400275 397368
55755C97368k265k520l082l020k589l040m832o944q204q468q210p861p859q388
$$ 397368 395103 392583 389501 386481 383892 380852 376020 369076 360872 352404 344194 336333 328474 320086
55741C20086q716p714n562l870l598l842l365k286j383p23p8J31n77j702k470
$$ 320086 311370 303656 298094 294224 290626 286784 283419 281133 279750 279027 278949 279080 278503 276801 274331
55726B74331l057m073n270n822n653n384n187m684l911l430l408l400l066k441
$$ 274331 271274 267201 261931 256109 250456 245072 239885 235201 231290 227860 224452 221052 217986 215545
55712B15545j540l63P32J343J605J950K397K629K618K548K304J678Q12j77j683
$$ 215545 214005 213642 214374 215717 217322 219272 221669 224298 226916 229464 231768 233446 234258 234081 232398
55697B32398l892n866o341n400m383m105m063l569k727j985j569j664k379l160
$$ 232398 228506 222640 216299 210899 206516 202411 198348 194779 192052 190067 188498 186834 184455 181295
55683A81295k993j676k59K86K43M59R94J223R26N43K89k17j254k353k789k556
$$ 181295 178302 176626 176367 176653 176896 177355 178349 179572 180498 181041 181330 181113 179859 177506 174717 172161
55667A72161k389k762l182k894k014j454j648j961j687r97m04J46R92J874K162
$$ 172161 169772 167010 163828 160934 158920 157466 155818 153857 152170 151173 150769 150915 151907 153781 155943
55652A55943J893J790K150K483K402K277K586L153L383L002K234J520J256J593
$$ 155943 157836 159626 161776 164259 166661 168938 171524 174677 178060 181062 183296 184816 186072 187665
55638A87665K229K522J983O33j097k672l746m372m892n422n610n187m535m243
$$ 187665 189894 192416 194399 195032 193935 191263 187517 183145 178253 172831 167221 162034 157499 153256
55624A53256m281m081l433k647j890j035l15m09j374k153j756n46K23j1o94j143
$$ 153256 148975 144894 141461 138814 136924 135889 135574 135165 133791 131638 129882 129336 129559 129548 128854 127711
55608A27711j354j595j757j536j084r64j420j942j827r97q4L06J09m08j035j603
$$ 127711 126357 124762 123005 121469 120385 119421 118001 116059 114232 113235 113151 113457 113566 113158 112123 110520
55592A10520j837j501o47M50J441J904J512M67m36n48j9N57R05J153J356J462
$$ 110520 108683 107182 106535 106985 108426 110330 111842 112309 111873 111325 111306 111863 112768 113921 115277 116739
55576A16739J639K141K884L598M349N424O687P587P963Q284Q853R178Q478O527
$$ 116739 118378 120519 123403 127001 131350 136774 143461 151048 159011 167295 176148 185326 193804 200331
55562B00331L757P59k068m492o310p302p458p265p512q433r296r232q285p195
$$ 200331 204088 204847 202779 198287 191977 184675 177217 169952 162440 154007 144711 135479 127194 119999
55548A19999o295n256l924k671j830j382j364j942k830l302l062k554k136j632
$$ 119999 113704 108448 104524 101853 100023 98641 97277 95335 92505 89203 86141 83587 81451 79819
55534G9819j006p22r59j136q76p65j389k238k465k282k531l166l291k681k155
$$ 79819 78813 78091 77132 75996 75120 74355 72966 70728 68263 65981 63450 60284 56993 54312 52157
55519E2157k189k270j972j700j716j264M18K716M194M411M329M890N836O286N912
$$ 52157 49968 47698 45726 44026 42310 41046 41464 44180 48374 52785 57114 62004 67840 74126 80038
55504H0038N129M325L396K159Q98J79J29K00j28o96r91j022j337k074k526k021
$$ 80038 85167 89492 92888 95047 95945 96124 96253 96453 96325 95629 94638 93616 92279 90205 87679 85658
55488H5658q85OL64O14R61J014N25q7l37l22l49k98Q1N13M43p7m01j65L50P97
$$ 85658 84773 84779 85143 85757 86718 87732 88257 88170 87833 87511 87162 86864 86945 87458 87901 87824 87423 87258 87608 88405
55468H8405J094J065M70l61o06j56jq67j941j883o75L69L66k74p48q33p46o74
$$ 88405 89499 90564 91034 90673 90067 89911 89910 89043 87102 85219 84544 84913 85279 85005 84257 83424 82678 82004
55450H2004o86o81l53L08O22l9j193j721j412j088j018l96J116K445K544J861
$$ 82004 81318 80637 80284 80592 81214 81175 79982 78261 76849 75761 74743 74347 75463 77908 80452 82313
55434H2313J413J177N48k39l88K0R9m33r91j321j720k002j397J40J508J884J659
$$ 82313 83726 84903 85451 85212 84824 84844 84943 84510 83519 82198 80478 78476 77079 77219 78727 80611 82270
55417H2270J522J426J039N08Q7l26o37k22J068K037J320q22k682l036k142r36
$$ 82270 83792 85218 86257 86765 86852 86526 85889 85667 86735 88772 90092 89270 86588 83552 81410 80474
55401H0474PN45O80N02J63k47n73n48j77M8j64k93K81J090J005r5r90p58K1K44
$$ 80474 80481 81026 81706 82208 82371 82124 81551 81003 80826 80874 80710 80417 80698 81788 82793 82698 81708 80950 80971 81215
55381H1215k24o55o26l91l36n68r46j096n87N03J406J476R36M74L06J76J9%n0
$$ 81215 80991 80336 79710 79319 78983 78415 77469 76373 75786 76289 77695 79171 80107 80581 80887 81063 81082 81082 81032
55362H1032n10j244j586j237o23k18K8L97Q99J299J304O70m78j392j315n10k9
$$ 81032 80522 79278 77692 76455 75832 75614 75642 76039 76938 78237 79541 80211 79733 78341 77026 76516 76487
55345G6487l16n94r6P77J118Q65P16R80J267J158N91l82j646k715k947k192q91
$$ 76487 76171 75577 75481 76258 77376 78241 78957 79937 81204 82362 82953 82571 80925 78210 75263 73071 72180
55328G2180M31J389J633J033P2m96m99m41o72r82j087j028q70m93K5L01K10J44
$$ 72180 72611 74000 75633 76666 76738 76242 75743 75302 74630 73648 72561 71533 70663 70170 70195 70496 70706 70850
55310G0850L83O44O27O03R46J405J406R51N57L61m3p98j300r15J41J021J132N87
$$ 70850 71233 71877 72504 73107 74053 75458 76864 77815 78372 78733 78690 77892 76592 75677 75818 76839 77971 78558
55292G8558j16n52n65k32J95M98O42P54Q59P70L29k98p19p13l75J37Q30J698K467
$$ 78558 78442 77890 77325 77093 77288 77786 78428 79182 80041 80811 81140 80842 80123 79410 79035 79172 80002 81700 84167
55273H4167K703K221J261K68l99o21n65n04n14l84RL58J98m67j080j148p77m38
$$ 84167 86870 89091 90352 90620 90221 89600 89035 88531 88017 87633 87642 88000 88198 87731 86651 85503 84726 84288
55255H4288l73l64p6M77Q71P22J91j90k08k17n11q03o74k44Q9L79R77J674J742
$$ 84288 83915 83551 83475 83952 84823 85545 85736 85546 85338 85121 84610 83807 83133 82889 82978 83357 84334 86008 87750
55236H7750R95J58j57k39n87r93r17m36j54k72m08l20k42l60m27k17J6j42o34
$$ 87750 88745 88903 88746 88507 87920 86927 86010 85574 85420 85148 84740 84420 84178 83818 83391 83174 83190 83048 82414
55217H2414r21o27l3K06j75p23p32n6O94P83J60m56k75P50J820K024J200J8p65
$$ 82414 81493 80866 80833 81039 80864 80141 79409 79353 80047 80830 80990 80534 80259 81009 82829 84853 86053 86071 85306
55198H5306r18n99LO09Q15N35K52M18P20N54Qk54m5J61J09O4M4l04p75m81P39
$$ 85306 84388 83789 83792 84401 85216 85751 86003 86421 87141 87695 87703 87449 87404 87565 87674 87738 87782 87478 86703 86222 86961
55177H6961J639J140j37q19p27p42j127j150m51L25N27L25J72J12p0l91o67o53
$$ 86961 88600 89740 89603 88784 88057 87315 86188 85038 84587 84912 85439 85764 85936 86048 85978 85587 84920 84267
55159H4267j84N31P65J8j158j597q92K83J225J904K335K093R07o67j697j759j123
$$ 84267 84083 84614 85379 85397 84239 82642 81750 82033 83258 85162 87497 89590 90497 89830 88133 86374 85251
55142H5251l33J35J23n6J9K23M7m64n07L38J337J479P75M6k74m72q35j249j549
$$ 85251 84918 85053 85176 85120 85139 85362 85409 84945 84438 84776 86113 87592 88367 88413 88139 87667 86832 85583 84034
55123H4034j727j660j113k33L92L92P2o5Pm0k33j67L85J048J229Q46L78J99J63
$$ 84034 82307 80647 79534 79301 79693 80085 80157 80092 80099 80059 79826 79659 80044 81092 82321 83167 83545 83744 83907
55104H3907qk24j42K81O92Q10P12O69Q31J145J435J510J276P99K34k62n16m97
$$ 83907 83899 83675 83533 83814 84506 85316 86028 86697 87528 88673 90108 91618 92894 93693 93927 93665 93149 92652
55086I2652n06r00j419j212L4J376J615Q13P1l8mk70n07l75k67p45j614k109j736
$$ 92652 92146 91246 89827 88615 88649 90025 91640 92453 92524 92486 92482 92212 91705 91330 91063 90318 88704 86595 84859
55067H4859o24O51J328R84Q8l72q8K03j19o52p03l91l20n11n12k83k43m53m66
$$ 84859 84235 84886 86214 87198 87286 86914 86826 87029 86910 86258 85555 85164 84844 84333 83821 83538 83295 82842 82376
55048H2376k4N88R56Q60K54n69q80j54J149J983J866J194M44k65p32n64J64P28
$$ 82376 82352 82940 83896 84756 85010 84441 83561 83407 84556 86539 88405 89599 90043 89778 89046 88482 88646 89374
55030H9374O17K10J81O15J043J048N06m97j564k016j461l13N54O60K13l42p41
$$ 89374 89991 90201 90382 90997 92040 93088 93594 93097 91533 89517 88056 87743 88297 88957 89170 88828 88087
55013H8087q29m52K96Q65O27l73j295j350o66ML20O10J035J162P97O25J357K467
$$ 88087 87258 86806 87102 87967 88594 88221 86926 85576 84910 84914 85234 85844 86879 88041 88838 89463 90820 93287
54995I3287K683J650L76j00J78N57O94N80K02l50o93n55j68J1j55m66o77o07j98
$$ 93287 95970 97620 97996 97896 98074 98631 99325 99905 100107 99757 99064 98509 98341 98352 98197 97731 97054 96447 96249
54976I6249L10N14L88L90Q39J422J608J293P34J00n30r21q95o45m40j79L89J063
$$ 96249 96559 97073 97461 97851 98690 100112 101720 103013 103747 103847 103317 102396 101501 100856 100416 100237 100626 101689
54958A01689J259P46o5n86n25J12J088J840J735O87n64j084o04L12Q82Q02L16
$$ 101689 102948 103694 103629 103043 102518 102630 103718 105558 107293 107980 107416 106332 105728 106040 106922 107724 108040
54941A08040j98n85q49q72n11N9M13M26N04R92J568J606J030M03J43L4l11q27
$$ 108040 107842 107257 106408 105536 105025 105084 105497 105923 106427 107419 108987 110593 111623 112026 112169 112203 111892 111065
54923A11065j010n25M66J512K331L021L825M790N698O350O752O974P034P019P121
$$ 111065 110055 109530 109996 111508 113839 116860 120685 125475 131173 137523 144275 151249 158283 165302 172423
54908A72423P325P189O196M288J831p87l298n422o927p870q448q612q130p044
$$ 172423 179748 186937 193133 197421 199252 198465 195167 189745 182818 174948 166500 157888 149758 142714
54894A42714n815m887m270l710l064k451k108k062j916j081M53J743J760O59k82
$$ 142714 136899 132012 127742 124032 120968 118517 116409 114347 112431 111350 111803 113546 115306 115965 115683
54879A15683j05R03J871K440K814L153L478L979M878O000O873P320P591P851P850
$$ 115683 115578 116481 118352 120792 123606 126759 130237 134216 139094 145094 151967 159287 166878 174729 182579
54864A82579P222N904M167K317M21j673m076o522q424r351r372q789p762o450
$$ 182579 189801 195705 199872 202189 202610 200937 196861 190339 181915 172564 163192 154403 146641 140191
54850A40191n336m905m946m632l502k073j255j332j793j986j674j022l57L7M4
$$ 140191 134855 129950 125004 120372 116870 114797 113542 112210 110417 108431 106757 105735 105378 105415 105459
54835A05459k30n91q74r50o74o7N92R79J081J166J347J381R08j61j537k709l137
$$ 105459 105229 104638 103764 102814 102140 102073 102665 103644 104725 105891 107238 108619 109527 109366 107829 105120 101983
54818A01983k552j276j11L39K08J28M46R22J157J056P52L28j85o99j090j272j124
$$ 101983 99431 98155 98044 98383 98591 98719 99165 100087 101244 102300 103052 103380 103195 102496 101406 100134 99010
54801I9010n57J80N04J70k57j5P84J256R39L86L14O37Q14P51P57Q17N54Lk54O5
$$ 99010 98453 98633 99137 99307 99050 99035 99819 101075 102014 102400 102714 103351 104165 104916 105673 106490 107044 107047 106793 106858
54781A06858M17K14k80l21J98N69L51k3K2K87J83j71J15J457L066L919M031M258
$$ 106858 107275 107489 107209 106888 107086 107655 108006 107983 108005 108292 108475 108304 108419 109876 112942 116861 120892 125150
54763A25150M994N763O085O130O211O225N981N715N729N807N445M513L216J572
$$ 125150 130144 135907 141992 148122 154333 160558 166539 172254 177983 183790 189235 193748 196964 198536
54749A98536n18k741m428n314n741o025o107o001o023o196n887m576k743j416
$$ 198536 198018 195277 190849 185535 179794 173769 167662 161661 155638 149442 143555 138979 136236 134820
54735A34820r37o72n1O03O25Ln43m84j29j62p05j167j036m88pM09J221K569L973
$$ 134820 133883 133211 133160 133763 134388 134391 133848 133364 133235 133073 132368 131201 130165 129677 129670 130079 131300 133869 137842
54716A37842N003N813O709P496P666P125O307N532M622L187J112j413m055o348
$$ 137842 142845 148658 155367 162863 170529 177654 183961 189493 194115 197302 198414 197001 192946 186598
54702A86598p821q272p923p222o505n889n316m638l757k836k272k274k465k138
$$ 186598 178777 170505 162582 155360 148855 142966 137650 133012 129255 126419 124147 121873 119408 117270
54688A17270j027L04R84O66k39j099j569j610j287p77l94l31m26l84j87l9J7J51
$$ 117270 116243 116547 117531 118197 117958 116859 115290 113680 112393 111616 111222 110891 110465 110081 109894 109855 109872 110023
54670A10023L49L10j00n38n93k49J94N14O50N21Q7m86r77j340j563j379m83Q87
$$ 110023 110372 110682 110582 110044 109451 109202 109396 109910 110560 111081 111168 110682 109705 108365 106802 105423 104940 105827
54652A05827J932K000J215K59k86k81N2L53L14q8n14n51j73J51l0o23j017p82
$$ 105827 107759 109759 110974 111233 110947 110666 110718 111071 111385 111297 110783 110232 110059 110210 110180 109557 108540 107758
54634A07758j25M03N40M62L77K87J39j7j63l52m52j65M92R39O26k31q34p45l12
$$ 107758 107633 108036 108576 109038 109415 109702 109841 109824 109661 109309 108857 108692 109184 110123 110749 110518 109684 108939 108627
54615A08627j70n07r89j195j025p26n51l80J34J002J646J499P40R0k9J74L90O72
$$ 108627 108457 107950 106961 105766 104741 104015 103464 103084 103218 104220 105866 107365 108105 108195 108166 108340 108730 109402
54597A09402J104J417J177M02l25l96J87P50O37n5n66l73J65L40K4k53j23K05
$$ 109402 110506 111923 113100 113502 113177 112781 112968 113718 114355 114300 113734 113361 113526 113866 113890 113637 113514 113719
54579A13719L88M04L80K62n8m84p81p54k95N32J363J740J622J394J277J048N50
$$ 113719 114107 114511 114891 115153 115095 114611 113830 113076 112781 113313 114676 116416 118038 119432 120709 121757 122307
54562A22307J19J32L42J60m85r81p55J07R99J288P03m47j357j355n85J11R0l76
$$ 122307 122426 122558 122900 123060 122575 121594 120839 120946 121945 123233 123936 123489 122132 120777 120192 120303 120393 120017
54544A20017m14N03J928K751K199O41o22n35P59K206L001L180L130K938K511K027
$$ 120017 119603 120106 122034 124785 126984 127625 127003 126468 127227 129433 132434 135614 138744 141682 144193 146220
54528A46220J841J874J549N12p73j492j427j114j043j098r76q51j105j555j460
$$ 146220 148061 149935 151484 151996 151223 149731 148304 147190 146147 145049 144073 143222 142117 140562 139102
54513A39102m54Q39J435R65j29j193j860k043j790j239n90l8L48O19Q03P47K55
$$ 139102 138648 139487 140922 141887 141758 140565 138705 136662 134872 133633 133043 133005 133353 133972 134775 135522 135777
54496A35777m63o81O5J193J571R20J99K74P20N16m83j406j591j242p92l00L11
$$ 135777 135314 134633 134698 135891 137462 138382 138581 138855 139575 140091 139608 138202 136611 135369 134577 134277 134588
54479A34588Q79J239J470J631J551J173Q64J023J509J806J666J278Q66M96K99
$$ 134588 135467 136706 138176 139807 141358 142531 143395 144418 145927 147733 149399 150677 151543 152039 152338
54464A52338N51J305K148K560K397J907J392J047J003J244J433J134L79k01k6
$$ 152338 152889 154194 156342 158902 161299 163206 164598 165645 166648 167892 169325 170459 170838 170637 170611
54449A70611P76J561J813J408M15r06j909j949j125l44l83j138j956k423k528
$$ 170611 171387 172948 174761 176169 176584 175678 173769 171820 170695 170351 169968 168830 166874 164451 161923
54434A61923k388k166k102k201k092j556j001r71j221r20K21J482K044J877J476
$$ 161923 159535 157369 155267 153066 150974 149418 148417 147446 146225 145305 145526 147008 149052 150929 152405
54419A52405J152R51R17J031R97O07K26M07J027J252O11l22o59m34m92j232j975
$$ 152405 153557 154508 155425 156456 157453 158060 158286 158693 159720 160972 161583 161261 160602 160168 159676 158444 156469
54402A56469j880j096m74l71k80K75J027J392J263J030J049J336J635J575R21
$$ 156469 154589 153493 153019 152648 152368 152643 153670 155062 156325 157355 158404 159740 161375 162950 163871
54387A63871p7q13r78q56p76n97j31K66P5n81j077j121q77l79M59J240J227L72
$$ 163871 163794 162981 162003 161147 160371 159774 159643 159909 159984 159403 158326 157205 156328 155949 156408 157648 158875 159247
54369A59247m91p57p17p79p49m21k32n61q33j89J116J865J399L27m39o24m23j4
$$ 159247 158756 157999 157282 156503 155754 155333 155101 154540 153707 153518 154634 156499 157898 158225 157786 157162 156739 156725
54351A56725L74L66j37p42j035j061j043r48o92n43q43j419j666j350r31r80j446
$$ 156725 157099 157465 157328 156586 155551 154490 153447 152499 151807 151264 150421 149002 147336 145986 145055 144075 142629
54334A42629j763j545j038p85r70j218j060n28m6J87M30Q79J177Q87K10k34l45
$$ 142629 140866 139321 138283 137498 136528 135310 134250 133722 133676 133863 134293 135172 136349 137236 137446 137212 136867
54317A36867o65j328j528n63R79J801J508R12O79M98q0o74o21q1J34k44n83k66
$$ 136867 136202 134874 133346 132783 133762 135563 137071 137983 138662 139160 139080 138406 137785 137704 137838 137594 137011 136745
54299A36745N23J088R81K53o76j237j071m42j06n40j344j600q20N72J673J901
$$ 136745 137268 138356 139337 139590 138914 137677 136606 136164 136058 135518 134174 132574 131754 132326 133999 135900
54283A35900J361N50j38o11r06j035j037j000r08o23o7N76R82R16L31n95j425
$$ 135900 137261 137811 137673 137062 136156 135121 134084 133084 132176 131553 131486 132062 133044 133960 134291 133696 132271
54266A32271j704j379q39l98J7N30R34R28N51R1j79q1M16Q80N79n54j515j288
$$ 132271 130567 129188 128349 127951 127968 128498 129432 130360 130911 131002 130823 130742 131158 132038 132617 132063 130548 129260
54248A29260r7R51J278J174R46N18p5n45p76p83l34O52J420J008k31q41l00K20
$$ 129260 129163 130114 131392 132566 133512 134030 133955 133410 132634 131851 131517 132169 133589 134597 134366 133525 133225 133445
54230A33445k74r92n95O99J350N12j095k264k531k274k067k009j612n18P10J125
$$ 133445 133171 132179 131584 132283 133633 134145 133050 130786 128255 125981 123914 121905 120293 119775 120485 121610
54214A21610P93P89J493J830R60l23p77m85l03k44K66R81J076N44P9k50q62j379
$$ 121610 122403 123192 124685 126515 127475 127152 126375 125890 125587 125343 125609 126590 127666 128210 128289 128039 127177 125798
54196A25798r67PK42k99j62J136K064J375on56l17k48l70j04K38j90j211j709
$$ 125798 124831 124838 125080 124781 124619 125755 127819 129194 129188 128632 128315 128067 127697 127593 127831 127641 126430 124721
54178A24721j309p58o15n59j83L02M90K92j13m40l69N9K68j64p36n57M00J236
$$ 124721 123412 122654 122039 121480 121297 121599 122089 122381 122268 121828 121459 121518 121786 121622 120886 120329 120729 121965
54160A21965J327R70P17O93P59P96O53J99l30m77j91L7j36m79o04m63k50r8k4
$$ 121965 123292 124262 124979 125672 126431 127227 127880 128079 127749 127272 127081 127118 126982 126503 125899 125436 125186 125088 125064
54141A25064K5K26O79J056Q43L6o79o75p0M87M65k04j129j674j454p77l11k28
$$ 125064 125089 125315 125994 127050 127893 127929 127250 126575 126505 126992 127457 127253 126124 124450 122996 122219 121908 121680
54123A21680n1N17J060J052O19K99L01M64P14J108J459J408R06L47J13K26M10
$$ 121680 121629 122146 123206 124258 124877 125176 125477 125941 126655 127763 129222 130630 131536 131883 131996 132222 132632
54106A32632L57q8p55j182j041m69J56O67J083J208P19l30j393j961j932j415
$$ 132632 132989 132901 132146 130964 129923 129454 129610 130277 131360 132568 133287 132957 131564 129603 127671 126256
54090A26256n17N23J280J525J459J385J297J012N07q4o39r40o24L61J387J639
$$ 126256 125739 126262 127542 129067 130526 131911 133208 134220 134727 134643 134004 133064 132440 132801 134188 135827
54074A35827J032L12J64N16Q52R15R12J175J785K417K530J839O81k54o33p33r15
$$ 135827 136859 137171 137335 137851 138703 139618 140530 141705 143490 145907 148437 150276 150957 150703 150070 149337 148422
54057A48422j155j157p87k03K18O3p23j507j440m98L95N98O43J381K617L359L310
$$ 148422 147267 146110 145323 145120 145338 145401 144678 143171 141731 141233 141628 142226 142869 144250 146867 150226 153536
54040A53536L260L815M413M057K583Q73pL88J750L372M700N582O059O074N653
$$ 153536 156796 160611 165024 169081 171664 172537 172530 172918 174668 178040 182740 188322 194381 200455 206108
54025B06108N153M848M447L572K616K383K791K777J822P60N09Q02Q27N26K93o7
$$ 206108 211261 216109 220556 224128 226744 229127 231918 234695 236517 237277 237786 238588 239415 239941 240234 240167
54009B40167j036k254k827k731k878l525l768l049k262k556l693m411m047l057
$$ 240167 239131 236877 234050 231319 228441 224916 221148 218099 215837 213281 209588 205177 201130 198073
53995A98073k108j419j015r17r63q65o68p38j120j271p49J07N28J51p59j792k655
$$ 198073 195965 194546 193531 192614 191651 190786 190118 189380 188260 186989 186240 186347 186875 187026 186267 184475 181820
53978A81820l017k577j569p48n25m08K36J089J227N46J02P41K035L106L943N136
$$ 181820 178803 176226 174657 173909 173384 172976 173212 174301 175528 176074 176176 176917 178952 182058 186001 191137
53962A91137O603P552P722P856Q478Q862P768M959J424j769m298o252p458p533
$$ 191137 197740 205292 213014 220870 229348 238210 245978 250937 252361 250592 246294 240042 232584 225051
53948B25051o485m871l300k002r13l2O42J270J913K243J983J580J826K621K868
$$ 225051 218566 213695 210395 208393 207480 207448 208090 209360 211273 213516 215499 217079 218905 221526 224394
53933B24394K087J379K003L494M205L483K274J494R83L84K2K48O37O54N71J047
$$ 224394 226481 227860 229863 233357 237562 241045 243319 244813 245796 246180 246202 246450 247087 247741 248312 249359
53917B49359K036K871L236L474L991M818N756O567O979O810O134N208M381M091
$$ 249359 251395 254266 257502 260976 264967 269785 275541 282108 289087 295897 302031 307239 311620 315711
53903C15711M516N041M528K575K28j095j108o63n51q70j418k042k545k789k912
$$ 315711 320227 325268 329796 332371 332599 331504 330396 329733 329182 328312 326894 324852 322307 319518 316606
53888C16606l169l588m136m950n934o402n866m971m815n373n503m676l699l358
$$ 316606 313437 309849 305713 300763 294829 288427 282561 277590 272775 267402 261899 257223 253524 250166
53874B50166l215k521j574j314j939k675k821k428j974j848k119k467k443k028
$$ 250166 246951 244430 242856 241542 239603 236928 234107 231679 229705 227857 225738 223271 220828 218800
53860B18800j728j840j979j698j303j413j976k303k078j638j307j014p47p35r74
$$ 218800 217072 215232 213253 211555 210252 208839 206863 204560 202482 200844 199537 198523 197776 197041 196067
53845A96067j025o27j00J37J13K5k11p44j307j426j079p55p97j003j077j188j779
$$ 196067 195042 194415 194315 194452 194565 194590 194379 193635 192328 190902 189823 189068 188271 187268 186191 185003 183224
53828A83224k770l298k561p91Q78J532J221M78m21j368j910j492k78Q41J221J101
$$ 183224 180454 177156 174595 173804 174682 176214 177435 177913 177492 176124 174214 172722 172444 173285 174506 175607
53812A75607J030J078R05M10n7n1N66J540K445L085L684M457N062M932M252M034
$$ 175607 176637 177715 178620 179030 178973 178922 179488 181028 183473 186558 190242 194699 199761 204693 208945 212979
53796B12979M838N975O507O619P189Q251Q852Q516P951P929Q160P871O922N633
$$ 212979 217817 223792 230299 236918 244107 252358 261210 269726 277677 285606 293766 301637 308559 314192
53782C14192L881J235k049m871o365o685o523o297o117o145o471o742o437n589
$$ 314192 318073 319308 317259 312388 306023 299338 292815 286518 280401 274256 267785 261043 254606 249017
53768B49017m872m761m880m519l648k960k931l216l238k969k733k532k109j651
$$ 249017 244145 239384 234504 229985 226337 223377 220446 217230 213992 211023 208290 205758 203649 201998
53754B01998j732k420k972k789k184j730j248j81J224J937J467N02j00l48p07
$$ 201998 200266 197846 194874 192085 189901 188171 186923 186742 187966 189903 191370 191872 191772 191424 190717
53739A90717j119j093n97j43L1L00R13J428J272O39L29P51J448J721J421R37O60
$$ 190717 189598 188505 187908 187765 187796 188096 189009 190437 191709 192348 192677 193428 194876 196597 198018 198955 199615
53722A99615O89R54J308J514J434J266J352J614J489O40n34j354j612j503j082
$$ 199615 200304 201258 202566 204080 205514 206780 208132 209746 211235 211875 211341 209987 208375 206872 205790
53707B05790l11M47N81J00k57MM99O28M08K28J82J79L77R00J363J343J170J485
$$ 205790 205479 205926 206507 206607 206350 206354 206853 207481 207889 208117 208299 208478 208855 209755 211118 212461 213631 215116
53689B15116K054J897P95j73q4N96Q13L46l10j011j953k763k606j399j67J63k12
$$ 215116 217170 219067 219862 219689 219605 220201 221014 221360 221050 220039 218086 215323 212717 211318 211151 211314 211102
53672B11102m78k63K40Q26J382J629J232K72p64j487j878k020j794j051L5R07
$$ 211102 210624 210361 210601 211427 212809 214438 215670 215942 215178 213691 211813 209793 207999 206948 206983 207890
53656B07890J052M30m57j010j034p99o00m70l23k43l14l71j67K09M23M85Q10J517
$$ 207890 208942 209372 208915 207905 206871 206072 205472 205002 204679 204436 204122 203751 203584 203793 204216 204701 205511 207028
53638B07028K027J787J145R77J480J915J662J013O16O36Q02R21Q40K25r01j630
$$ 207028 209055 210842 211987 212964 214444 216359 218021 219034 219650 220286 221088 222009 222849 223074 222173 220543
53622B20543r08R99K555K736K131J907K288K748L193L996M975N213M261K867K048
$$ 220543 219635 220634 223189 225925 228056 229963 232251 234999 238192 242188 247163 252376 256637 259504 261552
53607B61552J870J612R43L34K96P04J078J254J372J354Q36k04j111j206o29j38
$$ 261552 263422 265034 265977 266311 266607 267311 268389 269643 271015 272369 273205 273001 271890 270684 270055 269917
53591B69917j49l95o04r45j573k118k134j703j254r50p74r35j587k204j959q69
$$ 269917 269768 269373 268769 267824 266251 264133 261999 260296 259042 258092 257318 256383 254796 252592 250633 249764
53575B49764K4q7q06j177q37j86L22N00K44m79j316j589r36K23J051J113P01L48
$$ 249764 249788 249701 248895 247718 246881 246695 247017 247517 247761 247282 245966 244377 243441 243664 244715 245828 246529 246877
53557B46877K81M76J050K104L170L387K555J594J458J985K366K441K766L492M033
$$ 246877 247158 247634 248684 250788 253958 257345 259900 261494 262952 264937 267303 269744 272510 276002 280035
53542B80035L967L520L037K690K888M127O025P305P338P008P454Q590R607J0324
$$ 280035 284002 287522 290559 293249 296137 300264 306289 313594 320932 327940 335394 343984 353591 363915
53528C63915J1086J1772J1877J1522J1481J2108J2923J3379J3490J3699J4551
$$ 363915 375001 386773 398650 410172 421653 433761 446684 460063 473553 487252 501803
53517E01803J6360J8658K0210K0295J9769K0039K1115K1670K1092K0361K0529
$$ 501803 518163 536821 557031 577326 597095 617134 638249 659919 681011 701372 721901
53506G21901K1287K1698K1475K0895K0065J9097J8523J8734J9272J9341J8892
$$ 721901 743188 764886 786361 807256 827321 846418 864941 883675 902947 922288 941180
53495I41180J8530J8562J8752J8962J9307J9608J9319J8289J7151J6629J6696
$$ 941180 959710 978272 997024 1015986 1035293 1054901 1074220 1092509 1109660 1126289 1142985
53484A142985J6645J5842J4251J2332J0629R375Q353P166N653M073K708J362n68
$$ 1142985 1159630 1175472 1189723 1202055 1212684 1222059 1230412 1237578 1243231 1247304 1250012 1251374 1250806
53471A250806l311o197q276r430j0528j2321j4527j6372j7594j8480j9231j9822
$$ 1250806 1247495 1241298 1233022 1223592 1213064 1200743 1186216 1169844 1152250 1133770 1114539 1094717
53459A094717k0402k1137k1739k1812k1644k1970k2825k3302k2758k1568k0388
$$ 1094717 1074315 1053178 1031439 1009627 987983 966013 943188 919886 897128 875560 855172
53448H55172j9336j8283j7310j6390j5197j3743j2669j2299j1924j0691q724o698
$$ 855172 835836 817553 800243 783853 768656 754913 742244 729945 718021 707330 698606 691908
53436F91908m708k495m34P02R61J324K536M512O860R260J1230J2336J2885J3775
$$ 691908 687200 684705 684271 684973 685934 687258 689794 694306 701166 710426 721656 733992 746877 760652
53422G60652J5432J7463J9424K1224K2616K3179K3186K3731K5423K7580K9263
$$ 760652 776084 793547 812971 834195 856811 879990 903176 926907 952330 979910 1009173
53411A009173L0551L2115L4040L5866L7515L9307M1194M2730M3943M5482M7759
$$ 1009173 1039724 1071839 1105879 1141745 1179260 1218567 1259761 1302491 1346434 1391916 1439675
53400A439675N0406N2814N4626N5591N5440N4374N3269N2862N2897N2487N1249
$$ 1439675 1490081 1542895 1597521 1653112 1708552 1762926 1816195 1869057 1921954 1974441 2025690
53389B025690M9660M8232M6817M4925M2432L9588L6513L3023K9063K4983K1208
$$ 2025690 2075350 2123582 2170399 2215324 2257756 2297344 2333857 2366880 2395943 2420926 2442134
53378B442134J7733J4112R913N180M74l648p320j1460j6873k3195k9154l4046
$$ 2442134 2459867 2473979 2483892 2489072 2489546 2485898 2478578 2467118 2450245 2427050 2397896 2363850
53366B363850l8572m3799m9654n4960n8791o1165o2419o2610o1823o0563n9388
$$ 2363850 2325278 2281479 2231825 2176865 2118074 2056909 1994490 1931880 1870057 1809494 1750106
53355A750106n8372n7288n6017n4539n2692n0453m8268m6687m5677m4623m3119
$$ 1750106 1691734 1634446 1578429 1523890 1471198 1420745 1372477 1325790 1280113 1235490 1192371
53344A192371m1447m0155l9412l8901l8101l6499l3823l0391k7098k4678k2978
$$ 1192371 1150924 1110769 1071357 1032456 994355 957856 924033 893642 866544 841866 818888
53333H18888k1244j9157j7139j5508j3850j1727r599q317p714o547m166j522M0
$$ 818888 797644 778487 761348 745840 731990 720263 710664 702347 694633 688086 683920 682398 682438
53320F82438N19J051K224L464M157M625N603P227Q982J0377J1360J2183J3181
$$ 682438 682957 684008 686232 689696 693853 698478 704081 711308 720290 730667 742027 754210 767391
53307G67391J4609J6429J8253J9705K0788K1857K3204K4787K6282K7350K7889
$$ 767391 782000 798429 816682 836387 857175 879032 902236 927023 953305 980655 1008544
53296A008544K8117K8350K8688K8957K8934K8589K8023K7306K6383K5159K3550
$$ 1008544 1036661 1065011 1093699 1122656 1151590 1180179 1208202 1235508 1261891 1287050 1310600
53285A310600K1479J8858J5718J2369R333O832M434J500j949n169p649r720j1904
$$ 1310600 1332079 1350937 1366655 1379024 1388357 1395189 1399623 1401123 1399174 1394005 1386356 1376636 1364732
53272A364732j4047j5646j6772j8077j9877k1837k3576k5115k6563k7844k8971
$$ 1364732 1350685 1335039 1318267 1300190 1280313 1258476 1234900 1209785 1183222 1155378 1126407
53261A126407l0128l1321l2300l2938l3394l3710l3630l3026l2101l0972k9503
$$ 1126407 1096279 1064958 1032658 999720 966326 932616 898986 865960 833859 802887 773384
53250G73384k7764k6293k5498k5118k4643k4023k3565k3360k3167k2764k2102
$$ 773384 745620 719327 693829 668711 644068 620045 596480 573120 549953 527189 505087
53239E05087k1216k0246j9381j8544j7348j5537j3363j1284r576q406p883p690
$$ 505087 483871 463625 444244 425700 408352 392815 379452 368168 358592 350186 342303 334613
53227C34613p110n920m907m870n416n422m582l756l739m404n149n533n212m030
$$ 334613 327503 321583 316676 311806 306390 300968 296386 292630 288891 284487 279338 273805 268593 264563
53213B64563k553j932k625l630l557k281j008q15j639k648l131k901k197j429
$$ 264563 262010 260078 257453 253823 250266 247985 246977 246162 244523 241875 238744 235843 233646 232217
53199B32217q84n47k84j75n04j286k002j972j059J12O71L00n60j245j468j333
$$ 232217 231333 230786 230502 230327 229823 228537 226535 224563 223504 223616 224287 224587 224027 222782 221314 219981
53183B19981r45l72P7m2p19j348j467j376j602k015j999j438q93o97m77O0M56
$$ 219981 219036 218664 218741 218699 217980 216632 215165 213789 212187 210172 208173 206735 205842 205145 204668 204728 205184
53166B05184J44o23j048q52l70J78R22J755K214K093J667J079J11j213k297k643
$$ 205184 205328 204705 203657 202805 202435 202613 203535 205290 207504 209597 211264 212343 212454 211241 208944 206301
53150B06301k401j930j290o03k93m73n23K8O09L82m39q92p13n35o71p32n70o52
$$ 206301 203900 201970 200680 200077 199784 199311 198788 198816 199425 199807 199368 198476 197763 197228 196557 195825 195255 194603
53132A94603j143j423j043m49l02n84q77j025j010o67LN55N66J15m59r32j058
$$ 194603 193460 192037 190994 190545 190243 189659 188782 187757 186747 186080 186083 186638 187204 187319 186860 185928 184870
53115A84870o13O4J56n22j040n66M83J159J322J444J493J004O3o84j085j587k262
$$ 184870 184257 184321 184477 183955 182915 182349 182832 183991 185313 186757 188250 189254 189317 188633 187548 185961 183699
53098A83699k491j982j312j148j435j691j669j399r25l68op0n10j041j259p96
$$ 183699 181208 179226 177914 176766 175331 173640 171971 170572 169647 169279 169273 169203 168693 167652 166393 165597
53082A65597L04J360J573Q76k2m38k72K01O60Q15N47J22m0N2k3m86j045j348j426
$$ 165597 165901 167261 168834 169710 169688 169250 168978 169179 169839 170654 171201 171323 171283 171335 171312 170826 169781 168433 167007
53063A67007j468j481j353j067o59j39L74O24M55L4k79k74j16k05o49q97k75J004
$$ 167007 165539 164058 162705 161638 160979 160840 161214 161838 162293 162327 162048 161774 161658 161453 160804 159907 159632 160636
53045A60636J755J197qo17l75r0k84n72m31J62R62J716K002J413J82q69j229j122
$$ 160636 162391 163588 163580 162963 162588 162498 162214 161642 161211 161373 162335 164051 166053 167466 167648 166779 165550 164428
53027A64428r42p46n27l80k51M2K86Oo76r56m77J04J17j59r4K45L09n0n16q49
$$ 164428 163486 162740 162213 161833 161582 161624 161910 161916 161240 160284 159807 159911 160028 159869 159775 160020 160329 160279 159763 158914
53007A58914r74p48k03J99O8l53n44m32k47J8L96N00m1q16j003n28j67l34m68
$$ 158914 157940 157192 156989 157188 157256 156903 156359 155927 155680 155698 156094 156594 156553 155737 154734 154206 154039 153705 153237
52988A53237O0R56J372R77K66r3P9M76P67Q80Q36N07k04r46j075m48K82M39J49
$$ 153237 153297 154253 155625 156602 156868 156775 156854 157330 158097 158977 159813 160320 160116 159170 158095 157647 157929 158368 158517
52969A58517MK41N89Q22R79J078J095J172J512J952K026J519P38J61mL4j73q44
$$ 158517 158521 158762 159351 160173 161152 162230 163325 164497 166009 167961 169987 171506 172244 172405 172401 172435 172262 171418
52951A71418j563j555o57L16N44J71k23p28j768k884k929j739o48p60j502j609
$$ 171418 169855 168300 167643 167959 168503 168674 168451 167723 165955 163071 160142 158403 157755 156995 155493 153884
52935A53884r42m53o42r45p48j96K39M88Q08J217J379J020K85l53n80n79p51j088
$$ 153884 152942 152489 151847 150902 150154 149958 150197 150685 151493 152710 154089 155109 155394 155041 154461 153882 153131 152043
52917A52043j062l10P22J183P46r6o73p95p23p57r97j268j199n54L60Q94Q09O00
$$ 152043 150981 150671 151393 152576 153322 153226 152553 151758 151035 150278 149281 148013 146814 146260 146620 147514 148323 148923
52899A48923P93J125Q89Rp95r56p67p37p37k66O18J220J072M88P8N9K08K91K50
$$ 148923 149716 150841 151730 151739 150944 149988 149221 148484 147747 147481 148099 149319 150391 150879 150957 151016 151224 151515 151765
52880A51765J62J57L16M92L80j68r28j451j364o32L33Q11L72n68j084p14J38Q45
$$ 151765 151927 152084 152400 152892 153272 153104 152176 150725 149361 148729 149062 149873 150245 149677 148593 147879 148017 148862
52862A48862J258J568J807J906J981K177K353K315K188K114J816R60k6k26M65
$$ 148862 150120 151688 153495 155401 157382 159559 161912 164227 166415 168529 170345 171305 171279 171053 171518
52847A71518R49L13q97j429j035o96j138j953k446k654k919l010k490j703j489
$$ 171518 172467 172780 171883 170454 169419 168723 167585 165632 163186 160532 157613 154603 152113 150410 148921
52832A48921j865j888j112k91q0J09J088K342K651J910J204J047Q20J36l59j90
$$ 148921 147056 145168 144056 143765 143685 143794 144882 147224 149875 151785 152989 154036 154856 154992 154633 154443
52816A54443J2m71j225j363q60l61j08J18K91J77k4J00M96P98J059J587K184K272
$$ 154443 154455 153984 152759 151396 150536 150175 150067 150185 150476 150653 150629 150729 151225 152023 153082 154669 156853 159125
52798A59125J792J250Q06O2j068k003k303k272k406k715k854k561j772o42L37
$$ 159125 160917 162167 162973 163035 161967 159964 157661 155389 152983 150268 147414 144853 143081 142439 142776
52783A42776O20K11l28n61n38m04j94p2k74n58l08N01J002N49l62q10o20k43J59
$$ 142776 143396 143607 143279 142718 142180 141776 141582 141510 141236 140678 140370 140871 141873 142422 142060 141250 140630 140387 140546
52764A40546P41J231J021R7p29q47n93o42r81j005m57K24N62O77R40J271J186
$$ 140546 141287 142518 143539 143636 142907 142060 141467 140825 139844 138839 138382 138606 139168 139845 140785 142056 143242
52747A43242N34k00m45j05N99J455K157K241J598Q63P93J318J729J660J390J174
$$ 143242 143776 143576 143131 143026 143625 145080 147237 149478 151076 151939 152732 154050 155779 157439 158829 160003
52731A60003R05N54L38J96k41r04j081m10N01R05R21J025R96J98j208k167k035
$$ 160003 160908 161462 161800 161996 161755 160851 159770 159360 159861 160766 161687 162712 163708 163906 162698 160531 158496
52714A58496j340r78j157j471j596j548j391j127q54p29p15n09J19R54J417J082
$$ 158496 157156 156178 155021 153550 151954 150406 149015 147888 147034 146305 145590 145081 145200 146154 147571 148653
52698A48653J21q30j181q13q7N00O15K93j55m30m61k95O4M93O12R2p84j240q38
$$ 148653 148774 147944 146763 145950 145863 146363 146978 147271 147116 146686 146225 145930 145994 146487 147099 147191 146407 145167 144329
52679A44329M2P02R27J019J228J391J203P06L55N10R54J067O56J93P4o6p03j374
$$ 144329 144371 145073 146000 147019 148247 149638 150841 151547 151902 152412 153366 154433 155089 155282 155356 155290 154587 153213
52661A53213j108R6J062J038O96R48J582J822J656J613J593R97N4j15R29K196
$$ 153213 152105 152201 153263 154301 154997 155945 157527 159349 161005 162618 164211 165208 165262 165147 166076 168272
52645A68272K551K052J412P46l53j770k709k650j969j409j323j527j602j261o08
$$ 168272 170823 172875 174287 175033 174680 172910 170201 167551 165582 164173 162850 161323 159721 158460 157852
52630A57852j46k82p70q60j85Q09J462J645J673J664J473J115Q20N46qp62j084
$$ 157852 157706 157424 156654 155794 155609 156418 157880 159525 161198 162862 164335 165450 166270 166816 166808 166046 164962
52613A64962o39k6p9p68j290j131n45k9J78L4l45n46j60N93R18L66o23j270j194
$$ 164962 164323 164297 164218 163450 162160 161029 160484 160455 160633 160667 160322 159776 159616 160209 161127 161493 160870 159600 158406
52594A58406m41P30J760J958J223L46J25M28N82M68N67R90J123N37k90n74k57
$$ 158406 157965 158695 160455 162413 163636 163982 164107 164535 165117 165585 166152 167142 168265 168802 168512 167938 167681
52577A67681N0N8K55J083K041K096J059p0l59j23k25n78k20J021J929J400p4j091
$$ 167681 167731 167789 168044 169127 171168 173264 174323 174253 173894 173771 173546 172968 172748 173769 175698 177098 177024 175933
52559A75933j101p43o62p33n00J32Q00R89M26n78j239j078m58j05k17m07l98k36
$$ 175933 174832 174089 173427 172694 172194 172326 173126 174115 174541 173963 172724 171646 171188 171083 170866 170459 170061 169825
52541A69825M3M73Q65R07O25L32N0m94j186j377p42J56M86P9n40q30o21m5N98
$$ 169825 169868 170341 171206 172113 172738 173070 173120 172626 171440 170063 169321 169477 169963 170042 169502 168672 168051 168006 168604
52522A68604R55Q94O41M72L55R9k52l54K5O96J239J412J389J537J975K406K493
$$ 168604 169559 170453 171094 171566 171921 172020 171768 171414 171439 172135 173374 174786 176175 177712 179687 182093 184586
52505A84586K282K149K248K266J816R88L03J04J08k65j173k082k401k166j892
$$ 184586 186868 189017 191265 193531 195347 196335 196638 196742 196850 196585 195412 193330 190929 188763 186871
52490A86871j823j690j319j020j145j489j496r14K0Q54J207R88N72N55J072J595
$$ 186871 185048 183358 182039 181019 179874 178385 176889 175975 175995 176849 178056 179044 179616 180171 181243 182838
52474A82838J677J605J835K138J909J191O60O21O86N70N44Q12J034Q31L86J76
$$ 182838 184515 186120 187955 190093 192002 193193 193853 194474 195160 195730 196274 197086 198120 198951 199337 199513
52458A99513L76P29Q02K55p94j606j470o25n9k24n93p56j132k014k615k051q43
$$ 199513 199889 200618 201420 201675 200881 199275 197805 197180 197121 196897 196304 195548 194416 192402 189787 187736 186893
52441A86893m24j198k026j838r80n70j073j919k225j567k95P33R40O04M10M30
$$ 186893 186469 185271 183245 181407 180427 179857 178784 176865 174640 173073 172778 173511 174451 175055 175465 175895
52425A75895P5q30j517j275m83m3j49k62j25p2k06p3N72J280J612J842K374K852
$$ 175895 175970 175140 173623 172348 171865 171822 171673 171411 171286 171214 171008 170935 171507 172787 174399 176241 178615 181467
52407A81467K580J705J246J845L123M430N581O482O637N726M315L263K553J373
$$ 181467 184047 185752 186998 188843 191966 196396 201977 208459 215096 220822 225137 228400 230953 232326
52393B32326n66k471l484l641l488l152k412j469r55j095j301r46k28P9l14q09
$$ 232326 231760 229289 225805 222164 218676 215524 213112 211643 210688 209593 208292 207346 207118 207197 206883 206074
52377B06074p51l11j67m96o85j80P62J417J433J092R31J319K225L109L232K394
$$ 206074 205323 205012 204845 204349 203664 203484 204246 205663 207096 208188 209119 210438 212663 215772 219004 221398
52361B21398J204L75j00o45j263j551j492j547j813j742r83M1P79J278J790K084
$$ 221398 222602 222977 222877 222232 220969 219418 217926 216379 214566 212824 211841 211882 212661 213939 215729 217813
52345B17813J744R83N15O34R25R63Q73J013J402J725J747J533J352J469J978K698
$$ 217813 219557 220540 221055 221689 222614 223577 224450 225463 226865 228590 230337 231870 233222 234691 236669 239367
52329B39367L249L344L129L143L806M956O021O674P039P250P149O773O647P049
$$ 239367 242616 245960 249089 252232 256038 260994 267015 273689 280728 287978 295127 301900 308547 315596
52315C15596P175N898L425J382Q98J325J417J069J098J671J959J417N98M07J077
$$ 315596 322771 328669 332094 333476 334374 335699 337116 338185 339283 340954 342913 344330 344928 345335 346412
52300C46412K150L103L666L811L646L298K803K228J808J735J802J550P72l39j507
$$ 346412 348562 351665 355331 359142 362788 366086 368889 371117 372925 374660 376462 378012 378784 378445 376938
52285C76938k536l075k726j622n46j34j10L13J391K503K883K428J629J012Q12
$$ 376938 374402 371327 368601 366979 366433 366299 366189 366502 367893 370396 373279 375707 377336 378348 379160
52270C79160J104J870K846L496L482L130L134L725M322M252L576K957K881L283
$$ 379160 380264 382134 384980 388476 391958 395088 398222 401947 406269 410521 414097 417054 419935 423218
52256D23218L810M092L797K914K077K153L257M457M799M392M108M426N030N420
$$ 423218 427028 431120 434917 437831 439908 442061 445318 449775 454574 458966 463074 467500 472530 477950
52242D77950N426M992L925K250N45m39m72J69J225K598L910M478M025L138K622
$$ 477950 483376 488368 492293 494543 495088 494649 494177 494346 495571 498169 502079 506557 510582 513720 516342
52227E16342K629K793L084L852M994N668N237M105L161K745K537K338K331K678
$$ 516342 518971 521764 524848 528700 533694 539362 544599 548704 551865 554610 557147 559485 561816 564494
52213E64494L318M204N253O008N871M967M267M492N227N552N284N058N300N662
$$ 564494 567812 572016 577269 583277 589148 594115 598382 602874 608101 613653 618937 623995 629295 634957
52199F34957N589M955L969K774J553O96N77J134J928K525K740K573K184J878J823
$$ 634957 640546 645501 649470 652244 653797 654493 655070 656204 658132 660657 663397 665970 668154 670032 671855
52184F71855J826J560J109R58J290J582J090l12j976l114l443l288l308m006n299
$$ 671855 673681 675241 676350 677308 678598 680180 681270 680958 678982 675868 672425 669137 665829 661823 656524
52169F56524o462o762o106n023m050l343k845k515k240j745q21M87J922L164L855
$$ 656524 650062 643300 637194 632171 628121 624778 621933 619418 617178 615433 614612 615099 617021 620185 624040
52154F24040L783L146K436J843J038j91j320j529p63Q6K21j76k47M86J574K092
$$ 624040 627823 630969 633405 635248 636286 636095 634775 633246 632483 632569 632790 632614 632367 632853 634427 636519
52138F36519J517K77o77q54p39j082j814k091j439m15J95L75O56J236J932K870
$$ 636519 638036 638313 637636 636782 636043 634961 633147 631056 629617 629202 629397 629772 630428 631664 633596 636466
52122F36466M505O791Q887J0080J0608J1257J2375J3632J4501J4555J3512J1456
$$ 636466 640971 647762 656649 666729 677337 688594 700969 714601 729102 743657 757169 768625
52110G68625Q943O606M624K840J244r7j498l403n588p072p157o252n326m835m378
$$ 768625 777568 784174 788798 791638 792882 792785 791287 787884 782296 775224 768067 761815 756489 751654 747276
52095G47276l304j489M09J507J689J859K842M128M414L438K346J974J658M44j333
$$ 747276 743972 742483 742892 744399 746088 747947 750789 754917 759331 762769 765115 767089 768747 769191 767858
52080G67858k629l281l925m581m508l518k344j547r00j99K08J29M6L97Q67Q66
$$ 767858 765229 761948 758023 753442 748934 745416 743072 741525 740625 740426 740634 740763 740809 741206 742073 742939
52064G42939L67j41k24J94P68Q57J22q60j181r06j101k304l756m556m807m977
$$ 742939 743306 743165 742941 743135 743903 744760 744882 744022 742841 741935 740834 738530 734774 730218 725411 720434
52048G20434m945m432l829l652l622l165k531k483l045l436l262k953k982l342
$$ 720434 715489 711057 707228 703576 699954 696789 694258 691775 688730 685294 682032 679079 676097 672755
52034F72755l830m145l769k411o49O00J263K063L251M261M781N285O086O697O593
$$ 672755 668925 664780 661011 658600 657951 658551 659814 661877 665128 669389 674170 679455 685541 692238 698831
52019F98831N967N270M587M007L937M396M561L755K447J591J293R87N86M39K29
$$ 698831 704798 710068 714655 718662 722599 726995 731556 735311 737758 739349 740642 741629 742215 742654 742883
52004G42883j024l581o480q764j0499j2056j3212j3629j3751j4345j5364j6113
$$ 742883 741859 738278 731798 723034 712535 700479 687267 673638 659887 645542 630178 614065
51992F14065j6452j7005j7959j8435j7519j5463j3342j1798j0587r172p340n332
$$ 614065 597613 580608 562649 544214 526695 511232 497890 486092 475505 466333 458993 453661
51980D53661l741l152l591m361m756m791m935n337n710n890n941n849n580n356
$$ 453661 449920 446768 443177 438816 434060 429269 424334 418997 413287 407397 401456 395607 390027 384671
51966C84671n292m854l396j275M27J427K628M623O683P844Q204Q410Q531Q273
$$ 384671 379379 374525 371129 369854 370281 371708 374336 378959 385642 393486 401690 410100 418631 426904
51952D26904P831P600P341O413M679K461jk326l552l070j803j270j484q71J403
$$ 426904 434735 442335 449676 456089 460768 463229 463228 460902 457350 454280 452477 451207 449723 448852 450255
51937D50255M200O036O953Q050R815J1743J3193J3875J3634J2407J0433Q100N491
$$ 450255 454455 460491 467444 475494 485309 497052 510245 524120 537754 550161 560594 568694 574185
$$ [...]
##END NTUPLES=NMR SPECTRUM
##END=
