
##TITLE=AC1163_Rove100-17_6524235_JVyTqHjAKj
##JCAMPDX= 6.0         $$ Bruker NMR JCAMP-DX V2.0
##DATA TYPE= NMR SPECTRUM
##DATA CLASS= NTUPLES
##ORIGIN= BRUKER
##OWNER= Administrator
$$ 1.72 TOPSPIN		Version 2.1
$$ 2012-07-14 18:47:52.468 -0500  Administrator@TOPSPIN
$$ Compression mode = diff/dup
##.OBSERVE FREQUENCY= 400.02188249412
##.OBSERVE NUCLEUS= ^1H
##.ACQUISITION MODE= SIMULTANEOUS (DQD)
##.ACQUISITION SCHEME= undefined
##.AVERAGES= 64
##.DIGITISER RES= 22
##SPECTROMETER/DATA SYSTEM= spect
##.PULSE SEQUENCE= noesygpps1d.comp
##.SOLVENT NAME= COFFEE_meoh
##.SHIFT REFERENCE= INTERNAL, COFFEE_meoh, 1, 14.96094
##AUDIT TRAIL= $$ (NUMBER, WHEN, WHO, WHERE, PROCESS, VERSION, WHAT)
$$ ##TITLE= Audit trail, TOPSPIN		Version 2.1
$$ ##JCAMPDX= 5.01
$$ ##ORIGIN= Bruker BioSpin GmbH
$$ ##OWNER= Administrator
$$ $$ C:\Bruker\TOPSPIN/data/COFFEE/nmr/AC1163_Rove100-17_6524235_JVyTqHjAKj/12/pdata/1/auditp.txt
$$ ##AUDIT TRAIL=  $$ (NUMBER, WHEN, WHO, WHERE, PROCESS, VERSION, WHAT)
(   1,<2012-07-14 18:47:47.796 -0500>,<Administrator>,<TOPSPIN>,<go>,<TOPSPIN 2.1>,
      <created by zg
	started at 2012-07-14 18:36:17.250 -0500,
	POWCHK enabled, PULCHK disabled,
       configuration hash MD5:
       6B 1B 68 BB D9 2E 58 E2 7F 35 AD 54 07 DF 0E 41
       data hash MD5: 64K
       42 90 B9 61 02 79 7E 3C 77 88 9B 6D E1 6A A5 87>)
(   2,<2012-07-14 18:47:50.593 -0500>,<Administrator>,<TOPSPIN>,<proc1d>,<TOPSPIN 2.1>,
      <Start of raw data processing
       efp LB = 0.3 FT_mod = 6 PKNL = 1 PHC0 = 0 PHC1 = 0 SI = 128K 
       data hash MD5: 128K
       67 94 C6 75 48 B2 84 1E 11 E2 D8 53 E6 FF 54 53>)
(   3,<2012-07-14 18:47:51.734 -0500>,<Administrator>,<TOPSPIN>,<proc1d>,<TOPSPIN 2.1>,
      <pk PHC0 = -0.2581787 PHC1 = 0 
       data hash MD5: 128K
       A4 F4 81 29 AB D4 1A 6B 20 C3 CA D2 46 5C 80 A2>)
(   4,<2012-07-14 18:47:51.953 -0500>,<Administrator>,<TOPSPIN>,<proc1d>,<TOPSPIN 2.1>,
      <abs ABSG = 1 
       data hash MD5: 128K
       3B 75 46 91 72 EE 53 78 C0 40 9D 43 C0 95 88 C4>)
(   5,<2012-07-14 18:47:52.031 -0500>,<Administrator>,<TOPSPIN>,<proc1d>,<TOPSPIN 2.1>,
      <abs ABSG = 2 
       data hash MD5: 128K
       47 23 42 02 51 5A EF 31 18 11 3F 35 1F DC E5 8F>)
(   6,<2012-07-14 18:47:52.093 -0500>,<Administrator>,<TOPSPIN>,<proc1d>,<TOPSPIN 2.1>,
      <abs ABSG = 3 
       data hash MD5: 128K
       71 B7 55 3E E0 FC 0B FF 1F 66 3F 0D 9A 26 D5 97>)
(   7,<2012-07-14 18:47:52.328 -0500>,<Administrator>,<TOPSPIN>,<proc1d>,<TOPSPIN 2.1>,
      <abs ABSG = 4 
       data hash MD5: 128K
       89 FD 88 A5 9E FE 89 90 5E 03 84 4E 04 46 F6 68>)
(   8,<2012-07-14 18:47:52.375 -0500>,<Administrator>,<TOPSPIN>,<proc1d>,<TOPSPIN 2.1>,
      <abs ABSG = 5 
       data hash MD5: 128K
       50 73 AF 8A EF 08 D9 FC EB 82 B0 FE AC 2A 0D 38>)
$$ ##END=
$$ 
$$ $$ hash MD5
$$ $$ 9A 60 F3 21 AD 95 AD 8A 0C B6 34 C0 20 D9 8D DF
##$RELAX= 
##$RELAX= 
##$RELAX= 
##$RELAX= 
##$RELAX= 
##$RELAX= 
##$RELAX= 
##$RELAX= 
$$ Bruker specific parameters
$$ [...]
##$TP07= 0
##$TPNAME0= <>
##$TPNAME1= <>
##$TPNAME2= <>
##$TPNAME3= <>
##$TPNAME4= <>
##$TPNAME5= <>
##$TPNAME6= <>
##$TPNAME7= <>
##$TPOAL= (0..7)
0.5 0.5 0.5 0.5 0.5 0.5 0.5 0.5
##$TPOFFS= (0..7)
0 0 0 0 0 0 0 0
##$TUNHIN= 0
##$TUNHOUT= 0
##$TUNXOUT= 0
##$USERA1= <user>
##$USERA2= <user>
##$USERA3= <user>
##$USERA4= <user>
##$USERA5= <user>
##$V9= 5
##$VALIST= <valist>
##$VCLIST= <CCCCCCCCCCCCCCC>
##$VD= 0
##$VDLIST= <DDDDDDDDDDDDDDD>
##$VPLIST= <PPPPPPPPPPPPPPP>
##$VTLIST= <TTTTTTTTTTTTTTT>
##$WBST= 2048
##$WBSW= 25
##$XGAIN= (0..3)
0 0 0 0
##$XL= 0
##$YL= 0
##$YMAX_a= 11208153
##$YMIN_a= -8310279
##$ZGOPTNS= <>
##$ZL1= 120
##$ZL2= 120
##$ZL3= 120
##$ZL4= 120
##$ABSF1= 14.96094
##$ABSF2= -5.597241
##$ABSG= 5
##$ABSL= 3
##$ALPHA= 0
##$AQORDER= 0
##$ASSFAC= 0
##$ASSFACI= 0
##$ASSFACX= 0
##$ASSWID= 0
##$AUNMP= <proc_prof1d_extract.lims>
##$AXLEFT= 0
##$AXNAME= <>
##$AXNUC= <1H>
##$AXRIGHT= 0
##$AXTYPE= 0
##$AXUNIT= <>
##$AZFE= 0.1
##$AZFW= 0.1
##$BCFW= 0
##$BC_mod= 0
##$BYTORDP= 0
##$COROFFS= 0
##$CY= 15
##$DATMOD= 1
##$DC= 0
##$DFILT= <>
##$DTYPP= 0
##$F1P= 0
##$F2P= 0
##$FCOR= 0.5
##$FTSIZE= 131072
##$FT_mod= 6
##$GAMMA= 0
##$GB= 0
##$INTBC= 1
##$INTSCL= 1
##$ISEN= 128
##$LB= 0.3
##$LEV0= 0
##$LPBIN= 0
##$MAXI= 10000
##$MC2= 0
##$MEAN= 0
##$ME_mod= 0
##$MI= 0
##$NCOEF= 0
##$NC_proc= -2
##$NLEV= 6
##$NOISF1= 0
##$NOISF2= 0
##$NSP= 0
##$NTH_PI= 0
##$NZP= 0
##$OFFSET= 14.96094
##$PC= 1
##$PHC0= -0.2581787
##$PHC1= 0
##$PH_mod= 1
##$PKNL= yes
##$PPARMOD= 0
##$PPDIAG= 0
##$PPIPTYP= 0
##$PPMPNUM= 2147483647
##$PPRESOL= 1
##$PSCAL= 4
##$PSIGN= 0
##$PYNMP= <proc.py>
##$REVERSE= no
##$SF= 400.020009659282
##$SI= 131072
##$SIGF1= 0
##$SIGF2= 0
##$SINO= 400
##$SIOLD= 131072
##$SPECTYP= <>
##$SREGLST= <1H.CDCl3>
##$SSB= 0
##$STSI= 131072
##$STSR= 0
##$SW_p= 8223.68421052631
##$SYMM= 0
##$S_DEV= 0
##$TDeff= 65536
##$TDoff= 0
##$TI= <>
##$TILT= no
##$TM1= 0
##$TM2= 0
##$TOPLEV= 0
##$USERP1= <user>
##$USERP2= <user>
##$USERP3= <user>
##$USERP4= <user>
##$USERP5= <user>
##$WDW= 1
##$XDIM= 131072
##$YMAX_p= 363642906
##$YMIN_p= -32948
##$CURPLOT= <Network HP LaserJet P1505>
##$CURPRIN= <$Network HP LaserJet P1505>
##$DFORMAT= <normdp>
##$LAYOUT= <+/1D_H.xwp>
##$LFORMAT= <normlp>
##$PFORMAT= <normpl>
##$SURQMSG= 1
$$ End of Bruker specific parameters
$$ ---------------------------------
##NTUPLES= NMR SPECTRUM
##VAR_NAME=  FREQUENCY,     SPECTRUM/REAL,   SPECTRUM/IMAG
##SYMBOL=    X,             R,               I
##VAR_TYPE=  INDEPENDENT,   DEPENDENT,       DEPENDENT
##VAR_FORM=  AFFN,          ASDF,            ASDF
##VAR_DIM=   131072,        131072,          131072
##UNITS=     HZ,            ARBITRARY UNITS, ARBITRARY UNITS
##FACTOR=    0.0627417313425164, 1,          1
##FIRST=     8223.62146879497, 2058,         -55879
##LAST=      0,             3845,            -55979
##MIN=       0,             -32948,          0
##MAX=       8223.62146879497, 363642906,    0
$$ Real data points
##PAGE= N=1
##DATA TABLE= (X++(R..R)), XYDATA
$$ [...]
61594D40988m734l712k850k527k493k368k266k547l116l366k914k073j482j421
61580D03119j592j524j118p30o90q79j040j367k249l351l662k853j969k050k681
61565C75364k783k386k481l180l361k377j033l36k92m51p34j061r21j93K52l49
61549C53678j388j588o93L97Q93P73K58m57r82r28m71j30L2M20J063J448J340
61532C53665J156J267J461J375J085R38J061J300J410J218P78M07K62o6j123k668
61516C63526l721l703l021k287j607j050j180k255l322l041j444qK02l38o61o20
61500C35470o19o72n52m72q13j311j323q41m92n16n12l26l34n44k66P22J468J025
61482C29092j74q95p16k68j30k61l97l34J47R52J360P75k80o32L8Q44R36L42m85
$$ plain form
61594 440988 436254 432542 429692 427165 424672 422304 420038 417491 414375 411009 408095 406022 404540 403119
61580 403119 401527 400003 398885 398155 397465 396586 395546 394179 391930 388579 384917 382064 380095 378045 375364
61565 375364 372581 370195 367714 364534 361173 358796 357763 357427 357135 356684 355950 354889 353968 353775 354027 353678
61549 353678 352290 350702 350009 350406 351299 352072 352330 351873 350891 349963 349492 349362 349394 349814 350877 352325 353665
61532 353665 354821 356088 357549 358924 360009 360947 362008 363308 364718 365936 366714 367121 367383 367317 366194 363526
61516 363526 359805 356102 353081 350794 349187 348137 346957 344702 341380 338339 336895 336887 337089 336751 336090 335470
61500 335470 334851 334179 333627 333155 332342 331031 329708 328867 328375 327859 327347 327021 326687 326143 325877 326599 328067 329092
61482 329092 328918 328023 327307 327039 326909 326648 326251 325917 326064 327016 328376 329151 328871 328239 328277 329121 330057 330399 329914
61463C29914j213j431p29N50J257O51p00j602j501p37N0M49M62M38O68R40Q83
61446C28349P00R93J755K191J867J327J185J185P84J66K4N99J474K185K551K597
61430C49932K521K575K714K612K286K241K626K736J933P54L94J165K140K372J921
61415C80922J522J644K126K565K886L353M054M488M013K623R74m36j615k576l095
61400D03448l242l532m121m339l611k368j508j294j372j589k044k520k473j723
61386C67712p02M3K55N3j40J24Q00J338J426J423J640J649R25j65p33n78k41N3
61368C74882O40J485J792J063j7k99N00J564K062K080K362L260M117L940K621
61353D02052J229Q87J707K968M035M700M956N033N587P207R574J1457J1914J1354
$$ plain form
61463 329914 328701 327270 326541 327091 328348 328999 328299 326697 325196 324459 324509 324958 325420 325858 326526 327466 328349
61446 328349 329049 330042 331797 333988 335855 337182 338367 339552 340336 340502 340526 341125 342599 344784 347335 349932
61430 349932 352453 355028 357742 360354 362640 364881 367507 370243 372176 372930 373324 374489 376629 379001 380922
61415 380922 382444 384088 386214 388779 391665 395018 399072 403560 407573 410196 411170 410734 409119 406543 403448
61400 403448 400206 396674 392553 388214 384603 382235 380727 379433 378061 376472 374428 371908 369435 367712
61386 367712 367010 367053 367308 367361 367221 367345 368145 369483 370909 372332 373972 375621 376546 376381 375648 375070 374829 374882
61368 374882 375522 377007 378799 379862 379845 379546 380046 381610 383672 385752 388114 391374 395491 399431 402052
61353 402052 403281 404168 405875 408843 412878 417578 422534 427567 433154 440361 449935 461392 473306 484660
61339D84660J1136J2069J3375J3347J1163P854N203L907L298K707K258K061J577
61326E74615L44j250k641l965n510o739o807n877n039m879m954m696m111l373
61312E15118k540j918k062k911l382k400j67J972K910K757K452K615L020L175
61298E18639L144L472M356N354O034O534P025P075N964L543L86k787n487p418
61284E55834q390q398p606o312m963l928l122k142r35PL45M22Q17J749L125M786
61268E21289O315P160P341P632Q548R600J0071J0092J0296J0760J0920J0386R309
61255F39719Q133P475P920R416J1159J2569J3910J5438J6413J5858J3859J1297
61243G83166Q533N267J512k173n394q100j0087j1077j1289j1191j0823j0009r096
$$ plain form
61339 484660 495796 507865 521240 534587 545750 553604 558807 562714 566012 568719 570977 573038 574615
61326 574615 574959 573709 571068 567103 561593 554854 548047 542170 537131 532252 527298 522602 518491 515118
61312 515118 512578 510660 508598 505687 502305 499905 499738 501710 504620 507377 509829 512444 515464 518639
61298 518639 521783 525255 529611 534965 540999 547533 554558 561633 567597 571140 571526 568739 563252 555834
61284 555834 547444 539046 531440 525128 520165 516237 513115 510973 510038 510045 510390 510812 511629 513378 516503 521289
61268 521289 527604 534764 542105 549737 558285 567885 577956 588048 598344 609104 620024 630410 639719
61255 639719 647852 655327 663247 672663 683822 696391 710301 725739 742152 758010 771869 783166
61243 783166 791699 796966 798478 796305 790911 782811 772724 761647 750358 739167 728344 718335 709239
61230G09239q642q425p647o130m565l511k951k751k813k698j927p41J89P82J482
61215F58891K191K209J426N76P6m80j384k236k664k833k781k070o47O29R06L46
61199F52155l23q21j357j933k094j338M20K661M609N956P134Q657J0493J2541
61185F96760J5217J8686K1828K3114K2541K1564K0857J9356J6191J2446J0078
61174H98638R616R844R547Q751Q203Q055P492N711L083R03k40j260l149n368o615
61159I53211o888p579r481j1824j3522j4391j4772j4881j4935j5087j4871j3533
61147H01447j1262r263q172p255n660l619j781j47J564L065L745L376K048j75
61133G67911l032n836q028r599j0629j0813r856q047o066m425l248k276r86Q75
$$ plain form
61230 709239 700597 692172 684525 678395 673830 670319 667368 664617 661804 659106 657179 656438 656627 657409 658891
61215 658891 661082 663291 664717 665293 665369 664889 663505 661269 658605 655772 652991 650921 650274 650903 651809 652155
61199 652155 651832 651011 649654 647721 645627 644289 644709 647370 651979 657935 665069 673726 684219 696760
61185 696760 711977 730663 752491 775605 798146 819710 840567 859923 876114 888560 898638
61174 898638 908254 918098 927645 936396 944599 952654 960146 965857 968940 969843 969603 968343 965194 959826 953211
61159 953211 946323 938744 929263 917439 903917 889526 874754 859873 844938 829851 814980 801447
61147 801447 790185 780922 772750 765495 759835 756216 754435 754288 755852 758917 762662 766038 768086 767911
61133 767911 764879 759043 751015 741416 730787 719974 710118 702071 696005 691580 688332 686056 685070 685945
61119F85945K781L977M601N624P597J0085J2516J4829J7064J9072K0930K2894
61107H27915K4578K5030K4103K3046K3190K4516K5994K6747K6478K5258K3512
61096A100367K1806K0282J8591J6479J4032J1166P542L180j415n914j0334j4389
61084A181393j7437j9286k0379k1029k1177k1054k1175k1422k1051j9950j8995
61073I58438j8776j8816j8420j7481j6081j4260j2506j1568j1266j0466q693o823
61061G93282n613m580l026j201K90J516K813M016M835N517O555Q053R764J1270
61047H33491J2092J2203J2438J3622J5337J6548J7311J8577K0330K1458K1723
61036A015130K2317K3972K6098K8196L0616L3341L5515L6879L8198L9762M0965
$$ plain form
61119 685945 688726 692703 697304 702928 710525 720610 733126 747955 765019 784091 805021 827915
61107 827915 852493 877523 901626 924672 947862 972378 998372 1025119 1051597 1076855 1100367
61096 1100367 1122173 1142455 1161046 1177525 1191557 1202723 1210265 1213445 1212030 1206116 1195782 1181393
61084 1181393 1163956 1144670 1124291 1103262 1082085 1061031 1039856 1018434 997383 977433 958438
61073 958438 939662 920846 902426 884945 868864 854604 842098 830530 819264 808798 800105 793282
61061 793282 787669 783089 780063 778862 779152 780668 783481 787497 792332 797849 804404 812457 822221 833491
61047 833491 845583 857786 870224 883846 899183 915731 933042 951619 971949 993407 1015130
61036 1015130 1037447 1061419 1087517 1115713 1146329 1179670 1215185 1252064 1290262 1330024 1370989
61025A370989M1871M3445M5747M7758M9561N2627N7134O1353O4554O8218P3130
61014A976387P7738Q0767Q3108Q5734Q8323R1677R8748J11148J27181J45331J67010
61003C133152J93570K23652K56544K95569L45081M06461M79779N66301O66583
60994F566692P79899R09138J061727J241647J446844J680421J955219K275173
60986A7916760K618611K953900L258086L483476L500270L128115K294034J172844
60978D0326096J28011n26572p14200n61482k33663J42850M16148L67918j68475
60969C9176631j132068k218245l072484l508510l556872l353158l019487k633273
60961A6682534k246709j894381j588062j324700j101853r19464p72254o50859
$$ plain form
61025 1370989 1412860 1456305 1502052 1549810 1599371 1651998 1709132 1770485 1835039 1903257 1976387
61014 1976387 2054125 2134892 2218000 2303734 2392057 2483734 2582482 2693630 2820811 2966142 3133152
61003 3133152 3326722 3550374 3806918 4102487 4447568 4854029 5333808 5900109 6566692
60994 6566692 7346591 8255729 9317456 10559103 12005947 13686368 15641587 17916760
60986 17916760 20535371 23489271 26747357 30230833 33731103 36859218 39153252 40326096
60978 40326096 40454107 39927535 39213335 38651853 38418190 38561040 38977188 39345106 39176631
60969 39176631 38044563 35826318 32753834 29245324 25688452 22335294 19315807 16682534
60961 16682534 14435825 12541444 10953382 9628682 8526829 7607365 6835111 6184252
60953F184252n50031m69215m06134l55639l14267k80924k53575k29440k07884
60944C117143j89364j72247j54295j36441j21377j09167r8002q8619q3816q3492
60934A880323q3998q2910q1060p9339p6801p2917o8797o5015o0599n5196n0158
60923A103533m6415m3121l9413l5805l2999l0717k8557k6696k5102k3236k1081
60912G50391j9331j8148j6799j4915j3000j1421r922q421p217o198m830l111j617
60899F15461n49K64N74kr38j272j065j190j724j885j629j793k501k787k267j852
60883E94845k352l415m315m790m768m296m037m864o527p727p815p495p449p316
60869E17679o565n548n017n153n526n556m897l811l171l446l872l439k509k281
$$ plain form
60953 6184252 5634221 5165006 4758872 4403233 4088966 3808042 3554467 3325027 3117143
60944 3117143 2927779 2755532 2601237 2464796 2343419 2234252 2136250 2047631 1963815 1880323
60934 1880323 1796325 1713415 1632355 1553016 1476215 1403298 1334501 1269486 1208887 1153691 1103533
60923 1103533 1057118 1013997 974584 938779 905780 875063 846506 819810 794708 771472 750391
60912 750391 731060 712912 696113 681198 668198 656777 646855 638434 631217 625019 620189 617078 615461
60899 615461 614912 615176 615750 615748 614810 613538 612473 611283 609559 607674 606045 604252 601751 598964 596697 594845
60883 594845 592493 589078 584763 579973 575205 570909 566872 562008 555481 547754 539939 532444 524995 517679
60869 517679 511114 505566 500549 495396 489870 484314 479417 475606 472435 468989 465117 461678 459169 456888
60855D56888k710k362o17J291K094K163K553L340L790L561K936K306K052K528
60841D79813L528M240M159L726L593L642L205J989L48j131k026k287k289k459
60827D98051k705k531j813j103r27j150j205p01L44J556K327K198J295K28n54
60812D93310j109j774k803m177n521o264o210n783n481n290m990m723m707m686
60798D29792m235l473k850k389j885j642k210l295l753l003j766j174j584k455
60784C94078k929k406j007L62P77K79l16m74l40j41J44L89K30l09n79NJ328K810
60766C91901L963M573M679M570M584M824N185N648O258O840P021O591N742M987
60752D67366M807N164N288M403K823J826K126K982L272K826K178J619J172R79
$$ plain form
60855 456888 454178 451816 451199 452490 454584 456747 459300 462640 466430 469991 472927 475233 477285 479813
60841 479813 483341 487581 491740 495466 499059 502701 505906 507895 508243 507112 505086 502799 500510 498051
60827 498051 495346 492815 491002 489899 488972 487822 486617 485916 486260 487816 490143 492341 493636 493864 493310
60812 493310 492201 490427 487624 483447 477926 471662 465452 459669 454188 448898 443908 439185 434478 429792
60798 429792 425557 422084 419234 416845 414960 413318 411108 407813 404060 401057 399291 398117 396533 394078
60784 394078 391149 388743 387736 388098 388875 389154 388838 388364 388024 387883 388027 388416 388646 388337 387758 387763 389091 391901
60766 391901 395864 400437 405116 409686 414270 419094 424279 429927 436185 443025 450046 456637 462379 467366
60752 467366 472173 477337 482625 487028 489851 491677 493803 496785 500057 502883 505061 506680 507852 508831
60738E08831R11K73j310l133m408n418o737p820p671o604n982o270o600o373o014
60723D35675n906n732n228m635m119l603l313l580l898l327j967r84q53p23Q5
60708C87892J071J602J852K099K040J581J430K060K860L041K847L093L977N061
60694D22506N934O364O205N709N456N517N240M341L516L356L266K320P26m01n00
60679D79555ON60J052J528J941K276K625L042L543M160M815N355N802O356O969
60664E29585P390P701Q392R631J0811J1280J1118J0887J0923J1228J1797J2601
60652F53344J3367J3771J3724J3302J2560J1585J0620R854R155Q143O479M107
60640G80011J357j215l281n015o738q489j0162j1773j3152j3738j3240j2323j1890
$$ plain form
60738 508831 509742 510015 508705 505572 501164 495746 489009 481189 473518 466914 460932 454662 448062 441689 435675
60723 435675 429769 424037 418809 414174 410055 406452 403139 399559 395661 392334 390367 389383 388530 387807 387892
60708 387892 388963 390565 392417 394516 396556 398137 399567 401627 404487 407528 410375 413468 417445 422506
60694 422506 428440 434804 441009 446718 452174 457691 462931 467272 470788 474144 477410 479730 480456 480055 479555
60679 479555 479561 480121 481173 482701 484642 486918 489543 492585 496128 500288 505103 510458 516260 522616 529585
60664 529585 536975 544676 553068 562699 573510 584790 595908 606795 617718 628946 640743 653344
60652 653344 666711 680482 694206 707508 720068 731653 742273 752127 761282 769425 775904 780011
60640 780011 781368 780153 776872 771857 765119 756630 746468 734695 721543 707805 694565 682242 670352
60627F70352j1803j1148r680q204p374o944o397n621m688l676k941k954l605m259
60613E81058m584m729m650m112l451l376l825l953l566l535m285m983m836m266
60599E22907l999l881l436k951l036l623m208m683n116n185m574l691l260l376
60585D67888l536l405k980k333j582r41l82L70J303K028K510L245M321N068N164
60570D76738N297O116P257Q264R664J2079J4854J6803J7919J9238K1195K3290
60558F38714K5149K6669K7046K4928K0091J3965Q042K507l044q316j2470j5114
60546G48167j6340j5985j3632r479m657k02L910Q222J2567J6112J8848K2094K6812
60533G96437L2004L5702L7210L7231L5897L2120K5344J6794Q221K34p372j4281
$$ plain form
60627 670352 658549 647401 637721 629517 622143 615199 608802 603181 598493 594817 591876 588922 585317 581058
60613 581058 576474 571745 567095 562983 559532 556156 552331 548378 544812 541277 536992 532009 527173 522907
60599 522907 518908 515027 511591 508640 505604 501981 497773 493090 487974 482789 478215 474524 471264 467888
60585 467888 464352 460947 457967 455634 454052 453111 452729 453099 454402 456430 458940 462185 466506 471574 476738
60570 476738 482035 488151 495408 503672 513336 525415 540269 557072 574991 594229 615424 638714
60558 638714 663863 690532 717578 742506 762597 776562 784604 787111 784067 775751 763281 748167
60546 748167 731827 715842 702210 692731 688074 687872 691782 700004 712571 728683 747531 769625 796437
60533 796437 828441 864143 901353 938584 974481 1006601 1031945 1048739 1056960 1057194 1049822 1035541
60521A035541j9463k1979k1573j8809j5097j1985j0039q827q065p979q277p872
60509H75576o287m316k620o91J863M187N582P070J0118J4453J8689K2680K7604
60496I73908L3882M0605M7173N4149O2214P1308Q0940R0288R7904J02490J04117
60485A758978J03631J00572R3045Q0163O3548M5650K7379Q103j2539l3716n3953
60474B180861p2083q7670j00690j10790j16903j18028j14357j07296r8420q8833
60464A165791p9371p0656o2777n5482m8825m3220l8778l5087l1698k8342k4747
60453F46808k0876j7378j5173j4310j3791j2707j1095r508q298p445o782o106
60441E03339n388m823m456l893k854j743j108p37o0P03P48Lp35j174k012l583
$$ plain form
60521 1035541 1016078 994099 972526 953717 938620 926635 916596 907769 899704 891725 883448 875576
60509 875576 869289 864973 862353 861662 863525 867712 873294 880364 890482 904935 923624 946304 973908
60496 973908 1007790 1048395 1095568 1149717 1211931 1283239 1364179 1454467 1552371 1654861 1758978
60485 1758978 1862609 1963181 2056226 2136389 2199937 2245587 2272966 2281069 2268530 2234814 2180861
60474 2180861 2108778 2021108 1920418 1809628 1692725 1574697 1460340 1353044 1254624 1165791
60464 1165791 1086420 1015764 952987 897505 848680 805460 766682 731595 699897 671555 646808
60453 646808 625932 608554 593381 579071 565280 552573 541478 531970 523672 516227 509445 503339
60441 503339 497951 493128 488672 484779 481925 480182 479074 478337 478277 478980 479728 479731 478996 477822 475810 472227
60425D72227n006n354m933m664m743m667m276l959m001m230m328m017l067j561
60411D13421j09O13N96M76P30J104J009L39l34m20J7M13M24J68j98o46r35o18
60393D16050K57R64J068J057J464J784J164k17j237j232m62O69J951K873K748
60378D28901J614L60l58o39o73l21L94J026J307J403J335Q12L3j32P54J982K603
60361D40401K500K091J528Q79N56Q65J324J186N03N2K21O02P27O64O91P44N55
60344D56089J15k04j02K84N80O88R27J589K511L265L578L412K843K093J507J207
60328D80382R58O72O94J161J469J012J69j15L41Q71J047J046R77P54P50J582L013
60311D96783M066M568N553P665J0195J2316J4163J5898J6823J6628J6694J8641
$$ plain form
60425 472227 467221 461867 456934 452270 447527 442860 438584 434625 430624 426394 422066 418049 414982 413421
60411 413421 413312 413925 414521 414997 415727 416831 417840 418179 417845 417425 417442 417855 418279 418447 418249 417603 416668 416050
60393 416050 416307 417271 418339 419396 420860 422644 423808 423591 422354 421122 420660 421329 423280 426153 428901
60378 428901 430515 430875 430517 429878 429205 428884 429278 430304 431611 433014 434349 435161 435194 435062 435816 437798 440401
60361 440401 442901 444992 446520 447399 447955 448820 450144 451330 451833 451885 452106 452708 453435 454099 454790 455534 456089
60344 456089 456204 456000 455898 456182 456762 457450 458377 459966 462477 465742 469320 472732 475575 477668 479175 480382
60328 480382 481340 482012 482706 483867 485336 486348 486517 486402 486743 487614 488661 489707 490684 491438 492188 493770 496783
60311 496783 500849 505417 510970 518635 528830 541146 555309 571207 588030 604658 621352 639993
60299F39993K2103K5455K8325L1566L4545L4401K9085J9967J0213J357p435j7020
60287H52555k6445l3575l6845l6193l2903k8778k5077k1859j8474j4651j0954
60276E66801q164o553n890n759n713n318m490l679l478m016m828n243m785l506
60262D95379k168j775k501l244k754j168J26K06n10j128j329j228q70m39n09j415
60246D74673k702l611l862l526k559j093J80N82K99P0J68K75K15K13M64R00J392
60229D62078J800J959K050K596L625M237L744K846K705L197L192K482K177K906
60215E01594L781L708K793J857J336J197J348J554J421R51P36J187J991K646K982
60200E31082K949K471J898J897K432K522J645O77P28J572K120K026J846J789J371
$$ plain form
60299 639993 662096 687551 715876 747442 781987 816388 845473 865440 875653 877010 869575 852555
60287 852555 826110 792535 755690 719497 686594 657816 632739 610880 592406 577755 566801
60276 566801 558637 552084 546194 540435 534722 529404 524914 521235 517757 513741 508913 503670 498885 495379
60262 495379 493211 491436 488935 485691 482937 481769 481895 482101 481591 480463 479134 477906 477036 476597 476088 474673
60246 474673 471971 468360 464498 460972 458413 457320 457500 458082 458381 458451 458619 458894 459109 459322 459786 460686 462078
60229 462078 463878 465837 467887 470483 474108 478345 482089 484935 487640 490837 494029 496511 498688 501594
60215 501594 505375 509083 511876 513733 515069 516266 517614 519168 520589 521540 522276 523463 525454 528100 531082
60200 531082 534031 536502 538400 540297 542729 545251 546896 547573 548301 549873 551993 554019 555865 557654 559025
60185E59025N11L0N54J453J483L34r94j434j123j128k017l197l802l767l534l053
60169E39341j875k01R89J194J098J545K328K548J935J210J203J991K966L578L798
60154E63648L866L682K775J117m60j139j152j291j626j526q93l78k19J31Q22J128
60138E68485P81Q34K309M638O472P481Q338R174R222Q120O566N321M235K694N45
60123F45215j820l995n801o997p153n994l917j937r09p39n59K52J496K581L219
60108F12942L537L779M080M430M710M851M973N247N644N978O077N703M541K687
60094F79179Q78k62j015k019l101l512l237l083l348l309k438j224l43K16O92
60079F54074R64R50R56J103R99M72p3n33j516l282m976n733n814n894n893n504
$$ plain form
60185 559025 559536 559566 560120 561573 563056 563390 562396 560962 559839 558711 556694 553497 549695 545928 542394 539341
60169 539341 537466 537265 538254 539448 540546 542091 544419 546967 548902 550112 551315 553306 556272 559850 563648
60154 563648 567514 571196 573971 575088 574628 573489 572337 571046 569420 567894 567001 566623 566404 566535 567357 568485
60138 568485 569266 570100 572409 577047 583519 591000 599338 608512 617734 625854 632420 637741 641976 644670 645215
60123 645215 643395 639400 633599 626602 619449 613455 609538 607601 606692 605953 605394 605646 607142 609723 612942
60108 612942 616479 620258 624338 628768 633478 638329 643302 648549 654193 660171 666248 671951 676492 679179
60094 679179 680057 679795 678780 676761 673660 670148 666911 663828 660480 657171 654733 653509 653166 653382 654074
60079 654074 655038 655988 656944 658047 659046 659518 659445 658912 657396 654114 649138 643405 637591 631697 625804 620300
60063F20300n260n850o767o778n697m616m387m704m870m619m132l739l736m014
60049E51131m007l472l012l207l552l159k217j748j900j617k84J237J802J480
60035E27475J304J845K666L022K757K399K551L162L552L193K283J389P89L97K6
60020E58810o00j768l270m334m523m391m659n124n063m490m113m156m065l505
60006E04749k859k524k368k138j861j630j443j380j527j642j425j088j090j231
59992D80543p74L47J169J012M20L40Q45J304J440J535J837K338L099M211N357
59977E05023N878N482M565L680K958K195J308M72j30m00k36L49R42Q76o9j288
59961E31605j973j960j685j376p85K45J385K122K195J589M68p53j602j975k150
$$ plain form
60063 620300 615040 609190 602423 595645 589948 585332 580945 576241 571371 566752 562620 558881 555145 551131
60049 551131 547124 543652 540640 537433 533881 530722 528505 526757 524857 523240 522956 524193 525995 527475
60035 527475 528779 530624 533290 536312 539069 541468 544019 547181 550733 553926 556209 557598 558387 558784 558810
60020 558810 558210 556442 553172 548838 544315 539924 535265 530141 525078 520588 516475 512319 508254 504749
60006 504749 501890 499366 496998 494860 492999 491369 489926 488546 487019 485377 483952 482864 481774 480543
59992 480543 479769 480116 481285 482297 482717 483057 483902 485206 486646 488181 490018 492356 495455 499666 505023
59977 505023 510901 516383 520948 524628 527586 529781 531089 531561 531431 531031 530795 531144 532086 532962 532893 531605
59961 531605 529632 527672 525987 524611 523826 524071 525456 527578 529773 531362 531830 531077 529475 527500 525350
59946E25350k252k098j657j244j107j145j269j556j875j822j318q17o63o44m85
59931E05398k90k18j71j77m68q25m58Q50K060K039J019K36M19J277K224K878L026
59914E18819K743K423K308K116J586J041Q96J005J022J064J370J650J468J003
59900E40514P09M96j11j044j692j714j288o68j9M45O64R82J656K414K912L358
59884E47614M101M945N499N817O118O203N886N579N749O096O072N776N606N397
59870F26458M803M061L432K386L91j871l317m122n202o379o559n699m995m972
59856E98415m873m297l939m168m254l670l018k863k773k180j347o75J25J490L249
59841E65222M998O618Q008Q938R646J0904J3030J5362J6895J6824J4457R768M304
$$ plain form
59946 525350 523098 521000 519343 518099 516992 515847 514578 513022 511147 509325 508007 507190 506527 505883 505398
59931 505398 505108 504890 504719 504542 504074 503249 502791 503641 505701 507740 508759 508995 509414 510691 512915 515793 518819
59914 518819 521562 523985 526293 528409 529995 531036 531932 532937 533959 535023 536393 538043 539511 540514
59900 540514 541223 541719 541608 540564 538872 537158 535870 535202 535183 535628 536292 537274 538930 541344 544256 547614
59884 547614 551715 556660 562159 567976 574094 580297 586183 591762 597511 603607 609679 615455 621061 626458
59870 626458 631261 635322 638754 641140 641531 639660 636343 632221 627019 620640 614081 608382 603387 598415
59856 598415 593542 589245 585306 581138 576884 573214 570196 567333 564560 562380 561033 560358 560483 561973 565222
59841 565222 570220 576838 584846 593784 603430 614334 627364 642726 659621 676445 690902 700670 704974
59828G04974M28r77j018o90M30K566M123L013j081o776j2585j7351j9970k0088
59814F34998j8820j7656j6732j5152j2743j0429q908p928p056o259n542m652l539
59801D99582k666k577l273m131m370l711k668k007j870j758j412j226j509j879
59787D64525j817j404j082j025j156j416j665j560j013m83m39p28p97m25J34M44
59771D50093K03n52j415j987k290k513k456j822r81o45p42n06J13K29l36l85R17
59754D34925K575L083K463J898J880J872J561J323J499K016K713L387L623L244
59740D68062K752K661K648K106J271R09J022Q02j7o86n91j16K2l26q69j405j798
59723D76447j793j285o46m30p86j356j666j513r83k63M40Q50P54K60j38o0L10
$$ plain form
59828 704974 705402 704425 703407 702717 703147 705713 709836 712849 711768 704992 692407 675056 655086 634998
59814 634998 616178 598522 581790 566638 553895 543466 534558 526630 519574 513315 507773 503121 499582
59801 499582 496916 494339 491066 486935 482565 478854 476186 474179 472309 470551 469139 467913 466404 464525
59787 464525 462708 461304 460222 459197 458041 456625 454960 453400 452387 451904 451465 450737 449940 449515 449649 450093
59771 450093 450296 449744 448329 446342 444052 441539 439083 437261 436280 435635 434893 434387 434500 434729 434393 434008 434925
59754 434925 437500 440583 443046 444944 446824 448696 450257 451580 453079 455095 457808 461195 464818 468062
59740 468062 470814 473475 476123 478229 479500 480409 481431 482233 482216 481530 480939 480823 480845 480519 479650 478245 476447
59723 476447 474654 473369 472723 472293 471507 470151 468485 466972 465989 465726 466166 467016 467770 468030 467892 467832 468142
59706D68142N39N99Q57J463K212K977L787M386M287L412K336J709J845K782M148
59691E05481N016M704L857L800M592M718L198R90l83p01o86o62n86q00j580k286
59675E28672k022r41n2J26j32n52j091j476j377j042j073j563k005k041j730j211
59659E10490p03o00r78j229q90m86p58j299r42N31K052K742K831K851K834K652
59643E19098K494K491K322J535N2j728l128l517k937k359k738l809m337l614k161
59628D97664r15l02k30l84l41P7M04K5p74r22n7Q46P62J9l28j22k91j428k856
59609D90847l458l007k272j922j815j471r02m99k98J19Q09J128N64m44j021r35
59593D75423p07p37q88q71o48l33n1J7k47o61q12m88J25O20O18q2j380k838l878
$$ plain form
59706 468142 468681 469280 470137 471600 473812 476789 480576 484962 489249 492661 494997 496706 498551 501333 505481
59691 505481 510497 515201 519058 522858 527450 532168 535366 536356 535973 535272 534586 533924 533338 532538 530958 528672
59675 528672 526650 525709 525657 525783 525651 525099 524008 522532 521155 520113 519040 517477 515472 513431 511701 510490
59659 510490 509787 509187 508209 506980 506090 505604 504846 503547 502605 503136 505188 507930 510761 513612 516446 519098
59643 519098 521592 524083 526405 527940 527992 526264 523136 519619 516682 514323 511585 507776 503439 499825 497664
59628 497664 496749 496447 496217 495833 495492 495569 495973 495998 495224 494302 494245 495091 495853 495872 495544 495422 495131 493703 490847
59609 490847 487389 484382 482110 480188 478373 476902 476000 475501 475203 475322 476131 477259 477823 477379 476358 475423
59593 475423 474716 473979 473091 472220 471572 471239 471188 471205 470958 470297 469485 468997 469122 469742 470360 470278 468898 466060 462182
59574D62182m129l658k962k605k624k430j671r88j334k527l243k725j637r25n42
59559D28182k1M70M63J10n1P0K77P05J500K138K011J461J328J669J873J970K679
59542D46834M006M906M796M423M699N485O221P114Q787J1096J3197J4758J6290
59529E52612J7822J7846J4374P298p36o316q069p185n433l415r85J581L662N142
59515E88198O368P330P607P034N914M572L184J955R50k42k046m159n839o931p998
59500F05897r312j0319j0426r803r064q471p840p053o342o010o009n868n141l889
59486E00350k637j795j376j278j425j486r73O5Q82J051J163J937K998L320K709
59471E03505K084K239L014L797M256M290L780K738J541O91L57J95k62r45j058
$$ plain form
59574 462182 458053 454395 451433 448828 446204 443774 442103 441115 439781 437254 434011 431286 429649 428724 428182
59559 428182 428161 428631 429094 429204 429153 429223 429500 430205 431705 433843 435854 437315 438643 440312 442185 444155 446834
59542 446834 450840 455746 460542 464965 469664 475149 481370 488484 497271 508367 521564 536322 552612
59529 552612 570434 588280 602654 609952 609216 602900 594831 587646 582213 578798 577813 579394 583056 588198
59515 588198 594566 601896 609503 616537 622451 627023 630207 632162 633112 632870 630824 626665 620826 613895 605897
59500 605897 596585 586266 575840 566037 556973 548502 540662 533609 527267 521257 515248 509380 504239 500350
59486 500350 497713 495918 494542 493264 491839 490353 489380 489445 490327 491378 492541 494478 497476 500796 503505
59471 503505 505589 507828 510842 514639 518895 523185 526965 529703 531244 531935 532292 532487 532225 531280 530222
59456E30222J23K237M176N455O676Q336R893J0616J0759J1183J2213J3549J4911
59443F40349J6054J6415J5499J3489J0837P500L252j473n762r124j1607j3201
59431F82228j3847j3850j3569j2849j1464r918r037q742q112o683m910l229j359
59418E64659J126M044O802R026J0861J2789J5133J7628J9648K0951K1938K3074
59406G27679K4418K5629K5590K2145J3669J752q955j4767j6059j5450j4202j1875
59394G59574q386m440n94K063R04o082j6819k5996l0024k9619k7304k4388k1127
59381E67762j7876j4769j1497q351o424n947n598m331k827k185k178j851j048
59368D82880l47o0p3j73J9Q01J681J703Q84M12Q98J517J538J565K305L180L372
$$ plain form
59456 530222 530345 532582 536758 542213 548889 557225 567118 577734 588493 599676 611889 625438 640349
59443 640349 656403 672818 688317 701806 712643 720143 723395 721922 716160 707036 695429 682228
59431 682228 668381 654531 640962 628113 616649 606731 597694 588952 580840 574157 569247 566018 564659
59418 564659 565785 569829 576631 585657 596518 609307 624440 642068 661716 682667 704605 727679
59406 727679 752097 777726 803316 825461 839130 840882 831927 817160 801101 785651 771449 759574
59394 759574 751188 746748 746154 748217 749121 743039 726220 700224 670200 640581 613277 588889 567762
59381 567762 549886 535117 523620 515269 508845 502898 497300 492969 490142 487957 485779 483928 482880
59368 482880 482533 482473 482400 482227 482246 483047 484728 486431 487315 487727 488625 490142 491680 493245 495550 498730 502102
59351E02102L404M322N893O974P320P793Q909J0309J1777J3685J6094J8221J9226
59338F36029J9138J8721J8638J8950J9232J9055J8255J6818J4693J1988R109O378
59326H27004L676Q32j858m100o273q845j1368j2953j3617j4099j4350j3510j1585
59313G18954r876r274r197q820q193p528o442m752l150k274j839j384j131j295
59299F43799j354q24j41R3J76P89J969L368N022P035Q979J0370J1450J2889J5004
59284G18624J7736K0909K4085K6465K7261K5566J9980R756l046j3943j9680k0789
59272H32924j9633j7208j3230q269l780k18L140O479Q958J0145J0650J0981J0855
59259H31794J0002Q712P173N025K035j372m603p459r873j1533j2243j2455j2948
$$ plain form
59351 502102 505506 509828 515721 522695 530015 537808 546717 557026 568803 582488 598582 616803 636029
59338 636029 655167 673888 692526 711476 730708 749763 768018 784836 799529 811517 820626 827004
59326 827004 830680 831512 829654 825554 819281 810436 799068 786115 772498 758399 744049 730539 718954
59313 718954 709078 699804 690607 681787 673594 666066 659624 654872 651722 649448 647609 646225 645094 643799
59299 643799 642445 641621 641480 641573 641749 642538 644507 647875 652897 659932 668911 679281 690731 703620 718624
59284 718624 736360 757269 781354 807819 835080 860646 880626 890382 887336 873393 853713 832924
59272 832924 813291 796083 782853 774584 770804 770586 773726 780205 789163 799308 809958 820939 831794
59259 831794 841796 850508 857681 862706 864741 863369 858766 851307 841434 829901 817658 805203 792255
59246G92255j3908j4546j3989j2482j1290j1120j1063r792p445n452m632m389
59234F72147l969l339k539j265L29J383J574J709K393L019K868K359K225K090
59220F80984R72j216l601n493o815p724q458r232r810r666q960q629q927q800
59206E84625p525o009n479n665n521m970m621m335l412k027j132j031j145j096
59192E30657r73o47J24R61J185Q70P94J368K355L434M340M713M606M779N655O437
59176E70658O231N555N550O024N802M854M591N775P456Q410Q501Q178P636P089
59162F62310P058P787Q836R681J0314J0889J1278J1280J0916J0240R109P358N125
59149G82181K888J162J0j179l054n347p053p747q065q519q709q259p735p751p874
$$ plain form
59246 792255 778347 763801 749812 737330 726040 714920 703857 694065 686620 681168 676536 672147
59234 672147 668178 664839 662300 661035 661364 662747 664321 666030 668423 671442 674310 676669 678894 680984
59220 680984 681956 680740 677139 671646 664831 657107 648649 639417 629607 619941 610981 602352 593425 584625
59206 584625 577100 571091 565612 559947 554426 549456 544835 540500 537088 535061 533929 532898 531753 530657
59192 530657 529684 529037 529161 530122 531307 532177 532971 534339 536694 540128 544468 549181 553787 558566 564221 570658
59176 570658 576889 582444 587994 594018 599820 604674 609265 615040 622496 630906 639407 647585 655221 662310
59162 662310 669368 677155 685991 695672 705986 716875 728153 739433 750349 760589 769698 777056 782181
59149 782181 785069 786231 786241 785062 782008 776661 769608 761861 753796 745277 736568 728309 720574 712823 704949
59134G04949p395o618o273o138n351l829k264r26M26J618K186K402L157M698O367
59119F87009P693Q898J0279J1825J3480J5101J6162J6163J5276J4109J3085J2520
59107H41600J2783J3593J3722J2348J0278Q834Q040P030N779N060M916M576L784
59094I52343K928J847j26k756m854n872o413o897o901o210n457n304n785o749
59080H93794q215r963j1523j2743j3761j4475j4790j5205j6229j7323j7385j6297
59068G25885j4901j3564j1892r918q281p122n944m823m539n208n869n815n294
59055F22715m556l366j858q64p89j096j301j700k590l566m065l970l403k467j464
59040E85660p09q4O21J037P32L10Q29K154L060L092L118L742M435M680M837N319
$$ plain form
59134 704949 697554 690936 684663 678525 673174 669345 667081 666155 666581 668199 670385 672787 675944 680642 687009
59119 687009 694702 703600 713879 725704 739184 754285 770447 786610 801886 815995 829080 841600
59107 841600 854383 867976 881698 894046 904324 913158 921198 928228 934007 939067 943983 948559 952343
59094 952343 955271 957118 956992 954236 949382 943510 937097 930200 923299 917089 911632 906328 900543 893794
59080 893794 885579 875616 864093 851350 837589 823114 808324 793119 776890 759567 742182 725885
59068 725885 710984 697420 685528 675610 667329 660207 654263 649440 644901 639693 633824 628009 622715
59055 622715 618159 614793 612935 612071 611282 610186 608885 607185 604595 601029 596964 592994 589591 587124 585660
59040 585660 584951 584867 585488 586525 587257 587567 588396 590550 593610 596702 599820 603562 607997 612677 617514 622833
59024F22833N917O431P130Q077Q853R388J0166J1353J2508J3470J4554J5577J5676
59011G61933J4482J2481R993O851L400O92q70j964k993l403k860j973j231k91
58997G94247J049K178K806L668N306O902P142N677L192O42j115j833k407m016
58983H23438o340p710p503p176q152r820j0670j0387r762r246q629p714o418m641
58969G09270k631j030JJ089K612M117N239O338P593Q416Q500Q586R249R702Q774
58954G85825O552M076J947L2j864l886o237q751j0708j1670j2104j2616j2982
58941G17614j2594j1384r740p940o182m767l819l131k603k376k341k220k262l058
58927F43197m294m771m118l515m038n154n602n004l925l014k766l410m390m610
$$ plain form
59024 622833 628750 635181 642311 650388 659241 668629 678795 690148 702656 716126 730680 746257 761933
59011 761933 776415 788896 798889 805740 809140 809832 808962 806998 804005 800602 797742 795769 794538 794247
58997 794247 795296 797474 800280 803948 809254 816156 823298 828975 832167 832809 831694 829861 827454 823438
58983 823438 817098 809388 801885 794709 786557 776737 766067 755680 745918 736672 728043 720329 713911 709270
58969 709270 706639 705609 705610 706699 709311 713428 718667 725005 732598 741014 749514 758100 767349 777051 785825
58954 785825 792377 796453 798400 798432 796568 792682 786445 777694 766986 755316 743212 730596 717614
58941 717614 705020 693636 683896 675956 669774 665007 661188 658057 655454 653078 650737 648517 646255 643197
58927 643197 638903 634132 630014 626499 622461 617307 611705 606701 602776 599762 596996 593586 589196 584586
58913E84586l692k308r33P01K452L353L114K915L678M718N113N393O540Q204R375
58898F33209J0102J1211J2717J3872J4513J5100J5571J5279J4089J2618J1468
58887G79749J0931J1310J2716J4701J6589J8152J9506K0675K1606K2176K1815
58876I69926J9742J5959J1492P192L141n60l392n472p824j0767j3183j4376j5416
58863I56462j7303j8821j8005j5150j2685j2193j3036j3911j4446j4979j5774
58852G90159j6722j7281j6798j5386j4167j3977j4271j3963j2869j1540j0188
58841F32997q733p471o754o298n709n274n345n424m844l978l631l604l044k017
58827E60871j469j616j607j027o56j269k436l029k500j317l59r1k76m69n87p09
$$ plain form
58913 584586 580894 578586 577653 578354 580806 584159 587273 590188 593866 598584 603697 609090 615630 623834 633209
58898 633209 643311 654522 667239 681111 695624 710724 726295 741574 755663 768281 779749
58887 779749 790680 801990 814706 829407 845996 864148 883654 904329 925935 948111 969926
58876 969926 989668 1005627 1017119 1024311 1027452 1026892 1023500 1018028 1010204 999437 986254 971878 956462
58863 956462 939159 920338 902333 887183 874498 862305 849269 835358 820912 805933 790159
58852 790159 773437 756156 739358 723972 709805 695828 681557 667594 654725 643185 632997
58841 632997 624264 616793 610039 603741 598032 592758 587413 581989 577145 573167 569536 565932 562888 560871
58827 560871 559402 557786 556179 555152 554496 553227 550791 547762 545262 543945 543586 543495 543219 542750 542163 541454
58811E41454n61J88J110J371J073J204K002K475K101J758K137K441J717M97j56
58796E60811l28p25j131q12L7N57N98O55P68O51O39J329K477L287L651M117M798
58779E81379N275N456N652N936O207O612P205P421O670N101L142P76j954m233
58765F40645n292n489n673n876n598m928m351l813k924j888j251r95p02l45j23
58750E91397J88R08J916L032M506O342P852Q526Q748Q819Q265P088O690Q176J0481
58735F82934J1706J1659J1575J1876J1851J1306J0977J1258J1805J2359J2829
58724H12135J2714J1553R935Q929Q701Q542Q044P303O336N293M836N319O040O226
58710I21906O192O493O720O260N538N075M099J657j543m099o215r202j3052j6318
$$ plain form
58811 541454 540893 541081 542191 543562 544635 545839 547841 550316 552417 554175 556312 558753 560470 560967 560811
58796 560811 560483 559758 558627 557815 557852 558409 559007 559662 560430 561081 561720 563049 565526 568813 572464 576581 581379
58779 581379 586654 592110 597762 603698 609905 616517 623722 631143 637813 642914 646056 646832 644878 640645
58765 640645 635353 629864 624191 618315 612717 607789 603438 599625 596701 594813 593562 592567 591865 591520 591397
58750 591397 591585 592493 594409 597441 601947 608289 616141 624667 633415 642234 650499 657587 664277 672453 682934
58735 682934 694640 706299 717874 729750 741601 752907 763884 775142 786947 799306 812135
58724 812135 824849 836402 846337 855266 863967 872509 880553 887856 894192 899485 904321 909640 915680 921906
58710 921906 928098 934591 941311 947571 953109 958184 962283 963940 962397 958298 952083 942881 929829 913511
58696I13511j8323j9764k1148k2240k3062k3897k4260k3268k1107j8828j6864
58685F80750j5033j3631j2971j2159j0111p604o469o793o830n814m922n017n240
58672E68156m498k923j188L64J390J541J204J333K249L518M981O822Q637R635
58658F01221R728R368Q491O796M817L269J713o15k953l739l046k412k352j980
58644F28306j245j428k898m263m432l898l413k984k777l346m298m206k607p84
58630E85727R8L38N84P17O29Q91J815K745K969K617K182J949K153K882L608L637
58614F15541L116K761K723K708K998M121N606O330O058N418M564L254K030J648
58600F68876J496K79j727k886k719k397k508k296j459q93r64p54K95J493K208
$$ plain form
58696 913511 895188 875424 854276 832036 808974 785077 760817 737549 716442 697614 680750
58685 680750 665717 652086 639115 626956 616845 609241 602772 595979 589149 583335 578413 573396 568156
58672 568156 563658 560735 559547 559911 561301 562842 564046 565379 567628 571146 576127 582949 591586 601221
58658 601221 610949 620317 628808 635604 640421 643690 645403 644788 641835 638096 635050 632638 630286 628306
58644 628306 627061 625633 622735 618472 614040 610142 606729 603745 600968 597622 593324 589118 586511 585727
58630 585727 585825 586163 586747 587464 588093 588984 590799 593544 596513 599130 601312 603261 605414 608296 611904 615541
58614 615541 618657 621418 624141 626849 629847 633968 639574 645904 651962 657380 661944 665198 667228 668876
58600 668876 670372 670651 668924 666038 663319 660922 658414 656118 654659 653766 652802 652048 652343 653836 656044
58585F56044K811L680M544N245O022O798P280P888R224J0718J1118J0359R483
58572G51214Q857Q066P389P524P974P640P007P675R733J1729J3382J5904J9320
58559H83414K1897K2839K3288K3959K3959K2809K1405K0117J7926J4368J0475
58548A106456O912L092j079m506o824r144j2059j4692j6478j8016j9396j9622
58536I94644j8522j7437j7271j7565j8069j9079j9760j8447j5459j3254j2884
58525H06897j2638j1152r396q394p405n792m403l601k159L52K215K170J387J247
58511G49328J189L97l28j01M47O63J246K544L245K449J376J347J699J326O82O13
58495G68122P01L57J77O41R06K66n30o64n39n05O2J262J990J923K414M092N557
$$ plain form
58585 656044 658855 662535 667079 672324 678346 685144 692424 700312 709536 720254 731372 741731 751214
58572 751214 760071 768137 775526 783050 791024 798664 805671 813346 823079 834808 848190 864094 883414
58559 883414 905311 928150 951438 975397 999356 1022165 1043570 1063687 1081613 1095981 1106456
58548 1106456 1113368 1116460 1115381 1110875 1104051 1094907 1082848 1068156 1051678 1033662 1014266 994644
58536 994644 976122 958685 941414 923849 905780 886701 866941 848494 833035 819781 806897
58525 806897 794259 783107 773711 765317 757912 752120 747717 744116 741957 742309 744524 746694 748081 749328
58511 749328 750517 750914 750586 750485 750932 751595 752841 755385 758630 761079 762455 763802 765501 766827 767509 768122
58495 768122 768823 769180 769357 769998 770904 771170 770640 769976 769437 768932 768994 770256 772246 774169 776583 780675 786232
58478G86232N795N904O954Q078Q366Q726J0133J1666J2058J1517J0524Q483N194
58465H99630J965k20k069m171n650o061o622q046r005q320o777n296l361q04R93
58450H36186J370J770L212M523M752M915N588N182K736M6j166j836l221m357m162
58435H55538l720m025l746j724N35J472K246M218N973N765M821N196O314O596
58421H85459O625P626Q606Q217P806R299J1508J1692R647P264N290L449K517L257
58407I88262M242L482J305p14k454m508o181o650o736p165o727m571k423j945
58393I47217j859m05J380J829J966L392M852M335K847K553K764J490n08q57L19
58378I71315R95R06J289J988J990J849K562L250K852K794M795P556Q738Q785R498
$$ plain form
58478 786232 792027 797931 804885 812963 821329 830055 840188 851854 863912 875429 885953 894436 899630
58465 899630 901595 901375 899306 895135 889485 883424 876802 868756 859751 851431 844654 839358 835997 835193 836186
58450 836186 837556 839326 842538 847061 851813 856728 862316 867498 870234 870280 869114 867278 864057 859700 855538
58435 855538 851818 847793 844047 842323 842858 844330 846576 850794 856767 862532 867353 872549 878863 885459
58421 885459 892084 899710 908316 916533 924339 933638 945146 956838 966485 973749 979039 982488 985005 988262
58407 988262 992504 995986 997291 996577 994123 989615 983434 976784 970048 962883 956156 951585 949162 947217
58393 947217 945358 944953 946333 948162 950128 953520 958372 962707 965554 968107 970871 972361 971853 970996 971315
58378 971315 972310 973216 974505 976493 978483 980332 982894 986144 988996 991790 996585 1004141 1012879 1021664 1031162
58363A031162J0377R853Q735Q986J0280J1034J1480J2581J3486J3197J2981J3879
58351A168031J3955J1575R072R212J0301R144O659N878O315N403L964N006Q119
58338A272634J0009J0026J0379J1571J2159J2438J3930J5787J5884J4793J4689
58327A414299J5259J4745J3890J4620J6130J6466J6515J7973J8986J6767J2960
58316A588610J1412J1951J1548J0231J0465J1860J1953J1248J2089J3622J3296
58305A718285J2266J3674J6682J7904J7642J8819K0838K0775J9632K0987K4070
58294A921574K4679K2645K1912K3447K4436K4384K5623K7787K8026K6746K7146
58283B198405K9237L0290L0691L3139L6687L8051L8063M0154M3303M3666M2340
$$ plain form
58363 1031162 1041539 1051392 1060127 1069113 1079393 1090427 1101907 1114488 1127974 1141171 1154152 1168031
58351 1168031 1181986 1193561 1202633 1211845 1222146 1231290 1237949 1243827 1250142 1255545 1259509 1264515 1272634
58338 1272634 1282643 1292669 1303048 1314619 1326778 1339216 1353146 1368933 1384817 1399610 1414299
58327 1414299 1429558 1444303 1458193 1472813 1488943 1505409 1521924 1539897 1558883 1575650 1588610
58316 1588610 1600022 1611973 1623521 1633752 1644217 1656077 1668030 1679278 1691367 1704989 1718285
58305 1718285 1730551 1744225 1760907 1778811 1796453 1815272 1836110 1856885 1876517 1897504 1921574
58294 1921574 1946253 1968898 1990810 2014257 2038693 2063077 2088700 2116487 2144513 2171259 2198405
58283 2198405 2227642 2257932 2288623 2321762 2358449 2396500 2434563 2474717 2518020 2561686 2604026
58272B604026M3953M8083M9936M9214N0337N3877N5911N6113N8420O3174O6565
58261C199609O8248P1645P6474P9076Q0149Q3874Q9338R1573R1002R2780R6660
58250D120428R7143R4039R3056R5257R6037R5417R8990J07331J14723J19849J27454
58239E259724J38137J46976J53707J63559J76626J87365J95902K08509K25554
58230F856059K40783K53811K70965K92410L11413L27933L49578L77301M04115
58221I684368M29805M62337N02676N43557N85523O38031P02106P68858Q38152
58212A5155413R21138J021220J131363J253830J402885J584143J792481K034941
58204B6297414K333652K701542L139346L661488M296799N054443N915905O870343
$$ plain form
58272 2604026 2647979 2696062 2745998 2795212 2845549 2899426 2955337 3011450 3069870 3133044 3199609
58261 3199609 3267857 3339502 3415976 3495052 3575201 3659075 3748413 3839986 3930988 4023768 4120428
58250 4120428 4217571 4311610 4404666 4499923 4595960 4691377 4790367 4897698 5012421 5132270 5259724
58239 5259724 5397861 5544837 5698544 5862103 6038729 6226094 6421996 6630505 6856059
58230 6856059 7096842 7350653 7621618 7914028 8225441 8553374 8902952 9280253 9684368
58221 9684368 10114173 10576510 11079186 11622743 12208266 12846297 13548403 14317261 15155413
58212 15155413 16076551 17097771 18229134 19482964 20885849 22469992 24262473 26297414
58204 26297414 28631066 31332608 34471954 38133442 42430241 47484684 53400589 60270932
58196F0270932P932562R121595J0454759J1969953J3715554J5705686J7917528
58189A47088569K0324442K2862223K5340687K7442878K8792492K8873637K6837753
58182C27562681K1661076J2906536J512613j0303432k0138888k6577927k9526095
58175B77096564k9714501k8048899k5287303k2005076j8615318j5362694j2347617
58168A25715156r606520p178434n088613l310848j850606r20414r28757k117857
58160I4713107m165501o256776p638265q084114p834560p217359o429287n583723
58152D1503522m780614m075829l463615k931738k492594k146564j863043j618183
58144A8131342j415448j254675j115358r85606q77270p97675p32478o69506o15469
$$ plain form
58196 60270932 68203494 77325089 87779848 99749801 113465355 129171041 147088569
58189 147088569 167413011 190275234 215615921 243058799 271851291 300724928 327562681
58182 327562681 349223757 362130293 363642906 353339474 333200586 306622659 277096564
58175 277096564 247382063 219333164 194045861 172040785 153425467 138062773 125715156
58168 125715156 116108636 108930202 103841589 100530741 98680135 97759721 96830964 94713107
58160 94713107 90547606 84290830 76652565 68568451 60733891 53516532 47087245 41503522
58152 41503522 36722908 32647079 29183464 26251726 23759132 21612568 19749525 18131342
58144 18131342 16715894 15461219 14345861 13360255 12482985 11685310 10952832 10283326 9667857
58135I667857n76415n43135n07528m74151m45231m12421l72961l37027l10288
58126E688700k85043k56378k31224k13909j98209j81428j71387j71526j72848
58117C806748j68258j61915j57404j49751j36477j24262j17189j09791r8534q9004
58107B494163q4967q1191p3901o7880o6538o4982n9645n5266n5620n6346n3426
58096A774401n0160m9567m8182m3372l8874l7345l5144l0076k6431k6877k6983
58085A361390k3365j9878k0126k1021j9368j7906j9310k0682j9430j8328j9594
58074A142382k0151j7837j6152j7781j9390j7941j6370j7931k0388k0725k0265
58063I37451k0470j9072j5041j2100j2631j3335j1420r756j1204j3120j2433j1216
$$ plain form
58135 9667857 9091442 8548307 8040779 7566628 7121397 6708976 6336015 5998988 5688700
58126 5688700 5403657 5147279 4916055 4702146 4503937 4322509 4151122 3979596 3806748
58117 3806748 3638490 3476575 3319171 3169420 3032943 2908681 2791492 2681701 2583167 2494163
58107 2494163 2409196 2328005 2254104 2186224 2119686 2054704 1995059 1939793 1884173 1827827 1774401
58096 1774401 1724241 1674674 1626492 1583120 1544246 1506901 1471757 1441681 1415250 1388373 1361390
58085 1361390 1338025 1318147 1298021 1277000 1257632 1239726 1220416 1199734 1180304 1161976 1142382
58074 1142382 1122231 1104394 1088242 1070461 1051071 1033130 1016760 998829 978441 957716 937451
58063 937451 916981 897909 882868 870768 858137 844802 833382 823626 812422 799302 786869 775653
58051G75653j2237j3572j2578j0862j0640j0346q358o975q156r440q333o731o827
58038F50598o870n183m125n682p247o267n042o362q283p945o828p516q717q247
58024E56284p677r241j1108j0378q127p065o769n491m080m067m242l079k113l169
58010D69678m649m316l161l037k973j559k88q61j728r25J80l01r05M17K236K269
57994D50077J660K606L986L442J909K001L538M413M513N136N983N942N536N547
57980E06289M895K751R13J037J443j71k770l893l741m095m861m823m347m340m128
57965D80159l101k688l920m999m183l025l671m924m367k559j745k047k161k302
57951D34467l201l770k904k107l140m600m082k165j050o59M80J867J940J323J877
$$ plain form
58051 775653 763416 749844 737266 726404 715764 705418 697060 690085 681929 672489 664156 657425 650598
58038 650598 643728 638545 634420 628738 621491 615224 610182 603820 595537 587592 580764 573248 564531 556284
58024 556284 548607 539366 528258 517880 509753 502688 495919 490428 486348 482281 478039 474960 472847 469678
58010 469678 465029 460713 457552 454515 451542 449983 449695 448834 447106 446181 446361 446060 445155 445572 447808 450077
57994 450077 451737 454343 458329 461771 463680 465681 469219 473632 478145 483281 489264 495206 500742 506289
57980 506289 511184 513935 514848 515885 517328 517157 514387 510494 506753 502658 497797 492974 488627 484287 480159
57965 480159 477058 474370 470450 465451 461268 458243 454572 449648 445281 442722 440977 438930 436769 434467
57951 434467 431266 427496 424592 422485 419345 414745 410663 408498 407448 406789 407269 409136 411076 412399 414276
57936D14276L463M604N358O559P452O979O299P060Q359Q360P679Q047Q874Q320
57922E11689O757N963N713M388K194P29j9j366l294m824o275q459j0433j0752
57908D92011j0108j0132j0472r767q560q408q990q805q013p850q036p437o466
57895C78967o229o170n128l733l225l021k039j162j565j971o31J304J623J028
57881C48048J838L743M483L935L896M401L911K708K570L297L069J995J858K468
57867C92220J855L6q65m62o12j815k381j665r51o64K68J770K278J564J223J828
57851C93627K338K620L816N786O862O618O317O328N760M887N053N854N285L194
57837D64345J701J614J308j34j570k400l684n586o422n478m395m546n143n069
$$ plain form
57936 414276 417739 422343 427701 434260 441712 448691 454990 462050 470409 478769 486448 494495 503369 511689
57922 511689 518446 524409 530122 534510 536704 537433 537414 536048 532754 527930 521655 513196 502763 492011
57908 492011 481903 471771 461299 451532 442972 434564 425574 416769 408756 400906 392870 385433 378967
57895 378967 372738 366568 361440 357707 354482 351461 349422 348260 346695 344724 344093 345397 347020 348048
57881 348048 349886 353629 358112 362047 365943 370344 374255 376963 379533 382830 385899 387894 389752 392220
57867 392220 394075 394111 393246 392784 392172 390357 387976 386311 385360 384696 384964 386734 389012 390576 391799 393627
57851 393627 395965 398585 402401 408187 415049 421667 427984 434312 440072 444959 450012 455866 461151 464345
57837 464345 466046 467660 468968 468834 467264 464864 461180 455594 449172 443694 439299 434753 429610 424541
57823D24541m585m162l497k644k227j880k97K438M482M838M505M479M555M578
57809D35124M847M780L257Q25n76n28o02j407j618p67n02j972m153n892p487r123
57793D14206r793r095q224p939p302n653m076l636l687l261k653k443k208j393
57779C42843k77Q48K273L808M432L803K971K792K929L029L578M760N799O191O407
57764C96186O706O504N594M732M318L741K608J435O01j81q96r91n48l74n84m48
57748D28403L4k7o67q55m15m86j452k186k071k027k677l131k650k016k207k851
57732D02719l013k477j528m28L83N04L74P06J130P35m5J39J139J370N80M07J472
57715D04167K204J517N47N18Q14N08P6K08M59M18O99J538J871J119M33Q10J409
$$ plain form
57823 424541 419956 415794 412297 409653 407426 405546 405249 407687 412169 417007 421512 425991 430546 435124
57809 435124 439971 444751 448008 448833 448257 447729 447127 445720 444102 443335 442833 440861 436708 430816 423329 414206
57793 414206 404413 395318 387094 379155 371853 366200 362124 358488 354801 351540 348887 346444 344236 342843
57779 342843 342566 343414 345687 349495 353927 357730 360701 363493 366422 369451 373029 377789 383588 389779 396186
57764 396186 402892 409396 414990 419722 424040 427781 430389 431824 432425 432244 431348 430357 429809 429435 428851 428403
57748 428403 428437 428410 427743 426888 426473 425987 424535 422349 420278 418251 415574 412443 409793 407777 405570 402719
57732 402719 399706 397229 395701 395273 395656 396160 396534 397240 398370 399105 399060 399199 400338 401708 402288 402695 404167
57715 404167 406371 407888 408435 408953 409767 410275 410351 410559 411018 411436 412135 413673 415544 416663 417096 417906 419315
57698D19315J169P51J335K586L370L558L753M067M400N070N995O090M709K807
57684D68975J656J229R37J018K046L787N702P885J0580J3411J6069J9058K2967
57671E75320K7632L2684L8166M4049N0006N6241O3418P1029P6667P7291P0229
57660A182732N3132K5394q929m1436o4598p6336p8977p5481o8099n9079n0314
57649G38009m2413l5327k9400k4790k0723j6485j2561r710p683n827m227l160
57637E25703k240j139l87l90m47J73R59J090Q87J163J770J986J824J808J934J810
57621E36504J458J125P25K20L1M30J033J429J612J456O96j44Q4J416K468K478
57605E53021K253K368K064J047O62J761K923K529J338J133J831J999J404J068
$$ plain form
57698 419315 420484 421235 422570 425156 428526 432084 435837 439904 444304 449374 455369 461459 466168 468975
57684 468975 470631 471860 472797 473815 475861 479648 485350 493235 503815 517226 533295 552353 575320
57671 575320 602952 635636 673802 717851 767857 824098 887516 958545 1035212 1112503 1182732
57660 1182732 1235864 1261258 1252329 1210893 1146295 1069959 990982 915501 847402 788323 738009
57649 738009 695596 660269 630869 606079 585356 568871 556310 546600 538917 533090 528863 525703
57637 525703 523463 522324 521937 521547 521100 521273 522232 523322 524209 525372 527142 529128 530952 532760 534694 536504
57621 536504 537962 539087 539812 540032 540063 540493 541526 542955 544567 546023 546719 546575 546659 548075 550543 553021
57605 553021 555274 557642 559706 560753 561415 563176 566099 568628 569966 571099 572930 574929 576333 577401
57591E77401J225J153P81O86P50L56k25j82K95L21rL11J423K319K396K085J819
57574E92905J570J389J510J777J854J882K105K129J504P42P44J376J683J450J507
57559F16127K376L548M258M350M193M221M560M843M607M010L698L801L807L650
57545F72049L892M402M063K552J239J269J879J858J521J870K666K926K678K669
57531G07533K853K684K411K639K968K622K029K282L243L840M069N067P085Q941
57517G60266R803J0212J0829J1366J1266J0672J0258J0525J1389J2077J1610R907
57505H90180Q082P147O880O592O276O113N499L811J681L80K34O28J185J833K181
57490I48702J986J853K359K882K607K132K611L670L814K836K120K482L228L629
$$ plain form
57591 577401 578626 579779 580560 581246 581996 582352 582127 581945 582240 582561 582552 582863 584286 586605 589001 591086 592905
57574 592905 594475 595864 597374 599151 601005 602887 604992 607121 608625 609367 610111 611487 613170 614620 616127
57559 616127 618503 622051 626309 630659 634852 639073 643633 648476 653083 657093 660791 664592 668399 672049
57545 672049 675941 680343 684406 686958 688197 689466 691345 693203 694724 696594 699260 702186 704864 707533
57531 707533 710386 713070 715481 718120 721088 723710 725739 728021 731264 735104 739173 744240 751325 760266
57517 760266 770069 780281 791110 802476 813742 824414 834672 845197 856586 868663 880273 890180
57505 890180 898262 905409 912289 918881 925157 931270 936769 940580 942261 942641 942875 943503 944688 946521 948702
57490 948702 950688 952541 954900 957782 960389 962521 965132 968802 972616 975452 977572 980054 983282 986911
57476I86911L924M440M937N258N614N945N896N592N569N725N426M702M374M796
57462A059109N426N785N943N971N778N646N950O390O345O035O283P143P761P752
57448A147317P652P816P877P554P176P065P175P428P752P824P481P246P683Q428
57434A253474Q723Q622Q651Q611P947P138P280Q262Q751Q189P521P612Q201Q735
57420A367717R117R273R025Q747R055R613R370Q343P909Q837J0172J0659J0283
57407A488120R744R378R221R387R783J0046J0158J0465J0838J0646R926R595J0114
57394A617421J0778J0845J0579J0625J1062J1573J1950J2026J1730J1505J1957
57383A742051J2804J3036J2399J1904J2351J3250J3725J3693J3458J2912J1888
$$ plain form
57476 986911 990835 995275 1000212 1005470 1011084 1017029 1022925 1028517 1034086 1039811 1045237 1049939 1054313 1059109
57462 1059109 1064535 1070320 1076263 1082234 1088012 1093658 1099608 1105998 1112343 1118378 1124661 1131804 1139565 1147317
57448 1147317 1154969 1162785 1170662 1178216 1185392 1192457 1199632 1207060 1214812 1222636 1230117 1237363 1245046 1253474
57434 1253474 1262197 1270819 1279470 1288081 1296028 1303166 1310446 1318708 1327459 1335648 1343169 1350781 1358982 1367717
57420 1367717 1376834 1386107 1395132 1403879 1412934 1422547 1431917 1440260 1448169 1457006 1467178 1477837 1488120
57407 1488120 1497864 1507242 1516463 1525850 1535633 1545679 1555837 1566302 1577140 1587786 1597712 1607307 1617421
57394 1617421 1628199 1639044 1649623 1660248 1671310 1682883 1694833 1706859 1718589 1730094 1742051
57383 1742051 1754855 1767891 1780290 1792194 1804545 1817795 1831520 1845213 1858671 1871583 1883471
57372A883471J0799J0275J0411J0866J1329J1610J1629J1612J1880J2253J2231
57361B008366J1915J2042J2823J3443J3165J2335J1892J2242J3021J3568J3425
57350B148237J2786J2475J3111J4195J4664J4266J3733J3620J3843J4364J5274
57339B300568J6030J5670J4273J3170J3249J3884J4152J4160J4461J4966J5225
57328B459808J5244J5250J5112J4697J4347J4409J4642J4659J4593J4814J5281
57317B622856J5671J5854J5811J5440J4838J4464J4671J5273J5909J6511J7107
57306B794405J7542J7609J7275J6600J5825J5566J6325J7583J7981J6838J5042
57295B978591J4104J4674J6247J7807J8410J7646J6014J4641J4282J4686J5110
$$ plain form
57372 1883471 1894270 1904545 1914956 1925822 1937151 1948761 1960390 1972002 1983882 1996135 2008366
57361 2008366 2020281 2032323 2045146 2058589 2071754 2084089 2095981 2108223 2121244 2134812 2148237
57350 2148237 2161023 2173498 2186609 2200804 2215468 2229734 2243467 2257087 2270930 2285294 2300568
57339 2300568 2316598 2332268 2346541 2359711 2372960 2386844 2400996 2415156 2429617 2444583 2459808
57328 2459808 2475052 2490302 2505414 2520111 2534458 2548867 2563509 2578168 2592761 2607575 2622856
57317 2622856 2638527 2654381 2670192 2685632 2700470 2714934 2729605 2744878 2760787 2777298 2794405
57306 2794405 2811947 2829556 2846831 2863431 2879256 2894822 2911147 2928730 2946711 2963549 2978591
57295 2978591 2992695 3007369 3023616 3041423 3059833 3077479 3093493 3108134 3122416 3137102 3152212
57284C152212J5126J4804J4434J4305J4490J4748J4784J4650J4548J4451J4264
57273C312816J4248J4689J5298J5491J5223J4927J4737J4420J4011J3769J3580
57262C473209J3196J2951J3377J4139J4334J3894J3618J3708J3461J2661J2051
57251C620599J1943J1611J0680R979J0210J0753J0701J0311J0395J0928J1257
57240C739367J1179J0906J0331R242Q046P457P523P638P434P149P077P111O927
57227C847387O386N766N580N984O459O426O060N994O277O359O155O265O887P387
57213C935372P371P449Q288R586J0561J1029J1330J1522J1242J0326R202Q631
57201D051909R030R820R696Q055O004N228N863O360N538L865K427J522Q13O0q05
$$ plain form
57284 3152212 3167338 3182142 3196576 3210881 3225371 3240119 3254903 3269553 3284101 3298552 3312816
57273 3312816 3327064 3341753 3357051 3372542 3387765 3402692 3417429 3431849 3445860 3459629 3473209
57262 3473209 3486405 3499356 3512733 3526872 3541206 3555100 3568718 3582426 3595887 3608548 3620599
57251 3620599 3632542 3644153 3654833 3664812 3675022 3685775 3696476 3706787 3717182 3728110 3739367
57240 3739367 3750546 3761452 3771783 3781025 3789071 3796528 3804051 3811689 3819123 3826272 3833349 3840460 3847387
57227 3847387 3853773 3859539 3865119 3871103 3877562 3883988 3890048 3896042 3902319 3908678 3914833 3921098 3927985 3935372
57213 3935372 3942743 3950192 3958480 3968066 3978627 3989656 4000986 4012508 4023750 4034076 4043278 4051909
57201 4051909 4060939 4070759 4080455 4088510 4094514 4099742 4105605 4111965 4117503 4121368 4123795 4125317 4126130 4126190 4125385
57186D125385j772k526k675k422k441k805k837k300j917k286k999l375l375l330
57172D088325l389l718m653o177p791r150j0264j0914j0702r928r491r517r043
57159C983588p573o001n302n201m798l889k921k353k554l750n480o768p367q111
57145C911520r566j1165j2230j3001j3932j4801j5232j5495j5973j6487j6826
57134C756812j7261j7946j8452j8509j8404j8062j6687j4039j1188r045o938l670
57122C586611O78N033Q907J2639J6479K0329K4117K7747L1042L4289L8426M4094
57110C850391N1083N9136O8674Q0182R3674J09363J28128J50809J77943K10822
57100D980205K51823L02786L63973M35405N18249O13789P21765Q40497R67853
$$ plain form
57186 4125385 4123613 4121087 4118412 4115990 4113549 4110744 4107907 4105607 4103690 4101404 4098405 4095030 4091655 4088325
57172 4088325 4084936 4081218 4076565 4070388 4062597 4053447 4043183 4032269 4021567 4011639 4002148 3992631 3983588
57159 3983588 3976015 3970014 3964712 3959511 3954713 3950824 3947903 3945550 3942996 3939246 3933766 3926998 3919631 3911520
57145 3911520 3901954 3890789 3878559 3865558 3851626 3836825 3821593 3806098 3790125 3773638 3756812
57134 3756812 3739551 3721605 3703153 3684644 3666240 3648178 3631491 3617452 3606264 3597219 3590281 3586611
57122 3586611 3587289 3592322 3601229 3613868 3630347 3650676 3674793 3702540 3733582 3767871 3806297 3850391
57110 3850391 3901474 3960610 4029284 4109466 4203140 4312503 4440631 4591440 4769383 4980205
57100 4980205 5232028 5534814 5898787 6334192 6852441 7466230 8187995 9028492 9996345
57091I996345J101183J237086J371807J500905J618007J715244J785722J824667
57083B2150966J829543J803804J761964J723922J694623J647120J531166J304166
57075C5447274R57550N18788L4482m48218q92599j275911j587520j824099j985756
57066B8943991k075157k097927k062425j979465j862208j724677j578804j432637
57058A4130691j291063j157275j033314r20377q19284p30349o52825n85324n26876
57049F414004m76744m33238l93958l57512l24102k94029k66666k41363k18462
57040C407930j98750j82402j68839j57219j46783j37201j28694j21466j15048
57031B051528j08663j02113r5692q9459q3353p7814p3335o9343o4390n7613m9395
$$ plain form
57091 9996345 11097528 12334614 13706421 15207326 16825333 18540577 20326299 22150966
57083 22150966 23980509 25784313 27546277 29270199 30964822 32611942 34143108 35447274
57075 35447274 36404824 36923612 36958094 36509876 35617277 34341366 32753846 30929747 28943991
57066 28943991 26868834 24770907 22708482 20729017 18866809 17142132 15563328 14130691
57058 14130691 12839628 11682353 10649039 9728662 8909378 8179029 7526204 6940880 6414004
57049 6414004 5937260 5504022 5110064 4752552 4428450 4134421 3867755 3626392 3407930
57040 3407930 3209180 3026778 2857939 2700720 2553937 2416736 2288042 2166576 2051528
57031 2051528 1942865 1840752 1745060 1655601 1572248 1494434 1421099 1351756 1287366 1229753 1180358
57020A180358m0446l0863k0166p742O810K3457M1906O2194Q4837J10411J39102
57009A549858J69223J93327J95888J60217Q3331j6092j08199j71841k03838k11837
56999A640037k03709j84976j61034j36838j14861r5537p9157o5922n5109m5786
56989D97108l7881l1422k5601j9736j4488j0888q707o949n437m822n355o705q762
56976C10355j1706j5226j8333k0028j9893j8230j5873j3615j1610r540p350n264
56964A43687l185p80J714L635M988O515Q493J0375J1873J3264J4226J3461J0214
56951B38480N278j51n705j1152j5386j7237j6809j5255j3436j1471r260o776m039
56938A17081j204J494M132P032J0120J2833J4838J6386J7760J8901J9613J9376
$$ plain form
57020 1180358 1139912 1109049 1088883 1081141 1087951 1111408 1153314 1215508 1300345 1410756 1549858
57009 1549858 1719081 1912408 2108296 2268513 2351844 2335752 2227553 2055712 1851874 1640037
56999 1640037 1436328 1251352 1090318 953480 838619 743082 663925 598003 542894 497108
56989 497108 459227 427805 402204 382468 367980 357092 348385 341436 335999 331177 325822 319117 310355
56976 310355 298649 283423 265090 245062 225169 206939 191066 177451 165841 156301 148951 143687
56964 143687 140502 139722 141436 145071 150059 156574 165067 175442 187315 200579 214805 228266 238480
56951 238480 243758 243607 237902 226750 211364 194127 177318 162063 148627 137156 127896 121120 117081
56938 117081 115877 117371 121503 128535 138655 151488 166326 182712 200472 219373 238986 258362
56926B58362J6921J1018K182p153j4561j9137k1036k0637j8714j6527j4941j3862
56914A41915j2868j1829j0603q991p308o285n990n672m927m151l554k731j622
56901E5384p73j71R57K593L435K839K092K694M370N914P049Q291R715J1083J2684
56886A28156J4836J6953J8064J7956J6901J4708J0976O014P05m146p797r498r317
56873B14511q432p698o503l889k60L154O048R126J2719J6445K0205K4436K9196
56860C09058L3762L7339L9634M0577L9707L5843K7575J4730l60j3877k3284k8527
56848E12177l0392k8965k4511j8596j2977p936k749K862Q759J5138K2060K8832
56836D63702L5113M1864M9868N7830O3489O5969O5256N9650M6160K4252k178k7276
$$ plain form
56926 258362 275283 286301 288483 281330 266769 247632 226596 205959 187245 170718 155777 141915
56914 141915 129047 117218 106615 97624 90316 84031 78041 72369 67442 63291 59737 57006 55384
56901 55384 54611 54440 55397 57990 61425 64264 66356 69050 73420 79334 86383 94674 104389 115472 128156
56886 128156 142992 159945 178009 195965 212866 227574 238550 244564 245269 241123 233326 223828 214511
56873 214511 206079 198381 191878 187989 187729 190883 196931 206057 218776 235221 255426 279862 309058
56860 309058 342820 380159 419793 460370 500077 535920 563495 578225 577865 563988 540704 512177
56848 512177 481785 452820 428309 409713 396736 388800 386051 388913 397672 412810 434870 463702
56836 463702 498815 540679 590547 648377 711866 777835 843091 902741 948901 973153 970975 943699
56824I43699m6770n8997o4178o3773n9764n3546m5683l6860k8248k0527j3247
56813D52106n742J826Q862J5299K1675K8397L5222M1259M5255M5949M2256L3291
56801G65655J8782L3j9690l6484m7879n3577n4594n2152m7370m1271l4739k8379
56789C68335k2371j6497j0715n715k288J25L362Q397J3933J7950J9926K0530J9630
56776D14602J5966Q848q73j1485k1266k8640l2589l3313l1942k9526k6740k4272
56764A98770k2577k1165j9008j5884j2683j0276q708p638o915o498o302o244o120
56751D8752n500m257l045k690l085l312k803j827q77k15l9m25j024j320j284j307
56735A5742j550j842k132k479k596k053r62K5M68M64L24L18O38J149J340J010
$$ plain form
56824 943699 896929 837932 773754 709981 650217 596671 550988 514128 485880 465353 452106
56813 452106 446364 448190 457052 472351 494026 522423 557645 598904 644159 690108 732364 765655
56801 765655 784437 784470 764780 728296 680417 626840 572246 520094 472724 431453 396714 368335
56789 368335 345964 329467 318752 313037 310749 310874 314236 322633 336566 354516 374442 394972 414602
56776 414602 430568 439416 438543 427058 405792 377152 344563 311250 279308 249782 223042 198770
56764 198770 176193 155028 136020 120136 107453 97177 88469 80831 73916 67418 61116 54872 48752
56751 48752 43252 38995 35950 33260 30175 26863 24060 22233 21356 21141 21102 20677 19653 18333 17049 15742
56735 15742 14192 12350 10218 7739 5143 3090 2128 2153 2621 3085 3409 3727 4365 5514 6854 7864
56719G864O19N66M98K5l65l5N77M83k61n75L8Q89J258J133O76j40j048j491j336
56700I375r59m91K05P38L40r09j889j841j228q14o36l53QJ68K9l57D44a083j868
56681b951j990k066j931j280l97K3j63m14m49n93j008j324j403j689k419l075
56665b3129l104k649k108j456n02N06J059J109J297K356M350O436P567f54F922
56649A5275R673J0730J1392J2030J2420J1857J0353Q834P938P429O941O478N922
56636A37272M868L363K093J441J001L61k19l98m84j013j885k405k084j198n86
56621A40127q80j842k503k207j245l05L55P19N54j88q87r51p31r55j541j818j641
56604A24061j366j031o05o88j745k805k376o14P56Q79O06O95P13K62j45j56l07
$$ plain form
56719 7864 8483 9049 9547 9572 9207 9172 9749 10232 9971 9396 9434 10323 11581 12714 13390 13250 12202 10711 9375
56700 9375 8416 7925 8130 8868 9208 8299 6410 4569 3341 2527 1891 1538 1546 1714 1743 1386 444 -1083 -2951
56681 -2951 -4941 -7007 -8938 -10218 -10615 -10592 -10755 -11169 -11618 -12211 -13219 -14543 -15946 -17635 -20054 -23129
56665 -23129 -26233 -28882 -30990 -32446 -32948 -32442 -31383 -30274 -28977 -26621 -22271 -15835 -8268 -654 6922
56649 15275 24948 35678 47070 59100 71520 83377 93730 102564 110502 117931 124872 131350 137272
56636 137272 142140 145503 147596 149037 150038 150399 150180 149782 149298 148285 146400 143995 141911 140713 140127
56621 140127 139247 137405 134902 132695 131450 131145 131500 132219 132773 132585 131698 130747 130016 129061 127520 125702 124061
56604 124061 122695 121664 121059 120371 118626 115821 113445 112831 113587 114466 115072 115767 116480 116742 116597 116441 116134
56587A16134q92j256r61n95o92q59p05n95p06m41L56P33J96j04J032K847L622
56570A17114L047K322K254K536K733K862K928K836K855L482M779O306P641Q555
56556A72250Q943Q973R040R109Q402O317L387Q72m42o96n17n03q76j317j373j127
56540B20442j135j598k110k354k461k557k653l035l917m618m173l002k757l942
56526A80130m951m340k875k233k633l032k936k674k382j912j558j749k210k312
56512A42333k072j963k006j852j513j233q86l24on18j569k300k297j739p96L49
56496A21608J147J110M61j73n02n13j34M70P40N87P83J716K333J460l20j324j031
56479A28418n06n72p99n42R4N95O74K54m71q77m00O51J373J428J366J737K482
$$ plain form
56587 116134 115242 113986 113025 112430 111738 110879 110174 109579 108873 108432 108788 109521 109717 109613 110645 113492 117114
56570 117114 120161 122483 124737 127273 130006 132868 135796 138632 141487 144969 149748 156054 163695 172250
56556 172250 181193 190166 199206 208315 216717 223034 226421 227293 226851 226155 225638 225135 224259 222942 221569 220442
56540 220442 219307 217709 215599 213245 210784 208227 205574 202539 198622 194004 189831 186829 184072 180130
56526 180130 175179 170839 167964 165731 163098 160066 157130 154456 152074 150162 148604 146855 144645 142333
56512 142333 140261 138298 136292 134440 132927 131694 130808 130484 130478 129960 128391 126091 123794 122055 121259 121608
56496 121608 122755 123865 124326 124153 123651 123138 123004 123474 124214 124801 125584 127300 129633 131093 130773 129449 128418
56479 128418 127912 127340 126541 125999 126093 126688 127362 127616 127145 126268 125868 126519 127892 129320 130686 132423 134905
56462A34905L220L580L205K030O93Q8L58P81Q15P61J211K190L120L418K950J997
56446A65322R09j00q32r60m06L01N39L98M33O08L22m31p58j95N65P21L81j0m13
56427A66394p71o49p4K6q97j972k015j070o7M96O52L25m09r02o30PL76N03N46
56408A59869N4j204k337k307j365m75J29P69J252J160Q09P47O85J23m51k14N78
56391A57822J049J215J589J785J045p0k09O07J037P42R60K365L934M604M705N063
56375A88243N668N991N773M981L672K274J377J014P20L72K66L26O9n74j089j177
56359B17906j007p67o12q41j304j084K67J551J306L7l59O09J438J040J43j97p9
56342B18047m8n7J98O62J189J718J908J420O91N68J047J325J203J372K115K833
$$ plain form
56462 134905 138125 141705 144910 146940 147633 147721 148079 148860 149675 150436 151647 153837 156957 160375 163325 165322
56446 165322 166231 166131 165299 164339 163933 164234 164773 165171 165604 166212 166534 166103 165345 165150 165715 166436 166817 166807 166394
56427 166394 165623 164974 164900 164926 164029 162057 160042 158972 158905 159401 160053 160378 159969 159067 158437 158444 158820 159323 159869
56408 159869 159923 158719 156382 154075 152710 152235 152364 153133 154385 155545 156354 157101 157786 157909 157458 157244 157822
56391 157822 158871 160086 161675 163460 164505 164435 164226 164833 165870 166612 167572 169937 173871 178475 183180 188243
56375 188243 193911 199902 205675 210656 214328 216602 217979 218993 219713 220085 220351 220677 220746 220172 219083 217906
56359 217906 216899 216132 215520 214679 213375 212291 212558 214109 215415 215452 215093 215702 217140 218180 218323 218126 218047
56342 218047 217999 217942 218140 218802 219991 221709 223617 225037 225728 226296 227343 228668 229871 231243 233358 236191
56326B36191L113L258L412L232K671K183J900J544J261J443J714J323N96O38J357
56311B65836J332L7j270j508j184j120j167r22o03l70J36Q83J088N39J94P18J435
56294B64054J534J274J249J355J278J142R71L69n33q29j96L78Q1m67k67O29J500
56277B73522K059K330K257K113K522L361L516K485J296J040J413J626J846K531
56263C03917L102K603J337O58J218K309K890K665K121J971K512L380M118M818
56249C39619N785O617O569N808N342N534N731N647N959O969P868P947P599P435
56235D30429P298O905O569O624O687O204N169L934K840K180J849J052p63k717
56221D84260l402k890k487k493k014j114j171k426l169k386j320j276j583j136
$$ plain form
56326 236191 239304 242562 245974 249206 251877 254060 255960 257504 258765 260208 261922 263245 263841 264479 265836
56311 265836 267168 267205 265935 264427 263243 262123 260956 260034 259431 259061 259197 260080 261168 261707 261901 262619 264054
56294 264054 265588 266862 268111 269466 270744 271886 272857 273226 272693 271864 271668 272046 272127 271660 271393 272022 273522
56277 273522 275581 277911 280168 282281 284803 288164 291680 294165 295461 296501 297914 299540 301386 303917
56263 303917 307019 309622 310959 311617 312835 315144 318034 320699 322820 324791 327303 330683 334801 339619
56249 339619 345404 352021 358590 364398 369740 375274 381005 386652 392611 399580 407448 415395 422994 430429
56235 430429 437727 444632 451201 457825 464512 470716 475885 479819 482659 484839 486688 487740 486977 484260
56221 484260 480858 477968 475481 472988 470974 469860 468689 466263 463094 460708 459388 458112 456529 455393
56207D55393l87l30p24q63r86j552k131k200k114k097j404K91J791J953J383J271
56191D47294J570J608J543J797J993J753J754K690L926M456M395M447M620M521
56177D88367M208L691K646J409J269K685M369N076N108N068M563L421K760L424
56163E38064M595N238N668O359O692O314O245P103P721P268P103Q675J0996J2225
56149F40266J2471J3013J4058J5274J7314K0579K3710K5484K7053L0172L4382
56138H73776L8269M2238M7591N3974O0347O7547P7259Q9150J01558J14148J27214
56127A693071J39022J46548J48358J44420J34072J17226R7173P9033O5360N5538
56117B819821M8822M4825M1125L3824K1404O057r082k1959l1179l6357l9470m3941
$$ plain form
56207 455393 455006 454676 453952 453089 452103 450551 448420 446220 444106 442009 440605 440896 442687 444640 446023 447294
56191 447294 448864 450472 452015 453812 455805 457558 459312 462002 465928 470384 474779 479226 483846 488367
56177 488367 492575 496266 498912 500321 501590 504275 508644 513720 518828 523896 528459 531880 534640 538064
56163 538064 542659 547897 553565 559924 566616 572930 579175 586278 593999 601267 608370 617045 628041 640266
56149 640266 652737 665750 679808 695082 712396 732975 756685 782169 809222 839394 873776
56138 873776 912045 954283 1001874 1055848 1116195 1183742 1261001 1350151 1451709 1565857 1693071
56127 1693071 1832093 1978641 2126999 2271419 2405491 2522717 2619890 2698923 2764283 2819821
56117 2819821 2868643 2913468 2954593 2988417 3009821 3015878 3006796 2984837 2953658 2917301 2877831 2833890
56105B833890n2016o4197q0394r9209j16775j28840j34061j33429j27432j16404
56095A781133j02796q9859p8204o6364n4438m4218l6073k8778k2437j8301j5774
56084A223891j2683q775n809m052j869R25K575K809L550N483P038P499Q183R602
56070A238367J0342R770R171R335R467R296R844J1382J2947J4400J6565J8935
56058A379821J9843J9367J9505K1046K2760K3953K5138K6005K5455K3959K3210
56047A630062K3268K2779K1944K2255K3432K3787K3542K4439K6220K7026K7203
56036A895957K8917L2013L4179L5200L6966L9293M0133M0021M1663M4761M6213
56025B315316M5934M7334N1131N3987N4605N5890N9457O3080O5378O8076P1817
$$ plain form
56105 2833890 2781874 2717677 2637283 2538074 2421299 2292459 2158398 2024969 1897537 1781133
56095 1781133 1678337 1588478 1510274 1443910 1389472 1345254 1309181 1280403 1257966 1239665 1223891
56084 1223891 1211208 1202433 1196624 1192572 1190703 1191628 1194203 1197012 1200562 1206045 1213083 1220582 1228765 1238367
56070 1238367 1248709 1258479 1267650 1276985 1286452 1295748 1305592 1316974 1329921 1344321 1360886 1379821
56058 1379821 1399664 1419031 1438536 1459582 1482342 1506295 1531433 1557438 1582893 1606852 1630062
56047 1630062 1653330 1676109 1698053 1720308 1743740 1767527 1791069 1815508 1841728 1868754 1895957
56036 1895957 1924874 1956887 1991066 2026266 2063232 2102525 2142658 2182679 2224342 2269103 2315316
56025 2315316 2361250 2408584 2459715 2513702 2568307 2624197 2683654 2746734 2812112 2880188 2952005
56014B952005P4590P6104P8842Q3094Q5970Q6987Q9496R4740R9870J03651J08542
56003C933891J15114J20329J23647J28909J37558J45984J52286J59613J69937
55994E187268J80611J90163K01348K15375K29294K42206K57626K76510K94678
55985G275079L10469L28069L49966L73338L97382M26511M62527N01637N43115
55976A0968093N92424O51692P16117P84365Q63152R56880J062897J182245J324444
55967A9102309J496279J697416J933173K219455K569237K988294L490902M102548
55959C9599613M836053N679868O621095P666577Q834711J0146726J1635535J3339381
55951A08359559J5273154J7425507J9780688K2288699K4784142K6968613K8462274
$$ plain form
56014 2952005 3026595 3102699 3181541 3264635 3350605 3437592 3527088 3621828 3721698 3825349 3933891
56003 3933891 4049005 4169334 4292981 4421890 4559448 4705432 4857718 5017331 5187268
55994 5187268 5367879 5558042 5759390 5974765 6204059 6446265 6703891 6980401 7275079
55985 7275079 7585548 7913617 8263583 8636921 9034303 9460814 9923341 10424978 10968093
55976 10968093 11560517 12212209 12928326 13712691 14575843 15532723 16595620 17777865 19102309
55967 19102309 20598588 22296004 24229177 26448632 29017869 32006163 35497065 39599613
55959 39599613 44435666 50115534 56736629 64403206 73237917 83384643 95020178 108359559
55951 108359559 123632713 141058220 160838908 183127607 207911749 234880362 263342636
55944B63342636K8747787K7000810K2199674J3810989K600645r331026j9548909
55937C28822606k6501458k9965022l0603989k9314809k6884523k3927797k0875556
55930A40749452j7974649j5345673j3050308j1104681r475557q110887o972661
55923E8715036o029976n242651m573878m006536l530849l127717k777703k474295
55915B6951431k214590j986982j780098j594317j432943j290504j159949j043119
55907A4448929r43836q57926p79422p09791o52120o02414n55167n11801m75627
55898H360825m43811m11943l81551l55838l32580l08170k84391k64565k46949
55889E331027k28114k09128j92579j76984j59717j42171j26726j11847r5067p7660
$$ plain form
55944 263342636 292090423 319091233 341290907 355101896 357702541 348371515 328822606
55937 328822606 302321148 272356126 241752137 212437328 185552805 161625008 140749452
55930 140749452 122774803 107429130 94378822 83274141 73798584 65687697 58715036
55923 58715036 52685060 47442409 42868531 38861995 35331146 32203429 29425726 26951431
55915 26951431 24736841 22749859 20969761 19375444 17942501 16651997 15492048 14448929
55907 14448929 13505093 12647167 11867745 11157954 10505834 9903420 9348253 8836452 8360825
55898 8360825 7917014 7505071 7123520 6767682 6435102 6126932 5842541 5577976 5331027
55889 5331027 5102913 4893785 4701206 4524222 4364505 4222334 4095608 3983761 3888694 3811034
55879C811034o1637m5423k7037q470P469K1381L3963M1642M0017K8972J0656j4305
55867C838262m4350p4084r8617j18523j36593j52134j62409j67009j66785j61016
55857B556742j49631j35974j23434j11501r8641q6475p7232o9580o1164n3204
55847A589906m8418m6200m3897m1271l9731l8627l6204l3034l0948k9619k7569
55836A174388k5335k4401k4098k2703k0653j9643j9597j9324j8979j9145j8845
55825I41665j7146j5432j5254j5461j4305j2841j3169j4670j5230j4879j5057
55814G78221j5370j4358j2586j1769j1568j0337q313p046o347m798k795k080k561
55801F68293k459j290j45P40K130L732M409M217M120M086L529L018L342L632K652
$$ plain form
55879 3811034 3749397 3703974 3676937 3668467 3675936 3697317 3731280 3772922 3812939 3841911 3852567 3838262
55867 3838262 3793912 3719828 3621211 3502688 3366095 3213961 3051552 2884543 2717758 2556742
55857 2556742 2407111 2271137 2147703 2036202 1937561 1851086 1773854 1704274 1643110 1589906
55847 1589906 1541488 1495288 1451391 1410120 1370389 1331762 1295558 1262524 1231576 1201957 1174388
55836 1174388 1149053 1124652 1100554 1077851 1057198 1037555 1017958 998634 979655 960510 941665
55825 941665 924519 909087 893833 878372 864067 851226 838057 823387 808157 793278 778221
55814 778221 762851 748493 735907 724138 712570 702233 693920 686874 680527 675729 672934 670854 668293
55801 668293 665834 664544 664399 665139 667269 671001 675410 679627 683747 687833 691362 694380 697722 701354 704006
55786G04006J195P71P44o91l301n288o340p606r100r973j0979j3827j8053k1181
55772F00377k2068k1736k0847j8912j6067j3290j0586p180l595j370o83m03m19
55759D63221j587l368m017l379l129l899m496m414m732n901o851p041p322q033
55745C95052q229p585p254p866q407p982p124o523n826m666l628l271l196k845
55731C10650k305j814j349j179j787k861l320k777k123k254l046l874m375m437
55717B73149m177m035m233m209l340k075j384j300r34J15J363K347K996L194K880
55702B60357K381J894Q88r83k914l971m576n699p081p625p221o663o052m796l116
55687B04823k014j693j429j017j031j494j663j165l29O49J696K256J909J341J434
$$ plain form
55786 704006 705201 705972 706716 706025 702724 697436 691096 683490 674390 664417 653438 639611 621558 600377
55772 600377 578309 556573 535726 516814 500747 487457 476871 469691 466096 464726 464043 463640 463221
55759 463221 461634 458266 454249 450870 447741 443842 439346 434932 430200 424299 417448 410407 403085 395052
55745 395052 386823 379238 371984 364118 355711 347729 340605 334082 328256 323590 319962 316691 313495 310650
55731 310650 308345 306531 305182 304003 302216 299355 296035 293258 291135 288881 285835 281961 277586 273149
55717 273149 268972 264937 260704 256495 253155 251080 249696 248396 247462 247577 248940 251287 254283 257477 260357
55702 260357 262738 264632 265520 264537 261623 257652 253076 247377 240296 232671 225450 218787 212735 207939 204823
55687 204823 202809 201116 199687 198670 197639 196145 194482 193317 192988 193637 195333 197589 199498 200839 202273
55672B02273J661Q12r66k364k906l159l145k326j179r73j737k084j380n38l51
55657A81638n29o55p20m16P16K214L093L430M106M991N022M191L746M077M195
55642B19099L626L119K930K219Q15j66k73p09k450m698o149o621o655o531o479
55627A91077o747o903o067m346k996k745l005l118l088k774j760m99j67p88r61
55612A45113m5Q52P24%p19j698k932l460k858k144k141k199j597q95q07q34l22
55595A24038K09J3n37o92o38q40r40m23L12O34P76J179J368O73n17j191j004k93
55577A22127P04J780K492K668K709K785K475J854J947L295M907N639N739N959
55563A67080O024N185L680K288R43r35l041m437m964n308n731n838n553n248m937
$$ plain form
55672 202273 203934 204746 203780 201416 198510 195351 192206 189880 188701 187728 185991 183907 182527 181989 181638
55657 181638 181109 180454 179734 179318 180034 182248 185341 188771 192877 197868 202890 207081 210827 214904 219099
55642 219099 222725 225844 228774 230993 231808 231642 231369 230660 228210 223512 217363 210742 204087 197556 191077
55627 191077 184330 177427 171360 167014 164018 161273 158268 155150 152062 149288 147528 147029 146862 146074 145113
55612 145113 145068 145920 146644 146644 145925 144227 141295 137835 134977 132833 130692 128493 126896 126001 125194 124360 124038
55595 124038 124247 124260 123723 123031 122393 121553 120613 120190 120502 121136 121912 123091 124459 125132 124615 123424 122420 122127
55577 122127 122831 124611 127103 129771 132480 135265 137740 139594 141541 144836 149743 155382 161121 167080
55563 167080 173104 178289 181969 184257 185200 184265 181224 176787 171823 166515 160784 154946 149393 144145 139208
55548A39208m269l493l429m241m941m507l093j812j478j753j633p47O4j64j081
55533A02631j445r45o28j176j843j741j275j396k060k419k188j884j865j973k020
55518G7773k066k158k256k331k260j776p78N09J843L130M194M801N053N239N207
55503I4124M451L090J991J638J526J049L61j39m91r14j323j577j729j726j363
55488I8968p37k23J90Q11J404J231K29p48j129j120q16O9J128J201M3j094j253
55471I8154j019j141j133l45N79O08r4o34p90q25n93K8L80j49r87j133o48l20
55453H9938l27k41j5O3N4R5j71r08j325o41N37R36L83k36m73o60q59o47j9M83
55433H5967O40O98O76K96l61q65j076j115q29m1Q02R57L70k79m68k04L15Q41J033
$$ plain form
55548 139208 134939 131446 128017 123776 118835 114328 111235 109423 107945 106192 104559 103812 103876 103712 102631
55533 102631 101186 100241 99613 98437 96594 94853 93578 92182 90122 87703 85515 83631 81766 79793 77773
55518 77773 75707 73549 71293 68962 66702 64926 64148 64657 66500 69630 73824 78625 83678 88917 94124
55503 94124 98575 101665 103656 105294 106820 107869 108230 108091 107600 106686 105363 103786 102057 100331 98968
55488 98968 98231 98008 98198 99009 100413 101644 101873 101125 99996 98876 98060 98129 99257 100458 100501 99407 98154
55471 98154 97135 95994 94861 94516 95095 95703 95609 94975 94185 93360 92767 92795 93175 93026 92039 90906 90258 89938
55453 89938 89611 89370 89355 89418 89472 89567 89396 88488 87163 86522 87059 87995 88378 88142 87669 87009 86150 85503 85484 85967
55433 85967 86607 87305 87981 88277 87916 87051 85975 84860 84031 83990 84792 85749 86119 85840 85372 85168 85483 86324 87357
55414H7357Q22O08N98L60l63q83m08O12R77L93k42k06K30M47K65m6j70l4M9l37
55394I0029j080j510j221n64m5K51L29J9n31p68n59m31n68m19J80N24K99K62P62
55375H4959Q17k45j299j039k4M05L62P79J277O78o88j198m45L64N55P63J230J167
55357H8418L20l33j46J94m0m62l79J98Q74J418J506P14p00j686j478l79P85J398
55339I0222J220M45l08n36m24l88l69k15k93q49j184o22J32q4q79p51N11J448
55321H7076J160L78q4m74j108j618j785j980k184j682m00O18P06M75N81O59K83
55304H0621m3K40O67M95r2l62o3N14J055J238Q18J62J04P23R87J43j170j834j602
55285H2601r05M1J161J989K062J570J049O89M17L21M68N81L66k0k35k04o5J23
$$ plain form
55414 87357 88179 88787 89385 89745 89382 88499 88091 88703 89680 90073 89831 89625 89855 90302 90567 90521 90351 90317 90366 90029
55394 90029 88949 87439 86218 85654 85609 85860 86189 86208 85677 84909 84350 83919 83351 82932 83112 83636 83935 84197 84959
55375 84959 85776 85531 84232 83193 83169 83574 83936 84715 85992 86670 85982 84784 84339 84703 85258 86021 87251 88418
55357 88418 88738 88405 88259 88453 88413 87951 87572 87770 88644 90062 91568 92282 91582 89896 88418 88039 88824 90222
55339 90222 91442 91887 91579 91043 90619 90231 89862 89647 89354 88505 87321 86699 86831 86747 85868 85117 85628 87076
55321 87076 88236 88614 88530 88056 86948 85330 83545 81565 79381 77699 77299 77917 78623 79098 79679 80338 80621
55304 80621 80578 80818 81485 81980 81888 81526 81463 81977 83032 84270 85088 85250 85354 86077 87064 87207 86037 84203 82601
55285 82601 81696 81737 82898 84887 86949 88519 89568 90257 90674 90995 91463 92044 92410 92390 92155 91951 91886 92009
55267I2009L08L53K67K39L62N05N44M26K8o14j032q22l12j40k56r7L89P09P85
55248I3651R58J052N66j16O7R98J121l31j970k057p25N30Q38M74n8m78o20n61
55230I3339o45r13r18m55J9J44K05M32M19j01n84m38N2K75K83M70O83M40k55r50
55210I1502j388j581j455j014o08n19n44l13K01Q46J525J998J864J178O29O72
55194I2993R19Q20M27L5m25j046j426j149m46R4K58K01O4m3j5n1n34j342j753
55175H7581j396p00j30L66P45N79o2k04P12J818J979J357Q82P52N04K16M49J118
55157I6566J433J041M72K65L60L98J80k30n45m75j87k29p30j050o99j05P5j06
55139I6434k77n49j137j599j378q18o60p11n3J368K312J762J68j158j449j027
$$ plain form
55267 92009 92317 92670 92937 93176 93538 94043 94587 95013 95041 94427 93395 92573 92261 92121 91865 91768 92157 92866 93651
55248 93651 94609 95661 96227 96111 96178 97176 98297 97966 95996 93939 93214 93744 94582 95056 94998 94520 93900 93339
55230 93339 92694 91781 90863 90408 90427 90571 90776 91208 91627 91526 90942 90504 90556 90831 91114 91584 92267 92707 92452 91502
55210 91502 90114 88533 87078 86064 85456 84937 84393 84080 84281 85127 86652 88650 90514 91692 92321 92993
55194 92993 93912 94732 95159 95194 94769 93723 92297 91148 90702 90796 91054 91255 91319 91276 91261 91210 90676 89334 87581
55175 87581 86185 85485 85355 85721 86466 87045 86983 86779 87491 89309 91288 92645 93527 94279 94783 94999 95448 96566
55157 96566 97999 99040 99512 99777 100137 100535 100715 100485 99940 99465 99278 99049 98319 97269 96570 96465 96540 96434
55139 96434 96157 95608 94471 92872 91494 90676 90016 89305 89252 90620 92932 94694 94862 93704 92255 91228
55123I1228p23r67j299q80M29J746K137J622Q14L2p48j343j418r61k57M75J004
55106I0891J024N96M16R84J810J971J295M33k6j3K90O25P31P25J080J726J715
55089A06273N02q32p06Q02J931J505K32n53n32l29m02o36p46o82n87o33q15j005
55071A02787j200j514j812j645q44P4M47K46p1j91j79k03l71o37o81j76N92Q87
55053I5509O01M64Q07Q50q3j290j585r49l56k56k70j33N2L82R82J343Q09k14n56
55034I6107J25R39J121R18P86O02J09m66o92m93j57m1l78r76j157n02M31O47K0
55015I6943n60m15J57M47K09k31l52J06Q19J039M91j55j73K34M34M81Q22J173
54997A01469P74k61r38q66o59n92j1J399K702K830J935R66M31K19J69K10J87M3
$$ plain form
55123 91228 90505 89538 88239 87359 87788 89534 91671 93293 94107 94139 93391 92048 90630 89669 89412 89887 90891
55106 90891 91915 92511 92927 93911 95721 97692 98987 99420 99394 99381 99671 100296 101027 101752 102832 104558 106273
55089 106273 106775 105943 105237 106039 107970 109475 109707 109154 108622 108293 107891 107255 106509 105827 105240 104607 103792 102787
55071 102787 101587 100073 98261 96616 95772 95846 96293 96539 96468 96277 96098 95895 95524 94887 94206 94030 94622 95509
55053 95509 96110 96574 97381 98231 98148 96858 95273 94324 93968 93712 93442 93309 93361 93743 94725 96068 96877 96663 96107
55034 96107 96232 97171 98292 99210 99996 100598 100707 100241 99549 99056 98899 98858 98480 97504 96347 95845 96276 96923 96943
55015 96943 96383 95968 96125 96572 96781 96550 96198 96304 97123 98162 98653 98498 98325 98559 98993 99474 100296 101469
54997 101469 102243 101982 101044 100178 99519 98927 98916 100315 103017 105847 107782 108748 109179 109398 109567 109777 109964 110007
54979A10007k7P6J59J21K05N25P78P23N91O28N97K30j55M0Q26J493J416O92k8
54960A18897k76j45JR3L95R25J210Q74J80l30m74l24J86R75J432R55j99j180j535
54941A21660j393q94j48L61J74l32m05r7q9l20J47J506K517K049N47o74r31l84
54923A23294O58J930L055L813M325M615M372L641L333M427O758R058J0129R740
54909A93148Q491P138N958M603K621J20k242l944m992n678o291p115q200r044
54895A74573q976p978o753n816n009m031k955k045j389r71p06l57K27P42Q03P38
54879A30097J345K737M007M374M060L776L874M349N130N988O593O918P226P499
54865A97973P371O761N908M600K192j182m255o070p047p933q411p755o369n625
$$ plain form
54979 110007 109980 110056 110215 110336 110541 111066 111844 112567 113158 113786 114383 114613 114458 114498 115324 116817 118233 118925 118897
54960 118897 118621 118476 118477 118570 118965 119890 121100 121974 122154 121824 121350 121026 121212 122187 123619 124574 124375 123195 121660
54941 121660 120267 119373 119225 119586 119760 119428 119023 118926 118837 118517 118664 120170 122687 124736 125283 124609 123678 123294
54923 123294 123952 125882 128937 132750 137075 141690 146062 149703 153036 157463 164221 173279 183408 193148
54909 193148 201639 208777 214735 219338 221959 222079 219837 215893 210901 205223 198932 191817 183617 174573
54895 174573 165597 157619 150866 145050 140041 136010 133055 131010 129621 128650 127944 127587 127814 128556 129359 130097
54879 130097 131442 134179 138186 142560 146620 150396 154270 158619 163749 169737 176330 183248 190474 197973
54865 197973 205344 212105 218013 222613 224805 223623 219368 213298 206251 198318 189907 182152 175783 170158
54851A70158o092o855o740n631m334l560l283k996k387j700j386j449j509j408
54837A20828j413j657j839j721j483j361j251q98k26O29J284J203K83o70o70R3
54821A11131M00l02j190j317p79j20N88J396J836J476O75J51J04K66M45M99K31
54804A15490j71r0N63R17L44n09n81J38Q30J112J195J113O77P4k77l63m13l26
54786A19723R0N18M94J10k60o74j214j292l57Q78J098K79j18Q55K464L460L586
54769A29640L372L166K944K712K614K809L422M426N512O362P016P680Q271Q579
54755A98525Q652Q502P616N521K757M36j215k968n150p009p937q363q822q896
54741A81649p927o200m678l790l267k881k621k207j255o3M16k66j363j742j146
$$ plain form
54851 170158 164066 157211 150471 144840 140506 136946 133663 130667 128280 126580 125194 123745 122236 120828
54837 120828 119415 117758 115919 114198 112715 111354 110103 109205 108979 109608 110892 112095 112378 111708 111038 111131
54821 111131 111531 111229 110039 108722 107943 107823 108411 109807 111643 113119 113794 113945 114049 114315 114760 115259 115490
54804 115490 115319 115229 115792 116709 117053 116544 115963 116101 116931 118043 119238 120351 121028 121102 120825 120462 120049 119723
54786 119723 119813 120331 120825 120935 120675 120001 118787 117495 117138 118016 119114 119393 119275 120130 122594 126054 129640
54769 129640 133012 136178 139122 141834 144448 147257 150679 155105 160617 166979 173995 181675 189946 198525
54755 198525 207177 215679 223295 228816 231573 232009 230794 227826 222676 215667 207730 199367 190545 181649
54741 181649 173722 167522 162844 159054 155787 152906 150285 148078 146823 146760 147176 146910 145547 143805 142659
54726A42659k52L40Q18J631K673L304L218K896L011L616M274M809N494O418P054
54711A91963O778N658M407L470K391L77k524n105o179n902n477n632n933n775
54697A72517n334n086m888m260l278k522k239k176k122k053j826j336r24r64j096
54682A32413o19K50L90o26j804k016j364o67k42J01L45L34L07N99R65Q68L62k0
54664A29576j30l01n32l67J97M33j22r45j271j045p31n55m34l68l38p1N49J040
54646A24585Q95M37M17Q45R67N11R8R4n6p71j328p75N18J176O50j63k77J22J92
54627A28137k97p12m40L69R93R43M57J01Mk37p89j140p65O7N71M21l7l77n05m95
54607A26269m58n33o60m82J82R00J123R46Q55Q55N16k00p76q79o33j85M21R03
$$ plain form
54726 142659 142407 142747 143565 145196 147869 151173 154391 157287 160298 163914 168188 172997 178491 184909 191963
54711 191963 198741 204399 208806 212276 214667 215044 212520 207415 201236 195334 189857 184225 178292 172517
54697 172517 167183 162097 157209 152949 149671 147149 144910 142734 140612 138559 136733 135397 134473 133509 132413
54682 132413 131794 132044 132434 131808 130004 127988 126624 125957 125715 125816 126161 126495 126802 127401 128366 129234 129596 129576
54664 129576 129446 129145 128613 128246 128443 128876 128754 127809 126538 125493 124762 124207 123773 123405 123067 122996 123545 124585
54646 124585 125480 125917 126334 127179 128146 128657 128755 128849 128793 128022 126694 125919 126437 127613 128263 128100 127823 127945 128137
54627 128137 127840 127128 126688 127057 128050 128993 129450 129551 129555 129318 128529 127389 126624 126691 127262 127683 127646 127269 126764 126269
54607 126269 125811 125278 124618 124136 124318 125218 126341 127287 128142 128997 129513 129313 128537 127658 127025 126840 127261 128164
54589A28164R28P02P04Q99R25R79J539K200J929P27j33KK16l41r88o58L64R27
54571A39085O94K80J59K62M04L84k6n76m61O28J837K151J646J028N57J83J42N20
54553A48897P25L62R1O03J240Q53l47j014o30RK02L6l16p94r04r7J124J636J411
54534A53087J597K647L533L383K684K261K043J628J234J237J312R04J25m69o98
54519A76508p07m92J2N23O52M90M72O91P17J40q84j683j713j172q21j018j241
54502A70474q42j0N19M66J74j10l71m02k3L01j59j197j729j231l77P9K10L40L40
54483A66452J10Q9O76J509J880J630J187J030J366K003K288J672N73J85J056K380
54467A86086L142L360L641L995L863L054K013J232Q83Q99J006P87J20n72q04n40
$$ plain form
54589 128164 129092 129794 130498 131397 132322 133301 134840 137040 138969 139696 139563 139565 139781 139440 138452 137794 138158 139085
54571 139085 139779 140059 140218 140480 140884 141268 141242 140666 140205 140833 142670 144821 146467 147495 148052 148235 148377 148897
54553 148897 149622 149984 150075 150678 151918 152771 152424 151410 150780 150789 150991 151027 150711 149917 149013 148916 150040 151676 153087
54534 153087 154684 157331 160864 164247 166931 169192 171235 172863 174097 175334 176646 177550 177675 177206 176508
54519 176508 175801 175309 175321 175844 176496 176986 177458 178149 178866 179006 178122 176439 174726 173554 172733 171715 170474
54502 170474 169632 169622 170141 170607 170781 170671 170300 169898 169875 170176 170017 168820 167091 165860 165483 165562 165772 166112 166452
54483 166452 166562 166651 167327 168836 170716 172346 173533 174563 175929 177932 180220 181892 182465 182650 183706 186086
54467 186086 189228 192588 196229 200224 204087 207141 209154 210386 211269 212168 213174 213961 214081 213509 212705 212165
54451B12165k7O08J203J365R22L73L46P38Q63M11k30o31q18j030j353j739k140
54434B11026k416k346j863j222q08p65q61p72m94l93p45j381j828j776j193k01
54418A91962Q59J384J017K14j25K72P01L96n54j356j358n89K78M10m66j677k238
54401A89130j931j393j104p56O8J152J913K172K204K206K131J966J835J759J593
54386B02945J266R32P53O61M02p2m07k74M8r7q04j365j227q47j008j690k164k033
54368A95019j464o27M33J333J473P75k35j075j502j257l58M12J66p89j232p10
54352A90362j03k12o89q00m83j33l5m19j387k367k435j640j199j775k382j844
54336A72459n44J37l11j201j775j788j248m08J17j10p31j118j158j070p34k2N48
$$ plain form
54451 212165 212138 212746 213949 215314 216236 216609 216955 217693 218556 218967 218737 218106 217288 216258 214905 213166 211026
54434 211026 208610 206264 204401 203179 202371 201606 200745 199973 199479 199086 198341 196960 195132 193356 192163 191962
54418 191962 192821 194205 195222 195436 195311 195583 196284 196680 196126 194770 193412 192823 193101 193511 193045 191368 189130
54401 189130 187199 185806 184702 183946 184014 185166 187079 189251 191455 193661 195792 197758 199593 201352 202945
54386 202945 204211 205143 205896 206557 206959 206887 206480 206206 206254 206157 205353 203988 202761 201914 200906 199216 197052 195019
54368 195019 193555 192928 193361 194694 196167 196942 196707 195632 194130 192873 192515 192927 193093 192304 191072 190362
54352 190362 190259 190047 189358 188558 188075 187942 187907 187488 186101 183734 181299 179659 178460 176685 174303 172459
54336 172459 171915 172052 171741 170540 168765 166977 165729 165321 165438 165328 164597 163479 162321 161251 160517 160495 161043
54319A61043K96n73j178j185j106j338j541j187k93N85Q56M13j87k30L09O79L31
54302A55694l95q25p18m7J320L050M009L307J535J19l25k75j86nK28J49l21q25
54284A65489j122j254j165o95n3K99K77J69qm99j169j513j426j288j148n37N97
54267A54954J427J210L08k91j23M18P15M96j29q56j426j761j880j733j227m34
54251A49668M01J066J433J401J008N19K27J66J75J24m7l49n84m97l27p72j980
54234A51632k925k472q72N13R03P38O65O76N37L01L0m63j104j281o02L66O67J41
54216A47450m24k86M17R30P13q4q48j125r99q94j081j448j696j659j381r86n40
54199A36059n4L71N35L62J33K51P77J363J643J503R92L23r1J9L03J47m30p68o34
$$ plain form
54319 161043 161339 160766 159588 158403 157297 155959 154418 153231 152938 153523 154379 154792 154605 154375 154684 155363 155694
54302 155694 155299 154474 153756 153709 155029 158079 162088 165395 166930 167049 166724 166449 166263 166258 166486 166635 166314 165489
54284 165489 164367 163113 161948 161253 161200 161499 161776 161945 161937 161438 160269 158756 157330 156042 154894 154357 154954
54267 154954 156381 157591 157899 157608 157485 157903 158618 159114 158985 158129 156703 154942 153062 151329 150102 149668
54251 149668 150069 151135 152568 153969 154977 155496 155723 155889 156064 156188 156141 155792 155208 154711 154384 153612 151632
54234 151632 148707 146235 145363 145876 146779 147517 148182 148858 149395 149696 149726 149263 148159 146878 146276 146642 147309 147450
54216 147450 147026 146740 147157 148087 148800 148716 147868 146743 145744 144850 143769 142321 140625 138966 137585 136599 136059
54199 136059 136005 136376 136911 137273 137406 137657 138434 139797 141440 142943 143935 144258 144167 144186 144489 144636 144206 143438 142804
54180A42804o47j245j875j777j087m67m9N13J235J710J761J546J180P32M50L90
54164A45174J41n29j074r35n33o00q07k04R90J323J64j266j539p55M5M44P24Q81
54146A41644N21k63p29l72M11P62L23l71m23M41J513J833J236M92L54P66J067
54129A49205P46j00r05j139p14LN54O82K84n29j211j105l33R5m64j320j374o45
54111A41730p0O0M92J661K821L003K196J200O33M61K69k62r54j196o15L28P53
54094A52510L70l04p23q30p85o13l39n4J84K88L8n14p45j30Q41J135N88J02K55
54075A51274N00J61m53n10J22P24O73J46j37L08J169J673J439Q45L64j1l22k33
54057A57732L33N72j76j182j208m51k77r51j105N9J421J640J040Q41J332J879
$$ plain form
54180 142804 142157 140912 139037 137260 136173 135706 135657 136170 137405 139115 140876 142422 143602 144334 144784 145174
54164 145174 145315 144786 143712 142777 142244 141644 140837 140633 141623 142946 143110 141844 140305 139550 139595 140039 140763 141644
54146 141644 142165 141902 141173 140801 141212 141974 142297 141926 141503 141944 143457 145290 146526 147018 147372 148138 149205
54129 149205 149951 149851 148946 147807 147093 147096 147650 148332 148616 148087 146876 145771 145438 145533 145069 143749 142375 141730
54111 141730 141660 141720 142212 143873 146694 149697 151893 153093 153726 154187 154456 154194 153240 152044 151429 151757 152510
54094 152510 152880 152576 151853 151023 150238 149625 149286 149232 149416 149704 149742 149228 148483 148353 149194 150329 150917 151019 151274
54075 151274 151774 151935 151482 150972 151094 151818 152491 152637 152500 152808 153977 155650 157089 157934 158298 158287 157965 157732
54057 157732 158065 158637 158461 157279 156071 155620 155343 154392 153287 153346 154767 156407 157447 158288 159620 161499
54041A61499K151K317K471K568K701K788K440J705J418K071K967L202L007L163
54027A96468L611L704L542L883M769N357N199M762M369L615K177O37j42J2N22
54012B42485P62N52J89J32N09Q56N63m13j574k491l152l653l920l848l503l102
53996B20392k877k902k985k772k161j457j006q02o43m62l37l39o19j358k312k672
53980A94688j834k69P97N92o03j947k817l021k641j854q88l7M18M53M55P79J178
53963A83449J006K21l20J18J170J860J788J383J161J220J445J713J846J676J211
53948B00947O65L13M23J094J986K502K448K284K493L038L682M490N541O478O865
53933B45249O873P080P681Q402R071R836J0770J1677J2295J2303J1232Q723M974
$$ plain form
54041 161499 163650 165967 168438 171006 173707 176495 178935 180640 182058 184129 187096 190298 193305 196468
54027 196468 200079 203783 207325 211208 215977 221334 226533 231295 235664 239279 241456 242093 241951 241963 242485
54012 242485 243247 243799 243988 244120 244629 245485 246048 245635 244061 241570 238418 234765 230845 226997 223494 220392
53996 220392 217515 214613 211628 208856 206695 205238 204232 203430 202787 202325 201988 201649 201030 199672 197360 194688
53980 194688 192854 192585 193382 193974 193371 191424 188607 185586 182945 181091 180203 180166 180584 181037 181492 182271 183449
53963 183449 184455 184676 184356 184474 185644 187504 189292 190675 191836 193056 194501 196214 198060 199736 200947
53948 200947 201612 201925 202348 203442 205428 207930 210378 212662 215155 218193 221875 226365 231906 238384 245249
53933 245249 252122 259202 266883 275285 284356 294192 304962 316639 328934 341237 352469 361192 366166
53920C66166O29l668p349r727j0280r191p273n298l589k163r14L23J514K268K238
53905C13686J662J170J147J585K376L347M055M041L347K382J299l9j467k449k721
53890C33421k645k651k768k860l032l487m156m690m800m545m330m596n302n839
53876B77720n655m906m193l786l440k947k422j972j539j213j300j806k198j996
53862B38347j417j121j385j857k116k217k480k868k887k237j388j137j598k004
53848B11635j715j066q55j220j457r68j3N84K97n61j109p91k3K82j03l95R8R44
53830B03564J127L23q95j875k334k127j292l12K49M37O89R01M85n58j298j086
53814A95998m18j87n23r03j005q63m07N29J707K544K756K647K662K847K859K453
$$ plain form
53920 366166 366795 363127 355778 346051 335771 326580 319307 314009 310420 308257 307343 307666 309180 311448 313686
53905 313686 315348 316518 317665 319250 321626 324973 329028 333069 336416 338798 340097 340058 338591 336142 333421
53890 333421 330776 328125 325357 322497 319465 315978 311822 307132 302332 297787 293457 288861 283559 277720
53876 277720 272065 267159 262966 259180 255740 252793 250371 248399 246860 245647 244347 242541 240343 238347
53862 238347 236930 235809 234424 232567 230451 228234 225754 222886 219999 217762 216374 215237 213639 211635
53848 211635 209920 208854 207999 206779 205322 204354 204341 204925 205222 204661 203552 202761 202738 203020 202917 202522 202620 203564
53830 203564 204691 205014 204119 202244 199910 197783 196491 196179 196428 196865 197554 198455 198940 198382 197084 195998
53814 195998 195580 195393 194870 193967 192962 192099 191692 192221 193928 196472 199228 201875 204537 207384 210243 212696
53798B12696J901J888K773M020M606M220L642L748M425M887M763M329L780K883
53784B64561J611N09R8K45M45N87R34J449J618J081J45n73q60j000j328j885k514
53767B65123l063l389l413l260l239l537l893l796l038k072j565j582j376k82
53753B27618J314K259J999J214R98J677K830L993M956N546N719N734N699N086
53739B76642L247L94k531m918o759p891p777o455m883l929l498l100k632k165
53725B23745j520o78k00n51j328j759j687j434j064m81M5J46Q0M28J108J415J055
53708B17320N09K42K20L59Q31J579K081J990J652J641J996K261K175J956J904
53693B38716J973J878J553J272J254J322J279J393J986K637K415J176p4m95m65
$$ plain form
53798 212696 214597 216485 219258 223278 227884 232104 235746 239494 243919 248806 253569 257898 261678 264561
53784 264561 266172 266681 266779 267024 267469 268056 268990 270439 272057 273138 273283 272710 271850 270850 269522 267637 265123
53767 265123 262060 258671 255258 251998 248759 245222 241329 237533 234495 232423 230858 229276 227900 227618
53753 227618 228932 231191 233190 234404 235402 237079 239909 243902 248858 254404 260123 265857 271556 276642
53739 276642 279889 280283 277752 272834 266075 258184 250407 243952 239069 235140 231642 228542 225910 223745
53725 223745 222225 221547 221347 220796 219468 217709 216022 214588 213524 213043 213088 213234 213314 213742 214850 216265 217320
53708 217320 217829 218071 218291 218650 219481 221060 223141 225131 226783 228424 230420 232681 234856 236812 238716
53693 238716 240689 242567 244120 245392 246646 247968 249247 250640 252626 255263 257678 258854 258780 258285 257820
53678B57820p40j146j003m24k49p46j255j176o57j00L78P35P97M40k63j112j759
53661B49540j752j021k03J9k43l85k66k58m46n25m21l64k45L06J062J246P27L61
53643B47132P48J331J308R25J133K207L286L366K389J216O78P50P73L82m9j55
53627B67420k59q73j775k218j876j024J32J524K694K971K380J655J266J002P26
53612B73745Q08J485K415L141L549L655L446L072K768K463K025J810K207K672
53598C09261K209R52J30J72J1j081k205k243j553j132r62m39J51j1p69j131q66
53581C00494p76j264j712j570j081o42j89K70K04q15k305l176k740j321Q1P00
53565B84158O30N58P53P03K4o84n06M16R29M69r9M07J859K893K518J297O75J343
$$ plain form
53678 257820 257080 255934 254931 254507 254258 253512 252257 251081 250424 250324 250702 251437 252234 252674 252411 251299 249540
53661 249540 247788 246767 246564 246583 246340 245955 245689 245431 244985 244460 244039 243675 243430 243736 244798 246044 246771 247132
53643 247132 247880 249211 250519 251444 252577 254784 258070 261436 263825 265041 265719 266469 267242 267624 267575 267420
53627 267420 267161 266288 264513 262295 260419 259395 259527 261051 263745 266716 269096 270751 272017 273019 273745
53612 273745 274553 276038 278453 281594 285143 288798 292244 295316 298084 300547 302572 304382 306589 309261
53598 309261 311470 312422 312552 312724 312735 311654 309449 307206 305653 304521 303559 303120 303271 303260 302491 301360 300494
53581 300494 299718 298454 296742 295172 294091 293449 293260 293530 293734 292919 290614 287438 284698 283377 283458 284158
53565 284158 284788 285346 286099 286802 286826 286142 285636 286052 286981 287450 287351 287758 289617 292510 295028 296325 297000 298343
53547B98343K549L192L202L339L850M079L652L214L501M245M737N041N765O908
53533C55617P766Q076Q381R092R871J0311J0640J1306J2206J2788J2804J2631
53521D81489J2800J3428J4197J4844J5611J6935J8736K0231K0824K0855K1163
53510F71113K2099K3376K4715K6034K7013K7118K6333K5442K5184K5434K5513
53499I49374K5070K4401K3998K4099K4580K5026K5035K4601K4194K4220K4468
53488A219066K4336K3558K2495K1567K0672J9400J7663J5801J4043J2211J0104
53477A420916P963O283N295M771M269L331J648p20l301n592p492r167j0770j2536
53463A404898j4873j7774k0309k1395k1199k1023k1679k2681k3401k4225k5780
$$ plain form
53547 298343 300892 304084 307286 310625 314475 318554 322206 325420 328921 333166 337903 342944 348709 355617
53533 355617 363383 371459 379840 388932 398803 409114 419754 431060 443266 456054 468858 481489
53521 481489 494289 507717 521914 536758 552369 569304 588040 608271 629095 649950 671113
53510 671113 693212 716588 741303 767337 794350 821468 847801 873243 898427 923861 949374
53499 949374 974444 998845 1022843 1046942 1071522 1096548 1121583 1146184 1170378 1194598 1219066
53488 1219066 1243402 1266960 1289455 1311022 1331694 1351094 1368757 1384558 1398601 1410812 1420916
53477 1420916 1428879 1435162 1440457 1445228 1449497 1452828 1454476 1453756 1450455 1444863 1437371 1428204 1417434 1404898
53463 1404898 1390025 1372251 1351942 1330547 1309348 1288325 1266646 1243965 1220564 1196339 1170559
53452A170559k7604k8478k7933k6614k5151k3489k1507j9656j8485j7881j7230
53441I16531j6222j5130j4262j3441j2194j0357q300o468m914l420j889l73J185
53428H10746K924M821O814R084J1793J4487J6390J7440J8495K0227K2280K3928
53416I79429K5111K6277K7567K8770K9963L1606L3895L6385L8389L9598M0361
53405A337351M1470M3530M6402M9365N1916N4151N6286N8177N9618O0724O1650
53394A920640O2205O2138O1623O1036O0487N9909N9331N8668N7395N4996N1622
53383B570050M7973M4518M1229L7879L4222K9977K5115K0102J5483J1273P110
53372B884931K869j299n403r663j4164j9026k4767l1840l9696m6942n2701n7343
$$ plain form
53452 1170559 1142955 1114477 1086544 1059930 1034779 1011290 989783 970127 951642 933761 916531
53441 916531 900309 885179 870917 857476 845282 834925 826625 820157 815243 811823 809934 809561 810746
53428 810746 813670 818491 825305 834389 846182 860669 877059 894499 912994 933221 955501 979429
53416 979429 1004540 1030817 1058384 1087154 1117117 1148723 1182618 1219003 1257392 1296990 1337351
53405 1337351 1378821 1422351 1468753 1518118 1570034 1624185 1680471 1738648 1798266 1858990 1920640
53394 1920640 1982845 2044983 2106606 2167642 2228129 2288038 2347369 2406037 2463432 2518428 2570050
53383 2570050 2618023 2662541 2703770 2741649 2775871 2805848 2830963 2851065 2866548 2877821 2884931
53372 2884931 2887800 2886501 2881098 2871435 2857271 2838245 2813478 2781638 2741942 2695000 2642299 2584956
53360B584956o1612o5552o8610p0415p0945p0288o8721o6909o5492o4501o3477
53349A848434o2209o0891n9538n7780n5528n3436n2203n1591n0726m9230m7463
53338A247839m5568m3088l9882l6713l4323l2416l0231k7650k5012k2285j9416
53327H91255j7040j5656j4312j1566p796n087m342m053k658n89J018K330M087
53314H15591N901O828P097P743Q943J0146J1475J3558J5997J7596J8175J8857
53302I57907K0305K1948K3305K4807K6804K8815L0316L1410L2219L2464L2176
53291A262476L2028L2352L2575L2111L1166K9979K8094K5104K1662J8814J6686
53280A563047J4502J1786Q786N866L030J64k698n408p764r653j1284j3178j5604
$$ plain form
53360 2584956 2523344 2457792 2389182 2318767 2247822 2177534 2108813 2041904 1976412 1911911 1848434
53349 1848434 1786225 1725334 1665796 1608016 1552488 1499052 1446849 1395258 1344532 1295302 1247839
53338 1247839 1202271 1159183 1119301 1082588 1048265 1015849 985618 957968 932956 910671 891255
53327 891255 874215 858559 844247 832681 824885 819798 815456 811403 808745 808156 809174 811504 815591
53314 815591 821492 828320 835417 843160 852103 862249 873724 887282 903279 920875 939050 957907
53302 957907 978212 1000160 1023465 1048272 1075076 1103891 1134207 1165617 1197836 1230300 1262476
53291 1262476 1294504 1326856 1359431 1391542 1422708 1452687 1480781 1505885 1527547 1546361 1563047
53280 1563047 1577549 1589335 1598121 1603987 1607017 1607181 1604483 1599075 1591311 1581658 1570374 1557196 1541592
53267A541592j8172k0230k1642k2954k4814k7327l0004l2233l3836l5146l6482
53256A238752l7690l8402l8611l8671l8745l8611l8038l7043l5713l4077l2253
53245H30898l0466k8871k7549k6638k6204k5948k5452k4730k4210k4123k4138
53234E42569k3691k2431k0419j8144j6185j4602j2822j0506q299p094o822o663
53222C74891o316o254o627o826o463o029o064o357o400o142n732n027l956l011
53208B93687k817l308l811l790l190k253j414j209j827k741l163k873k407k329
53194B56555k591k683k308j740j452j461j263n08M37Q69M92m32j473k295k658
53179B37489k550k214j743q96K93J056O53n24j320j220p20l29K3L82L73k09r06
$$ plain form
53267 1541592 1523420 1503190 1481548 1458594 1433780 1406453 1376449 1344216 1310380 1275234 1238752
53256 1238752 1201062 1162660 1124049 1085378 1046633 1008022 969984 932941 897228 863151 830898
53245 830898 800432 771561 744012 717374 691170 665222 639770 615040 590830 566707 542569
53234 542569 518878 496447 476028 457884 441699 427097 414275 403769 395470 388376 381554 374891
53222 374891 368575 362321 355694 348868 342405 336376 330312 323955 317555 311413 305681 300654 296698 293687
53208 293687 290870 287562 283751 279961 276771 274518 273104 271895 270068 267327 264164 261291 258884 256555
53194 256555 253964 251281 248973 247233 245781 244320 243057 242549 242986 243855 244347 243915 242442 240147 237489
53179 237489 234939 232725 230982 230086 230379 231435 232088 231564 230244 229024 228304 227975 227998 228380 228753 228544 227638
53162B27638j085n43M52J390J717J250N01R6p7n28j098j023k13M35K33n27j246
53145B27372j666j551o27P08J425J118M86J06l02r05j012j98P39R15O79P63P81
53128B28831j08j480k043j576j206j593k079j930j373r47o36j87L02O29Q68J076
53112B16548R30J35r99j703j552q73m11n77j087j384j360j371j590j651j224m95
53096B01336J66O93J069R66J94p50j151j007q97j003q94l79L5j02m46k55O18J500
53078A99693J638R94K15r2Kj41j000k331l328l299k259r43j57l2k9K13L81Q8l91
53059A89222n22m09n80r51q19J8Q95J239J206J076P49K42qJ90L84K43N9N7j47
53040A92144p53j080m41P16J324J037L76j49m63n96n85n98p31p89n76j38M51J113
$$ plain form
53162 227638 226553 226010 226462 227852 229569 230819 231320 231416 231339 230811 229713 228690 228477 228912 229145 228618 227372
53145 227372 225706 224155 223528 224236 225661 226779 227265 227371 227069 226164 225152 224954 225693 226608 227287 228050 228831
53128 228831 228723 227243 225200 223624 222418 220825 218746 216816 215443 214496 213860 213673 213975 214604 215472 216548
53112 216548 217478 217613 216614 214911 213359 212486 212075 211498 210411 209027 207667 206296 204706 203055 201831 201336
53096 201336 201502 202195 203264 204230 204424 203674 202523 201516 200619 199616 198722 198343 198378 198276 197830 197575 198193 199693
53078 199693 201331 202325 202540 202448 202450 202309 201309 198978 195650 192351 190092 189149 188992 188960 188931 189144 189525 189613 189222
53059 189222 188700 188291 187711 186760 185941 185959 186854 188093 189299 190375 191124 191366 191358 191548 191932 192175 192234 192291 192144
53040 192144 191391 190311 189870 190586 191910 192947 193323 193174 192711 192115 191530 190932 190201 189412 188836 188698 189149 190262
53022A90262J339M57j242k379k100j118n07k57J12L08k22j061j325j021q22p78
53006A79646m24J05K84L27Q41J457J196J91k72K54P05K65m71o58m67m47n08k97
52988A81727M8J53m0m82j235k058k238j412q8R80J565J756J535R70M41K86M20
52971A82328N80N93L21k54p67p70m41l54m82o4J172K387K668K149J549J147O66
52954A92428q6j000j777j965j224P6Q78N04n46j269j354j295j544j980k165j818
52938A75863j004j00M49M01j68r63j579j635j137n74l85l99j49L92P73O75J30
52921A70590o78j348j232j23J139J459Q45K04j20n66j106r07K62J382J492Q59
52905A72152K00l96j056j360r21j64J98J94K80M68M56L41M20N05J86l62n32j44
$$ plain form
53022 190262 191601 192058 190816 188437 186337 185219 184712 184455 184567 184875 184653 183592 182267 181246 180424 179646
53006 179646 179222 179327 179611 179938 180779 182236 183432 183623 183351 183605 184310 184575 184104 183446 182979 182532 182024 181727
52988 181727 181775 181928 181888 181406 180171 178113 175875 174463 174375 175355 176920 178676 180211 181181 181622 181908 182328
52971 182328 182908 183501 183822 183568 182801 182031 181590 181236 180754 180690 181862 184249 186917 189066 190615 191762 192428
52954 192428 192342 191342 189565 187600 186376 186452 187330 187834 187288 186019 184665 183370 181826 179846 177681 175863
52938 175863 174859 174759 175208 175609 175441 174478 172899 171264 170127 169553 169168 168769 168620 169012 169785 170460 170590
52921 170590 169912 168564 167332 167209 168348 169807 170652 170856 170736 170170 169064 168157 168419 169801 171293 172152
52905 172152 172352 171956 170900 169540 168619 168455 168653 168847 169127 169595 170051 170392 170812 171317 171503 171141 170609 170465
52887A70465L93P02P28M90J15M4N96J305J175j97k055l124k700j166L88J098J032
52870A69289Q55Q93Q64O08M99Q09J136R49L66p0j26J07N72J187J626J658J563
52853A82785J782K233K404K018J270N26N7j5J45K07J21J70L54J05r32k219k931
52836A88080k947k783k686k423j858j242q36o38m64j17L87O37J49q22j187k30
52820A71020J424K522K620K280K037J859J567J157O30r1q88j379j215l46Q46J666
52804A85709J652J167J051J486J812J751J945K679K874J399j159l139l904m154
52790A91169m416m479m333m350m311l452j844o56m91n65o0O43Q04N16K41j05p56
52773A63555j235q70J15Q38R20P21N51K92j83p39j141j178o88K00J033J596K133
$$ plain form
52887 170465 170858 171560 172288 172778 172893 172937 173533 174838 176013 175816 173761 170637 167937 166771 167159 168257 169289
52870 169289 170144 171037 171901 172509 173008 173817 174953 175902 176268 176198 176072 176179 176751 177938 179564 181222 182785
52853 182785 184567 186800 189204 191222 192492 193018 193075 193060 193205 193412 193533 193703 194057 194162 193230 191011 188080
52836 188080 185133 182350 179664 177241 175383 174141 173305 172667 172203 172086 172473 173110 173259 172437 171250 171020
52820 171020 172444 174966 177586 179866 181903 183762 185329 186486 187116 187025 186137 184758 183543 183197 184043 185709
52804 185709 187361 188528 189579 191065 192877 194628 196573 199252 202126 203525 202366 199227 195323 191169
52790 191169 186753 182274 177941 173591 169280 165828 163984 163328 162837 162272 162212 162855 163659 164175 164416 164311 163555
52773 163555 162320 161450 161565 162403 163323 164044 164595 164887 164704 163965 162824 161646 160958 161158 162191 163787 165920
52756A65920K735K791J761K19n64j37O75R22N32J7l32n58o73n74j95L89R22J011
52738A74861M75l48q03n79P2P61J270J446J140O01M64R66J447J075J5o93m48K81
52720A82003P46Q50R18R35O11l5o56j150j774k496k737k071r03j72l86j117j452
52703A71114r21l3J84o30j593j592p56k86p17j148o74J94L37k17l95J79O58M29
52685A64133R9M49J102J084L42j22L23J089J206O38K49O09J211J154K92o23r20
52668A72315o65k25L94J300K154K419K115J784J648J348O38j59o02o15l53P1M24
52651A83991L71m2k23K35R55J294J210J184J481J905K154K016J317J01j182k042
52635A94725k469k633k275j044N38J191L44j068j677j172k71M55J010J425J473
$$ plain form
52756 165920 168655 171446 173207 173426 172862 172725 173400 174322 174854 174871 174539 173981 173308 172734 172539 172928 173850 174861
52738 174861 175336 174988 174185 173606 173678 174439 175709 177155 178295 178896 179360 180326 181773 182848 182863 182170 181722 182003
52720 182003 182749 183599 184517 185452 186063 186028 185372 184222 182448 179952 177215 175144 174241 174069 173683 172566 171114
52703 171114 170193 170160 170344 169714 168121 166529 165773 165487 164770 163622 162948 163142 163479 163262 162867 163046 163704 164133
52685 164133 164232 164681 165783 166867 167209 167087 167410 168499 169705 170343 170592 171201 172412 173566 173858 173235 172315
52668 172315 171650 171425 171819 173119 175273 177692 179807 181591 183239 184587 185225 185066 184464 183849 183496 183567 183991
52651 183991 184362 184320 184097 184332 185287 186581 187791 188975 190456 192361 194515 196531 197848 197949 196767 194725
52635 194725 192256 189623 187348 186304 186842 188033 188377 187309 185632 184460 184189 184644 185654 187079 188552
52620A88552J124P54O49N69J22o85j448j801j682j233o66j68J62K87J37l14p89
52603A83570p87j49N44M56n75j794k226j569l57O03R14P82O85Q68J219J515J618
52586A85317J396P55o7m60QJ048J964K354K297J962J455J050J078J409J442P81
52570B03789k81j124j388j082m56rk45j115j923k048j581r56l35K80N70J89n69
52553A91716r13n67j24k29p65j157j109p25j64M31P50M59l09q85p02J26R97J480
52535A88310J561J321P30n6n31l24K00K46m08j061r10K7R86J299R02J89m13o77
52517A91391n89k14M02J122J573J410P97L77N72J157J668J958K119K133J992J927
52501B09795K080K071J361R7r20j171r73q80r70j055j228j747k418k536j672k12
$$ plain form
52620 188552 189676 190430 191079 191648 191770 191085 189637 187836 186154 184921 184255 184087 184249 184536 184673 184359 183570
52603 183570 182783 182634 183178 183634 183059 181265 179039 177470 177113 177716 178630 179412 180097 180965 182184 183699 185317
52586 185317 186713 187468 187401 186941 186949 187997 189961 192315 194612 196574 198029 199079 200157 201566 203008 203789
52570 203789 203508 202384 200996 199914 199458 199449 199204 198089 196166 194118 192537 191581 191246 191526 192096 192285 191716
52553 191716 190803 190236 190112 189883 189118 187961 186852 186127 185963 186394 187144 187603 187294 186409 185707 185833 186830 188310
52535 188310 189871 191192 191922 191866 191335 191011 191211 191457 191049 189988 189078 189105 190091 191390 192292 192481 192068 191391
52517 191391 190802 190588 190990 192112 193685 195095 195892 196269 196841 197998 199666 201624 203743 205876 207868 209795
52501 209795 211875 213946 215307 215404 214484 213313 212340 211460 210490 209435 208207 206460 204042 201506 199834 199622
52485A99622J026J555J463J056N94L26M38P86R22O32K60J97L12K58K12P11J735
52468B12105K496K434J944J731J803J557P13l05q83p50m4R16J739K089J798R45
52452B30288j43j049j543j781k051k361k479k313j947j357m89L26N93L25K9j64
52436B13884o80j552k055j800j433j606j822j197K5P57N73N9k76n17p30p26o01
52419B00303o99q95o28J53P73Q30O58N92M48J12j2M02J079J600J898K006J833
52402B10453J560J753K617L659M536N549O691O873N107K213K08j14m6j091k959
52387B47009m047l503k108j170j042j039n80L0R5l98o44m3R34J230M55n99p77
52370B33803K95J926L120L477L307L036K728K229J533P85M9o24j062j135j060
$$ plain form
52485 199622 200648 202203 203666 204722 205316 205642 206080 206866 207788 208420 208680 208877 209189 209447 209659 210370 212105
52468 212105 214601 217035 218979 220710 222513 224070 224783 224478 223595 222845 222801 223717 225456 227545 229343 230288
52452 230288 230145 229096 227553 225772 223721 221360 218881 216568 214621 213264 212775 213101 213694 214019 214048 213884
52436 213884 213204 211652 209597 207797 206364 204758 202936 201739 201764 202521 203094 203153 202877 202360 201630 200904 200303
52419 200303 199604 198709 198081 198234 199007 199837 200495 201087 201535 201647 201635 202037 203116 204716 206614 208620 210453
52402 210453 212013 213766 216383 220042 224578 230127 236818 243691 248798 251011 251219 251105 251059 249968 247009
52387 247009 242962 239459 237351 236181 235139 234100 233520 233550 233645 233247 232603 232560 233494 234724 235179 234580 233803
52370 233803 234098 236024 239144 242621 245928 248964 251692 253921 255454 256239 256288 255664 254602 253467 252407
52355B52407j218j674k106k261k185k017j749j286n89J82O26L65l88p84k17Q86
52339B37992J607J696J631J664J510J037O30O36R95J566K309K995L346L605M295
52324B67514N215N507N018M792N619O870P435P177O613N821M625L443K901K716
52310C41266J978N50o36p57J48J578L006L861L789L174K785K780K675K294K071
52295C70562K194K194J786J474J884K878L700L675K543N63j440k551k608k225
52281C84629j808j091N1J006J224J077J241J598J540J109J034J582K180K361K436
52266D00169K887L588M004L874L385K866K582K712L241L943M564M940M929M408
52252D52092L455K381J423O46K80Q37K488M397N158M157K257Q97O37Q83R67J023
$$ plain form
52355 252407 251189 249515 247409 245148 242963 240946 239197 237911 237322 237504 238130 238495 238107 237323 237106 237992
52339 237992 239599 241295 242926 244590 246100 247137 247767 248403 249398 250964 253273 256268 259614 263219 267514
52324 267514 272729 278236 283254 288046 293665 300535 307970 315147 321760 327581 332206 335649 338550 341266
52310 341266 343244 343794 343158 342401 342549 344127 347133 350994 354783 357957 360742 363522 366197 368491 370562
52295 370562 372756 374950 376736 378210 380094 382972 386672 390347 392890 393453 392013 389462 386854 384629
52281 384629 382821 381730 381781 382787 384011 385088 386329 387927 389467 390576 391610 393192 395372 397733 400169
52266 400169 403056 406644 410648 414522 417907 420773 423355 426067 429308 433251 437815 442755 447684 452092
52252 452092 455547 457928 459351 459997 460277 461114 463602 467999 473157 477314 479571 480468 481105 481988 482955 483978
52236D83978J540K392K871K658K255K244K621L113L748M559N025M555L420K610
52222E27589K647L137L657M311N131N576N249M604M329M379M224L780L423L264
52208E85300L132L184L827M981O005O460O376N856N030M389M416M754M554L817
52194F52081L475L856M014L178J991J579K000K501K768L040L289L181K715K258
52180F91926K017K049K486L122L120J895L4j427k385l503m863n789n975n787n386
52165F71534m514l365k657k563k426j853j234p79l6J136J994K065K085K903L993
52150F66283M001K522N28q56j287j006l83K49P39J212J778K257K461K510K553
52135F83561K319J405q2j512k357k551k304j843j291n70N00J849L088M017N029
$$ plain form
52236 483978 485518 487910 490781 493439 495694 497938 500559 503672 507420 511979 517004 521559 524979 527589
52222 527589 530236 533373 537030 541341 546472 552048 557297 561901 566230 570609 574833 578613 582036 585300
52208 585300 588432 591616 595443 600424 606429 612889 619265 625121 630151 634540 638956 643710 648264 652081
52194 652081 655556 659412 663426 666604 668595 670174 672174 674675 677443 680483 683772 686953 689668 691926
52180 691926 693943 695992 698478 701600 704720 706615 706649 705222 702837 699334 694471 688682 682707 676920 671534
52165 671534 667020 663655 660998 658435 656009 654156 652922 652143 652107 653243 655237 657302 659387 662290 666283
52150 666283 670284 672806 673334 672478 671191 670185 669802 670051 670790 672002 673780 676037 678498 681008 683561
52135 683561 685880 687285 687203 685691 683334 680783 678479 676636 675345 674775 675275 677124 680212 684229 689258
52120F89258O599Q501R893J0296J0130J0164J0603J0932J0634R788Q781P610N882
52107H09071L592J462J8j249l168n502p087p326o788o087n050l449j853r93o32
52092G64959J82J846L695M818N027M899N028N257M792L174J003p52j919l029m105
52077G94875m436l755k795k240j838j116l04J04J67K13K14P2R8N09Q60O66L11
52060G81605N22J265J776J567P38m52j720k688l267l883m651m841l850k409j830
52045G57882k261k666k461k130k207k573l024l594m036l760k694j621j271j556
52031G22028j858j654p17P99K314L288L830M413N140N774O380P183P877P910P504
52016G80211P505Q040Q288P806P174O894O582N818M983M631M606M373L659K301
$$ plain form
52120 689258 695857 704358 714251 724547 734677 744841 755444 766376 777010 786798 795579 803189 809071
52107 809071 812663 814125 814143 812894 809726 804224 797137 789811 783023 776936 771886 768437 766584 765591 764959
52092 764959 765141 766987 770682 775500 780527 785426 790454 795711 800503 803677 804680 803928 802009 798980 794875
52077 794875 790439 786684 783889 781649 779811 778695 778391 778495 778662 778875 779089 779161 779259 779768 780628 781294 781605
52060 781605 782127 783392 785168 786735 787473 787021 785301 782613 779346 775463 770812 765971 762121 759712 757882
52045 757882 755621 752955 750494 748364 746157 743584 740560 736966 732930 729170 726476 724855 723584 722028
52031 722028 720170 718516 717799 718598 720912 724200 728030 732443 737583 743357 749737 756920 764797 772707 780211
52016 780211 787716 795756 804044 811850 819024 825918 832500 838318 843301 847932 852538 856911 860570 862871
52002H62871P7k738n261p056q681j0584j2164j2829j3261j4614j6811j8699j9671
51989G20579k0050j9993j9196j7809j6573j5689j4371j2078r491p729p083p028
51977E53489p141p402p796q023p746o945o040n711o336p518q309q029o745m949
51963D54799l130j658o66K53J887M490P217Q902R314R291R618J0177J0284R515
51949E30293Q016O214M410K505J54k662n081n801m397j933Q3J279K588M875P842
51934E48385J0424J1943J2632J3119J3603J3607J2572J0673Q766P384N916L242
51922F72266r73n957j0756j4920j8257k0474k1440k1414k0752j9589j8009j6265
51910D83460j4577j3006j1622j0469r290p763o162n158m689l689j481J138K896
$$ plain form
52002 862871 862948 860210 854949 847893 839212 828628 816464 803635 790374 775760 758949 740250 720579
51989 720579 700529 680536 661340 643531 626958 611269 596898 584820 575329 567600 560517 553489
51977 553489 546348 538946 531150 523127 515381 508436 502396 496685 490349 482831 474522 466493 459748 454799
51963 454799 451669 450011 449345 449598 451485 455975 463192 472094 481408 490699 500317 510494 520778 530293
51949 530293 538309 544523 548933 551438 551592 548930 543849 538048 533651 531718 531801 533080 535668 540543 548385
51934 548385 558809 570752 583384 596503 610106 623713 636285 646958 655724 663108 669024 672266
51922 672266 671293 665336 654580 639660 621403 600929 579489 558075 537323 517734 499725 483460
51910 483460 468883 455877 444255 433786 424496 416733 410571 405413 400724 397035 395554 396692 399588
51897C99588L641M214N095O109P180Q430R490R560Q391O504M263J396k229n903
51883D65729q574r746r644q738p433o026m675l339j763K64K543M377N301N871
51869D24147P190R426J1356J1838J1130J0162R135P611N538L263Q34j816m198
51856E05616n781o932q348r662r721q344o595n162l552j284J133K943M044M718
51842D53073N134N517O137O758O773O098N271M506L442J976L43j746m873q394
51828D90015j0566j0746j0275j0248r794p734m827k845k181j868j508j663k484
51815D13276l327l726l698l107j770j94P96J210J752K540K907K613K311K586L255
51800D17424L814L838K823M94k462m673n428n239m917m622m063l066j701l21L62
$$ plain form
51897 399588 403229 407443 412538 418647 425827 434257 443747 453307 461698 468202 472465 473861 471632 465729
51883 465729 457155 447409 437765 429027 421594 415568 410893 407554 405791 406055 408598 412975 418276 424147
51869 424147 431337 440763 452119 463957 475087 485249 494384 501995 507533 510796 511630 509814 505616
51856 505616 499835 492903 484555 474893 465172 456828 450233 445071 441519 440235 441368 444311 448355 453073
51842 453073 458207 463724 469861 476619 483392 489490 494761 499267 502709 504685 505028 503282 498409 490015
51828 490015 479449 468703 458428 448180 438386 430652 425825 422980 420799 418931 417423 415760 413276
51815 413276 409949 406223 402525 399418 397648 397454 398250 399460 401212 403752 406659 409272 411583 414169 417424
51800 417424 421238 425076 427899 428393 425931 421258 415830 410591 405674 401052 396989 393923 392222 391901 392263
51785C92263k58j920l583m426m373l687k619j543q18k88N11J453J709P94q07k283
51769C70125l196l234k074k4J715K215J952K184L371M873O065P029Q030Q866R054
51754D16951Q371P018N359L654J894j66k647n188p108q014q055p536o531n127
51740C92875l753k812k060q10J051K773L740M377N529P257Q915J0245J1671J3305
51726D52303J4434J4299J2966J0931Q421N564K997J676K071L761N677O457M967
51713E46524J091l881p987r956r866q674p279n922m424l068k965m971q159j0199
51699D60264r683p502n366l686j818J73J238Q57k68j276k016k515k416j500k28
51684D24258Q22J649K378K446J016j778m496n687n232m199l448k791j534M56K621
$$ plain form
51785 392263 392005 390085 386502 382076 377703 374016 371397 369854 369036 368748 369259 370712 372421 373215 372408 370125
51769 370125 366929 363695 361621 361597 363312 365527 367479 369663 373034 377907 383972 391001 399031 407897 416951
51754 416951 425322 432340 437699 441353 443247 443081 440434 435246 428138 420124 412069 404533 398002 392875
51740 392875 389122 386310 384250 383440 384491 387264 391004 395381 400910 408167 417082 427327 438998 452303
51726 452303 466737 481036 494002 504933 513354 518918 521915 523591 525662 529423 535100 541557 546524
51713 546524 547615 543734 535747 525791 515925 507251 499972 494050 489626 486558 483593 478622 470463 460264
51699 460264 450581 443079 437713 434027 432209 432382 433620 434477 434209 432933 430917 428402 425986 424486 424258
51684 424258 425080 426729 429107 431553 432569 430791 426295 420608 415376 411177 407729 404938 403404 403860 406481
51669D06481M489O134P771R333J0617J1555J2083J2156J2147J2841J4576J6579
51657E36762J7533J6589J3585Q672K287m632j0953j5895j9026k0036j8956j6442
51645D89488j3315r920o328k988n49P83J159M78j524m531p618j0048j1640j2310
51631D11137j1910j0662r242q178p424o713n958n230m564l896l035j789l93N08
51617C32651N65K14j9k59p56j074o91r9k33q61q01K24J095J039N92L31j79j311
51599C30428k272k126j215n03j12M63J119J289J154J635L117N041O834Q427R747
51584C63026J0479J0556J0162R037O543K846n56k034j368L45K001L357M773O619
51570D25786R024J1919J5114J8275K0929K2629K3341K3678K4517K6209K8255K9870
$$ plain form
51669 406481 410970 417104 424875 434208 444825 456380 468463 480619 492766 505607 520183 536762
51657 536762 554295 570884 584469 593141 595428 590796 579843 563948 544922 524886 505930 489488
51645 489488 476173 466253 459925 456937 456388 457171 458330 458808 457284 452753 445135 435087 423447 411137
51631 411137 399227 388565 379323 371145 363721 357008 351050 345820 341256 337360 334325 332536 332143 332651
51617 332651 333216 333430 333411 333152 332396 331322 330631 330532 330299 329438 328637 328861 329956 330995 331587 331918 331739 330428
51599 330428 328156 326030 324815 324312 324200 324663 325782 327071 328225 329860 332977 338018 344852 353279 363026
51584 363026 373505 384061 394223 403260 409803 412649 412093 410059 408691 409036 411037 414394 419167 425786
51570 425786 434810 446729 461843 480118 501047 523676 547017 570695 595212 621421 649676 679546
51558F79546L0750L1154L1444L1854L2768L4755L7979M1649M4400M5279M4017
51547A085595M0316L3371K2668R139n007j7756k8392l7145m4210m9403n2549n3810
51535I02817n3543n1970m9094m4924l9788l4361k9339k5013k1177j7473j3800
51524E22335j0516q233p283p284p380o985o201n447m988m914n293n967o464o505
51510D28875o428o651o820o008l930j551k45n78j978l388m152m361m496m686m519
51495C69084l729k804k513k921l308l042k185j240o44n14n78l36M17J225J483
51480C48395J152O75K77j51o03r24j174j500j692j470j185j500k312k740k366
51465C32882j686j136n21K01M38q9o32m63o3m28j487k096j495q0J262K042K328
$$ plain form
51558 679546 710296 741450 772894 804748 837516 872271 910250 951899 996299 1041578 1085595
51547 1085595 1125911 1159282 1181950 1191089 1186082 1168326 1139934 1102789 1058579 1009176 956627 902817
51535 902817 849274 797304 748210 703286 663498 629137 599798 574785 553608 536135 522335
51524 522335 511819 503586 496303 489019 481639 474654 468453 463006 458018 453104 447811 441844 435380 428875
51510 428875 422447 415796 408976 402968 399038 397487 397242 396664 394686 391298 387146 382785 378289 373603 369084
51495 369084 365355 362551 360038 357117 353809 350767 348582 347342 346698 346184 345606 345270 345687 346912 348395
51480 348395 349547 350222 350499 350348 349745 348821 347647 346147 344455 342985 341800 340300 337988 335248 332882
51465 332882 331196 330060 329539 329740 330178 330089 329457 328994 328931 328503 327016 324920 323425 323345 324607 326649 328977
51448C28977K518L046L987M915N381N389N229N085N114N600O621P753Q555R234
51434D07404J0303J1677J2460J1689R050N048R49j631j713J44K239L058K095m18
51420D72354l965p688j0367j1049r754p509n553m513m151l783k948j702l99O47
51406C99620J302J584J662J783K011K131J902J418J100J234J653J887J743J640
51392D22670K163L323M573N658O932Q551R796R930R475R796J1445J3720J6023
51379E34055J8800K2703K7565L2714L7810M2841M7673N2083N5879N8674N9881
51368I90678N9272N7034N2862M5694L5047K2110Q689m580j8058l1386m3034n1733
51356A122595n7530o1157o2967o2883o0976n7573n3041m7712m1894l5925l0214
$$ plain form
51448 328977 331495 334541 338528 343443 348824 354213 359442 364527 369641 375241 381862 389615 398170 407404
51434 407404 417707 429384 441844 453533 462583 467631 468580 466949 465236 465380 467619 470677 472772 472354
51420 472354 468389 460701 450334 439285 429531 422022 416469 411956 407805 404022 401074 399372 398973 399620
51406 399620 400922 402506 404168 405951 407962 410093 411995 413413 414513 415747 417400 419287 421030 422670
51392 422670 424833 428156 432729 438387 445319 453870 463666 473596 483071 492867 504312 518032 534055
51379 534055 552855 575558 603123 635837 673647 716488 764161 816244 872123 930797 990678
51368 990678 1049950 1106984 1159846 1205540 1240587 1262697 1271386 1266806 1248748 1217362 1174328 1122595
51356 1122595 1065065 1003908 940941 878058 817082 759509 706468 658756 616862 580937 550723
51345E50723k5254k1348j8316j5761j3598j2096j1362j1024j0574r843r050q485
51333C84012q146p718o946o044n479n299m934l903k526j639j704k360k786k370
51319C22158j165J37Q25Q98R76J405J754J402L95n98r65n82K48R97J268J127Q98
51302C31178O33J20n22p47l32K85P47J249J958K478K403J907J235J87j283k500
51286C38996k888k886l219l646l412k624k128k065j696o92L61R48J182J223J032
51271C18486Q90J310K057K166J286K50k08l86p15p20K13J605K350K215J999K234
51255C35032K484K158J427J007J269J846K111J865J404R48K56r34k243k892k686
51240C43052k295k426l009l420l223k472j585j158j635k839l906l971k892j339
$$ plain form
51345 550723 525469 504121 485805 470044 456446 444350 432988 421964 411390 401547 392497 384012
51333 384012 375866 368148 361202 355158 349679 344380 339446 335543 333017 331378 329674 327314 324528 322158
51319 322158 320993 321130 321955 322853 323829 325234 326988 328390 328785 328187 327222 326640 326888 327885 329153 330280 331178
51302 331178 331811 331931 331409 330662 330330 330615 331362 332611 334569 337047 339450 341357 342592 342779 341496 338996
51286 338996 336108 333222 330003 326357 322945 320321 318193 316128 314432 313740 314101 315049 316231 317454 318486
51271 318486 319376 320686 322743 324909 326195 326445 326237 325851 325136 324416 324629 326234 328584 330799 332798 335032
51255 335032 337516 339674 341101 342108 343377 345223 347334 349199 350603 351551 351807 350873 348630 345738 343052
51240 343052 340757 338331 335322 331902 328679 326207 324622 323464 321829 318990 315084 311113 308221 306882
51226C06882j81J45o7r8M41J157J373J052R03J405K093K093J200J79oQ46J986
51209C21403K454K022J421J476K188K796K715K138J728J898K473K898K844K612
51195C53066K744L192L226K484J719J918K952L725L548K742J841R53R3n25q12
51180C82866r72j080q95m30k27p47j721k475k717k716k861l189l355k990k172
51165C54319j421j077r19o86o60j135j589j151P5J029J180J210J842K764L176
51150C56957K844K055J075J62l40m50p52j616k581l015k983k965l045l026l013
51135C39307l263l535l278k410j442p94m67l05j49J85O92R74P31L74O36J589K606
51118C31451L258L708M074M100L804L857M702N694N741M682L434K741K417K034
$$ plain form
51226 306882 306701 306846 306779 306681 307122 308279 309652 310704 311607 313012 315105 317198 318398 318577 318571 319417 321403
51209 321403 323857 325879 327300 328776 330964 333760 336475 338613 340341 342239 344712 347610 350454 353066
51195 353066 355810 359002 362228 364712 366431 368349 371301 375026 378574 381316 383157 384110 384203 383678 382866
51180 382866 381894 380814 379919 379489 379262 378515 376794 374319 371602 368886 366025 362836 359481 356491 354319
51165 354319 352898 351821 350902 350216 349556 348421 346832 345681 345756 346785 347965 349175 351017 353781 356957
51150 356957 359801 361856 362931 363093 362753 362303 361551 359935 357354 354339 351356 348391 345346 342320 339307
51135 339307 336044 332509 329231 326821 325379 324585 324118 323813 323664 323849 324541 325515 326246 326620 327256 328845 331451
51118 331451 334709 338417 342491 346591 350395 354252 358954 364648 370389 375071 378505 381246 383663 385697
51104C85697J713J732J734J132J92l6Q83K139K800K943L119L278K993K338J700
51089D14357Q53p25k640l730l706l632m307n053m770l557k397j803j508j292j250
51074C74840j327j227q22k38L89R35J209J280J629K543L544L948L853M008M768
51059C99332N759O538O999P136O963O887P504Q742R562Q872O594L647J168j20
51045D85583l0J172K943M651N779O145O093O346P287Q365Q548P479N995N344N979
51030E67679P193P760O815M271O42l339o996r779j1398j2017j2110j1949j1375
51017E15397j0241q902p873p064n757l561j092O36J304J525J988K722L284L442
51003D85808L395L376L378L320L228L162L133L220L499L668L138J806M12l21o33
$$ plain form
51104 385697 387410 389142 390876 392008 392200 392164 393047 395186 397986 400929 404048 407326 410319 412657 414357
51089 414357 415210 414485 411845 408115 404409 400777 396470 391417 386647 383090 380693 378890 377382 376090 374840
51074 374840 373513 372286 371464 371226 371615 372550 373759 375039 376668 379211 382755 386703 390556 394564 399332
51059 399332 405091 411629 418628 425764 432727 439614 447118 455860 465422 474294 480888 484535 485703 485583
51045 485583 485553 486725 489668 494319 500098 506243 512336 518682 525969 534334 542882 550361 556356 561700 567679
51030 567679 574872 582632 589447 593718 594360 591021 584025 574246 562848 550831 538721 526772 515397
51017 515397 505156 496254 488381 481317 475560 471999 470907 471543 472847 474372 476360 479082 482366 485808
51003 485808 489203 492579 495957 499277 502505 505667 508800 512020 515519 519187 522325 524131 524543 524222 523589
50988E23589j239k079k325j595l66R49K510M304N670O156O338P096Q517J0074
50974E67599J1505J2891J4036J4360J3411J1111P654L585k23l148n283o986q180
50961F32332q530q203p898q110q606q683p712n665l280j487m16O78K282L938N137
50946E75777O346Q352J1034J3600J5828J8183K0807K3277K5456K7740L0305L2784
50934H09489L4684L5419L3966K9495K2643J5351R118M126K55k186l296m208n924
50921I78932q124r905j1256j2913j5145j7466j9379k0613k0879k0195j9314j9051
50909G84692j9079j8207j5965j3270j1317j0394j0060r895r706r356q869q449
50897F40125q189p892p405o898o569o338o024n700n536n382m838l739k437j549
$$ plain form
50988 523589 522350 520271 517946 516351 515985 516934 519444 523748 529418 535574 541912 549008 557525 567599
50974 567599 579104 591995 606031 620391 633802 644913 652567 656152 655929 652781 647498 640512 632332
50961 632332 623802 615599 607701 599591 590985 582302 574590 568925 565645 564158 563742 564420 566702 570640 575777
50946 575777 582123 590475 601509 615109 630937 649120 669927 693204 718660 746400 776705 809489
50934 809489 844173 879592 913558 943053 965696 981047 990165 994291 994546 992360 989064 984856 978932
50921 978932 970808 960903 949647 936734 921589 904123 884744 864131 843252 823057 803743 784692
50909 784692 765613 747406 731441 718171 706854 696460 686400 676505 666799 657443 648574 640125
50897 640125 631936 624044 616639 609741 603172 596834 590810 585110 579574 574192 569354 565615 563178 561629
50883E61629j484k097k797l017k731k411k337k154j312J67J541J980J241k09j519
50868E44490k005j608q50k82RK29M35O34J093K130L459M322M429M352M714N374
50852E70925N804N836N649N292M816M620N063N780O005N638N395N862O929Q237
50838F51851R643J1006J2052J2815J3768J5171J6681J7901J8996K0372K2077K3912
50826H46245K5879K8148L0742L3505L6187L8416L9939M1169M3048M5898M8772
50815A257948N0420N0570M9665M7674M3965L8341L1453K4000J6141P946o8p254
50803A610801j3431j8900k3956k8504l2059l4073l4402l3504l1977k9971k7216
50792A302808k3640j9718j6110j3068j0239p040l279N80L874O443Q622J0470J1495
$$ plain form
50883 561629 560145 558048 555251 552234 549503 547092 544755 542601 541289 541456 542997 544977 546218 546009 544490
50868 544490 542485 540877 540027 539745 539754 539983 540418 541052 542145 544275 547734 552056 556485 560837 565551 570925
50852 570925 576729 582565 588214 593506 598322 602942 608005 613785 619790 625428 630823 636685 643614 651851
50838 651851 661494 672500 684552 697367 711135 726306 742987 760888 779884 800256 822333 846245
50826 846245 872124 900272 931014 964519 1000706 1039122 1079061 1120230 1163278 1209176 1257948
50815 1257948 1308368 1358938 1408603 1456277 1500242 1538583 1570036 1594036 1610177 1618123 1618055 1610801
50803 1610801 1597370 1578470 1554514 1526010 1493951 1459878 1425476 1391972 1359995 1330024 1302808
50792 1302808 1279168 1259450 1243340 1230272 1220033 1212993 1209714 1210294 1214168 1220611 1229233 1239703 1251198
50779A251198J1410J0765J0252R694Q277N721K712J63j643l180n242q247j1629
50766A280251j4255j5783j7340k0206k4114k7613k9897l1361l2373l2557l1690
50755A003062l0385k9223k7920k5921k3390k0955j8887j7038j5320j3701j1960
50744G68362r992q149o762n510l763j473P70K521L831M823N485N935O563P613
50730G70254Q980J0474J1982J3165J3422J2574J1405J1002J1503J1936J1478J0461
50718I08636R791R768J0009J0370J1133J2174J2735J2442J1898J1743J1700J1267
50706A043666J0853J1319J2639J4028J5368J7386K0242K2988K4876K6313K7859
50695A247537K9137K9457K8926K8130K7038K5116K2271J8973J5551J2157R363
$$ plain form
50779 1251198 1262608 1273373 1283625 1293319 1301596 1307317 1310029 1310192 1308549 1305369 1300127 1291880 1280251
50766 1280251 1265996 1250213 1232873 1212667 1188553 1160940 1131043 1099682 1067309 1034752 1003062
50755 1003062 972677 943454 915534 889613 866223 845268 826381 809343 794023 780322 768362
50744 768362 758370 750221 743459 737949 734186 732713 733483 736004 739835 744658 750143 756078 762641 770254
50730 770254 779234 789708 801690 814855 828277 840851 852256 863258 874761 886697 898175 908636
50718 908636 918427 928195 938204 948574 959707 971881 984616 997058 1008956 1020699 1032399 1043666
50706 1043666 1054519 1065838 1078477 1092505 1107873 1125259 1145501 1168489 1193365 1219678 1247537
50695 1247537 1276674 1306131 1335057 1363187 1390225 1415341 1437612 1456585 1472136 1484293 1493656
50684A493656Q013Q249R219J0032J0618J1420J2598J3836J4688J4892J4453J3727
50672A635401J3426J4399J7144K1364K6139L0713L5085L9512M3576M6241M7015
50661A970015M6439M5118M2901L9634L6175L3781L2622L1762L0583K9422K8592
50650B367044K7691K6322K4763K3449K2225K0783J9428J8831J9247K0529K2763
50639B613075K6173L0458L4769L8521M1721M4432M6309M6855M5761M2851L8090
50628C049015L1950K5399J9172J3246P304J388m272r737j5133k0248k5080l0772
50616C042232l8994m9785o0341o6624o6221n9639m9203l7290k5575j5235p191
50605B566134j941N64O26j746o848j4620k4171l4215m3830n2517n9769o5153o8867
$$ plain form
50684 1493656 1501669 1509918 1519137 1529169 1539787 1551207 1563805 1577641 1592329 1607221 1621674 1635401
50672 1635401 1648827 1663226 1680370 1701734 1727873 1758586 1793671 1833183 1876759 1923000 1970015
50661 1970015 2016454 2061572 2104473 2144107 2180282 2214063 2246685 2278447 2309030 2338452 2367044
50650 2367044 2394735 2421057 2445820 2469269 2491494 2512277 2531705 2550536 2569783 2590312 2613075
50639 2613075 2639248 2669706 2704475 2742996 2784717 2829149 2875458 2922313 2968074 3010925 3049015
50628 3049015 3080965 3106364 3125536 3138782 3146086 3147474 3143202 3133465 3118332 3098084 3073004 3042232
50616 3042232 3003238 2953453 2893112 2826488 2760267 2700628 2651425 2614135 2588560 2573325 2566134
50605 2566134 2564193 2564757 2565383 2563637 2556789 2542169 2517998 2483783 2439953 2387436 2327667 2262514 2193647
50592B193647p1566p3468p4131p3259p1125o7922o3461n7978n2579m8133m4201
50581A495824l9816l4978l0461k6447k2328j7844j3475r442n272p11L651P166
50569A305867J0035J2950J6102J8932K0703K1135K0613J9839J9033J7612J5054
50558A497875J1998R917R662J0833J2741J5298J8738K3126K8471L4746M1440M7609
50546A762454N2767N7220O1154O4067O5550O6082O6374O6402O5836O5135O5431
50535B458472O7516P1436P6873Q3247Q9644R5477J01182J07682J15084J22546
50525C389159J29438J35885J42061J47634J52250J55962J58708J59793J58453
50516D729343J54566J48262J38895J25059J05924Q2213N5607K7417j785l1375
$$ plain form
50592 2193647 2122081 2048613 1974482 1901223 1830098 1762176 1698715 1640737 1588158 1540025 1495824
50581 1495824 1456008 1421030 1390569 1364122 1341794 1323950 1310475 1301033 1295761 1295050 1298701 1305867
50569 1305867 1315902 1328852 1344954 1363886 1384589 1405724 1426337 1446176 1465209 1482821 1497875
50558 1497875 1509873 1519790 1529452 1540285 1553026 1568324 1587062 1610188 1638659 1673405 1714845 1762454
50546 1762454 1815221 1872441 1933595 1997662 2063212 2129294 2195668 2262070 2327906 2393041 2458472
50535 2458472 2525988 2597424 2674297 2757544 2847188 2942665 3043847 3151529 3266613 3389159
50525 3389159 3518597 3654482 3796543 3944177 4096427 4252389 4411097 4570890 4729343
50516 4729343 4883909 5032171 5171066 5296125 5402049 5484262 5539869 5567286 5565501 5534126
50506E534126o0111q6657j10238j30367j46044j55923j59341j56781j49131j36930
50496D242603j20614j01032p9317n6455l3420j1531P638K2677L2410L5752L2064
50485C970775K1636N629j4513l7345o1246q4309j04724j21213j33196j40641j43810
50474C157043j43247j39943j35299j30356j25030j18561j10882j03068r6085q9671
50464A964901q3010p6132o9869o4626n9945n5373n1064m7236m3664l9947l6033
50453A338002l2152k8500k5213k2388j9967j7788j5896j4561j3763j2913j1360
50442A123501r105o787m938l493k031l23J485L193M880O826R163J1704J4140J6314
50428A164529J8330K0509K3128K6072K8780L0908L2929L5655L9063M2118M4104
$$ plain form
50506 5534126 5474015 5387358 5277120 5146753 5000709 4844786 4685445 4528664 4379533 4242603
50496 4242603 4121989 4020957 3941640 3885185 3851765 3840234 3847872 3870549 3902959 3938711 3970775
50485 3970775 3992411 3998040 3983527 3946182 3884936 3800627 3695903 3574690 3441494 3300853 3157043
50474 3157043 3013796 2873853 2738554 2608198 2483168 2364607 2253725 2150657 2054572 1964901
50464 1964901 1881891 1805759 1735890 1671264 1611319 1555946 1504882 1457646 1413982 1374035 1338002
50453 1338002 1305850 1277350 1252137 1229749 1209782 1191994 1176098 1161537 1147774 1134861 1123501
50442 1123501 1114396 1107609 1102671 1099178 1097147 1096824 1098309 1101502 1106382 1113208 1122371 1134075 1148215 1164529
50428 1164529 1182859 1203368 1226496 1252568 1281348 1312256 1345185 1380840 1419903 1462021 1506125
50417A506125M5647M7889N1129N4938N9241O4395P0144P5431P9627Q3267Q7073
50406B224906R0742R3327R4502R4793R4533R3208R0062Q5026P8752P1793O3922
50395C175566N4361M2585K8819J3667k604k0060l8281n5826p0858q2226q9649
50384B955494r3046r2224q7525q0289p2130o3744n4764m4793l4227k4031j5021
50373B293700p567j749K320M114K618k956j2049k2767l3339m3290n2782o1238
50361B065015o7419p0830p2240p2644p2291p0943o8545o5311o1560n7766n4369
50350A331097n1212m7628m3422l9405l6492l4530l2509k9795k6628k3532k0710
50339I45234j8143j5947j4294j3137j2112j0847r328p928p046o760o933p441q117
$$ plain form
50417 1506125 1551772 1599661 1650790 1705728 1764969 1829364 1899508 1974939 2054566 2137833 2224906
50406 2224906 2315648 2408975 2503477 2598270 2692803 2786011 2876073 2961099 3039851 3111644 3175566
50395 3175566 3229927 3272512 3301331 3314998 3312394 3292334 3254053 3198227 3127369 3045143 2955494
50384 2955494 2862448 2770224 2682699 2602410 2530280 2466536 2411772 2366979 2332752 2308721 2293700
50373 2293700 2286133 2284384 2286704 2290818 2293436 2290480 2278431 2255664 2222325 2179035 2126253 2065015
50361 2065015 1997596 1926766 1854526 1781882 1709591 1638648 1570103 1504792 1443232 1385466 1331097
50350 1331097 1279885 1232257 1188835 1149430 1112938 1078408 1045899 1016104 989476 965944 945234
50339 945234 927091 911144 896850 883713 871601 860754 851426 843498 836452 829692 822759 815318 807201
50326H07201q604q631q337q011p602o879o004n393n053m599l947l355k661j289
50312G26836P56K638L875M988O468P878Q706R399J0599J1825J1999J1097J0183
50299H27247R853R613Q961Q217P833P625P202O679O471O576O535O025N195M396
50285I28428L815L457L343L536M021M876O507R376J3144J6650J9278K1804K4722
50272A062957K5888K1440J0000m858j7204k3404k3824k0969j7112j3350r730n995
50260I83839k523m28l88j910m213p186j0725j3722j4761j3632j1337q882o780
50247H87352n369m687m201l536l138l423l679k880j291q9M34R75J719K014J686
50232H61887J386J434J463J349J390J343N23r10k042k827m209o172p218o599n641
$$ plain form
50326 807201 798597 789966 781629 773618 766016 759137 753133 747740 742687 738088 734141 730786 728125 726836
50312 726836 727592 730230 734105 739093 745561 753439 762145 771544 782143 793968 805967 817064 827247
50299 827247 837100 846713 855674 863891 871724 879349 886551 893230 899701 906277 912812 918837 924032 928428
50285 928428 932243 935700 939043 942579 946600 951476 957983 967359 980503 997153 1016431 1038235 1062957
50272 1062957 1088845 1110285 1120285 1115427 1098223 1074819 1050995 1030026 1012914 999564 989834 983839
50260 983839 981316 980888 980500 978590 974377 967191 956466 942744 927983 914351 903014 894132 887352
50247 887352 881983 877296 873095 869559 866421 862998 859319 856439 855148 855059 855493 856468 858187 860201 861887
50232 861887 863273 864707 866170 867519 868909 870252 870775 869865 867823 864996 860787 854615 847397 840798 835157
50217H35157n838o798p263p127p089p113o571n562m782m359l901l511l657m073
50203G57513l785k474r80k51k23o9P52J915K721L075L763N465P705R477J0766
50188G95370J2572J5260J7891J9752K1565K4439K8367L2561L6658M0739M4653
50177A089827M8149N1313N4057N5552N4899N2083M7608M1753L4982K8632K4031
50166A582886K1126J8881J6880J5507J4599J2907R132K810n837j6123k6812l6495
50154A609461m4323n0011n3277n3935n2481m9807m6251m1599l6031l0311k4952
50143A126483k0012j5910j3529j3016j3298j3369j3561j4858j7345k0008k1822
50132I49755k2445k1854k0002j7071j3732j0727q316o296m540l276k709k675k859
$$ plain form
50217 835157 829319 822521 815258 808131 801042 793929 787358 781796 777014 772655 768754 765243 761586 757513
50203 757513 753728 751254 750274 750023 749800 749731 750483 752398 755119 758194 761957 767422 775127 784604 795370
50188 795370 807942 823202 841093 860845 882410 906849 935216 967777 1004435 1045174 1089827
50177 1089827 1137976 1189289 1243346 1298898 1353797 1405880 1453488 1495241 1530223 1558855 1582886
50166 1582886 1604012 1622893 1639773 1655280 1669879 1682786 1691918 1694728 1688891 1672768 1645956 1609461
50154 1609461 1565138 1515127 1461850 1407915 1355434 1305627 1259376 1217777 1181746 1151435 1126483
50143 1126483 1106471 1090561 1077032 1064016 1050718 1037349 1023788 1008930 991585 971577 949755
50132 949755 927310 905456 885454 868383 854651 843924 835608 829312 824772 821496 818787 816112 813253
50119H13253l166l490l401k605j707j746k764l498k926j494k61N26J223J716J560
50104G91220J110J400K780M335M997M694M157M016M330M752M963N053N361N836
50090H49004N887N221M518M713N801P029Q035R061J0114J0809J1176J1852J3143
50077I56363J4589J5777J7002J8742K1021K3597K6383K9278L2108L5137L9125
50066A229122M4425N0334N5992O1614O8208P6118Q4364R1458R6340R8469R7489
50055B053933R3306Q6441P8023O9365O1553N5299N0853M7794M5103M1724L7085
50044B720479L0776K1871R263o949k4873m2193n7792p1552q3049r1358r6169r8159
50032B210295r7981r5675r1423q6123q0612p4708o7763n9901n2114m5257l9430
$$ plain form
50119 813253 810087 806597 803196 800591 798884 797138 794374 790876 787950 786456 786195 786721 787944 789660 791220
50104 791220 792330 793730 796510 800845 805842 810536 814693 818709 823039 827791 832754 837807 843168 849004
50090 849004 854891 860112 864630 869343 875144 882173 890208 899269 909383 920192 931368 943220 956363
50077 956363 970952 986729 1003731 1022473 1043494 1067091 1093474 1122752 1154860 1189997 1229122
50066 1229122 1273547 1323881 1379873 1441487 1509695 1585813 1670177 1761635 1857975 1956444 2053933
50055 2053933 2147239 2233680 2311703 2381068 2442621 2497920 2548773 2596567 2641670 2683394 2720479
50044 2720479 2751255 2773126 2782389 2775440 2750567 2708374 2650582 2579030 2495981 2404623 2308454 2210295
50032 2210295 2112314 2016639 1925216 1839093 1758481 1683773 1616010 1556109 1503995 1458738 1419308
50021A419308l4402l0117k6641k3942k1980k0780k0264k0116k0014j9946k0070
50010A161036k0243j9946j8914j7718j7394j8333j9860k0988k1373k1297k1015
49999I43955k0466j9547j8318j6865j5217j3241j0619p104l081M67K933M735O487
49986H34119P809P708O107M173K900K091J100o9j030j892l200n143p310r193j0524
49971H27646j1156j1051j0452r747r055q138o796n169l525j972m66R58K186L267
49957G56530M510O146Q021R782J1433J3401J5935J8736K1493K4608K8861L4336
49945I53792M0156M5437N0215N5130O0477O5809P0296P3183P3948P2381O8563
49934A629387O2630N4682M5106L5064K6218J9588J4707J0229N413O80l472p702
$$ plain form
50021 1419308 1384906 1354789 1328148 1304206 1282226 1261446 1241182 1221066 1201052 1181106 1161036
50010 1161036 1140793 1120847 1101933 1084215 1066821 1048488 1028628 1007640 986267 964970 943955
49999 943955 923489 903942 885624 868759 853542 840301 829682 822578 819497 819964 822897 827632 834119
49986 834119 841928 849636 855743 859916 862816 864907 866007 865938 864908 863016 859816 854673 847363 838170 827646
49971 827646 816490 805439 794987 785240 776185 768047 761251 756082 752557 750585 750119 751077 753263 756530
49957 756530 761040 767186 775207 784989 796422 809823 825758 844494 865987 890595 919456 953792
49945 953792 993948 1039385 1089600 1144730 1205207 1271016 1341312 1414495 1488443 1560824 1629387
49934 1629387 1692017 1746699 1791805 1826869 1853087 1872675 1887382 1897611 1903024 1903704 1900232 1892530
49922A892530j3490k1700l1980m3437n5239o6201p4591p9051p9694p7782p4351
49911A275014o9579o3405n6304m9212m2873l7425l2577k8079k4020k0576j7609
49900H33355j4721j1712q627n397j900J488L983N430O732Q752J1107J2535J2140
49887H53165R889O289K216j252l517m879n911o725p402q596j0871j3766j6391
49874G92249j8626k0743k2162k1876k0165j8499j7429j5887j3112j0042p962o777
49862E98969n627m369l441k743j738m21P56J798L129M723O021O793P509Q694J0356
49847F30409J2113J3587J4569J5071J5248J5189J4801J3904J2302R750O289K692
49835G75924J03j052j453k022l136m886p348j0104j2084j2560j2004j1333j0715
$$ plain form
49922 1892530 1879040 1857340 1825360 1781923 1726684 1660483 1585892 1506841 1427147 1349365 1275014
49911 1275014 1205435 1142030 1085726 1036514 993641 956216 923639 895560 871540 850964 833355
49900 833355 818634 806922 798295 792898 790998 792486 796469 801899 808631 817383 828490 841025 853165
49887 853165 863054 869343 871559 870307 866790 861911 856000 849275 841873 833277 822406 808640 792249
49874 792249 773623 752880 730718 708842 688677 670178 652749 636862 623750 613708 605746 598969
49862 598969 593342 588973 585532 582789 581051 580630 581386 583184 586313 591036 597057 603850 611359 620053 630409
49847 630409 642522 656109 670678 685749 700997 716186 730987 744891 757193 766943 773232 775924
49835 775924 776027 774975 773522 771500 768364 763478 756130 746026 733942 721382 709378 698045 687330
49822F87330r751q397o926n252l178j183rN23J394K932M377N186N963P550R814
49807F90373J1930J3445J4460J4966J4662J3422J1549R438P248M997K874J259
49795H10623L16m03j751m145p054r583j1443j3085j4834j6370j7127j6855j5615
49782F82674j3576j1174r125p868p111o299n449n061n171n022l999k511j462r75
$$ plain form
49822 687330 677579 669182 662256 657004 653826 652643 652634 653157 654551 657483 661860 667046 673009 680559 690373
49807 690373 702303 715748 730208 745174 759836 773258 784807 794245 801493 806490 809364 810623
49795 810623 810939 810536 808785 804640 797586 788003 776560 763475 748641 732271 715144 698289 682674
49782 682674 669098 657924 648799 640931 633820 627521 622072 617011 611840 606818 602819 600308 598846 597871
$$ [...]
##END NTUPLES=NMR SPECTRUM
##END=
