##TITLE=NES1006_50530289_9232656_fRCv0EkKs0
##JCAMPDX= 6.0         $$ Bruker NMR JCAMP-DX V2.0
##DATA TYPE= NMR SPECTRUM
##DATA CLASS= NTUPLES
##ORIGIN= BRUKER
##OWNER= Administrator
$$ 1.72 TOPSPIN		Version 2.1
$$ 2015-08-24 16:27:39.920 -0700  Administrator@X
$$ Compression mode = diff/dup
##.OBSERVE FREQUENCY= 400.02188249412
##.OBSERVE NUCLEUS= ^1H
##.ACQUISITION MODE= SIMULTANEOUS (DQD)
##.ACQUISITION SCHEME= undefined
##.AVERAGES= 64
##.DIGITISER RES= 22
##SPECTROMETER/DATA SYSTEM= spect
##.PULSE SEQUENCE= noesygpps1d.comp
##.SOLVENT NAME= COFFEE_meoh
##.SHIFT REFERENCE= INTERNAL, COFFEE_meoh, 1, 14.96127
##AUDIT TRAIL= $$ (NUMBER, WHEN, WHO, WHERE, PROCESS, VERSION, WHAT)
$$ ##TITLE= Audit trail, TOPSPIN		Version 2.1
$$ ##JCAMPDX= 5.01
$$ ##ORIGIN= Bruker BioSpin GmbH
$$ ##OWNER= Administrator
$$ $$ E:\/data/COFFEE/nmr/NES1006_50530289_9232656_fRCv0EkKs0/22/pdata/1/auditp.txt
$$ ##AUDIT TRAIL=  $$ (NUMBER, WHEN, WHO, WHERE, PROCESS, VERSION, WHAT)
(   1,<2015-08-24 16:27:34.561 -0700>,<Administrator>,<X>,<go>,<TOPSPIN 2.1>,
      <created by zg
	started at 2015-08-24 16:16:04.061 -0700,
	POWCHK enabled, PULCHK disabled,
       configuration hash MD5:
       21 0F 79 D6 B3 7B B4 F6 88 20 88 DB 03 48 BD 9F
       data hash MD5: 64K
       0E 65 5A AC 36 5D F3 29 4F CE D4 51 75 4C CA DA>)
(   2,<2015-08-24 16:27:37.842 -0700>,<Administrator>,<X>,<proc1d>,<TOPSPIN 2.1>,
      <Start of raw data processing
       efp LB = 0.3 FT_mod = 6 PKNL = 1 PHC0 = 0 PHC1 = 0 SI = 128K 
       data hash MD5: 128K
       FA 12 8C 86 E0 BB 7E 34 CD D5 BF 28 6C E7 8B D6>)
(   3,<2015-08-24 16:27:38.733 -0700>,<Administrator>,<X>,<proc1d>,<TOPSPIN 2.1>,
      <pk PHC0 = -87.01172 PHC1 = 0 
       data hash MD5: 128K
       E2 A6 0C 36 11 9D E3 1B 27 0B FB C2 5C 6D 61 D0>)
(   4,<2015-08-24 16:27:39.108 -0700>,<Administrator>,<X>,<proc1d>,<TOPSPIN 2.1>,
      <abs ABSG = 1 
       data hash MD5: 128K
       D2 D7 9F FD 42 9C A8 84 69 41 67 F1 F9 F1 C9 59>)
(   5,<2015-08-24 16:27:39.201 -0700>,<Administrator>,<X>,<proc1d>,<TOPSPIN 2.1>,
      <abs ABSG = 2 
       data hash MD5: 128K
       58 A7 09 3E 6A 70 11 88 5F D4 42 17 91 43 10 D1>)
(   6,<2015-08-24 16:27:39.280 -0700>,<Administrator>,<X>,<proc1d>,<TOPSPIN 2.1>,
      <abs ABSG = 3 
       data hash MD5: 128K
       41 0E 7A 48 39 45 D7 0F 71 93 4F 78 E2 0A EE 22>)
(   7,<2015-08-24 16:27:39.373 -0700>,<Administrator>,<X>,<proc1d>,<TOPSPIN 2.1>,
      <abs ABSG = 4 
       data hash MD5: 128K
       D3 4F 82 0A 17 2C 84 7A DD D2 93 47 81 BB 38 46>)
(   8,<2015-08-24 16:27:39.467 -0700>,<Administrator>,<X>,<proc1d>,<TOPSPIN 2.1>,
      <abs ABSG = 5 
       data hash MD5: 128K
       4C 43 F7 FA 77 B8 21 5C 81 A3 D8 06 E4 2D 9D AC>)
$$ ##END=
$$ 
$$ $$ hash MD5
$$ $$ 4F 83 B7 C8 9D 8E 77 01 C8 5A 54 14 55 D7 37 2B
##$RELAX= 
##$RELAX= 
##$RELAX= 
##$RELAX= 
##$RELAX= 
##$RELAX= 
##$RELAX= 
##$RELAX= 
$$ Bruker specific parameters
$$ --------------------------
##$DU= <E:\>
##$EXPNO= 22
$$ [...]
##$TP07= 0
##$TPNAME0= <>
##$TPNAME1= <>
##$TPNAME2= <>
##$TPNAME3= <>
##$TPNAME4= <>
##$TPNAME5= <>
##$TPNAME6= <>
##$TPNAME7= <>
##$TPOAL= (0..7)
0.5 0.5 0.5 0.5 0.5 0.5 0.5 0.5
##$TPOFFS= (0..7)
0 0 0 0 0 0 0 0
##$TUNHIN= 0
##$TUNHOUT= 0
##$TUNXOUT= 0
##$USERA1= <user>
##$USERA2= <user>
##$USERA3= <user>
##$USERA4= <user>
##$USERA5= <user>
##$V9= 5
##$VALIST= <valist>
##$VCLIST= <CCCCCCCCCCCCCCC>
##$VD= 0
##$VDLIST= <DDDDDDDDDDDDDDD>
##$VPLIST= <PPPPPPPPPPPPPPP>
##$VTLIST= <TTTTTTTTTTTTTTT>
##$WBST= 2048
##$WBSW= 25
##$XGAIN= (0..3)
0 0 0 0
##$XL= 0
##$YL= 0
##$YMAX_a= 4695656
##$YMIN_a= -8307342
##$ZGOPTNS= <>
##$ZL1= 120
##$ZL2= 120
##$ZL3= 120
##$ZL4= 120
##$ABSF1= 14.96127
##$ABSF2= -5.596911
##$ABSG= 5
##$ABSL= 3
##$ALPHA= 0
##$AQORDER= 0
##$ASSFAC= 0
##$ASSFACI= 0
##$ASSFACX= 0
##$ASSWID= 0
##$AUNMP= <proc_prof1d_extract.lims>
##$AXLEFT= 0
##$AXNAME= <>
##$AXNUC= <1H>
##$AXRIGHT= 0
##$AXTYPE= 0
##$AXUNIT= <>
##$AZFE= 0.1
##$AZFW= 0.1
##$BCFW= 0
##$BC_mod= 0
##$BYTORDP= 0
##$COROFFS= 0
##$CY= 15
##$DATMOD= 1
##$DC= 0
##$DFILT= <>
##$DTYPP= 0
##$F1P= 0
##$F2P= 0
##$FCOR= 0.5
##$FTSIZE= 131072
##$FT_mod= 6
##$GAMMA= 0
##$GB= 0
##$INTBC= 1
##$INTSCL= 1
##$ISEN= 128
##$LB= 0.3
##$LEV0= 0
##$LPBIN= 0
##$MAXI= 10000
##$MC2= 0
##$MEAN= 0
##$ME_mod= 0
##$MI= 0
##$NCOEF= 0
##$NC_proc= -2
##$NLEV= 6
##$NOISF1= 0
##$NOISF2= 0
##$NSP= 0
##$NTH_PI= 0
##$NZP= 0
##$OFFSET= 14.96127
##$PC= 1
##$PHC0= -87.01172
##$PHC1= 0
##$PH_mod= 1
##$PKNL= yes
##$PPARMOD= 0
##$PPDIAG= 0
##$PPIPTYP= 0
##$PPMPNUM= 2147483647
##$PPRESOL= 1
##$PSCAL= 4
##$PSIGN= 0
##$PYNMP= <proc.py>
##$REVERSE= no
##$SF= 400.020009528406
##$SI= 131072
##$SIGF1= 0
##$SIGF2= 0
##$SINO= 400
##$SIOLD= 131072
##$SPECTYP= <>
##$SREGLST= <1H.CDCl3>
##$SSB= 0
##$STSI= 131072
##$STSR= 0
##$SW_p= 8223.68421052631
##$SYMM= 0
##$S_DEV= 0
##$TDeff= 65536
##$TDoff= 0
##$TI= <>
##$TILT= no
##$TM1= 0
##$TM2= 0
##$TOPLEV= 0
##$USERP1= <user>
##$USERP2= <user>
##$USERP3= <user>
##$USERP4= <user>
##$USERP5= <user>
##$WDW= 1
##$XDIM= 131072
##$YMAX_p= 274538307
##$YMIN_p= -10583
##$CURPLOT= <Network HP LaserJet P1505>
##$CURPRIN= <$Network HP LaserJet P1505>
##$DFORMAT= <normdp>
##$LAYOUT= <+/1D_H.xwp>
##$LFORMAT= <normlp>
##$PFORMAT= <normpl>
##$SURQMSG= 1
$$ End of Bruker specific parameters
$$ ---------------------------------
##NTUPLES= NMR SPECTRUM
##VAR_NAME=  FREQUENCY,     SPECTRUM/REAL,   SPECTRUM/IMAG
##SYMBOL=    X,             R,               I
##VAR_TYPE=  INDEPENDENT,   DEPENDENT,       DEPENDENT
##VAR_FORM=  AFFN,          ASDF,            ASDF
##VAR_DIM=   131072,        131072,          131072
##UNITS=     HZ,            ARBITRARY UNITS, ARBITRARY UNITS
##FACTOR=    0.0627417313425164, 1,          1
##FIRST=     8223.62146879497, 664,          -31875
##LAST=      0,             1370,            -31661
##MIN=       0,             -10583,          0
##MAX=       8223.62146879497, 274538307,    0
$$ Real data points
##PAGE= N=1
##DATA TABLE= (X++(R..R)), XYDATA
$$ [...]
$$ plain form
61468 1157231 1145362 1135210 1125977 1116910 1107740 1098326 1088310 1077419 1065962 1054843 1044963 1036527
61456 1036527 1028923 1021347 1013622 1006353 1000407 996416 994711 995348 998059 1002488 1008717 1017350 1028911 1043386
61442 1043386 1060475 1079944 1101303 1123282 1143989 1161632 1174990 1183443 1186958 1186124 1182003 1175818
61430 1175818 1168744 1161744 1155473 1150442 1147280 1146587 1148417 1152284 1157891 1165507 1175310 1186803 1199234 1212098
61416 1212098 1224475 1234133 1238184 1234909 1224640 1208928 1189419 1167538 1144495 1121178 1098330 1076962
61404 1076962 1058190 1042312 1028423 1015268 1002380 990177 979198 969560 961097 953783 947904 943786
61392 943786 941325 939930 939093 938980 940193 943106 947718 954106 962540 973048 985292 999171 1015241 1034210
61378 1034210 1056118 1080221 1105655 1132151 1160181 1190484 1223306 1258067 1293786 1329715 1365344
$$ packed form
61468A157231j1869j0152r233r067r170r414j0016j0891j1457j1119r880q436
61456A036527p604p576p725p269n946l991j705O37K711M429O229Q633J1561J4475
61442A043386J7089J9469K1359K1979K0707J7643J3358Q453L515q34m121o185
61430A175818p074p000o271n031l162o93J830L867N607P616R803J1493J2431J2864
61416A212098J2377R658M051l275j0269j5712j9509k1881k3043k3317k2848k1368
61404A076962j8772j5878j3889j3155j2888j2203j0979r638q463p314n879m118
61392I43786k461j395q37j13J213K913M612O388Q434J0508J2244J3879J6070J8969
61378A034210K1908K4103K5434K6496K8030L0303L2822L4761L5719L5929L5629
$$ plain form
61367 1365344 1399882 1432131 1460974 1485828 1506621 1523566 1536852 1546173 1550501 1548730 1540708 1527369
61355 1527369 1509747 1488205 1462698 1433388 1400786 1365619 1328809 1291299 1253638 1215938 1178391
61344 1178391 1141578 1106065 1071970 1039209 1008015 978947 952449 928516 906703 886461 867651
61333 867651 850688 835985 823355 812394 803274 796498 791832 788318 785656 784781 786479 790088 794321
61320 794321 798882 804439 811286 818955 827071 835843 845552 856119 867253 878527 889253 898787 907055
61307 907055 914430 921094 926877 931609 935178 937307 937897 937622 937601 938267 939028 939178 938670 937813 936629 934725
61291 934725 931483 926267 918889 910004 900659 891348 881950 872665 864245 856931 849865 842173 834161 826742
61277 826742 820017 813228 806006 798885 792462 786699 781390 776758 773201 770670 768666 766781 764937 763146
$$ packed form
61367A365344L4538L2249K8843K4854K0793J6945J3286R321M328j771q022j3339
61355A527369j7622k1542k5507k9310l2602l5167l6810l7510l7661l7700l7547
61344A178391l6813l5513l4095l2761l1194k9068k6498k3933k1813k0242j8810
61333H67651j6963j4703j2630j0961r120o776m666l514k662q75J698L609M233
61320G94321M561N557O847P669Q116Q772R709J0567J1134J1274J0726R534Q268
61307I07055P375O664N783M732L569K129N90k75k1O66P61J50n08q57j184j904
61291I34725l242n216p378q885r345r311r398r285q420p314p066p692q012p419
61277H26742o725o789p222p121o423n763n309m632l557k531k004j885j844j791
$$ plain form
61263 763146 761202 758735 755506 751636 747560 743810 740892 739408 740129 743773 750577 760130 771691 784834
61249 784834 799958 818239 840894 868270 899621 933771 969841 1007083 1044098 1078523 1107696
61238 1107696 1129683 1143813 1150591 1151319 1147659 1141171 1132932 1123477 1113031 1101835 1090276 1078834 1067977
61225 1067977 1058216 1050259 1044917 1042537 1042375 1042689 1041692 1038318 1031886 1021230 1004830 982250 955159 926532
61211 926532 898789 872926 849197 827991 809855 795052 783408 774365 766938 759950 752705 745442
61199 745442 738780 732701 726272 718341 708392 696788 684471 672446 661303 651056 641437 632287 623619
61186 623619 615339 607095 598423 589006 578878 568490 558458 549062 540057 531113 522358 514199 506683
61173 506683 499345 491790 484178 476975 470372 464147 458029 452034 446427 441486 437397 434368 432605 432018
$$ packed form
61263G63146j944k467l229l870m076l750k918j484P21L644O804R553J1561J3143
61249G84834J5124J8281K2655K7376L1351L4150L6070L7242L7015L4425K9173
61238A107696K1987J4130O778P28l660o488q239r455j0446j1196j1559j1442j0857
61225A067977r761p957n342k380j62L14r97l374o432j0656j6400k2580k7091k8627
61211I26532k7743k5863k3729k1206j8136j4803j1644r043p427o988p245p263
61199G45442o662o079o429p931r949j1604j2317j2025j1143j0247r619r150q668
61186F23619q280q244q672r417j0128j0388j0032r396r005q944q755q159p516
61173E06683p338p555p612p203o603o225o118n995n607m941m089l029j763n87
$$ plain form
61159 432018 432068 432283 432926 434683 437428 439729 440063 438282 435338 431744 427046 420998 414590 409386 406099
61144 406099 404192 402734 401297 400052 399311 399187 399585 400398 401591 403081 404673 406227 407763 409164 409881
61129 409881 409253 407164 404181 401016 398098 395635 393742 392352 391294 390643 390769 391879 393743 396037 398750
61114 398750 402044 405869 409944 414008 417947 421689 425054 427567 428377 426604 422016 415337 407858 400742
61100 400742 394558 389056 383321 376531 368767 360837 353187 345390 336972 328282 320058 312440 304992 297524
61086 297524 290255 283195 275998 268676 261949 256533 252426 249205 246711 244997 243759 242328 240370 238289
61072 238289 236728 235832 235241 234674 234273 234289 234687 235243 235931 237011 238719 240961 243301 245204 246425 247292 248473
61055 248473 250275 252298 254046 255686 257857 260800 264152 267568 270987 274151 276516 278011 279365 281180
$$ packed form
61159D32018N0K15O43J757K745K301L34j781k944l594m698o048o408n204l287
61144D06099j907j458j437j245p41j24L98Q13J193J490J592J554J536J401P17
61129D09881o28k089k983l165k918k463j893j390j058o51J26J110J864K294K713
61114C98750L294L825M075M064L939L742L365K513Q10j773m588o679p479p116
61100D00742o184n502n735o790p764p930p650p797q418q690q224p618p448p468
61086B97524p269p060p197p322o727n416m107l221k494j714j238j431j958k081
61072B38289j561q96n91n67m01J6L98N56O88J080J708K242K340J903J221Q67J181
61055B48473J802K023J748J640K171K943L352L416L419L164K365J495J354J815
$$ plain form
61041 281180 283055 284141 284262 283868 283140 281833 280047 278479 277697 277548 277503 277300 277129 277451 278702 280997 284168
61024 284168 288327 294290 303030 314879 329830 348472 371651 398487 425076 445880 456784 457231
61012 457231 450208 440621 433170 430716 433930 441888 452380 461598 464693 458052 441525 418173 391866
60999 391866 365434 340683 318934 300788 285746 272767 261292 251501 243699 237781 233247 229495
60987 229495 226096 223037 220683 219336 218854 218899 219458 220747 222616 224479 226043 227755 230204 233366 236777
60972 236777 240244 243892 247593 250883 253553 255952 258588 261796 265853 270867 276318 281270 285466 289814
60958 289814 295264 301496 307361 312374 317024 321666 325871 329136 331565 333495 334946 335845 336353 336527 335941
60943 335941 334113 331117 327381 323075 318141 312704 306904 300380 292517 283386 273989 265391 257919 251404
$$ packed form
61041B81180J875J086J21l94p28j307j786j568p82j49m5k03j71L22J251K295L171
61024B84168M159N963Q740J1849J4951J8642K3179K6836K6589K0804J0904M47
61012D57231p023r587p451k454L214P958J0492R218L095o641j6527k3352k6307
60999C91866k6432k4751k1749j8146j5042j2979j1475r791p802n918m534l752
60987B29495l399l059k354j347m82M5N59J289J869J863J564J712K449L162L411
60972B36777L467L648L701L290K670K399K636L208M057N014N451M952M196M348
60958B89814N450O232N865N013M650M642M205L265K429J930J451Q99N08J74n86
60943C35941j828k996l736m306m934n437n800o524p863r131r397q598p472o515
$$ plain form
60929 251404 245829 241448 238409 236507 235193 233824 232178 230837 230690 231727 232683 232352 231047 230219 230692
60914 230692 231892 232900 233599 234372 235186 235621 235613 235585 235783 235997 236058 236243 236924 238067 239311 240415 241443 242547
60896 242547 243673 244467 244481 243588 242199 240888 239818 238765 237699 236985 236832 236876 236669 236376 236658 237922 240000
60879 240000 242437 244745 246448 247319 247727 248470 250044 252193 254225 255598 256162 256081 255704 255332 254966 254397 253597
60862 253597 252841 252316 251745 250563 248364 245128 241177 237024 233117 229543 226126 222924 220445 219165 218989
60847 218989 219522 220738 222963 226195 229798 233023 235543 237366 238580 239442 240413 241734 243168 244527 246250
60832 246250 248985 252597 256180 259166 261945 265108 268545 271722 274510 277176 279699 281658 282833 283513
60818 283513 284137 284965 286139 287617 288967 289619 289477 288860 287681 285245 281259 276650 272773 269965 267331
$$ packed form
60929B51404n575m381l039j902j314j369j646j341j47J037R56l31j305q28M73
60914B30692J200J008O99P73Q14M35qk8J98K14O1J85O81J143J244J104J028J104
60896B42547J126P94J4q93j389j311j070j053j066p14j53M4k07k93K82J264K078
60879B40000K437K308J703Q71M08P43J574K149K032J373N64q1l77l72l66n69q00
60862B53597p56n25n71j182k199l236l951m153l907l574l417l202k479j280j76
60847B18989N33J216K225L232L603L225K520J823J214Q62R71J321J434J359J723
60832B46250K735L612L583K986K779L163L437L177K788K666K523J959J175O80
60818B83513O24Q28J174J478J350O52j42o17j179k436l986m609l877k808k634
$$ plain form
60803 267331 263896 259515 254631 249602 244478 239188 233748 228359 223417 219298 216056 213297 210392 206919
60789 206919 203062 199539 196916 194984 193095 191152 189846 189687 190203 190452 190030 189195 188365 187973 188494 189923
60773 189923 191335 191661 190936 190229 190365 191357 193129 195924 199614 203276 206115 208483 211506 215953 221802
60758 221802 228639 235966 243262 250178 256738 263123 269290 274979 280031 284552 288816 293063 297229 300839
60744 300839 303342 304672 305193 305010 303712 301062 297611 294258 291360 288629 285729 282636 279442 276182 272885
60729 272885 269555 266070 262222 257883 253022 247660 241958 236288 231130 226851 223541 220883 218263 215341
60715 215341 212516 210490 209297 208185 206623 204936 203677 202892 202433 202472 203096 203765 203948 204101 205265 207663
60699 207663 210413 212739 214777 216943 219119 220928 222440 224213 226750 230118 233924 237523 240366 242309
$$ packed form
60803B67331l435m381m884n029n124n290n440n389m942m119l242k759k905l473
60789B06919l857l523k623j932j889j943j306j59N16K49m22q35q30l92N21J429
60773A89923J412L26p25p07J36R92J772K795L690L662K839K368L023M447N849
60758B21802O837P327P296O916O560O385O167N689N052M521M264M247M166L610
60744C00839K503J330N21j83j298k650l451l353k898k731k900l093l194l260l297
60729B72885l330l485l848m339m861n362n702n670n158m279l310k658k620k922
60715B15341k825k026j193j112j562j687j259p85m59L9O24O69J83J53J164K398
60699B07663K750K326K038K166K176J809J512J773K537L368L806L599K843J943
$$ plain form
60685 242309 243442 243676 242775 240836 238409 235929 233279 230059 226088 221483 216486 211381 206454 201853 197590
60670 197590 193698 190294 187464 185222 183561 182318 181059 179462 177846 176908 176777 176783 176433 176229 177063 179043
60654 179043 181432 183639 185775 188113 190481 192493 194136 195810 197785 199884 201730 203132 204072 204441 204048
60639 204048 203039 202131 202155 203315 204960 206137 206350 205856 205382 205621 206891 209127 212078 215478 219134 223018
60623 223018 227297 232060 236998 241617 245884 250354 255425 260682 265337 269098 272221 274795 276372 276407 274733
60608 274733 271649 267808 263986 260601 257376 253706 249336 244468 239364 234260 229573 225704 222589 219906
60594 219906 217726 216410 215802 215138 213951 212510 211118 209664 208269 207722 208622 210488 212364 214040 216024
60579 216024 218470 220827 222613 224001 225526 227560 230159 233083 235933 238511 241083 244098 247695 251652
$$ packed form
60685B42309J133K34r01j939k427k480k650l220l971m605m997n105m927m601m263
60670A97590l892l404k830k242j661j243j259j597j616r38j31Ol50k04Q34J980
60654A79043K389K207K136K338K368K012J643J674J975K099J846J402R40L69l93
60639B04048j009r08K4J160J645J177K13m94m74K39J270K236K951L400L656L884
60623B23018M279M763M938M619M267M470N071N257M655L761L123K574J577L5j674
60608B74733l084l841l822l385l225l670m370m868n104n104m687l869l115k683
60594B19906k180j316o08o64j187j441j392j454j395n47R00J866J876J676J984
60579B16024K446K357J786J388J525K034K599K924K850K578K572L015L597L957
$$ plain form
60565 251652 255717 259808 264113 269233 276024 284937 295657 307695 321150 336603 354637 375981 401826
60552 401826 433139 469448 508758 548607 586628 620155 646166 662175 666902 660048 642108 614892
60540 614892 581632 545835 509972 475436 443336 414759 390342 370061 353453 339826 328395
60529 328395 318693 310931 305631 302804 301685 301398 301710 303045 305880 310287 316066 323231 332254 343848
60515 343848 358637 377182 400185 428311 461678 499710 541554 586348 632742 678264 719567
60504 719567 753637 779000 796072 806656 813128 817855 822897 829644 838109 846389 851127 848968 837895
60491 837895 817450 788172 751187 708238 661667 614023 567586 524097 484672 449741 419093
60480 419093 392104 368127 346816 328167 312291 299134 288379 279516 271928 265031 258458 252142
$$ packed form
60565B51652M065M091M305N120O791Q913J0720J2038J3455J5453J8034K1344K5845
60552D01826L1313L6309L9310L9849L8021L3527K6011J6009M727o854j7940k7216
60540F14892l3260l5797l5863l4536l2100k8577k4417k0281j6608j3627j1431
60529C28395r702p762n300k827j119k87L12J335K835M407N779P165R023J1594
60515C43848J4789J8545K3003K8126L3367L8032M1844M4794M6394M5522M1303
60504G19567L4070K5363J7072J0584O472M727N042O747Q465Q280M738k159j1073
60491H37895k0445k9278l6985m2949m6571m7644m6437m3489l9425l4931l0648
60480D19093k6989k3977k1311j8649j5876j3157j0755q863p588o897o573o316
$$ plain form
60468 252142 246201 240802 236160 232446 229445 226480 222988 219193 215881 213467 211577 209661 207702 206113
60454 206113 205170 204780 204698 204726 204739 204633 204258 203422 202075 200439 198743 196836 194420 191722 189545 188441 188214
60437 188214 188468 189236 190597 192045 192889 193185 193703 194884 196283 197179 197347 197083 196815 196881 197423 198250 198970 199406
60419 199406 199761 200324 201208 202451 204132 206186 208275 210023 211299 212136 212492 212320 211924 212079 213636 216800
60403 216800 220779 224310 226749 228562 230648 233318 236243 239231 242533 246274 250029 253295 256142 259041
60389 259041 262227 265532 268779 272035 275367 278551 281170 282998 284262 285472 286886 288229 289068 289463 289993
60374 289993 291066 292413 293434 293857 293913 294038 294601 295750 297310 298872 300168 301290 302358 303148 303249 302544
60358 302544 301295 299805 298197 296528 294901 293411 292112 291005 289924 288455 286191 283129 279752 276642
$$ packed form
60468B52142n941n399m642l714l001k965l492l795l312k414j890j916j959j589
60454B06113r43l90q2K8J3j06l75q36j347j636j696j907k416k698k177j104k27
60437A88214K54P68J361J448Q44K96N18J181J399Q96J68k64k68O6N42Q27P20M36
60419A99406L55N63Q84J243J681K054K089J748J276Q37L56j72l96J55J557L164
60403B16800L979L531K439J813K086K670K925K988L302L741L755L266K847K899
60389B59041L186L305L247L256L332L184K619J828J264J210J414J343Q39L95N30
60374B89993J073J347J021M23N6J25N63J149J560J562J296J122J068P90J01p05
60358C02544j249j490j608j669j627j490j299j107j081j469k264l062l377l110
$$ plain form
60344 276642 274031 271673 269156 266410 263985 262618 262480 263017 263630 264183 264621 264501 263444 261887 260775 260495
60328 260495 260567 260427 260013 259429 258567 257329 255824 254053 251820 249249 247007 245573 244630 243617 242671 242550
60312 242550 243739 246073 249104 252429 255655 258514 261002 263035 264027 263291 260885 257585 253861 249393 243875
60297 243875 237851 232354 228032 224948 223013 222140 222067 222402 222853 223215 223284 223091 223116 223803 224846 225394 225111 224677
60279 224677 224989 226124 227361 228004 227908 227342 226714 226437 226771 227710 229210 231525 235001 239438 243918 247537
60263 247537 250163 252360 254706 257463 260720 264457 268361 271827 274359 275881 276678 277168 277743 278557 279393
60248 279393 279938 280345 281243 283041 285446 287939 290470 293337 296587 300035 303899 308837 315125 322199 329288
60233 329288 336274 343656 351921 361281 371855 383706 396736 410929 426735 444881 465656 488615
$$ packed form
60344B76642k611k358k517k746k425j367j38N37O13N53M38j20j057j557j112k80
60328B60495P2j40m14n84q62j238j505j771k233k571k242j434r43j013r46j21
60312B42550J189K334L031L325L226K859K488K033R92p36k406l300l724m468n518
60297B43875o024n497m322l084j935q73p3L35M51L62O9j93K5O87J043N48k83m34
60279B24677L12J135J237O43r6n66o28k77L34R39J500K315L476M437M480L619
60263B47537K626K197K346K757L257L737L904L466K532J522P97M90N75Q14Q36
60248B79393N45M07Q98J798K405K493K531K867L250L448L864M938O288P074P089
60233C29288O986P382Q265R360J0574J1851J3030J4193J5806J8146K0775K2959
$$ plain form
60221 488615 513151 539161 567023 597121 629601 664464 701564 740408 780033 819151 856467
60210 856467 891046 922575 951206 976981 999414 1017795 1031814 1041647 1047385 1048755 1045654 1038761
60198 1038761 1029332 1018445 1006742 994784 983238 972597 963090 955144 949755 947979 950095 955530 963730
60185 963730 974933 989995 1009597 1033806 1062317 1094876 1131182 1170453 1211390 1252794 1294002
60174 1294002 1334450 1372931 1407771 1437802 1462759 1482556 1496662 1504537 1506209 1501817 1490895 1472860
60162 1472860 1448276 1418904 1386320 1351101 1313674 1275391 1238191 1203524 1172082 1144367 1120972
60151 1120972 1102322 1088534 1079541 1075023 1074344 1077010 1083251 1093674 1108126 1125217 1143202 1161112
60139 1161112 1178717 1195607 1210721 1222876 1231434 1236255 1237254 1234379 1228113 1219605 1210024 1199855 1189169
$$ packed form
60221D88615K4536K6010K7862L0098L2480L4863L7100L8844L9625L9118L7316
60210H56467L4579L1529K8631K5775K2433J8381J4019R833N738J370l101o893
60198A038761r429j0887j1703j1958j1546j0641r507p946n389j776K116N435Q200
60185I63730J1203J5062J9602K4209K8511L2559L6306L9271M0937M1404M1208
60174A294002M0448L8481L4840L0031K4957J9797J4106P875J672m392j0922j8035
60162A472860k4584k9372l2584l5219l7427l8283l7200l4667l1442k7715k3395
60151A120972j8650j3788q993m518o79K666O241J0423J4452J7091J7985J7910
60139A161112J7605J6890J5114J2155Q558M821R99k875o266q508r581j0169j0686
$$ plain form
60126 1189169 1178470 1168938 1161784 1157751 1157368 1161258 1169862 1183176 1201197 1224374 1253238 1287742 1327500
60113 1327500 1372598 1423641 1480977 1544350 1613442 1688247 1768611 1853762 1942451 2033263 2124456
60102 2124456 2213753 2298615 2376709 2446112 2505319 2553197 2588734 2610788 2618480 2611936 2592221 2560279
60090 2560279 2516474 2461572 2397626 2327115 2251588 2171992 2090333 2009993 1933951 1863243 1797502
60079 1797502 1736530 1680815 1630896 1586879 1548609 1515939 1488735 1466837 1450082 1438272 1431088
60068 1431088 1428049 1428458 1431382 1435905 1441611 1448630 1457072 1466484 1475957 1484627 1491970 1497840 1502389 1505653
60054 1505653 1506962 1505022 1498989 1489293 1476920 1462021 1443834 1421992 1397221 1370443 1341842 1311380
60042 1311380 1279818 1248509 1218324 1189455 1162354 1138224 1118195 1102362 1089987 1080561 1074466 1072742
$$ packed form
60126A189169j0699r532p154m033l83L890Q604J3314J8021K3177K8864L4504L9758
60113A327500M5098N1043N7336O3373O9092P4805Q0364Q5151Q8689R0812R1193
60102B124456Q9297Q4862P8094O9403N9207M7878L5537K2054P692o544j9715l1942
60090B560279m3805n4902o3946p0511p5527p9596q1659q0340p6042p0708o5741
60079A797502o0972n5715m9919m4017l8270l2670k7204k1898j6755j1810p184
60068A431088l039M09K924M523N706P019Q442R412R473Q670P343N870M549L264
60054A505653J309j940o033r696j2373j4899j8187k1842k4771k6778k8601l0462
60042A311380l1562l1309l0185k8869k7101k4130k0029j5833j2375r426o095j724
$$ plain form
60030 1072742 1076456 1086193 1101870 1122999 1149231 1180656 1217478 1259368 1305276 1353928 1404421 1456163
60018 1456163 1508199 1558656 1605032 1645120 1677637 1701992 1717753 1724606 1722634 1712212 1693529 1666581
60006 1666581 1631809 1590438 1544020 1493998 1442029 1390365 1341236 1295829 1254255 1216554 1183278
59995 1183278 1155044 1132066 1114414 1102383 1096242 1095860 1100990 1111731 1128392 1151000 1179310 1213281
59983 1213281 1253127 1298860 1350102 1406352 1466934 1530376 1594109 1655185 1711353 1761343 1804355
59972 1804355 1839590 1866291 1883924 1892207 1891028 1880451 1860664 1831940 1794837 1750638 1701520 1650113
59960 1650113 1598812 1549456 1503486 1462129 1426310 1396461 1372563 1354396 1341757 1334531 1332696 1336344
59948 1336344 1345671 1360808 1381531 1407112 1436570 1469219 1504941 1543764 1585097 1627486 1669176
$$ packed form
60030A072742L714R737J5677K1129K6232L1425L6822M1890M5908M8652N0493N1742
60018A456163N2036N0457M6376M0088L2517K4355J5761O853j972j0422j8683k6948
60006A666581l4772m1371m6418n0022n1969n1664m9129m5407m1574l7701l3276
59995A183278k8234k2978j7652j2031o141l82N130J0741J6661K2608K8310L3971
59983A213281L9846M5733N1242N6250O0582O3442O3733O1076N6168M9990M3012
59972A804355L5235K6701J7633Q283j179j0577j9787k8724l7103m4199m9118n1407
59960A650113n1301m9356m5970m1357l5819k9849k3898j8167j2639p226j835L648
59948A336344R327J5137K0723K5581K9458L2649L5722L8823M1333M2389M1690
$$ plain form
59937 1669176 1708819 1745607 1778948 1808336 1833567 1854839 1872500 1886796 1897962 1906466 1912915 1917740
59925 1917740 1921174 1923793 1927077 1933178 1943877 1959719 1980320 2005554 2036177 2073150 2116483 2164977
59913 2164977 2216981 2271165 2326592 2382289 2436843 2488204 2533884 2571627 2600054 2618582 2626782
59902 2626782 2624156 2610669 2587168 2554933 2515034 2468467 2416774 2362064 2306299 2250747 2196203
59891 2196203 2143485 2093592 2047575 2006325 1970306 1939356 1913003 1891174 1874549 1863980 1859617
59880 1859617 1860763 1866548 1876529 1890538 1908172 1928680 1951316 1975531 2000692 2025769 2049556 2071197
59868 2071197 2090312 2106526 2118982 2126487 2128153 2123902 2114429 2100619 2082823 2060590 2033238 2000850
59856 2000850 1964672 1926389 1886978 1846351 1804039 1760178 1715895 1672814 1632160 1594209 1558655
$$ packed form
59937A669176L9643L6788L3341K9388K5231K1272J7661J4296J1166Q504O449M825
59925A917740L434K619L284O101J0699J5842K0601K5234L0623L6973M3333M8494
59913B164977N2004N4184N5427N5697N4554N1361M5680L7743K8427J8528Q200
59902B626782k626j3487k3501l2235l9899m6567n1693n4710n5765n5552n4544
59891B196203n2718m9893m6017m1250l6019l0950k6353k1829j6625j0569m363
59880A859617J146N785R981J4009J7634K0508K2636K4215K5161K5077K3787K1641
59868B071197J9115J6214J2456P505J666m251r473j3810j7796k2233k7352l2388
59856B000850l6178l8283l9411m0627m2312m3861m4283m3081m0654l7951l5554
$$ plain form
59845 1558655 1525499 1495366 1468833 1445640 1424821 1405478 1387159 1369563 1352295 1335090 1318031
59834 1318031 1301454 1285740 1271219 1258073 1246245 1235659 1226555 1219456 1214707 1212234 1211816 1213383 1216976
59821 1216976 1222575 1230003 1238764 1247943 1256591 1264352 1271481 1278098 1283708 1287670 1289873 1290756 1290854 1290561 1290018
59806 1290018 1288956 1286924 1284026 1281190 1279272 1278105 1276900 1275452 1274319 1273870 1273737 1273409 1272819 1272033 1270786
59791 1270786 1268681 1265586 1261466 1256022 1248883 1240209 1230900 1222169 1214880 1209215 1204829 1201376 1198879 1197602
59777 1197602 1197732 1199519 1203677 1211199 1222595 1237563 1255657 1277041 1302409 1332471 1367834 1409240
59765 1409240 1457574 1513749 1578760 1653717 1739408 1835716 1941345 2053531 2167372 2275405
59755 2275405 2368425 2437438 2475570 2479326 2449367 2390678 2311492 2221042 2127362 2036178 1950953
$$ packed form
59845A558655l3156l0133k6533k3193k0819j9343j8319j7596j7268j7205j7059
59834A318031j6577j5714j4521j3146j1828j0586r104p099m749k473m18J567L593
59821A216976N599P428Q761R179Q648P761P129O617N610L962K203Q83R8k93n43
59806A290018j062k032k898k836j918j167j205j448j133m49j33l28n90p86j247
59791A270786k105l095m120n444p139q674r309q731p289n665m386l453k497j277
59777A197602J30J787M158P522J1396J4968J8094K1384K5368L0062L5363M1406
59765A409240M8334N6175O5011P4957Q5691R6308J05629J12186J13841J08033
59755B275405R3020O9013L8132L756k9959n8689p9186r0450r3680r1184q5225
$$ plain form
59744 1950953 1873524 1804880 1745606 1695796 1654866 1621916 1596403 1578174 1566788 1561193 1560369 1564109
59732 1564109 1572812 1586577 1604820 1626851 1652611 1682689 1717624 1757309 1801145 1848827 1900871
59721 1900871 1958255 2021660 2091271 2167342 2250671 2342336 2443151 2553508 2673613 2803684
59711 2803684 2943893 3094144 3253756 3421244 3594524 3771388 3949542 4125998 4296650
59702 4296650 4456937 4603132 4733074 4845906 4941519 5020342 5083431 5132531 5169968 5198330
59692 5198330 5219992 5236753 5249884 5260383 5269060 5276480 5283015 5288964 5294375 5298785 5301493 5302345 5302145
59679 5302145 5302109 5303054 5305349 5309501 5316447 5327148 5342244 5362317 5388322 5421432 5462488 5511802 5569512
59666 5569512 5635874 5711077 5794992 5887140 5986632 6091845 6200426 6309912 6418198 6522942
$$ packed form
59744A950953p7429o8644n9274m9810m0930l2950k5513j8229j1386n595q24L740
59732A564109Q703J3765J8243K2031K5760L0078L4935L9685M3836M7682N2044
59721A900871N7384O3405O9611P6071Q3329R1665J00815J10357J20105J30071
59711B803684J40209J50251J59612J67488J73280J76864J78154J76456J70652
59702D296650J60287J46195J29942J12832R5613P8823O3089M9100L7437K8362
59692E198330K1662J6761J3131J0499Q677P420O535N949N411M410K708Q52k00
59679E302145l6R45K295M152O946J0701J5096K0073K6005L3110M1056M9314N7710
59666E569512O6362P5203Q3915R2148R9492J05213J08581J09486J08286J04744
$$ plain form
59656 6522942 6620640 6706888 6777698 6830124 6861458 6868490 6848210 6799130 6721632 6617419 6489223
59645 6489223 6340961 6177436 6003559 5823946 5643197 5466146 5297650 5142180 5003300
59636 5003300 4882795 4779810 4690708 4609631 4529027 4440202 4334661 4206282 4053043 3877401
59626 3877401 3685490 3485568 3285890 3092854 2910627 2742020 2588966 2451952 2329805
59617 2329805 2220749 2123534 2037237 1960561 1892129 1831246 1777624 1730311 1687556 1647896 1610877
59606 1610877 1576599 1545047 1516095 1489645 1465399 1442794 1421466 1401601 1383549 1367226 1352138
59595 1352138 1337794 1323877 1310126 1296301 1282281 1268086 1253813 1239670 1226030 1213353 1201962
59584 1201962 1191753 1182015 1171719 1160350 1148520 1137473 1127882 1119384 1111387 1103987 1097827 1093308 1090265
$$ packed form
59656F522942R7698Q6248P0810N2426L1334P032k0280m9080p7498j04213j28196
59645F489223j48262j63525j73877j79613j80749j77051j68496j55470j38880
59636E003300j20505j02985q9102q1077q0604q8825j05541j28379j53239j75642
59626C877401j91911j99922j99678j93036j82227j68607j53054j37014j22147
59617B329805j09056r7215q6297p6676o8432o0883n3622m7313m2755l9660l7019
59606A610877l4278l1552k8952k6450k4246k2605k1328j9865j8052j6323j5088
59595A352138j4344j3917j3751j3825j4020j4195j4273j4143j3640j2677j1391
59584A201962j0209r738j0296j1369j1830j1047r591q498p997p400o160m519l043
$$ plain form
59571 1090265 1088301 1087142 1086696 1087020 1088233 1090370 1093386 1097409 1102774 1109626 1117719 1126916 1137717 1150834
59557 1150834 1166344 1183667 1202458 1223032 1245720 1270209 1295844 1322408 1350319 1380252 1412802
59546 1412802 1448484 1487814 1531245 1578688 1628491 1676703 1718138 1749319 1770868 1786802 1801395
59535 1801395 1816823 1833334 1850639 1868483 1886382 1903539 1919021 1931671 1940099 1943395 1941893 1936687
59523 1936687 1928255 1916072 1899805 1880261 1858655 1835332 1809885 1782414 1754026 1725991 1698899
59512 1698899 1672769 1647549 1623291 1600220 1578947 1560334 1544928 1532748 1523857 1518819 1518248 1522218
59500 1522218 1530560 1543578 1561909 1585732 1614670 1648540 1687757 1732816 1783788 1840459 1902358
59489 1902358 1968277 2036168 2104025 2170660 2235124 2295597 2349405 2394152 2428339 2450923 2460924
$$ packed form
59571A090265j964j159m46L24J213K137L016M023N365O852Q093R197J0801J3117
59557A150834J5510J7323J8791K0574K2688K4489K5635K6564K7911K9933L2550
59546A412802L5682L9330M3431M7443M9803M8212M1435L1181K1549J5934J4593
59535A801395J5428J6511J7305J7844J7899J7157J5482J2650Q428L296j502n206
59523A936687q432j2183j6267j9544k1606k3323k5447k7471k8388k8035k7092
59512A698899k6130k5220k4258k3071k1273j8613j5406j2180q891n038n71L970
59500A522218Q342J3018J8331K3823K8938L3870L9217M5059N0972N6671O1899
59489A902358O5919O7891O7857O6635O4464O0473N3808M4747L4187K2584J0001
$$ plain form
59478 2460924 2457840 2442208 2415514 2379722 2336965 2289269 2238252 2185127 2131162 2077966 2027272
59467 2027272 1980606 1939183 1903690 1873898 1848846 1827764 1810580 1797241 1786882 1778245 1770737 1764429
59455 1764429 1758976 1753075 1745183 1734372 1720378 1703221 1682977 1659607 1632898 1602857 1570157 1535706
59443 1535706 1499656 1461417 1420898 1379183 1337562 1296430 1255684 1215699 1177182 1140269 1104550
59432 1104550 1069977 1037064 1006197 977340 950563 926218 904408 884788 867177 851941 839516
59421 839516 830020 823717 821533 824560 832842 844503 855779 862132 860352 850511 835967 821155 809215
59408 809215 801477 798421 800455 807820 820009 835050 849114 857433 856684 846946 831181 812866 794300
59395 794300 776749 761139 748047 737466 729158 723185 719780 718819 719789 722335 726578 732772 740815 750313
$$ packed form
59478B460924l084j5632k6694l5792m2757m7696n1017n3125n3965n3196n0694
59467B027272m6666m1423l5493k9792k5052k1082j7184j3339j0359q637p508o308
59455A764429n453n901p892j0811j3994j7157k0244k3370k6709l0041l2700l4451
59443A535706l6050l8239m0519m1715m1621m1132m0746l9985l8517l6913l5719
59432A104550l4573l2913l0867k8857k6777k4345k1810j9620j7611j5236j2425
59421H39516r496o303k184L027Q282J1661J1276O353j780r841j4544j4812j1940
59408H09215p738l056K034P365J2189J5041J4064Q319p49r738j5765j8315j8566
59395G94300j7551j5610j3092j0581q308n973l405r61R70K546M243O194Q043R498
$$ plain form
59381 750313 761061 773217 786958 802200 818886 837379 858191 881277 905938 931550 958090
59370 958090 985750 1014383 1043676 1073671 1104726 1137038 1170447 1204669 1239554 1275333 1312909
59359 1312909 1353725 1398999 1449213 1504646 1566149 1634870 1711362 1795544 1887447 1987338 2095044
59348 2095044 2209821 2331079 2458554 2591365 2727495 2864542 3000412 3132823 3258773
59339 3258773 3375343 3480842 3574552 3655656 3723133 3776577 3816286 3842428 3854815 3853695 3840129
59328 3840129 3815140 3778914 3731152 3671764 3600804 3518088 3423530 3317954 3203240 3081599 2954883
59317 2954883 2824631 2692525 2560640 2431206 2306065 2186333 2072583 1965395 1865543 1773594
59307 1773594 1689487 1612766 1543158 1480681 1425112 1375633 1331184 1291059 1254961 1222651 1193827
$$ packed form
59381G50313J0748J2156J3741J5242J6686J8493K0812K3086K4661K5612K6540
59370I58090K7660K8633K9293K9995L1055L2312L3409L4222L4885L5779L7576
59359A312909M0816M5274N0214N5433O1503O8721P6492Q4182R1903R9891J07706
59348B095044J14777J21258J27475J32811J36130J37047J35870J32411J25950
59339C258773J16570J05499R3710Q1104O7477N3444L9709K6142J2387j120j3566
59328C840129k4989l6226m7762n9388p0960q2716r4558j05576j14714j21641j26716
59317B954883j30252j32106j31885j29434j25141j19732j13750j07188r9852r1949
59307A773594q4107p6721o9608o2477n5569m9479m4449m0125l6098l2310k8824
$$ plain form
59296 1193827 1168377 1146375 1127584 1111207 1096495 1083489 1072748 1064311 1057336 1050911 1044875 1039655
59284 1039655 1035678 1033308 1032969 1034751 1038001 1041825 1046048 1051262 1057905 1065792 1074697 1084887 1096751 1110215
59270 1110215 1124800 1139969 1155094 1169381 1182276 1193873 1204567 1214315 1222478 1228342 1231520 1231899
59258 1231899 1229458 1224174 1215887 1204367 1189692 1172545 1153835 1134057 1113214 1091317 1068652 1045640
59246 1045640 1022787 1000740 979885 959802 939631 919214 899460 881269 864547 848748 833963
59235 833963 820812 809376 798936 788896 779397 770804 763010 755590 748329 741362 734982 729562 725452
59222 725452 722735 721210 720797 721687 723904 726970 730441 734585 740065 746993 754832 763352 773186 785137
59208 785137 799324 815508 834001 855624 880699 908697 939269 973318 1012528 1057844 1108817
$$ packed form
59296A193827k5450k2002j8791j6377j4712j3006j0741q437o975o425o036n220
59284A039655l977k370l39J782L250L824M223N214O643P887Q905J0190J1864J3464
59270A110215J4585J5169J5125J4287J2895J1597J0694R748Q163N864L178L79
59258A231899k441n284q287j1520j4675j7147j8710j9778k0843k1897k2665k3012
59246A045640k2853k2047k0855k0083k0171k0417j9754j8191j6722j5799j4785
59235H33963j3151j1436j0440j0040r499q593p794p420p261o967o380n420m110
59222G25452k717j525m13Q90K217L066L471M144N480O928P839Q520R834J1951
59208G85137J4187J6184J8493K1623K5075K7998L0572L4049L9210M5316N0973
$$ plain form
59197 1108817 1164539 1224802 1290117 1360867 1436806 1517248 1601308 1687859 1775520 1862725 1947512
59186 1947512 2027179 2098494 2158602 2205599 2238184 2255093 2255316 2238767 2206458 2160031 2101389 2032691
59174 2032691 1956279 1874433 1789301 1703094 1618012 1535792 1457454 1383599 1314843 1251819 1194849
59163 1194849 1143762 1098120 1057624 1022242 991820 965696 942995 923429 907400 894982 885104
59152 885104 876227 867696 859907 853263 847624 842797 838814 835410 831883 827902 823976 820616 817490 813969
59138 813969 810125 806516 803233 799869 796415 793521 791768 791171 791480 792477 793875 795426 797330 800106 803838
59123 803838 807924 811814 815737 820372 826026 832411 839079 845832 852672 859463 865686 870640 874082 876624
59109 876624 879265 882456 885794 888537 890120 890234 888904 886653 884281 882253 880495 878895 877650 876969 876717
$$ packed form
59197A108817N5722O0263O5315P0750P5939Q0442Q4060Q6551Q7661Q7205Q4787
59186A947512P9667P1315O0108M6997L2585J6909K23j6549l2309m6427n8642o8698
59174B032691p6412q1846q5132q6207q5082q2220p8338p3855o8756o3024n6970
59163A194849n1087m5642m0496l5382l0422k6124k2701j9566j6029j2418r878
59152H85104q877q531p789o644n639m827l983l404l527l981l926l360l126l521
59138H13969l844l609l283l364l454k894j753n97L09R97J398J551J904K776L732
59123H03838M086L890L923M635N654O385O668O753O840O791O223M954L442K542
59109H76624K641L191L338K743J583J14j330k251k372k028j758j600j245o81k52
$$ plain form
59094 876717 876611 876582 876761 877365 878731 881147 884450 888058 891641 895517 900085 905206 910478 915903 921854
59079 921854 928523 935727 943171 950569 957645 964364 971083 978044 984768 990307 994159 996667 998426 999613
59065 999613 999908 998843 996104 991697 985874 978777 970147 959609 947264 933796 919926 905899 891511
59052 891511 876533 861053 845533 830505 816163 802265 788459 774632 760885 747407 734451
59041 734451 722190 710403 698616 686808 675635 665579 656157 646564 636954 628462 621891 616916 612711
59028 612711 608877 605506 602735 600502 598609 596859 595259 594046 593261 592398 590803 588356 585379 581924 577749
59013 577749 573027 568438 564301 560195 555759 551406 547886 545514 544141 543438 542823 541557 539426 537102 535402
58998 535402 534511 534256 534764 536222 538191 539826 540867 542036 544438 548788 555041 562382 569727 576660 583845
$$ packed form
59094H76717j06k9J79O04J366K416L303L608L583L876M568N121N272N425N951
59079I21854O669P204P444P398P076O719O719O961O724N539L852K508J759J187
59065I99613K95j065k739m407n823p097q630j0538j2345j3468j3870j4027j4388
59052H91511j4978j5480j5520j5028j4342j3898j3806j3827j3747j3478j2956
59041G34451j2261j1787j1787j1808j1173j0056r422r593r610q492o571m975m205
59028F12711l834l371k771k233j893j750j600j213p85q63j595k447k977l455m175
59013E77749m722m589m137m106m436m353l520k372j373p03o15j266k131k324j700
58998E35402q91k55N08J458J969J635J041J169K402M350O253P341P345O933P185
$$ plain form
58983 583845 592239 602118 613234 625602 639538 654958 671278 688045 705172 722440 739268 755112
58971 755112 769756 783125 795175 806006 815647 823676 829520 833263 835729 837599 838859 839280 838958 838044
58957 838044 836278 833193 828704 823265 817569 812102 806819 801205 794994 788876 784155 781543 780648 780710 781357
58942 781357 782369 783254 783605 783727 784506 786734 790799 796788 804530 813569 823340 833386 843381 853263 863444
58927 863444 874546 886713 899539 912961 927755 944665 963430 983271 1004102 1026626 1051385
58916 1051385 1078442 1108033 1140725 1176655 1215152 1255452 1297312 1340498 1383916 1425614 1463561
58905 1463561 1496341 1523518 1545856 1565155 1583508 1602475 1622912 1645431 1670779 1699783 1733025
58894 1733025 1770630 1812338 1857818 1906963 1959865 2016530 2076646 2139619 2204807 2271816 2340663
$$ packed form
58983E83845Q394R879J1116J2368J3936J5420J6320J6767J7127J7268J6828J5844
58971G55112J4644J3369J2050J0831R641Q029N844L743K466J870J260M21l22r14
58957H38044j766l085m489n439n696n467n283n614o211o118m721k612q95O2O47
58942G81357J012Q85L51J22P79K228M065N989P742R039R771J0046R995R882J0181
58927H63444J1102J2167J2826J3422J4794J6910J8765J9841K0831K2524K4759
58916A051385K7057K9591L2692L5930L8497M0300M1860M3186M3418M1698L7947
58905A463561L2780K7177K2338J9299J8353J8967K0437K2519K5348K9004L3242
58894A733025L7605M1708M5480M9145N2902N6665O0116O2973O5188O7009O8847
$$ plain form
58883 2340663 2411525 2484173 2557675 2630737 2702199 2770968 2835645 2894522 2945994 2988736 3021664
58872 3021664 3044275 3057274 3062486 3061777 3056100 3045624 3030399 3010589 2986263 2957371 2923935 2886141
58860 2886141 2844292 2798823 2750228 2698836 2644774 2588412 2530651 2472413 2413808 2354198 2293251
58849 2293251 2231724 2170994 2111973 2054734 1999122 1945356 1893837 1844589 1797250 1751697 1708407
58838 1708407 1667955 1630258 1594612 1560518 1528230 1498392 1471316 1446783 1424443 1404240 1386419
58827 1386419 1371237 1358697 1348542 1340501 1334527 1330677 1328798 1328496 1329537 1332148 1336802 1343709 1352583
58814 1352583 1362820 1373833 1385268 1397046 1409232 1421889 1435082 1448987 1463877 1479968 1497335
58803 1497335 1515998 1536033 1557623 1581094 1606785 1634683 1664372 1695714 1729576 1767292 1809206
$$ packed form
58883B340663P0862P2648P3502P3062P1462O8769O4677N8877N1472M2742L2928
58872C021664K2611J2999N212p09n677j0476j5225j9810k4326k8892l3436l7794
58860B886141m1849m5469m8595n1392n4062n6362n7761n8238n8605n9610o0947
58849B293251o1527o0730n9021n7239n5612n3766n1519m9248m7339m5553m3290
58838A708407m0452l7697l5646l4094l2288k9838k7076k4533k2340k0203j7821
58827A386419j5182j2540j0155q041n974l850j879l02J041K611M654O907Q874
58814A352583J0237J1013J1435J1778J2186J2657J3193J3905J4890J6091J7367
58803A497335J8663K0035K1590K3471K5691K7898K9689L1342L3862L7716M1914
$$ plain form
58792 1809206 1854169 1900881 1949279 2000141 2053667 2109194 2166253 2225119 2286078 2348600 2411559
58781 2411559 2473979 2535383 2595664 2654739 2711944 2765539 2813161 2853157 2885287 2909914 2926838
58770 2926838 2935385 2935416 2927576 2912409 2889688 2858933 2820367 2775116 2724649 2670222 2612651 2552237
58758 2552237 2488903 2422809 2355014 2287271 2220857 2155736 2091152 2026918 1963690 1902022 1841761
58747 1841761 1782711 1725435 1670883 1619462 1571062 1525848 1484299 1446328 1410958 1377251 1345231
58736 1345231 1315560 1288601 1264081 1241410 1219939 1199116 1178701 1158770 1139333 1120096 1100862
58725 1100862 1081984 1064098 1047536 1032271 1018274 1005666 994629 985546 979106 975904 975885 978432 982773
58712 982773 987816 991615 991629 985920 973977 956415 934262 908716 881091 852519 823709 795157 767469
$$ packed form
58792A809206M4963M6712M8398N0862N3526N5527N7059N8866O0959O2522O2959
58781B411559O2420O1404O0281N9075N7205N3595M7622L9996L2130K4627J6924
58770B926838Q547L1p840j5167k2721l0755l8566m5251n0467n4427n7571o0414
58758B552237o3334o6094o7795o7743o6414o5121o4584o4234o3228o1668o0261
58747A841761n9050n7276n4552n1421m8400m5214m1549l7971l5370l3707l2020
58736A345231k9671k6959k4520k2671k1471k0823k0415j9931j9437j9237j9234
58725A100862j8878j7886j6562j5265j3997j2608j1037r083o440l202j9K547M341
58712I82773N043L799J4n709j1943j7562k2153k5546k7625k8572k8810k8552k7688
$$ plain form
58699 767469 741293 717046 694851 674711 656613 640571 626639 614799 604846 596535 589887 585260
58687 585260 583077 583631 587029 592997 600633 608635 615866 621493 624578 623986 619028 609959 597703 583319
58673 583319 567913 552655 538500 525970 515398 507107 501085 496739 493297 490315 487532 484562 481125
58660 481125 477362 473480 469246 464233 458392 451948 445000 437806 431259 426289 422714 419380 415659 412183
58646 412183 409868 408858 408812 409581 410983 412312 412802 412521 412300 412814 414087 415855 417996 420526 423432 426603
58630 426603 429810 432764 435363 437808 440395 443266 446518 450384 455075 460540 466619 473317 480685 488407
58616 488407 495756 502005 506818 510304 512821 514713 516095 517020 517890 519531 522613 527081 532393 538252 544857
58601 544857 552540 561406 571353 582205 593821 606229 619634 634137 649515 665527 682327 700306
$$ packed form
58699G67469k6176k4247k2195k0140j8098j6042j3932j1840r953q311o648m627
58687E85260k183N54L398N968P636Q002P231N627L085n92m958r069j2256j4384
58673E83319j5406j5258j4155j2530j0572q291o022m346l442k982k783k970l437
58660D81125l763l882m234n013n841o444o948p194o547m970l575l334l721l476
58646D12183k315j010m6P69J402J329M90k81k21N14J273J768K141K530K906L171
58630D26603L207K954K599K445K587K871L252L866M691N465O079O698P368P722
58616D88407P349O249M813L486K517J892J382R25Q70J641L082M468N312N859O605
58601E44857P683Q866R947J0852J1616J2408J3405J4503J5378J6012J6800J7979
$$ plain form
58589 700306 719556 739834 761006 783064 805592 827718 848869 869257 889230 908388 925716
58578 925716 940458 952456 961723 968149 971816 973227 972872 970731 966495 960291 952860 944856 936174 926239
58564 926239 914927 902910 890996 879378 867763 856102 844845 834467 825021 816262 807946 799771
58552 799771 791160 781417 770193 757686 744351 730487 716175 701513 686730 672026 657410 642842
58540 642842 628503 614746 601702 589099 576647 564546 553432 543750 535258 527232 519182 511379
58528 511379 504636 499482 495591 492109 488527 485008 481869 479124 476807 475315 474941 475197 475127 474390 473580 473413
58512 473413 474085 475595 478160 481815 485882 489439 492324 495276 499001 503380 507648 511030 513003 513278 511933
58497 511933 509618 507316 505685 504695 504065 503938 504841 506888 509405 511664 513813 516701 520778 525582 530416
$$ packed form
58589G00306J9250K0278K1172K2058K2528K2126K1151K0388J9973J9158J7328
58578I25716J4742J1998R267O426L667J411l55k141m236o204p431q004q682r935
58564I26239j1312j2017j1914j1618j1615j1661j1257j0378r446q759q316q175
58552G99771q611r743j1224j2507j3335j3864j4312j4662j4783j4704j4616j4568
58540F42842j4339j3757j3044j2603j2452j2101j1114r682q492q026q050p803
58528E11379o743n154l891l482l582l519l139k745k317j492l74K56p0p37q10j67
58512D73413O72J510K565L655M067L557K885K952L725M379M268L382J973K75j345
58497E11933k315k302j631r90o30j27R03K047K517K259K149K888M077M804M834
$$ plain form
58482 530416 535174 540195 545492 550421 554104 556122 556887 557405 558454 559809 560375 559237 556503 553059 549642
58467 549642 546244 542225 536867 530063 522700 516122 510967 506675 502415 498231 494921 492951 492066 491965 492705
58452 492705 494181 495680 496350 495984 495035 494025 493187 492602 492409 492766 493697 494964 496165 497033 497702 498529 499651
58435 499651 500903 502173 503575 505158 506706 508042 509334 510870 512705 514710 516885 519375 522304 525723
58421 525723 529530 533274 536329 538607 540789 543462 546335 548928 551760 555858 561012 565587 568607 571163
58407 571163 574938 580005 585090 589592 594191 599558 605610 612264 619842 628232 636466 643851 650865 658348
58393 658348 666321 674292 682140 689870 696814 702103 705862 709108 712335 715022 716665 717527 718054 718298 718412
58378 718412 719210 721680 726186 732456 739989 748130 756172 763894 771775 780236 788929 797229 805181 813338
$$ packed form
58482E30416M758N021N297M929L683K018P65N18J049J355N66j138k734l444l417
58467E49642l398m019n358o804p363o578n155m292m260m184l310j970q85j01P40
58452D92705J476J499O70l66r49j010q38n85j93L57R31J267J201Q68O69Q27J122
58435D99651J252J270J402J583J548J336J292J536J835K005K175K490K929L419
58421E25723L807L744L055K278K182K673K873K593K832M098N154M575L020K556
58407E71163L775N067N085M502M599N367O052O654P578Q390Q234P385P014P483
58393F58348P973P971P848P730O944N289L759L246L227K687J643Q62N27K44J14
58378G18412P98K470M506O270P533Q141Q042P722P881Q461Q693Q300P952Q157
$$ plain form
58364 813338 821753 829747 836854 843532 850734 859000 868070 877139 885419 892736 899760 907505 916488 926436
58350 926436 936695 946708 956181 965186 974221 983867 994223 1004859 1015391 1025828 1036273 1046643
58338 1046643 1056915 1067448 1078691 1090691 1103153 1115901 1129039 1142652 1156628 1170835 1185277
58327 1185277 1199971 1214795 1229577 1244288 1259095 1274271 1290052 1306554 1323774 1341749 1360683
58316 1360683 1380830 1402156 1424223 1446541 1468980 1491742 1514926 1538365 1561981 1586131 1611362
58305 1611362 1637787 1664843 1691740 1718054 1743899 1769645 1795566 1821710 1848063 1874825 1902447
58294 1902447 1931306 1961400 1992491 2024535 2057766 2092303 2127968 2164598 2202377 2241691 2282746
58283 2282746 2325484 2369767 2415378 2461905 2508805 2555726 2602771 2650491 2699681 2751099 2805248
$$ packed form
58364H13338Q415P994P107O678P202Q266R070R069Q280P317P024P745Q983R948
58350I26436J0259J0013R473R005R035R646J0356J0636J0532J0437J0445J0370
58338A046643J0272J0533J1243J2000J2462J2748J3138J3613J3976J4207J4442
58327A185277J4694J4824J4782J4711J4807J5176J5781J6502J7220J7975J8934
58316A360683K0147K1326K2067K2318K2439K2762K3184K3439K3616K4150K5231
58305A611362K6425K7056K6897K6314K5845K5746K5921K6144K6353K6762K7622
58294A902447K8859L0094L1091L2044L3231L4537L5665L6630L7779L9314M1055
58283B282746M2738M4283M5611M6527M6900M6921M7045M7720M9190N1418N4149
$$ plain form
58272 2805248 2862392 2922713 2986334 3053143 3122793 3194972 3269556 3346466 3425578 3506947 3590949
58261 3590949 3677975 3768049 3860781 3955605 4052034 4150019 4250291 4354082 4462207 4574636
58251 4574636 4691279 4812942 4941057 5076586 5219688 5370362 5528865 5695416 5870077
58242 5870077 6053233 6245853 6449017 6663457 6889740 7128611 7380949 7647629 7929674
58233 7929674 8228336 8544812 8880083 9235325 9612397 10013655 10441363 10897476 11384074
58224 11384074 11903905 12460604 13058473 13702075 14396054 15145414 15955916 16834175 17787657
58215 17787657 18825086 19957052 21196017 22555802 24051358 25698771 27514583 29514889
58207 29514889 31716732 34143097 36828715 39822343 43184480 46983943 51296986 56209237
$$ packed form
58272B805248N7144O0321O3621O6809O9650P2179P4584P6910P9112Q1369Q4002
58261C590949Q7026R0074R2732R4824R6429R7985J00272J03791J08125J12429
58251D574636J16643J21663J28115J35529J43102J50674J58503J66551J74661
58242E870077J83156J92620K03164K14440K26283K38871K52338K66680K82045
58233G929674K98662L16476L35271L55242L77072M01258M27708M56113M86598
58224A1384074N19831N56699N97869O43602O93979P49360Q10502Q78259R53482
58215A7787657J037429J131966J238965J359785J495556J647413J815812K000306
58207B9514889K201843K426365K685618K993628L362137L799463M313043M912251
$$ plain form
58199 56209237 61817976 68232464 75571985 83962369 93531249 104400662 116673967 130413638
58191 130413638 145607316 162121786 179648781 197653630 215346615 231702888 245552823
58184 245552823 255745253 261353697 261865495 257287314 248128759 235275477 219804275 202802764
58176 202802764 185236550 167877259 151282781 135812543 121661149 108897909 97504365
58169 97504365 87405946 78496620 70656757 63765027 57705583 52372168 47670170 43516781
58161 43516781 39839559 36574831 33667291 31070186 28744327 26655909 24775124 23076335
58153 23076335 21538138 20141992 18870903 17709893 16647091 15673105 14779116 13956234
58145 13956234 13196679 12494551 11844962 11243037 10684173 10164615 9681132 9230387 8809174
$$ packed form
58199E6209237N608739O414488P339521Q390384R568880J0869413J2273305J3739671
58191A30413638J5193678J6514470J7526995J8004849J7692985J6356273J3849935
58184B45552823J0192430N608444N11798m578181r158555j2853282j5471202j7001511
58176B02802764j7566214j7359291j6594478j5470238j4151394j2763240j1393544
58169I7504365j0098419q909326p839863o891730o059444n333415m701998m153389
58161D3516781l677222l264728k907540k597105k325859k088418j880785j698789
58153B3076335j538197j396146j271089j161010j062802r73986q93989q22882
58145A3956234p59555p02128o49589o01925n58864n19558m83483m50745m21213
$$ plain form
58136 8809174 8415030 8046143 7700710 7376736 7072296 6785670 6515364 6260377 6020281
58127 6020281 5794614 5582189 5381268 5190346 5008496 4835140 4669943 4512823 4363641
58118 4363641 4221761 4086293 3956746 3833046 3714867 3601446 3492194 3387021 3285760
58109 3285760 3187754 3092478 3000291 2912133 2828564 2749431 2674314 2602949 2535256 2471335 2411482
58098 2411482 2355934 2304578 2256981 2212546 2170360 2129220 2088308 2047782 2008175 1969219 1929873
58087 1929873 1889734 1849814 1811464 1774852 1738913 1702571 1665628 1628606 1592120 1556381 1521107
58076 1521107 1485938 1451026 1417006 1384249 1352459 1321332 1291238 1262774 1235854 1209877 1184725
58065 1184725 1160995 1139078 1118523 1098574 1079006 1060128 1042207 1025094 1008348 991577 974701
$$ packed form
58136H809174l94144l68887l45433l23974l04440k86626k70306k54987k40096
58127F020281k25667k12425k00921j90922j81850j73356j65197j57120j49182
58118D363641j41880j35468j29547j23700j18179j13421j09252j05173j01261
58109C285760r8006r5276r2187q8158q3569p9133p5117p1365o7693o3921n9853
58098B411482n5548n1356m7597m4435m2186m1140m0912m0526l9607l8956l9346
58087A929873m0139l9920l8350l6612l5939l6342l6943l7022l6486l5739l5274
58076A521107l5169l4912l4020l2757l1790l1127l0094k8464k6920k5977k5152
58065A184725k3730k1917k0555j9949j9568j8878j7921j7113j6746j6771j6876
$$ plain form
58054 974701 957883 941209 924571 908064 892223 877482 863503 849520 835342 821585 808863
58043 808863 797186 786199 775570 765028 754494 744338 735063 726596 718320 709975 701989 694691 687772
58030 687772 680809 673778 666644 659022 650741 642232 633795 624984 615371 605511 596403 588301 580836 574037
58016 574037 568338 563615 559086 554316 549646 545565 542312 540132 539161 538845 538188 536848 535423 534453 533850
58001 533850 533608 534203 535675 537006 537226 536795 537111 538843 541447 544207 547026 550068 553255 556395 559432
57986 559432 562276 564616 566179 567121 568088 569927 573286 578280 584482 591364 598844 607342 617239 628401
57972 628401 640247 652200 663916 675040 684829 692179 696113 696290 693029 686958 678643 668433 656469
57959 656469 642856 627915 612192 596106 579703 562911 545965 529376 513616 499043 486043
$$ packed form
58054I74701j6818j6674j6638j6507j5841j4741j3979j3983j4178j3757j2722
58043H08863j1677j0987j0629j0542j0534j0156r275q467q276q345p986p298o919
58030F87772o963p031p134p622q281q509q437q811r613r860r108q102p465o799
58016E74037n699m723m529m770m670m081l253k180r71l16o57j340j425r70o03
58001E33850k42N95J472J331K20m31L16J732K604K760K819L042L187L140L037
57986E59432K844K340J563R42R67J839L359M994O202O882P480Q498R897J1162
57972F28401J1846J1953J1716J1124R789P350L934J77l261o071q315j0210j1964
57959F56469j3613j4941j5723j6086j6403j6792j6946j6589j5760j4573j3000
$$ plain form
57948 486043 474845 465193 456559 448821 442415 437663 434196 431219 428132 424741 421195 417941 415517 414002
57934 414002 412769 411046 408644 405887 402907 399345 394870 389729 384600 379963 375784 371844 368288 365701
57920 365701 364665 365303 367278 370057 373115 376069 378897 381948 385575 389810 394491 399532 404694 409247
57906 409247 412241 413176 412118 409120 403957 396560 387396 377300 367103 357431 348469 339828 330889 321486
57892 321486 312028 303001 294772 287839 282657 278906 275461 271515 267349 263601 260152 256241 251436 245995
57878 245995 240441 235227 230771 227367 224941 223069 221209 218952 216361 214239 213605 214548 215965 216834 217396
57863 217396 218577 220659 223151 225702 228294 230606 232030 232485 232520 232438 231937 230870 229747 229049 228495 227447
57847 227447 225704 223578 221427 219494 217974 216843 215734 214253 212399 210551 209136 208462 208652 209553 210774
$$ packed form
57948D86043j1198r652q634p738o406m752l467k977l087l391l546l254k424j515
57934D14002j233j723k402k757k980l562m475n141n129m637m179l940l556k587
57920C65701j036O38J975K779L058K954K828L051L627M235M681N041N162M553
57906D09247K994R35j058k998n163p397r164j0096j0197r672q962q641q939r403
57892C21486r458r027q229o933n182l751l445l946m166l748l449l911m805n441
57878B45995n554n214m456l404k426j872j860k257k591k122o34R43J417Q69N62
57863B17396J181K082K492K551K592K312J424M55L5q2n01j067j123o98n54j048
57847B27447j743k126k151j933j520j131j109j481j854j848j415o74J90R01J221
$$ plain form
57832 210774 211969 213010 213841 214309 214268 213778 213081 212447 211982 211416 210121 207641 204261 200813 197853 195282
57816 195282 192809 190381 188014 185643 183495 182223 182211 182882 183188 182797 182491 183314 185619 188983 192811 196886
57800 196886 201433 206792 213009 219750 226627 233546 240635 247903 255058 261645 267328 272049 275945 278987
57786 278987 280765 280820 279254 276791 274058 271009 267218 262528 257088 250942 243995 236413 228680 221086 213446
57771 213446 205493 197395 189654 182628 176334 170681 165662 161298 157575 154489 152001 149869 147687 145309
57757 145309 143176 141966 141844 142250 142509 142462 142356 142382 142616 143288 144642 146508 148306 149637 150622 151514 152248
57740 152248 152599 152656 152899 153791 155337 156985 157972 158029 157848 158588 160778 163901 167214 170645 174535 178765 182614
57723 182614 185492 187405 188727 189865 191167 192731 194109 194575 193943 192930 192445 192689 193118 193158 192679 191892
$$ packed form
57832B10774J195J041Q31M68m1m90o97o34m65n66j295k480l380l448k960k571
57816A95282k473k428k367k371k148j272j2O71L06l91l06Q23K305L364L828M075
57800A96886M547N359O217O741O877O919P089P268P155O587N683M721L896L042
57786B78987J778N5j566k463k733l049l791m690n440o146o947p582p733p594p640
57771B13446p953q098p741p026o294n653n019m364l723l086k488k132k182k378
57757A45309k133j210j22M06K59m7j06K6K34O72J354J866J798J331R85Q92P34
57740A52248L51N7K43Q92J546J648R87N7j81P40K190L123L313L431L890M230L849
57723A82614K878J913J322J138J302J564J378M66o32j013m85K44M29M0m79p87
$$ plain form
57707 191892 191021 190146 189258 188420 187853 187757 188000 188175 188057 187895 188116 188941 190446 192767 195921 199535 203136
57690 203136 206719 210707 215324 220365 225663 231418 237876 244992 252748 261590 272219 285053 300201
57677 300201 317905 338733 363395 392797 428402 472259 526441 592436 670852 760791 858323
57666 858323 955026 1038525 1096053 1119487 1108594 1070327 1015119 953205 892858 839914 797356
57655 797356 765295 742192 726592 717593 713997 713911 715562 718052 720928 723461 724856 724893 723783 721436
57641 721436 717304 710948 702480 692429 681435 670011 658254 645765 632088 617252 601735 586009
57629 586009 570423 555452 541651 529197 517757 506926 496597 486813 477536 468750 460654 453543
57617 453543 447508 442402 438105 434804 432961 432938 434625 437505 441097 445223 449889 455191 461440 468976 477603
$$ packed form
57707A91892q71q75q88q38n67r6K43J75j18j62K21Q25J505K321L154L614L601
57690B03136L583L988M617N041N298N755O458P116P756Q842J0629J2834J5148
57677C00201J7704K0828K4662K9402L5605M3857N4182O5995P8416Q9939R7532
57666H58323R6703Q3499N7528K3434j0893l8267n5208o1914o0347n2944m2558
57655G97356l2061k3103j5600q999l596q6J651K490K876K533J395L7j110k347
57641G21436m132o356q468j0051j0994j1424j1757j2489j3677j4836j5517j5726
57629E86009j5586j4971j3801j2454j1440j0831j0329r784r277q786q096p111
57617D53543o035n106m297l301j843k3J687K880L592M126M666N302O249P536Q627
$$ plain form
57602 477603 486510 495151 503969 513754 524508 535525 546443 557541 568917 580103 590786 601306
57590 601306 612027 622678 632719 641954 650300 657266 662104 664326 663703 659984 653101 643512 631923
57577 631923 618671 603717 587211 569688 551710 533614 515674 498159 481110 464236 447228
57566 447228 430139 413441 397770 383510 370562 358576 347371 336945 327083 317362 307746 298810
57554 298810 290976 283856 276876 270316 265069 261288 257930 253909 249290 245038 241920 239992 238899 238244
57540 238244 237686 237007 236251 235719 235732 236336 237222 237967 238416 238763 239202 239660 240060 240666 241820 243407 245026 246783
57522 246783 249475 253742 259349 265555 271888 278227 284439 290448 296572 303277 310562 318007 325499 333470
57508 333470 342220 351416 360579 369759 379375 389587 400261 411387 423065 435073 446880 458230
$$ packed form
57602D77603Q907Q641Q818R785J0754J1017J0918J1098J1376J1186J0683J0520
57590F01306J0721J0651J0041R235Q346O966M838K222o23l719o883r589j1589
57577F31923j3252j4954j6506j7523j7978j8096j7940j7515j7049j6874j7008
57566D47228j7089j6698j5671j4260j2948j1986j1205j0426r862r721r616q936
57554B98810p834p120o980o560n247l781l358m021m619m252l118j928j093o55
57540B38244n58o79p56n32J3O04Q86P45M49L47M39M58M00O06J154J587J619J757
57522B46783K692M267N607O206O333O339O212O009O124O705P285P445P492P971
57508C33470Q750R196R163R180R616J0212J0674J1126J1678J2008J1807J1350
$$ plain form
57496 458230 469293 480094 490180 499151 507184 514552 520800 524855 525978 524346 520702 515706 509582
57483 509582 502093 492821 481728 469431 456674 443635 430149 416592 403957 392856 382922 373490
57471 373490 364399 355753 347342 338852 330422 322490 315235 308669 303077 298794 295637 293203 291685 291648 292883
57456 292883 294237 295020 295928 298042 301444 305511 310110 315593 321731 327681 333310 339796 348358 358849
57442 358849 370098 381276 392324 403254 413706 423390 432527 441568 450641 459338 466901 472624 476342
57429 476342 478570 479898 480216 478803 475192 469550 462121 452820 441730 429517 416863 403763 389889
57416 389889 375411 360833 346205 331185 315975 301524 288548 276844 265784 255011 244447
57405 244447 234125 224364 215671 208044 200690 192899 184954 177732 171601 166113 160696 155238 150013 145366
$$ packed form
57496D58230J1063J0801J0086Q971Q033P368O248M055J123j632l644m996o124
57483E09582p489r272j1093j2297j2757j3039j3486j3557j2635j1101r934r432
57471C73490r091q646q411q490q430p932p255o566n592m283l157k434j518l7J235
57456B92883J354P83R08K114L402M067M599N483O138N950N629O486Q562J0491
57442C58849J1249J1178J1048J0930J0452R684R137R041R073Q697P563N723L718
57429D76342K228J328L18j413l611n642p429r301j1090j2213j2654j3100j3874
57416C89889j4478j4578j4628j5020j5210j4451j2976j1704j1060j0773j0564
57405B44447j0322r761q693p627p354p791p945p222o131n488n417n458n225m647
$$ plain form
57391 145366 141512 138446 136043 134263 133055 132057 130713 128915 127176 125826 124404 122247 119403 116506
57377 116506 113969 111794 110001 108701 107768 106947 106227 105680 105022 103878 102465 101467 101131 100901 100028 98143
57361 98143 95334 92175 89683 88561 88305 87660 86185 84808 84535 85189 85829 85896 85527 85158 85332 86578 88915
57344 88915 91595 93781 95355 96783 98384 100111 101906 103846 105960 108189 110456 112569 114167 114998 115093
57329 115093 114506 113199 111466 110142 109891 110433 110921 110969 110845 110838 111003 111490 112466 113581 114116 113960 113921 114714 116063
57310 116063 117214 117975 118689 119357 119451 118746 117871 117733 118630 120195 122053 124242 126968 130173 133475 136449
57294 136449 138890 140877 142709 144798 147487 150893 154914 159342 163960 168612 173247 177887 182470 186821
57280 186821 190886 194961 199438 204261 208773 212177 214128 214879 214994 214954 214865 214487 213615 212422 211242 210073
$$ packed form
57391A45366l854l066k403j780j208r98j344j798j739j350j422k157k844k897
57377A16506k537k175j793j300r33q21p20n47o58j144j413r98l36k30q73j885
57361I8143k809l159k492j122k56o45j475j377k73O54O40O7l69l69J74J246K337
57344H8915K680K186J574J428J601J727J795J940K114K229K267K113J598Q31R5
57329A15093n87j307j733j324k51N42M88M8j24pJ65M87R76J115N35j56l9P93J349
57310A16063J151P61P14O68R4p05q75j38Q97J565J858K189K726L205L302K974
57294A36449K441J987J832K089K689L406M021M428M618M652M635M640M583M351
57280A86821M065M075M477M823M512L404J951P51J15m0q9l78q72j193j180j169
$$ plain form
57264 210073 208573 206571 204232 201581 198290 194278 190204 186953 184752 183115 181501 179636 177366 174737
57250 174737 172272 170648 169898 169315 168403 167561 167546 168497 169852 171052 171944 172543 172784 172675 172489 172686 173647 175424
57232 175424 177581 179307 179964 179721 179539 180341 182176 184286 185903 186925 187856 189253 191213 193253 194683
57217 194683 195315 195847 197342 200157 203548 206489 208750 210936 213634 216900 220552 224539 228810 233131 237294
57202 237294 241391 245667 250177 254786 259447 264330 269673 275632 282246 289451 297093 304972 312867 320545
57188 320545 327874 335002 342359 350365 359099 368209 377151 385601 393758 402124 410803 419219 426854 434208
57174 434208 442538 452448 463110 473138 481881 489645 497054 504601 512567 520857 529041 536899 544807 553219
57160 553219 561992 570725 579579 589132 599460 610106 621105 633293 647214 662299 677664 693308
$$ packed form
57264B10073j500k002k339k651l291m012m074l251k201j637j614j865k270k629
57250A74737k465j624p50n83r12q42j5R51J355J200Q92N99K41j09j86J97R61J777
57232A75424K157J726O57k43j82Q02J835K110J617J022R31J397J960K040J430
57217A94683O32N32J495K815L391K941K261K186K698L266L652L987M271M321M163
57202B37294M097M276M510M609M661M883N343N959O614P205P642P879P895P678
57188C20545P329P128P357Q006Q734R110Q942Q450Q157Q366Q679Q416P635P354
57174D34208Q330R910J0662J0028Q743P764P409P547P966Q290Q184P858P908Q412
57160E53219Q773Q733Q854R553J0328J0646J0999J2188J3921J5085J5365J5644
$$ plain form
57148 693308 709943 727993 747365 768038 790145 813465 837462 862050 887861 915438 944582
57137 944582 974816 1006217 1039416 1074866 1112433 1151716 1192565 1235384 1281100 1330780 1384952
57126 1384952 1443325 1505366 1571215 1641780 1717840 1799349 1885834 1977258 2074164 2177068 2286099
57115 2286099 2401409 2523782 2654611 2795347 2947106 3110924 3288351 3481645 3693349
57106 3693349 3925842 4181573 4463801 4776923 5126053 5516559 5954297 6446132 6999885
57097 6999885 7623656 8325138 9111151 9987094 10956265 12019340 13173910 14413756 15728052
57088 15728052 17101082 18512496 19937616 21347763 22711191 23994636 25164778 26189253
57080 26189253 27037695 27683163 28103691 28283676 28215246 27899325 27345678 26571852 25601859
$$ packed form
57148F93308J6635J8050J9372K0673K2107K3320K3997K4588K5811K7577K9144
57137I44582L0234L1401L3199L5450L7567L9283M0849M2819M5716M9680N4172
57126A384952N8373O2041O5849P0565P6060Q1509Q6485R1424R6906J02904J09031
57115B286099J15310J22373J30829J40736J51759J63818J77427J93294K11704
57106C693349K32493K55731K82228L13122L49130L90506M37738M91835N53753
57097F999885O23771P01482P86013Q75943R69171J063075J154570J239846J314296
57088A5728052J373030J411414J425120J410147J363428J283445J170142J024475
57080B6189253Q48442O45468M20528J79985o8430l15921n53647p73826r69993
$$ plain form
57071 25601859 24465081 23194911 21826850 20396643 18938946 17486025 16066111 14702069
57063 14702069 13411040 12204769 11090051 10069399 9142067 8304902 7552712 6878742 6275714
57054 6275714 5736775 5255618 4826165 4442586 4099536 3792158 3516026 3267335 3043013
57045 3043013 2840401 2657038 2490850 2340162 2203224 2078063 1963103 1857494 1760401 1670438
57035 1670438 1586385 1508043 1435687 1368962 1307065 1249703 1196951 1148231 1102423 1059126 1018879
57024 1018879 981847 947075 913456 880812 849589 820031 792070 765557 740227 715729 691992
57013 691992 669246 647584 626950 607566 589710 572872 555923 538475 521396 505614 491217
57002 491217 478237 467386 459103 452528 446415 440672 436016 432443 429191 426136 424162 423895 424863 426111
$$ packed form
57071B5601859j136778j270170j368061j430207j457697j452921j419914j364042
57063A4702069j291029j206271j114718j020652r27332q37165p52190o73970o03028
57054F275714n38939m81157m29453l83579l43050l07378k76132k48691k24322
57045C043013k02612j83363j66188j50688j36938j25161j14960j05609r7093q9963
57035A670438q4053p8342p2356o6725o1897n7362n2752m8720m5808m3297m0247
57024A018879l7032l4772l3619l2644l1223k9558k7961k6513k5330k4498k3737
57013F91992k2746k1662k0634j9384j7856j6838j6949j7448j7079j5782j4397
57002D91217j2980j0851q283o575o113n743m656l573l252l055j974k67R68J248
$$ plain form
56988 426111 426939 426891 425789 424095 422593 421310 419208 415219 409146 401315 391892 381030 369278 357372
56974 357372 345754 334560 323870 313710 304082 295278 288008 282870 279751 277916 276646 275794 275934 278020
56960 278020 282543 288790 295171 300487 304611 307809 309832 310091 308451 305250 300650 294514 287023 278980
56946 278980 271300 264465 258692 254283 251475 250031 249308 248875 248938 250147 253044 257726 263924 271182 278951
56931 278951 286597 293495 299142 303127 305030 304469 301347 295969 288844 280399 270995 261170 251692 243158
56917 243158 235506 228059 220228 212179 204701 198380 193060 188203 183655 179811 177024 175111 173574 172197
56903 172197 171245 171117 171848 172990 173913 174257 174185 174264 175025 176541 178437 180368 182461 185164 188685 192804 197333
56886 197333 202493 208458 214617 219696 222696 223438 222211 219387 215668 212177 209751 208267 207067 205957
$$ packed form
56988D26111Q28m8j102j694j502j283k102l989o073p831r423j0862j1752j1906
56974C57372j1618j1194j0690j0160r628q804p270n138l119j835j270q52J40K086
56960B78020M523O247O381N316M124L198K023K59j640l201m600o136p491q043
56946B78980p680o835n773m409k808j444p23m33O3J209K897M682O198P258P769
56931B78951P646O898N647L985J903n61l122n378p125q445r404r825r478q534
56917B43158p652p447p831q049p478o321n320m857m548l844k787j913j537j377
56903A72197r52j28P31J142R23L44p2P9P61J516J896J931K093K703L521M119M529
56886A97333N160N965O159N079L000P42j227k824l719l491k426j484j200j110
$$ plain form
56872 205957 205349 205569 206610 208634 212207 217803 225420 234825 245735 257567 269490 281187 293185
56859 293185 305914 318553 329396 337295 342237 344429 343540 339321 332587 324904 317285 309764 302435 296411
56845 296411 293232 293498 296540 301457 308065 316747 327870 341669 358346 377793 399230 421441 443261
56832 443261 463520 480656 492928 499189 499251 493519 482713 468032 451095 433343 415683 398853
56820 398853 383773 371232 361555 354903 351587 351666 354506 359381 366417 376334 389108 403413 417682
56807 417682 431206 443807 454683 462159 464656 461706 453963 442433 427823 410552 391284 371268
56795 371268 351991 334463 318906 305141 293042 282609 273912 267287 263394 262678 264719 268392 272825
56782 272825 277981 284158 291064 297545 302185 304030 302836 298791 292086 282781 271131 258002 244680
$$ packed form
56872B05957o08K20J041K024L573N596P617R405J0910J1832J1923J1697J1998
56859B93185J2729J2639J0843P899M942K192q89m219o734p683p619p521p329o024
56845B96411l179K66L042M917O608Q682J1123J3799J6677J9447K1437K2211K1820
56832D43261K0259J7136J2272O261O2n732j0806j4681j6937j7752j7660j6830
56820C98853j5080j2541r677o652l316P9K840M875P036R917J2774J4305J4269
56807D17682J3524J2601J0876P476K497k950p743j1530j4610j7271j9268k0016
56795C71268j9277j7528j5557j3765j2099j0433q697o625l893p16K041L673M433
56782B72825N156O177O906O481M640J845j194m045o705r305j1650j3129j3322
$$ plain form
56769 244680 232029 219944 207912 196014 184980 175225 166348 157919 150379 144569 140438 136820 132706
56756 132706 128317 124618 122066 120229 118497 116668 114757 112620 110098 107406 105057 103328 101951 100512
56742 100512 99035 97976 97555 97283 96328 94357 91872 89780 88758 88923 89787 90485 90399 89765 89444 89904 90691
56725 90691 91127 91206 91362 91575 91336 90534 89757 89510 89608 89706 89979 90822 92092 93192 93847 94375 95120 95998 96729
56706 96729 97245 97716 98294 98950 99489 99717 99684 99734 100194 101010 101768 102014 101462 100083 98252 96737 96209 96676 97587
56687 97587 98460 99219 100005 100999 102404 104184 105767 106483 106422 106436 107073 108019 108891 110053 112086 114827 117575
56670 117575 120030 122448 124908 127064 128689 129970 131205 132565 134194 136043 137548 138043 137658 137385 138045
56655 138045 139568 141439 143344 145033 146024 145946 145001 143749 142546 141446 140512 139919 139805 140144 140634 140676 139801
$$ packed form
56769B44680j2651j2085j2032j1898j1034r755q877q429p540n810m131l618m114
56756A32706m389l699k552j837j732j829j911k137k522k692k349j729j377j439
56742A00512j477j059m21k72r55j971k485k092j022J65Q64O98q6o34l21M60P87
56725I0691M36P9J56K13k39q02p77k47R8R8K73Q43J270J100O55N28P45Q78P31
56706I6729N16M71N78O56N39K28l3N0M60Q16P58K46n52j379j831j515n28M67R11
56687I7587Q73P59P86R94J405J780J583P16o1J4O37R46Q72J162K033K741K748
56670A17575K455K418K460K156J625J281J235J360J629J849J505M95l85k73O60
56655A38045J523J871J905J689R91p8r45j252j203j100r34n93j14L39M90M2q75
$$ plain form
56638 139801 138260 136869 136100 135696 135350 135220 135388 135359 134716 133842 133286 132762 131573 129904 128694 128199 127555
56621 127555 126088 124204 122528 120929 119080 117507 117227 118440 120235 121648 122516 123198 123882 124485 125034 125828
56605 125828 127104 128601 129655 129868 129581 129469 129704 129802 129366 128617 128019 127626 127089 126095 124547 122458 120017
56588 120017 117739 116233 115681 115697 115754 115691 115813 116579 118197 120458 122999 125633 128271 130531 131776 131833 131435
56571 131435 131559 132375 133179 133475 133703 134689 136554 138547 139985 141064 142548 144791 147376 149791 152152 154961
56555 154961 158212 161166 163082 163984 164502 165198 166226 167463 168657 169499 169829 169831 169907 170266 170728 170898 170441 169246
56537 169246 167470 165444 163448 161508 159444 157058 154281 151276 148430 146109 144215 142124 139269 135755
56523 135755 132203 129058 126268 123602 120970 118414 116069 114267 113392 113383 113614 113501 113072 112708 112454 111973 111155
$$ packed form
56638A39801j541j391p69m04l46j30J68k9o43q74n56n24j189j669j210m95o44
56621A27555j467j884j676j599j849j573k80J213J795J413Q68O82O84O03N49P94
56605A25828J276J497J054K13k87j12K35R8m36p49n98l93n37r94j548k089k441
56588A20017k278j506n52J6N7o3J22P66J618K261K541K634K638K260J245N7l98
56571A31435J24Q16Q04K96K28R86J865J993J438J079J484K243K585K415K361K809
56555A54961L251K954J916R02N18O96J028J237J194Q42L30KP6L59M62J70m57j195
56537A69246j776k026j996j940k064k386k777l005k846k321j894k091k855l514
56523A35755l552l145k790k666k632k556k345j802q75rK31j13m29l64k54m81q18
$$ plain form
56506 111155 110361 109880 109493 108847 108070 107617 107606 107677 107605 107626 107971 108455 108819 109246 110062 111052 111606 111599 111675 112457 113905
56485 113905 115688 117758 120036 121853 122357 121551 120453 120025 120285 120639 120757 120833 121116 121486 121571 121189 120672 120699
56467 120699 121650 123104 124175 124436 124314 124496 125208 126322 127869 129958 132155 133454 133211 131923 130839 130837
56451 130837 131844 133185 134202 134563 134362 134130 134592 136102 138276 140253 141301 141155 140008 138419 137170
56436 137170 136783 137085 137440 137566 137846 138635 139547 139766 139023 137869 137005 136647 136657 136970 137626 138542 139442 139983 139889
56417 139889 139106 137920 136780 135880 135058 134233 133672 133579 133618 133302 132810 132945 134105 135691 136834 137406 137928 138643
56399 138643 139173 139144 138753 138501 138613 138958 139395 139959 140737 141758 142968 144191 145106 145451 145311 145151 145450 146358
56381 146358 147692 149187 150689 152155 153544 154769 155783 156708 157824 159325 161085 162731 163970 164794 165357
$$ packed form
56506A11155p94m81l87o46p77m53j1P1p2K1L45M84L64M27Q16R90N54pP6P82J448
56485A13905J783K070K278J817N04q06j098m28K60L54J18P6K83L70Q5l82n17K7
56467A20699R51J454J071K61j22J82P12J114J547K089K197J299k43j288j084k
56451A30837J007J341J017L61k01k32M62J510K174J977J048j46j147j589j249
56436A37170l87L02L55J26K80P89R12K19p43j154q64l58J0L13O56R16R00N41r4
56417A39889p83j186j140r00q22q25n61r3L9l16m92J35J160J586J143N72N22P15
56399A38643N30k9l91k52J12L45M37N64P78J021J210J223R15L45j40j60K99R08
56381A46358J334J495J502J466J389J225J014R25J116J501J760J646J239Q24N63
$$ plain form
56366 165357 165759 166006 166130 166243 166469 166917 167710 168961 170648 172531 174243 175479 176029 175768 174797 173691 173391
56349 173391 174526 176771 179029 180366 180758 180938 181701 183365 185678 188044 189952 191343 192480 193392 193642
56334 193642 192914 191634 190642 190287 190227 190157 190312 191045 192298 193774 195337 196869 197977 198340 198301 198630 199561 200485
56316 200485 200797 200741 201097 202280 204156 206611 209784 213584 217350 220332 222412 224121 226016 228275 230844
56301 230844 233692 236813 240197 243888 247890 251923 255497 258419 261072 263967 267153 270244 272942 275277
56287 275277 277473 279872 282970 287079 291814 296271 299937 303238 306979 311468 316415 321442 326341 330957
56273 330957 335264 339666 344856 351138 358098 365147 372281 380088 389055 399181 410300 422501 436058
56260 436058 451157 468005 487168 509418 535095 563856 595210 629201 666457 707781 753818
$$ packed form
56366A65357M02K47J24J13K26M48P93J251J687J883J712J236N50k61r71j106l00
56349A73391J135K245K258J337L92J80P63J664K313K366J908J391J137R12K50
56334A93642p28j280r92l55o0p0J55P33J253J476J563J532J108L63l9L29R31R24
56316B00485L12n6L56J183J876K455L173L800L766K982K080J709J895K259K569
56301B30844K848L121L384L691M002M033L574K922K653K895L186L091K698K335
56287B75277K196K399L098M109M735M457L666L301L741M489M947N027M899M616
56273C30957M307M402N190O282O960P049P134P807Q967J0126J1119J2201J3557
56260D36058J5099J6848J9163K2250K5677K8761L1354L3991L7256M1324M6037
$$ plain form
56249 753818 804757 859975 918094 977836 1038885 1101558 1165597 1229509 1291080 1348212 1399299
56238 1399299 1443289 1479662 1508088 1527912 1538212 1538572 1529582 1512406 1488110 1457554 1421634 1381265
56226 1381265 1337263 1290468 1241844 1192215 1142053 1091794 1042237 994375 948873 905912 865374
56215 865374 826923 790046 754444 720427 688728 659850 633732 609982 588233 568315 550376
56204 550376 534867 522185 512241 504448 498154 492973 488761 485458 483005 481280 480080 479227 478643 478297
56190 478297 478154 478263 478791 479836 481298 483014 484924 486947 488843 490402 491718 493153 495033 497491 500464
56175 500464 503769 507270 511062 515304 519843 524297 528651 533459 539196 545739 552792 560433 568788 577461
56161 577461 585883 594101 602653 611760 621295 631615 643720 658290 675063 693578 714286 738642
$$ packed form
56249G53818N0939N5218N8119N9742O1049O2673O4039O3912O1571N7132N1087
56238A399299M3990L6373K8426J9824J0300L60q990j7176k4296l0556l5920m0369
56226A381265m4002m6795m8624m9629n0162n0259m9557m7862m5502m2961m0538
56215H65374l8451l6877l5602l4017l1699k8878k6118k3750k1749j9918j7939
56204E50376j5509j2682r944p793o294n181m212l303k453j725j200q53n84l46
56190D78297j43J09N28J045J462J716J910K023J896J559J316J435J880K458K973
56175E00464L305L501L792M242M539M454M354M808N737O543P053P641Q355Q673
56161E77461Q422Q218Q552R107R535J0320J2105J4570J6773J8515K0708K4356
$$ plain form
56149 738642 768257 804252 847328 898177 957552 1025665 1101246 1181231 1261529 1338084 1407346
56138 1407346 1466584 1514832 1553797 1587258 1619075 1651455 1684418 1715890 1742281 1760040 1767723
56127 1767723 1766726 1760032 1750443 1739695 1728176 1714559 1695863 1668528 1629896 1579235 1518167 1450551
56115 1450551 1381418 1315259 1254934 1201887 1156754 1119504 1089554 1066326 1049483 1038319 1031318
56104 1031318 1026879 1024304 1023647 1024754 1026948 1029637 1032841 1037071 1042953 1050847 1060485 1070968 1081436 1091764
56090 1091764 1102457 1113943 1126203 1139006 1152190 1165677 1179421 1193381 1207543 1222092 1237636
56079 1237636 1254942 1274156 1294377 1314349 1333558 1352550 1372302 1393464 1416063 1439649 1463754
56068 1463754 1488293 1513445 1539112 1564779 1590041 1614961 1639721 1664189 1688130 1711516 1734409
$$ packed form
56149G38642K9615L5995M3076N0849N9375O8113P5581P9985Q0298P6555O9262
56138A407346N9238M8248L8965L3461L1817L2380L2963L1472K6391J7759P683
56127A767723r97o694r589j0748j1519j3617j8696k7335l8632n0661o1068o7616
56115A450551o9133o6159o0325n3047m5133l7250k9950k3228j6843j1164p001
56104A031318m439k575o57J107K194K689L204M230N882P894R638J0483J0468J0328
56090A091764J0693J1486J2260J2803J3184J3487J3744J3960J4162J4549J5544
56079A237636J7306J9214K0221J9972J9209J8992J9752K1162K2599K3586K4105
56068A463754K4539K5152K5667K5667K5262K4920K4760K4468K3941K3386K2893
$$ plain form
56057 1734409 1756920 1779595 1803420 1828865 1855275 1881815 1908738 1937027 1966981 1997984 2029720
56046 2029720 2062805 2097964 2135170 2173918 2213827 2254600 2295823 2337225 2379038 2421868 2466352
56035 2466352 2513022 2562271 2614321 2669436 2728212 2791261 2858461 2928833 3001388 3075924 3152828
56024 3152828 3232361 3314342 3398376 3484221 3572064 3662512 3756176 3853160 3953196 4056425 4163807
56013 4163807 4276547 4395222 4519562 4649023 4783514 4923720 5070824 5225831 5389121
56004 5389121 5560656 5740472 5928834 6126145 6333099 6550822 6780435 7022471 7277163
55995 7277163 7545365 7828706 8128688 8446146 8781875 9137374 9514658 9915683 10342370
55986 10342370 10796879 11281473 11798359 12350128 12940275 13573017 14252846 14984772 15774879
$$ packed form
56057A734409K2511K2675K3825K5445K6410K6540K6923K8289K9954L1003L1736
56046B029720L3085L5159L7206L8748L9909M0773M1223M1402M1813M2830M4484
56035B466352M6670M9249N2050N5115N8776O3049O7200P0372P2555P4536P6904
56024C152828P9533Q1981Q4034Q5845Q7843R0448R3664R6984J00036J03229J07382
56013D163807J12740J18675J24340J29461J34491J40206J47104J55007J63290
56004E389121J71535J79816J88362J97311K06954K17723K29613K42036K54692
55995G277163K68202K83341K99982L17458L35729L55499L77284M01025M26687
55986A0342370M54509M84594N16886N51769N90147O32742O79829P31926P90107
$$ plain form
55977 15774879 16630193 17557959 18565582 19661547 20856271 22162157 23593381 25166116
55969 25166116 26899094 28814097 30936536 33296363 35929238 38877601 42191635 45930401
55961 45930401 50163258 54971287 60448394 66701742 73851199 82027223 91366623 102005527
55953 102005527 114068396 127650388 142789155 159423153 177337698 196106650 215045659
55946 215045659 233201097 249402234 262394008 271038884 274538307 272600594 265493523
55939 265493523 253965367 239071490 221973181 203768062 185381283 167517680 150660436
55932 150660436 135098680 120968117 108292696 97021118 87056587 78279522 70563035
55925 70563035 63782252 57819923 52569898 47938431 43843504 40213561 36986635 34109543
$$ packed form
55977A5774879Q55314R27766J007623J095965J194724J305886J431224J572735
55969B5166116J732978J915003K122439K359827K632875K948363L314034L738766
55961D5930401M232857M808029N477107O253348P149457Q176024R339400J0638904
55953A02005527J2062869J3581992J5138767J6633998J7914545J8768952J8939009
55946B15045659J8155438J6201137J2991774Q644876L499423j937713p107071
55939B65493523j1528156j4893877j7098309j8205119j8386779j7863603j6857244
55932A50660436j5561756j4130563j2675421j1271578r964531q777065p716487
55925G0563035o780783n962329n250025m631467m094927l629943l226926k877092
$$ plain form
55917 34109543 31536712 29229136 27153657 25281960 23589182 22053170 20654827 19378435
55909 19378435 18211030 17141463 16159956 15257830 14427003 13659901 12950041 12292177 11681448
55900 11681448 11112870 10582170 10086668 9624520 9193274 8789824 8411571 8056820 7724085
55891 7724085 7411742 7118359 6842561 6582414 6335780 6101691 5880733 5673530 5479215
55882 5479215 5295806 5121590 4955570 4796778 4643837 4495413 4350870 4210382 4074522
55873 4074522 3943743 3818199 3697963 3583141 3473485 3368052 3265788 3166612 3071537 2981514
55863 2981514 2896458 2815604 2738374 2664584 2594183 2527301 2464361 2405641 2350722 2298678 2248770
55852 2248770 2200582 2153618 2107264 2061289 2016031 1971914 1929061 1887441 1847023 1807557 1768561
$$ packed form
55917C4109543k572831k307576k075479j871697j692778j536012j398343j276392
55909A9378435j167405j069567r81507r02126q30827p67102p09860o57864o10729
55900A1681448n68578n30700m95502m62148m31246m03450l78253l54751l32735
55891G724085l12343k93383k75798k60147k46634k34089k20958k07203j94315
55882E479215j83409j74216j66020j58792j52941j48424j44543j40488j35860
55873D074522j30779j25544j20236j14822j09656j05433j02264r9176r5075r0023
55863B981514q5056q0854p7230p3790p0401o6882o2940n8720n4919n2044m9908
55852B248770m8188m6964m6354m5975m5258m4117m2853m1620m0418l9466l8996
$$ plain form
55841 1768561 1729957 1692514 1657167 1623786 1591042 1557718 1523942 1490901 1459520 1429788 1401316
55830 1401316 1374054 1348164 1323458 1299451 1276018 1253604 1232514 1212205 1191635 1170352 1148977
55819 1148977 1128490 1109210 1090643 1072249 1054037 1036403 1019667 1004058 989942 977634 966847
55808 966847 956644 946201 935514 925161 915502 906417 897744 889588 882020 874712 867216 859566 852403
55795 852403 846378 841532 837386 833589 830230 827155 822932 814934 801048 781503 758924 736461 715896
55782 715896 697317 680050 663593 648043 634097 622658 613992 607214 600932 594527 588617 584088 580948
55769 580948 578309 575235 571317 566612 561533 556852 553364 551233 549810 548282 546399 544478 542884 541737
55755 541737 540957 540331 539533 538284 536536 534345 531549 527716 522419 515555 507480 498903 490432 482000 472858
$$ packed form
55841A768561l8604l7443l5347l3381l2744l3324l3776l3041l1381k9732k8472
55830A401316k7262k5890k4706k4007k3433k2414k1090k0309k0570k1283k1375
55819A148977k0487j9280j8567j8394j8212j7634j6736j5609j4116j2308j0787
55808I66847j0203j0443j0687j0353r659r085q673q156p568p308p496p650p163
55795H52403o025m846m146l797l359l075m223p998j3886j9545k2579k2463k0565
55782G15896j8579j7267j6457j5550j3946j1439q666o778o282o405n910m529l140
55769E80948k639l074l918m705n079m681l488k131j423j528j883j921j594j147
55755E41737p80o26p98j249j748k191k796l833n297o864q075q577q471q432r142
$$ plain form
55740 472858 462431 451082 439743 428955 418688 408999 400264 392539 385196 377528 369419 361146 352867
55727 352867 344674 336884 329874 323728 318330 313650 309615 305850 301884 297576 293104 288708 284671 281328
55713 281328 278695 276157 272941 268912 264665 260904 258006 256000 254544 252995 250933 248654 246768 245341
55699 245341 243829 241809 239326 236488 233260 229768 226330 223040 219774 216810 214857 214167 214107 214019 214150 215291
55683 215291 217770 221177 224843 228172 230731 232504 233946 235445 236828 237691 237994 237877 237100 235188 232146
55668 232146 228555 224927 221358 217835 214381 210758 206514 201578 196463 191658 187132 182765 178919 176157
55654 176157 174512 173461 172612 172036 171846 171798 171492 170816 169993 169244 168504 167457 165821 163694 161664 160427 160185
55637 160185 160572 161303 162689 165243 168878 172867 176613 180114 183582 187058 190671 194859 199791 204722 208377
$$ packed form
55740D72858j0427j1349j1339j0788j0267r689q735p725p343p668q109q273q279
55727C52867q193p790p010o146n398m680m035l765l966m308m472m396m037l343
55713B81328k633k538l216m029m247l761k898k006j456j549k062k279j886j427
55699B45341j512k020k483k838l228l492l438l290l266k964j953o90o0q8J31J141
55683B15291K479L407L666L329K559J773J442J499J383Q63L03j17p77j912l042
55668B32146l591l628l569l523l454l623m244m936n115m805m526m367l846k762
55654A76157j645j051q49n76j90m8l06o76q23p49p40j047j636k127k030j237k42
55637A60185L87P31J386K554L635L989L746L501L468L476L613M188M932M931L655
$$ plain form
55622 208377 210063 210157 209567 208995 208593 207957 206485 204113 201639 199877 198616 196962 194717 192717 191575 190841
55606 190841 189785 188346 186689 184418 181004 176725 172367 168106 163374 157890 152119 146579 141245 135893
55592 135893 130578 125520 120804 116427 112489 109197 106753 105182 104020 102327 99360 95288 90972 87121
55578 87121 83989 81771 80672 80481 80557 80448 80131 79499 78161 76053 73827 72196 71155 70147 68758 66982
55562 66982 65080 63515 62762 62759 62734 61924 60399 58877 57857 57183 56269 54507 51706 48498 46071 45134 45319
55545 45319 45898 46774 48179 49689 50412 50194 49868 50068 50478 50658 50962 52070 53954 55954 57714 59477 61490
55528 61490 63531 65115 65866 65689 64861 63998 63612 63605 63361 62475 61202 60108 59415 58817 57884 56529 55133 54295
55510 54295 54396 55273 56236 56500 55746 54408 53318 52989 53250 53642 54085 54914 56321 58059 59802 61482 63088
$$ packed form
55622B08377J686R4n90n72m02o36j472k372k474j762j261j654k245k000j142p34
55606A90841j056j439j657k271l414m279m358m261m732n484n771n540n334n352
55592A35893n315n058m716m377l938l292k444j571j162j693k967m072m316l851
55578H7121l132k218j099j91P6j09l17o32j338k108k226j631j041j008j389j776
55562F6982j902j565p53lk5q10j525j522j020o74r14j762k801l208k427r37J85
55545D5319N79Q76J405J510P23k18l26K00M10J80L04J108J884K000J760J763K013
55528F1490K041J584P51j77q28q63l86pk44q86j273j094o93n98r33j355j396q38
55510E4295J01Q77R63K64p54j338j090l29K61L92M43Q29J407J738J743J680J606
$$ plain form
55493 63088 64460 65629 67118 69463 72451 75288 77576 79777 82614 86330 90689 95244 99308 101916
55479 101916 102344 100729 97951 94858 91725 88417 84849 81219 77873 74950 72153 68981 65251 61293
55465 61293 57498 53898 50382 47179 44763 43242 42163 40996 39584 38008 36262 34263 32103 30054
55451 30054 28357 27027 25870 24652 23401 22507 22397 22991 23669 23868 23577 23104 22563 21803 20739 19494 18214
55434 18214 17019 16150 15981 16765 18421 20511 22277 22810 21609 19182 16826 15513 15121 14951 14795 15017
55418 15017 15659 16055 15685 14955 14656 14819 14678 13820 12779 12198 11882 11206 10193 9588 9833 10440 10624 10190
55400 10190 9556 9151 9080 9261 9604 10065 10679 11551 12636 13540 13732 13079 12140 11831 12622 13999 14811 14331 12967
55381 12967 11723 11081 10719 10318 10110 10317 10555 10327 9877 9936 10664 11440 11777 11891 12157 12537 12908 13508 14578
$$ packed form
55493F3088J372J169J489K345K988K837K288K201K837L716M359M555M064K608
55479A01916M28j615k778l093l133l308l568l630l346k923k797l172l730l958
55465F1293l795l600l516l203k416j521j079j167j412j576j746j999k160k049
55451C0054j697j330j157j218j251q94j10N94O78J99k91m73n41p60j064j245j280
55434A8214j195q69j69P84J656K090J766N33j201k427k356j313l92j70j56K22
55418A5017O42L96l70p30k99J63j41q58j041n81l16o76j013o05K45O07J84m34
55400A0190o34m05p1J81L43M61O14Q72J085R04J92o53r39l09P91J377Q12m80j364
55381A2967j244o42l62m01k08K07K38k28m50N9P28P76L37J14K66L80L71O00J070
$$ plain form
55362 14578 15847 16834 17534 18313 19168 19606 19385 18920 18738 18823 18782 18448 18051 17830 17700 17292 16229 14430 12280
55343 12280 10448 9380 8997 8991 9288 9976 10843 11363 11346 11240 11525 11957 11841 11021 10175 9954 10156 10037 9262
55324 9262 8248 7601 7514 7737 7890 7726 7271 6861 6893 7412 7947 7893 7080 5999 5480 6050 7493 8986 9794
55305 9794 9880 9730 9662 9493 8958 8239 7821 7913 8251 8495 8593 8639 8538 8080 7351 6848 7009 7661 8130 7971 7463
55284 7463 7303 7858 8835 9611 9734 9138 8036 6704 5368 4268 3764 4148 5193 6068 6041 5260 4567 4503
55266 4503 4827 5093 5301 5727 6408 7113 7672 8023 8090 7920 7842 8097 8430 8378 7925 7476 7194 6842 6417 6392 7015
55245 7015 7751 7841 7187 6280 5473 4775 4232 4003 3977 3837 3592 3635 4104 4585 4707 4607 4434 3832 2528 1179
55224 863 1636 2334 2090 1422 1310 1754 1970 1760 1802 2485 3279 3623 3824 4506 5557 6281 6422 6425 6667 7019
$$ packed form
55362A4578J269R87P00P79Q55M38k21m65j82Q5m1l34l97k21j30m08j063j799k150
55343A2280j832j068l83oK97O88Q67N20j7j06K85M32j16q20q46k21K02j19p75
55324I262j014o47q7K23J53j64m55m10L2N19N35n4q13j081n19N70J443J493Q08
55305I794Q6j50o8j69n35p19m18R2L38K44R8M6j01m58p29n03J61O52M69j59n08
55284G463j60N55R77P76J23n96j102j332j336j100n04L84J045Q75k7p81o93o4
55266D503L24K66K08M26O81P05N59L51O7j70p8K55L33n2m53m49k82l52m25k5O23
55245G015P36R0o54r07q07o98n43k29k6j40k45M3M69M81J22j00j73o02j304A179
55224H63P73O98k44o68j12M44K16k10M2O83P94L44K01O82J051P24J41LK42L52
$$ plain form
55204 7019 7278 7542 7815 7693 6842 5591 4624 4164 3812 3209 2495 2061 2121 2692 3706 4947 5986 6466
55186 6466 6486 6522 6956 7743 8562 9134 9349 9220 8841 8405 8148 8206 8555 9098 9757 10399 10679 10169 8797 7120
55166 7120 5930 5516 5405 4930 3945 2844 2074 1802 2044 2762 3717 4466 4713 4588 4467 4595 5009 5616 6143
55147 6143 6178 5617 5094 5584 7361 9549 10898 10939 10236 9603 9290 8973 8350 7569 7022 6812 6581 5949 4977
55128 4977 4096 3695 3956 4934 6394 7553 7499 6250 5076 5330 7032 8939 9935 9908 9280 8211 6668
55111 6668 4949 3701 3372 3933 5111 6691 8447 9964 10691 10276 8834 6937 5311 4485 4635 5592
55095 5592 6923 8058 8547 8359 7886 7561 7529 7766 8380 9609 11464 13513 15166 16121 16513 16727 17096 17631
55077 17631 17955 17614 16646 15689 15264 15007 14006 12024 9977 8905 8782 8746 8317 7799 7507 7208 6655 6197
$$ packed form
55204G019K59K64K73j22q51j251r67m60l52o03p14m34O0N71J014J241J039M80
55186F466K0L6M34P87Q19N72K15j29l79m36k57N8L49N43O59O42K80n10j372j677
55166G120j190m14j11m75r85j101p70k72K42P18R55P49K47j25j21J28M14O07N27
55147F143L5n61n23M90J777K188J349M1p03o33l13l17o23p81n47k10k31o32r72
55128D977q81m01K61R78J460J159n4j249j174K54J702J907R96k7o28j069j543
55111F668j719j248l29N61J178J580J756J517P27m15j442j897j626q26J50R57
55095E592J331J135M89j88m73l25l2K37O14J229J855K049J653R55L92K14L69N35
55077A7631L24l41r68r57m25k57j001j982k047j072j23l6m29n18k92k99n53m58
$$ plain form
55059 6197 6361 7048 7589 7559 7175 6886 6897 7195 7739 8383 8764 8473 7453 6184 5417 5570 6340 6984 7017 6550
55039 6550 5916 5268 4735 4698 5449 6644 7460 7374 6521 5352 4277 3739 4140 5449 7105 8592 9941 11481
55021 11481 13224 14699 15317 14825 13553 12311 11794 11915 11919 11320 10521 10308 10941 12008 12944 13339 12957 11979
55003 11979 11197 11471 12828 14395 15369 15719 15805 15673 15118 14247 13551 13362 13503 13609 13656 13986 14860 16124 17405
54984 17405 18527 19587 20644 21580 22302 22865 23273 23355 23120 23024 23506 24257 24316 23085 21026 19270 18671 19303
54966 19303 20602 21775 22208 21706 20453 18783 17054 15662 14853 14466 14060 13447 12915 12811 13128 13709 14624
54949 14624 16052 17819 19348 20156 20271 20121 20105 20264 20355 20287 20453 21440 23363 25702 27957 30222 32875
54932 32875 35960 39292 43100 48078 54591 62176 70024 77775 85521 93079 99561 103853 105435 104576 101734
$$ packed form
55059F197J64O87N41l0l84k89J1K98N44O44L81k91j020j269p67J53P70O44L3m67
55039F550o34o48n33l7P51J195Q16q6q53j169j075n38M01J309J656J487J349J540
55021A1481J743J475O18m92j272j242n17J21Mn99p99k13O33J067R36L95l82r78
55003A1979p82K74J357J567R74L50Q6j32n55q71o96j89J41J06M7L30Q74J264J281
54984A7405J122J060J057R36P22N63M08Q2k35r6M82P51N9j231k059j756n99O32
54966A9303J299J173M33n02j253j670j729j392q09l87m06o13n32j04L17N81R15
54949A4624J428J767J529Q08J15j50j6J59R1o8J66R87J923K339K255K265K653
54932C2875L085L332L808M978O513P585P848P751P746P558O482M292J582q59k842
$$ plain form
54917 101734 97034 90562 83044 75738 69483 64119 59013 53864 48733 43637 38667 34363 31416 29884
54903 29884 29062 28262 27395 26729 26416 26403 26513 26463 26115 25807 26156 27365 29063 30978 33410 36818 41250 46467
54885 46467 52422 59288 67159 75849 84735 92695 98556 101904 103127 102492 99698 94708 88428 81880 75149
54870 75149 67901 60610 54273 49027 44042 38956 34446 31012 28107 25094 22370 20808 20477 20538 20203
54855 20203 19299 18119 17182 16924 17157 17054 16120 14990 14737 15518 16421 16636 16286 16049 16392 17286 18385 19364
54837 19364 20195 21053 21813 21912 21042 19765 18986 18933 19161 19409 19820 20252 20088 19043 17621 16431 15435 14266
54819 14266 12917 11721 10881 10458 10644 11654 13305 14982 16072 16360 16134 16031 16613 17846 19035 19490
54803 19490 19202 18724 18479 18360 17980 17145 16079 15257 15053 15477 16284 17268 18385 19658 21112 22796 24643
$$ packed form
54917A01734m700o472p518p306o255n364n106n149n131n096m970m304k947j532
54903B9884q22q00q67o66l13j3J10n0l48l08L49J209J698J915K432L408M432N217
54885D6467N955O866P871Q690Q886P960N861L348J223o35k794m990o280o548o731
54870G5149p248p291o337n246m985n086m510l434k905l013k724j562l31O1l35
54855B0203r04j180r37k58K33j03r34j130k53P81R03K15l50k37L43Q94J099R79
54837A9364Q31Q58P60R9q70j277p79n3K28K48M11M32j64j045j422j190r96j169
54819A4266j349j196q40m23J86J010J651J677J090K88k26j03N82J233J189M55
54803A9490k88m78k45j19l80q35j066q22k04M24Q07R84J117J273J454J684J847
$$ plain form
54786 24643 26350 27613 28465 29099 29429 29293 29182 30258 33314 38073 43731 49782 56001 62158 68274 74803
54770 74803 81924 88849 94402 98162 100438 101283 100261 97231 92622 86783 79781 72166 65238 60003 56220
54755 56220 52953 49779 47009 44961 43532 42474 41711 41319 41387 41904 42644 43244 43502 43576 43741 44139 44915 46426
54737 46426 49029 52664 56843 61167 65809 71497 78922 88106 98321 108772 119184 129471 138887
54724 138887 145961 149447 149080 145339 138888 130479 120937 110881 100591 90413 80963 72638 65244 58514
54710 58514 52671 48013 44227 40722 37512 35156 33845 33135 32584 32057 31278 29753 27481 25241 23825
54695 23825 23319 23396 23852 24454 24644 23952 22549 21018 19698 18655 18136 18524 19708 20890 21277 20863 20506
54678 20506 21232 23394 26333 28874 30307 30885 31331 31997 32694 33209 33652 34218 34778 34873 34109 32623 31149
$$ packed form
54786B4643J707J263Q52O34L30j36j11J076L056M759N658O051O219O157O116O529
54770G4803P121O925N553L760K276Q45j022l030m609n839p002p615o928n235l783
54755E6220l267l174k770k048j429j058p63l92O8N17P40O00K58P4J65L98P76J511
54737D6426K603L635M179M324M642N688P425R184J0215J0451J0412J0287R416
54724A38887P074L486l67l741o451q409r542j0056j0290j0178r450q325p394o730
54710E8514n843m658l786l505l210k356j311p10n51n27p79j525k272k240j416
54695B3825n06P7M56O02J90o92j403j531j320j043n19L88J184J182L87m14l57
54678B0506P26K162K939K541J433N78M46O66O97N15M43N66N60R5p64j486j474
$$ plain form
54661 31149 30479 30714 31173 31162 30651 30055 29598 29268 29175 29430 29638 29080 27645 26134 25306 24956 24382 23520 23056
54642 23056 23439 24337 25260 26252 27595 29097 30177 30667 31092 31998 33289 34521 35684 37353 40032 43610
54626 43610 47584 51711 56270 61771 68463 76149 84504 93490 103298 113665 123428 131103 135901 137841
54612 137841 136886 132612 125129 115834 106556 98099 90116 82320 75124 69006 63869 59321 55132 51137
54598 51137 47080 42959 39194 36083 33335 30544 27941 26241 25791 26224 26919 27390 27236 26168 24370 22604
54582 22604 21677 21817 22623 23526 24148 24292 23850 22963 22203 22250 23093 23800 23478 22416 21778 22116 22779 22999 22951
54563 22951 23211 23708 23888 23631 23264 22821 22079 21285 21039 21327 21419 20986 20583 20682 20896 20702 20390 20662 21655 22923
54543 22923 24145 25273 26140 26464 26246 25769 25267 24847 24593 24421 24037 23413 23106 23678 24959 26284 27294
$$ packed form
54661C1149o70K35M59j1n11n96m57l30r3K55K08n58j435j511q28l50n74q62m64
54642B3056L83Q98R23R92J343J502J080M90M25R06J291J232J163J669K679L578
54626D3610L974M127M559N501O692P686Q355Q986R808J0367R763P675M798J940
54612A37841r55m274p483r295r278q457p983p796p196o118n137m548m189l995
54598E1137m057m121l765l111k748k791k603j700m50M33O95M71j54j068j798j766
54582B2604r27J40Q06R03O22J44m42q87p60M7Q43P07l22j062o38L38O63K20m8
54563B2951K60M97J80k57l67m43p42p94k46K88R2m33m03R9K14j94l12K72R93J268
54543B2923J222J128Q67L24k18m77n02m20k54j72l84o24l07N72J281J325J010
$$ plain form
54526 27294 28079 28711 29203 29787 30634 31378 31520 31348 31831 33531 36228 39602 43526 47481 50622 52966 55851
54509 55851 60459 66269 71548 75055 76649 76587 75093 72611 69739 66646 62983 58560 53849 49669 46545
54494 46545 44433 42855 41298 39598 37937 36365 34558 32316 30108 28700 28263 28235 28090 27863 27861 28188 28726
54477 28726 29287 29606 29433 28859 28434 28746 29909 31448 32643 32989 32541 31878 31585 31719 31881 31766 31432 31018
54459 31018 30516 29958 29629 29790 30245 30370 29664 28261 26932 26478 27044 27987 28509 28377 27930 27512 27165 26868
54441 26868 26742 26872 27060 26966 26420 25537 24613 23930 23579 23397 23188 23003 23072 23469 23982 24349 24508 24645 25134 26337
54421 26337 28162 29840 30484 29979 29049 28390 28069 27915 28016 28443 28819 28666 28138 28003 28840 30536 32585 34635
54403 34635 36656 38770 40974 42983 44403 45167 45673 46270 46724 46451 45247 43567 42046 41043 40649 40799
$$ packed form
54526B7294P85O32M92N84Q47P44J42j72M83J700K697L374L924L955L141K344K885
54509E5851M608N810N279L507J594o2j494k482k872l093l663m423m711m180l124
54494D6545k112j578j557j700j661j572j807k242k208j408m37k8j45k27kL27N38
54477B8726N61L19j73n74m25L12J163J539J195L46m48o63k93J34J62j15l34m14
54459C1018n02n58l29J61M55J25p06j403j329m54N66R43N22j32m47m18l47k97
54441B6868j26J30J88r4n46q83r24o83l51j82k09j85O9L97N13L67J59J37M89J203
54421B6337J825J678O44n05r30o59l21j54J01M27L76j53n28j35Q37J696K049K050
54403C4635K021K114K204K009J420P64N06N97M54k73j204j680j521j003l94J50
$$ plain form
54387 40799 41159 41120 40279 38917 37812 37488 37745 38009 38024 38021 38190 38268 37909 37285 36935 36926 36582 35332 33555 32222
54367 32222 31825 32048 32391 32702 33027 33317 33500 33631 33782 33923 34050 34315 34875 35710 36704 37854 39254 40876
54349 40876 42492 43865 44947 45771 46183 45844 44705 43412 42919 43543 44610 45206 45094 44649 44107 43300 42102
54332 42102 40680 39202 37617 35901 34298 33116 32462 32337 32763 33610 34419 34702 34406 33876 33382 32814 31931
54315 31931 30784 29814 29486 29843 30443 30791 30776 30583 30264 29603 28506 27351 26776 27093 28015 28944 29530 29959
54297 29959 30656 31653 32363 32107 30855 29228 27795 26583 25381 24268 23609 23596 23961 24186 23983 23545 23345
54280 23345 23644 24204 24555 24440 23876 22949 21872 21154 21313 22276 23381 24112 24495 24624 24216 23093 21851 21570
54262 21570 22742 24734 26345 26790 26228 25521 25425 25900 26255 25977 25240 24475 23832 23298 23040 23145 23254 22957
$$ packed form
54387D0799L60l9q41j362j105l24K57K64J5lJ69P8l59o24l50rl44j250j777j333
54367C2222l97K23L43L11L25K90J83J31J51J41J27K65N60Q35R94J150J400J622
54349D0876J616J373J082Q24M12l39j139j293m93O24J067N96j12m45n42q07j198
54332D2102j422j478j585j716j603j182o54j25M26Q47Q09K83k96n30m94n68q83
54315C1931j147r70l28L57O00L48j5j93l19o61j097j155n75L17R22R29N86M29
54297B9959O97R97P10k56j252j627j433j212j202j113o59j3L65K25k03m38k00
54280B3345K99N60L51j15n64r27j077p18J59R63J105P31L83J29m08j123j242k81
54262B1570J172J992J611M45n62p07r6M75L55k78p37p65o43n34k58J05J09k97
$$ plain form
54244 22957 22443 22279 22559 22836 22910 23105 23572 23846 23457 22608 21918 21786 22299 23370 24594 25202 24717 23522
54226 23522 22441 21813 21376 20967 20855 21306 22201 23285 24396 25281 25503 24888 23899 23235 23082 23036 22788 22602
54208 22602 22981 24064 25510 26899 27949 28380 27885 26476 24742 23457 22855 22485 21880 21222 21159 22047 23498
54191 23498 24748 25369 25575 25864 26465 27154 27609 27802 27940 28114 28184 28045 27800 27601 27511 27624 28132 28983 29615
54172 29615 29396 28398 27494 27460 28149 28724 28598 27950 27358 27140 27166 27149 26931 26498 25858 25029 24146 23480 23253 23448
54152 23448 23834 24185 24415 24470 24207 23540 22651 21898 21410 20946 20301 19730 19745 20479 21495 22313 22967 23846 25135
54133 25135 26646 28156 29653 31110 32189 32427 31752 30739 30218 30595 31550 32418 32818 32819 32615 32209 31571 30889
54115 30889 30496 30494 30581 30259 29219 27628 26103 25247 25071 25048 24878 25013 26079 27952 29815 31064 31698 31822
$$ packed form
54244B2957n14j64K80K77P4J95M67K74l89q49o90j32N13J071J224O08m85j195
54226B3522j081o28m37m09j12M51Q95J084J111Q85K22o15r89o64j53m6k48j86
54208B2602L79J083J446J389J050M31m95j409j734j285o02l70o05o58o3Q88J451
54191B3498J250O21K06K89O01O89M55J93J38J74P0j39k45j99r0J13N08Q51O32
54172B9615k19r98r04l4O89N75j26o48n92k18K6j7k18m33o40q29q83o66k27J95
54152B3448L86L51K30N5k63o67q89p53m88m64o45n71J5P34J016Q18O54Q79J289
54133B5135J511J510J497J457J079K38o75j013n21L77R55Q68M00Jk04m06o38o82
54115C0889l93kQ7l22j040j591j525q56j76k3j70J35J066J873J863J249O34J24
$$ plain form
54097 31822 31358 30521 29997 30171 30522 30277 29447 28689 28352 28214 28121 28255 28667 29058 29225 29335 29561 29814 30024
54078 30024 30333 30777 31198 31699 32800 34763 37095 39147 40907 42666 44169 44783 44508 44173 44455 45200 45957
54061 45957 46713 47775 49214 50802 52336 53758 55113 56516 58088 59852 61928 64824 69074 74287 79096
54046 79096 82526 85147 88344 92686 97595 102392 106868 110776 113655 115541 117211 119236 121222 122480
54032 122480 123064 123554 124069 124160 123593 122689 121804 120945 119957 118672 116762 113818 109807 105167 100348 95506 90712
54015 90712 86138 81831 77638 73612 70235 67910 66328 64700 62591 60278 58208 56400 54602 52961
54001 52961 52224 53005 54856 56352 56325 54877 52987 51338 49884 48473 47314 46584 46044 45378 44707 44427 44696
53984 44696 45340 46116 46830 47308 47484 47417 47050 46201 45048 44343 44707 45840 46877 47442 47898 48568 49217 49523
$$ packed form
54097C1822m64q37n24J74L51k45q30p58l37j38r3J34M12L91J67J10K26K53K10
54078C0024L09M44M21N01J101J963K332K052J760J759J503O14k75l35K82P45P57
54061D5957P56J062J439J588J534J422J355J403J572J764K076K896M250N213M809
54046G9096L430K621L197M342M909M797M476L908K879J886J670K025J986J258
54032A22480N84M90N15R1n67r04q85q59r88j285j910k944m011m640m819m842m794
54015I0712m574m307m193m026l377k325j582j628k109k313k070j808j798j641
54001E2961p37P81J851J496k7j448j890j649j454j411j159p30n40o66o71k80K69
53984D4696O44P76P14M78J76o7l67q49j153p05L64J133J037N65M56O70O49L06
$$ plain form
53966 49523 49577 49666 49870 50142 50574 51295 52276 53465 54964 56852 58916 60754 62170 63332 64609 66302 68414
53949 68414 70545 72133 72950 73405 74283 76153 78998 82283 85436 88368 91544 95386 99738 104206 109005
53934 109005 114989 122674 131556 140670 149457 157822 165711 173155 180543 188233 195873 202584 207923 212271
53920 212271 216135 219426 221686 222756 222928 222500 221356 219023 215178 210159 204913 200252 196181 192161 187960
53905 187960 183926 180361 177030 173434 169311 164669 159612 154379 149333 144609 139964 135209 130590 126393
53891 126393 122332 117798 112743 107930 104157 101564 99772 98408 97260 96134 94798 93000 90422 86827
53877 86827 82435 78015 74369 71745 69884 68506 67526 66830 66191 65507 64938 64703 64825 65083 65101 64508 63258
53860 63258 61871 61094 61142 61415 61183 60416 59777 59914 60963 62623 64398 65770 66432 66479 66254 65950 65524 64911
$$ packed form
53966D9523N4Q9K04K72M32P21R81J189J499J888K064J838J416J162J277J693K112
53949F8414K131J588Q17M55Q78J870K845L285L153K932L176L842M352M468M799
53934A09005N984P685Q882R114Q787Q365P889P444P388P690P640O711N339M348
53920B12271L864L291K260J070J72m28j144k333l845n019n246m661m071m020m201
53905A87960m034l565l331l596m123m642n057n233n046m724m645m755m619m197
53891A26393m061m534n055m813l773k593j792j364j148j126j336j798k578l595
53877H6827m392m420l646k624j861j378r80o96o39o84n69k35J22K58J8n93j250
53860F3258j387p77M8K73k32p67o39J37J049J660J775J372O62M7k25l04m26o13
$$ plain form
53842 64911 64183 63520 63221 63659 64825 65982 66196 65364 64265 63477 62756 61795 60989 60850 61110 61164 61145 61772 63144
53823 63144 64533 65587 66950 69300 72390 75510 78413 81237 83950 86492 89254 92756 96893 101042
53809 101042 104948 108949 113179 116993 119538 120728 121400 122527 124380 126418 127955 128843 129438 129923 129928 128959
53793 128959 126971 124306 121270 118134 115361 113327 111711 109582 106336 102270 98099 94174 90454 86989
53779 86989 84037 81648 79472 77181 74949 73303 72442 71835 70686 68759 66562 64649 63001 61281 59519
53764 59519 58208 57715 57892 58273 58467 58289 57764 57133 56684 56444 56116 55404 54343 53262 52470 51966 51421 50490
53746 50490 49245 48175 47591 47190 46547 45993 46540 48710 51692 53994 54816 54617 54418 54779 55510 56190 56682
53729 56682 57072 57279 57087 56670 56657 57410 58541 59556 60661 62347 64337 65688 66011 65907 66010 66299 66668
$$ packed form
53842F4911p28o63k99M38J166J157K14q32j099p88p21r61q06j39K60N4j9O27J372
53823F3144J389J054J363K350L090L120K903K824K713K542K762L502M137M149
53809A01042L906M001M230L814K545J190O72J127J853K038J537Q88N95M85Nr69
53793A28959j988k665l036l136k773k034j616k129l246m066m171l925l720l465
53779H6989k952k389k176k291k232j646q61o07j149j927k197j913j648j720j762
53764E9519j311m93J77L81J94j78n25o31m49k40l28p12j061j081p92n04n45r31
53746E0490j245j070n84m01o43n54N47K170K982K302Q22j99j99L61P31O80M92
53729E6682L90K07j92m17j3P53J131J015J105J686J990J351L23j04J03K89L69
$$ plain form
53712 66668 67407 68540 69340 69237 68830 69186 70350 71408 71940 72616 74126 76208 78057 79272 80058 80853 82046
53695 82046 83854 86197 88719 91032 92890 94180 94983 95649 96572 97786 98908 99523 99528 99088 98447 97718 96701
53678 96701 95024 92662 90252 88613 88050 88329 89108 89921 89934 88443 85817 83446 82419 82593 83093 83257 82764
53661 82764 81386 79252 77178 76199 76619 77845 79136 80222 81162 81916 82269 82077 81486 80914 80862 81614 83017
53644 83017 84521 85526 85817 85664 85487 85494 85735 86387 87566 88857 89516 89434 89505 90595 92492 94391 96129 98190
53626 98190 100637 102824 104302 105337 106367 107556 109094 111251 113828 116145 117917 119559 121325 122852
53612 122852 123989 125358 127380 129380 130515 131121 132291 134369 136792 139206 141784 144404 146458 147699
53598 147699 148589 149575 150537 151148 151223 150643 149517 148547 148534 149272 149574 148740 147405 146516 146017 145121 143493 141582
$$ packed form
53712F6668P39J133Q00j03m07L56J164J058N32O76J510K082J849J215P86P95J193
53695H2046J808K343K522K313J858J290Q03O66R23J214J122O15Nm40o41p29j017
53678I6701j677k362k410j639n63K79P79Q13J3j491k626k371j027J74N00J64m93
53661H2764j378k134k074r79M20J226J291J086R40P54L53j92n91n72n2P52J403
53644H3017J504J005K91j53j77PK41O52J179J291O59q2P1J090J897J899J738K061
53626I8190K447K187J478J035J030J189J538K157K577K317J772J642J766J527
53612A22852J137J369K022K000J135O06J170K078K423K414K578K620K054J241
53598A47699Q90R86R62O11P5n80j126r70j3P38L02q34j335q89m99q96j628j911
$$ plain form
53580 141582 139957 138800 137983 137237 136272 135016 133719 132664 131854 131136 130470 129890 129330 128733 128208 127896 127740
53563 127740 127530 127068 126297 125440 125057 125600 126734 127450 127158 126393 126100 126462 126852 126807 126523 126468 126910 127954 129598
53544 129598 131538 133230 134412 135475 137058 139303 141709 143801 145761 148241 151596 155528 159594 163822
53530 163822 168554 173790 179115 184338 189831 196029 202911 210227 217988 226389 235341 244344 252817 260446
53516 260446 267353 274138 281625 290412 300685 312492 325814 340223 354811 368887 382524 396116
53504 396116 409675 423000 436263 449792 463304 475987 487443 498054 508301 518242 527856 537386
53492 537386 547044 556780 566645 576978 587864 598738 608980 618661 628307 638125 647876 657376 666690
53479 666690 675891 684938 693660 701540 707713 711711 714178 716322 718557 720143 720275 718974 716604 713053
$$ packed form
53580A41582j625j157q17p46r65j256j297j055q10p18o66n80n60n97n25l12j56
53563A27740k10m62p71q57l83N43J134P16k92p65k93L62L90m5k84n5M42J044J644
53544A29598J940J692J182J063J583K245K406K092J960K480L355L932M066M228
53530A63822M732N236N325N223N493O198O882P316P761Q401Q952R003Q473P629
53516B60446O907O785P487Q787J0273J1807J3322J4409J4588J4076J3637J3592
53504C96116J3559J3325J3263J3529J3512J2683J1456J0611J0247R941R614R530
53492E37386R658R736R865J0333J0886J0874J0242R681R646R818R751R500R314
53479F66690R201R047Q722P880O173L998K467K144K235J586J32j301k370l551
$$ plain form
53465 713053 707912 701265 693691 685460 676122 665159 652927 640791 630202 621523 613729 605340 595692
53452 595692 585205 574513 563723 552673 541553 530878 520971 511781 503108 494683 486144 477379 468959
53439 468959 461912 456864 453607 451537 450271 449731 449895 450685 451983 453595 455361 457359 459855 462914 466295
53424 466295 469898 474100 479393 485857 493312 501866 511886 523293 535260 546941 558393 570493 583952
53411 583952 598665 614148 630336 647564 665814 684427 702875 721581 741644 763833 788122
53400 788122 814124 841489 869825 898597 927443 956427 985836 1015816 1046241 1076765 1106977
53389 1106977 1136731 1166346 1196171 1225904 1254708 1282037 1307922 1332334 1354870 1375397 1394442
53378 1394442 1412367 1428547 1441911 1452024 1459083 1463228 1464538 1463504 1460677 1455908 1448591 1438660 1426522
$$ packed form
53465G13053n141o647p574q231r338j0963j2232j2136j0589q679p794q389r648
53452E95692j0487j0692j0790j1050j1120j0675r907r190q673q425q539q765q420
53439D68959p047n048l257k070j266n40J64P90J298J612J766J998K496L059L381
53424D66295L603M202N293O464P455Q554J0020J1407J1967J1681J1452J2100J3459
53411E83952J4713J5483J6188J7228J8250J8613J8448J8706K0063K2189K4289
53400G88122K6002K7365K8336K8772K8846K8984K9409K9980L0425L0524L0212
53389A106977K9754K9615K9825K9733K8804K7329K5885K4412K2536K0527J9045
53378A394442J7925J6180J3364J0113P059M145J310j034k827m769p317r931j2138
$$ plain form
53365 1426522 1411899 1393569 1370617 1343406 1313037 1280548 1246945 1213311 1180271 1147705 1115489
53354 1115489 1084081 1053910 1024650 995776 967619 941165 916874 894269 872666 851749 831330
53343 831330 811053 790616 770020 749418 728895 708576 688830 670225 653336 638543 625888
53332 625888 614968 605029 595323 585599 576340 568365 561996 556661 551446 545918 540150 534166 527854 521424
53318 521424 515441 510203 505554 501487 498467 496834 496287 496332 496872 498038 499827 502283 505694 510139 515168
53303 515168 520465 526508 533960 542619 551621 560607 570078 580603 592272 604946 618464 632491 646722
53290 646722 661421 677195 694002 710801 726481 740733 753774 765621 776073 785170 793220 800309
53278 800309 805938 809246 809682 807645 804365 800860 796959 791654 784461 776024 767234 758110 747942 736338
$$ packed form
53365A426522j4623j8330k2952k7211l0369l2489l3603l3634l3040l2566l2216
53354A115489l1408l0171k9260k8874k8157k6454k4291k2605k1603k0917k0419
53343H31330k0277k0437k0596k0602k0523k0319j9746j8605j6889j4793j2655
53332F25888j0920r939r706r724r259p975o369n335n215n528n768n984o312o430
53318E21424n983n238m649m067l020j633n47M5N40J166J789K456L411M445N029
53303E15168N297O043P452Q659R002Q986R471J0525J1669J2674J3518J4027J4231
53290F46722J4699J5774J6807J6799J5680J4252J3041J1847J0452R097Q050P089
53278H00309N629L308M36k037l280l505l901n305p193q437q790r124j0168j1604
$$ plain form
53264 736338 723785 711116 698601 685633 671347 655591 639236 623364 608183 592949 576931
53253 576931 560186 543329 526853 510867 495322 480291 466099 453219 441870 431666 421767 411460
53241 411460 400512 389038 377295 365661 354498 343880 333641 323801 314749 306881 300255 294759
53229 294759 290334 286760 283411 279610 275230 270742 266567 262615 258548 254289 249985 245485 240175 233635
53215 233635 226320 219235 212850 206728 200332 193837 187839 182629 178176 174579 171927 169797 167436 164516
53201 164516 161318 158168 155123 152216 149489 146644 143188 139106 134941 131100 127576 124550 122604 121924
53187 121924 121749 121135 119891 118317 116426 114125 111917 110670 110610 111103 111526 111866 112312 112706 112769 112610 112667 113227
53169 113227 114209 115400 116690 117992 119055 119565 119519 119420 119907 121173 122807 124203 125042 125460 125891 126704 127828
$$ packed form
53264G36338j2553j2669j2515j2968j4286j5756j6355j5872j5181j5234j6018
53253E76931j6745j6857j6476j5986j5545j5031j4192j2880j1349j0204r899j0307
53241D11460j0948j1474j1743j1634j1163j0618j0239r840r052p868o626n496
53229B94759m425l574l349l801m380m488m175l952m067m259m304m500n310o540
53215B33635p315p085o385o122o396o495n998n210m453l597k652k130k361k920
53201A64516l198l150l045k907k727k845l456m082m165l841l524l026j946o80
53187A21924j75o14j244j574j891k301k208j247o0M93M23L40M46L94O3j59N7N60
53169A13227R82J191J290J302J063N10m6r9M87J266J634J396Q39M18M31Q13J124
$$ plain form
53152 127828 128817 129442 130047 131022 132061 132380 131724 130704 130051 129925 130146 130619 131286 131968 132570 133185 133807 134236
53134 134236 134494 134972 135899 136963 137740 138207 138557 138824 138926 138774 138031 136185 133300 130377 128491 127755 127495
53117 127495 127132 126526 125795 125310 125535 126286 126446 125085 122686 120589 119351 118378 117089 115579 113959 111847
53101 111847 108930 105538 102290 99491 97096 94959 92964 91180 89963 89525 89416 88920 88036 87495 87614 87678
53085 87678 86820 85057 83108 81574 80670 80454 80822 81420 81890 82145 82225 82082 81664 81019 80164 79073 77967 77342
53067 77342 77470 78077 78730 79271 79652 79631 78986 77856 76541 75104 73469 71811 70514 69727 69186 68510 67583
53050 67583 66672 66257 66577 67296 67754 67603 67010 66185 65098 63802 62638 61814 61116 60408 60104 60647 61794 62968
53032 62968 64203 66090 68721 71238 72623 72547 71316 69520 68034 67858 69337 71611 73303 73792 73530 73167
$$ packed form
53152A27828R89O25O05R75J039L19o56j020o53j26K21M73O67O82O02O15O22M29
53134A34236K58M78R27J064P77M67L50K67J02j52p43j846k885k923j886p36k60
53117A27495l63o06p31m85K25P51J60j361k399k097j238r73j289j510j620k112
53101A11847k917l392l248k799k395k137j995j784j217m38j09m96q84n41J19O4
53085H7678q58j763j949j534r04k16L68N98M70K55Q0j43m18o45q55j091j106o25
53067G7342J28O07O53N41L81k1o45j130j315j437j635j658j297p87n41o76r27
53050F7583r11m15L20P19M58j51n93q25j087j296j164q24o98p08l04N43J147J174
53032F2968J235J887K631K517J385p6j231j796j486j76J479K274J692M89k62l63
$$ plain form
53016 73167 72826 72353 71879 71691 71694 71500 71117 71137 71953 73028 73365 72621 71387 70324 69482 68719 68332 68782 69883
52997 69883 70755 70783 70321 70309 71361 73350 75674 77675 78858 79084 78737 78585 79251 80772 82722 84712 86608
52980 86608 88348 89845 91218 92871 95019 97187 98476 98397 97312 96050 95202 94740 94105 92712 90602 88632
52964 88632 87747 88024 88625 88700 88042 86865 85378 83862 82807 82548 82876 83289 83528 83598 83438 82881 81972 81045
52946 81045 80391 80011 79718 79335 78845 78449 78489 79163 80329 81657 82906 83937 84607 84865 84878 84844 84745 84467 84076
52927 84076 83717 83265 82411 81137 79811 78673 77539 76205 74938 74288 74513 75413 76638 77898 78925 79484
52911 79484 79530 79168 78383 77022 75181 73449 72527 72620 73323 74025 74268 73847 72923 72072 71864 72168 72183 71402 70267
52892 70267 69571 69443 69425 69371 69623 70224 70560 70124 69249 68678 68668 68879 69019 69136 69278 69193 68555 67390 66190 65558
$$ packed form
53016G3167l41m73m74j88Lj94l83K0Q16J075L37p44j234j063q42p63l87M50J101
52997F9883Q72K8m62j2J052J989K324K001J183K26l47j52O66J521J950J990J896
52980H6608J740J497J373J653K148K168J289p9j085j262q48m62o35j393k110j970
52964H8632q85K77O01P5o58j177j487j516j055k59L28M13K39P0j60n57r09r27
52946H1045o54l80k93l83m90l96M0O74J166J328J249J031O70K58J3l4r9k78l91
52927H4076l59m52q54j274j326j138j134j334j267o50K25R00J225J260J027N59
52911G9484M6l62p85j361j841j732r22R3P03P02K43m21r24q51k08L04J5p81j135
52892G0267o96j28j8n4K52O01L36m36q75n71j0K11J40J17J42q5o38j165j200o32
$$ plain form
52872 65558 65648 66002 66090 66050 66643 68386 70932 73448 75343 76430 76655 75986 74476 72245 69541 66973 65361
52855 65361 65039 65420 65618 65321 64753 64016 62990 61748 60526 59253 57662 55947 54805 54648 55248 56346
52839 56346 58073 60420 62797 64595 65861 66934 67732 67982 67981 68444 69566 70891 72189 73798 75731 77142
52823 77142 77319 76821 76791 77259 76940 75003 72269 70152 68892 67559 65548 63290 61428 60065 59124 58846
52807 58846 59314 59829 59390 57753 55609 53704 52226 51083 50327 50036 50065 50178 50311 50516 50685 50515 49821 48798
52789 48798 47938 47587 47622 47653 47534 47460 47475 47263 46786 46843 48345 50999 53331 54262 54147 53919 53696 52874 51301
52770 51301 49703 48903 49135 50170 51546 52522 52371 51159 49945 49771 50646 51845 52938 54004 54939 55208
52754 55208 54530 53369 52444 52018 51966 52196 52614 52880 52675 52182 51864 51739 51285 50189 48840 47879 47546 47686
$$ packed form
52872F5558R0L54Q8m0N93J743K546K516J895J087K25o69j510k231k704k568j612
52855F5361l22L81J98k97n68p37j026j242j222j273j591j715j142j57O00J098
52839E6346J727K347K377J798J266J073P98K50jM63J122J325J298J609J933J411
52823G7142J77m98l0M68l19j937k734k117j260j333k011k258j862j363r41k78
52807E8846M68N15m39j637k144j905j478j143p56k91K9J13J33K05J69j70o94j023
52789D8798q60l51L5L1j19p4J5k12m77N7J502K654K332R31j15k28k23q22j573
52770E1301j598q00K32J035J376R76j51j212j214j74Q75J199J093J066R35K69
52754E5208o78j161r25m26n2K30M18K66k05m93l18j25m54j096j349r61l33J40
$$ plain form
52736 47686 48134 48762 49373 49877 50499 51559 53092 54871 56722 58492 59813 60292 60036 59630 59381 58901 57768
52719 57768 56423 55908 56617 57733 58206 58098 58509 60234 62915 65647 68009 70162 72271 74329 76432 78693
52703 78693 80825 82227 82649 82431 81976 81339 80472 79476 78349 76863 75104 73794 73645 74464 75244 75068 73689
52686 73689 71413 68833 66625 65192 64446 64120 64176 64608 64996 64704 63606 62275 61399 61305 62079 63732 66035
52669 66035 68454 70519 72145 73484 74575 75267 75369 74788 73623 72183 70875 69944 69355 68895 68372 67754
52653 67754 67150 66615 66020 65195 64107 62708 60759 58233 55864 54675 54735 54956 54555 54119 54613 55898 57062
52636 57062 57864 58854 60154 61128 61378 61186 60781 60073 59411 59691 61153 62787 63492 63301 62920 62640 62303 61899
52618 61899 61530 61121 60705 60707 61340 62095 62410 62603 63479 65193 67140 68812 70124 70980 71170 70798 70252 69693
$$ packed form
52736D7686M48O28O11N04O22J060J533J779J851J770J321M79k56m06k49m80j133
52719E7768j345n15P09J116M73j08M11J725K681K732K362K153K109K058K103K261
52703G8693K132J402M22k18m55o37q67r96j127j486j759j310j49Q19P80j76j379
52686G3689k276k580k208j433p46l26N6M32L88k92j098j331q76r4P74J653K303
52669F6035K419K065J626J339J091O92J02n81j165j440j308r31n89m60n23o18
52653F7754o04n35n95q25j088j399j949k526k369j189O0K21m01m36M94J285J164
52636E7062Q02R90J300R74K50j92m05p08o62K80J462J634P05j91l81k80l37m04
52618F1899l69m09m16KO33P55L15J93Q76J714J947J672J312Q56J90l72n46n59
$$ plain form
52600 69693 68993 68220 67710 67629 67842 68273 68921 69532 69704 69427 69100 68937 68813 68841 69574 71319 73563 75385 76287
52581 76287 76464 76453 76680 77185 77641 77691 77295 76675 76029 75500 75264 75318 75286 74865 74408 74523 75061 75097 74172 73011
52561 73011 72638 73192 74088 74983 76128 77829 79953 81937 83152 83410 83283 83549 84067 83583 81177 77646 74875
52544 74875 73878 74017 74080 73535 72547 71430 70525 70290 71008 72392 73679 74113 73360 71708 69935 68730 68023
52527 68023 67120 65662 64155 63303 63089 62901 62365 61628 60943 60435 60232 60322 60268 59563 58425 57672 57661 57876 57804
52508 57804 57624 57546 57145 56112 55254 55796 57772 59965 61550 62919 64633 66325 67155 66804 65544 63801
52492 63801 62175 61445 61920 62942 63550 63528 63379 63453 63567 63456 63085 62539 61954 61633 61901 62790 64043 65319
52474 65319 66216 66317 65633 64847 64670 65033 65322 65317 65344 65490 65308 64586 63873 63890 64703 65818 66858 67773 68526 68908
$$ packed form
52600F9693p00p73n10q1K13M31O48O11J72k77l27j63j24K8P33J745K244J822R02
52581G6287J77j1K27N05M56N0l96o20o46n29k36N4l2m21m57J15N38L6r25j161
52561G3011l73N54Q96Q95J145J701K124J984J215K58j27K66N18m84k406l531k771
52544G4875r97J39O3n45r88j117r05k35P18J384J287M34p53j652j773j205p07
52527F8023r03j458j507q52k14j88n36p37o85n08k03R0n4p05j138p53j1K15p2
52508E7804j80p8m01j033q58N42J976K193J585J369J714J692Q30l51j260j743
52492F3801j626p30M75J022O08k2j49P4J14j11l71n46n85l21K68Q89J253J276
52474F5319Q97J01o84p86j77L63K89nK7J46j82p22p13J7Q13J115J040R15P53L82
$$ plain form
52454 68908 68725 68037 67185 66581 66389 66410 66311 65915 65180 64136 63085 62655 63157 63982 64179 63716 63574 64382 65479
52435 65479 65725 64806 63344 62082 61467 61769 63028 64844 66568 67727 68138 67829 67190 66993 67809 69412 71092
52418 71092 72405 73271 73470 72689 71158 69744 69143 69298 69753 70194 70407 70139 69419 68750 68559 68623 68448 68108
52400 68108 68170 68763 69291 69306 69217 69725 70890 72243 73661 75524 77922 80202 81648 82291 82735 83377 84176 85052
52382 85052 86108 87380 88712 90053 91604 93487 95385 96768 97495 98045 99038 100583 102165 103209 103679
52367 103679 104063 104835 106086 107635 109219 110482 111092 111188 111559 113039 115723 118980 122187 125176 128022 130760
52351 130760 133431 136179 139181 142598 146573 151087 155799 160306 164625 169216 174469 180377 186771 193602
52337 193602 200906 208699 216985 225649 234351 242801 251233 260244 270026 280087 289888 299393 308725 317663
$$ packed form
52454F8908j83o88q52o04j92K1r9l96p35j044j051m30N02Q25J97m63j42Q08J097
52435F5479K46r19j462j262o15L02J259J816J724J159M11l09o39j97Q16J603J680
52418G1092J313Q66J99p81j531j414o01J55M55M41K13k68p20o69j91O4j75l40
52400F8108O2N93N28J5q9N08J165J353J418J863K398K280J446O43M44O42P99Q76
52382H5052J056J272J332J341J551J883J898J383P27N50R93J545J582J044M70
52367A03679L84P72J251J549J584J263O10R6L71J480K684L257L207K989K846K738
52351A30760K671K748L002L417L975M514M712M507M319M591N253N908O394O831
52337A93602P304P793Q286Q664Q702Q450Q432R011R782J0061R801R505R332Q938
$$ plain form
52323 317663 325871 333424 340664 347628 353972 359438 364104 368177 371726 374668 376828 378040 378271 377617 376195
52308 376195 374147 371769 369358 366873 364023 360804 357643 354861 352374 350090 348168 346577 344891 342993
52294 342993 341544 341156 341482 341898 342772 345183 349374 354375 359342 364461 370229 376586 383231 390185 397461
52279 397461 404606 411196 417539 424373 431932 439684 446838 452759 457059 459737 461275 462301 463128 463627 463414
52264 463414 462010 459126 455180 451257 448097 445173 441258 435885 429726 423486 417055 410114 403119 397024
52250 397024 392109 387620 382762 377691 373273 370070 367919 366423 365526 365401 365979 366884 367749 368423 368893 369305
52234 369305 370076 371714 374301 377365 380436 383539 386848 390086 392721 394807 397168 400488 404503 408430
52220 408430 412033 415854 420401 425459 430318 434451 437740 440232 441982 443126 443935 444751 445916 447656 449825
$$ packed form
52323C17663Q208P553P240O964O344N466M666M073L549K942K160J212K31o54j422
52308C76195k048k378k411k485k850l219l161k782k487k284j922j591j686j898
52294C42993j449l88L26M16Q74K411M191N001M967N119N768O357O645O954P276
52279C97461P145O590O343O834P559P752P154N921M300K678J538J026Q27M99k13
52264D63414j404k884l946l923l160k924l915n373o159o240o431o941o995o095
52250C97024m915m489m858n071m418l203k151j496q97j25N78R05Q65O74M70M12
52234C69305P71J638K587L064L071L103L309L238K635K086K361L320M015L927
52220D08430L603L821M547N058M859M133L289K492J750J144Q09Q16J165J740K169
$$ plain form
52205 449825 451862 453232 453933 454342 454558 454211 453049 451384 449715 448175 446663 445301 444370 443821 443214 442183
52189 442183 440657 438667 436293 433885 431945 430510 428911 426440 423215 420162 418168 417337 417002 416346 415060
52174 415060 413456 411977 410639 409109 407296 405610 404586 404401 404797 405234 405069 403964 402383 401420 401802 403277
52158 403277 405191 407306 409563 411322 411739 411037 410639 411575 413327 414806 415997 417845 420768 424202 427747
52143 427747 431855 436931 442505 447994 453812 460850 469062 477446 485480 493658 502240 510292 516694 521621
52129 521621 526291 531392 536482 540942 544892 548917 553312 557848 562064 565563 568152 569852 570731 570728 569814
52114 569814 568199 566205 563968 561501 558978 556645 554399 551820 548702 545334 542165 539461 537290 535552
52100 535552 533951 532255 530666 529594 528994 528415 527846 528052 529710 532617 536165 540199 544980 550570 556834
$$ packed form
52205D49825K037J370P01M09K16l47j162j665j669j540j512j362r31n49o07j031
52189D42183j526j990k374k408j940j435j599k471l225l053j994q31l35o56j286
52174D15060j604j479j338j530j813j686j024j85L96M37j65j105j581r63L82J475
52158D03277J914K115K257J759M17p02l98R36J752J479J191J848K923L434L545
52143D27747M108N076N574N489N818P038Q212Q384Q034Q178Q582Q052O402M927
52129E21621M670N101N090M460L950M025M395M536M216L499K589J700Q79lr14
52114E69814j615j994k237k467k523k333k246k579l118l368l169k704k171j738
52100E35552j601j696j589j072o00n79n69K06J658K907L548M034M781N590O264
$$ plain form
52085 556834 563873 571873 580566 589386 598188 607321 616894 626430 635444 643886 651772 658710 664201 668198
52071 668198 670992 672599 672661 671075 668438 665537 662405 658154 651936 643940 635173 626333 617147 606870
52057 606870 595101 582047 568328 554733 541832 529501 517043 504068 491053 478694 467006
52046 467006 455480 443985 433051 423351 415324 409139 404493 400479 396237 391870 388261 385880 384236
52033 384236 382579 380595 378166 375040 371112 366738 362418 358448 355012 352171 349422 345742 340521 334252
52019 334252 327919 321931 315962 309601 302718 295400 287876 280348 272585 263916 254024 243543 233424 223912
52005 223912 214597 205285 196249 187741 179839 172780 166850 161795 156903 151822 146845 142239 137812 133383
51991 133383 129195 125546 122433 119860 118016 116762 115344 113228 110919 109315 108379 107158 105237 103503
$$ packed form
52085E56834P039Q000Q693Q820Q802R133R573R536R014Q442P886O938N491L997
52071F68198K794J607O2j586k637k901l132m251o218p996q767q840r186j0277
52057F06870j1769j3054j3719j3595j2901j2331j2458j2975j3015j2359j1688
52046D67006j1526j1495j0934r700q027o185m646m014m242m367l609k381j644
52033C84236j657j984k429l126l928m374m320l970l436k841k749l680n221o269
52019C34252o333n988n969o361o883p318p524p528p763q669r892j0481j0119r512
52005B23912r315r312r036q508p902p059n930n055m892n081m977m606m427m429
51991A33383m188l649l113k573j844j254j418k116k309j604r36j221j921j734
$$ plain form
51977 103503 103091 104008 105273 106201 107006 108112 109276 109714 108941 107176 104878 102108 98652 94766 91481 89829
51961 89829 89781 90185 89926 88956 88019 87519 87088 86319 85465 84986 84711 84014 82815 81817 81521 81588 81597 81894 82980 84355
51941 84355 84831 84082 83104 82862 83187 83465 83771 84600 85834 86797 87332 88030 89175 90033 89671 88102 86179 84549
51923 84549 83193 81969 81049 80522 79916 78582 76491 74252 72277 70343 68167 66020 64347 63071 61817
51908 61817 60740 60530 61485 63068 64596 65866 66854 67298 67057 66519 66175 65979 65576 64944 64338 63758 63009 62172
51890 62172 61503 60943 60343 60130 61022 62832 64213 64040 62629 61232 60668 60826 61137 61034 60184 58749 57380
51873 57380 56609 56314 56115 56092 56699 58048 59725 61346 62829 63985 64322 63564 62223 61308 61510 62735 64411
51856 64411 66060 67592 69106 70577 71830 72804 73642 74436 75100 75610 76160 76795 77113 76768 76137 76042 76742 77658
$$ packed form
51977A03503m12R17J265R28Q05J106J164M38p73j765k298k770l456l886l285j652
51961H9829m8M04k59r70r37n00m31p69q54m79k75o97j199r98k96O7RK97J086J375
51941H4355M76p49r78k42L25K78L06Q29J234R63N35O98J145Q58l62j569j923j630
51923H4549j356j224r20n27o06j334k091k239j975j934k176k147j673j276j254
51908F1817j077k10R55J583J528J270R88M44k41n38l44j96m03o32o06n80p49q37
51890F2172o69n60o00k13Q92J810J381j73j411j397n64J58L11j03q50j435j369
51873E7380p71k95j99k3O07J349J677J621J483J156L37p58j341r15K02J225J676
51856F4411J649J532J514J471J253R74Q38P94O64N10N50O35L18l45o31r5P00R16
$$ plain form
51838 77658 78255 78706 79402 80265 81038 82036 84029 87369 91648 96306 101189 106437 112253 119093 127793 139052
51822 139052 152768 168263 185160 203697 223797 243897 260995 272022 275229 270510 258936 242340
51810 242340 223079 203560 185518 169671 156040 144445 134617 126095 118394 111394 105466 101126 98507
51797 98507 97121 96112 94784 92990 91000 89068 87241 85589 84371 83715 83314 82728 81973 81506 81560 81796
51781 81796 81814 81704 81837 82199 82329 81910 81164 80567 80340 80351 80356 80245 80117 80149 80318 80241 79499 78215 77092 76733
51761 76733 77073 77666 78301 78998 79554 79528 78790 77783 77115 77090 77738 78985 80610 82218 83487 84354 84897 85226
51743 85226 85601 86346 87421 88343 88824 89310 90530 92598 94895 96744 97904 98505 98877 99425 100293 101119 101444
51726 101444 101346 101280 101378 101341 101100 100971 100935 100354 98857 97081 96005 95798 95781 95354 94510 93504 92477 91440 90308
$$ packed form
51838G7658N97M51O96Q63P73R98J993L340M279M658M883N248N816O840Q700J1259
51822A39052J3716J5495J6897J8537K0100K0100J7098J1027L207m719j1574j6596
51810B42340j9261j9519j8042j5847j3631j1595r828q522p701p000n928m340k619
51797I8507j386j009j328j794j990j932j827j652j218o56m01n86p55m67N4K36
51781H1796J8j10J33L62J30m19p46n97k27J1Nj11j28L2J69p7p42j284j123l59
51761G6733L40N93O35O97N56k6p38j007o68k5O48J247J625J608J269Q67N43L29
51743H5226L75P45J075R22M81M86J220K068K297J849J160O01L72N48Q68Q26L25
51726A01444r8o6R8l7k41j29l6n81j497j776j076k07j7m27q44j006j027j037j132
$$ plain form
51707 90308 88938 87382 86039 85317 85175 85187 84963 84296 83187 82043 81562 81944 82384 81965 80975 80687 81737
51690 81737 83351 84361 84361 83591 82335 80941 79959 79664 79667 79462 79094 78822 78415 77430 76064 75108 74902 74872 74326
51671 74326 73325 72520 72321 72551 72825 73075 73632 74742 76152 77382 78423 79747 81407 82590 82612 82064 82219
51654 82219 83297 84114 83749 82863 82777 83709 84599 84559 83836 83253 83227 83630 84290 85185 86161 86869 87225 87820 89460
51635 89460 92123 94701 96132 96632 97357 98893 100608 101654 101977 102011 101823 101139 100018 98982 98527 98875 100083
51618 100083 101985 104020 105550 106401 106863 107222 107640 108330 109336 110135 109990 108884 107596 106717 106008 104964
51602 104964 103477 101629 99373 96938 95118 94486 94513 94101 92907 91510 90316 89003 87257 85417 83949
51587 83949 82662 81000 78951 77260 76700 77333 78497 79376 79557 79186 78645 78172 77843 77837 78408 79451 80352 80529
$$ packed form
51707I0308j370j556j343p22j42J2k24o67j109j144m81L82M40m19r90k88J050
51690H1737J614J010%p70j256j394r82k95Lk05l68k72m07r85j366r56k06l0n46
51671G4326j001q05j99K30K74K50N57J110J410J230J041J324J660J183K2n48J55
51654H2219J078Q17l65q86q6R32Q90m0p23n83k6M03O60Q95R76P08L56N95J640
51635H9460K663K578J431N00P25J536J715J046L23L4j88o84j121j036m55L48J208
51618A00083J902K035J530Q51M62L59M18O90J006P99j45j106j288q79p09j044
51602A04964j487j848k256k435j820o32K7m12j194j397j194j313j746j840j468
51587H3949j287j662k049j691n60O33J164Q79J81l71n41m73l29oN71J043R01J77
$$ plain form
51569 80529 80040 79390 78833 78162 77235 76363 75958 75954 75874 75416 74781 74372 74418 74979 76107 77717 79418 80759 81587
51550 81587 81996 82022 81754 81751 82804 85060 87731 90005 91865 93627 95106 95870 96112 96528 97321 97976 98137 98070
51532 98070 98076 98062 97996 98179 98677 99072 99231 99834 101518 103914 106127 107815 109198 110350 111303 112625 114931 117786
51514 117786 119962 120985 121641 122687 123789 124166 123630 122497 120990 119243 117516 115896 114125 112109 110244
51499 110244 108766 107192 104998 102558 100727 99673 98791 97708 96726 96233 96311 96999 98294 99696 100374 100083
51483 100083 99476 99239 99370 99607 100031 100721 101215 100958 100142 99503 99230 98610 96916 94247 91294 88555 86063
51466 86063 83709 81546 79688 78107 76659 75302 74213 73601 73448 73554 73803 74202 74589 74521 73678 72330 71165
51449 71165 70694 70910 71476 72037 72359 72438 72513 72805 73148 73078 72405 71578 71316 71936 73153 74381 75112 75128 74598 73958
$$ packed form
51569H0529m89o50n57o71r27q72m05mq0m58o35m09M6N61J128J610J701J341Q28
51550H1587M09K6k68lJ053K256K671K274J860J762J479P64K42M16P93O55J61o7
51532I8070Oj4o6J83M98L95J59O03J684K396K213J688J383J152R53J322K306K855
51514A17786K176J023O56J046J102L77n36j133j507j747j727j620j771k016j865
51499A10244j478j574k194k440j831j054q82j083r82m93P8O88J295J402O78k91
51483A00083o07k37J31K37M24O90M94k57q16o39k73o20j694k669k953k739k492
51466H6063k354k163j858j581j448j357j089o12j53J06K49L99L87o8q43j348j165
51449G1165m71K16N66N61L22P9P5K92L43p0o73q27k62O20J217J228P31J6n30o40
$$ plain form
51429 73958 73535 73266 72972 72838 73327 74519 75785 76366 76121 75503 74919 74395 73854 73402 73167 73129 73298 73940 75309
51410 75309 77167 78772 79459 79176 78377 77511 76707 75938 75331 75168 75569 76286 76956 77544 78341 79486 80726 81842
51392 81842 83170 85323 88279 91048 92509 92470 91704 91009 90503 89868 88922 87669 85971 83602 80692 77822
51376 77822 75424 73269 70836 68146 65924 64855 64873 65257 65252 64494 63074 61455 60225 59668 59520 59282 58717
51359 58717 57955 57190 56501 55940 55591 55442 55360 55252 55136 55004 54759 54304 53635 52841 52136 51919 52553 53939 55388
51340 55388 56116 55894 55221 54869 55208 55871 56051 55248 53801 52603 52277 52623 52841 52236 50823 49358 48721 49117
51322 49117 49949 50595 51057 51567 51825 51276 50140 49466 49857 50713 51156 51225 51555 52244 52728 52678 52329 51887 51210
51303 51210 50287 49551 49424 49868 50636 51683 53092 54748 56261 57187 57270 56687 56141 56505 58159 60658 63083
$$ packed form
51429G3958m23k69k94j34M89J192J266N81k45o18n84n24n41m52k35l8J69O42J369
51410G5309J858J605O87k83p99q66q04p69o07j63M01P17O70N88P97J145J240J116
51392H1842J328K153K956K769J461l9p66o95n06o35r46j253j698k369k910k870
51376G7822k398k155k433k690k222j069J8L84np58j420j619j230n57j48k38n65
51359E8717p62p65o89n61l49j49q2j08j16j32k45m55o69p94p05k17O34J386J449
51340E5388P28k22o73l52L39O63J80q03j447j198l26L46K18o05j413j465o37L96
51322D9117Q32O46M62N10K58n49j136o74L91Q56M43O9L30O89M84n0l49m42o77
51303E1210r23p36j27M44P68J047J409J656J513R26Q3n83n46L64J654K499K425
$$ plain form
51286 63083 64661 65182 64963 64442 63698 62484 60857 59498 58987 58926 58333 56905 55317 54193 53476 53069 53334
51269 53334 54352 55234 54980 53833 53014 53160 53718 53976 53992 54160 54405 54356 54074 54148 55004 56416 57808 58917
51251 58917 60064 61769 64132 66664 68709 69958 70482 70462 70069 69538 69062 68556 67688 66263 64494 62860
51235 62860 61755 61247 61052 60729 60056 59283 58893 59098 59609 59880 59483 58310 56679 55322 55003 55878 57308
51218 57308 58496 59270 60064 61151 62198 62749 62911 63273 64149 65228 66077 66662 67104 67155 66365 64772 63071
51201 63071 61980 61677 61923 62395 62787 62811 62332 61399 60117 58748 57940 58359 59878 61546 62613 63162 63379
51184 63379 62876 61440 59980 59742 60706 61684 62039 62235 62437 61704 59322 56195 53994 53284 53296 53319 53469 54096
51166 54096 55169 56402 57456 57867 57320 56265 55792 56520 57873 58723 58605 57994 57557 57515 57770 58337 59356
$$ packed form
51286F3083J578N21k19n21p44j214j627j359n11o1n93j428j588j124p17m07K65
51269E3334J018Q82k54j147q19J46N58K58J6J68K45m9k82P4Q56J412J392J109
51251E8917J147J705K363K532K045J249N24k0l93n31m76n06q68j425j769j634
51235F2860j105n08j95l23o73p73l90K05N11K71l97j173j631j357l19Q75J430
51218E7308J188P74P94J087J047N51J62L62Q76J079Q49N85M42N1p90j593j701
51201F3071j091l03K46M72L92K4m79r33j282j369q08M19J519J668J067N49K17
51184F3379n03j436j460k38R64R78L55J96K02p33k382l127k201p10J2K3J50O27
51166E4096J073J233J054M11n47j055m73P28J353Q50j18o11m37m2K55N67J019
$$ plain form
51149 59356 60707 61820 62075 61398 60341 59516 59016 58503 57725 56809 56093 55810 55926 56119 55959 55311 54638 54696
51131 54696 55779 57378 58698 59409 59733 59965 60227 60712 61788 63558 65469 66696 66922 66514 65921 65236 64465
51114 64465 63897 63895 64484 65383 66339 67193 67749 67885 67730 67495 67194 66813 66667 67166 68234 69328 70116 70762 71514
51095 71514 72436 73653 75381 77428 79136 80168 80970 82076 83285 84018 84208 84245 84146 83386 81646 79334 77230
51078 77230 75928 75617 76087 76860 77565 78236 79038 79821 80305 80604 81090 81692 81839 81242 80276 79385 78580 77870 77667
51059 77667 78243 79090 79398 79079 78754 78762 78741 78387 78082 78390 79256 80111 80595 80775 80687 80133 79061 77869 77132 77131
51039 77131 77786 78827 79869 80496 80584 80507 80757 81403 82141 82848 83782 85165 86863 88563 90030 91071 91562
51022 91562 91653 91748 92093 92617 93303 94377 95859 97260 98100 98544 99160 100188 101445 102769 104094 105177 105785
$$ packed form
51149E9356J351J113K55o77j057q25n00n13p78r16p16k83J16J93j60o48o73N8
51131E4696J083J599J320P11L24K32K62M85J076J770J911J227K26m08n93o85p71
51114F4465n68kN89Q99R56Q54N56J36j55k35l01l81j46M99J068J094P88O46P52
51095G1514R22J217J728K047J708J032Q02J106J209P33J90L7r9p60j740k312k104
51078G7230j302l11M70P73P05O71Q02P83M84K99M86O02J47n97r66q91q05p10k03
51059G7667N76Q47L08l19l25Qk1l54l05L08Q66Q55M84J80q8n54j072j192p37j
51039G7131O55J041J042O27Q8p7K50O46P38P07R34J383J698J700J467J041M91
51022I1562R1R5L45N24O86J074J482J401Q40M44O16J028J257J324J325J083O08
$$ plain form
51005 105785 106264 107429 109734 112876 116355 119979 123644 127076 130175 133351 137066 141151 144990 148392
50991 148392 151946 156386 161798 167620 173324 178915 184794 191350 198914 207934 218826 231478 245192
50978 245192 259415 274398 290953 309715 330898 354496 380275 407683 436240 466074 497599
50967 497599 530636 564315 598004 631765 665576 698484 729022 756244 780009 800399 817282
50956 817282 830455 839855 845626 848174 848330 847282 846243 846025 846869 848626 851099 854191 857743 861426 864999
50941 864999 868406 871281 872443 870329 864055 853765 839931 822712 802066 777983 750423 719442
50929 719442 685676 650331 614438 578480 542931 508663 476373 446063 417603 391406 367962
50918 367962 347009 327857 310423 295240 282456 271484 261778 253378 246516 241131 236902 233349 229806
$$ packed form
51005A05785M79J165K305L142L479L624L665L432L099L176L715M085L839L402
50991A48392L554M440N412N822N704N591N879O556P564R020J0892J2652J3714
50978B45192J4223J4983J6555J8762K1183K3598K5779K7408K8557K9834L1525
50967D97599L3037L3679L3689L3761L3811L2908L0538K7222K3765K0390J6883
50956H17282J3173R400N771K548J56j048j039k18Q44J757K473L092L552L683L573
50941H64999L407K875J162k114o274j0290j3834j7219k0646k4083k7560l0981
50929G19442l3766l5345l5893l5958l5549l4268l2290l0310k8460k6197k3444
50918C67962k0953j9152j7434j5183j2784j0972r706q400o862n385m229l553l543
$$ plain form
50905 229806 225837 221949 219419 218973 219864 220576 220284 219381 218743 218837 219475 220205 220827 221504 222419 223491 224611
50888 224611 226057 228244 231035 233726 235936 238221 241497 246025 251200 256206 260688 264971 269842 275987
50874 275987 283410 291451 299539 307764 316530 325930 335934 347140 360784 377758 397942 420791 446355
50861 446355 475378 508506 545735 586733 631490 680470 734221 792958 856479 924341 996021
50850 996021 1070867 1147943 1226001 1303675 1379583 1452135 1519347 1579129 1629965 1671248 1702996
50839 1702996 1725500 1739323 1745286 1744200 1736935 1725202 1712025 1700794 1693720 1691542 1694596 1703397 1717850
50826 1717850 1736487 1756985 1777043 1794336 1806035 1809236 1802015 1783722 1754276 1713539 1661482 1598738
50814 1598738 1526953 1448568 1366004 1280815 1193894 1106745 1022165 943089 870916 805427 746149
$$ packed form
50905B29806l969l888k530m46Q91P12k92r03o38R4O38P30O22O77R15J072J120
50888B24611J446K187K791K691K210K285L276M528N175N006M482M283M871O145
50874B75987P423Q041Q088Q225Q766R400J0004J1206J3644J6974K0184K2849K5564
50861D46355K9023L3128L7229M0998M4757M8980N3751N8737O3521O7862P1680
50850I96021P4846P7076P8058P7674P5908P2552O7212N9782N0836M1283L1748
50839A702996K2504J3823N963j086p265j1733j3177j1231p074k178L054Q801J4453
50826A717850J8637K0498K0058J7293J1699L201p221j8293k9446m0737n2057o2744
50814A598738p1785p8385q2564q5189q6921q7149q4580p9076p2173o5489n9278
$$ plain form
50803 746149 693163 646693 606611 572529 543831 519565 498837 481530 468028 458043 450228 443298
50791 443298 436980 431603 427264 423894 421609 420411 419845 419516 419653 420552 421635 421748 420429 418295 416040
50776 416040 413472 409728 404130 396673 387904 378533 369041 359609 350390 341785 334253 327969 322796 318535
50762 318535 314989 311988 309591 308157 307940 308732 310213 312554 316289 321651 328416 336353 345364 355213 365744
50747 365744 377592 392089 410053 431009 453966 478567 505032 533394 563538 595852 631034
50736 631034 668989 708488 748246 787971 828028 868417 908481 947352 984197 1018024 1047649
50725 1047649 1071933 1089896 1100671 1103790 1099688 1089749 1075823 1059838 1043806 1029687 1018904 1012115
50713 1012115 1009579 1011509 1017826 1027810 1040329 1054292 1068639 1082007 1092698 1098923 1098879 1090861 1073801
$$ packed form
50803G46149n2986m6470m0082l4082k8698k4266k0728j7307j3502r985p815o930
50791D43298o318n377m339l370k285j198n66l29J37Q99J083J13j319k134k255
50776D16040k568l744n598p457q769r371r492r432r219q605p532o284n173m261
50762C18535l546l001k397j434k17P92J481K341L735N362O765P937R011R849J0531
50747C65744J1848J4497J7964K0956K2957K4601K6465K8362L0144L2314L5182
50736F31034L7955L9499L9758L9725M0057M0389M0064L8871L6845L3827K9625
50725A047649K4284J7963J0775L119m102r939j3926j5985j6032j4119j0783o789
50713A012115k536J930O317R984J2519J3963J4347J3368J0691O225m4q018j7060
$$ plain form
50700 1073801 1047774 1013660 972433 925213 873993 821641 770757 722754 678197 637636 601746
50689 601746 570933 545181 524190 507437 494248 484150 477109 473247 472457 474499 479291 486775 496601
50676 496601 508195 521031 534495 547511 558806 567731 574726 580843 586944 593268 599522 605322 610755
50663 610755 616539 623477 631748 641010 651163 662668 675965 690981 707499 725794 746544 770225
50651 770225 796947 826788 859859 895917 934184 973666 1013420 1052452 1089674 1124252 1155763
50640 1155763 1183732 1207137 1224783 1236182 1241738 1242026 1237234 1227387 1212736 1193705 1170770 1144691
50628 1144691 1116622 1087715 1058778 1030531 1003897 979641 958040 939408 924651 914644 909148
50617 909148 907149 908411 913836 923941 937682 953312 969748 986317 1001495 1012768 1017791 1015230
$$ packed form
50700A073801k6027l4114m1227m7220n1220n2352n0884m8003m4557m0561l5890
50689F01746l0813k5752k0991j6753j3189j0098p041l862p90K042M792P484R826
50676D96601J1594J2836J3464J3016J1295Q925O995O117O101O324O254N800N433
50663F10755N784O938Q271R262J0153J1505J3297J5016J6518J8295K0750K3681
50651G70225K6722K9841L3071L6058L8267L9482L9754L9032L7222L4578L1511
50640A155763K7969K3405J7646J1399N556K88m792r847j4651j9031k2935k6079
50628A144691k8069k8907k8937k8247k6634k4256k1601j8632j4757j0007n496
50617I09148j999J262N425J0105J3741J5630J6436J6569J5178J1273N023k561
$$ plain form
50605 1015230 1004694 986545 961831 931818 897393 859247 818641 777409 737014 697984 660444
50594 660444 624804 591696 561526 534366 510012 487990 467867 449882 434934 423540 414998 408024
50582 408024 402126 397895 395945 396041 397453 399776 403025 407173 412068 417829 424911 433577 443507 454132
50568 454132 465212 476804 488769 500566 511671 521993 531836 541577 551421 561309 570985 580264 589286
50555 589286 598369 607625 616958 626502 636803 648460 661854 677370 695600 717017 741671 769478
50543 769478 800664 835659 874777 918376 967251 1022493 1084864 1154469 1230915 1313542 1401596
50532 1401596 1494460 1591631 1692210 1794516 1896371 1995506 2089389 2175082 2249961 2312532 2361908
50521 2361908 2396583 2414506 2414568 2397257 2363576 2314073 2249527 2172091 2085116 1992089 1896169 1800309
$$ packed form
50605A015230j0536j8149k4714l0013l4425l8146m0606m1232m0395l9030l7540
50594F60444l5640l3108l0170k7160k4354k2022k0123j7985j4948j1394q542o974
50582D08024n898m231j950R6J412K323L249M148M895N761P082Q666R930J0625
50568D54132J1080J1592J1965J1797J1105J0322R843R741R844R888R676R279R022
50555E89286R083R256R333R544J0301J1657J3394J5516J8230K1417K4654K7807
50543G69478L1186L4995L9118M3599M8875N5242O2371O9605P6446Q2627Q8054
50532A401596R2864R7171J00579J02306J01855R9135R3883Q5693P4879O2571M9376
50521B361908L4675J7923O2j7311l3681m9503o4546p7436q6975r3027r5920r5860
$$ plain form
50509 1800309 1707105 1618567 1536498 1463046 1400343 1349651 1311254 1285117 1271264 1269531 1279519 1300903
50497 1300903 1333334 1375712 1425698 1479936 1534482 1584959 1626740 1655457 1667613 1661061 1635376
50486 1635376 1591949 1533535 1463499 1385464 1303269 1220475 1139450 1061217 986472 916509 852704
50475 852704 795347 743601 696670 654593 617670 585579 557477 532798 511467 493310 477653
50464 477653 463804 451756 442139 435443 431405 429208 428132 427912 428522 429798 431451 433395 435879 439083
50450 439083 442709 446187 449329 452541 456279 460482 464676 468432 471507 473779 475419 477072 479496 482926
50436 482926 487076 491840 497705 505249 514430 524580 535020 545640 557085 570461 586664 605782
50424 605782 627223 650593 676314 705322 738327 775588 817141 862826 912073 963984 1017702
$$ packed form
50509A800309r3204q8538q2069p3452o2703n0692l8397k6137j3853j733R988K1384
50497A300903L2431M2378M9986N4238N4546N0477M1781K8717J2156o552k5685
50486A635376m3427n8414p0036p8035q2195q2794q1025p8233p4745o9963o3805
50475H52704n7357n1746m6931m2077l6923l2091k8102k4679k1331j8157j5657
50464D77653j3849j2048r617o696m038k197j076k20O10J276J653J944K484L204
50450D39083L626L478L142L212L738M203M194L756L075K272J640J653K424L430
50436D82926M150M764N865P544R181J0150J0440J0620J1445J3376J6203J9118
50424F05782K1441K3370K5721K9008L3005L7261M1553M5685M9247N1911N3718
$$ plain form
50413 1017702 1072479 1127295 1180707 1231320 1278249 1320858 1358115 1388531 1410807 1424210 1428058
50402 1428058 1421167 1402364 1371738 1331025 1282536 1227990 1168684 1106462 1043898 983405 926494
50391 926494 873940 826235 783763 746951 716627 693998 679921 674134 675308 681910 693036 708629
50379 708629 728875 753151 779531 805474 828954 848548 862553 868808 865866 853947 834306 808065
50367 808065 776179 740243 702518 664990 628653 593649 559763 526923 495693 467214 442314
50356 442314 420713 401516 384319 369297 356395 345126 335249 326938 320130 314371 309573 306263 304659
50343 304659 304150 304169 305023 307223 310388 313546 316321 319169 322504 326185 329807 333057 335810 338314 341160
50328 341160 344565 347795 349907 351071 352491 354905 357739 359960 361150 361502 361364 361237 361709 362906 364306
$$ packed form
50413A017702N4777N4816N3412N0613M6929M2609L7257L0416K2276J3403L848
50402A428058o891j8803l0626m0713m8489n4546n9306o2222o2564o0493n6911
50391I26494n2554m7705m2472l6812l0324k2629j4077n787J174O602J1126J5593
50379G08629K0246K4276K6380K5943K3480J9594J4005O255k942j1919j9641k6241
50367H08065l1886l5936l7725l7528l6337l5004l3886l2840l1230k8479k4900
50356D42314k1601j9197j7197j5022j2902j1269r877q311o808n759m798l310j604
50343C04659n09J9Q54K200L165L158K775K848L335L681L622L250K753K504K846
50328C41160L405L230K112J164J420K414K834K221J190L52j38j27M72J197J400
$$ plain form
50313 364306 365570 367160 369675 372889 376048 378966 382207 386213 390767 395300 399268 402301 404499 406589
50299 406589 409192 411864 413428 413412 412553 411689 410770 409387 407645 405955 404353 402629 400776 398743 395992
50284 395992 392060 387466 383372 380290 377725 375183 372824 370816 368647 365577 361514 356958 352273 347422
50270 347422 342433 337787 334156 331771 330132 328526 326950 326297 327334 329648 332025 333833 335515 337649
50256 337649 340129 342565 344880 347077 348765 349521 349488 349104 348317 346592 343701 340101 336394 332734 328835
50241 328835 324371 319279 313812 308283 302752 297109 291502 286373 281855 277433 272584 267466 262560 257876
50227 257876 253063 248205 243814 239994 236215 232099 227904 223969 220210 216559 213526 211809 211514 212090 212953
50212 212953 213879 214847 215759 216352 216294 215445 214059 212624 211401 210263 208962 207345 205209 202242 198343 193844
$$ packed form
50313C64306J264J590K515L214L159K918L241M006M554M533L968L033K198K090
50299D06589K603K672J564j6q59q64r19j383j742j690j602j724j853k033k751
50284C95992l932m594m094l082k565k542k359k008k169l070m063m556m685m851
50270C47422m989m646l631k385j639j606j576o53J037K314K377J808J682K134
50256C37649K480K436K315K197J688P56l3l84p87j725k891l600l707l660l899
50241C28835m464n092n467n529n531n643n607n129m518m422m849n118m906m684
50227B57876m813m858m391l820l779m116m195l935l759l651l033j717k95N76Q63
50212B12953R26R68R12N93n8q49j386j435j223j138j301j617k136k967l899m499
$$ plain form
50196 193844 189246 184828 180648 176687 172839 168977 165202 161885 159211 156838 154250 151363 148592 146443
50182 146443 145235 145038 145593 146303 146554 146151 145372 144676 144422 144736 145392 145911 145963 145657 145408 145665 146812 149057
50164 149057 152150 155467 158732 162501 167590 174164 181786 190260 199918 211042 223492 237053 251722
50151 251722 267375 283473 299368 314667 329072 342133 353527 363529 372862 382115 391514 401254
50139 401254 411699 423012 434691 445698 455032 461985 465779 465373 460098 450489 437965 423550 407367
50126 407367 389753 372238 356584 343037 330355 317713 305845 296030 288688 283420 279825 277584
50114 277584 276045 274460 272634 270908 269640 269143 269947 272540 276749 281821 287163 292661 298313 304048 310015
50099 310015 316580 323768 331082 338127 345079 352197 359114 365005 369427 372702 375426 377805 379550 380336
$$ packed form
50196A93844m598m418m180l961l848l862l775l317k674k373k588k887k771k149
50182A46443j208j97N55P10K51m03p79o96k54L14O56N19N2l06k49K57J147K245
50164A49057L093L317L265L769N089O574P622Q474R658J1124J2450J3561J4669
50151B51722J5653J6098J5895J5299J4405J3061J1394J0002R333R253R399R740
50139D01254J0445J1313J1679J1007R334O953L794m06n275r609j2524j4415j6183
50126D07367j7614j7515j5654j3547j2682j2642j1868r815p342n268l595k241
50114B77584j539j585j826j726j268m97Q04K593M209N072N342N498N652N735N967
50099C10015O565P188P314P045O952P118O917N891M422L275K724K379J745P86
$$ plain form
50085 380336 380204 379402 377948 375596 372368 368813 365385 361788 357342 351964 346324 341086 336534 333007 331018
50070 331018 330570 330897 331355 332215 334121 337138 340887 345306 350633 356754 363184 369638 376047 382083 387338
50055 387338 392064 397032 402403 407304 410949 413687 416505 419777 422975 425447 427084 428337 429969 432749
50041 432749 437066 442765 449514 457367 466877 478676 492968 509332 526915 544851 562525 579391
50029 579391 594740 608075 619789 631045 642748 654943 667417 680387 694070 707807 720171
50018 720171 729875 736017 737522 733097 722184 705615 684922 661136 634572 605632 575380 545142
50006 545142 515700 487110 459235 432208 406286 381550 358141 336731 318294 303103 290283
49995 290283 278608 267580 257438 248321 239896 231780 223918 216448 209453 202980 197086 191795 187114
$$ packed form
50085C80336j32q02j454k352l228l555l428l597m446n378n640n238m552l527j989
50070C31018m48L27M58Q60J906L017L749M419N327O121O430O454O409O036N255
50055C87338M726M968N371M901L645K738K818L272L198K472J637J253J632K780
50041D32749M317N699O749P853R510J1799J4292J6364J7583J7936J7674J6866
50029E79391J5349J3335J1714J1256J1703J2195J2474J2970J3683J3737J2364
50018G20171R704O142J505m425j0913j6569k0693k3786k6564k8940l0252l0238
50006E45142k9442k8590k7875k7027k5922k4736k3409k1410j8437j5191j2820
49995B90283j1675j1028j0142r117q425q116p862p470o995o473n894n291m681
$$ plain form
49982 187114 183055 179501 176193 173101 170660 169267 168573 167643 165861 163311 160284 156879 153256 149849 147051
49967 147051 144982 143747 143506 144000 144368 143820 142302 140178 137614 134733 132145 130651 130384 130687 130922 130986
49951 130986 130945 130657 130034 129360 129023 129054 129148 129066 128878 128910 129523 130787 132227 133038 132799 131994 131651 132483 134448
49932 134448 137085 140058 143315 146844 150428 153706 156464 158845 161275 164160 167731 172156 177701 184676
49918 184676 193287 203673 216031 230511 246876 264388 282113 299264 315199 329308 341132 350616
49906 350616 358086 364100 369431 375063 381765 389567 397903 406285 414460 421680 426279 426469 421449 411452
49892 411452 396979 378563 357286 334823 312589 291094 270381 250795 232998 217425 204088
49881 204088 192866 183637 176064 169521 163461 157810 152900 149018 146074 143740 141762 140064 138567 137167
$$ packed form
49982A87114m059l554l308l092k441j393o94r30j782k550l027l405l623l407k798
49967A47051k069j235k41M94L68n48j518k124k564k881k588j494k67L03K35O4
49951A30986m1k88o23o74l37L1R4q2j88L2O13J264J440Q11k39q05l43Q32J965
49932A34448K637K973L257L529L584L278K758K381K430K885L571M425N545O975
49918A84676Q611J0386J2358J4480J6365J7512J7725J7151J5935J4109J1824R484
49906C50616P470O014N331N632O702P802Q336Q382Q175P220M599J90n020r997
49892D11452j4473j8416k1277k2463k2234k1495k0713j9586j7797j5573j3337
49881B04088j1222r229p573o543o060n651m910l882k944k334j978j698j497j400
$$ plain form
49867 137167 135956 135241 135137 135283 135206 134854 134498 134215 133849 133490 133507 133977 134435 134450 134187 134174 134683 135548 136397 136875
49847 136875 136830 136448 136067 135699 134987 133736 132225 130738 129151 127318 125578 124375 123495 122209 120228 118180
49831 118180 117018 117178 118318 119653 120491 120680 120581 120565 120664 120820 121179 121831 122504 122942 123384 124191 125103 125483 125290
49812 125290 125178 125500 125835 125780 125576 125496 125121 123874 121983 120304 119219 118241 116779 114906 113269 112462 112545
49795 112545 113008 113216 113033 112940 113347 113940 113963 113086 111667 110207 108921 107911 107364 107361 107720 108269 109134 110514
49777 110514 112257 113865 114956 115596 116166 116918 117657 117882 117325 116408 116035 116798 118460 120280 121699 122591 122995
49760 122995 122993 122926 123389 124663 126216 127045 126659 125559 124719 124678 125217 125726 125716 125106 124278 123888 124429 125853 127648
49741 127648 129285 130453 130946 130646 129803 129075 129015 129551 130183 130573 130705 130607 130283 129935 129868 130087 130331 130632 131437
$$ packed form
49867A37167j211p15j04J46p7l52l56k83l66l59J7M70M58J5k63j3N09Q65Q49M78
49847A36875m5l82l81l68p12j251j511j487j587j833j740j203q80j286j981k048
49831A18180j162J60J140J335Q38J89r9j6R9J56L59O52O73M38M42Q07R12L80j93
49812A25290j12L22L35n5k04q0l75j247j891j679j085r78j462j873j637q07Q3
49795A12545M63K08j83r3M07N93K3q77j419j460j286j010n47lL59N49Q65J380
49777A10514J743J608J091O40N70P52P39K25n57r17l73P63J662J820J419Q92M04
49760A22995ko7M63J274J553Q29l86j100q40m1N39N09j0o10q28l90N41J424J795
49741A27648J637J168M93l00q43p28o0N36O32L90J32r8l24l48o7K19K44L01Q05
$$ plain form
49722 131437 132844 134161 134702 134784 135332 136538 137550 137677 137293 137226 137680 138219 138580 138982 139666 140496 141068 141060 140449
49703 140449 139590 138968 138710 138441 137768 136756 135726 134801 133990 133509 133586 133981 134145 133903 133619 133702 134268 135224 136248
49684 136248 136738 136355 135679 135721 136596 137360 137405 137291 137709 138296 138181 137207 135887 134565 133424 132984 133642 134768
49666 134768 135243 134965 134899 135368 135267 133485 130446 127612 125959 125519 125957 126879 127737 128097 128051 128043 128347 128954 129799
49647 129799 130699 131207 130944 130093 129223 128660 128339 128141 127997 127663 126866 125807 125104 124990 124947 124437 123703 123424 123757
49628 123757 124222 124542 125056 126021 126908 126951 126216 125592 125655 126051 126230 126293 126595 126890 126577 125739 125258 125728 126857
49609 126857 128188 129809 131835 133649 134371 133948 133197 132803 132839 133319 134577 136741 139238 141245 142430 142945
49593 142945 142910 142349 141624 141435 142170 143454 144603 145416 146315 147758 149761 152073 154559 157197 159803 162076
$$ packed form
49722A31437J407J317N41Q2N48J206J012J27l84o7M54N39L61M02O84Q30N72qo11
49703A40449q59o22k58k69o73j012j030r25q11m81P7L95J64k42k84Q3N66R56J024
49684A36248M90l83o76M2Q75P64M5j14M18N87j15r74j320j322j141m40O58J126
49666A34768M75k78o6M69j01j782l039k834j653m40M38R22Q58L60m6qL04O07Q45
49647A29799R00N08k63q51q70n63l21j98j44l34p97j059p03j14m3n10p34k79L33
49628A23757M65L20N14R65Q87M3p35o24O3L96J79O3L02K95l13q38m81M70J129
49609A26857J331J621K026J814P22m23p51l94L6M80J258K164K497K007J185N15
49593A42945l5n61p25j89P35J284J149Q13Q99J443K003K312K486K638K606K273
$$ plain form
49577 162076 163952 165767 167881 170237 172413 174138 175645 177486 179998 183027 186225 189539 193226 197356
49563 197356 201616 205833 210469 216134 222566 228580 233276 236984 240657 244611 248361 251597 254805 258699
49549 258699 263364 268162 272326 275438 277523 278944 280185 281472 282565 283041 282794 282079 281087 279757 278197
49534 278197 277042 276985 277958 279135 279880 280396 281263 282594 283954 284920 285363 285295 284912 284849 285996 288773 292779
49517 292779 297318 302149 307546 313814 320927 328542 336226 343691 350874 357691 363722 368383 371524 373664
49503 373664 375447 377013 378029 378095 376913 374251 370144 365102 359837 354673 349451 343954 338242 332509 326856
49488 326856 321306 315842 310272 304148 297055 289076 280924 273535 267421 262388 257776 252967 247680 242001
49474 242001 236329 231240 227131 223888 221011 218131 215302 212774 210626 208672 206535 203851 200663 197666
$$ packed form
49577A62076J876J815K114K356K176J725J507J841K512L029L198L314L687M130
49563A97356M260M217M636N665O432O014M696L708L673L954L750L236L208L894
49549B58699M665M798M164L112K085J421J241J287J093M76k47p15r92j330j560
49534B78197j155n7R73J177P45N16Q67J331J360R66M43o8l83o3J147K777M006
49517B92779M539M831N397O268P113P615P684P465P183O817O031M661L141K140
49503C73664J783J566J016O6j182k662m107n042n265n164n222n497n712n733n653
49488C26856n550n464n570o124p093p979q152p389o114n033m612m809n287n679
49474B42001n672n089m109l243k877k880k829k528k148j954k137k684l188k997
$$ plain form
49460 197666 195716 194909 194468 193732 192911 192541 192502 192128 191089 189706 188393 187283 186441 186022 186011 186137 186192 186215
49442 186215 186248 186187 186024 186032 186531 187625 189299 191625 194767 198882 204136 210674 218394 226736 234727 241211
49426 241211 245150 245995 243931 239751 234493 229151 224540 221136 218976 217840 217573 218144 219553 221906 225410
49411 225410 229954 234807 239234 243500 248767 255711 263713 271726 279496 287392 295365 302868 309851 317131
49397 317131 325366 334029 341865 348277 353898 359737 366061 372220 377350 381032 383341 384574 385006 384776 383897
49382 383897 382446 380817 379555 378723 377587 375218 371457 367061 362872 359071 355317 351372 347389 343719
49368 343719 340551 337742 334917 331808 328578 325770 323951 323343 323591 323733 322610 319788 316144 313225 311844
49353 311844 311499 311256 310881 310934 311942 313769 315800 317591 319332 321617 324680 328023 331107 334189 338070
$$ packed form
49460A97666j950q07m41p36q21l70l9l74j039j383j313j110q42m19j1J26N5K3
49442A86215L3o1j63QM99J094J674K326L142M115N254O538P720Q342P991O484
49426B41211L939Q45k064m180n258n342m611l404k160j136k67N71J409K353L504
49411B25410M544M853M427M266N267O944Q002Q013P770P896P973P503O983P280
49397C17131Q235Q663P836O412N621N839O324O159N130L682K309J233M32k30q79
49382C83897j451j629j262q32j136k369l761m396m189l801l754l945l983l670
49368C43719l168k809k825l109l230k808j819o08K48J42j123k822l644k919j381
49353C11844l45k43l75N3J008J827K031J791J741K285L063L343L084L082L881
$$ plain form
49338 338070 343018 348520 354136 359923 365764 371050 375614 380310 385940 392004 397390 402047 407042 412992
49324 412992 419330 425272 430712 435874 440848 445834 451234 457007 462416 466919 470902 475055 479350 483147
49310 483147 485985 487771 488423 487936 486725 485410 484237 483066 481849 480673 479423 477923 476447 475558 475339
49295 475339 475291 475230 475768 477485 479960 482166 483719 485313 487903 491839 496865 502692 509248 516510 524269
$$ packed form
49338C38070M948N502N616N787N841N286M564M696N630O064N386M657M995N950
49324D12992O338N942N440N162M974M986N400N773N409M503L983M153M295L797
49310D83147K838J786O52m87j211j315j173j171j217j176j250j500j476q89k19
49295D75339m8o1N38J717K475K206J553J594K590L936N026N827O556P262P759
$$ [...]
##END NTUPLES=NMR SPECTRUM
##END=
