##TITLE=NES1008_LH_9233092_lStpFqmLiy
##JCAMPDX= 6.0         $$ Bruker NMR JCAMP-DX V2.0
##DATA TYPE= NMR SPECTRUM
##DATA CLASS= NTUPLES
##ORIGIN= BRUKER
##OWNER= Administrator
$$ 1.72 TOPSPIN		Version 2.1
$$ 2015-06-17 20:02:16.300 -0700  Administrator@X
$$ Compression mode = diff/dup
##.OBSERVE FREQUENCY= 400.02188249412
##.OBSERVE NUCLEUS= ^1H
##.ACQUISITION MODE= SIMULTANEOUS (DQD)
##.ACQUISITION SCHEME= undefined
##.AVERAGES= 64
##.DIGITISER RES= 22
##SPECTROMETER/DATA SYSTEM= spect
##.PULSE SEQUENCE= noesygpps1d.comp
##.SOLVENT NAME= COFFEE_meoh
##.SHIFT REFERENCE= INTERNAL, COFFEE_meoh, 1, 14.96334
##AUDIT TRAIL= $$ (NUMBER, WHEN, WHO, WHERE, PROCESS, VERSION, WHAT)
$$ ##TITLE= Audit trail, TOPSPIN		Version 2.1
$$ ##JCAMPDX= 5.01
$$ ##ORIGIN= Bruker BioSpin GmbH
$$ ##OWNER= Administrator
$$ $$ E:\/data/COFFEE/nmr/NES1008_LH_9233092_lStpFqmLiy/12/pdata/1/auditp.txt
$$ ##AUDIT TRAIL=  $$ (NUMBER, WHEN, WHO, WHERE, PROCESS, VERSION, WHAT)
(   1,<2015-06-17 20:02:11.066 -0700>,<Administrator>,<X>,<go>,<TOPSPIN 2.1>,
      <created by zg
	started at 2015-06-17 19:50:40.737 -0700,
	POWCHK enabled, PULCHK disabled,
       configuration hash MD5:
       21 0F 79 D6 B3 7B B4 F6 88 20 88 DB 03 48 BD 9F
       data hash MD5: 64K
       0F 8A E0 CC B5 53 1C 46 10 31 87 36 8F 75 B9 47>)
(   2,<2015-06-17 20:02:14.237 -0700>,<Administrator>,<X>,<proc1d>,<TOPSPIN 2.1>,
      <Start of raw data processing
       efp LB = 0.3 FT_mod = 6 PKNL = 1 PHC0 = 0 PHC1 = 0 SI = 128K 
       data hash MD5: 128K
       48 AF C2 B5 05 FF 25 87 8B 19 28 C7 AE 80 7D 64>)
(   3,<2015-06-17 20:02:15.112 -0700>,<Administrator>,<X>,<proc1d>,<TOPSPIN 2.1>,
      <pk PHC0 = -83.94653 PHC1 = 0 
       data hash MD5: 128K
       31 02 61 47 E7 A4 48 A6 17 08 AD 2F 08 CD ED 4A>)
(   4,<2015-06-17 20:02:15.472 -0700>,<Administrator>,<X>,<proc1d>,<TOPSPIN 2.1>,
      <abs ABSG = 1 
       data hash MD5: 128K
       45 40 82 F0 70 46 67 4A 61 C6 8D 4B 13 2A 52 5F>)
(   5,<2015-06-17 20:02:15.581 -0700>,<Administrator>,<X>,<proc1d>,<TOPSPIN 2.1>,
      <abs ABSG = 2 
       data hash MD5: 128K
       47 F9 C7 19 C9 BD 60 F2 9B E3 21 04 66 B7 98 7E>)
(   6,<2015-06-17 20:02:15.659 -0700>,<Administrator>,<X>,<proc1d>,<TOPSPIN 2.1>,
      <abs ABSG = 3 
       data hash MD5: 128K
       01 E9 F6 0B 31 6D 84 DE 6C 45 EA 4E 63 DE 44 D4>)
(   7,<2015-06-17 20:02:15.769 -0700>,<Administrator>,<X>,<proc1d>,<TOPSPIN 2.1>,
      <abs ABSG = 4 
       data hash MD5: 128K
       C1 49 E5 2C DD 12 7C 38 CC C6 EB CB 11 1F BD 15>)
(   8,<2015-06-17 20:02:15.847 -0700>,<Administrator>,<X>,<proc1d>,<TOPSPIN 2.1>,
      <abs ABSG = 5 
       data hash MD5: 128K
       0B 99 52 89 B4 47 E7 23 3C 45 B9 C4 22 C7 7C 78>)
$$ ##END=
$$ 
$$ $$ hash MD5
$$ $$ 2B A7 9A FB 97 3A 85 12 47 B5 E2 C9 E3 C0 21 08
##$RELAX= 
##$RELAX= 
##$RELAX= 
##$RELAX= 
##$RELAX= 
##$RELAX= 
##$RELAX= 
##$RELAX= 
$$ Bruker specific parameters
$$ --------------------------
##$DU= <E:\>
##$EXPNO= 12
$$ [...]
##$TP07= 0
##$TPNAME0= <>
##$TPNAME1= <>
##$TPNAME2= <>
##$TPNAME3= <>
##$TPNAME4= <>
##$TPNAME5= <>
##$TPNAME6= <>
##$TPNAME7= <>
##$TPOAL= (0..7)
0.5 0.5 0.5 0.5 0.5 0.5 0.5 0.5
##$TPOFFS= (0..7)
0 0 0 0 0 0 0 0
##$TUNHIN= 0
##$TUNHOUT= 0
##$TUNXOUT= 0
##$USERA1= <user>
##$USERA2= <user>
##$USERA3= <user>
##$USERA4= <user>
##$USERA5= <user>
##$V9= 5
##$VALIST= <valist>
##$VCLIST= <CCCCCCCCCCCCCCC>
##$VD= 0
##$VDLIST= <DDDDDDDDDDDDDDD>
##$VPLIST= <PPPPPPPPPPPPPPP>
##$VTLIST= <TTTTTTTTTTTTTTT>
##$WBST= 2048
##$WBSW= 25
##$XGAIN= (0..3)
0 0 0 0
##$XL= 0
##$YL= 0
##$YMAX_a= 7048599
##$YMIN_a= -14958154
##$ZGOPTNS= <>
##$ZL1= 120
##$ZL2= 120
##$ZL3= 120
##$ZL4= 120
##$ABSF1= 14.96334
##$ABSF2= -5.594842
##$ABSG= 5
##$ABSL= 3
##$ALPHA= 0
##$AQORDER= 0
##$ASSFAC= 0
##$ASSFACI= 0
##$ASSFACX= 0
##$ASSWID= 0
##$AUNMP= <proc_prof1d_extract.lims>
##$AXLEFT= 0
##$AXNAME= <>
##$AXNUC= <1H>
##$AXRIGHT= 0
##$AXTYPE= 0
##$AXUNIT= <>
##$AZFE= 0.1
##$AZFW= 0.1
##$BCFW= 0
##$BC_mod= 0
##$BYTORDP= 0
##$COROFFS= 0
##$CY= 15
##$DATMOD= 1
##$DC= 0
##$DFILT= <>
##$DTYPP= 0
##$F1P= 0
##$F2P= 0
##$FCOR= 0.5
##$FTSIZE= 131072
##$FT_mod= 6
##$GAMMA= 0
##$GB= 0
##$INTBC= 1
##$INTSCL= 1
##$ISEN= 128
##$LB= 0.3
##$LEV0= 0
##$LPBIN= 0
##$MAXI= 10000
##$MC2= 0
##$MEAN= 0
##$ME_mod= 0
##$MI= 0
##$NCOEF= 0
##$NC_proc= -2
##$NLEV= 6
##$NOISF1= 0
##$NOISF2= 0
##$NSP= 0
##$NTH_PI= 0
##$NZP= 0
##$OFFSET= 14.96334
##$PC= 1
##$PHC0= -83.94653
##$PHC1= 0
##$PH_mod= 1
##$PKNL= yes
##$PPARMOD= 0
##$PPDIAG= 0
##$PPIPTYP= 0
##$PPMPNUM= 2147483647
##$PPRESOL= 1
##$PSCAL= 4
##$PSIGN= 0
##$PYNMP= <proc.py>
##$REVERSE= no
##$SF= 400.02000870051
##$SI= 131072
##$SIGF1= 0
##$SIGF2= 0
##$SINO= 400
##$SIOLD= 131072
##$SPECTYP= <>
##$SREGLST= <1H.CDCl3>
##$SSB= 0
##$STSI= 131072
##$STSR= 0
##$SW_p= 8223.68421052631
##$SYMM= 0
##$S_DEV= 0
##$TDeff= 65536
##$TDoff= 0
##$TI= <>
##$TILT= no
##$TM1= 0
##$TM2= 0
##$TOPLEV= 0
##$USERP1= <user>
##$USERP2= <user>
##$USERP3= <user>
##$USERP4= <user>
##$USERP5= <user>
##$WDW= 1
##$XDIM= 131072
##$YMAX_p= 433653857
##$YMIN_p= -11809
##$CURPLOT= <Network HP LaserJet P1505>
##$CURPRIN= <$Network HP LaserJet P1505>
##$DFORMAT= <normdp>
##$LAYOUT= <+/1D_H.xwp>
##$LFORMAT= <normlp>
##$PFORMAT= <normpl>
##$SURQMSG= 1
$$ End of Bruker specific parameters
$$ ---------------------------------
##NTUPLES= NMR SPECTRUM
##VAR_NAME=  FREQUENCY,     SPECTRUM/REAL,   SPECTRUM/IMAG
##SYMBOL=    X,             R,               I
##VAR_TYPE=  INDEPENDENT,   DEPENDENT,       DEPENDENT
##VAR_FORM=  AFFN,          ASDF,            ASDF
##VAR_DIM=   131072,        131072,          131072
##UNITS=     HZ,            ARBITRARY UNITS, ARBITRARY UNITS
##FACTOR=    0.0627417313425164, 1,          1
##FIRST=     8223.62146879497, -435,         -43512
##LAST=      0,             731,             -44341
##MIN=       0,             -11809,          0
##MAX=       8223.62146879497, 433653857,    0
$$ Real data points
##PAGE= N=1
##DATA TABLE= (X++(R..R)), XYDATA
$$ [...]
63270B93724N16O49J218K089K593K331J647J105Q25O01M74P42J449K145K325J963
63254C16396J482J283J412J692K026K448K908L193L231L249L500L895M225M637
63240C55577N542O913Q096Q551Q587R055J0401J2250J3873J4831J5254J5634J6320
63227E00884J7067J7238J6610J5794J5539J5744J5523J4337J2701J1700J1912
63216F65049J2990J4100J4701J4873J4996J5188J5275J5161J4845J3884J1341
63205H22403O821J254l867p972j1569j5112j8394k1140k3403k5117k5811k5239
63193F52854k3808k2039j9899j7163j4060j1135q659o519m507k422j14K225M060
63180E28814N151N995P238Q848J0289J1278J1986J2522J2754J2642J2416J2367
$$ y = [293724, 294240, 294889, 296107, 298196, 300789, 303120, 304767, 305872, 306697, 307298, 307772, 308514, 309963, 312108, 314433, 316396, 317878, 319161, 320573, 322265, 324291, 326739, 329647, 332840, 336071, 339320, 342820, 346715, 350940, 355577, 361119, 368032, 376128, 384679, 393266, 402321, 412722, 424972, 438845, 453676, 468930, 484564, 500884, 517951, 535189, 551799, 567593, 583132, 598876, 614399, 628736, 641437, 653137, 665049, 678039, 692139, 706840, 721713, 736709, 751897, 767172, 782333, 797178, 811062, 822403, 829224, 830478, 826611, 818639, 807070, 791958, 773564, 752424, 729021, 703904, 678093, 652854, 629046, 607007, 587108, 569945, 555885, 544750, 536091, 529572, 525065, 522643, 522529, 524754, 528814, 533965, 539960, 547198, 556046, 566335, 577613, 589599, 602121, 614875, 627517, 639933, 652300]
63168F52300J2642J3190J3661J3582J2875J2044J1477J0826R517P609N593L444
63156G78760N89l148p196j0958j4269j6974j8607j8975j8609j8247j8078j7746
63144F16542j6912j5518j3736j1912j0450r518q914q312p535o518n248l839k535
63131D95595j538q75m46J8Q97K239L414L614K826J954J830K427L221L897M455
63116E23528M935N322N536N309M379L027K087K118K792L383L547L338K780J949
63102E74030J235J003J036P57L7o41q07m90j7K92K07k88p95p29N6J045J630J718
63084E79279J644J622J558J424J580K505M120N556N847M880L498K597K426K800
63070F21336L638M869O084O785P071P614Q843J0385J1503J1915J2021J2457J3523
$$ y = [652300, 664942, 678132, 691793, 705375, 718250, 730294, 741771, 752597, 762114, 769723, 775316, 778760, 779349, 776201, 769005, 758047, 743778, 726804, 708197, 689222, 670613, 652366, 634288, 616542, 599630, 584112, 570376, 558464, 548014, 538496, 529582, 521270, 513735, 507217, 501969, 498130, 495595, 494057, 493182, 492736, 492754, 493651, 495890, 499304, 502918, 505744, 507698, 509528, 511955, 515176, 519073, 523528, 528463, 533785, 539321, 544630, 549009, 552036, 554123, 556241, 559033, 562416, 565963, 569301, 572081, 574030, 575265, 576268, 577304, 578061, 578098, 577457, 576650, 576160, 576143, 576435, 576642, 576354, 575559, 574830, 574886, 575931, 577561, 579279, 580923, 582545, 584103, 585527, 587107, 589612, 593732, 599288, 605135, 610015, 613513, 616110, 618536, 621336, 624974, 629843, 635927, 642712, 649783, 657397, 666240, 676625, 688128, 700043, 712064, 724521, 738044]
63057G38044J4986J6409J7655J9077K0990K3150K4959K6281K7704K9825L2464
63046I91544L4797L6205L6778L7029L7346L7717L7891L7668L7075L6314L5579
63035A395943L4965L4472L4119L4017L4320L4984L5503L5098L3361L0707K7757
63024A765246K4296J9190J1666K407o965j5413k3119l0586l7663m3654m8127n1174
63012A566104n2959n3378n2280m9798m6312m2144l7479l2568k7771k3335j9130
63001A128950j4849j0418o127k251J273M633P745J0325J2279J3770J4852J5415
62989A175597J5621J5970J6647J7146J6894J6029J5145J4443J3640J2603J1490
62978A341225J0178Q073M737K74n024j1014j7379k3388k8389l2294l5430l8024
$$ y = [738044, 753030, 769439, 787094, 806171, 827161, 850311, 875270, 901551, 929255, 959080, 991544, 1026341, 1062546, 1099324, 1136353, 1173699, 1211416, 1249307, 1286975, 1324050, 1360364, 1395943, 1430908, 1465380, 1499499, 1533516, 1567836, 1602820, 1638323, 1673421, 1706782, 1737489, 1765246, 1789542, 1808732, 1820398, 1822805, 1815840, 1800427, 1777308, 1746722, 1709059, 1665405, 1617278, 1566104, 1513145, 1459767, 1407487, 1357689, 1311377, 1269233, 1231754, 1199186, 1171415, 1148080, 1128950, 1114101, 1103683, 1097556, 1095305, 1096578, 1101211, 1108956, 1119281, 1131560, 1145330, 1160182, 1175597, 1191218, 1207188, 1223835, 1240981, 1257875, 1273904, 1289049, 1303492, 1317132, 1329735, 1341225, 1351403, 1359476, 1364213, 1364487, 1359463, 1348449, 1331070, 1307682, 1279293, 1246999, 1211569, 1173545]
62966A173545m0077m1474m2000m1499m0057l7913l5165l1976k8994k6885k5307
62955G82198k3162k0275j7904j6990j6668j5575j3909j2937j2753j2025j0144
62944F09856q211p430p522p436o894o419o358o537o622o421n967n610n744o212
62930E16473o366n885n085m248l262k299k147l227m676n137m334l249k837l091
62916D60630l378l223k701k236k079j988j526q01m45o82q76l69N09Q16J24j155
62900D40620k389l212l524l501l548l893m295m491m629m870m818m039k978k603
62886C87830l001l166k394j291q77j246j675j702j504j258q11p8O19Q97P16K97
62870C71356j71n18n03m7N06P15O28P00J030J099O00Q3L31J271K066K194J946
$$ y = [1173545, 1133468, 1091994, 1049994, 1008495, 968438, 930525, 895360, 863384, 834390, 807505, 782198, 759036, 738761, 720857, 703867, 687199, 671624, 657715, 644778, 632025, 620000, 609856, 601645, 594215, 586693, 579257, 572363, 565944, 559586, 553049, 546427, 540006, 534039, 528429, 522685, 516473, 510107, 504222, 499137, 494889, 491627, 489328, 487181, 483954, 479278, 474141, 469807, 466558, 463721, 460630, 457252, 454029, 451328, 449092, 447013, 445025, 443499, 442698, 442253, 441571, 440695, 440326, 440835, 441651, 441775, 440620, 438231, 435019, 431495, 427994, 424446, 420553, 416258, 411767, 407138, 402268, 397450, 393411, 390433, 387830, 384829, 381663, 379269, 377978, 377101, 375855, 374180, 372478, 370974, 369716, 368905, 368827, 369446, 370343, 371059, 371356, 371185, 370667, 370164, 370117, 370623, 371338, 371966, 372666, 373696, 374795, 375395, 375478, 375809, 377080, 379146, 381340, 383286]
62853C83286J826K003K405K864L017K618K055K080K747L252L032K495K157J778
62839D17615R24m8m46l72n82j267j740j520j062j069j582k016j953j518j100q44
62823D01420n84k04P6Nj64J07Q01J198Q60L09K97P83J151J170J121J135J051Q96
62805D11428R60J326J755K093K402K665K784K877L227L840M422M814N157N641
62791D55391O411P701R622J1867J3910J5619J7319J9320K1671K4356K7378L0652
62779F61217L4174L8171M2672M7185N1214N5020N9216O3661O7429O9872P1029
62768A260860P0844O8746O4344N7950N0007M0613K9955J8673P200m669j6976k8687
62756A618860l8409m5853n1944n7384o1765o4361o5237o5147o4490o2867n9759
$$ y = [383286, 385112, 387115, 389520, 392384, 395401, 398019, 400074, 402154, 404901, 408153, 411185, 413680, 415837, 417615, 418539, 418491, 418045, 417673, 417091, 415824, 414084, 412564, 411502, 410433, 408851, 406835, 404882, 403364, 402264, 401420, 400836, 400632, 400708, 400713, 400549, 400656, 401457, 402655, 403515, 403824, 404121, 404904, 406055, 407225, 408346, 409481, 410532, 411428, 412388, 413714, 415469, 417562, 419964, 422629, 425413, 428290, 431517, 435357, 439779, 444593, 449750, 455391, 461802, 469503, 479125, 490992, 504902, 520521, 537840, 557160, 578831, 603187, 630565, 661217, 695391, 733562, 776234, 823419, 874633, 929653, 988869, 1052530, 1119959, 1189831, 1260860, 1331704, 1400450, 1464794, 1522744, 1572751, 1613364, 1643319, 1661992, 1669192, 1664523, 1647547, 1618860, 1580451, 1534598, 1482654, 1425270, 1363505, 1299144, 1233907, 1168760, 1104270, 1041403, 981644]
62745I81644n5422n0860m6985m3995m1561l9304l6892l4023l0703k7415k4715
62734E49769k2603k0639j8562j6523j4716j3148j1807j0691r684q626p612o855
62722C88303o268n484m368l147k048j091l06K39P34J556K728L763M228M250M341
62707C87430M926O132P773R480J0996J2439J4081J6006J8256K1110K4653K8251
62695E61533L1047L3059L5151L7818M0632M3046M4960M6129M5765M3372L9549
62684A002061L5285L0717K5196J8349J0607K687n012j2525k0008k7253l3428l7622
62672I89054l9783m0772m1284m1173m0144l8565l6979l5226l2772k9749k6974
62661E85633k4866k2972k0804j8623j7095j6438j6137j5432j3918j1728r338p260
$$ y = [981644, 926222, 875362, 828377, 784382, 742821, 703517, 666625, 632602, 601899, 574484, 549769, 527166, 506527, 487965, 471442, 456726, 443578, 431771, 421080, 411396, 402770, 395158, 388303, 382035, 376551, 372183, 369036, 366988, 365897, 365591, 365830, 366564, 368120, 370848, 374611, 378839, 383089, 387430, 392356, 398488, 406261, 415741, 426737, 439176, 453257, 469263, 487519, 508629, 533282, 561533, 592580, 625639, 660790, 698608, 739240, 782286, 827246, 873375, 919140, 962512, 1002061, 1037346, 1068063, 1093259, 1111608, 1122215, 1124902, 1119890, 1107365, 1087357, 1060104, 1026676, 989054, 949271, 908499, 867215, 826042, 785898, 747333, 710354, 675128, 642356, 612607, 585633, 560767, 537795, 516991, 498368, 481273, 464835, 448698, 433266, 419348, 407620, 398282, 391022]
62649C91022n888n380n554n892n917n608n283n102m937m669m316l845l230k725
62635C22676k701l120l533l690l712l621l214k557k040j705j117k37K49q9o50
62620B90939o88l97m28o92m67M78J578K291K546K447K168K173K946M340N637O403
62604C21274O907P597Q473R184R548R865J0655J2142J3970J5739J7660K0244K3315
62591D86573K5976K7843K9660L2143L4828L6636L7076L6200L3993L0593K6701
62580H38222K2804J8350J2692O423P28m344r661j5185j9792k3104k6009k8870
62568G72254l0623l0455k9232k8242k7478k6210k4508k3073k1980k0741j9351
62557D90361j8278j7489j6414j4918j3488j2456j1711j1251j1241j1403j0982
$$ y = [391022, 385134, 379754, 374200, 368308, 362391, 356783, 351500, 346398, 341461, 336792, 332476, 328631, 325401, 322676, 319975, 316855, 313322, 309632, 305920, 302299, 299085, 296528, 294488, 292783, 291666, 291429, 291678, 291589, 290939, 290251, 289854, 289426, 288734, 288267, 288745, 290323, 292614, 295160, 297607, 299775, 301948, 304894, 309234, 314871, 321274, 328181, 335778, 344251, 353435, 362983, 372848, 383503, 395645, 409615, 425354, 443014, 463258, 486573, 512549, 540392, 570052, 602195, 637023, 673659, 710735, 746935, 780928, 811521, 838222, 861026, 879376, 892068, 898491, 899219, 894875, 885214, 870029, 850237, 827133, 801124, 772254, 741631, 711176, 681944, 653702, 626224, 600014, 575506, 552433, 530453, 509712, 490361, 472083, 454594, 438180, 423262, 409774, 397318, 385607, 374356, 363115, 351712, 340730]
62546C40730r668q061o938o436o219o059n917n600m795l519k334j876k062k001
62532B69245r35P75K003K277K343L043M154M864M964M926N011N087N260N908O904
62517C25829P525P497P633Q939J1475J4428J7063J9193K0935K2370K3502K4275
62505E10664K4663K4673K4176K2841K0525J7731J5121J2460Q667L311k485p228
62493F75119j0715j3816j6905j9353k0585k0784k0440j9851j9257j8756j7866
62482D76791j5871j3049j0846j0219j0413j0018q786p579o810n916m469k932j997
62469C67886j704j520j001j44P09J206J417J862K796L684L844L470L447M046M581
62454C94579M506M207M291M644M667M093L078J774K18j513l291m964o310p196
$$ y = [340730, 331062, 323001, 316063, 309627, 303408, 297349, 291432, 285832, 281037, 277518, 275184, 273308, 271246, 269245, 268310, 269085, 271088, 273365, 275708, 278751, 282905, 287769, 292733, 297659, 302670, 307757, 313017, 318925, 325829, 333354, 340851, 348484, 357423, 368898, 383326, 400389, 419582, 440517, 462887, 486389, 510664, 535327, 560000, 584176, 607017, 627542, 645273, 660394, 672854, 681521, 684832, 682347, 675119, 664404, 650588, 633683, 614330, 593745, 572961, 552521, 532670, 513413, 494657, 476791, 460920, 447871, 437025, 426806, 416393, 406375, 397589, 390010, 383200, 377284, 372815, 369883, 367886, 366182, 364662, 363661, 363517, 364226, 365432, 366849, 368711, 371507, 375191, 379035, 382505, 385952, 389998, 394579, 399085, 403292, 407583, 412227, 416894, 420987, 424065, 425839, 426057, 424544, 421253, 416289, 409979, 402783]
62440D02783p848q574r138q997q273p723p489o640m645k475j482j701k139k215
62426C23444j987j281K00J992L180L632M009M475M442L845L583M261N388O228
62412C65411O709O922O556N468M219L376K764K029J369J060O92k56j480k212k335
62397D00292k336k350k108j808k135l180m080l966k851j332J1P58Q23Q07J685
62382C78230L666N763O974P525Q454J0209J2324J4326J6334J8582K0955K3279
62370E26621K5701K8404L1125L3264L4481L4961L5183L5431L5447L4465L1776
62359H86859K7363K1872J5871R478K845l383q512j2441j5431j7478j8498j9019
62347H69526j9986k1725k3692k5342k6588k7154k6367k4102k1350j9179j7547
$$ y = [402783, 394935, 386361, 377223, 368226, 359953, 352230, 344741, 338101, 333456, 330981, 329499, 327798, 325659, 323444, 321457, 320176, 320376, 322368, 325548, 329180, 333189, 337664, 342106, 345951, 349534, 353795, 359183, 365411, 372120, 379042, 385598, 391066, 395285, 398661, 401425, 403454, 404823, 405883, 406575, 406319, 404839, 402627, 400292, 397956, 395606, 393498, 391690, 389555, 386375, 382295, 378329, 375478, 374146, 374157, 374915, 375738, 376545, 378230, 381896, 387659, 394633, 402158, 410612, 420821, 433145, 447471, 463805, 482387, 503342, 526621, 552322, 580726, 611851, 645115, 679596, 714557, 749740, 785171, 820618, 855083, 886859, 914222, 936094, 951965, 961443, 964288, 960905, 952393, 939952, 924521, 907043, 888545, 869526, 849540, 827815, 804123, 778781, 752193, 725039, 698672, 674570, 653220, 634041, 616494]
62336F16494j5839j4070j2699j1558r959p884o162n306m970m728m601m487l865
62323E10366k597j417j062j353j631j728j929k358k909l603m371m743m386l840
62309D72439m100n277o276n986m464k693j484q46k99M51J115J116L48m65m50M30
62293D43559J399J936K332L047L892M347M411M576N030N398N415N351N542N865
62279E02100O129O596P590Q720R182Q902Q836R840J1690J3563J5169J6946J9355
62266F44618K2496K6254L0366L4260L7239L9042L9931M0095L9159L6453L1722
62255A021635K5443J8516J1684N275n40n459r266j2291j5265j8499k1562k3988
62243I75683k5837k7160k7370k5886k3167k0369j8057j5949j3914j2304j1110
$$ y = [616494, 600655, 586585, 573886, 562328, 552369, 544485, 538323, 533017, 528047, 523319, 518718, 514231, 510366, 507769, 506352, 505290, 503937, 502306, 500578, 498649, 496291, 493382, 489779, 485408, 480665, 476279, 472439, 468339, 463062, 456786, 450800, 446336, 443643, 442159, 441313, 441014, 441465, 442580, 443696, 444044, 443579, 443129, 443559, 444958, 446894, 449226, 452273, 456165, 460512, 464923, 469499, 474529, 479927, 485342, 490693, 496235, 502100, 508229, 514825, 522415, 531135, 540317, 549219, 558055, 567895, 579585, 593148, 608317, 625263, 644618, 667114, 693368, 723734, 757994, 795233, 834275, 874206, 914301, 953460, 989913, 1021635, 1047078, 1065594, 1077278, 1082553, 1082013, 1076554, 1067288, 1054997, 1039732, 1021233, 999671, 975683, 949846, 922686, 895316, 869430, 846263, 825894, 807837, 791888, 777974, 765670, 754560]
62232G54560r714p909o360n498m712l361j988j609k196k765k849k902l253l516
62218F95928l244k455j283J74J467J951J738J804K692L734M200M601N957Q101
62204G25365R806J0535J1135J2502J4426J6268J8064K0256K2777K5168K7382K9741
62192I43425L2103L3701L3925L2852L0833K7962K4121J9258J3567P628K390j377
62180A200388l641m782m706k870O59M791Q435J1528J4650J7994K1165K3653K4956
62167A312220K4465K1841J7622J3123R567P407O219N167L764K342J514J022k33
62154A426040k705n335o780o916o390n249l109m21J722L140M791P109R209J0201
62140A425307J0428J0685J0981J0929J0858J1626J3415J5440J6806J7279J7257
$$ y = [754560, 744846, 736937, 730577, 725079, 720367, 717006, 715018, 713409, 711213, 708448, 705599, 702697, 699444, 695928, 692684, 690229, 688946, 689120, 690587, 692538, 694276, 696080, 698772, 702506, 706706, 711307, 717264, 725365, 735171, 745706, 756841, 769343, 783769, 800037, 818101, 838357, 861134, 886302, 913684, 943425, 975528, 1009229, 1043154, 1076006, 1106839, 1134801, 1158922, 1178180, 1191747, 1199375, 1201765, 1200388, 1196747, 1191965, 1187259, 1184389, 1185048, 1189839, 1198274, 1209802, 1224452, 1242446, 1263611, 1287264, 1312220, 1336685, 1358526, 1376148, 1389271, 1398838, 1406245, 1412464, 1417631, 1421395, 1423737, 1425251, 1426273, 1426040, 1423335, 1418000, 1411220, 1404304, 1397914, 1392665, 1389556, 1389135, 1390857, 1393997, 1398788, 1405897, 1415106, 1425307, 1435735, 1446420, 1457401, 1468330, 1479188, 1490814, 1504229, 1519669, 1536475, 1553754, 1571011]
62129A571011J7367J8049J9231K0440K1373K2246K3356K4525K5275K5419K5240
62118A813532K5164K5364K5655K5716K5522K5506K6047K6861K7273K7151K7036
62107B100827K7317K7801K8343K9278L0767L2315L3471L4607L6374L8686M1019
62096B460805M3475M6682N0446N3258N3656N1745M9006M6948M6250M6993M9089
62085B998353N2236N5662N8263N8976N7037N2097M4664L6409K9458K4902K2219
62074C490276K0429J9341J9078J8929J7719J5306J2683J0347P528L501j243n795
62062C628099r987j4024j7441j9428j9991k0086k0669k2112k4304k6682k8340
62051C405035k8734k8275k7705k7069k5829k3844k1552j9224j6758j4263j2229
$$ y = [1571011, 1588378, 1606427, 1625658, 1646098, 1667471, 1689717, 1713073, 1737598, 1762873, 1788292, 1813532, 1838696, 1864060, 1889715, 1915431, 1940953, 1966459, 1992506, 2019367, 2046640, 2073791, 2100827, 2128144, 2155945, 2184288, 2213566, 2244333, 2276648, 2310119, 2344726, 2381100, 2419786, 2460805, 2504280, 2550962, 2601408, 2654666, 2708322, 2760067, 2809073, 2856021, 2902271, 2949264, 2998353, 3050589, 3106251, 3164514, 3223490, 3280527, 3332624, 3377288, 3413697, 3443155, 3468057, 3490276, 3510705, 3530046, 3549124, 3568053, 3585772, 3601078, 3613761, 3624108, 3631636, 3635137, 3633894, 3628099, 3618112, 3604088, 3586647, 3567219, 3547228, 3527142, 3506473, 3484361, 3460057, 3433375, 3405035, 3376301, 3348026, 3320321, 3293252, 3267423, 3243579, 3222027, 3202803, 3186045, 3171782, 3159553]
62040C159553j0851r755q584p397o308n142l847k816k476k730l108l420l899m803
62026C084417o029p265q392r592j1009j2380j3240j3505j3670j4318j5595j7175
62014B942247j8478j8901j8209j6872j5695j4849j3738j2033j0350r356q742p824
62002B777200o878p048q960j2276j6627k2110k8437l4416l8865m1733m3729m5102
61990B471019m5363m4104m1753l9286l7401l5970l4266l1776k8818k6254k4633
61979B081395k3726k2967k2080k1135k0221j9302j8449j7927j7896j8097j7972
61968A861623j7170j5884j4585j3600j3053j3046j3471j3776j3306j2049j0644
61957A711039r499q339o900n471m331k996p86K118M843P053R298J2040J4922J7353
$$ y = [3159553, 3148702, 3138947, 3130363, 3122966, 3116658, 3111516, 3107669, 3104853, 3102377, 3099647, 3096539, 3093119, 3089220, 3084417, 3078388, 3071123, 3062731, 3053139, 3042130, 3029750, 3016510, 3003005, 2989335, 2975017, 2959422, 2942247, 2923769, 2904868, 2886659, 2869787, 2854092, 2839243, 2825505, 2813472, 2803122, 2793766, 2785024, 2777200, 2770322, 2763274, 2754314, 2742038, 2725411, 2703301, 2674864, 2640448, 2601583, 2559850, 2516121, 2471019, 2425656, 2381552, 2339799, 2300513, 2263112, 2227142, 2192876, 2161100, 2132282, 2106028, 2081395, 2057669, 2034702, 2012622, 1991487, 1971266, 1951964, 1933515, 1915588, 1897692, 1879595, 1861623, 1844453, 1828569, 1813984, 1800384, 1787331, 1774285, 1760814, 1747038, 1733732, 1721683, 1711039, 1701540, 1693201, 1686301, 1680830, 1676499, 1673503, 1672717, 1674835, 1679678, 1686731, 1696029, 1708069, 1722991, 1740344]
61943A740344J9351K1503K4292K7693L1236L4318L6698L8858M1701M5632N0101
61932B111727N4214N7687O0999O4910P0037P6827Q5549R6250J08900J23721J41194
61921C052015J61731J85555K13123K45309K82800L25321L71974M22366M76845
61912E737039N35268N95769O54779P07438P47107P64887P50845O96723N98422
61903A1788277M57572K82526Q7865j08667k90505m44927n63631o43239o86052
61894I879219o98774o88967o62556o24392n79526n32621m86631m42929m02219
61885D760604l64566l29283k95932k65200k37958k13962j92207j72202j54008
61876B535286j37502j22563j09548r8572q8742p9139p0194o2812n6530m9967m2998
$$ y = [1740344, 1759695, 1781198, 1805490, 1833183, 1864419, 1898737, 1935435, 1974293, 2015994, 2061626, 2111727, 2165941, 2223628, 2284627, 2349537, 2419574, 2496401, 2581950, 2678200, 2787100, 2910821, 3052015, 3213746, 3399301, 3612424, 3857733, 4140533, 4465854, 4837828, 5260194, 5737039, 6272307, 6868076, 7522855, 8230293, 8977400, 9742287, 10493132, 11189855, 11788277, 12245849, 12528375, 12616240, 12507573, 12217068, 11772141, 11208510, 10565271, 9879219, 9180445, 8491478, 7828922, 7204530, 6625004, 6092383, 5605752, 5162823, 4760604, 4396038, 4066755, 3770823, 3505623, 3267665, 3053703, 2861496, 2689294, 2535286, 2397784, 2275221, 2165673, 2067101, 1978359, 1899220, 1829026, 1766214, 1709684, 1659717, 1616719]
61865A616719l6927l2305k8055k3197j8136j3607r453n223j079K578N784Q660
61853A465759J0961J2444J3245J3510J3094J1911J0137P943N571L650K665K055
61841A572945Q30p84j342j57J845L666N398P229Q461Q594Q365Q594Q716P675N679
61826A645714L879K716J790J133J353K570M241O212Q961J2608J6475J9947K3226
61813A750825K6871L1083L5707M0595M5756N1304N7327O3692P0153P6758Q3982
61802B334053R2128J00944J10154J20142J31661J45054J60331J77800J98119K21702
61792C792088K48563K78710L12488L50629L94386M45374N04726N72511O48450
61783G547925P32954Q26595R28221J033826J137092J229968J301917J339011J324971
$$ y = [1616719, 1579792, 1547487, 1519432, 1496235, 1478099, 1464492, 1455039, 1449816, 1448737, 1451315, 1457099, 1465759, 1476720, 1489164, 1502409, 1515919, 1529013, 1540924, 1551061, 1559004, 1564575, 1568225, 1570890, 1572945, 1573775, 1572991, 1571649, 1571492, 1573337, 1577003, 1582401, 1589630, 1598091, 1606685, 1615050, 1623644, 1632360, 1640035, 1645714, 1649593, 1652309, 1654099, 1655232, 1656585, 1659155, 1663396, 1669608, 1678569, 1691177, 1707652, 1727599, 1750825, 1777696, 1808779, 1844486, 1885081, 1930837, 1982141, 2039468, 2103160, 2173313, 2250071, 2334053, 2426181, 2527125, 2637279, 2757421, 2889082, 3034136, 3194467, 3372267, 3570386, 3792088, 4040651, 4319361, 4631849, 4982478, 5376864, 5822238, 6326964, 6899475, 7547925, 8280879, 9107474, 10035695, 11069521, 12206613, 13436581, 14738498, 16077509, 17402480]
61774A7402480J244687J088892Q58069N64243K29804j16362m44385p28980r53551
61765A9144897j111659j205746j244155j237975j198625j136335j059482r74673
61757I976247q87184q01260p19976o44917n76207n13338m56312m05815l62137
61748D609101l24217k90317k59527k32066k08126j87224j68850j53009j39581
61739B646184j27665j16201j05037r4818q5993p8308p1188o4283n7679n1765m6796
61728A746451m2505l8413l4614l1818l0321k9418k8319k7296k7295k8550l0085
61717A397817l0632k9721k7925k6286k5425k4980k4076k2462k0912k0193j9997
61706A125208j9348j7884j6158j4796j3811j2847j1725j0583r716r314r304r445
$$ y = [17402480, 18647167, 19736059, 20594128, 21158371, 21388175, 21271813, 20827428, 20098448, 19144897, 18033238, 16827492, 15583337, 14345362, 13146737, 12010402, 10950920, 9976247, 9089063, 8287803, 7567827, 6922910, 6346703, 5833365, 5377053, 4971238, 4609101, 4284884, 3994567, 3735040, 3502974, 3294848, 3107624, 2938774, 2785765, 2646184, 2518519, 2402318, 2297281, 2202463, 2116470, 2038162, 1966974, 1902691, 1845012, 1793247, 1746451, 1703946, 1665533, 1630919, 1599101, 1568780, 1539362, 1511043, 1483747, 1456452, 1427902, 1397817, 1367185, 1337464, 1309539, 1283253, 1257828, 1232848, 1208772, 1186310, 1165398, 1145205, 1125208, 1105860, 1087976, 1071818, 1057022, 1043211, 1030364, 1018639, 1008056, 998340, 989026, 979722, 970277]
61694I70277r537r438q946q031p223p222p931q403q079p581p713q235q268p680
61680H55990p215p332p613p468o897o343o182o471o965p190o747n667m427l582
61666G65891l352l472l374k773k006j616j572j376q93m78j72N16J667K546K623
61651G52159K341K274K214J832J571J890K148J374j32j077j058r69j429j811j296
61636G60031l1J229K064K514K726K831K972L209L608M306N175N494M442J939j332
61621H01177m627p432r335j0266j0711j1129j1239j0607r654r178q983q046o242
61608F83728m796m651n261n515n108m409l686l026k523k088j498r22q27j097r50
61593F37371k04K91nl23K41J291J876K109K890M255N184N117M675M656N097N662
$$ y = [970277, 960740, 951302, 942356, 934325, 927102, 919880, 911949, 903546, 895467, 887886, 880173, 871938, 863670, 855990, 848775, 841443, 833830, 826362, 819465, 813122, 806940, 800469, 793504, 786314, 779567, 773900, 769473, 765891, 762539, 759067, 755693, 752920, 750914, 749298, 747726, 746350, 745457, 744979, 744807, 745323, 746990, 749536, 752159, 754500, 756774, 758988, 760820, 762391, 764281, 766429, 767803, 767671, 766594, 765536, 764567, 763138, 761327, 760031, 760000, 761229, 763293, 765807, 768533, 771364, 774336, 777545, 781153, 785459, 790634, 796128, 800570, 802509, 801177, 796550, 789118, 779783, 769517, 758806, 747677, 736438, 725831, 716177, 706999, 698016, 689970, 683728, 678932, 674281, 669020, 663505, 658397, 653988, 650302, 647276, 644753, 642665, 641167, 640245, 639418, 638321, 637371, 637167, 637458, 637453, 637130, 637371, 638662, 640538, 642647, 645537, 649792, 654976, 660093, 664768, 669424, 674521, 680183]
61577F80183O274P024P956R217J1000J3056J4736J5777J6712J8155J9992K1616
61565H41698K2722K3500K4161K4671K4931K4931K4661K4070K3297K2743K2760
61554A104145K3222K3581K3387K2794K2384K2521K2891K2776K1752J9954J7689
61543A347096J4927J1331O817J875k726o505r485j2025j4466j6755j8224j8071
61531A283789j6382j4457j3523j3224j2090r592o873n043l592j267K101N649R045
61518A204541J2832J7183K1352K4833K8259L2613L8145M4507N1558N9390O7902
61507A603115P6938Q6784R8079J11070J25411J40726J57208J75312J94897K14821
61497B984361K33434K49316K61183K67119K64424K50643K24797J87632J41240
$$ y = [680183, 686457, 693481, 701437, 710654, 721654, 734710, 749446, 765223, 781935, 800090, 820082, 841698, 864420, 887920, 912081, 936752, 961683, 986614, 1011275, 1035345, 1058642, 1081385, 1104145, 1127367, 1150948, 1174335, 1197129, 1219513, 1242034, 1264925, 1287701, 1309453, 1329407, 1347096, 1362023, 1373354, 1380171, 1382046, 1379320, 1372815, 1363330, 1351305, 1336839, 1320084, 1301860, 1283789, 1267407, 1252950, 1239427, 1226203, 1214113, 1204521, 1197648, 1192605, 1189013, 1187746, 1189847, 1195496, 1204541, 1217373, 1234556, 1255908, 1280741, 1309000, 1341613, 1379758, 1424265, 1475823, 1535213, 1603115, 1680053, 1766837, 1864916, 1975986, 2101397, 2242123, 2399331, 2574643, 2769540, 2984361, 3217795, 3467111, 3728294, 3995413, 4259837, 4510480, 4735277, 4922909, 5064149]
61488E064149Q8993L5325j5500o0897j00010j32310j56833j72965j81422j83911
61478D184619j82029j76662j68197j56996j43703j29247j14477r9874q5709p2283
61468B855442n9664m7410l5099k3130j2370k899O183J5451K4220L1364L6560M0290
61456B828938M2985M4749M5624M5610M4497M2187L9206L6559L4970L4455L4586
61445C274366L4989L5615L6698L8520M1127M4347M8023N2025N5952N8988O0247
61434C780897N9275N6244N1777M6487M0366L2680K2808J1174r64j2662k3764l4191
61422D030127m3374n0696n6005n9291o0273n8770n5318n0849m5902m0458l4456
61411C474735k8083k1612j5267r226l575J686O397J0121J2499J3574J3550J2326
$$ y = [5064149, 5153142, 5188467, 5172967, 5112070, 5012060, 4879750, 4722917, 4549952, 4368530, 4184619, 4002590, 3825928, 3657731, 3500735, 3357032, 3227785, 3113308, 3013434, 2927725, 2855442, 2795778, 2748368, 2713269, 2690139, 2677769, 2674870, 2681053, 2696504, 2720724, 2752088, 2788648, 2828938, 2871923, 2916672, 2962296, 3007906, 3052403, 3094590, 3133796, 3170355, 3205325, 3239780, 3274366, 3309355, 3344970, 3381668, 3420188, 3461315, 3505662, 3553685, 3605710, 3661662, 3720650, 3780897, 3840172, 3896416, 3948193, 3994680, 4035046, 4067726, 4090534, 4101708, 4100744, 4088082, 4064318, 4030127, 3986753, 3936057, 3880052, 3820761, 3760488, 3701718, 3646400, 3595551, 3549649, 3509191, 3474735, 3446652, 3425040, 3409773, 3400547, 3396972, 3398658, 3405055, 3415176, 3427675, 3441249, 3454799, 3467125]
61399C467125R639N626R46l724p999j1492j3471j3185j0612o549j721M225J2457
61386C431265K3648L7221N2145O8130Q5604J04786J25365J47035J69717J93107
61376D438023K16462K38908K59478K76676K88436K92692K87652K71660K43762
61367F813749K04945J58286J07494N5634N337m0941q1913j18219j51181j80972
61357F772219k06696k27869k44800k57458k65088k67265k64599k57989k47879
61348D532576k34737k19691k04002j88173j72070j55800j39918j24821j10377
61339B982987r6290q2537o9308n6760m4988l4070k3977j4541n664K574J0193J7502
61327B585121K4747L1548L7061M0879M3470M5563M7271M8180M8051M7073M5456
$$ y = [3467125, 3476764, 3482390, 3483336, 3479612, 3471613, 3460121, 3446650, 3433465, 3422853, 3416304, 3414583, 3418808, 3431265, 3454913, 3492134, 3544279, 3612409, 3698013, 3802799, 3928164, 4075199, 4244916, 4438023, 4654485, 4893393, 5152871, 5429547, 5717983, 6010675, 6298327, 6569987, 6813749, 7018694, 7176980, 7284474, 7340108, 7345445, 7304504, 7222591, 7104372, 6953191, 6772219, 6565523, 6337654, 6092854, 5835396, 5570308, 5303043, 5038444, 4780455, 4532576, 4297839, 4078148, 3874146, 3685973, 3513903, 3358103, 3218185, 3093364, 2982987, 2886697, 2804160, 2734852, 2678092, 2633104, 2599034, 2575057, 2560516, 2554852, 2557426, 2567619, 2585121, 2609868, 2641416, 2678477, 2719356, 2762826, 2808389, 2855660, 2903840, 2951891, 2998964, 3044420]
61316C044420M3189M0222L6620L2436K7662K2445J7197J2470Q733O222M817M129
61304C300562L853L835L682K605J4l834q250j2930j8002k3480k9178l5065m1013
61291C142799m6379n0436n3210n5163n6087n5206n2554m9272m6138m2634l8027
61280B597693l2613k7212k2053j6895j1811p176l210j42J499J437K04j541m052
61267B474128q142j3878k0165k5604k9351l1187l1283k9913k7088k2556j6323
61256B218638q904p25Q379J8630K9632M0775N2144O4321P7339R0370J02404J12948
61244B805951J22075J30123J37039J41578J41361J34254J19593R7712O8942L3989
61234C932617m881m4034q0098j10926j35197j52099j61714j64981j62963j56613
$$ y = [3044420, 3087609, 3127831, 3164451, 3196887, 3224549, 3246994, 3264191, 3276661, 3285394, 3291616, 3296433, 3300562, 3304415, 3308250, 3311932, 3314537, 3314551, 3310717, 3302467, 3289537, 3271535, 3248055, 3218877, 3183812, 3142799, 3096420, 3045984, 2992774, 2937611, 2881524, 2826318, 2773764, 2724492, 2678354, 2635720, 2597693, 2565080, 2537868, 2515815, 2498920, 2487109, 2479933, 2476723, 2476581, 2478080, 2479517, 2479721, 2478180, 2474128, 2465986, 2452108, 2431943, 2406339, 2376988, 2345801, 2314518, 2284605, 2257517, 2234961, 2218638, 2209734, 2209009, 2217388, 2236018, 2265650, 2306425, 2358569, 2422890, 2500229, 2590599, 2693003, 2805951, 2928026, 3058149, 3195188, 3336766, 3478127, 3612381, 3731974, 3829686, 3898628, 3932617, 3927736, 3883702, 3803604, 3692678, 3557481, 3405382, 3243668, 3078687, 2915724, 2759111]
61224B759111j47319j36873j26406j15976j05494r5512q6607p8564p0769o3069
61214A732522n5751m8940m2497l6310l0213k3895j7329j1149o081k141J151L832
61202A463199N335N354M270K518N7l073o023p610p533o714o257o458o995p783
61188A422287r146j1250j3701j5854j7298j8041j8476j9186k0451k1898k2778
61177A234208k2811k2419k2048k1513k0416j8895j7548j6586j5471j3598j1107
61166A031796q754p064n807m481l093k181k089k628l710n804r207j3180j6512
61153I47286j8905k1003k3001k4059k3557k2119k0742j9450j7530j4765j1683
61142G30472q846o529m949m116l474k298o06Q33J465J550J707K215K846L097K557
$$ y = [2759111, 2611792, 2474919, 2348513, 2232537, 2127043, 2031531, 1944924, 1866360, 1795591, 1732522, 1676771, 1627831, 1585334, 1549024, 1518811, 1494916, 1477587, 1466438, 1460357, 1458216, 1459367, 1463199, 1468534, 1473888, 1478158, 1480676, 1480733, 1477660, 1471637, 1464027, 1456494, 1449780, 1443523, 1437065, 1430070, 1422287, 1413141, 1401891, 1388190, 1372336, 1355038, 1336997, 1318521, 1299335, 1278884, 1256986, 1234208, 1211397, 1188978, 1166930, 1145417, 1125001, 1106106, 1088558, 1071972, 1056501, 1042903, 1031796, 1023042, 1015978, 1010171, 1005690, 1002597, 1000416, 998327, 995699, 991989, 986185, 976978, 963798, 947286, 928381, 907378, 884377, 860318, 836761, 814642, 793900, 774450, 756920, 742155, 730472, 721626, 715097, 710148, 706032, 702558, 700260, 699654, 700487, 701952, 703502, 705209, 707424, 710270, 713367, 715924]
61127G15924J321N5m92o5J078K457L560M028M076M382N166N760N583N112N044
61112G62989M808L020m83m161o730q627j0814j2956j3806j3078j1919j1453j1616
61099F65174j1666j1222j0479r818r609j0072j0926j1360j0740r402q257p678
61087E43945p165o284n385n037n137n098m731m282l772k901j732q22m41j82M44
61072D91420J438K588L813M939N542N464N117M974N047N242N728O548P202P208
61058E62270O790O562O711O982P252P527P583P169O534O214O310O453O461O592
61044F57410P060P742Q431R009R309R157Q649Q076P529O826N926N107M561M123
61030G58915L551K897K384J969J401P40N26J137K101K592K602L118M835P248R498
$$ y = [715924, 717245, 717300, 716808, 716743, 717821, 720278, 723838, 727866, 731942, 736324, 741490, 747250, 752833, 757945, 762989, 767797, 770817, 770334, 766173, 759443, 750816, 740002, 727046, 713240, 700162, 688243, 676790, 665174, 653508, 642286, 631807, 621989, 612380, 602308, 591382, 580022, 569282, 559880, 551623, 543945, 536780, 530496, 525111, 520074, 514937, 509839, 505108, 500826, 497054, 494153, 492421, 491599, 491158, 490976, 491420, 492858, 495446, 499259, 504198, 509740, 515204, 520321, 525295, 530342, 535584, 541312, 547860, 555062, 562270, 569060, 575622, 582333, 589315, 596567, 604094, 611677, 618846, 625380, 631594, 637904, 644357, 650818, 657410, 664470, 672212, 680643, 689652, 698961, 708118, 716767, 724843, 732372, 739198, 745124, 750231, 754792, 758915, 762466, 765363, 767747, 769716, 771117, 771857, 772383, 773520, 775621, 778213, 780815, 783933, 788768, 796016, 805514]
61015H05514J1607J4118J6936J9443K1610K4082K7205L0813L4855L9339M3679
61004A089201M7141M9851N2380N4462N5613N6950O0679O7439P5833Q5021R5714
60993A790284J07698J18572J26495J32713J40045J50616J66479J90702K25910
60984C149514K73357L34998M14393N13751O33520P79086R66227J215709J541738
60975I822293J941750K379895K760168K922176K706196K071633J169811K84733
60967B6058655l22824n36778l89516M513M88445Q61745R11791N16399k58158j172746
60957B6161526j951209k425101k579014k495280k276163k002401j726142j473940
60949I232276j252190j057451q86297p37417o09260n00238m10376l39930k86673
$$ y = [805514, 817121, 831239, 848175, 867618, 889228, 913310, 940515, 971328, 1006183, 1045522, 1089201, 1136342, 1186193, 1238573, 1293035, 1348648, 1405598, 1466277, 1533716, 1609549, 1694570, 1790284, 1897982, 2016554, 2143049, 2275762, 2415807, 2566423, 2732902, 2923604, 3149514, 3422871, 3757869, 4172262, 4686013, 5319533, 6098619, 7064846, 8280555, 9822293, 11764043, 14143938, 16904106, 19826282, 22532478, 24604111, 25773922, 26058655, 25735831, 25199053, 24809537, 24814050, 25302495, 26164240, 27076031, 27592430, 27334272, 26161526, 24210317, 21785216, 19206202, 16710922, 14434759, 12432358, 10706216, 9232276, 7980086, 6922635, 6036338, 5298921, 4689661, 4189423, 3779047, 3439117, 3152444]
60940C152444k46429k15656j91919j72771j56175j41700j29635j19182j08803
60931A670174r7914q6978p6357o6408n8388n3748n2361n2398n1960n0184m7019
60920I76459m2927l8732l5105l2056k9250k6466k3466k0027j6511j3760j1888
60909F86271r929p306m865l642l376l132k676k254j655o50J41l7p88j049o74m70
60893F43909q62j508k185l107m294n367o075o486o686o778o967p284p411p243
60879E71656p306q057r092r466q563o423l724j735j451k298k445r82R88K167K848
60864E16117L977N370O220O698P640R012R993J0377J0691J1110J1521J2368J4209
60851F35303J6441J7688J7528J6836J6345J5881J5080J3926J2477J0857R512Q678
$$ y = [3152444, 2906015, 2690359, 2498440, 2325669, 2169494, 2027794, 1898159, 1778977, 1670174, 1572260, 1485282, 1408925, 1342517, 1284129, 1230381, 1178020, 1125622, 1073662, 1023478, 976459, 933532, 894800, 859695, 827639, 798389, 771923, 748457, 728430, 711919, 698159, 686271, 676342, 669036, 664171, 660529, 657153, 654021, 651345, 649091, 647436, 646786, 646927, 646890, 646102, 645053, 644379, 643909, 643047, 641539, 639354, 636247, 631953, 626586, 620511, 614025, 607339, 600561, 593594, 586310, 578899, 571656, 564350, 556293, 547201, 537735, 529172, 522749, 519025, 517290, 515839, 513541, 511096, 510114, 511102, 513269, 516117, 520094, 525464, 531684, 538382, 546022, 555034, 565027, 575404, 586095, 597205, 608726, 621094, 635303, 651744, 669432, 686960, 703796, 720141, 736022, 751102, 765028, 777505, 788362, 797874, 806552]
60839H06552P742N980L803K247J401M72p20j535j916k739m455o431q055r496j0940
60824G81910j2020j2493j2736j3072j3194j2709j1719j0510r183p827o593n346
60812F54508l823k213j069m56K27J369K622L470L833L893L767L553L370L207L056
60797F79314L086L331L343K598J235r8r70j338j208p31l74m07l38N31K176L988
60781F94138N557O709P192P180P601R030J0604J1095J0689J0504J0645J0210R146
60768H10300Q500Q600Q444P384N988M754L272J375j74r27j632k950m231m450l723
60753H40530k913k378j936j597j562j854k500l750n569p325q500r221r743r862
60739G71820r367q617q152q127q413q862r155q935q397q154q163p554n973m346
$$ y = [806552, 814294, 820274, 824077, 826324, 827725, 828197, 827477, 825942, 824026, 821287, 816832, 810401, 802346, 792850, 781910, 769890, 757397, 744661, 731589, 718395, 705686, 693967, 683457, 674274, 666447, 659854, 654508, 650685, 648472, 647403, 646947, 647174, 648543, 651165, 654635, 658468, 662361, 666128, 669681, 673051, 676258, 679314, 682400, 685731, 689074, 691672, 692907, 692809, 691839, 690501, 689293, 688562, 688188, 687781, 687443, 687974, 690150, 694138, 699695, 706404, 713596, 720776, 728377, 737407, 748011, 759106, 769795, 780299, 790944, 801154, 810300, 818800, 827400, 835844, 843228, 849216, 853970, 857242, 858617, 858443, 857516, 855884, 852934, 848703, 844253, 840530, 837617, 835239, 833303, 831706, 830144, 828290, 825790, 822040, 816471, 809146, 800646, 791425, 781682, 771820, 762453, 753836, 745684, 737557, 729144, 720282, 711127, 702192, 693795, 685641, 677478, 669924, 663951, 659605]
60725F59605l641l545l094k121j245q02n09l4O98J632K517K947K858K750K973
60710F60989L135K604J342j23j346k199k806l533m782o424p749q295q366q503
60696F13944q825r158r352r144q208o752n578n191n204n070m808m663m492m071
60682E23428l502k845j810l44R47J534J729K105K647L091L695M853O277P273P710
60667E56788P963Q165Q160Q132Q486R073R227Q652P758P091O822O864P090P404
60653F67675P911Q907J0433J1941J2806J2942J2568J1626J0001Q083O576N719
60641G87188N175M594L832K740J300k0p00r57j627l106m967o673q161r484j0430
60626G58704j0818j0899j1058j1361j1609j1606j1187j0215q799p385o354n625
$$ y = [659605, 655964, 652419, 649325, 647204, 645959, 645157, 644648, 644614, 645312, 646944, 649461, 652408, 655266, 658016, 660989, 664124, 666728, 668070, 667947, 666601, 664402, 661596, 658063, 653281, 646857, 639108, 630813, 622447, 613944, 605119, 595961, 586609, 577465, 569257, 562505, 556927, 551736, 546532, 541462, 536654, 531991, 527499, 523428, 519926, 517081, 515271, 514927, 515874, 517408, 519137, 521242, 523889, 526980, 530675, 535528, 541805, 549078, 556788, 564751, 572916, 581076, 589208, 597694, 606767, 615994, 624646, 632404, 639495, 646317, 653181, 660271, 667675, 675586, 684493, 694926, 706867, 719673, 732615, 745183, 756809, 766810, 774893, 781469, 787188, 792363, 796957, 800789, 803529, 804829, 804809, 804109, 803152, 801525, 798419, 793452, 786779, 778618, 769134, 758704, 747886, 736987, 725929, 714568, 702959, 691353, 680166, 669951, 661152, 653767, 647413, 641788]
60614F41788m838l846k809j839p79N59K188M011O002Q140J0273J2226J3912J5134
60600G00122J5399J4338J2385J0600R492Q399O342L325L79j476k032j834j768
60587G73671k468l737m666m813m982o226q300r915j0459j0569j0878j1149j1087
60574F74422j1111j1600j2011j1508j0199r068q731q833q649p873o719n518m380
60561E58222l240k209j636j576j436n99O76J530J688J784K321K968L203L107L158
60546E67961L603M402N522O997Q890J1334J4309J7444K0492K3963K8634L4367
60534G47918M0056M4957M9116N2152N2525M8831M1217L0887J8751N389q042j9709
60522A104048k8007l2257l2744l0556k7018k2881j8183j3137q643n471l382j630
$$ y = [641788, 636950, 633104, 630295, 628456, 627677, 628236, 630424, 634435, 640437, 648577, 658850, 671076, 684988, 700122, 715521, 729859, 742244, 752844, 762336, 770735, 777077, 780402, 780781, 779305, 777273, 775439, 773671, 771203, 767466, 762800, 757987, 753005, 746779, 738479, 728564, 718105, 707536, 696658, 685509, 674422, 663311, 651711, 639700, 628192, 617993, 608925, 600194, 591361, 582712, 574839, 568120, 562602, 558222, 554982, 552773, 551137, 549561, 548125, 547526, 548202, 549732, 551420, 553204, 555525, 558493, 561696, 564803, 567961, 571564, 575966, 581488, 588485, 597375, 608709, 623018, 640462, 660954, 684917, 713551, 747918, 787974, 832931, 882047, 934199, 986724, 1035555, 1076772, 1107659, 1126410, 1131799, 1123757, 1104048, 1076041, 1043784, 1011040, 980484, 953466, 930585, 912402, 899265, 890622, 885151, 881769, 880139]
60510H80139k7J045J405J305J121J278K251M088O219Q164J0290J3402J7836K3325
60496I71841K9517L6167M3061N0134N7475O4788P1129P5597P8162P9712Q1639
60485A639222Q5607R3168J05191J22106J44905J75085K12935K56252L01058L42501
60475C478030L74129L87482L74534L31490K60041J65778N6698n7035j63962k53778
60465D953407l19665l59072l73456l67554l47849l20472k89898k58847k28722
60456B087872k00062j73236j48933j27864j10063r4977q2136p1345o2339n4732
60446I62185m8252m2603l7231l1783k6718k2837k0192j8021j5830j4000j3084
60435F71634j2986j3059j2785j2115j1290j0437r363p855o181n004m640m745m927
$$ y = [880139, 880112, 881157, 882562, 883867, 884988, 886266, 888517, 892605, 898824, 906988, 917278, 930680, 948516, 971841, 1001358, 1037525, 1080586, 1130720, 1188195, 1252983, 1324112, 1399709, 1477871, 1557583, 1639222, 1724829, 1817997, 1923188, 2045294, 2190199, 2365284, 2578219, 2834471, 3135529, 3478030, 3852159, 4239641, 4614175, 4945665, 5205706, 5371484, 5428182, 5371147, 5207185, 4953407, 4633742, 4274670, 3901214, 3533660, 3185811, 2865339, 2575441, 2316594, 2087872, 1887810, 1714574, 1565641, 1437777, 1327714, 1232737, 1150601, 1079256, 1016917, 962185, 913933, 871330, 834099, 802316, 775598, 752761, 732569, 714548, 698718, 684718, 671634, 658648, 645589, 632804, 620689, 609399, 598962, 589599, 581744, 575563, 570559, 565919, 561174, 556247]
60422E56247n171n359m910l451j503P0R94J455J446R52M77O49J377K032K272K233
60406E49810K035J788J821K269K630K419K078K384L094L116K088R88Q51J607K427
60391E81405K714K426J868J438J350J525J802K082K111J506L85m43n02l94q84
60376E98389j622j696j159r62j454j903j642q49jO66J027J042J029J332J748J850
60360E95795J894K524L579M084L668L168L506M640N855O586O687O447O414O706
60346F61553O597N421L769K911L058L136K444J537J183J369J739K147K395K179
60332G01438J685J514J695J573J007P67J301J945J946J492J114P67J53o72j546
60317G16179k508l362l574l132k833l180l665l748l724l955l944l143j989j188
$$ y = [556247, 551076, 545717, 540807, 537356, 535853, 535923, 536917, 538372, 539818, 540770, 541247, 541896, 543273, 545305, 547577, 549810, 551845, 553633, 555454, 557723, 560353, 562772, 564850, 567234, 570328, 573444, 575532, 576520, 577371, 578978, 581405, 584119, 586545, 588413, 589851, 591201, 592726, 594528, 596610, 598721, 600227, 600612, 600169, 599667, 599273, 598389, 596767, 595071, 593912, 592950, 591496, 589593, 587951, 587102, 587101, 587767, 588794, 589836, 590865, 592197, 593945, 595795, 597689, 600213, 603792, 607876, 611544, 614712, 618218, 622858, 628713, 635299, 641986, 648433, 654847, 661553, 668150, 673571, 677340, 680251, 683309, 686445, 688889, 690426, 691609, 692978, 694717, 696864, 699259, 701438, 703123, 704637, 706332, 707905, 708912, 709679, 710980, 712925, 714871, 716363, 717477, 718244, 718397, 717725, 716179, 713671, 710309, 706735, 703603, 700770, 697590, 693925, 690177, 686453, 682498, 678554, 675411, 673422, 672234]
60303F72234m39J022K973M345M680M557M541M615M627M526M013K687P24j064k020
60288G12021k177j965j791j875k113k135j783j389j279j189o46L03J235K014K754
60273F99985L309L436L446L939M892N623N860O132O855P665Q224R080J1028J3754
60259G93228J5950J6847J7107J7901J9573K1618K3657K5754K7847K9553L0932
60248A039967L2935L6465M1233M6094N0481N4957O0313O6709P3870Q1567Q9483
60237A674074R7016J03655J09448J14745J19408J22566J23146J20646J15432J08246
60227B808382R9418Q8680P5903O1753M7210L2565J7446J869j3252k6836l8317
60216C154821m7380n3609n6867n7705n6777n4006m8764m0894l1108k0290q800
$$ y = [672234, 671795, 672817, 675790, 680135, 684815, 689372, 693913, 698528, 703155, 707681, 711694, 714381, 715105, 714041, 712021, 709844, 707879, 706088, 704213, 702100, 699965, 698182, 696793, 695514, 694325, 693679, 693982, 695217, 697231, 699985, 703294, 706730, 710176, 714115, 719007, 724630, 730490, 736622, 743477, 751142, 759366, 768446, 779474, 793228, 809178, 826025, 843132, 861033, 880606, 902224, 925881, 951635, 979482, 1009035, 1039967, 1072902, 1109367, 1150600, 1196694, 1247175, 1302132, 1362445, 1429154, 1503024, 1584591, 1674074, 1771090, 1874745, 1984193, 2098938, 2218346, 2340912, 2464058, 2584704, 2700136, 2808382, 2907800, 2996480, 3072383, 3134136, 3181346, 3213911, 3231357, 3233226, 3219974, 3193138, 3154821, 3107441, 3053832, 2996965, 2939260, 2882483, 2828477, 2779713, 2738819, 2707711, 2687421, 2678621]
60205B678621L370J6062K8967M2138N6125P1198Q6656J01236J14199J25479J34664
60194C458715J40483J41782J38599J31730J21532J07923R1280P2584N2622L1636
60184D488886R866j2186l3998n5012p4255r0512j02993j11434j15599j15335j11087
60173C676341j03697r3633q0963o6121m9911l2697j4456M266K2306L9119N5121
60162C355675P0328Q3440R2856R7936R8699R5058Q7171P6098O3270M9487L4946
60151D204964J9898M772j0080k4180l6648m6565n3372n6682n6105n1632m3851
60140C850519l3371k0291m659J3045L2327N3134P5443R8759J22695J47694J74513
60129D509808K03088K32443K61634K90237L17915L43975L67421L87153M02060
$$ y = [2678621, 2681991, 2698053, 2727020, 2769158, 2825283, 2896481, 2983137, 3084373, 3198572, 3324051, 3458715, 3599198, 3740980, 3879579, 4011309, 4132841, 4240764, 4332044, 4404628, 4457250, 4488886, 4498752, 4486566, 4452568, 4397556, 4323301, 4232789, 4129796, 4018362, 3902763, 3787428, 3676341, 3572644, 3479011, 3398048, 3331927, 3282016, 3249319, 3234863, 3239129, 3261435, 3300554, 3355675, 3426003, 3509443, 3602299, 3700235, 3798934, 3893992, 3981163, 4057261, 4120531, 4170018, 4204964, 4224862, 4229634, 4219554, 4195374, 4158726, 4112161, 4058789, 4002107, 3946002, 3894370, 3850519, 3817148, 3796857, 3792198, 3805243, 3837570, 3890704, 3966147, 4064906, 4187601, 4335295, 4509808, 4712896, 4945339, 5206973, 5497210, 5815125, 6159100, 6526521, 6913674, 7315734]
60120G315734M11068M13153M07444L93651L72414L44666L10582K69643K21997
60111A0460352J69027J12225N2172j0722p4919j37860j97003k50137k95103l30024
60101I498008l53906l66652l68642l60778l44648l22068k94456k62998k29245
60092F594615j94946j61235j28190r5231o1870k8347M200L4361O1319Q4734J03727
60081F213137J16606J21988J19764J10651R5415P5061N1259K5908M97k3821m6152
60070F860313o6314q4952j02564j18899j33706j47375j60040j70688j78081j82142
60060E515552j83457j81847j76550j67578j55784j41689j25329j07351q9094p1241
60050D115632n3253l4439j4857N136K5464M5977O6122Q5318J03281J19704J33962
$$ y = [7315734, 7726802, 8139955, 8547399, 8941050, 9313464, 9658130, 9968712, 10238355, 10460352, 10629379, 10741604, 10793776, 10783054, 10708135, 10570275, 10373272, 10123135, 9828032, 9498008, 9144102, 8777450, 8408808, 8048030, 7703382, 7381314, 7086858, 6823860, 6594615, 6399669, 6238434, 6110244, 6015013, 5953143, 5924796, 5928996, 5963357, 6024676, 6109410, 6213137, 6329743, 6451731, 6571495, 6682146, 6777561, 6852622, 6903881, 6929789, 6930286, 6906465, 6860313, 6793999, 6709047, 6606483, 6487584, 6353878, 6206503, 6046463, 5875775, 5697694, 5515552, 5332095, 5150248, 4973698, 4806120, 4650336, 4508647, 4383318, 4275967, 4186873, 4115632, 4062379, 4027940, 4013083, 4018219, 4043683, 4089660, 4155782, 4241100, 4344381, 4464085, 4598047]
60039D598047J45324J52987J55867J52919J44001J30009J11971R0409O5751L8838
60029E786123J0652j8171m7162p5551j02185j25858j45570j60645j70606j74982
60019D776045j73492j66748j56409j44083j30130j14058r6046p7264n8655m0119
60009C619041k1271k282J6574L5673N5579P6149R6790J17440J38536J59774J79567
59998D471570J96054K08206K15564K17293K12248K00015J81330J57406J29289
59989F188975R8075O5065L1145l574l8965p3849j06332j34839j58209j75023j83924
59978E508545j84870j79340j69060j55175j38812j21373j03634q5211o5613m5320
59968D260137k5125m954J5813L7043N7639P6567R3529J08569J21413J31262J37047
$$ y = [4598047, 4743371, 4896358, 5052225, 5205144, 5349145, 5479154, 5591125, 5681534, 5747285, 5786123, 5796775, 5778604, 5731442, 5655891, 5553706, 5427848, 5282278, 5121633, 4951027, 4776045, 4602553, 4435805, 4279396, 4135313, 4005183, 3891125, 3795079, 3717815, 3659160, 3619041, 3597770, 3595488, 3612062, 3647735, 3703314, 3779463, 3876253, 3993693, 4132229, 4292003, 4471570, 4667624, 4875830, 5091394, 5308687, 5520935, 5720950, 5902280, 6059686, 6188975, 6287050, 6352115, 6383260, 6379686, 6340721, 6266872, 6160540, 6025701, 5867492, 5692469, 5508545, 5323675, 5144335, 4975275, 4820100, 4681288, 4559915, 4456281, 4371070, 4305457, 4260137, 4235012, 4230058, 4245871, 4282914, 4340553, 4417120, 4510649, 4619218, 4740631, 4871893, 5008940]
59957E008940J38061J34551J27480J17626J05186R0465P4368N7790M1043K4350
59947E919860Q584n013j5529k2435k5193k3323j6600m853J2124L4100O0316R0289
59935F012327J24290J62504K04140K47860K92641L37603L81253M21486M56060
59926H640164M82432M97391M97388M79256M40659L80726L01065K05920J00909
59917A2025910q055j14564k11877k94667l60498m08938m39872m53624m52082m38313
59907H843420m15179l85021l50334l13430k75453k36700j97786j59616j22319
59898F387582q5366m8769j3260K0840N4021Q6707J18647J49096J76871K00224
59888G046593K17354K26945K27625K17382J94596J59608J14516O1731L829n5572
$$ y = [5008940, 5147001, 5281552, 5409032, 5526658, 5631844, 5722309, 5796677, 5854467, 5895510, 5919860, 5928444, 5923431, 5907902, 5885467, 5860274, 5836951, 5820351, 5815498, 5827622, 5861722, 5922038, 6012327, 6136617, 6299121, 6503261, 6751121, 7043762, 7381365, 7762618, 8184104, 8640164, 9122596, 9619987, 10117375, 10596631, 11037290, 11418016, 11719081, 11925001, 12025910, 12017855, 11903291, 11691414, 11396747, 11036249, 10627311, 10187439, 9733815, 9281733, 8843420, 8428241, 8043220, 7692886, 7379456, 7104003, 6867303, 6669517, 6509901, 6387582, 6302216, 6253447, 6240187, 6261027, 6315048, 6401755, 6520402, 6669498, 6846369, 7046593, 7263947, 7490892, 7718517, 7935899, 8130495, 8290103, 8404619, 8466350, 8470179, 8414607]
59878H414607j12263j63063k06213k40368k64475k78732k84395k82594k74456
59869F308048k62421k49724k38061k26901k15612k04861j95323j86314j76683
59860D352148j66136j54859j42655j29293j15039j00154q4576o8758n4050m1550
59850C295078l1239k3071j8147j7825k1983k8952l6970m5008n2399n8421o2415
59839B898648o4049o3528o1502n8520n4465m8975m2357l5442k8448k0807j2289
59828B408266l434N524J5228K6003L6863M6399N4135O0325O5027O8163P0131P1531
59816B924161P2416P2299P0665O6889N9994M9251L5111J9295M070q483j7054k1624
59804C326990k3230k2729j9897j4005n018O200J8793L2614M8111O5827Q6024J08772
$$ y = [8414607, 8302344, 8139281, 7933068, 7692700, 7428225, 7149493, 6865098, 6582504, 6308048, 6045627, 5795903, 5557842, 5330941, 5115329, 4910468, 4715145, 4528831, 4352148, 4186012, 4031153, 3888498, 3759205, 3644166, 3544012, 3459436, 3390678, 3336628, 3295078, 3263839, 3240768, 3222621, 3204796, 3182813, 3153861, 3116891, 3071883, 3019484, 2961063, 2898648, 2834599, 2771071, 2709569, 2651049, 2596584, 2547609, 2505252, 2469810, 2441362, 2420555, 2408266, 2404832, 2410356, 2425584, 2451587, 2488450, 2534849, 2588984, 2649309, 2714336, 2782499, 2852630, 2924161, 2996577, 3068876, 3139541, 3206430, 3266424, 3315675, 3350786, 3370081, 3374151, 3365668, 3348614, 3326990, 3303760, 3281031, 3261134, 3247129, 3242111, 3248311, 3267104, 3299718, 3347829, 3413656, 3499680, 3608452]
59792C608452J34388J63686J97501K35998K78746L25188L74006M21369M59963
59783F199297M80038M71644M27126L43961K27433R0968m7242j69798k64762l27557
59773G431108l59967l67361l55945l31564k99624k64697k29618j95547j63141
59764D863644j33373j07096q4486o5248m8918l4659k1312q143M772J7129K9193
59753D411503M1693N5180O9594Q4386R9088J13945J29833J47249J65828J85333
59743E503632K06630K30768K57456K85627L15435L48368L85135M24635M65403
59734H423089N06700N47336N84488O14697O35386O44641O40191O20014N84110
59725A3800652N35359M78923M21182L68665L26902K99717K89169K95654L17916
$$ y = [3608452, 3742840, 3906526, 4104027, 4340025, 4618771, 4943959, 5317965, 5739334, 6199297, 6679335, 7150979, 7578105, 7922066, 8149499, 8240467, 8193225, 8023427, 7758665, 7431108, 7071141, 6703780, 6347835, 6016271, 5716647, 5451950, 5222332, 5026785, 4863644, 4730271, 4623175, 4538689, 4473441, 4424523, 4389864, 4368552, 4360409, 4365181, 4382310, 4411503, 4453196, 4508376, 4577970, 4662356, 4761444, 4875389, 5005222, 5152471, 5318299, 5503632, 5710262, 5941030, 6198486, 6484113, 6799548, 7147916, 7533051, 7957686, 8423089, 8929789, 9477125, 10061613, 10676310, 11311696, 11956337, 12596528, 13216542, 13800652, 14336011, 14814934, 15236116, 15604781, 15931683, 16231400, 16520569, 16816223, 17134139]
59716A7134139L53514L99514M52367N07365N59058O02571O33856O48812O43285
59707B1934481O14716N63259M91109M01644K99584J90930Q1963k1391j13148j87605
59697B4255542k41045k72613k82991k72914k43412j96582j35113o1422K2438J14805
59687B2686693K14850L22173M35418N52030O69731P86925R00591J004623J090987
59678B8664021J151423J176968J157232J082569R47860P54434N09902K28010p1937
59669C5600482l67876o39129q69129j046333j164949j225326j232915j196560
59661B7858265j127849j041215r53117q80028q35796q28204q55496r06055r63008
59652A9467497j010697j038544j041816j021290r82034r30577q72197q10541p48519
$$ y = [17134139, 17487653, 17887167, 18339534, 18846899, 19405957, 20008528, 20642384, 21291196, 21934481, 22549197, 23112456, 23603565, 24005209, 24304793, 24495723, 24577686, 24556295, 24443147, 24255542, 24014497, 23741884, 23458893, 23185979, 22942567, 22745985, 22610872, 22549450, 22571888, 22686693, 22901543, 23223716, 23659134, 24211164, 24880895, 25667820, 26568411, 27573034, 28664021, 29815444, 30992412, 32149644, 33232213, 34180073, 34934507, 35444409, 35672419, 35600482, 35232606, 34593477, 33724348, 32678015, 31513066, 30287740, 29054825, 27858265, 26730416, 25689201, 24736084, 23856056, 23020260, 22192056, 21336560, 20430505, 19467497, 18456800, 17418256, 16376440, 15355150, 14373116, 13442539, 12570342, 11759801, 11011282]
59643A1011282o88029o29415n72712n19329m71161m28276l88953l52107l18196
59634F643104k87535k59167k32009k06117j82160j60426j40780j22973j06506
59625D945431r0813p5898o2411n0992m1921l5496l2071l1606l3626l7772m3889
59614D408936n1581o0199o9303p8596q7393r4602r9388j01512j01126r8621r4504
59603C472111q9075q2324p4506o6356n8375n0306m1854l3395k5338j7371r210
59592B924001j446N279J1449J7787K3565K7225K8589K9107K9725K9746K8214K5424
59580C178665K2587K0728K0252K1026K2657K5184K9367L5730M3529N1545N9749
59569C531019O9131Q0008R1662J03746J16838J31293J46684J62785J80023J98395
$$ y = [11011282, 10323253, 9693838, 9121126, 8601797, 8130636, 7702360, 7313407, 6961300, 6643104, 6355569, 6096402, 5864393, 5658276, 5476116, 5315690, 5174910, 5051937, 4945431, 4854618, 4778720, 4716309, 4665317, 4623396, 4587900, 4555829, 4524223, 4490597, 4452825, 4408936, 4357355, 4297156, 4227853, 4149257, 4061864, 3967262, 3867874, 3766362, 3665236, 3566615, 3472111, 3383036, 3300712, 3226206, 3159850, 3101475, 3051169, 3009315, 2975920, 2950582, 2933211, 2924001, 2922555, 2927834, 2939283, 2957070, 2980635, 3007860, 3036449, 3065556, 3095281, 3125027, 3153241, 3178665, 3201252, 3221980, 3242232, 3263258, 3285915, 3311099, 3340466, 3376196, 3419725, 3471270, 3531019, 3600150, 3680158, 3771820, 3875566, 3992404, 4123697, 4270381, 4433166, 4613189, 4811584]
59559D811584K16914K34710K51782K67992K82111K92611K98818L00674K97934
59550G255130K90319K78065K61678K41520K18153J92811J67055J42028J18206
59541I164965R5316P2094M6797J8848r745l4870n2267n9283n5361m1447j8976
59530I126071J0865M6959Q7513J29704J70009K04672K29976K42564K39809K20114
59520A0708256J83305J31182O7443l609p8498j54582k28937k97867l57650m05370
59510I563673m39168m58406m63882m57595m42002m19440l91975l61326l28840
59501E801039k95682k62948k31440k01638j74043j49048j26164j04049q1928o0522
59491D113577m0791k2248l465J6096L5789N5207P4773R4906J15468J36324J57636
$$ y = [4811584, 5028498, 5263208, 5514990, 5782982, 6065093, 6357704, 6656522, 6957196, 7255130, 7545449, 7823514, 8085192, 8326712, 8544865, 8737676, 8904731, 9046759, 9164965, 9260281, 9332375, 9379172, 9398020, 9388275, 9353405, 9301138, 9241855, 9186494, 9145047, 9126071, 9136936, 9183895, 9271408, 9401112, 9571121, 9775793, 10005769, 10248333, 10488142, 10708256, 10891561, 11022743, 11090186, 11086577, 11008079, 10853497, 10624560, 10326693, 9969043, 9563673, 9124505, 8666099, 8202217, 7744622, 7302620, 6883180, 6491205, 6129879, 5801039, 5505357, 5242409, 5010969, 4809331, 4635288, 4486240, 4360076, 4256027, 4174099, 4113577, 4072786, 4050538, 4047073, 4063169, 4098958, 4154165, 4228938, 4323844, 4439312, 4575636, 4733272]
59480D733272J79311K00671K20863K39191K54947K67328K75321K77253K70802
59471F918959K54208K27321J91011J46055R3461L5474k4819q4642j41415j92004
59461G423609k33569k65308k88149l02826l09430l08828l02940k93224k80103
59452D839232k64306k47380k30285k12660j94206j75796j58546j42720j28234
59443C085099j15323j03937r3238q2516p2008o2225n3150m4651l7011l0380k4294
59432B366366j8362j2825p907l267J283N187P907R743J1247J2404J3128J4005
59420B398909J5728J8220K1126K4705K9140L3048L3812L0016K3245J7149J4750
59409B659848J6731K1951K9226L8341M9533O2509P6167Q8808R8336J03138J03884
$$ y = [4733272, 4912583, 5113254, 5334117, 5573308, 5828255, 6095583, 6370904, 6648157, 6918959, 7173167, 7400488, 7591499, 7737554, 7831015, 7866489, 7841670, 7757028, 7615613, 7423609, 7190040, 6924732, 6636583, 6333757, 6024327, 5715499, 5412559, 5119335, 4839232, 4574926, 4327546, 4097261, 3884601, 3690395, 3514599, 3356053, 3213333, 3085099, 2969776, 2865839, 2772601, 2690085, 2618077, 2555852, 2502702, 2458051, 2421040, 2390660, 2366366, 2348004, 2335179, 2327272, 2324005, 2325288, 2330475, 2338382, 2348125, 2359372, 2371776, 2384904, 2398909, 2414637, 2432857, 2453983, 2478688, 2507828, 2540876, 2574688, 2604704, 2627949, 2645098, 2659848, 2676579, 2698530, 2727756, 2766097, 2815630, 2878139, 2954306, 3043114, 3141450, 3244588, 3348472]
59398C348472J04234J08605J19035J34741J54455J77981K05422K36323K70339
59389D859607L07945L49681L95267M43785M93976N43716N89683O28239O56442
59380I268341O71989O72842O57718O27097N83734N32236M77746M24223L73712
59371A4289638L27391K86734K52604K23504J95936J66841J34739R8466N6209O517
59361A6038579n0456j13057j78516k42924l02090l53368l96208m30725m56787
59352A3514448m75037m87554m96377n01937n03549n00713m93221m80770m63272
59343I112018m41166m14902l84816l52016l18527k85830k53990k22880j93432
59334F244459j66761j42897j21402j02613q7290p5522o7050o2135o1016o2797
$$ y = [3348472, 3452706, 3561311, 3680346, 3815087, 3969542, 4147523, 4352945, 4589268, 4859607, 5167552, 5517233, 5912500, 6356285, 6850261, 7393977, 7983660, 8611899, 9268341, 9940330, 10613172, 11270890, 11897987, 12481721, 13013957, 13491703, 13915926, 14289638, 14617029, 14903763, 15156367, 15379871, 15575807, 15742648, 15877387, 15975853, 16032062, 16038579, 15988123, 15875066, 15696550, 15453626, 15151536, 14798168, 14401960, 13971235, 13514448, 13039411, 12551857, 12055480, 11553543, 11049994, 10549281, 10056060, 9575290, 9112018, 8670852, 8255950, 7871134, 7519118, 7200591, 6914761, 6660771, 6437891, 6244459, 6077698, 5934801, 5813399, 5710786, 5623496, 5547974, 5480924, 5418789, 5357773, 5294976]
59324E294976o5922o9754p4716q0970q7712r3780r8348j01072j02056j01622r9713
59313D319311r5821q9908q2913p5789o8421o0209n1328m2560l4105k5466j6518
59302C676273p846J64Q006J6514K5948L5905M6084N6889O9107Q2895R7422J11830
59290D219191J26375J41942J58556J75051J90202K03382K13927K20793K23245
59281E872664K21074K13718J99958J79116J51918J19795Q3854M4947L884l8843
59271G052085q2672j25574j63813j94009k15098k27938k33739k33631k29094k21664
59261E124853k12291k01441j89516j76809j63461j49824j36313j22671j08199
59252C664328r3099p8676o5667n3283m0584k7821j5521l191J0076K4368L9396
$$ y = [5294976, 5229054, 5159300, 5084584, 5003614, 4915902, 4822122, 4723774, 4622702, 4520646, 4419024, 4319311, 4223490, 4133582, 4050669, 3974880, 3906459, 3846250, 3794922, 3752362, 3718257, 3692791, 3676273, 3668427, 3668591, 3676597, 3693111, 3719059, 3754964, 3801048, 3857937, 3927044, 4009939, 4107361, 4219191, 4345566, 4487508, 4646064, 4821115, 5011317, 5214699, 5428626, 5649419, 5872664, 6093738, 6307456, 6507414, 6686530, 6838448, 6958243, 7042097, 7087044, 7090928, 7052085, 6969413, 6843839, 6680026, 6486017, 6270919, 6042981, 5809242, 5575611, 5346517, 5124853, 4912562, 4711121, 4521605, 4344796, 4181335, 4031511, 3895198, 3772527, 3664328, 3571229, 3492553, 3426886, 3373603, 3333019, 3305198, 3289677, 3286486, 3296562, 3320930, 3360326]
59241C360326N5576P3593R3404J14664J37739J63364J91754K22941K57460K95688
59231D966509L36747L78800M19858M57360M87470N06038N10197M98280M68674
59222I029933M20004L52485K68373J71187O5292m4072j51249k50854l37828m07685
59212I115586m57811m88462n01736m99801m84667m59149m26784l90725l53175
59203E053276l15671k79329k44916k13152j84623j59148j35905j14696r6298q1011
59193C228527o7801n5714m5116l6505k9042k1608j4505q618l434K449R193J5684
59181B973510K1471K7246L3292L8780M2893M5550M6894M6964M5947M3815L9803
59170C406165L3146K4326J4639M666n775j6377k6150l4597m2073m8843n4606n9020
$$ y = [3360326, 3415902, 3489495, 3582899, 3697563, 3835302, 3998666, 4190420, 4413361, 4670821, 4966509, 5303256, 5682056, 6101914, 6559274, 7046744, 7552782, 8062979, 8561259, 9029933, 9449937, 9802422, 10070795, 10241982, 10307274, 10263202, 10111953, 9861099, 9523271, 9115586, 8657775, 8169313, 7667577, 7167776, 6683109, 6223960, 5797176, 5406451, 5053276, 4737605, 4458276, 4213360, 4000208, 3815585, 3656437, 3520532, 3405836, 3309538, 3228527, 3160726, 3105012, 3059896, 3023391, 2994349, 2972741, 2958236, 2949618, 2946184, 2948633, 2957826, 2973510, 2994981, 3022227, 3055519, 3094299, 3137192, 3182742, 3229636, 3276600, 3322547, 3366362, 3406165, 3439311, 3463637, 3478276, 3482942, 3477167, 3460790, 3434640, 3400043, 3357970, 3309127, 3254521, 3195501]
59158C195501o1930o3080o2378o0328n7480n3629m8417m2433l6778l1724k6727
59147B650597k1571j6595j1963p570l469M89M972J0205J5187J9130K3054K8552
59135B691018L5332M1732M7456N3962O1974P0337P7862Q4716R1424R7847J03799
59124C457459J09508J14778J18786J21188J22481J22796J21365J17796J12950
59115D519107J07973J03237R8710R4617R1201Q8610Q7462Q8883R3427J00451J08660
59104E582338J16600J22335J23443J17775J03902Q0947M8825Q908l6158q3512
59094F185403j30392j73724k10482k38821k58349k69357k72548k69394k61599
59085D100737k50087k35303k18431k01243j84683j68656j53247j39080j26337
$$ y = [3195501, 3133571, 3070491, 3008113, 2947785, 2890305, 2836676, 2788259, 2745826, 2709048, 2677324, 2650597, 2629026, 2612431, 2600468, 2592898, 2589429, 2589918, 2594890, 2605095, 2620282, 2639412, 2662466, 2691018, 2726350, 2768082, 2815538, 2869500, 2931474, 3001811, 3079673, 3164389, 3255813, 3353660, 3457459, 3566967, 3681745, 3800531, 3921719, 4044200, 4166996, 4288361, 4406157, 4519107, 4627080, 4730317, 4829027, 4923644, 5014845, 5103455, 5190917, 5279800, 5373227, 5473678, 5582338, 5698938, 5821273, 5944716, 6062491, 6166393, 6247340, 6296165, 6305073, 6268915, 6185403, 6055011, 5881287, 5670805, 5431984, 5173635, 4904278, 4631730, 4362336, 4100737, 3850650, 3615347, 3396916, 3195673, 3010990, 2842334, 2689087, 2550007, 2423670]
59076B423670j14633j04000r4816q6594p8237o9728o2283n6310n0660m4477l8498
59065A623434l3694k9733k5728k1621j7871j4558j1543q974o994n521m820n538
59053A436839p679j0265j2500j4588j6890j9132k0987k2688k4289k5066k4264
59042A238491k1991j8844j5213j1391p686l911N69N742J0484J3759J5651J6739
59030A222399J7123J6643J5447J3665J1071P664M172J407m90j742k303k034j088
59017A301934L29K228M512O752Q610J0114J1235J1655J1253J0253Q711O311L056
59004A396953m29l583o428r101j1397j3060j4031j4148j3113j1143r105p699o846
58991A276870o122n230l919j943N24K869M631N771O335O424O522P226Q478R611
$$ y = [2423670, 2309037, 2205037, 2110221, 2023627, 1945390, 1875662, 1813379, 1757069, 1706409, 1661932, 1623434, 1589740, 1560007, 1534279, 1512658, 1494787, 1480229, 1468686, 1459712, 1452718, 1447197, 1442377, 1436839, 1429160, 1418895, 1406395, 1391807, 1374917, 1355785, 1334798, 1312110, 1287821, 1262755, 1238491, 1216500, 1197656, 1182443, 1171052, 1163366, 1159455, 1160024, 1165766, 1176250, 1190009, 1205660, 1222399, 1239522, 1256165, 1271612, 1285277, 1296348, 1304012, 1308184, 1309591, 1309101, 1307359, 1305056, 1303022, 1301934, 1302263, 1304491, 1309003, 1315755, 1324365, 1334479, 1345714, 1357369, 1368622, 1378875, 1387586, 1393897, 1396953, 1396524, 1392941, 1386513, 1377412, 1366015, 1352955, 1338924, 1324776, 1311663, 1300520, 1291415, 1283716, 1276870, 1270748, 1265518, 1261599, 1259656, 1260180, 1263049, 1267680, 1273451, 1279786, 1286210, 1292732, 1299958, 1308436, 1318047]
58977A318047J0294J0874J1792J3221J5240J7731K0134K2023K3852K6298K9058
58966A518564L1227L2800L4565L6425L7077L5836L3591L1465K9565K7660K6152
58955A874927K5582K5832K6505K7603K9393L1982L5347L9346M3565M7615N1670
58944B259367N6135O0889O5532P0273P5611Q1270Q6485R1453R7452J05321J14754
58933C164542J25247J36693J48973J61977J76190J92234K09798K28195K47948
58924D791797K70461K95954L23218L51752L82675M17034M54553M94520N36659
58915H318623N80544O25307O70140P13750P53003P83593Q02296Q06919P93929
58906A4848104P58395O97259O10964N01288L70151K21948O4969r1613k40954l77639
$$ y = [1318047, 1328341, 1339215, 1351007, 1364228, 1379468, 1397199, 1417333, 1439356, 1463208, 1489506, 1518564, 1549791, 1582591, 1617156, 1653581, 1690658, 1726494, 1760085, 1791550, 1821115, 1848775, 1874927, 1900509, 1926341, 1952846, 1980449, 2009842, 2041824, 2077171, 2116517, 2160082, 2207697, 2259367, 2315502, 2376391, 2441923, 2512196, 2587807, 2669077, 2755562, 2847015, 2944467, 3049788, 3164542, 3289789, 3426482, 3575455, 3737432, 3913622, 4105856, 4315654, 4543849, 4791797, 5062258, 5358212, 5681430, 6033182, 6415857, 6832891, 7287444, 7781964, 8318623, 8899167, 9524474, 10194614, 10908364, 11661367, 12444960, 13247256, 14054175, 14848104, 15606499, 16303758, 16914722, 17416010, 17786161, 18008109, 18073078, 17981465, 17740511, 17362872]
58896A7362872m95802n90633o60939p08300p34483p41229p31658p09815o79145
58887A1310868o42620o03572n64754n26981m90115m54852m22350l92732l65432
58878F847460l40561l18523k98667k79622k60798k42473k24794k07717j91486
58869D482819j76187j61276j46515j32775j20869j10264r9994r0228q1630p3840
58859C289241o5866n7611m9789m2677l6070l0031k4538j8821j2234n482K81N183
58847B951586J0370J6340K2629K8912L5265M1542M7602N3975O1341O9459P7500
58836C416521Q5256R3173J01512J10334J20113J31402J44083J57644J72102J87966
58826D720106K05576K25014K46380K69691K94996L22949L54530L89796M27778
$$ y = [17362872, 16867070, 16276437, 15615498, 14907198, 14172715, 13431486, 12699828, 11990013, 11310868, 10668248, 10064676, 9499922, 8972941, 8482826, 8027974, 7605624, 7212892, 6847460, 6506899, 6188376, 5889709, 5610087, 5349289, 5106816, 4882022, 4674305, 4482819, 4306632, 4145356, 3998841, 3866066, 3745197, 3634933, 3534939, 3444711, 3363081, 3289241, 3223375, 3165764, 3115975, 3073298, 3037228, 3007197, 2982659, 2963838, 2951604, 2946122, 2946403, 2951586, 2961956, 2978296, 3000925, 3029837, 3065102, 3106644, 3154246, 3208221, 3269562, 3339021, 3416521, 3501777, 3594950, 3696462, 3806796, 3926909, 4058311, 4202394, 4360038, 4532140, 4720106, 4925682, 5150696, 5397076, 5666767, 5961763, 6284712, 6639242, 7029038, 7456816]
58817G456816M68154N11812N58824O06914O53087O95678P33484P63633P81722
58808A3230124P83555P65619P24716O58767N68008M54546L21472J73482J7770
58799A7698059j37221k83870m15932n28313o18007o84798p29869p54263p59774
58790A2786012p50295p30474p03225o69840o32009n92051n51457n10725m70573
58781G175363m32058l95479l60392l26793k95508k67664k44562k27345k15669
58772D409893k07079j98838j90038j81059j71763j61565j50712j40042j29744
58763B879053j19471j09352r9780r0674q1978p4238o7653o1288n4504m8258m3672
58752B028185m0125l6306l2226k8526k4731k0201j6115j4285j4379j4460j4111
$$ y = [7456816, 7924970, 8436782, 8995606, 9602520, 10255607, 10951285, 11684769, 12448402, 13230124, 14013679, 14779298, 15504014, 16162781, 16730789, 17185335, 17506807, 17680289, 17698059, 17560838, 17276968, 16861036, 16332723, 15714716, 15029918, 14300049, 13545786, 12786012, 12035717, 11305243, 10602018, 9932178, 9300169, 8708118, 8156661, 7645936, 7175363, 6743305, 6347826, 5987434, 5660641, 5365133, 5097469, 4852907, 4625562, 4409893, 4202814, 4003976, 3813938, 3632879, 3461116, 3299551, 3148839, 3008797, 2879053, 2759582, 2650230, 2550450, 2459776, 2377798, 2303560, 2235907, 2174619, 2120115, 2071857, 2028185, 1988060, 1951754, 1919528, 1891002, 1866271, 1846070, 1829955, 1815670, 1801291, 1786831, 1772720]
58741A772720j4763j6928j9151k0189k0364k0375k0384k0599k1415k2537k3229
58730A552786k3595k4380k5645k6806k7906k9447l1132l2181l2750l3556l4321
58719A231067l4107l3010l1905l0632k8219k4916k2180k0525j9086j7503j6396
58708I52588j5752j4494j2243r920q186o678n153m014l332k646k095k487l978
58695H61610n822p594r450j1143j2091j2482j3001j3411j2785j1161r532q160
58683G34978o353l996j763L02K898N955Q390R528R418P997N408L066K650M040
58669G82518N904Q144J1740J6259J9713K1139K1063J9138J3803N215l724j0394
58657I10518j4655j7217j7794j6208j3576j1009q381n432k797q04J365M280P155
$$ y = [1772720, 1757957, 1741029, 1721878, 1701689, 1681325, 1660950, 1640566, 1619967, 1598552, 1576015, 1552786, 1529191, 1504811, 1479166, 1452360, 1424454, 1395007, 1363875, 1331694, 1298944, 1265388, 1231067, 1196960, 1163950, 1132045, 1101413, 1073194, 1048278, 1026098, 1005573, 986487, 968984, 952588, 936836, 922342, 910099, 900179, 891993, 885315, 880162, 876148, 872816, 870170, 868075, 865588, 861610, 855788, 848194, 838744, 827601, 815510, 803028, 790027, 776616, 763831, 752670, 743138, 734978, 728625, 724629, 722866, 723168, 726066, 732021, 740411, 749939, 759357, 767354, 772762, 775828, 778478, 782518, 788422, 796566, 808306, 824565, 844278, 865417, 886480, 905618, 919421, 924636, 920912, 910518, 895863, 878646, 860852, 844644, 831068, 820059, 811678, 806246, 803449, 802645, 804010, 808290, 815445]
58644H15445R189J0881J3002J5279J7150J8889K1059K3611K6323K9365L2779L6127
58632A069099L9338M3066M7708N2819N7981O3424O9382P5733Q2711R1141J01521
58621A793923J13634J27299J42635J59306J76349J92961K08659K22604K33456
58612C370826K39818K39919K31317K12051J82046J42500R4637M0619j5026o7012
58602D671695j12377j50482j80363k00476k11106k14659k12985k06298j95181
58593B987768j81618j67355j52887j38531j24798j11297r7157q2950p0433o0070
58583A800672n0757m2343l6193l2725l0538k8764k8051k8392k8247k6816k5181
58572A442665k3994k2099j8678j4927j2351j1059j0976j2866j6827k1326k5036
$$ y = [815445, 824634, 835515, 848517, 863796, 880946, 899835, 920894, 944505, 970828, 1000193, 1032972, 1069099, 1108437, 1151503, 1199211, 1252030, 1310011, 1373435, 1442817, 1518550, 1601261, 1692402, 1793923, 1907557, 2034856, 2177491, 2336797, 2513146, 2706107, 2914766, 3137370, 3370826, 3610644, 3850563, 4081880, 4293931, 4475977, 4618477, 4713114, 4753733, 4738707, 4671695, 4559318, 4408836, 4228473, 4027997, 3816891, 3602232, 3389247, 3182949, 2987768, 2806150, 2638795, 2485908, 2347377, 2222579, 2111282, 2014125, 1931175, 1860742, 1800672, 1749915, 1707572, 1671379, 1638654, 1608116, 1579352, 1551301, 1522909, 1494662, 1467846, 1442665, 1418671, 1396572, 1377894, 1362967, 1350616, 1339557, 1328581, 1315715, 1298888, 1277562, 1252526]
58561A252526k8324l1747l4553l5716l5174l3069k9283k4621k0859j8633j6780
58550I43767j4676j3519j4243j5818j6841j7287j7601j7450j6582j5596j4815
58539G69339j3699j2143j0993j0476r693q364p530p697p983p783p599p514o815
58526F51050n830o073p580q288p074n293m211l173j578l50L4Q06K630M133M306
58511F13509M296N165N923N518M864N037N304M763M104L989L515K143J226J766
58497F71122K506K213K017L291M956N168M201L436K777J349m25j624k644m281
58483F94062n931o516o308o249o382o396o559o905o715n970n800o390o265m960
58469F06716m327n666p567q270q092p789o717m651l277l648m137l097j517p95
$$ y = [1252526, 1224202, 1192455, 1157902, 1122186, 1087012, 1053943, 1024660, 1000039, 979180, 960547, 943767, 929091, 915572, 901329, 885511, 868670, 851383, 833782, 816332, 799750, 784154, 769339, 755640, 743497, 732504, 722028, 712335, 703971, 696441, 688744, 680761, 672978, 665379, 657865, 651050, 645220, 639147, 631567, 623279, 616205, 610912, 606701, 603528, 601950, 601600, 601634, 602440, 605070, 609203, 613509, 617805, 622970, 628893, 634411, 639275, 644312, 649616, 654379, 658483, 662472, 665987, 668130, 669356, 671122, 673628, 675841, 677858, 681149, 686105, 691273, 695474, 698910, 701687, 703036, 702611, 700987, 698343, 694062, 688131, 681615, 675307, 669058, 662676, 656280, 649721, 642816, 636101, 630131, 624331, 617941, 611676, 606716, 602389, 596723, 589156, 580886, 572794, 565005, 558288, 553637, 550360, 546712, 542575, 539478, 537961, 537166]
58455E37166J1K202M698N886O408P508Q387P963P459Q464R934J0035R393R658
58441F35172J0212R279P122N281L708J371j347l435n306p581r087q692p739p975
58427F20983q348o752l754j646q83k48M67Q05J572L609N702O379O716Q426J0505
58412F43533J0831R940R909J0395R158N947K638l9k853n514o713o500o074n552
58398F69106m279k845k361k399j901j260j217r22M62J488M48j656k966m168o970
58383F38560j0536j2602j2873j2011q650j162Q432J6004K0120K2068K2116J9553
58371F89019J5800J3568J2990J1909R773Q079P197O101M948M863N495N666N898
58358H01306P409R356R998R686R614Q794N766K177R26J567J387J47q0Q25J000
$$ y = [537166, 537177, 539379, 544077, 549963, 556371, 563879, 572266, 580229, 587688, 596152, 606086, 616121, 625514, 635172, 645384, 654663, 661785, 667066, 670774, 672145, 670798, 667363, 662057, 654476, 645389, 636697, 628958, 620983, 612635, 605883, 602129, 600483, 599600, 599352, 599819, 600624, 602196, 605805, 611507, 617886, 624602, 633028, 643533, 654364, 664304, 674213, 684608, 693766, 699713, 702351, 702312, 699459, 693945, 687232, 680732, 674658, 669106, 664827, 661982, 659621, 657222, 655321, 654061, 652844, 651922, 652384, 653872, 654320, 652664, 649698, 645530, 638560, 628024, 615422, 602549, 590538, 581888, 580726, 589158, 605162, 625282, 647350, 669466, 689019, 704819, 718387, 731377, 743286, 753059, 761138, 768335, 774436, 779384, 784247, 789742, 795408, 801306, 808715, 818071, 828069, 837755, 847369, 856163, 861929, 864106, 865032, 866599, 867986, 868133, 868053, 868878, 869878]
58343H69878M07Q12K293L390M301O328Q644R324Q979R706J1099J1108J0090J0113
58329I66472J0926J0696R965J0649J1904J1417J0133J1079J3926J5358J4654J4223
58317A111402J4719J4206J2263J0522R097O677M070L498M540M929M858O199Q176
58304A215156Q483P995R477J2220J3127J2530J3664J6640J8370J8269J8717J9939
58292A384587J9832J8855J9696K2121K3479K4047K6401K9850L1314L1497L4094
58281A665773L8999M2440M3801M6004M9150N0214M9195M9012M9030M5427L8311
58270B167356L1910K7366K2260J7422J6859K0293K3055K4147K7166L2580L6601
58259B447015L8614M2147M7555N1280N3193N6988O2485O5532O6299O9393P5013
$$ y = [869878, 870285, 871097, 873390, 876780, 881081, 887409, 896053, 905377, 914356, 924062, 935161, 946269, 956359, 966472, 977398, 988094, 998059, 1008708, 1020612, 1032029, 1042162, 1053241, 1067167, 1082525, 1097179, 1111402, 1126121, 1140327, 1152590, 1163112, 1172209, 1178886, 1182956, 1186454, 1190994, 1195923, 1200781, 1206980, 1215156, 1223639, 1231634, 1241111, 1253331, 1266458, 1278988, 1292652, 1309292, 1327662, 1345931, 1364648, 1384587, 1404419, 1423274, 1442970, 1465091, 1488570, 1512617, 1539018, 1568868, 1600182, 1631679, 1665773, 1704772, 1747212, 1791013, 1837017, 1886167, 1936381, 1985576, 2034588, 2083618, 2129045, 2167356, 2199266, 2226632, 2248892, 2266314, 2283173, 2303466, 2326521, 2350668, 2377834, 2410414, 2447015, 2485629, 2527776, 2575331, 2626611, 2679804, 2736792, 2799277, 2864809, 2931108, 3000501, 3075514]
58248C075514P8496P9461Q2648Q8689R3206R5958J01550J09978J16139J19862
58238D041501J26390J35908J43019J47731J55960J67789J76855J82911J92939
58229E471003K07935K21181K31832K47066K68136K87676L03848L23525L48596
58220G910798L73238L97708M29892M70100N09871N49042N97518O56997P18757
58211A2613921P83064Q61721R57432J061095J174076J311650J479666J671411
58203B1914036J893208K168399K511196K925282L436026M096349M956645O061749
58195D9962890P478257R282117J1521793J4261710J7686065K2091533K7709138
58188A59993503L4473319M1761510M8036413N0700379M6853277L5044292J6791164
$$ y = [3075514, 3154010, 3233471, 3316119, 3404808, 3498014, 3593972, 3695522, 3805500, 3921639, 4041501, 4167891, 4303799, 4446818, 4594549, 4750509, 4918298, 5095153, 5278064, 5471003, 5678938, 5900119, 6131951, 6379017, 6647153, 6934829, 7238677, 7562202, 7910798, 8284036, 8681744, 9111636, 9581736, 10091607, 10640649, 11238167, 11895164, 12613921, 13396985, 14258706, 15216138, 16277233, 17451309, 18762959, 20242625, 21914036, 23807244, 25975643, 28486839, 31412121, 34848147, 38944496, 43901141, 49962890, 57441147, 66723264, 78245057, 92506767, 110192832, 132284365, 159993503, 194466822, 236228332, 284264745, 334965124, 381818401, 416862693, 433653857]
58181D33653857l687804k1600343l3883987m0009700m1202584l9217655l5579919
58174B18471865l1351768k7142434k3218400j9664523j6503292j3729032j1314446
58167G5547970r230401p451732n940840m643786l503107k458207j438200l76613
58159D0505084P53619J895810K853432L277864K814483J387202o34288k610177
58151E0243029m020052m704280m794965m512457m045121l528519l041142k605148
58143A8991345k216704j877068j589052j344000j132007r54257q11858o94326
58135H372073n91639n06548m43364l95320l53902l20499k98350k82354k66509
58126D913588k52691k43065k32223k15381j96547j80716j65591j48187j31814
$$ y = [433653857, 429966053, 408365710, 374481723, 334472023, 293269439, 254051784, 218471865, 187120097, 159977663, 136759263, 117094740, 100591448, 86862416, 75547970, 66317569, 58865837, 52924997, 48281211, 44778104, 42319897, 40881697, 40505084, 41258703, 43154513, 46007945, 49285809, 52100292, 53487494, 52853206, 50243029, 46222977, 41518697, 36723732, 32211275, 28166154, 24637635, 21596493, 18991345, 16774641, 14897573, 13308521, 11964521, 10832514, 9878257, 9066399, 8372073, 7780434, 7273886, 6830522, 6435202, 6081300, 5760801, 5462451, 5180097, 4913588, 4660897, 4417832, 4185609, 3970228, 3773681, 3592965, 3427374, 3279187, 3147373]
58117C147373j19339j07211r3136q2470q0040q2322q4056q5814q8870q9551q5273
58106B149291p9999p7496p5041o9493o3579o0355n7348n2001m7355m6505m6601
58095A473518m3966m0303l8646l7877l6162l5093l5597l4525k9990k5443k3911
58084A092005k3023k0176j7766j8487k0173k0092j9878k1435k2319k0001j6746
58073H71909j5611j5507j4514j4025j5174j5284j2378r371r200r741q041n782
58061G27281n674o125m456k189k272l912m823n756q304j0819j1008j0121j0307
58048F41515j0387q395n857n308n802m995l447k963k847j664n70j058j515K04
58034E86911K885M277M990O407P013M804J329o20j414k865m117l307j645j711
$$ y = [3147373, 3028034, 2920823, 2827687, 2745217, 2665177, 2582855, 2498799, 2412985, 2324115, 2234564, 2149291, 2069292, 1991796, 1916755, 1847262, 1783683, 1723328, 1665980, 1613979, 1566624, 1520119, 1473518, 1429552, 1389249, 1350603, 1312726, 1276564, 1241471, 1205874, 1171349, 1141359, 1115916, 1092005, 1068982, 1048806, 1031040, 1012553, 992380, 972288, 952410, 930975, 908656, 888655, 871909, 856298, 840791, 826277, 812252, 797078, 781794, 769416, 760045, 750845, 741104, 733063, 727281, 721607, 715482, 711026, 708837, 706565, 702653, 697830, 692074, 683770, 672951, 661943, 651822, 641515, 631128, 622733, 616876, 611568, 605766, 600771, 597324, 594361, 591514, 589850, 589280, 588222, 586707, 586911, 589796, 594073, 599063, 605470, 612483, 617287, 618616, 617996, 616582, 613717, 609600, 606293, 604648, 602937]
58020F02937l098l570l229l721m564m048k812k818l707l612k744k741l311k788
58006E56174j427r31j320j290j070k090m235o006o861p118o406m536k880k514
57992E07490k014N05M167O537O853N723K967j533n964q237q680q703p990n537
57978D85584k399o07k48o0L8n91j341j380j578k971m400m234l274l363m172m164
57962D50840l650m010m753m285k975k610l375l993m263m710m381j898J681L827
57948D11445M175M550N696O540O617O546O147M486J935J6q46j627k860m337o191
57933D42292q484j0154j0289r824j0124j0707j0368r548r284q813o893m604l953
57920C29247m317l283o84J226J599J962L178M268M717N286O104O358O360P574
$$ y = [602937, 599839, 596269, 593040, 589319, 584755, 580707, 577895, 575077, 571370, 567758, 565014, 562273, 558962, 556174, 554747, 553816, 552496, 551206, 550136, 548046, 543811, 537805, 530944, 523826, 517420, 512884, 510004, 507490, 505476, 505981, 510148, 516685, 523538, 529261, 532228, 530695, 524731, 516494, 507814, 499111, 491121, 485584, 483185, 482578, 482330, 482270, 482308, 481717, 480376, 478996, 477418, 474447, 470047, 465813, 462539, 459176, 455004, 450840, 447190, 443180, 438427, 434142, 431167, 428557, 425182, 421189, 416926, 412216, 407835, 405937, 407618, 411445, 415620, 420170, 425866, 432406, 439023, 445569, 451716, 456202, 458137, 458153, 457307, 455680, 452820, 448483, 442292, 433808, 423654, 413365, 403541, 393417, 382710, 372342, 362794, 353510, 344697, 337804, 333200, 329247, 324930, 321647, 320963, 322189, 323788, 325750, 328928, 333196, 337913, 343199, 349303, 355661, 362021, 369595]
57906C69595J0070J2068J2527J2142J1446R999P872N859L916J316j368k591k452
57893D50399k845m554o277p026p381p777p645o978o837p465p592o414m657l091
57879C63860j625m40l15j018r98N28K507L785M517N157N492N462N770O834P996
57864D07512Q414P951O874N424M052L143K415J304j12j377k561l848m684m583
57850D29924m345m940n725n404m353m062m549m521l926m079m918m631k626p27
57836C71118m72j186j668k070l033m354n524o420o850o641o561p704r485r996
57822B99154q876p972q341q606p482o035n846o378n998m568l325k769k290j485
57808B19183o53k1N65J276K182L212L975M065L941M750O885R249J0440J0065Q676
$$ y = [369595, 379665, 391733, 404260, 416402, 427848, 437847, 445719, 451578, 455494, 456810, 455442, 452851, 450399, 447554, 443000, 436723, 429697, 422316, 414539, 406894, 399916, 393079, 385614, 378022, 371608, 366951, 363860, 362235, 361795, 361480, 360462, 359464, 359992, 362499, 366284, 370801, 375958, 381450, 386912, 392682, 399516, 407512, 415926, 423877, 430751, 436175, 440227, 443370, 445785, 447089, 446977, 445600, 443039, 439191, 434507, 429924, 425579, 420639, 414914, 409510, 405157, 401095, 396546, 392025, 388099, 384020, 379102, 374471, 371845, 371118, 370646, 369460, 367792, 365722, 362689, 358335, 352811, 346391, 339541, 332900, 326339, 318635, 309150, 299154, 290278, 282306, 273965, 265359, 257877, 251842, 245996, 239618, 233620, 229052, 225727, 222958, 220668, 219183, 218530, 218509, 219074, 220350, 222532, 225744, 229719, 233784, 237725, 242475, 249360, 258609, 269049, 279114, 287790]
57793B87790P049N897N573N735N831N913O215O130M717K330M06o20j830l901o022
57778C31213p338q093q634q567p842p485q109q662p775n686l703k437j573r04
57764B44405n28k02N38J645K549K854K671K416K496L067L873M553N043N408N495
57749B86283N278N272N841O309N822M874M840N903O806O776O442O419O361O002
57735C69228N912O429O902O761O400O375O612P082Q229J0043J1597J2406J3341
57722D77317J5289J7737J9580K0677K1655K2799K4036K5555K7579K9747L1580
57711G33551L3218L5211L7916M1522M6253N2131N8948O6858P6339Q7260R8670
57700A367877J09977J21580J34033J47393J61979J78624J97251K15949K32312
$$ y = [287790, 294839, 300736, 306309, 312044, 317875, 323788, 330003, 336133, 340850, 343180, 343586, 342966, 341136, 337235, 331213, 323875, 315782, 307148, 298581, 290739, 283254, 275145, 266483, 258708, 253022, 249319, 246882, 245309, 244405, 243877, 243675, 244213, 245858, 248407, 251261, 253932, 256348, 258844, 261911, 265784, 270337, 275380, 280788, 286283, 291561, 296833, 302674, 308983, 314805, 319679, 324519, 330422, 337228, 344004, 350446, 356865, 363226, 369228, 375140, 381569, 388471, 395232, 401632, 408007, 414619, 421701, 429930, 439973, 451570, 463976, 477317, 492606, 510343, 529923, 550600, 572255, 595054, 619090, 644645, 672224, 701971, 733551, 766769, 801980, 839896, 881418, 927671, 979802, 1038750, 1105608, 1181947, 1269207, 1367877, 1477854, 1599434, 1733467, 1880860, 2042839, 2221463, 2418714, 2634663, 2866975]
57691B866975K44924K52553K52582K41594K17508J80528J32636P7109J8252l9397
57681D445264r1892j35860j68635j89370j99600k01666j96736j85003j67319j45561
57671B763622j21313r4989o6286l5046k228K8655N0814N6102L9449K770m4685
57660B576865r0052j22617j38158j39052j30641j17380j01693q4926o8235n2618
57650A531493l8661k6374j5114m101O832J7268K7253L7578M8719O0080P1026Q2217
57638A798216R5161J10582J27818J45730J63539J80764J96735K10258K19537K22495
57628C470835K17230K02208J76258J39158R2555L9972j4388o6695j13644j52555
57618C990934j81977k01832k12713k15534k12025k04667j95390j84658j72265
$$ y = [2866975, 3111899, 3364452, 3617034, 3858628, 4076136, 4256664, 4389300, 4466409, 4484661, 4445264, 4353372, 4217512, 4048877, 3859507, 3659907, 3458241, 3261505, 3076502, 2909183, 2763622, 2642309, 2547320, 2481034, 2445988, 2443760, 2472415, 2523229, 2579331, 2618780, 2621550, 2576865, 2486813, 2364196, 2226038, 2086986, 1956345, 1838965, 1737272, 1652346, 1584111, 1531493, 1492832, 1466458, 1451344, 1447243, 1454075, 1471343, 1498596, 1536174, 1584893, 1644973, 1715999, 1798216, 1893377, 2003959, 2131777, 2277507, 2441046, 2621810, 2818545, 3028803, 3248340, 3470835, 3688065, 3890273, 4066531, 4205689, 4298244, 4338216, 4323828, 4257133, 4143489, 3990934, 3808957, 3607125, 3394412, 3178878, 2966853, 2762186, 2566796, 2382138, 2209873]
57609B209873j58611j44752j31566j19438j08375r8086q8237p8976p0791o3715
57599A147326n7280n1462m6831m3330l9880l5877l2223k9900k8263k5908k2788
57588G33584k0206j8836j7882j6374j4372j2596j1474j0814j0049q679o766m973
57576E80563l846l178k379j271q7J064K310L667M921N861O410O714P241Q445J0164
57561F26599J1741J2940J4259J6045J7984J9877K2293K5782K9929L3916L7680
57550H69045M1858M6855N2604N9063O6394P4785Q4491R5653J07779J19841J31465
57539A749833J43333J55808J67673J76928J82183J82320J75458J59579J34211
57530C227326J00625O0767J7065k7021o7699j02505j30525j51131j63792j69232
$$ y = [2209873, 2051262, 1906510, 1774944, 1655506, 1547131, 1449045, 1360808, 1281832, 1211041, 1147326, 1090046, 1038584, 991753, 948423, 908543, 872666, 840443, 810543, 782280, 756372, 733584, 713378, 694542, 676660, 660286, 645914, 633318, 621844, 611030, 600981, 592302, 585536, 580563, 576717, 573539, 571160, 569889, 569802, 570866, 573176, 576843, 581764, 587625, 594035, 600749, 607990, 616435, 626599, 638340, 651280, 665539, 681584, 699568, 719445, 741738, 767520, 797449, 831365, 869045, 910903, 957758, 1010362, 1069425, 1135819, 1210604, 1295095, 1390748, 1498527, 1618368, 1749833, 1893166, 2048974, 2216647, 2393575, 2575758, 2758078, 2933536, 3093115, 3227326, 3327951, 3388718, 3405783, 3378762, 3311063, 3208558, 3078033, 2926902, 2763110, 2593878]
57520B593878j69463j66008j59061j48876j36975j25026j13378j01555q9808p9138
57510A304590o9983o1719n3621m5751l8671l2695k7648k3192j9107j5289j1622
57499I05292q000m453j009K517O334J0172J3418J6040J9049K3582K9604L6101
57487A048647M2377M8785N6111O4807P4819Q5828R7431J09419J21930J35047J48139
57476B033340J59846J68666J73237J72023J63253J45565J18737Q3819M2851j345
57466C259992m5431q6104j20773j47943j67091j78361j82468j80712j74721j65824
57456A810564j54799j42376j29696j17769j06666r5892q5542p6359o8530o1330
57446G71605n4373m8428m4209m1052l7623l3637k9962k7216k5046k2927k0914
$$ y = [2593878, 2424415, 2258407, 2099346, 1950470, 1813495, 1688469, 1575091, 1473536, 1383728, 1304590, 1234607, 1172888, 1119267, 1073516, 1034845, 1002150, 974502, 951310, 932203, 916914, 905292, 897292, 892839, 891830, 894347, 900681, 910853, 924271, 940311, 959360, 982942, 1012546, 1048647, 1091024, 1139809, 1195920, 1260727, 1335546, 1421374, 1518805, 1628224, 1750154, 1885201, 2033340, 2193186, 2361852, 2535089, 2707112, 2870365, 3015930, 3134667, 3218486, 3261337, 3259992, 3214561, 3128457, 3007684, 2859741, 2692650, 2514289, 2331821, 2151109, 1976388, 1810564, 1655765, 1513389, 1383693, 1265924, 1159258, 1063366, 977824, 901465, 832935, 771605, 717232, 668804, 624595, 583543, 545920, 512283, 482321, 455105, 430059, 407132, 386218]
57435C86218j9355j8310j7450j6274j4515j2488j0954j0384j0465j0591j0557
57424B34875j0411r962q948p601o542o174o402o817o871o149m839l652k990k563
57410A44954k192k320l140l791l372k311j754j877j880j508j330j489j387r69
57396A15634j070j956k524j822n29j2n18j151j310j208j131r70o49l77l73o54
57380I9380j157j693j839j274l76j6n60j410j772j617j472j477j212n07J44K63
57364H3405Q8Q5K26K41L76J129K259K834K399J402K40j261k993m001l565k297
57348H0567j443j390j557j404q42Q9J231K095K285K057J863J633J137Q14J367
57333H8502K552L303L168K834K967L311L378L381L895M887N646N615N058M810
$$ y = [386218, 366863, 348553, 331103, 314829, 300314, 287826, 276872, 266488, 256023, 245432, 234875, 224464, 214502, 205554, 197953, 191411, 185237, 178835, 172018, 165147, 158998, 154159, 150507, 147517, 144954, 142762, 140442, 137302, 133511, 130139, 127828, 126074, 124197, 122317, 120809, 119479, 117990, 116603, 115634, 114564, 112608, 110084, 108262, 107733, 107721, 107203, 106052, 104742, 103534, 102403, 101433, 100784, 100407, 100034, 99380, 98223, 96530, 94691, 93417, 93041, 93025, 92465, 91055, 89283, 87666, 86194, 84717, 83505, 82998, 83142, 83405, 83493, 83578, 83804, 84045, 84421, 85550, 87809, 90643, 93042, 94444, 94684, 93423, 90430, 86429, 82864, 80567, 79124, 77734, 76177, 74773, 73931, 74020, 75251, 77346, 79631, 81688, 83551, 85184, 86321, 87135, 88502, 91054, 94357, 97525, 100359, 103326, 106637, 110015, 113396, 117291, 122178, 127824, 133439, 138497, 143307]
57319A43307N415O566P456P751P897Q360Q965R347R681J0438J1672J3089J4611
57306B64555J6280J7760J8599J9030J9822K1329K3156K4820K6205K7364K8313
57295E07233K9028K9240K8279K5679K1806J7396J2522O633m13p927j5038k1236
57283F33202k6303l0228l3197l5213l5915l5250l4061l3140l2028k9581k5771
57272B82515k1854j8745j6238j3987j2168j0792r328p607o273n755n445m484k837
57259A47002j144N2M89J26o39j085q73k64M81J443K525L266L492L559L738L939
57243A66107M331N479P439R416J0900J2393J4379J6221J6855J6236J5391J5192
57231C10339J5693J6520J7433J8490J9935K1787K3676K5384K7399L0298L3573
$$ y = [143307, 148722, 155288, 162744, 170495, 178392, 186752, 195717, 205064, 214745, 225183, 236855, 249944, 264555, 280835, 298595, 317194, 336224, 356046, 377375, 400531, 425351, 451556, 478920, 507233, 536261, 565501, 593780, 619459, 641265, 658661, 671183, 677816, 677403, 669476, 654438, 633202, 606899, 576671, 543474, 508261, 472346, 437096, 403035, 369895, 337867, 308286, 282515, 260661, 241916, 225678, 211691, 199523, 188731, 179403, 171796, 165523, 159768, 154323, 149839, 147002, 145858, 145910, 146399, 146525, 145886, 144801, 143928, 143664, 144145, 145588, 148113, 151379, 154871, 158430, 162168, 166107, 170438, 175917, 183356, 192772, 203672, 216065, 230444, 246665, 263520, 279756, 295147, 310339, 326032, 342552, 359985, 378475, 398410, 420197, 443873, 469257, 496656, 526954, 560527]
57220E60527L5996L7313L8564M0400M2216M3487M4782M6401M7099M5502M2241
57209A024528L9330L7739L6822L6000L5639L6058L6744L7000L6686L6005L5036
57198A427587L3704L1829K9072K5240K0744J6577J3712J2731J3640J5724J7776
57187A658336J8925J9167J8913J8351J7595J7070J7127J7513J7755J7843J8112
57176A856707J8647J9372K0436K1916K3367K4277K4828K5539K6291K6456K5925
57165B113761K5421K5539K6056K6296K5886K5025K4290K4148K4438K4520K4177
57154B389557K4055K4786K5993K6732K6670K6285K6108K6277K6794K7564K8289
57143B679110K8808K9532L1010L3278L6058L9504M4200N0601N8673O7309P3052
$$ y = [560527, 596523, 633836, 672400, 712800, 755016, 798503, 843285, 889686, 936785, 982287, 1024528, 1063858, 1101597, 1138419, 1174419, 1210058, 1246116, 1282860, 1319860, 1356546, 1392551, 1427587, 1461291, 1493120, 1522192, 1547432, 1568176, 1584753, 1598465, 1611196, 1624836, 1640560, 1658336, 1677261, 1696428, 1715341, 1733692, 1751287, 1768357, 1785484, 1802997, 1820752, 1838595, 1856707, 1875354, 1894726, 1915162, 1937078, 1960445, 1984722, 2009550, 2035089, 2061380, 2087836, 2113761, 2139182, 2164721, 2190777, 2217073, 2242959, 2267984, 2292274, 2316422, 2340860, 2365380, 2389557, 2413612, 2438398, 2464391, 2491123, 2517793, 2544078, 2570186, 2596463, 2623257, 2650821, 2679110, 2707918, 2737450, 2768460, 2801738, 2837796, 2877300, 2921500, 2972101, 3030774, 3098083, 3171135]
57132C171135P0091N3731K5215p184l2749m4674m3210l4175k4780j9498j8365
57121C095537j8658j8149j6807j5849j5995j6865j7526j7189j5693j3365j0321
57110B919120n930N20Q736J7662K6979L7721N1097O7316Q6165J08465J36452J72852
57098C627155K20075K80387L56553M52054N70597P15175Q86879J083588J299075
57089I491538J523336J743881J946724K117186K242619K316393K337195K300030
57081B6018902K188044J979925J671823J291189Q83724M84430J02642k66186o19720
57072C3734773r42437j216147j432314j595025j715953j806948j873756j913316
57064B1238877j916507j874884j786539j657690j500374j328731j155837r91906
$$ y = [3171135, 3241226, 3294957, 3320172, 3312988, 3280239, 3235565, 3192355, 3158180, 3133400, 3113902, 3095537, 3076879, 3058730, 3041923, 3026074, 3010079, 2993214, 2975688, 2958499, 2942806, 2929441, 2919120, 2913190, 2913710, 2922446, 2940108, 2967087, 3004808, 3055905, 3123221, 3209386, 3317851, 3454303, 3627155, 3847230, 4127617, 4484170, 4936224, 5506821, 6221996, 7108875, 8192463, 9491538, 11014874, 12758755, 14705479, 16822665, 19065284, 21381677, 23718872, 26018902, 28206946, 30186871, 31858694, 33149883, 34033607, 34518037, 34620679, 34354493, 33734773, 32792336, 31576189, 30143875, 28548850, 26832897, 25025949, 23152193, 21238877, 19322370, 17447486, 15660947, 14003257, 12502883, 11174152, 10018315, 9026409]
57056I026409q43638p14087o03087n08695m29054l63018l09331k66149k31716
57047D757634k04961j84873j69939j58548j49508j41682j33701j24692j15007
57038C374723j05662r7372r0400q4840q0434p6524p2668o8980o5455o1551n7015
57027B513822n2644m9461m7513m6218m5433m5366m5618m5269m3935m2011l9832
57016B010522l7285l4296l1092k7779k4148j9997j5374j0341m766J853J0662K3288
57004A841247M0835O2924Q7539J10872J26291J24506R7701M6015j9709q2730j29335
56993B306156j54608j61478j55915j43247j27366j10939r5106p9428o3296m7495
56983A167278l3812k3342j6059j2047j1914j5303k0072k3922k6369k8253k9815
$$ y = [9026409, 8182771, 7468684, 6865597, 6356902, 5927848, 5564830, 5255499, 4989350, 4757634, 4552673, 4367800, 4197861, 4039313, 3889805, 3748123, 3614422, 3489730, 3374723, 3269061, 3171689, 3081289, 2996449, 2916015, 2839491, 2766823, 2697843, 2632388, 2570837, 2513822, 2461178, 2411717, 2364204, 2317986, 2272553, 2227187, 2181569, 2136300, 2092365, 2050354, 2010522, 1973237, 1938941, 1907849, 1880070, 1855922, 1835925, 1820551, 1810210, 1805444, 1807297, 1817959, 1841247, 1882082, 1945006, 2032545, 2143417, 2269708, 2394214, 2491915, 2537930, 2518221, 2435491, 2306156, 2151548, 1990070, 1834155, 1690908, 1563542, 1452603, 1357497, 1278069, 1214773, 1167278, 1133466, 1110124, 1094065, 1082018, 1070104, 1054801, 1034729, 1010807, 984438, 956185, 926370]
56972I26370l0369k9632k8245k6749k4892k2311j9285j6399j3791j1014p479k974
56960F93230K156P290J2082J6489K0064K1424J8837J1534N34j1599k1895k8514
56948G41632l1585l2437l1915k9946k6684k3140k0132j7396j4298j0897p490l828
56936D91884L64M661Q689J3247J9475K6925L3242L5693L2465K3153R247n950j9041
56923F74054k8517l4488l7080l6268l3099k9489k6435k3515k0338j7376j4971
56912C72478j2757j0553q832p756o735n479m597m526m769m740m538m288l615k490
56898B86803j699j640j423j35J702L013L901N416P849J0426J2672J5005J7785
56885C59675K0453K1846K0933J7239J1147L974k645p680j0987j2850j3520j3095
$$ y = [926370, 896001, 866369, 838124, 811375, 786483, 764172, 744887, 728488, 714697, 703683, 696204, 693230, 695386, 702676, 714758, 731247, 751311, 772735, 791572, 803106, 803640, 792041, 770146, 741632, 710047, 677610, 645695, 615749, 589065, 565925, 545793, 528397, 514099, 503202, 495712, 491884, 492248, 496909, 505598, 518845, 538320, 565245, 598487, 634180, 666645, 689798, 699045, 693095, 674054, 645537, 611049, 573969, 537701, 504602, 475113, 448678, 425163, 404825, 387449, 372478, 359721, 349168, 340336, 332580, 325845, 320366, 315769, 311243, 306474, 301734, 297196, 292908, 289293, 286803, 285104, 283464, 282041, 281906, 283608, 286621, 290522, 295938, 303787, 314213, 326885, 341890, 359675, 380128, 401974, 422907, 440146, 451293, 455267, 452622, 444942, 433955, 421105, 407585, 394490]
56873C94490j1645r441p041m902k821k07L017O325R613J3552J8618K4406L0540
56860D64504L7420M4899N0514N0272M1701K5913O749j1466k5532l3960l6976l5992
56848E78046l2787k8761k4596k0302j5575j0341m844Q04O900J3766K1467L0160
56836E13937M0434N2745O6434P9295Q7855Q8019P6428N2559K0141j3877m2454
56825A021516o1406p0351p1549o7923o1621n3855m5486l7313k9770k2761j6045
56814D83436r481k798M478J2684K1859L2082M3390N4893O4035O7062O0556M3283
56802H75479J7713j0110l3306m7943n4405n5370n3153m9066m3972l8376l2427
56791D75064k6501k1343j7064j2671p427k014K645P149J2983K0301K7530L2955
$$ y = [394490, 382845, 373404, 366363, 361461, 358640, 358433, 361450, 367775, 377388, 390940, 409558, 433964, 464504, 501924, 546823, 597337, 647609, 689310, 715223, 721972, 710506, 684974, 651014, 614038, 578046, 545259, 516498, 491902, 471600, 456025, 445684, 440840, 441644, 448544, 462310, 483777, 513937, 554371, 607116, 673550, 752845, 840700, 928719, 1005147, 1057706, 1077847, 1063970, 1021516, 960110, 889759, 818210, 750287, 688666, 634811, 589325, 552012, 522242, 499481, 483436, 473955, 471157, 475635, 488319, 510178, 542260, 585650, 640543, 704578, 771640, 832196, 875479, 893192, 883082, 849776, 801833, 747428, 692058, 638905, 589839, 545867, 507491, 475064, 448563, 427220, 410156, 397485, 390058, 388044, 390689, 397838, 410821, 431122, 458652, 491607]
56779D91607L5512L3943K6725J3807k148j7035k7793l3700l5774l5308l2897k8804
56767C88135k3996k0126j7913j6217j3628j0527q495p852p191n581l907l387l748
56754B45567l803l150k356j831j428j074j044j431j837j849j586j548j940k416
56740B18274k550k499k800l495l847l248k060j174r38r95r30o20j39J83j94j323
56724A91645k309k204j289o69p03o64j33K68p2p08q30l89OL3q4q7QR4J02J7r9
56703A81933j15L1K17K54J7m11o35j34J099K314K675K127J258M55k58o87m41L81
56685A90080J061J049N45P2j90m29q53j425j810j577p22J12K75o6j98J11K89k40
56667A86084j348k363k597j840o52o0m63j018p59j5O0o79j127o78j24l27r08r98
$$ y = [491607, 527119, 561062, 587787, 601594, 599446, 582411, 554618, 520918, 485144, 449836, 416939, 388135, 364139, 344013, 326100, 309883, 296255, 285728, 277233, 269381, 262190, 256609, 252702, 249315, 245567, 241764, 238614, 236258, 234427, 232999, 231925, 230881, 229450, 227613, 225764, 224178, 222630, 220690, 218274, 215724, 213225, 210425, 206930, 203083, 199835, 197775, 196601, 195663, 194668, 193738, 193118, 192979, 193162, 192968, 191645, 189336, 187132, 185843, 185174, 184471, 183807, 183674, 183942, 183870, 183162, 182332, 181943, 181949, 181982, 181898, 181811, 181819, 181913, 182015, 182032, 181933, 181818, 181849, 182066, 182320, 182337, 181926, 181291, 181157, 182256, 184570, 187245, 189372, 190630, 191085, 190827, 190140, 189699, 190080, 191141, 192190, 192735, 192807, 192617, 192188, 191335, 189910, 188100, 186523, 185801, 185913, 186188, 186122, 185924, 186035, 186324, 186084, 184736, 182373, 179776, 177936, 177284, 177224, 176761, 175743, 174984, 174969, 175029, 174350, 173223, 172545, 172421, 172094, 171186, 170188]
56649A70188o13m11n59o09l97k92n49q80q17l03J81R9m42o45OQ83R09O1m74Q8
56629A65424J121J595J428J239J198R00K55j86M9P14J118Q88L19J5J92N06N49
56612A77324L85L28M11L78J29k03n19o99m39L52J106J079L22l86n99n91o31n12
56594A77235r6K65J76k39m55m7R60J953K052J033j60l90K71P73N93K39K04L43
56576A84710M71P72J287J702J929K261K679K758K469K379K679K847K604K450K766
56561B16763L157L201L177L514M082M548M855M891M351L361K638K525K463J937
56547B65463J309J107J113Q12J97m79j224k049k614k722k687k752k630k206k014
56532B48624k427k948l019k998l557m471m791m070k788j711j283j417j562j229
$$ y = [170188, 169575, 169164, 168605, 167996, 167599, 167307, 166758, 165878, 165061, 164758, 164939, 165038, 164596, 163951, 163957, 164840, 165749, 165810, 165336, 165424, 166545, 168140, 169568, 170807, 172005, 172905, 173160, 172974, 173023, 173737, 174855, 175743, 176062, 176077, 176269, 176775, 177324, 177709, 178037, 178448, 178826, 178955, 178752, 178233, 177534, 177095, 177447, 178553, 179632, 179954, 179568, 178969, 178378, 177747, 177235, 177139, 177404, 177580, 177341, 176886, 176839, 177799, 179752, 181804, 182837, 182677, 182287, 182558, 183331, 183924, 184163, 184367, 184710, 185181, 185953, 187240, 188942, 190871, 193132, 195811, 198569, 201038, 203417, 206096, 208943, 211547, 213997, 216763, 219920, 223121, 226298, 229812, 233894, 238442, 243297, 248188, 252539, 255900, 258538, 261063, 263526, 265463, 266772, 267879, 268992, 269804, 270001, 269522, 268298, 266249, 263635, 260913, 258226, 255474, 252844, 250638, 248624, 246197, 243249, 240230, 237232, 233675, 229204, 224413, 220343, 217555, 215844, 214561, 213144, 211582, 210353]
56518B10353o90p26j426j935j671j151j095j431j713j857j883j567r41m75k91
56503A91501R5P40Q88K78q3O14J631J805J272R25Q38M63n4k2O38J381J917K210
56485B07037J973J136M43N67J014R30N51P67J501J821J478J176J339J654J865
56470B25252K061K116J810J441J497J791J738J382J289J498J566J478J610J818
56456B48347J506O96N2j48k76n09n64l66k84n55j028j411j310l18J295K404K297
56439B49828J746J849K320K021R14Q6o1k54q86j378j383j436j940k385k125j264
56423B45652m20j13o03j716k712k907k489k212k353k569k638k625k404j791j088
56408B17012p11m30K54J116J451J164P80N06K10J29N57R65N75j74k7J171K131
$$ y = [210353, 209663, 208937, 207511, 205576, 203905, 202754, 201659, 200228, 198515, 196658, 194775, 193208, 192267, 191792, 191501, 191596, 192336, 193224, 193502, 193419, 194033, 195664, 197469, 198741, 199666, 200504, 200967, 200913, 200891, 201529, 202910, 204827, 207037, 209010, 210146, 210589, 211156, 212170, 213100, 213651, 214418, 215919, 217740, 219218, 220394, 221733, 223387, 225252, 227313, 229429, 231239, 232680, 234177, 235968, 237706, 239088, 240377, 241875, 243441, 244919, 246529, 248347, 249853, 250549, 250601, 250453, 250177, 249668, 249104, 248738, 248454, 247899, 246871, 245460, 244150, 243832, 245127, 247531, 249828, 251574, 253423, 255743, 257764, 258678, 258764, 258703, 258449, 257563, 256185, 254802, 253366, 251426, 249041, 246916, 245652, 245232, 245119, 244516, 242800, 240088, 237181, 234692, 232480, 230127, 227558, 224920, 222295, 219891, 218100, 217012, 216301, 215871, 216125, 217241, 218692, 219856, 220636, 221142, 221352, 221481, 222038, 223003, 223578, 223404, 223377, 224548, 226679]
56391B26679J959J196O83M69L55N15R92J341J258J035J008J152J414J907K425
56376B44388K405J615M95k83k89M93J520J866J204L48K41P45J135J340J736K101
56360B61060J917J484J573K085K178J623R74M99J10J35R77K045K354K067K158
56345B83239K682K912L120M486O860Q434Q188P216O910P190P299P090O739O146
56331C68511N363M808M495L885K893K127J759J166R7p44p97m04j24r6l56r22j275
56314C90386q44r9j52j079j737j467q25l73j6K37J11p4L57J085J097N29O26J565
56296C89327K074J749J928L345M742M896M496M748N522O081O507P132P619P774
56282D57940Q360R955J1832J2994J3527J4066J4785J5782J7541K0103K2615K4565
$$ y = [226679, 228638, 229834, 230517, 230986, 231341, 231856, 232848, 234189, 235447, 236482, 237490, 238642, 240056, 241963, 244388, 246793, 248408, 248903, 248620, 248331, 248824, 250344, 252210, 253414, 253762, 254003, 254748, 255883, 257223, 258959, 261060, 262977, 264461, 266034, 268119, 270297, 271920, 272894, 273393, 273503, 273638, 274615, 276660, 279014, 281081, 283239, 285921, 288833, 291953, 296439, 303299, 311733, 319921, 327137, 334047, 341237, 348536, 355626, 362365, 368511, 373874, 378682, 383177, 387062, 389955, 392082, 393841, 395007, 395104, 394360, 393563, 393159, 393035, 392939, 392583, 391661, 390386, 389542, 389443, 389291, 388212, 386475, 385008, 384183, 383810, 383794, 384031, 384142, 384068, 384425, 385510, 386607, 387136, 387762, 389327, 391401, 393150, 395078, 398423, 403165, 408061, 412557, 417305, 422827, 428908, 435415, 442547, 450166, 457940, 466300, 476255, 488087, 501081, 514608, 528674, 543459, 559241, 576782, 596885, 619500, 644065]
56270F44065K6618K9446L2748L6210M0411M5812N1788N7589O3475P0042P7216
56259A175420Q4717R2567J00408J07222J12503J16600J19269J19125J15525J09707
56249B253063J02948R4746Q4105P1586N8714M6184L4029K2808J3295N460j187
56238B785751o734j1296j5633k0366k5241l0057l5612m2779n1221o0044o8921
56227B417847p7654q5334r0990r4618r6746r7525r7003r5580r3359q9830q4940
56216A414268p9698p4889p0010o4393n8521n3215m8338m3378l8609l4638l1285
56205H17294k7951k4621k1662j9037j6455j3914j1529r282p350o025n016l637
56193F50815j981q97m43M25K156L815M665N228O073O771O817O393N492L565Q91
$$ y = [644065, 670683, 700129, 732877, 769087, 809498, 855310, 907098, 964687, 1028162, 1098204, 1175420, 1260137, 1352704, 1453112, 1560334, 1672837, 1789437, 1908706, 2027831, 2143356, 2253063, 2356011, 2450757, 2534862, 2606448, 2665162, 2711346, 2745375, 2768183, 2781478, 2786938, 2785751, 2779017, 2767721, 2752088, 2731722, 2706481, 2676424, 2640812, 2598033, 2546812, 2486768, 2417847, 2340193, 2254859, 2163869, 2069251, 1972505, 1874980, 1777977, 1682397, 1589038, 1499208, 1414268, 1334570, 1259681, 1189671, 1125278, 1066757, 1013542, 965204, 921826, 883217, 848579, 817294, 789343, 764722, 743060, 724023, 707568, 693654, 682125, 672843, 665493, 659468, 654452, 650815, 648834, 647937, 647494, 647919, 650075, 653890, 658555, 663783, 669856, 676627, 683444, 689837, 695329, 698894, 699785]
56178F99785j030j380j163j549k301k718k901l152l183k820k433k056j237k07
56164F71655K95P02K318M803O114N793N989Q037J0314J1040J0973J1464J1957
56151G61454J1496J1015J1939J3873J5672J7557K0271K3403K6463L0601L7635
56140I81379M8426O3517Q3841J09027J36097J61295J81842J94941J97272J87740
56130B345377J69494J47592J25978J07893R6508R2409R1606Q8267P8675O1707
56120C405506L7967J0786j3854l1238m1162m6268m9433n4451o6239q6795j12186
56109B952633j36085j54945j67745j73087j69968j60188j46995j32144j16374
56100A595102j01184q7603p4734o2002n1182m3728l7967l1661k5525k1315j8313
$$ y = [699785, 698755, 697375, 696212, 694663, 692362, 689644, 686743, 683591, 680408, 677588, 675155, 673099, 671862, 671655, 671950, 672652, 674970, 679773, 685887, 691680, 697669, 705706, 716020, 727060, 738033, 749497, 761454, 772950, 783965, 795904, 809777, 825449, 843006, 863277, 886680, 913143, 943744, 981379, 1029805, 1093322, 1177163, 1286190, 1422287, 1583582, 1765424, 1960365, 2157637, 2345377, 2514871, 2662463, 2788441, 2896334, 2992842, 3085251, 3176857, 3265124, 3343799, 3405506, 3443473, 3454259, 3440405, 3409167, 3368005, 3321737, 3272304, 3217853, 3151614, 3064819, 2952633, 2816548, 2661603, 2493858, 2320771, 2150803, 1990615, 1843620, 1711476, 1595102, 1493918, 1406315, 1331581, 1269579, 1218397, 1174669, 1136702, 1105041, 1079516, 1058201, 1039888]
56089A039888j4857j1648j0172r456p663n459m509m030k202L05J552J831K752
56076I76332M122M837N535P162Q434P914P085Q006R574R565Q688R043J0182J0436
56062A086915J0425J1536J2691J2478J2604J5079J7873J7788J5856J5371J6284
56051A244900J6361J6211J8090K0976K1900K1166K1466K2940K3880K4986K7941
56040A480817L1070L1575L0820L2133L4808L5775L5729L7717M0715M0850L8164
56029A870173L6169L5317L3123L0126K9484L0998L1575L1312L3126L6726L9114
56018B237243M0608M4243M9616N3452N5720N9051O2997O5165O7029P1833P7927
56007B884884Q1195Q2844Q7298R3780R7972J00676J06376J14259J19635J23291
$$ y = [1039888, 1025031, 1013383, 1003211, 993755, 986092, 980633, 976124, 972094, 969892, 970197, 971749, 973580, 976332, 980454, 985291, 990826, 997988, 1006422, 1014336, 1021421, 1029427, 1039001, 1048566, 1057254, 1066297, 1076479, 1086915, 1097340, 1108876, 1121567, 1134045, 1146649, 1161728, 1179601, 1197389, 1213245, 1228616, 1244900, 1261261, 1277472, 1295562, 1316538, 1338438, 1359604, 1381070, 1404010, 1427890, 1452876, 1480817, 1511887, 1543462, 1574282, 1606415, 1641223, 1676998, 1712727, 1750444, 1791159, 1832009, 1870173, 1906342, 1941659, 1974782, 2004908, 2034392, 2065390, 2096965, 2128277, 2161403, 2198129, 2237243, 2277851, 2322094, 2371710, 2425162, 2480882, 2539933, 2602930, 2668095, 2735124, 2806957, 2884884, 2966079, 3048923, 3136221, 3230001, 3327973, 3428649, 3535025, 3649284, 3768919, 3892210]
55997C892210J30120J39205J44858J47125J51397J57960J62166J64894J72197
55988E262132J84408J96200K07528K23444K43101K60510K76481K97800L24390
55979G475994L49853L74879M06930M46285M86175N27123N76713O34992O95535
55970A1974479P61105Q41768R37474J040136J153128J289824J453257J638464
55962B1089635J855111K125416K460678K866221L370906M026077M878236N973164
55954D8645444P379792R169771J1385802J4097207J7500437K1894641K7492557
55947A57565651L4182601M1255062M7060355M8959430M4210130L1726232J3400822
55940D18360283o424968k3180469l4208682l9316471l9861101l7564469l3858838
$$ y = [3892210, 4022330, 4161535, 4306393, 4453518, 4604915, 4762875, 4925041, 5089935, 5262132, 5446540, 5642740, 5850268, 6073712, 6316813, 6577323, 6853804, 7151604, 7475994, 7825847, 8200726, 8607656, 9053941, 9540116, 10067239, 10643952, 11278944, 11974479, 12735584, 13577352, 14514826, 15554962, 16708090, 17997914, 19451171, 21089635, 22944746, 25070162, 27530840, 30397061, 33767967, 37794044, 42672280, 48645444, 56025236, 65195007, 76580809, 90678016, 108178453, 130073094, 157565651, 191748252, 233003314, 280063669, 329023099, 373233229, 404959461, 418360283, 411935315, 388754846, 354546164, 315229693, 275368592, 237804123, 203945285]
55933B03945285k9719482k5686363k1974600j8640843j5699833j3145307j0949813
55926F8129044r089512p549829o297965n277881m442281l765928l222664k775897
55918B5707087k400015k088628j834029j618314j430559j273149j144435j032219
55910A2885739r29747q41522p68003p00202o34347n76807n29577m85045m39966
55901F980523m00825l70477l42318l12762k87188k68457k51001k31320k13676
55892D302499k00595j87776j72966j60298j51531j42206j30583j21336j16407
55883B918801j10987j02653r5871r3261r0531q4431p8011p3796o9120o2456n7437
55872B000247n6280n5642n2923n0602n0549m9998m6895m3650m1979l9400l4201
$$ y = [203945285, 174225803, 148539440, 126564840, 107923997, 92224164, 79078857, 68129044, 59039532, 51489703, 45191738, 39913857, 35471576, 31705648, 28482984, 25707087, 23307072, 21218444, 19384415, 17766101, 16335542, 15062393, 13917958, 12885739, 11955992, 11114470, 10346467, 9646265, 9011918, 8435111, 7905534, 7420489, 6980523, 6579698, 6209221, 5866903, 5554141, 5266953, 4998496, 4747495, 4516175, 4302499, 4101904, 3914128, 3741162, 3580864, 3429333, 3287127, 3156544, 3035208, 2918801, 2807814, 2705161, 2609290, 2516029, 2425498, 2341067, 2263056, 2189260, 2120140, 2057684, 2000247, 1943967, 1888325, 1835402, 1784800, 1734251, 1684253, 1637358, 1593708, 1551729, 1512329, 1478128]
55861A478128k8868k5325k1601j6193j1192q521p512q223j2300j8556k2713k3621
55849A273503k4757k7745k9748k9339k9303l1092l1963l0425k9323l0448l1100
55838I48260k9101k6642k5935k5404k3250k0856j9647j8400j6299j4961j4871
55827G12894j3634j0215p191o414o242n361n412p277q616p820o833p421q085p204
55813F05169n914n441m875l842m070o064p542p316p306q594r121p608o130o246
55799E15100o225m607l171l596m554m754n559p854r560r130q345q815q837o706
55785D23387m035k627j154J662L337Q85m419q952j1595j3472j4678j4491j3494
55772C40354j2591j1192q766o739o504p038o740o023n923n760m498k822j827j146
$$ y = [1478128, 1449260, 1423935, 1402334, 1386141, 1374949, 1366428, 1358916, 1350693, 1338393, 1319837, 1297124, 1273503, 1248746, 1221001, 1191253, 1161914, 1132611, 1101519, 1069556, 1039131, 1009808, 979360, 948260, 919159, 892517, 866582, 841178, 817928, 797072, 777425, 759025, 742726, 727765, 712894, 699260, 689045, 681854, 675440, 669198, 663837, 658425, 651148, 642532, 634712, 627879, 620458, 612373, 605169, 599255, 593814, 588939, 585097, 581027, 574963, 567421, 560105, 552799, 544205, 535084, 527476, 521346, 515100, 508875, 504268, 501097, 497501, 492947, 488193, 482634, 474780, 465220, 456090, 447745, 438930, 430093, 423387, 419352, 416725, 415571, 417233, 420570, 421455, 417036, 408084, 396489, 383017, 368339, 353848, 340354, 327763, 316571, 307805, 301066, 294562, 287524, 280784, 274761, 268838, 263078, 258580, 255758, 253931, 252785]
55758B52785l20k15j115j284M41K540L336L802N561P789Q420O861L497j760q183
55743B82155j3167j4790j4042j2767j1090q804p191p052o721m569j897q72j105
55730A78088q79l38p72j849k164j776j827k346k518k415k583k639k062j455j423
55715A51042j229j38J079J607K210L662N048N455N890P424Q852Q504P183O841
55701B13430P273O578M161J093j986n098p499q125p326o534o332o207n800n177
55687A72451m223k985j997j416n77P17J541J450J464K389L486M013M584N665O179
55672A92741N192L637K773K278J334L25j29m78r90o86Q23J957J392J95r8j1p76
55655B09479j955k575l223m747o081n780m575m190m565m537m288m720n333n076
$$ y = [252785, 252465, 252250, 251135, 249851, 250292, 252832, 256168, 259970, 265531, 273320, 281740, 288601, 292098, 290338, 282155, 268988, 254198, 240156, 227389, 216299, 207495, 200304, 193252, 186531, 181962, 180065, 179193, 178088, 177209, 176871, 176099, 174250, 172086, 170310, 168483, 166137, 163619, 161204, 158621, 155982, 153920, 152465, 151042, 149813, 149675, 150754, 152361, 154571, 158233, 163281, 168736, 174626, 182050, 190902, 199406, 206589, 213430, 220703, 227281, 231442, 232535, 230549, 225451, 217952, 209827, 202501, 195967, 189635, 183428, 177628, 172451, 168228, 165243, 163246, 161830, 161253, 161970, 163511, 164961, 166425, 168814, 172300, 176313, 180897, 186562, 192741, 197933, 201570, 204343, 206621, 207955, 208280, 208151, 207673, 206683, 205997, 206820, 208777, 210169, 210364, 210266, 210255, 209479, 207524, 204949, 201726, 196979, 190898, 185118, 180543, 176353, 171788, 167251, 162963, 158243, 152910, 147834]
55641A47834m579n166o323o404n355m474m065l476k893k897k790j518J29M88l52
55626I8159r58j097j623k283k013j161j096j768j806r58l47l36k27k0m32j159
55610H0875j165o87r84k006k300j376k74L62Q92J202M88j095k228k229j680j044
55594F6751k45L90K79j68J04J095J786J847J815J628O78n90q10K21J184J231R74
55577G8170J107J413J599J914K558L412M563O246Q168R736J0871J1712J1839J0790
55563A64098R017P237N189K255j139m003o314q597j0413j0782r921r010q360p285
55549A11972n762m655m275m022l506k810j762k69Q66Q44L66P45J792K169J742
55534I3435J781K674L185K400R94m7o73j260j829k284k689l056l316l478l377
$$ y = [147834, 143255, 138089, 131766, 125362, 120007, 115533, 111468, 107992, 105099, 102202, 99412, 97894, 98023, 98511, 98159, 97201, 96104, 94481, 92198, 90185, 89024, 87928, 86160, 84354, 83396, 83049, 82713, 82486, 82466, 82034, 80875, 79710, 79023, 78039, 76033, 73733, 72357, 72083, 72445, 73337, 74539, 75027, 73932, 71704, 69475, 67795, 66751, 66506, 66896, 67175, 67007, 67111, 68206, 69992, 71839, 73654, 75282, 75960, 75370, 74560, 74781, 75965, 77196, 78170, 79277, 80690, 82289, 84203, 86761, 90173, 94736, 100982, 109150, 118886, 129757, 141469, 153308, 164098, 173115, 180352, 185541, 187796, 186657, 182654, 176340, 167743, 157330, 146548, 136627, 127617, 119257, 111972, 106210, 101555, 97280, 93258, 89752, 86942, 85180, 84911, 85777, 86621, 86987, 87732, 89524, 91693, 93435, 95216, 97890, 101075, 103475, 104469, 104422, 103749, 102489, 100660, 98376, 95687, 92631, 89315, 85837, 82460]
55519H2460k725j948k188l627m719m215k973k357j934n30J261J737P51l54j069
55504E7570j936k694k415j425j053j369j179l70j81q99j294p64j81j05K9M61M88
55487D2683j52p91j103j442j648j104j49J10l30l68J34Q9p16j133o92l39m91k36
55469C2322P97J519J112K32l35p82j294j404j005q02j062j229j195j546k056j519
55453B1753K84J935K388K231K254K210J768J312R36K4j401k172j581l51O96J562
55437C3848K139J710L01q57r75o82o44n64k92m41j039r52L04J508J554J007P86
55420C6711N60k64j062r25k06J29Q1L18R13J416J736J948J759J001K62K42Q47
55403D5466J491J852J812J212J63q78j655k314k755k582j859j175p54l26l8m04
$$ y = [82460, 79735, 77787, 75599, 71972, 67253, 63038, 60065, 57708, 55774, 55244, 56505, 58242, 58993, 58639, 57570, 55634, 52940, 50525, 49100, 48047, 46678, 45499, 45129, 44948, 44049, 42755, 41991, 41810, 41705, 41734, 42195, 42683, 42531, 41740, 40637, 39195, 37547, 36443, 36294, 36404, 36074, 35706, 35840, 35929, 35213, 34080, 33388, 33049, 32558, 32322, 33119, 34638, 35750, 35982, 35647, 34865, 33571, 32167, 31162, 30360, 29298, 28069, 26874, 25328, 23272, 21753, 22037, 23972, 26360, 28591, 30845, 33055, 34823, 36135, 37071, 37095, 35694, 33522, 31941, 31590, 32286, 33848, 35987, 37697, 37998, 37141, 36166, 35484, 34840, 34276, 33984, 33543, 32504, 31552, 31856, 33364, 34918, 35925, 36711, 37271, 37007, 35945, 35020, 34814, 34943, 35024, 35342, 36255, 37671, 39407, 41355, 43114, 44115, 44377, 44619, 45466, 46957, 48809, 50621, 51833, 51996, 51118, 49463, 47149, 44394, 41812, 39953, 38778, 38024, 37698, 37660, 37256]
55387C7256j119j080M2J246J706J662J486J017K82k05l98q41j489j608j235j399
55371C5323k319k812k156j150o38k60M32R88J010R18Q93L16q67j518j012l32m72
55354B6344q72o07M6L55M49P06Q02M46J82M37N53j40j118j495j266p90K1J058
55336B5111J479Q30p5l01KL04P30J393J726J360Q32N10j30j232j783j131k22j47
55318B9256m79k88K28L32P8j70o32j343j465o12K03J50J7O88J308P00m34n82J09
55299B7064K89k24m65k97m63q05k77J146K158J934J029K60j57l11l29m67o92m11
55281B8982N85J367R48k81j148j250r39l40N43J174J071O24L72L0o97j079m10
55264B9552N52O27J13J92R29J402J425J552J567O34j012k032j749p55K04Q17P94
$$ y = [37256, 36137, 35057, 35099, 36345, 38051, 39713, 41199, 42216, 42498, 42293, 41895, 41054, 39565, 37957, 36722, 35323, 33004, 30192, 28036, 26886, 26248, 25988, 26420, 27408, 28418, 29336, 30229, 30545, 29678, 28160, 27148, 26816, 26344, 25472, 24865, 24911, 25266, 25715, 26421, 27223, 27669, 27851, 28288, 28841, 28701, 27583, 26088, 24822, 24032, 24053, 25111, 26590, 27420, 27345, 27044, 27046, 27350, 28080, 29473, 31199, 32559, 33391, 33901, 33771, 32539, 30756, 29625, 29403, 29256, 28777, 28489, 28717, 29049, 29127, 28957, 28325, 26982, 25517, 24905, 25108, 25258, 25275, 25963, 27271, 27971, 27537, 26955, 27064, 27353, 27129, 26664, 26367, 25904, 25099, 24822, 25968, 28126, 30060, 31089, 31349, 31192, 30881, 30552, 30085, 29393, 28982, 29567, 30934, 31882, 31601, 30453, 29203, 28264, 27924, 28467, 29641, 30712, 31336, 31708, 31738, 31041, 29962, 29552, 30104, 30731, 30844, 31036, 31965, 33367, 34792, 36344, 37911, 38545, 37533, 35501, 33752, 32997, 33201, 34018, 34812]
55247C4812Q7n39l15K71K13l53m46L5L21K69L98N29n9j032j188l82J89q9m32j63
55227C2126L17M90M86M66K83J33M76J004P62l50j201r99l02l1k88n91n99k07M73
55208C2448J035J136R61Q46O31R6l05o4L25pq33j141p74n11n59k95L39N15j00
55189C3743p80r29p44m41J35Q22J050P58N33N53M02N8RK13M8m06k34P59J497J125
55169C8171R1p58j179j167n64L51P49K75m67q97j077j068n68L02P40L99k7J21
55151C3427N15N12L9o71j498j998j441J26J414J353M54Q6P06J530J723J330J027
55134C8634J264J733J726J062M69O34J276J692J871K232K529K043Q59j48o33j109
55118E6134j714j835j291q38j001j284j058m93j29j96o56j278j448o81M86R41
$$ y = [34812, 34899, 34360, 34045, 34316, 34529, 34176, 33730, 33765, 34086, 34355, 34753, 35282, 35223, 34191, 33003, 32621, 32810, 32721, 32289, 32126, 32443, 32933, 33419, 33885, 34168, 34301, 34777, 35781, 36543, 36193, 34992, 33993, 33691, 33660, 33372, 32781, 32182, 31975, 32448, 33483, 34619, 35580, 36426, 37057, 37153, 36848, 36784, 37109, 37102, 36269, 35128, 34354, 33843, 33284, 32989, 33328, 33843, 33743, 32963, 32034, 31290, 30849, 30984, 31806, 32856, 33614, 34147, 34700, 35102, 35160, 35169, 35382, 35430, 35024, 34790, 35549, 37046, 38171, 38262, 37504, 36325, 35158, 34594, 34945, 35694, 35969, 35502, 34605, 33528, 32460, 31892, 32194, 32934, 33333, 33306, 33427, 33942, 34454, 34493, 33822, 32324, 30326, 28885, 29011, 30425, 31778, 32232, 32318, 33024, 34554, 36277, 37607, 38634, 39898, 41631, 43357, 44419, 44888, 45522, 46798, 48490, 50361, 52593, 55122, 57165, 58024, 57876, 57243, 56134, 54420, 52585, 51294, 50456, 49455, 48171, 47113, 46620, 46491, 46295, 45639, 44361, 42913, 42232, 42718, 43659]
55102D3659M98K0p7k95p32o66Q3N57K37l8N16J334J574J439J467J419R25M84O44
55083E3048Q78M46k49k72K99O06M49L32L15n9o81p95j29O79R78Q26O75Q43J322
55064E9511J758J679J057M48K26K9n94j334j495r92m24k41l86o03o65l56L30J043
55046E8991J424J487J417J266J055Q53M84l73j459j874j203k68j01o27r82q16
55030E9274n26m54n86q89j281j371q75j79Q4m5j1L02M41K16k9j46m59j097j573
55011E0796j399p31o5L41N57O56O04L16k08o86o14J50Q87O57m44j205q19P5L76
54992D9244J21L15J312K237K214J408M81l03q34o39M82J670J808J063O59J088
54976F2326J581J605J716K332K778K470K154K883M349N440O000O839Q229R582
$$ y = [43659, 44157, 44177, 44100, 43805, 43073, 42407, 42490, 43047, 43284, 43246, 43762, 45096, 46670, 48109, 49576, 50995, 51920, 52404, 53048, 53926, 54372, 54123, 53851, 54150, 54756, 55205, 55537, 55852, 55793, 55112, 54317, 54188, 54867, 55845, 56671, 57346, 58189, 59511, 61269, 62948, 64005, 64453, 64679, 64708, 64114, 62780, 61285, 60293, 59869, 59628, 59242, 58639, 57974, 57618, 57948, 58991, 60415, 61902, 63319, 64585, 65640, 66493, 66977, 66604, 65145, 63271, 62068, 61800, 61699, 61072, 60090, 59274, 58748, 58294, 57708, 56819, 55538, 54167, 53292, 53113, 53197, 53152, 53141, 53443, 53884, 54100, 54071, 53925, 53466, 52369, 50796, 49397, 48666, 48601, 48942, 49499, 50155, 50759, 51075, 50867, 50181, 49567, 49717, 50604, 51261, 50817, 49612, 48793, 48868, 49244, 49365, 49680, 50992, 53229, 55443, 56851, 57332, 57029, 56195, 55556, 56038, 57708, 59516, 60579, 61238, 62326, 63907, 65512, 67228, 69560, 72338, 74808, 76962, 79845, 84194, 89634, 95634, 102473, 110702, 120284]
54962A20284J0641J1763J2898J3353J2734J1260Q976N653J682j922m725p208r574
54949A85815j1149j1441j0937j0341r691q761p756p033o623o332n926n060l626
54936H1139k277j806j889j390j59N88J49n31l61M12J074J826L129M450M942M876
54920I4172N217O067O712P068P798R000R759R265P508M763J288k219m688n782
54906A55928o356p374q770r794j0032r638q718p249n595m543m378m314l372j778
54892F4017p69r06j363j282j041j337j671r53N89J389O53o51j228q98k00M76P94
54875E5619L78m90q63l99J8m61j436j966j816j298n27L56P56L28l35m70j85L9
54857D7248M01J316K306K384J513O81N13O56N94K91j68q71j730k287k148j395
$$ y = [120284, 130925, 142688, 155586, 168939, 181673, 192933, 201909, 207562, 209244, 207322, 202597, 195389, 185815, 174666, 163225, 152288, 141947, 132256, 123495, 115739, 108706, 102083, 95751, 89825, 84765, 81139, 78862, 77056, 75167, 73777, 73618, 74206, 74355, 73824, 73463, 73875, 74949, 76775, 79904, 84354, 89296, 94172, 99389, 105456, 112168, 119236, 127034, 136034, 145793, 155058, 162566, 167329, 168617, 166398, 161710, 155928, 149572, 142198, 133428, 123634, 113602, 103964, 95246, 87997, 82402, 77859, 73481, 69167, 65795, 64017, 63248, 62342, 60979, 59697, 58656, 57319, 55648, 54695, 55284, 56673, 57326, 56675, 55447, 54549, 54349, 54825, 55619, 55997, 55507, 54644, 54245, 54263, 53802, 52366, 50400, 48584, 47286, 46759, 47115, 47871, 48199, 47864, 47394, 47209, 47248, 47649, 48965, 51271, 53655, 55168, 55849, 56362, 57018, 57612, 57903, 57735, 56864, 55134, 52847, 50699, 49304]
54841D9304m52K32N01N61O39M66l89j489j568j38J558J982J169L09n1k34k17N31
54823E2714J763K271J478L21L6P39J735K607L358L882L969L755L736M274N351
54808I1989O729Q143R433J0630J1799J2650J2429J0495P071L165k23k849m980
54795A76481o689p676p879p788p834p714o777n032l349k603k928l727m172l730
54781I8583k676j962k084k290j501Q4J195J296J239J819K733L429M061M913N700
54766A14539O200O972Q550J0445J1720J2154J2164J1894J1132R730P549M398P34
54753B28181k116l307l683m697o377p410p100o254o028o700p755q513q473p654
54739A42114o695o275o334o251n645m647l553k740k600k997l075k268j267j172
$$ y = [49304, 48852, 49084, 49585, 50146, 50785, 51251, 50862, 49373, 47805, 47667, 49225, 51207, 52376, 52685, 52634, 52400, 52183, 52714, 54477, 56748, 58226, 58547, 58583, 59322, 61057, 63664, 67022, 70904, 74873, 78628, 82364, 86638, 91989, 98718, 106861, 116294, 126924, 138723, 151373, 163802, 174297, 181368, 184533, 184310, 181461, 176481, 169792, 162116, 154237, 146449, 138615, 130901, 124124, 119092, 115743, 113140, 110212, 106485, 102313, 98583, 95907, 93945, 91861, 89571, 88070, 88154, 89349, 90645, 91884, 93703, 96436, 99865, 103926, 108839, 114539, 120739, 127711, 136261, 146706, 158426, 170580, 182744, 194638, 205770, 215500, 223049, 227447, 228181, 226065, 222758, 219075, 214378, 208001, 200591, 193491, 187237, 181209, 174509, 166754, 158241, 149768, 142114, 135419, 129144, 122810, 116559, 110914, 106267, 102714, 99974, 97374, 94377, 91302, 89034, 87767, 86595]
54725H6595j862k121j359l43k2m28r18r84n20J36L29k87j138j310p17j52j05j50
54707G4644K56R74J422J210L68o90j278j006k95L9j55k28K55Q64R48M92J9n8K30
54688G8011N62O22L63K6j76k97m25l51K18J199K156K750K910K742K490K409K393
54671I7602K002J154N04O88J457K107K421K686K918K815K381J976J721J458J302
54656A25192J613K370L042L236L061K853K888L351M180N012N659O452P696Q953
54642A85558R471R190Q727Q396P860O639M469J217k860o841r768j1507j2469j2655
54628A85427j1758j0191q995q512p985o789n293m104l146j996p21J31J65m87j208
54613A14538j223k35J152J942J723Q70j26j020j588j678j573j722k026j914j252
$$ y = [86595, 84733, 82612, 81253, 80910, 80888, 80460, 79542, 78558, 78038, 78174, 78503, 78216, 77078, 75768, 75051, 74899, 74794, 74644, 74900, 75874, 77296, 78506, 78874, 78184, 76906, 75900, 75605, 75644, 75489, 75261, 75516, 76380, 77328, 77820, 77839, 77781, 78011, 78573, 79195, 79558, 79584, 79408, 79111, 78686, 78335, 78553, 79752, 81908, 84658, 87568, 90310, 92800, 95209, 97602, 99604, 100758, 101262, 101950, 103407, 105514, 107935, 110621, 113539, 116354, 118735, 120711, 122432, 123890, 125192, 126805, 129175, 132217, 135453, 138514, 141367, 144255, 147606, 151786, 156798, 162457, 168909, 176605, 185558, 195029, 204219, 212946, 221342, 229202, 235841, 240310, 241527, 238667, 231826, 222058, 210551, 198082, 185427, 173669, 163478, 154483, 145971, 137986, 131197, 125904, 121800, 118654, 116658, 115937, 116068, 116233, 115746, 114538, 113315, 113080, 114232, 116174, 117897, 118767, 118641, 117621, 116033, 114355, 112782, 111060, 109034, 107120, 105868]
54598A05868o57o74j161j701k060k097j718j210j164j748k430k596k235j769j544
54583H1104j554j424p17M64J244Q54l24j136j069p31p98j141j242r63n75l62l81
54566G1249m48k81J02K53j26o35o89l67j85k00j8M03O85P20P94R30R05Q57J175
54547G5124J722J903J655J503J624J603J370J464K133K922L439L791M073M188
54533A08514M403N199O245O482N534M215L166J993K34j687l172m283n220n679
54519A25944n462n038m793m402l618l011l087l284k760j721j019q06m87J19N16
54504H7091L77L5k8K50N30M25o7l82K8Q34J094N66O1R5O1n88j135n79P39J528
54484I0935J361R83Q98P17J13m56m18J29O45P85M71k63j188j788j673j092p99
$$ y = [105868, 105211, 104537, 103376, 101675, 99615, 97518, 95800, 94590, 93426, 91678, 89248, 86652, 84417, 82648, 81104, 79550, 78126, 77409, 77873, 79117, 79971, 79647, 78511, 77442, 76711, 75913, 74772, 73530, 72567, 71992, 71630, 71249, 70801, 70520, 70622, 70875, 70749, 70114, 69425, 69058, 68873, 68673, 68655, 69058, 69743, 70463, 71257, 72187, 73092, 73949, 75124, 76846, 78749, 80404, 81907, 83531, 85134, 86504, 87968, 90101, 93023, 96462, 100253, 104326, 108514, 112917, 118116, 124361, 130843, 136377, 140592, 143758, 145751, 145985, 144298, 141126, 136843, 131623, 125944, 120482, 115444, 110651, 106249, 102631, 99620, 96533, 93249, 90489, 88768, 87749, 86943, 86456, 86575, 87091, 87468, 87503, 87475, 87725, 88255, 88680, 88613, 88231, 88259, 89093, 90187, 90753, 90814, 90909, 90970, 90382, 89247, 88668, 89407, 90935, 92296, 93279, 94177, 94894, 95007, 94551, 94133, 94262, 94907, 95692, 96163, 95900, 94712, 92924, 91251, 90159, 89360]
54467H9360j215j782j544l73P60J015P05N28L60l70j354j623j091p13q90q66j70
54450H0737M69L97R9J79K13l30q55m81M21P70M52L03N51M30n67j849k378j571
54432G6990K87K071K487J317j87o87k45J48K1l29o35p90m43N63J507J471O57J12
54414H4315K23M57N71J048K004K654K292J228L99M60J537L195M549M845M245L637
54398A17659L543L676L560L014J991N61p53j230q32l92o66j557k501l136l453
54383A19484l590l665l559k896j589l11J24k40p17j121j891k935l357k701j745
54368H9291j434j647j694j495j476j642j560j144p36l46M82J832L004L285K785
54353H7505K166J804J645J694K098K686K902K541K165K369K915L053K633K249
$$ y = [89360, 88145, 86363, 84819, 84446, 85206, 86221, 86926, 87454, 87814, 87444, 86090, 84467, 83376, 82663, 81773, 80907, 80737, 81206, 81603, 81702, 81881, 82094, 81764, 80909, 80428, 80849, 81619, 82071, 82374, 82925, 83355, 82788, 80939, 78561, 76990, 77277, 79348, 81835, 83152, 82965, 82278, 82033, 82181, 82202, 81873, 81238, 80448, 80005, 80568, 82075, 83546, 84203, 84315, 84538, 84995, 85566, 86614, 88618, 91272, 93564, 94792, 95191, 95651, 97188, 100383, 104932, 109777, 114022, 117659, 121202, 124878, 128438, 131452, 133443, 134004, 133251, 132021, 131189, 130797, 130131, 128574, 126073, 122937, 119484, 115894, 112229, 108670, 105774, 104185, 103874, 103998, 103758, 103041, 101920, 100029, 97094, 93737, 91036, 89291, 87857, 86210, 84516, 83021, 81545, 79903, 78343, 77199, 76463, 76117, 76599, 78431, 81435, 84720, 87505, 89671, 91475, 93120, 94814, 96912, 99598, 102500, 105041, 107206, 109575, 112490, 115543, 118176, 120425]
54339A20425K226K102J383K93o27j287j918k574l111l432l450l086k595k495k819
54324I9035k890k334j752j809k182k198k059k429l063k928j789o34k97n78r70
54309G1123j381j745j746j393j196j262r38J24J120J095K21n66q63r87j033o39
54293E9934K87J197J450Q83j87j197j602j254o10k41j32J57O81R03M90r6j29N19
54275F1053J231J319N94o13j715k172j764o87O13J684K162J912J272R11J132J392
54259F8324R52m2o23k79M40P94P78O76L42m18j083r34k00J56j39l70o2K81J03
54240F8696k90l07j0R7j46n08q00r43q14m44j51k15m91o22l64L68J404K153K001
54221F8614J139M65M35N74L92J05oj81n55n59J85R80Q91J20l91l29q3K35Q31J378
$$ y = [120425, 122651, 124753, 126136, 126429, 125802, 124515, 122597, 120023, 116912, 113480, 110030, 106944, 104349, 101854, 99035, 96145, 93811, 92059, 90250, 88068, 85870, 83811, 81382, 78319, 75391, 73602, 72968, 72671, 72093, 71123, 69742, 67997, 66251, 64858, 63662, 62400, 61462, 61586, 62706, 63801, 64022, 63456, 62593, 61606, 60573, 59934, 60221, 61418, 62868, 63751, 63564, 62367, 60765, 59511, 58901, 58660, 58528, 58685, 59366, 60269, 60759, 60663, 60534, 61053, 62284, 63603, 64197, 63584, 61869, 59697, 57933, 57246, 57859, 59543, 61705, 63617, 64889, 65800, 66932, 68324, 69276, 69234, 68611, 68332, 68772, 69566, 70344, 71020, 71362, 70944, 69861, 68927, 68727, 68883, 68744, 68374, 68312, 68593, 68696, 68406, 68099, 68089, 68186, 68040, 67532, 66732, 65789, 64975, 64531, 64380, 64165, 63674, 63052, 62688, 63056, 64460, 66613, 68614, 69753, 70218, 70653, 71227, 71619, 71724, 71718, 71537, 70982, 70423, 70608, 71588, 72479, 72599, 72208, 71879, 71796, 72031, 72862, 74240]
54201G4240J165J55q91j474j746j798j420p72n19r48j506j512q51J27R55J202
54185F4407P67J62OK06J42k98n73m38l04m95p36p20n70m31j30L32N50K99p9k53
54165F1844m24q02j026o59J4K82M7l2N32J385J843J735J464J316J107O23Q6j50
54147F9185j90m33q67j034q12o26o69m93J76P68N88k22r99j489j777j734j208
54130E8164n99m22m76j89L76N56R2o06j115j182n24P79J705J196l82j484j266
54113E4623l14N67J270J773J699R87K38j22l50o68p54m67l72q80j425j198k68
54096E4339N69P82M59m6l73l30j47k73o94q33m20M7N7j54n4L85P91R67R49P13
54076E6734K84j02k90m37o20n03J91J103J522J177M70qN0N69J237J746J913J603
$$ y = [74240, 75405, 75560, 74669, 73195, 71449, 69651, 68231, 67459, 66940, 65992, 64486, 62974, 62123, 62250, 63205, 64407, 65174, 65336, 65342, 65548, 65690, 65392, 64819, 64381, 64077, 63582, 62846, 62126, 61556, 61125, 60995, 61327, 61877, 62176, 62097, 61844, 61420, 60618, 59592, 58933, 58947, 59229, 59276, 59244, 59776, 61161, 63004, 64739, 66203, 67519, 68626, 69249, 69335, 69185, 68995, 68562, 67695, 66661, 65849, 65223, 64554, 64061, 64237, 65005, 65593, 65371, 64372, 62883, 61106, 59372, 58164, 57565, 57143, 56667, 56478, 56854, 57410, 57502, 56896, 55781, 54599, 54075, 54854, 56559, 57755, 57373, 55889, 54623, 54309, 54876, 56146, 57919, 59618, 60605, 60843, 60721, 60371, 59703, 58949, 58482, 58110, 57230, 55805, 54607, 54339, 54908, 55690, 56149, 56103, 55730, 55400, 55253, 54980, 54286, 53453, 53033, 53080, 53137, 52983, 52929, 53314, 54105, 55072, 56021, 56734, 57018, 56916, 56626, 56189, 55569, 55066, 55257, 56360, 57882, 59059, 59529, 59521, 59571, 60140, 61377, 63123, 65036, 66639]
54058F6639P28l89r71n34L91Q61P79Q68J419J794J431O57J76K51P09J292J682
54041G7783J662J495J724K405K993L178L206L236L042K664K615L063L501L631
54027A16198L848M369M625M182L604L653M103M119L447K524J722J068N44J13l13
54012A57806n71k69M89Q58K57q26j580j907k155k322k310k510l265m004l785k610
53996A31296j482j126j343j571j508j156p63p10j064j360j267j103j248j338p88
53981A13469J72P21O53N59P95R76N91l45j433k168k110j233j50M18M10K87K75
53964A11887J85j06m91r19j328j440j087o89q36j424j729j388p53k86r4n2M7M49
53946I9946J061J266O91l0J8O66R26O49R09K309L914M451L896L154K757K600K598
$$ y = [66639, 67367, 66978, 66007, 65473, 65864, 66725, 67504, 68372, 69791, 71585, 73016, 73673, 73849, 74100, 74809, 76101, 77783, 79445, 80940, 82664, 85069, 88062, 91240, 94446, 97682, 100724, 103388, 106003, 109066, 112567, 116198, 120046, 124415, 129040, 133222, 136826, 140479, 144582, 148701, 152148, 154672, 156394, 157462, 158006, 158119, 157806, 157235, 156966, 157455, 158313, 158570, 157744, 156164, 154257, 152102, 149780, 147470, 144960, 141695, 137691, 133906, 131296, 129814, 128688, 127345, 125774, 124266, 123110, 122347, 121637, 120573, 119213, 117946, 116843, 115595, 114257, 113469, 113641, 114362, 115015, 115574, 116369, 117345, 117936, 117591, 116158, 113990, 111880, 110647, 110497, 110915, 111325, 111612, 111887, 112072, 111966, 111475, 110556, 109228, 107788, 106701, 106012, 105176, 103752, 102023, 100635, 99882, 99596, 99502, 99450, 99497, 99946, 101007, 102273, 102964, 102934, 102952, 103618, 104544, 105193, 106102, 108411, 112325, 116776, 120672, 123826, 126583, 129183, 131781]
53929A31781K720K586J767N86m7K64R46J314J410J669K085K209J941J879K577
53914A55687L684M247L820L017K744L193L809M077L957L699L511L538L753L820
53900B06556L259J946L39r04j465j482j334j362j682k135k421k416k348k567l226
53885A88758m108m841n222n319n327n344n283m883l925k591j591j596k447l227
53871A33054l297k919k637k479k221k019k183k507k469j986j374p61j74m5p72
53856A05211j825k185j745j388j580j802j665j469j345q73p2K80p4k77K30P53
53840I0174O34M28P13P45l37j745k011j224p89j220j648j479j081p06j06N71P36
53823H1655N33Q62J817K240J425K44j54J42L06J91L77J075J715J672J024M97O95
$$ y = [131781, 134501, 137087, 138854, 139440, 139393, 139657, 140603, 141917, 143327, 144996, 147081, 149290, 151231, 153110, 155687, 159371, 163618, 167438, 170455, 173199, 176392, 180201, 184278, 188235, 191934, 195445, 198983, 202736, 206556, 209815, 211761, 212100, 211196, 209731, 208249, 206915, 205553, 203871, 201736, 199315, 196899, 194551, 191984, 188758, 184650, 179809, 174587, 169268, 163941, 158597, 153314, 148431, 144506, 141915, 140324, 138728, 136281, 133054, 129757, 126838, 124201, 121722, 119501, 117482, 115299, 112792, 110323, 108337, 106963, 106202, 106028, 105983, 105211, 103386, 101201, 99456, 98068, 96488, 94686, 93021, 91552, 90207, 89334, 89262, 89542, 89468, 89191, 89421, 90174, 90808, 91236, 91949, 92694, 92357, 90612, 88601, 87377, 86588, 85368, 83720, 82241, 81160, 80454, 80348, 80919, 81655, 82188, 83050, 84867, 87107, 88532, 88776, 88622, 88764, 89070, 89261, 89638, 90713, 92428, 94100, 95124, 95621, 96316]
53806I6316J387J784J699J965L154M419M434L317K523K796L341L256K776K554
53792A35721K614K676K806L128L282K895K146J485R97N96M26O42R84R37K83p21
53776A60897j573j821j425r24r74j604k212k353k151j952j929k095k344k362j979
53761A33199j482j192q47n8P45O66l06j227j608j913k329k210j342p06j075j709
53745A16606j522q41q70j746k343j918r56l15l42r31j713j991j256K0O73J77p30
53728A00002r84l92M03P50N37M7l44l80j7O59J484K221K558K285J503O00P3K06
53710A11211P35R09K80n12k67J241K751K953K057J280J160J109O34J70M29J382
53694A27522K299K496J805O20l33m37K17Q70R30N91M45P17J150J531J906K269
$$ y = [96316, 97703, 99487, 101186, 103151, 106305, 110724, 115158, 118475, 120998, 123794, 127135, 130391, 133167, 135721, 138335, 141011, 143817, 146945, 150227, 153122, 155268, 156753, 157750, 158346, 158772, 159414, 160398, 161335, 161618, 160897, 159324, 157503, 156078, 155154, 154180, 152576, 150364, 148011, 145860, 143908, 141979, 139884, 137540, 135178, 133199, 131717, 130525, 129678, 129620, 130365, 131031, 130725, 129498, 127890, 125977, 123648, 121438, 120096, 119390, 118315, 116606, 115084, 114243, 113373, 111627, 109284, 107366, 106410, 106095, 105753, 104822, 103109, 101118, 99862, 99882, 100555, 100732, 100002, 99018, 98626, 99029, 99779, 100316, 100363, 100019, 99639, 99622, 100281, 101765, 103986, 106544, 108829, 110332, 110932, 111005, 111211, 111946, 112855, 113135, 112623, 112356, 113597, 116348, 119301, 121358, 122638, 123798, 124907, 125541, 125711, 126140, 127522, 129821, 132317, 134122, 134742, 134409, 133972, 134189, 135059, 135989, 136580, 137025, 137742, 138892, 140423, 142329, 144598]
53678A44598K452K388K213J994J686J529J946K784L048K036M11m97l66p8k28l48
53662A65568Q0O78Q72Q72J156J461J130K41m55o26o77q92j006p99n09l73k22J66
53644A66665O37Q70P67N40N17Q69J351J371N93n98j481j687j313o04Q6L23N9j31
53626A68834K21P77R40Q02Q09Q38N20K57P73J658J590L73n15M9J285J785J393
53609A82389R43Q64J035J555K582L588L740L046K373K266K358K185K003K488L760
53594B17175N035N333M579L785L885M573M741L980L035K699K934L379M021M868
53580B74022N524N633N309M730L723K396J568J916K912L349K825J996J472J096
53566C18471M52l84q49m97M76J212R02l50j569j956j687j433j469j558j441j080
$$ y = [144598, 147050, 149438, 151651, 153645, 155331, 156860, 158806, 161590, 164638, 166674, 167085, 166588, 166222, 166144, 165916, 165568, 165648, 166326, 167198, 168070, 169226, 170687, 171817, 172058, 171603, 170977, 170300, 169408, 168402, 167603, 167094, 166721, 166499, 166665, 167302, 168172, 168939, 169479, 169996, 170865, 172216, 173587, 174180, 173582, 172101, 170414, 169101, 168497, 168583, 168906, 168965, 168834, 169055, 169832, 170772, 171574, 172383, 173221, 173741, 173998, 174771, 176429, 178019, 178392, 177877, 177926, 179211, 180996, 182389, 183332, 184196, 185231, 186786, 189368, 192956, 196696, 199742, 202115, 204381, 206739, 208924, 210927, 213415, 217175, 222210, 227543, 232122, 235907, 239792, 244365, 249106, 253086, 256121, 258820, 261754, 265133, 269154, 274022, 279546, 285179, 290488, 295218, 298941, 301337, 302905, 304821, 307733, 311082, 313907, 315903, 317375, 318471, 318923, 318539, 317690, 317193, 317669, 318881, 319783, 319433, 317864, 315908, 314221, 312788, 311319, 309761, 308320, 307240]
53550C07240o30m21p06j220j334r63q26j380j999j784q77k54m35j002j366j357
53534B90686j001k62P56J635J892J372M19k87k44M19J206J876K433K632K140J371
53518C07043J331K301L423M084M782N954O863O700O080O185O929P355P522Q440
53504C84992J0153J1410J1570J1500J1984J2584J2730J2915J3849J5209J6180
53493E25076J6679J7205J7878J8467J9053J9913K0950K1809K2423K2888K3076
53482G45417K2931K2846K3117K3216K2387K0926K0069K0468K1426K1926K1814
53471I86543K1661K1937K2660K3504K3865K3218K1752K0370J9615J8951J7596
53460A221672J5775J4426J3836J3338J2508J1786J1564J1368J0575R424Q589Q038
$$ y = [307240, 306610, 306189, 305483, 304263, 302929, 301966, 301140, 299760, 297761, 295977, 295100, 294846, 294411, 293409, 292043, 290686, 289685, 289423, 290179, 291814, 293706, 295078, 295497, 295210, 294966, 295385, 296591, 298467, 300900, 303532, 305672, 307043, 308374, 310675, 314098, 318182, 322964, 328918, 335781, 342481, 348561, 354746, 361675, 369030, 376552, 384992, 395145, 406555, 418125, 429625, 441609, 454193, 466923, 479838, 493687, 508896, 525076, 541755, 558960, 576838, 595305, 614358, 634271, 655221, 677030, 699453, 722341, 745417, 768348, 791194, 814311, 837527, 859914, 880840, 900909, 921377, 942803, 964729, 986543, 1008204, 1030141, 1052801, 1076305, 1100170, 1123388, 1145140, 1165510, 1185125, 1204076, 1221672, 1237447, 1251873, 1265709, 1279047, 1291555, 1303341, 1314905, 1326273, 1336848, 1346272, 1354861, 1362899]
53448A362899P030N162K776L90j715l373m575n712p300r349j1397j3168j4699
53435A306969j5944j6774j7401j8171j8946j9379j9742k0631k1782k2155k1554
53424A094490k1084k1505k2099k1951k1333k0951k0526j9303j7487j5982j4979
53413H77290j3836j2253j0614r126p632o218n201m362k996r28J231K963M336N495
53399H18149O379P182Q474J0514J2897J5064J6814J8211J9408K0608K1807K2615
53387I98122K2852K3220K4595K6636K8020K8317K8746L0514L3221L5636L7448
53376A317327L9288M1341M2958M3858M4821M6722M9249N1108N1490N0867N0245
53365A829274N0002M9784M9371M9036M8830M8093M6103M2992L9470L5909L2217
$$ y = [1362899, 1369929, 1375091, 1377867, 1378257, 1376542, 1373169, 1368594, 1362882, 1355582, 1346233, 1334836, 1321668, 1306969, 1291025, 1274251, 1256850, 1238679, 1219733, 1200354, 1180612, 1159981, 1138199, 1116044, 1094490, 1073406, 1051901, 1029802, 1007851, 986518, 965567, 945041, 925738, 908251, 892269, 877290, 863454, 851201, 840587, 831461, 823829, 817611, 812410, 808048, 805052, 804124, 805355, 808318, 812654, 818149, 824528, 831710, 840184, 850698, 863595, 878659, 895473, 913684, 933092, 953700, 975507, 998122, 1020974, 1044194, 1068789, 1095425, 1123445, 1151762, 1180508, 1211022, 1244243, 1279879, 1317327, 1356615, 1397956, 1440914, 1484772, 1529593, 1576315, 1625564, 1676672, 1728162, 1779029, 1829274, 1879276, 1929060, 1978431, 2027467, 2076297, 2124390, 2170493, 2213485, 2252955, 2288864, 2321081]
53354B321081K8556K5434K3022K0868J8565J6223J4038J1770Q955N494J759j781
53342B493984m983q280j2535j8396k5638l3246m0156m5794m9998n2751n4051n3902
53330B094254n2451n0319m8555m7839m7818m7575m6674m5469m4429m3773m3596
53319A575756m3811m3835m2964m1242l9495l8201l6865l4827l2212k9666k7397
53308A165241k5023k2312j9578j7291j5492j3844j2224j1121j1113j1920j2298
53297I93025j1260r115o905n130l610k427k073k516k826k190p82O70J719K253
53283I48833K251K006K233L397N199P099R063J1314J3586J5253J6280J7383J9117
53270A073014K1176K2789K3544K3541K2996K2072K1113K0673K1023K1676K1702
$$ y = [2321081, 2349637, 2375071, 2398093, 2418961, 2437526, 2453749, 2467787, 2479557, 2488512, 2494006, 2495765, 2493984, 2489001, 2480721, 2468186, 2449790, 2424152, 2390906, 2350750, 2304956, 2254958, 2202207, 2148156, 2094254, 2041803, 1991484, 1942929, 1895090, 1847272, 1799697, 1753023, 1707554, 1663125, 1619352, 1575756, 1531945, 1488110, 1445146, 1403904, 1364409, 1326208, 1289343, 1254516, 1222304, 1192638, 1165241, 1140218, 1117906, 1098328, 1081037, 1065545, 1051701, 1039477, 1028356, 1017243, 1005323, 993025, 981765, 972650, 965745, 960615, 957005, 954578, 952505, 949989, 947163, 944973, 944191, 944861, 946580, 948833, 951084, 953090, 955323, 958720, 963919, 971018, 980081, 991395, 1004981, 1020234, 1036514, 1053897, 1073014, 1094190, 1116979, 1140523, 1164064, 1187060, 1209132, 1230245, 1250918, 1271941, 1293617, 1315319]
53259A315319K0567J8509J6080J3676J1644J0430J0170J0242R779Q540O924N178
53247A457058L085N56j958l913n281o546q321j1027j4628j8498k1769k4009k5415
53234A319334k6345k6953k7349k7749k8249k8651k8689k8213k7148k5507k3635
53223A020846k2132k1380k1261k1422k1556k1387k0700j9687j8921j8829j9274
53212G94297j9768j9936j9581j8597j7041j5151j3166j1217r533q439p997p816
53200F26055p496p175p406q469r916j0827j0615r596q704q555q866q976q739q570
53186E02145q725q961q925q574q055p513p172p305p938q766r400r645r554r421
53172C82191r616j0101j0240r463q116p168p058p316p398p333p288p040o309n280
$$ y = [1315319, 1335886, 1354395, 1370475, 1384151, 1395795, 1406225, 1416395, 1426637, 1436416, 1444956, 1451880, 1457058, 1460143, 1460699, 1458741, 1454828, 1449547, 1443001, 1434680, 1423653, 1409025, 1390527, 1368758, 1344749, 1319334, 1292989, 1266036, 1238687, 1210938, 1182689, 1154038, 1125349, 1097136, 1069988, 1044481, 1020846, 998714, 977334, 956073, 934651, 913095, 891708, 871008, 851321, 832400, 813571, 794297, 774529, 754593, 735012, 716415, 699374, 684223, 671057, 659840, 650307, 641868, 633871, 626055, 618559, 611384, 603978, 595509, 585593, 574766, 564151, 554555, 545851, 537296, 528430, 519454, 510715, 502145, 493420, 484459, 475534, 466960, 458905, 451392, 444220, 436915, 428977, 420211, 410811, 401166, 391612, 382191, 372575, 362474, 352234, 342771, 334655, 327487, 320429, 313113, 305715, 298382, 291094, 284054, 277745, 272465]
53158B72465m412l970m048m710n704o225n497l612j560l85m63j415k502l080k927
53143B21955k363j936k007k427k668k352j716j347j397j343q01j48R5J69O48J288
53127B03650J241N09K45J156K434K880K496K157K050J426j20j870k812k780k412
53112B10250k275k355k370k288k356k755l389m036m514m619m092k916j577p90
53098A69918r12j699k508k713k142j326j095j667k354k448k079j851j924k014
53084A43186k053k206k337k177j900j916k018j513l55N24L67m84j115j059n55
53069A24389j12j14n19q78q41o20o25p70o71l71k62l21j05M64R75J180J130O69
53051A22598l97j577j999j572j000o17j32L22O6q55j422j137o62m79j15N83O81
$$ y = [272465, 268053, 264083, 260035, 255325, 249621, 243396, 237899, 234287, 232727, 232342, 231879, 230464, 227962, 224882, 221955, 219592, 217656, 215649, 213222, 210554, 208202, 206486, 205139, 203742, 202399, 201598, 201450, 201545, 201714, 202362, 203650, 204891, 205400, 205645, 206801, 209235, 212115, 214611, 216768, 218818, 220244, 220124, 218254, 215442, 212662, 210250, 207975, 205620, 203250, 200962, 198606, 195851, 192462, 188426, 183912, 179293, 175201, 172285, 170708, 169918, 169006, 167307, 164799, 162086, 159944, 158618, 157523, 155856, 153502, 151054, 148975, 147124, 145200, 143186, 141133, 138927, 136590, 134413, 132513, 130597, 128579, 127066, 126711, 127235, 127602, 127118, 126003, 124944, 124389, 124277, 124163, 123644, 122766, 121925, 121305, 120680, 119910, 119239, 118868, 118606, 118285, 118180, 118644, 119619, 120799, 121929, 122598, 122201, 120624, 118625, 117053, 116053, 115436, 115304, 115626, 115692, 114837, 113415, 112278, 111616, 111137, 111022, 111605, 112286]
53034A12286l36j382j279n47m75j141j600j516j257q37k9P26Q02M95N79R44Q84
53017A06317N31O77J202J047j3q39o58k11n45j485k019j642o87K40O88M77j81
53000A02899p63q63m87J42Q38J425J727J598J024K37k29ON38M33n35j345r12N83
52982A06316K061K927L377L619L553L245K994K914K837K661K406K019J484J009
52968A43422O98L43j90n99p20r45j579k135j978j348r84j047j136j090r72n20
52952A29220M54J355J408Q15L37p2j102k578l276k539j045K80J170J584J403R38
52936A28352R21J452J739J246L71l56r67j522j663j283r21r26q43j75P41J249
52920A27415J264J080P13J16l03j7Q06J367J082J00q88j203o60K93J078J561J903
$$ y = [112286, 111950, 110568, 109289, 108742, 108267, 107126, 105526, 104010, 102753, 101916, 101887, 102613, 103415, 103910, 104489, 105433, 106317, 106848, 107525, 108727, 109774, 109761, 108922, 108264, 108053, 107508, 106023, 104004, 102362, 101675, 101915, 102603, 103080, 102899, 102136, 101273, 100786, 100928, 101766, 103191, 104918, 106516, 107540, 107777, 107548, 107554, 108092, 108525, 107990, 106645, 105733, 106316, 108377, 111304, 114681, 118300, 121853, 125098, 128092, 131006, 133843, 136504, 138910, 140929, 142413, 143422, 144120, 144463, 144273, 143674, 142954, 142009, 140430, 138295, 136317, 134969, 133985, 132938, 131802, 130712, 129740, 129220, 129674, 131029, 132437, 133252, 133589, 133517, 132415, 129837, 126561, 124022, 122977, 123257, 124427, 126011, 127414, 128352, 129273, 130725, 132464, 133710, 134081, 133725, 132758, 131236, 129573, 128290, 127369, 126443, 125600, 125425, 126166, 127415, 128679, 129759, 130472, 130588, 130285, 130268, 131074, 132441, 133523, 133623, 132735, 131532, 130872, 131165, 132243, 133804, 135707]
52903A35707K002J630J041P77P76M06l34n76L8N82K03m48m9J462K695K554J386
52886A49852K83j58j08O7K79O78J303J884J973J389L93m48o51j82M17N26K54M28
52868A58179J437K454K420J498Q23Q97J165J193J277J560J556J097R26J666K792
52853A80940L369L378L515M014M366M169L533K640J471Q0j182j959k212k251k417
52838B01454k746k934k794k590k586k488j834r49p62j503k258k274j969k137k675
52823A68955k798k202j372q85r46j445k061k347k154j829j767j843j717j379j087
52808A43123q74n65j27K82N68O86N24R7l49o78j123j819k361k226j523q73o01
52791A32161m87l41l49p20j217j330q24n4L17n4q34j383j435j221r59n97j63K6
$$ y = [135707, 137709, 139339, 140380, 141157, 141933, 142339, 142005, 141429, 141467, 142049, 142252, 141804, 141755, 143217, 145912, 148466, 149852, 150135, 149977, 149869, 149936, 150215, 150893, 152196, 154080, 156053, 157442, 157835, 157387, 156736, 156554, 156971, 157497, 157751, 158179, 159616, 162070, 164490, 165988, 166811, 167708, 168873, 170066, 171343, 172903, 174459, 175556, 176482, 178148, 180940, 184309, 187687, 191202, 195216, 199582, 203751, 207284, 209924, 211395, 211475, 210293, 208334, 206122, 203871, 201454, 198708, 195774, 192980, 190390, 187804, 185316, 183482, 182533, 181771, 180268, 178010, 175736, 173767, 171630, 168955, 166157, 163955, 162583, 161698, 160752, 159307, 157246, 154899, 152745, 150916, 149149, 147306, 145589, 144210, 143123, 142249, 141684, 141557, 141839, 142407, 143093, 143617, 143714, 143365, 142687, 141564, 139745, 137384, 135158, 133635, 132762, 132161, 131674, 131333, 130984, 130264, 129047, 127717, 126893, 126839, 127156, 127102, 126268, 124885, 123450, 122229, 121270, 120673, 120510, 120536]
52773A20536k48p25r82r61r12r67r84q35o05n21p32j094j287j211j170j383j557
52756A04362j341j043j260j857j976j303n23k58k13R2M12K72j12j64N3p5p58j471
52738I2837j670j311p26k72j67l39m40k44M4Q9j99p16j381j997k158j686r83n95
52720G8086n71n12j09P16J885L043L533K959J726O91L07M16P17J092J502J859
52704I7340K075K042J703J228R09P52L84l44r58r15l44M6l30j468k774l387k814
52687I3145j545o41n34o97p41j076j953k587k169j267j152j911k362j853j074
52672G1583p74o89k43M79J005J207J166P42j25r62j155p20k47j16j76k01k60m78
52654G0036o63m91j5K65k1n17m89K83J131J301R66J129K489M596O197O382N263
$$ y = [120536, 120288, 119563, 118581, 117620, 116708, 115741, 114757, 113922, 113317, 112796, 112064, 110970, 109683, 108472, 107302, 105919, 104362, 103021, 101978, 100718, 98861, 96885, 95582, 95059, 94801, 94588, 94680, 95092, 95364, 95252, 95088, 95141, 95066, 94308, 92837, 91167, 89856, 89130, 88858, 88691, 88352, 87912, 87668, 87712, 87801, 87602, 86886, 85505, 83508, 81350, 79664, 78681, 78086, 77515, 77003, 76894, 77610, 79495, 82538, 86071, 89030, 90756, 91447, 91754, 92170, 92887, 93979, 95481, 97340, 99415, 101457, 103160, 104388, 105297, 106049, 106433, 106089, 105131, 104216, 103872, 103918, 103588, 102120, 99346, 95959, 93145, 91600, 90959, 90425, 89728, 88987, 87911, 85958, 83371, 81202, 79935, 78783, 76872, 74510, 72657, 71583, 70809, 70120, 69877, 70356, 71361, 72568, 73734, 74476, 74351, 73389, 72234, 71514, 71267, 71151, 70975, 70774, 70514, 70036, 69373, 68882, 68867, 69132, 69111, 68594, 68105, 68388, 69519, 70820, 71786, 72915, 75404, 80000, 86197, 92579, 97842]
52637I7842L536J589o89l152m940n208m214l084k491k078j373o47m71q21j089
52622G2710q47k43K12R6n42j073r11k33K22J76O0J48J62J9J82P29Q93K55l80j62
52602G1473M10L43j45j7Q11J415J492J574J657R85l78j152o40K39M90N50J280
52585H0387K366K769K300J647J190Q17O14P94J021P45K52M59J473K238J951J108
52569A02131O70P69P93L87j93n28l96J89R06J248J047P37P50Q20L82m56r29p08
52551A07619l70n15q91q61l14L13P24R56J081J056R32Q24P80Q27J022J140O95
52534A15018m13j497j878j684j385r07K2R75J261J087J214J432O97r45j854r39
52518A10204Q09J703J418P37J10m51o39j49N56P52M93L49L90K78R1J68L10jo46
$$ y = [97842, 101378, 102967, 102278, 99126, 94186, 88978, 84764, 81680, 79189, 77111, 75738, 75091, 74620, 73799, 72710, 71863, 71620, 71832, 71928, 71386, 70313, 69402, 69169, 69391, 69567, 69627, 69775, 69937, 69956, 70138, 70867, 71760, 72015, 71635, 71473, 71883, 72226, 72081, 72064, 72875, 74290, 75782, 77356, 79013, 79998, 79620, 78468, 77828, 78067, 78557, 79107, 80387, 82753, 85522, 87822, 89469, 90659, 91476, 92090, 92884, 93905, 94650, 94902, 95361, 96834, 99072, 101023, 102131, 102801, 103570, 104363, 104750, 104557, 104029, 103633, 103822, 104728, 105976, 107023, 107760, 108510, 109330, 109712, 109256, 108327, 107619, 107249, 106734, 105843, 104982, 104668, 104981, 105705, 106661, 107742, 108798, 109730, 110554, 111334, 112161, 113183, 114323, 115018, 114605, 113108, 111230, 109546, 108161, 107254, 107276, 108251, 109512, 110599, 111813, 113245, 113942, 112997, 111143, 110204, 111013, 112716, 114134, 114871, 114981, 114530, 113891, 113742, 114298, 115050, 115543, 115892, 116282, 116560, 116651, 116819, 117129, 117128, 116482]
52499A16482r44o42m6O44J310J373L34j103j461l66R06J102M98K20O79J234J162
52482A21382N25O6L73J134J458J010M51L98M66L7n39l89L97P86L21l58o14n30
52464A26374k89K35Q86J077O64K82L83N77L99J05J50L56J48o52j676k433k575
52447A24011k077j359r55r08p95m66k38k76l52l71n35p41m61L98J140J181Q26
52430A18022O25M82J2n66n84J20Q84R31J34q97j373j079n44l42l10Q4P52J001
52412A17352N85J21J69N63R53J323J627J540J072Q37J151J380Q41j09n27k03K03
52395A28878J51k00l24J24J040J829J908J466J325J724J861J135K69L34J146J597
52379A44263J351J116J293J379J023O86P98J015Q80N78N00M76J70j37J92J203
$$ y = [116482, 115538, 114896, 114850, 115494, 116804, 118177, 118511, 117408, 115947, 115581, 116487, 117589, 118087, 118307, 118986, 120220, 121382, 121907, 121973, 122346, 123480, 124938, 125948, 126399, 126797, 127263, 127300, 126761, 126372, 126769, 127555, 127876, 127518, 126904, 126374, 126085, 126320, 127206, 128283, 128947, 129229, 129612, 130189, 130588, 130693, 130843, 131199, 131347, 130695, 129019, 126586, 124011, 121934, 120575, 119620, 118712, 117917, 117451, 117213, 116937, 116585, 116214, 115679, 114938, 114477, 114875, 116015, 117196, 118022, 118647, 119129, 119141, 118575, 117991, 118111, 118995, 119926, 120060, 119163, 117790, 116711, 116167, 115825, 115515, 115599, 116351, 117352, 117937, 118058, 118227, 118790, 119743, 121066, 122693, 124233, 125305, 126142, 127293, 128673, 129514, 129405, 128878, 128675, 128878, 129029, 128829, 128505, 128629, 129669, 131498, 133406, 134872, 136197, 137921, 139782, 140917, 141186, 141520, 142666, 144263, 145614, 146730, 148023, 149402, 150425, 151111, 151909, 152924, 153804, 154382, 154882, 155358, 155528, 155391, 155583, 156786]
52363A56786K258K824K917K781K594K514K564K357J473K40k92L75J453J799J310
52348A83953Q18Q15R94J027J067J219J198Q72O97J082J685J807J263M85j3NM81
52331A99455J036J173Q02L57J54N6M4N17J513K217J992J422J447J869J699Q71
52315B16624M75J187K406L184L258K899K452K300K625L081L240L358M006M978
52301B56073N465N398N599O327O813O617O430O921P593P601O935O100N269M558
52287C43699M562N740P523Q759Q968Q658Q573R020R768J0263J0213J0049J0448
52274D56243J1254J1532J0893J0067R812R950R990R924R838R341Q202O960O260
52261E80266O065O069O316O690O413M975L112J996J720J473R27N07M40L50j39
$$ y = [156786, 159044, 161868, 164785, 167566, 170160, 172674, 175238, 177595, 179068, 179308, 179016, 179391, 180844, 182643, 183953, 184771, 185586, 186580, 187607, 188674, 189893, 191091, 191963, 192660, 193742, 195427, 197234, 198497, 198982, 198969, 198974, 199455, 200491, 201664, 202466, 202823, 202977, 203033, 203077, 203594, 205107, 207324, 209316, 210738, 212185, 214054, 215753, 216624, 217099, 218286, 220692, 223876, 227134, 230033, 232485, 234785, 237410, 240491, 243731, 247089, 251095, 256073, 261538, 266936, 272535, 278862, 285675, 292292, 298722, 305643, 313236, 320837, 327772, 333872, 339141, 343699, 348261, 354001, 361524, 370283, 379251, 387909, 396482, 405502, 415270, 425533, 435746, 445795, 456243, 467497, 479029, 489922, 499989, 509801, 519751, 529741, 539665, 549503, 558844, 567046, 574006, 580266, 586331, 592400, 598716, 605406, 611819, 616794, 619906, 621902, 623622, 625095, 626022, 626529, 626969, 627319, 627180]
52246F27180r70j806k138j582n80l98j684l273l379j806j18M33K64N95J880L535
52230F16153M760N385N916O823P853Q413Q642R406J0923J2121J1990J0937J0033
52217G29355R533Q987Q311P700O861N446L978L323L323L043K286J757J696J449
52203G97048O27l68j224k254l622m963o017o924p583p572p061o950p642q391q408
52188G18696p925p566p338o889o368o189o287o176n751n444n518n681n497m997
52174F31070m604m515m323l628k835k815l551l841k895j653j580k599l238k789
52160E86204k092j967k065j776j368j439j885k094j900j665j668j870k088k118
52146E60209j830j426j341j690k079k181k149k266k511k791l222l855m372m438
$$ y = [627180, 626210, 624404, 622266, 620684, 620104, 619706, 618022, 614749, 611370, 609564, 609446, 609879, 610143, 610738, 612618, 616153, 620913, 626298, 632214, 639037, 646890, 655303, 663945, 673351, 684274, 696395, 708385, 719322, 729355, 738888, 747875, 756186, 763886, 770747, 776193, 780171, 783494, 786817, 789860, 792146, 793903, 795599, 797048, 797675, 797307, 796083, 793829, 790207, 785244, 779227, 772303, 764720, 757148, 750087, 743137, 735495, 727104, 718696, 710771, 703205, 695867, 688978, 682610, 676421, 670134, 663958, 658207, 652763, 647245, 641564, 636067, 631070, 626466, 621951, 617628, 614000, 611165, 608350, 604799, 600958, 598063, 596410, 594830, 592231, 588993, 586204, 584112, 582145, 580080, 578304, 576936, 575497, 573612, 571518, 569618, 567953, 566285, 564415, 562327, 560209, 558379, 556953, 555612, 553922, 551843, 549662, 547513, 545247, 542736, 539945, 536723, 532868, 528496, 524058]
52132E24058m172l909l705l375k980k886l280l834m027l696l177k814k488j840
52118D77875j052q81j757l040l647l193k190j317r01r42j136r72k57N70J034J321
52102D59515J870K484K589K298K377L138M091M806N418O058O524O778P224Q141
52088E23311R378J0804J2436J3933J4636J4530J4506J5293J6555J7429J7468J6677
52076F96956J5255J3763J3117J3705J4774J5174J4510J3249J1947J0777R604Q233
52064H51064O622N106M125L641L095K158J101J98p39j937l156m115n034o294p701
52049H48134q629q739q285p730p414p423p534p393o911o373n990n556m750l607
52035G51800k511j814j571j470r76K17J799L165M110M913N623N857N431M827M717
$$ y = [524058, 519886, 515977, 512272, 508897, 505917, 503031, 499751, 495917, 491890, 488194, 485017, 482203, 479715, 477875, 476823, 475942, 474185, 471145, 467498, 464305, 462115, 460798, 459897, 458955, 457819, 456847, 456590, 457160, 458194, 459515, 461385, 463869, 466458, 468756, 471133, 474271, 478362, 483168, 488586, 494644, 501168, 507946, 515170, 523311, 532689, 543493, 555929, 569862, 584498, 599028, 613534, 628827, 645382, 662811, 680279, 696956, 712211, 725974, 739091, 752796, 767570, 782744, 797254, 810503, 822450, 833227, 842831, 851064, 857686, 862792, 866917, 870558, 873653, 875811, 876912, 877110, 876371, 874434, 871278, 867163, 862129, 855835, 848134, 839505, 830766, 822481, 814751, 807337, 799914, 792380, 784987, 778076, 771703, 765713, 760157, 755407, 751800, 749289, 747475, 745904, 744434, 743458, 743675, 745474, 748639, 752749, 757662, 763285, 769142, 774573, 779400, 784117]
52020G84117N321O325P134P117O097M719L896L720L423K576J637J042M77m66j523
52005H35612k283l033m352o176p878r088r906j0496j1004j1675j2629j3626j4496
$$ y = [784117, 789438, 795763, 802897, 810014, 816111, 820830, 824726, 828446, 831869, 834445, 836082, 837124, 837601, 837135, 835612, 833329, 830296, 825944, 819768, 811890, 802802, 792896, 782400, 771396, 759721, 747092, 733466, 718970]
$$ [...]
##END NTUPLES=NMR SPECTRUM
##END=
