##TITLE=NES1010_Conilon_9232912_cuLHfhc4Ys
##JCAMPDX= 6.0         $$ Bruker NMR JCAMP-DX V2.0
##DATA TYPE= NMR SPECTRUM
##DATA CLASS= NTUPLES
##ORIGIN= BRUKER
##OWNER= Administrator
$$ 1.72 TOPSPIN		Version 2.1
$$ 2015-08-24 17:03:45.045 -0700  Administrator@X
$$ Compression mode = diff/dup
##.OBSERVE FREQUENCY= 400.02188249412
##.OBSERVE NUCLEUS= ^1H
##.ACQUISITION MODE= SIMULTANEOUS (DQD)
##.ACQUISITION SCHEME= undefined
##.AVERAGES= 64
##.DIGITISER RES= 22
##SPECTROMETER/DATA SYSTEM= spect
##.PULSE SEQUENCE= noesygpps1d.comp
##.SOLVENT NAME= COFFEE_meoh
##.SHIFT REFERENCE= INTERNAL, COFFEE_meoh, 1, 14.96457
##AUDIT TRAIL= $$ (NUMBER, WHEN, WHO, WHERE, PROCESS, VERSION, WHAT)
$$ ##TITLE= Audit trail, TOPSPIN		Version 2.1
$$ ##JCAMPDX= 5.01
$$ ##ORIGIN= Bruker BioSpin GmbH
$$ ##OWNER= Administrator
$$ $$ E:\/data/COFFEE/nmr/NES1010_Conilon_9232912_cuLHfhc4Ys/32/pdata/1/auditp.txt
$$ ##AUDIT TRAIL=  $$ (NUMBER, WHEN, WHO, WHERE, PROCESS, VERSION, WHAT)
(   1,<2015-08-24 17:03:39.701 -0700>,<Administrator>,<X>,<go>,<TOPSPIN 2.1>,
      <created by zg
	started at 2015-08-24 16:52:09.639 -0700,
	POWCHK enabled, PULCHK disabled,
       configuration hash MD5:
       21 0F 79 D6 B3 7B B4 F6 88 20 88 DB 03 48 BD 9F
       data hash MD5: 64K
       BE A4 DE 89 53 2F DA EE C3 54 EE 09 59 10 52 CC>)
(   2,<2015-08-24 17:03:42.905 -0700>,<Administrator>,<X>,<proc1d>,<TOPSPIN 2.1>,
      <Start of raw data processing
       efp LB = 0.3 FT_mod = 6 PKNL = 1 PHC0 = 0 PHC1 = 0 SI = 128K 
       data hash MD5: 128K
       DD F0 A9 F6 2A 7B D0 9E 12 04 87 0B B3 52 BB 4B>)
(   3,<2015-08-24 17:03:43.795 -0700>,<Administrator>,<X>,<proc1d>,<TOPSPIN 2.1>,
      <pk PHC0 = -85.03418 PHC1 = 0 
       data hash MD5: 128K
       EF 43 63 65 48 9F 3C 09 59 E8 DB 4B 17 2F CF 1F>)
(   4,<2015-08-24 17:03:44.217 -0700>,<Administrator>,<X>,<proc1d>,<TOPSPIN 2.1>,
      <abs ABSG = 1 
       data hash MD5: 128K
       75 2E F2 BF EA 1F BF 5E 04 BA 68 37 E4 56 E9 B2>)
(   5,<2015-08-24 17:03:44.311 -0700>,<Administrator>,<X>,<proc1d>,<TOPSPIN 2.1>,
      <abs ABSG = 2 
       data hash MD5: 128K
       16 7B AF 69 33 2A EC 09 76 FC 0E 79 BB 52 45 04>)
(   6,<2015-08-24 17:03:44.389 -0700>,<Administrator>,<X>,<proc1d>,<TOPSPIN 2.1>,
      <abs ABSG = 3 
       data hash MD5: 128K
       6E F0 4B 8B B6 F9 06 45 B0 7F 73 68 5B 98 D1 D6>)
(   7,<2015-08-24 17:03:44.483 -0700>,<Administrator>,<X>,<proc1d>,<TOPSPIN 2.1>,
      <abs ABSG = 4 
       data hash MD5: 128K
       63 C1 7E D9 F9 8E 6B DC 89 26 75 66 0B 53 51 BF>)
(   8,<2015-08-24 17:03:44.623 -0700>,<Administrator>,<X>,<proc1d>,<TOPSPIN 2.1>,
      <abs ABSG = 5 
       data hash MD5: 128K
       2B 37 A5 D4 41 FC 01 89 10 77 A2 C9 2A C9 8B 98>)
$$ ##END=
$$ 
$$ $$ hash MD5
$$ $$ 4A F1 93 9C CC 16 5F 24 5F 00 3C B8 1A 3D 57 78
##$RELAX= 
##$RELAX= 
##$RELAX= 
##$RELAX= 
##$RELAX= 
##$RELAX= 
##$RELAX= 
##$RELAX= 
$$ Bruker specific parameters
$$ --------------------------
##$DU= <E:\>
##$EXPNO= 32
$$ [...]
##$TP07= 0
##$TPNAME0= <>
##$TPNAME1= <>
##$TPNAME2= <>
##$TPNAME3= <>
##$TPNAME4= <>
##$TPNAME5= <>
##$TPNAME6= <>
##$TPNAME7= <>
##$TPOAL= (0..7)
0.5 0.5 0.5 0.5 0.5 0.5 0.5 0.5
##$TPOFFS= (0..7)
0 0 0 0 0 0 0 0
##$TUNHIN= 0
##$TUNHOUT= 0
##$TUNXOUT= 0
##$USERA1= <user>
##$USERA2= <user>
##$USERA3= <user>
##$USERA4= <user>
##$USERA5= <user>
##$V9= 5
##$VALIST= <valist>
##$VCLIST= <CCCCCCCCCCCCCCC>
##$VD= 0
##$VDLIST= <DDDDDDDDDDDDDDD>
##$VPLIST= <PPPPPPPPPPPPPPP>
##$VTLIST= <TTTTTTTTTTTTTTT>
##$WBST= 2048
##$WBSW= 25
##$XGAIN= (0..3)
0 0 0 0
##$XL= 0
##$YL= 0
##$YMAX_a= 6355302
##$YMIN_a= -13115262
##$ZGOPTNS= <>
##$ZL1= 120
##$ZL2= 120
##$ZL3= 120
##$ZL4= 120
##$ABSF1= 14.96457
##$ABSF2= -5.593612
##$ABSG= 5
##$ABSL= 3
##$ALPHA= 0
##$AQORDER= 0
##$ASSFAC= 0
##$ASSFACI= 0
##$ASSFACX= 0
##$ASSWID= 0
##$AUNMP= <proc_prof1d_extract.lims>
##$AXLEFT= 0
##$AXNAME= <>
##$AXNUC= <1H>
##$AXRIGHT= 0
##$AXTYPE= 0
##$AXUNIT= <>
##$AZFE= 0.1
##$AZFW= 0.1
##$BCFW= 0
##$BC_mod= 0
##$BYTORDP= 0
##$COROFFS= 0
##$CY= 15
##$DATMOD= 1
##$DC= 0
##$DFILT= <>
##$DTYPP= 0
##$F1P= 0
##$F2P= 0
##$FCOR= 0.5
##$FTSIZE= 131072
##$FT_mod= 6
##$GAMMA= 0
##$GB= 0
##$INTBC= 1
##$INTSCL= 1
##$ISEN= 128
##$LB= 0.3
##$LEV0= 0
##$LPBIN= 0
##$MAXI= 10000
##$MC2= 0
##$MEAN= 0
##$ME_mod= 0
##$MI= 0
##$NCOEF= 0
##$NC_proc= -2
##$NLEV= 6
##$NOISF1= 0
##$NOISF2= 0
##$NSP= 0
##$NTH_PI= 0
##$NZP= 0
##$OFFSET= 14.96457
##$PC= 1
##$PHC0= -85.03418
##$PHC1= 0
##$PH_mod= 1
##$PKNL= yes
##$PPARMOD= 0
##$PPDIAG= 0
##$PPIPTYP= 0
##$PPMPNUM= 2147483647
##$PPRESOL= 1
##$PSCAL= 4
##$PSIGN= 0
##$PYNMP= <proc.py>
##$REVERSE= no
##$SF= 400.020008208379
##$SI= 131072
##$SIGF1= 0
##$SIGF2= 0
##$SINO= 400
##$SIOLD= 131072
##$SPECTYP= <>
##$SREGLST= <1H.CDCl3>
##$SSB= 0
##$STSI= 131072
##$STSR= 0
##$SW_p= 8223.68421052631
##$SYMM= 0
##$S_DEV= 0
##$TDeff= 65536
##$TDoff= 0
##$TI= <>
##$TILT= no
##$TM1= 0
##$TM2= 0
##$TOPLEV= 0
##$USERP1= <user>
##$USERP2= <user>
##$USERP3= <user>
##$USERP4= <user>
##$USERP5= <user>
##$WDW= 1
##$XDIM= 131072
##$YMAX_p= 459098695
##$YMIN_p= -11880
##$CURPLOT= <Network HP LaserJet P1505>
##$CURPRIN= <$Network HP LaserJet P1505>
##$DFORMAT= <normdp>
##$LAYOUT= <+/1D_H.xwp>
##$LFORMAT= <normlp>
##$PFORMAT= <normpl>
##$SURQMSG= 1
$$ End of Bruker specific parameters
$$ ---------------------------------
##NTUPLES= NMR SPECTRUM
##VAR_NAME=  FREQUENCY,     SPECTRUM/REAL,   SPECTRUM/IMAG
##SYMBOL=    X,             R,               I
##VAR_TYPE=  INDEPENDENT,   DEPENDENT,       DEPENDENT
##VAR_FORM=  AFFN,          ASDF,            ASDF
##VAR_DIM=   131072,        131072,          131072
##UNITS=     HZ,            ARBITRARY UNITS, ARBITRARY UNITS
##FACTOR=    0.0627417313425164, 1,          1
##FIRST=     8223.62146879497, 294,          -42044
##LAST=      0,             1189,            -42541
##MIN=       0,             -11880,          0
##MAX=       8223.62146879497, 459098695,    0
$$ Real data points
##PAGE= N=1
##DATA TABLE= (X++(R..R)), XYDATA
$$ [...]
63634B17791O123M808L051J996J793J582R70M88L83J20m14l48Q26K239K742K386
63618B46536K026J991J854J225J83r78j993k804l559m348m936n118n199n596o085
63603B13199n964m972l492k079j176j060j379j187j52P69P19L62P06J253Q56k3
63587A96380K09J629K587K323J965K424L158L666M478N786O615O277N407M745
63573B47649M063L056K102J400N28m35o61j13R9l97m23O32J446P84m66o99j0L12
63555B58867j76r59j859l071m342n228n786o134n878m912m066m028m256l931l333
63540B00908l202l359l076k432k142k360k605k632k550k398k240k349k607k315
63526A64641j253k95k38o83r46j263k072k756k376j242m77k58K73J383K176J846
$$ plain form
63634 217791 223914 228722 231773 233769 235562 237144 238114 238602 238985 239105 238691 238343 239169 241408 244150 246536
63618 246536 248562 250553 252407 253632 253815 252837 250844 248040 244481 240133 235197 230079 224880 219284 213199
63603 213199 207235 202263 198771 196692 195516 194456 193077 191890 191738 192507 193226 193588 194294 195547 196403 196380
63587 196380 196589 198218 200805 203128 205093 207517 210675 214341 218819 224605 231220 237497 242904 247649
63573 247649 251712 254768 256870 258270 258798 258363 257702 257589 257688 257291 256868 257500 258946 259730 259264 258565 258555 258867
63555 258867 258691 257732 255873 252802 248460 243232 237446 231312 225434 220522 216456 212428 208172 204241 200908
63540 200908 197706 194347 191271 188839 186697 184337 181732 179100 176550 174152 171912 169563 166956 164641
63526 164641 163388 163093 162855 162172 161226 159963 157891 155135 152759 151517 151040 150782 151055 152438 154614 156460
63510A56460P03l36p00m86k02k54n18n16j31K45M20O40R32R14O08O44J157J339
63492A60919P46J89M69J063J034N77N72J070J326J115R17R71J025R98J082J182
63476A75255R51M12K0J43P50J531K068K133K030K258K694K687K143J816K181K788
63460B01860L173L576M248M815N008N208N680N984N891O020O816P690Q039Q324
63446B82332R179J0197J0624J0592J0516R891P927N051K638J408J073J292J968
63433C64688K800L382L722L953L889L477L257L520L474K163j43k376m126n681
63419C85999o968p575p652p820q119p921o885n329l711k352j586j509j600j249
63405C15723m94J87O29J019J428J815K273K852L385L822M296M644M465M033M271
$$ plain form
63510 156460 157163 156827 156127 155641 155439 155185 154667 154151 154020 154265 154685 155325 156257 157171 157779 158423 159580 160919
63492 160919 161665 161854 162323 163386 164420 164997 165569 166639 167965 169080 169997 170968 171993 172991 174073 175255
63476 175255 176206 176618 176638 176781 177531 179062 181130 183263 185293 187551 190245 192932 195075 196891 199072 201860
63460 201860 205033 208609 212857 217672 222680 227888 233568 239552 245443 251463 258279 265969 274008 282332
63446 282332 291511 301708 312332 322924 333440 343331 351258 356309 358947 360355 361428 362720 364688
63433 364688 367488 370870 374592 378545 382434 385911 389168 392688 396162 398325 398182 395806 391680 385999
63419 385999 379031 371456 363804 355984 347865 339944 333059 327730 324019 321667 320081 318572 316972 315723
63405 315723 315229 315416 316045 317064 318492 320307 322580 325432 328817 332639 336935 341579 346044 350077 354348
63390C54348N311O012N678N317O190P897Q969Q791P837O532N016L606K461J178
63376D35143m35j624j738j356j384j574j089p1O22P92Q28N97l52j735k846l680
63360D20098m649n552n943o169o806p419p141o195n562n422n263n194n689o240
63346C36854n828m700m128m349m298l543k938l023l270l269l325l473l174k505
63332B85031k291k667k736k194j982k654l316l015k166j699j626j397j005q41
63318B55442r44j066j206j511j927k290k486k301j533m32L92O95Q00J025J344
63303B44002J607J590Q70o61k219k798k481k272k582k802k558k411k871l518l620
63288B17276l050k158j307q36r93j549j870j687j401j441j780k223k675k939k726
$$ plain form
63390 354348 359659 365671 371349 376666 382856 390753 399722 408513 416350 422882 427898 431504 433965 435143
63376 435143 434708 433084 431346 429990 428606 427032 425943 425872 426494 427286 428114 428711 428359 426624 423778 420098
63360 420098 415449 409897 403954 397785 390979 383560 376419 370224 364662 359240 353977 348783 343094 336854
63346 336854 331026 326326 322198 317849 313551 310008 307070 304047 300777 297508 294183 290710 287536 285031
63332 285031 282740 280073 277337 275143 273161 270507 267191 264176 262010 260311 258685 257288 256283 255442
63318 255442 254498 253432 252226 250715 248788 246498 244012 241711 240178 239746 240138 240833 241633 242658 244002
63303 244002 245609 247199 248069 247408 245189 242391 239910 237638 235056 232254 229696 227285 224414 220896 217276
63288 217276 214226 212068 210761 209925 208932 207383 205513 203826 202425 200984 199204 196981 194306 191367 188641
63273A88641k047j223m98K8J53j43k82L28J301J655J205P48O36J77j124k498k756
63256A84301j735l17O37R43R06R09J098J230R40K58l17l41J34O42P34L73J6K18
63238A90629J024J960K651L095L231K805K023J696K247L053L350L263L294L397
63224B27718L347L463M072M590M198L173K581K756K981K626J809R58M70O84J536
63209B66962K364K650K694K932L056K680K313K710L561L944L782L783M137M391
63195C11959M430M465M201L205J998J623K159K777L198L919M978N702N814N705
63181C66133N605N474N720O773Q075Q647Q668R144J0074J0448J0167J0364J1466
63168D76758J2434J2451J2015J1780J1653J1636J2294J3641J4655J4600J3906
$$ plain form
63273 188641 186594 185371 184873 184901 185054 184911 184629 184957 186258 187913 189118 189866 190502 190679 189555 187057 184301
63256 184301 182566 182249 182886 183829 184735 185644 186742 187972 188912 189170 188853 188512 188646 189288 190022 190395 190411 190629
63238 190629 191653 193613 196264 199359 202590 205395 207418 209114 211361 214414 217764 221027 224321 227718
63224 227718 231065 234528 238600 243190 247388 250561 253142 255898 258879 261505 263314 264272 264742 265426 266962
63209 266962 269326 271976 274670 277602 280658 283338 285651 288361 291922 295866 299648 303431 307568 311959
63195 311959 316389 320854 325055 328260 330258 331881 334040 336817 340015 343934 348912 354614 360428 366133
63181 366133 371738 377212 382932 389705 397780 406427 415095 424239 434313 444761 454928 465292 476758
63168 476758 489192 501643 513658 525438 537091 548727 561021 574662 589317 603917 617823
63157F17823J3169J2283J1076R837Q605O904M691K631R28j097l725o196p972r585
63143F59372j1529j3256j4061j4133j3942j3370j2230j1024j0352j0067r655r002
63131E16751q266p414o440n647n389n749o501p024o465m697k916k425k958l233
63117D41627k934k841l068k771j798j094r61m64Q54K057K336K168K233K417K616
63102D40377L208M017M076L283K988L992N268N633N456N513N447M678L836L824
63088E01596M266M243L877L882M147M010L460K895K186J138L63M66Q35L55j010
63073E36709k439l694n098o349o605n831n050n040n524n764n394m564l727l284
63059D68346l199l117k977l033l166k812j933j284j229j093l35L81J15q69j433
$$ plain form
63157 617823 630992 643275 654351 664188 672793 679697 684388 687019 687947 686850 683125 676929 668957 659372
63143 659372 647843 634587 620526 606393 592451 579081 566851 555827 545475 535408 525753 516751
63131 516751 508485 501071 494631 488984 483595 477846 471345 464321 457856 453159 450243 447818 444860 441627
63117 441627 438693 435852 432784 430013 428215 427121 426160 425696 426550 428607 430943 433111 435344 437761 440377
63102 440377 443585 447602 451678 454961 457949 461941 467209 472842 478298 483811 489258 493936 497772 501596
63088 501596 505862 510105 513982 517864 522011 526021 529481 532376 534562 535700 536063 536529 537364 537719 536709
63073 536709 534270 530576 525478 519129 512524 506693 501643 496603 491079 485315 479921 475357 471630 468346
63059 468346 465147 462030 459053 456020 452854 450042 448109 446825 445596 444503 444168 444549 444664 443795 442362
63044D42362r98N7J110J728J711J269R40R56J067J142J344J394N21j279k744k805
63028D47775j912j198j016r65q88r77j315j802k205j990p63P49J066j42j485j720
63012D31212j218q07k75Q87K163K721K848L478M682N708O222O521O804P052P469
62997D85467Q277R361J0624J2223J3956J5067J5400J6003J7718J9845K1125K1485
62985F66551K1766K2252K2527K2466K2314K2009K1249K0110J8916J7727J6534
62974H94421J5631J5110J4406J2837J0245O684K155k888p589j1851j6568k1976
62962I10617k6782k9849l1801l3787l5600l6306l5929l5097l3656l1166k8347
62951E52297k6508k5688k4770k3228k1503j9751j7592j5184j3317j2255j1482
$$ plain form
63044 442362 441364 441421 442531 444259 445970 447239 448179 449135 450202 451344 452688 454082 454603 453324 450580 447775
63028 447775 445863 444665 443649 442684 441796 440819 439504 437702 435497 433507 432744 433493 434559 434417 432932 431212
63012 431212 429994 429187 428912 429799 431962 434683 437531 441009 445691 451399 457621 464142 470946 477998 485467
62997 485467 493744 503105 513729 525952 539908 554975 570375 586378 604096 623941 645066 666551
62985 666551 688317 710569 733096 755562 777876 799885 821134 841244 860160 877887 894421
62974 894421 910052 925162 939568 952405 962650 969334 971489 968601 961012 949161 932593 910617
62962 910617 883835 853986 822185 788398 752798 716492 680563 645466 611810 580644 552297
62951 552297 525789 500101 475331 452103 430600 410849 393257 378073 364756 352501 341019
62940C41019j0606r704q735p551o506o181o439o519o027n223m423l781l485l531
62926B52308l467k999k564k711l218l499l405l026k199j029l39o93j427j559j134
62911B19039p81n10q3P0n65j475j821j844k272k730k172p30K51J67j84j8N09R74
62893B05825J297J395J065M59K3p2P1N04J218J797J971K175K857L633L853L590
62877B31661L149K305R63J0K03P45K76j091k085k314k512k973l188l069l091l180
62861B15809k788k188k335l261l879l602k983k524k045j512j378j785k273k536
62847A80720k559k055p75O06R80K92m59p43q46q12k55N26N69k59r12p16k23j39
62829A72940l07k62M8L89N25J95n47j012o71n5M2j07K44O11j75j731k134o77R65
$$ plain form
62940 341019 330413 320709 311974 304423 297917 291736 285297 278778 272751 267528 263105 259324 255839 252308
62926 252308 248841 245842 243278 240567 237349 233850 230445 227419 225220 224191 223852 223159 221732 220173 219039
62911 219039 218258 217748 217665 217735 217170 215695 213874 212030 209758 207028 204856 204126 204377 204544 204360 204342 204851 205825
62893 205825 207122 208517 209582 210041 210064 209992 210063 210567 211785 213582 215553 217728 220585 224218 228071 231661
62877 231661 234810 237115 238078 238088 238291 239036 239312 238221 236136 233822 231310 228337 225149 222080 218989 215809
62861 215809 213021 210833 208498 205237 201358 197756 194773 192249 190204 188692 187314 185529 183256 180720
62847 180720 178161 176106 175331 175937 176917 177209 176750 176007 175161 174349 174094 174620 175189 174930 174018 173302 173079 172940
62829 172940 172633 172371 172419 172808 173333 173528 172981 171969 171298 171243 171285 171178 171422 172033 171858 170127 167993 167316 168281
62810A68281J049m0q33q46o60o83q40j034j198j146q18m51k72l55p72j332j317
62793A56733j87J410K145J649Q77P33J117J436J418J185J125J698K811L614L534
62778A81298L216L569M273M311L630L118L098L132L162L518L859L508K764K499
62764B28955K417J408l50j391j392j688k867l648l123k324k471l172l591m068
62750B02695n133o019n642m429l678l571l157k059j014o59p25o26k77m6j75l82
62734A65103p6Q30J611J530Q40L83M09M72M36P11J424K210K863L495L994M135
62718A90370M203M643N171N195N063N661O797P310O987P007Q075R406J0116J0383
62704B86387J0593J0590J0532J1454J4042J7546K0710K3202K5523K8068L0796
$$ plain form
62810 168281 169330 169290 168457 167611 166951 166268 165428 164394 163196 162050 161232 160781 160509 160154 159382 158050 156733
62793 156733 156546 157956 160101 161750 162627 163360 164477 165913 167331 168516 169641 171339 174150 177764 181298
62778 181298 184514 188083 192356 196667 200297 203415 206513 209645 212807 216325 220184 223692 226456 228955
62764 228955 231372 232780 232430 231039 229647 227959 225092 221444 218321 215997 213526 210354 206763 202695
62750 202695 197562 191543 185901 181472 177794 174223 171066 169007 167993 167334 166609 165983 165706 165660 165485 165103
62734 165103 165027 165857 167468 168998 169838 170221 170630 171102 171538 172249 173673 175883 178746 182241 186235 190370
62718 190370 194573 199216 204387 209582 214645 220306 227103 234413 241400 248407 256482 265888 276004 286387
62704 286387 296980 307570 318102 329556 343598 361144 381854 405056 430579 458647 489443
62693D89443L3347L5225L6258L6983L7910L8493L7720L5603L3006K9991K5688
62682H69667J9971J3912Q152K193m276j0630j6471k2154k7538l1533l3670l4960
62670G32663l6304l7182l6793l5437l3779l1768k9241k6816k5183k4080k2785
62659C93295k1070j9075j6876j4771j3268j2345j1358j0104r138q663q069o996
62647B41562n914n158m470l849l821m303m400l864l529l678l369k106q99p37j189
62632A90276j461j672k082k264j980j858k193k225j565j153j660k200j775q85
62618A65303m58l26q2k65j138j452j72J461J490J88m53K23R56Q81N96O15M20l85
62600A67402j189j192m43L91Q05Q49R83J496J978J689P04KJ52O32Q75J095J486
$$ plain form
62693 489443 522790 558015 594273 631256 669166 707659 745379 780982 813988 843979 869667
62682 869667 889638 903550 911702 913895 909619 898989 882518 860364 832826 801293 767623 732663
62670 732663 696359 659177 622384 586947 553168 521400 492159 465343 440160 416080 393295
62659 393295 372225 353150 336274 321503 308235 295890 284532 274428 265290 256627 248558 241562
62647 241562 235648 230490 226020 222171 218350 214047 209647 205783 202254 198576 195207 193101 192202 191465 190276
62632 190276 188815 187143 185061 182797 180817 178959 176766 174541 172976 171823 170163 167963 166188 165303
62618 165303 164845 164519 164437 164172 163034 161582 161410 162871 164361 164549 164096 164319 165275 166156 166752 167367 167787 167402
62600 167402 166213 165021 164578 164969 165774 166623 167606 169102 171080 172769 173473 173475 173627 174259 175134 176229 177715
62583A77715J540R16J58k76p32j330j210Q3J383J385N25J04K27K0n47o08QM50
62565A79811J16p07j520k023j971j373p07m01l57m12p83j446j692j027J8O81J024
62548A67231J420J674J413Q65M68K46K03O30J428J883J787J822K222K145J245
62533A86682O72J402K705L460L817M256M203L244K564L398M889N362M997N256
62519B36907O269O899P105Q086J0008J1566J2121J2607J3938J5844J7643J9006
62507C77999J9735J9824J9796K0045J9953J8735J6802J5121J3475J0787O952L006
62495E62230m96l910p315j0210j2479j4430j5900j6445j6316j6060j5386j3790
62483D19493j2047j1495j1838j1300r203o776n081l667j846L0J294J937K284K463
$$ plain form
62583 177715 179255 180171 180329 180053 179321 177991 176781 176864 178247 179632 180157 180261 180488 180508 179961 179353 179361 179811
62565 179811 179927 179220 177700 175677 173706 172333 171626 171225 170868 170456 169673 168227 166535 165508 165526 166207 167231
62548 167231 168651 170325 171738 172603 173071 173317 173520 174150 175578 177461 179248 181070 183292 185437 186682
62533 186682 187354 188756 191461 194921 198738 202994 207197 210441 213005 216403 221292 226654 231651 236907
62519 236907 243176 250075 257180 265266 275274 286840 298961 311568 325506 341350 358993 377999
62507 377999 397734 417558 437354 457399 477352 496087 512889 528010 541485 552272 559224 562230
62495 562230 561734 557824 550509 540299 527820 513390 497490 481045 464729 448669 433283 419493
62483 419493 407446 395951 384113 372813 363610 356834 351753 348086 346240 346270 347564 349501 351785 354248
62469C54248K635K954L089K460J092m50j881l155l823l501k767k520k637k434
62455C43310k146k458k846k144p71m62j475j964q47N94J011J072J931L021L091
62440C38917K533K891M465N914O335O414P264Q941J0587J1524J1869J2275J3305
62427D43234J4958J6602J7325J6620J4921J3332J2534J1970J0620Q437O374M879
62415E91806L280R87j575l813n828p757r150r823j0461j1476j2049j1376r995
62402E02770q792p499n537l520k394j672j30K177M180N661P254Q870R919J0991
62388E22278J3477J7353K0992K3416K5279K7343K9529L1728L4104L6226L7159
62377H18884L6795L5863L4520L2179K8924K5606K2293J8062J2680P109J918l313
$$ plain form
62469 354248 356883 359837 362926 365386 366478 366028 364147 360992 357169 353668 350901 348381 345744 343310
62455 343310 341164 338706 335860 333716 332945 332483 331008 329044 328197 328791 329802 330874 332805 335826 338917
62440 338917 341450 344341 348806 354720 361055 367469 374733 383674 394261 405785 417654 429929 443234
62427 443234 458192 474794 492119 508739 523660 536992 549526 561496 572116 580553 586927 591806
62415 591806 595086 596073 594498 590685 584857 577100 567950 558127 547666 536190 524141 512765 502770
62402 502770 493978 486479 480942 477422 475028 473356 473226 475403 479583 485244 492498 501368 511287 522278
62388 522278 535755 553108 574100 597516 622795 650138 679667 711395 745499 781725 818884
62377 818884 855679 891542 926062 958241 987165 1012771 1035064 1053126 1065806 1072915 1074833 1071520
62365A071520q587j2997j6189j8917k1368k2364k1192j9026j7565j7092j6823
62354H79400j6409j6177j6312j6491j6068j4389j1348p741m612k150J13K290M109
62341G64215N721P526R302J0536J1390J2209J2386J1073Q888P290O268M358J125
62328H72287k173m684o927r113j0419j0705j1238j2641j3747j3565j2960j3115
62316G51000j3677j3667j3088j2334j1023q858o820o081o247n911m619l178k286
62303F43211j901j827j999k219k173j776j194o56m06n28p30o62m19k63P4J039
62287F27571K318L099L329L782M783N894O944Q295R833J0811J1034J1260J2086
62274G21039J3373J4964J6868J8550J9162J8814J8496J8451J7858J6386J4756
$$ plain form
62365 1071520 1062933 1049936 1033747 1014830 993462 971098 949906 930880 913315 896223 879400
62354 879400 862991 846814 830502 814011 797943 783554 772206 764465 759853 757703 757816 760106 764215
62341 764215 769936 777462 786764 797300 808690 820899 833285 844358 853246 860536 866804 871162 872287
62328 872287 870114 865430 858503 849390 838971 828266 817028 804387 790640 777075 764115 751000
62316 751000 737323 723656 710568 698234 687211 678353 671533 665452 659205 653294 648675 645497 643211
62303 643211 641310 639483 637484 635265 633092 631316 630122 629466 629060 628532 627802 627140 626721 626458 626532 627571
62287 627571 629889 632988 636317 640099 644882 650776 657720 666015 675848 686659 697693 708953 721039
62274 721039 734412 749376 766244 784794 803956 822770 841266 859717 877575 893961 908717
62263I08717J3395J1861J0106Q871Q282P405N848M450L653K643Q61r59k128l033
62249I79972l916l933k597r14N9P31J895L173L763L953M633N893P175Q220R000
62234A017107R347R357R545R929R817R116Q869R668J0612J0749J0574J1050J2043
62221A147783J2808J3182J3291J2859J1862J1098J1104J1246J0848J0381J0484
62210A276946J0658J0104R215R069R908J1150J2334J3148J3125J2382J2060J3032
62198A413131J4669J5744J6024J6050J6000J5820J5901J6613J7572J8274J8994
62187A594792K0163K1433K2225K2729K3521K4589K5544K6260K6649K6338K5303
62176A859546K4163K3172K1626J8958J5700J2603R744P214N649N051M042J518
$$ plain form
62263 908717 922112 933973 944079 952950 961232 968637 974485 978935 982588 985231 986092 985133 983005 979972
62249 979972 976056 972123 969526 968612 968671 969402 971297 974470 978233 982186 986819 992712 999887 1008107 1017107
62234 1017107 1026454 1035811 1045356 1055285 1065102 1074218 1083087 1092755 1103367 1114116 1124690 1135740 1147783
62221 1147783 1160591 1173773 1187064 1199923 1211785 1222883 1233987 1245233 1256081 1266462 1276946
62210 1276946 1287604 1297708 1306923 1315992 1325900 1337050 1349384 1362532 1375657 1388039 1400099 1413131
62198 1413131 1427800 1443544 1459568 1475618 1491618 1507438 1523339 1539952 1557524 1575798 1594792
62187 1594792 1614955 1636388 1658613 1681342 1704863 1729452 1754996 1781256 1807905 1834243 1859546
62176 1859546 1883709 1906881 1928507 1947465 1963165 1975768 1985512 1992726 1998375 2003426 2007468 2008986
62164B008986j836m722p093r519j1648j2744j3148j3694j4130j3585j2307j1557
62152A883003j1878j2632j3098j3002j2200j0745r217q142p314o424n780n642
62140A766929n419m440l076k194k000k175k519k697k077q24k72j180k410k519
62126A733127j815j563j951k316k624l188l522l162l067m515o914q364q292p857
62112A673977p917q222q587r241r836r648q987q997r816j0270r733q942q680q787
62098A546314q930r234r700r970j0057j0466j1192j1518j1073j0372r937r556
62086A424309q713p153m790j603K140O049J0106J4548J9129K2716K3648K0439
62074A520825J2686J948q622j6044j8980j7600j3075p798n085p315j4409k4539
$$ plain form
62164 2008986 2007150 2002428 1995335 1985816 1974168 1961424 1948276 1934582 1920452 1906867 1894560 1883003
62152 1883003 1871125 1858493 1845395 1832393 1820193 1809448 1800231 1792089 1784775 1778351 1772571 1766929
62140 1766929 1761510 1757070 1753994 1751800 1749800 1747625 1745106 1742409 1740332 1739508 1739236 1738056 1735646 1733127
62126 1733127 1731312 1729749 1727798 1725482 1722858 1719670 1716148 1712986 1709919 1705404 1698490 1690126 1681834 1673977
62112 1673977 1666060 1657838 1649251 1640010 1630174 1620526 1611539 1602542 1592726 1582456 1572723 1563781 1555101 1546314
62098 1546314 1537384 1528150 1518450 1508480 1498423 1487957 1476765 1465247 1454174 1443802 1433865 1424309
62086 1424309 1415596 1408443 1403653 1402050 1404190 1410239 1420345 1434893 1454022 1476738 1500386 1520825
62074 1520825 1533511 1535459 1526837 1510793 1491813 1474213 1461138 1453340 1448255 1440940 1426531 1401992
62062A401992l5610m5439n1738n3516n2154m9875m7471m4489m0965l7553l4383
62051I08799l1166k8245k6213k4656k2660k0401j8895j8253j7489j6130j4712
62040F69979j3621j2634j1803j1583j1894j1993j1535j0853j0201r579r263r528
62028E35492r853r477q676q433q793q682p504n862m540l761l527l765l908l296
62014D45415k114j160o83l40k12p62j772k414k567k986l929m751n074n368n905
61999D05378o156n691m897m295l805l186k619k415k467k396j958j176k80M14P73
61984C65224R79J285J815K725M027N134N223M415L872M234M868N230N861P144
61970D22036Q123P866P117P132P552O942N008K716N55j763m029n467n993o321
$$ plain form
62062 1401992 1366382 1320943 1269205 1215689 1163535 1113660 1066189 1021700 980735 943182 908799
62051 908799 877633 849388 823175 798519 775859 755458 736563 718310 700821 684691 669979
62040 669979 656358 643724 631921 620338 608444 596451 584916 574063 563862 554283 545020 535492
62028 535492 525639 516162 507486 499053 490260 481578 474074 468212 463672 459911 456384 452619 448711 445415
62014 445415 443301 442141 441458 441118 440906 440144 438372 435958 433391 430405 426476 421725 416651 411283 405378
61999 405378 399222 393531 388634 384339 380534 377348 374729 372314 369847 367451 365493 364317 364037 364451 365224
61984 365224 366203 367488 369303 372028 376055 381189 386412 390827 394699 398933 403801 409031 414892 422036
61970 422036 430159 438025 445142 452274 459826 466768 471776 474492 475047 473284 469255 463788 457795 451474
61956D51474o769p032o983o703n892m412l003k378j992r73K56P26P44J286K020
61941D10369J752P31N45J664K858L280L425L758M070M511N685P375Q661R600J1270
61926D79554J3873J6425J8641K1438K5108K8571L1040L2869L4045L3406L0083
61915G65053K4505J7343Q746p27r679j7081k2924k7256k9734l0493l0228k9044
61903F18481k6523k3223k0656j9256j7909j5965j4175j3044j1924j0524r632r370
61891D26280q331n696k795j253p32R2J382K351K866L530M551N603O449P018P270
61876D48585P456P974Q559Q452P689P270P590P837P517P338P819Q198P631O510
61862E56425N634N029M493M371M877N414N487N540O010O386O110N598N428N245
$$ plain form
61956 451474 444705 437673 430690 423987 418095 413683 410680 408302 406310 405337 405593 406319 407063 408349 410369
61941 410369 412121 412852 413397 415061 417919 421199 424624 428382 432452 436963 442648 450023 458684 468284 479554
61926 479554 493427 509852 528493 549931 575039 603610 634650 667519 701564 734970 765053
61915 765053 789558 806901 815647 814920 805241 788160 765236 737980 708246 677753 647525 618481
61903 618481 591958 568735 548079 528823 510914 494949 480774 467730 455806 445282 435650 426280
61891 426280 417949 412253 409458 408205 407473 407565 408947 411298 414164 417694 422245 427848 434297 441315 448585
61876 448585 456041 464015 472574 481026 488715 495985 503575 511412 518929 526267 534086 542284 549915 556425
61862 556425 562059 567088 571581 575952 580829 586243 591730 597270 603280 609666 615776 621374 626802 632047
61848F32047M438L286K466J996J476Q44J31r00k086k475j512J2R61J254J450J574
61832F44962J269O29N3l20l67L02J702L064L834M460N484O473O812O934P680Q795
61816G01766R135Q325P265O953P585Q838J0446J2234J4039J5762J7380J8924K0510
61803H59162K2214K3907K5410K6829K8395L0075L1713L3512L5779L8318M0709
61792A196023M3132M6141M9639N2731N4659N5087N3440M8885M1093L0290J6653
61781A687773O78j5799l0187m1051m8676n3618n5965n6088n4837n2500m8708m3788
61769A187234l8992l4971l1155k7176k3632k0831j8044j4796j1838r973q899p931
61757I38996o999o203n202l833k559j735j164q26j100j842k275k246k514l265
$$ plain form
61848 632047 636485 639771 642237 644233 645709 646553 646684 645784 643698 641223 639711 639723 640684 641938 643388 644962
61832 644962 646231 646860 646913 646593 646226 646528 648230 651294 655128 659588 665072 671545 678357 685291 692971 701766
61816 701766 710901 719226 726491 733444 741029 749867 760313 772547 786586 802348 819728 838652 859162
61803 859162 881376 905283 930693 957522 985917 1015992 1047705 1081217 1116996 1155314 1196023
61792 1196023 1239155 1285296 1334935 1387666 1442325 1497412 1550852 1599737 1640830 1671120 1687773
61781 1687773 1688451 1672652 1642465 1601414 1552738 1499120 1443155 1387067 1332230 1279730 1231022 1187234
61769 1187234 1148242 1113271 1082116 1054940 1031308 1010477 992433 977637 965799 955826 946927 938996
61757 938996 931997 925794 920592 916759 914200 912465 911301 910475 909375 907533 905258 903012 900498 897233
61743H97233l560k951k417k886l914m610m838m772m251l397k802k480j672k86
61729H52397P15J002J518K606L069K169J040Q20Q33L6j043j406j440j958k409
61714H57949j787o08k19p11j106j138j300j490j232q56j132j869k186j894j533
61699H38888j302j106j301k209l293l957m727o420q551r939j0625j1742j3553
61686G60163j4939j5052j4287j3431j2728j2090j1487j0944j0549j0472j0559
61675F23625j0229r185p859o671n414m003l165l475m255m378l794l329l292l217
61661E51359k834k414k133j815j331p91m17m54r63j580j880k114k850l815l994
61646E21974l184k509k868l886m846n576n869n207l914l363m156n191n424n364
$$ plain form
61743 897233 893673 890722 888305 885419 881505 876895 872057 867285 863034 859637 856835 854355 852683 852397
61729 852397 853112 854114 855632 858238 861307 863476 864516 865336 866169 866205 865162 863756 862316 860358 857949
61714 857949 856162 855554 855335 854624 853518 852380 851080 849590 848358 847502 846370 844501 842315 840421 838888
61699 838888 837586 836480 835179 832970 829677 825720 820993 814573 806022 796083 785458 773716 760163
61686 760163 745224 730172 715885 702454 689726 677636 666149 655205 644656 634184 623625
61675 623625 613396 604211 596352 589681 584267 580264 577099 573624 569369 564991 561197 557868 554576 551359
61661 551359 548525 546111 543978 542163 540832 540041 539624 539170 538207 536627 534747 532633 529783 525968 521974
61646 521974 518790 516281 513413 509527 504681 499105 493236 488029 484115 480752 476596 471405 465981 460617
61632D60617n760o085n611m902m811m938m506l898l877m058l676l135l341m069
61618C97950m400m265m154l907l140k385k355k592k272j820k207l068l099k072
61604C56214j008m46rM47O19O64J178K169L080L672M043M021L495K942K752K480
61588C86313J736J212J689K656L182L511M498N984P291Q757J1244J4391J6970
61575D69434J8657J9937K0334J8472J4059Q435K905k312p326j1862j5507j7826
61563E17400j8328j7089j5175j3562j2015r930p732o244n282m137k975k375j908
61550D00648p00Q37J413Q19N2l95r27j595j861j661j402j045l57J28j81n78J00
61533C93295J427J899J337J052J555J949J885K278L503M580M923N431O935Q811
$$ plain form
61632 460617 454857 448772 443161 438259 433448 428510 424004 420106 416229 412171 408495 405360 402019 397950
61618 397950 393550 389285 385131 381224 378084 375699 373344 370752 368480 366660 364453 361385 358286 356214
61604 356214 355206 354760 354751 355198 355817 356481 357659 359828 362908 366580 370623 374644 378139 381081 383833 386313
61588 386313 388049 389261 390950 393606 396788 400299 404797 410781 418072 426829 438073 452464 469434
61575 469434 488091 508028 528362 546834 560893 569328 572233 569921 562595 550733 535226 517400
61563 517400 499072 481983 466808 453246 441231 431301 423569 417325 412043 407906 404931 402556 400648
61550 400648 399948 400785 402198 403017 403069 402674 401747 400152 398291 396630 395228 394183 393826 393954 393773 393195 393295
61533 393295 394722 396621 397958 399010 400565 402514 404399 406677 410180 414760 419683 425114 432049 440860
61519D40860J0113J1092J2576J4571J6405J7889J9544K1860K4835K8142L1484
61508F49371L4763L7962M0806M2745M3217M1610L7020K9022J8992R790L470rj503
61495I87256j212Q03L896P668J2539J8526K4586L0226L6401M3403M9175N1401
61483A264668N0185M6778M0728L0463J5980j076j9290l7289n2402o1983o6111
61472A210651o6938o5619o1865n6231n0408m5114l9748l4375k9997k6682k3324
61461G10350j9580j6238j3576j1044q715p127n658l035M21L093M754O881R961
61448F50487J2676J4337J6022J8565K1251K3326K5257K7709L0665L3906L6896
61437I11097L7949L5137K8423J9526R677o80j0155j6687k0006k1666k2224k0630
$$ plain form
61519 440860 450973 462065 474641 489212 505617 523506 543050 564910 589745 617887 649371
61508 649371 684134 722096 762902 805647 848864 890474 927494 956516 975508 985298 988768 988759 987256
61495 987256 986044 986847 990743 998411 1010950 1029476 1054062 1084288 1120689 1164092 1213267 1264668
61483 1264668 1314853 1361631 1402359 1432822 1448802 1447726 1428436 1391147 1338745 1276762 1210651
61472 1210651 1143713 1078094 1016229 959998 909590 864476 824728 790353 760356 733674 710350
61461 710350 690770 674532 660956 649912 641197 634070 628412 625377 625798 628891 633645 640526 650487
61448 650487 663163 677500 693522 712087 733338 756664 781921 809630 840295 874201 911097
61437 911097 949046 984183 1012606 1032132 1041809 1041129 1030974 1014287 994281 972615 950391 929761
61425I29761j6832j2601q820m427J030O070R806J3579J8498K3199K5476K4497
61413A009236K0046J1502o25j3473k3926l1043l5317l6881l5869l3376l0527k7343
61401G72404k3657k0232j7815j5968j3900j1620r387p020m687l323l173k939j448
61388F37235P21K314L234M247N617P017Q156Q719Q331P335O875P483Q323Q411
61374G24018P878P454P435P655P713O914M864K359O83j68j295k834l660l568l971
61359G61477n685p646q737r308r893r953r116q296q266q307p537o491o070n877
61345F50295m945l336j819n81O73J938L159M629O327P512P749P619P738P799P343
61330G02100O689O348O236O043N674M877L336J560O69P72P03j31q77q55p27j220
$$ plain form
61425 929761 912929 900328 891508 887081 888111 894181 903987 917566 936064 959263 984739 1009236
61413 1009236 1029282 1040784 1040159 1026686 1002760 971717 936400 899519 863650 830274 799747 772404
61401 772404 748747 728515 710700 694732 680832 669212 659825 652805 648118 644795 641622 638683 637235
61388 637235 637956 640270 643504 647751 653368 660385 668541 677260 685591 692926 699801 707284 715607 724018
61374 724018 731896 739350 746785 754440 762153 769067 773931 776290 776973 776805 775510 772676 769016 765448 761477
61359 761477 755792 748146 739409 730101 720208 710255 701139 692843 684577 676270 668733 662242 656172 650295
61345 650295 645350 642014 640195 639614 640287 642225 645384 650013 656340 663852 671601 679220 686958 694757 702100
61330 702100 708789 715137 721373 727416 733090 737967 741303 742863 743532 744304 745007 744876 743999 743144 742417 741197
61314G41197j985k618l576m977n678m797l224k524l081m307n795p247q048p985
61300F75355p859q432r315r611r079q012o669n451m926n009m816l801k402j133
61286E88840P1J258K102K632L328M155M546M636N320O623P362O952O313O385P026
61271F57549P920R169J0371J0529R635R023R347R587Q893Q006P965Q595R167R452
61257G85208R375Q852Q581R629J1661J3038J3322J4052J6245J9034K1656K4925
61245I55578K9388L3901L7454M0771M4422M6646M4729L7611K6020J1316m338j7934
61233A285564k7398l2780l4889l3964l0535k6108k1563j6147r236j837M813J0734
61221A066654J6131K0240K2458K3092K1690J6286N972p179k0276l2181m2448m9461
$$ plain form
61314 741197 739212 736594 733018 728041 722363 717566 714342 711818 708737 704430 698635 691388 683340 675355
61300 675355 667496 659064 649749 640138 631059 623047 616378 610927 606001 600992 596176 592375 589973 588840
61286 588840 588911 590169 592271 594903 598231 602386 606932 611568 616888 623511 630873 637825 644138 650523 657549
61271 657549 665469 674638 685009 695538 705173 714196 723543 733130 742023 750029 757994 766589 775756 785208
61257 785208 794583 803435 812016 821645 833306 846344 859666 873718 889963 908997 930653 955578
61245 955578 984966 1018867 1056321 1097092 1141514 1188160 1232889 1270500 1296520 1307836 1303498 1285564
61233 1285564 1258166 1225386 1190497 1156533 1125998 1099890 1078327 1062180 1052944 1051107 1055920 1066654
61221 1066654 1082785 1103025 1125483 1148575 1170265 1186551 1192523 1185344 1165068 1132887 1090439 1040978
61209A040978n1890n0807m8331m5098m0870l6456l3023l0256k7160k3954k1492
61198F31641j9535j7299j5055j3565j2526j1165r719q896q504p926p248o640n574
61185D87989l943k960l481m465m539m029l917l812k773j284o37r18j176j009o00
61170D48446J60J277K093K296K647L603M273L905L225L022K690J621O66O26N80
61155D81130n54k020k574k598l137l872l919l584l593l601l208l239m189m671
61141D36371l378j454q41j351j516j256j417j634r22K28O18M35N73O31k42j245
61125D23600r34K92Q63O72R06J762K445K923L659M065L252J873J350J666J800
61110D50194J669J804J771R45K22Q35K042K069R03J03K86P31J062J389J347Q12
$$ plain form
61209 1040978 989088 938281 889950 844852 803982 767526 734503 704247 677087 653133 631641
61198 631641 612106 594807 579752 566187 553661 542496 532777 523881 515377 507451 500203 493563 487989
61185 487989 484046 481086 477605 473140 468601 464572 460655 456843 454070 452786 452149 451231 450055 449046 448446
61170 448446 448606 449883 451976 454272 456919 460522 464795 468700 471925 474947 477637 479258 479924 480550 481130
61155 481130 480576 478556 475982 473384 470247 466375 462456 458872 455279 451678 448470 445231 441042 436371
61141 436371 432993 431539 430698 429347 427831 426575 425158 423524 422602 422830 423448 423883 424456 425087 424845 423600
61125 423600 422666 422958 423821 424493 425399 427161 429606 432529 436188 440253 443505 445378 446728 448394 450194
61110 450194 451863 453667 455438 456383 456605 457440 459482 461551 462454 462557 462843 463574 464636 466025 467372 468184
61094D68184R37K557M250M063K564J976K822L613L475K960K497K064K108L030
61080E07100M058M291M262M892N656N561N057N039M901L708K486K994M852O067
61066E70924N944N536N679O508Q163J0235J1325J0923J0742J2354J4808J6579
61054F89720J8314K1211K4184K5416K5530K6292K7349K7157K6120K5775K5704
61043I62772K4278K1780J9779J8089J5321J1757Q741N840J711k828n642o701p688
61030A067209q740q608p546o988o739n459l456k122j061J188M188O315P818J0109
61016A046108J2752J4355J5670J8514K2229K4663K6069K8551L2193L5268L7888
61005A314260M1839M7025N1460N4658N7849O1271O4200O7087P0593P3476P4458
$$ plain form
61094 468184 469121 471678 475928 479991 482555 484531 487353 490966 494441 497401 499898 501962 504070 507100
61080 507100 511158 515449 519711 524603 530259 535820 540877 545916 550817 554525 557011 560005 564857 570924
61066 570924 576868 582404 588083 594591 602754 612989 624314 635237 645979 658333 673141 689720
61054 689720 708034 729245 753429 778845 804375 830667 858016 885173 911293 937068 962772
61043 962772 987050 1008830 1028609 1046698 1062019 1073776 1082517 1088357 1090068 1087240 1081598 1074897 1067209
61030 1067209 1058469 1049861 1042315 1035327 1028588 1023129 1019673 1017551 1016490 1017678 1021866 1028181 1035999 1046108
61016 1046108 1058860 1073215 1088885 1107399 1129628 1154291 1180360 1208911 1241104 1276372 1314260
61005 1314260 1356099 1403124 1454584 1509242 1567091 1628362 1692562 1759649 1830242 1903718 1978176
60994A978176P4974P6814P8779P9307Q0499Q5316R2436R8175J01835J04852J07029
60983B958192J08704J14282J27969J47959J70403J96393K28489K63232K94743
60974D610366L23737L55740L93613M40519N06441O00577P19772Q56153J013228
60965I820146J201060J420440J671753J978517K380349K904152L569930M410698
60957B9357045N400316O293844O598242N855420M060728J787422j65226j274477
60949E7913314j476643r63690L8180J226205K088305K036632Q13443j240521l379917
60940E7055308m944102n689775n746744n375966m800930m174859l589390l075415
60932A9658127k622895k219838j868069j568105j310516j088052r02550p54840
$$ plain form
60994 1978176 2053150 2129964 2208743 2288050 2368549 2453865 2546301 2644476 2746311 2851163 2958192
60983 2958192 3066896 3181178 3309147 3457106 3627509 3823902 4052391 4315623 4610366
60974 4610366 4934103 5289843 5683456 6123975 6630416 7230993 7950765 8806918 9820146
60965 9820146 11021206 12441646 14113399 16091916 18472265 21376417 24946347 29357045
60957 29357045 34757361 41051205 47649447 53504867 57565595 59353017 59187791 57913314
60949 57913314 56436671 55472981 55511161 56737366 58825671 60862303 61675746 60435225 57055308
60940 57055308 52111206 46421431 40674687 35298721 30497791 26322932 22733542 19658127
60932 19658127 17035232 14815394 12947325 11379220 10068704 8980652 8078102 7323262
60924G323262o38244n45675m73959m18186l70359l26868k90180k60743k33967
60915C765081k07136j82440j61089j40902j22041j08949j03822j03198j03078
60906B532426j02641j01151r6354q8216p9890p3044o6099n8442n2181m8332m5279
60895A720797m2373m1091m1376m0864l9066l8455m0012m1483m1324m0744m0545
60884A273464l9513l7305l5482l4452l2666k9886k7915k7078k5419k2453k0235
60873I41060j9563j8640j6677j5390j5501j5180j3480j2099j2099j1882j0096
60862G80453p732n778l488n71J586K400L368N432P369Q156Q659R637J0264R962
60848H29717R617R828R876R518R735J0837J1766J2034J2327J2478J1152Q283N671
$$ plain form
60924 7323262 6685018 6139343 5665384 5247198 4876839 4549971 4259791 3999048 3765081
60915 3765081 3557945 3375505 3214416 3073514 2951473 2842524 2738702 2635504 2532426
60906 2532426 2429785 2328634 2232280 2144064 2064174 1991130 1925031 1866589 1814408 1766076 1720797
60895 1720797 1678424 1637333 1595957 1555093 1516027 1477572 1437560 1396077 1354753 1314009 1273464
60884 1273464 1233951 1196646 1161164 1126712 1094046 1064160 1036245 1009167 983748 961295 941060
60873 941060 921497 902857 886180 870790 855289 840109 826629 814530 802431 790549 780453
60862 780453 772721 766943 763455 762884 764470 766870 770238 775670 783039 791195 799854 809491 819755 829717
60848 829717 839334 849162 859038 868556 878291 889128 900894 912928 925255 937733 948885 957168 962839
60835I62839M308L333K280J974K321J632q15l611n563p091q474q891q188p583
60821I28471p808q428r610j2350j6186j8967j9846k0402k1814k3048k2873k1707
60809G25432k0430j9122j7941j7447j7304j6301j4379j2877j2228j1357r845q707
60797E47494q258p286n155k957j733j216r01o58N1J780L601L985L422M000O115
60782E42284P962Q617R145J0096J0535J0337J0819J2099J2348J0841R263Q753
60770F63099Q061O103M052L209K701J053j546m049o273q399r942j0407r983q873
60756F28806p105n469n221o343p561q472r914j1866j2926j2469j1489j0671r569
60743E09731q263p756q078p922o927o334o663o785o095n502n486n213m446m163
$$ plain form
60835 962839 967147 970480 972760 974734 977055 978687 977872 974261 968698 961607 953133 944242 936054 928471
60821 928471 920663 912235 902625 890275 874089 855122 835276 814874 793060 770012 747139 725432
60809 725432 705002 685880 667939 650492 633188 616887 602508 589631 577403 566046 556201 547494
60797 547494 539236 531950 526795 523838 522105 520889 519988 519330 519381 521161 524762 528747 532169 536169 542284
60782 542284 550246 558863 568008 578104 588639 598976 609795 621894 634242 645083 654346 663099
60770 663099 671160 677263 681315 684524 687225 688278 686732 682683 676410 668011 658069 647662 637679 628806
60756 628806 621701 616232 611011 604668 597107 588635 578721 566855 553929 541460 529971 519300 509731
60743 509731 501468 493712 485634 477712 470785 464451 457788 451003 444908 439406 433920 428707 424261 420098
60729D20098m412l771k002r01j358j754o35J118K247L164M491N386N033M288M373
60714D35365N162N999O874P735Q038P952Q534R883J0739J0669J0842J1745J2133
60701E51670J1302J0408J0319J0085Q891P619O994O015L756J104q68k664n071
60688F19560p579r535j1394j3390j4496j4130j3507j3812j4418j4298j3786j3431
60676D65784j2579j0706q899q335q347p622o351n662n672n584n057m284l277k101
60662C71308j264j111j340j598j780j523n42K41o34k987m953n521n539n683n368
60647C31706m328l428l042k388j343r99j546j523l30O08L13J7R54K251K542K056
60631C21520J592R46j27q07n21o0j58k38K29N39J42k62j40j42n60l53R97K294
$$ plain form
60729 420098 415686 411915 409913 409012 407654 405900 405265 406383 408630 411794 416285 421671 426704 430992 435365
60714 435365 440527 446526 453400 461135 469173 477125 485659 495542 506281 516950 527792 539537 551670
60701 551670 562972 573380 583699 593784 602675 610294 617288 623303 627059 628163 627295 624631 619560
60688 619560 611981 602446 591052 577662 563166 549036 535529 521717 507299 493001 479215 465784
60676 465784 453205 442499 433600 425265 416918 409296 402945 397283 391611 386027 380970 376686 373409 371308
60662 371308 370044 368933 367593 365995 364215 362692 362150 362391 361757 358770 353817 348296 342757 337074 331706
60647 331706 327378 323950 320908 318520 317177 316178 314632 313109 312779 313387 313700 313717 314671 316922 319464 321520
60631 321520 323112 324058 323931 323124 322603 322543 322385 322147 322376 322915 323057 322795 322655 322513 321953 321600 322597 324891
60613C24891K482K205K298K369K173K572L781M337L332J987J655J938K244L259
60599C61523N214O528O133N469O219P648Q179Q140Q796R992J0770J1243J1912
60586D67766J2262J1898J1945J3377J4992J4968J3387J1427R030N355P45l555
60574E83597o991r540j0807j0720j0261j0118r552p983o518o389o957o796n707
60561D75258m294k707j207p65j600k379k278k369l536m544m007k629j661o22J270
60546D41930K934L041K620L590N612O763O674O707P506Q496R452J0750J2322J3905
60532E42302J5844J8423K1047K3355K6098K9811L3778L7716M2893N0091N8076
60521H99434O5826P4511Q5048R5295J02040J04403J02779R5956Q2223O2471L9452
$$ plain form
60613 324891 327373 329578 331876 334245 336418 338990 342771 347108 350440 352427 354082 356020 358264 361523
60599 361523 366737 373265 379398 384867 391086 398734 406913 415053 423849 433841 444611 455854 467766
60586 467766 480028 491926 503871 517248 532240 547208 560595 572022 581052 586407 587152 583597
60574 583597 576606 567066 556259 545539 535278 525160 515608 507625 501107 494718 487761 480965 475258
60561 475258 470964 468257 467050 466285 464685 462306 460028 457659 454123 449579 445572 442943 441282 440660 441930
60546 441930 444864 447905 450525 454115 459727 466490 473164 479871 487377 495873 505325 516075 528397 542302
60532 542302 558146 576569 597616 620971 647069 676880 710658 748374 791267 841358 899434
60521 899434 965260 1039771 1124819 1220114 1322154 1426557 1529336 1625292 1707515 1769986 1809438
60510A809438J4832j0330l3174n0304o1255o8049p1540p0836o6092n9189n1381
60499A282120m2581l3003k3377j3497k581Q868J9447K8987L8470M8044N7099O6072
60487A434068P6266Q8087J01282J16483J34428J53951J72766J89776K04203K12651
60477B883961K09801J92878J63895J27481Q8366N1062J9934j207q780N49K7474
60466C755414O7666J13531J58555J98814K30923K50605K53450K35837J95794J34784
60456E595373N8318k6804j15205k01297k76550l31870l63275l73231l66639l47770
60446C251050l20765k89961k58426k27686j99085j73724j51134j30149j11208
60437A388912r5852q3918p3424o3428n4854m8173m2438l7148l2925k9799k6684
$$ plain form
60510 1809438 1824270 1813940 1780766 1730462 1669207 1601158 1529618 1458782 1392690 1333501 1282120
60499 1282120 1239539 1206536 1183159 1169662 1167081 1175949 1195396 1224383 1262853 1310897 1367996 1434068
60487 1434068 1510334 1598421 1699703 1816186 1950614 2104565 2277331 2467107 2671310 2883961
60477 2883961 3093762 3286640 3450535 3578016 3666382 3717444 3737378 3736171 3727391 3727940 3755414
60466 3755414 3823080 3936611 4095166 4293980 4524903 4775508 5028958 5264795 5460589 5595373
60456 5595373 5653691 5626887 5511682 5310385 5033835 4701965 4338690 3965459 3598820 3251050
60446 3251050 2930285 2640324 2381898 2154212 1955127 1781403 1630269 1500120 1388912
60437 1388912 1293060 1209142 1135718 1072290 1017436 969263 926825 889677 856752 826953 800269
60426H00269k3185k0157j7922j5647j2946j0442q267n674k580J72K434N000P910
60413F98965J0213J1809J3835J6797J9995K3156K6860L0922L4169L6385L8625
60402I61731M0969M1716L9577L5057K8983K1422J2948N202r20o229j1297j4831
60390A154328j5284j3025r723o388l104r5K077L188L479L219K485J289k25j613
60376A120608k291k105j447m78J177L448N183N227L398k87o382j4824k3902l1737
60362A055588l8035m3068m5995m5989m4153m2286m0228l6566l1612k7437k4914
60351F35305k2854k0277j7619j5403j3464j1790j0570r186o814m138k842l190
60339D97158l703l471l059k971k764k192j716j512j277j195j846k948l494l248
$$ plain form
60426 800269 777084 756927 739005 723358 710412 699970 691703 686029 683449 683621 686055 691055 698965
60413 698965 709178 720987 734822 751619 771614 794770 821630 852552 886721 923106 961731
60402 961731 1002700 1044416 1083993 1119050 1148033 1169455 1182403 1187605 1186685 1180456 1169159 1154328
60390 1154328 1139044 1126019 1116296 1109908 1106804 1106709 1108786 1111974 1115453 1118672 1121157 1122446 1122221 1120608
60376 1120608 1118317 1116212 1114765 1114287 1115464 1118912 1124095 1129322 1132720 1132433 1126051 1111227 1087325 1055588
60362 1055588 1017553 974485 928490 882501 838348 796062 755834 719268 687656 660219 635305
60351 635305 612451 592174 574555 559152 545688 533898 523328 514142 507328 503190 500348 497158
60339 497158 493455 489984 486925 483954 481190 478998 477282 475770 474493 473298 471452 468504 465010 461762
60325D61762k926k882k847k837l060l107k573k107k451k891k248r21j59J24Q29
60310D31706J494Q86m79p86J58P36M05L04Q28Q95J89k33m3k79j205j645j060l08
60292D31563J82J094K484L309L277L334L879M312M732N932P407P621O827P187
60278D93140R352J1324J1777J2058J3530J5150J5412J4747J4331J4003J2979J1491
60266F49294J0182Q925P461O246N600M979M018L330L472M012M387M749N373O172
60252G28200P247Q869J0592J1526J1758J2291J3324J4042J4286J4900J6106J7118
60240H80259J7695J8380J8924J8293J6742J5978J6570J7037J6315J5319J5249
60229A066761J5976J7031J8555K0410K1834K2860K4601K7383L0095L2118L4359
$$ plain form
60325 461762 458836 455954 453107 450270 447210 444103 441530 439423 436972 434081 431833 430912 430753 430877 431706
60310 431706 433200 434086 433607 432821 432979 433715 434120 434424 435252 436147 436336 436103 436060 435781 434576 432931 431871 431563
60292 431563 431745 432839 435323 438632 441909 445243 449122 453434 458166 464098 471505 479126 485953 493140
60278 493140 502492 513816 525593 537651 551181 566331 581743 596490 610821 624824 637803 649294
60266 649294 659476 668401 675862 682108 687708 692687 696705 700035 703507 707519 711906 716655 722028 728200
60252 728200 735447 744316 754908 766434 778192 790483 803807 817849 832135 847035 863141 880259
60240 880259 897954 916334 935258 953551 970293 986271 1002841 1019878 1036193 1051512 1066761
60229 1066761 1082737 1099768 1118323 1138733 1160567 1183427 1208028 1235411 1265506 1297624 1331983
60218A331983L7607M1432M5473N0207N5520N9953O2262O2361O0104N4643M5907
60207A907452L5382K4707J4770O516R60k251m757p305r139r886j0321j0727j0470
60194A924931r675r417r657r012p344o307o505o315m599k460j134j97P46O33j430
60179A852258m924r628j6636k6184l6220m4577n0992n5805n8427n8565n7306n5534
60167A377460n2854m9255m5965m3330l9809l4643k9598k6294k3675k0043j5934
60156I96060j2982j1372j0436j0436j1706j3052j3039j2048j1473j1647j1988
60145H65881j2197j2024j0826q701o862n758m158j413J038J956K529M502P398
60132H21365R647J1303J3692J7160K1057K5315L0354L5985M1705M7461N2992N7348
$$ plain form
60218 1331983 1369590 1411022 1456495 1506702 1562222 1622175 1684437 1746798 1806902 1861545 1907452
60207 1907452 1942834 1967541 1982311 1988827 1989787 1987536 1982779 1975474 1966335 1956449 1946128 1935401 1924931
60194 1924931 1915256 1905839 1896182 1887170 1879826 1873519 1867014 1860699 1856100 1853640 1852506 1852309 1853055 1853688 1852258
60179 1852258 1847334 1837706 1821070 1794886 1758666 1714089 1663097 1607292 1548865 1490300 1432994 1377460
60167 1377460 1324606 1275351 1229386 1186056 1146247 1111604 1082006 1055712 1032037 1011994 996060
60156 996060 983078 971706 961270 950834 939128 926076 913037 900989 889516 877869 865881
60145 865881 853684 841660 830834 822133 815271 809513 805355 803942 804980 806936 809465 813967 821365
60132 821365 831012 842315 856007 873167 894224 919539 949893 985878 1027583 1075044 1128036 1185384
60120A185384O0116O2144O3960O4743O4116O3528O4422O6338O8324P0882P4785
60109A908742P9248Q3060Q6387Q9656R1601R0247Q5039P6299O3604M6442K5753
60098B726078L175k0461m4275o5945q3076r5420j04226j09975j12296j11424j08010
60087A874145j02017r3257q2682p1746o0865m9686l8364k7479j7156p363J501
60076A325031R078J5477K0436K2989K2722K0326J6271J0363L470k037m847o198
60064A453081p456p817o073l168j241j226l125p373j4042k1644k8416l3957l8202
60051A279341m0109l9034l6250l3355l0242k6427k3149k2132k3056k4192k4757
60040I56638k4901k4270k2417j9998j7896j5849j3467j1592j1013j0793r734q450
$$ plain form
60120 1185384 1245500 1307644 1371604 1436347 1500463 1563991 1628413 1694751 1763075 1833957 1908742
60109 1908742 1987990 2071050 2157437 2247093 2338694 2428941 2513980 2590279 2653883 2700325 2726078
60098 2726078 2729253 2708792 2664517 2598572 2515496 2420076 2315850 2205875 2093579 1982155 1874145
60087 1874145 1772128 1678871 1596189 1524443 1463578 1413892 1375528 1348049 1330893 1323530 1325031
60076 1325031 1334109 1349586 1370022 1393011 1415733 1436059 1452330 1462693 1466163 1464126 1459279 1453081
60064 1453081 1445625 1437808 1431735 1428567 1427326 1426100 1422975 1415602 1401560 1379916 1351500 1317543 1279341
60051 1279341 1239232 1200198 1163948 1130593 1100351 1073924 1050775 1028643 1005587 981395 956638
60040 956638 931737 907467 885050 865052 847156 831307 817840 806248 795235 784442 774708 766258
60028G66258q220q669q611q291q809r918j0377r934r232q322o965n820n635n825
60014F51630n370m415l490k097K77K677L984M816O348Q180R251R959J1389J3261
60000G06400J4619J5828J7786J9882K0765K0702K1113K2299K3502K4744K6682
59989I34322K9003L0774L1971L3058L3560L2709L0789K8184K3886J6851Q171k4
59977A233254p159j3829j9633k3389k4968k4980k3224j9429j4856j1091p711l166
59965A039819K471P642J1768J5580J9379K2751K5723K8439L0172L0357L0031L0516
59953A294648L1346L1372L1090L1880L3578L4803L5040L4397L2050K7056K0244
59942A637504J3180N885k454j1229j8964k5436l1070l5031l6228l5439l4153l1984
$$ plain form
60028 766258 758038 749369 740758 732467 723658 713740 703363 693429 684197 675875 668910 663090 657455 651630
60014 651630 646260 641845 638355 636258 636535 639212 643196 648012 654360 662540 671791 681750 693139 706400
60000 706400 721019 736847 754633 774515 795280 815982 837095 859394 882896 907640 934322
59989 934322 963325 994099 1026070 1059128 1092688 1125397 1156186 1184370 1208256 1225107 1233278 1233254
59977 1233254 1226095 1212266 1192633 1169244 1144276 1119296 1096072 1076643 1061787 1050696 1042985 1039819
59965 1039819 1042290 1049932 1061700 1077280 1096659 1119410 1145133 1173572 1203744 1234101 1264132 1294648
59953 1294648 1325994 1357366 1388456 1420336 1453914 1488717 1523757 1558154 1590204 1617260 1637504
59942 1637504 1650684 1656569 1654115 1642886 1623922 1598486 1567416 1532385 1496157 1460718 1426565 1394581
59930A394581k7723k2123j7072j2557p248j461L237O963J1102J5290J7811J8901
59918A379701K0570K2940K3722K1869J8989J6603J4549J2611J1447J1194J1259
59907A565454J1837J3592J5760J6745J6799J7778K0168K2746K5331K9371L5275
59896A790856M1603M7397N2933N7504N8553N3771M2510K5100L043j9889l9089
59885B114292n2481o0837o4915o4494o0356n4686m8877m2967l7508l3683l1062
59874A562426k7542k2228j6373j1016n753l00M841R860J5766K2504K8872L4841
59862A595898M2052N1542O2730P4880Q7692J00303J11777J22646J33645J42672
59852B525837J45332J38937J23896J01204P1521L7476M139k4245m6314o2016p1389
$$ plain form
59930 1394581 1366858 1344735 1327663 1315106 1307858 1306397 1309634 1316597 1327699 1342989 1360800 1379701
59918 1379701 1400271 1423211 1446933 1468802 1487791 1504394 1518943 1531554 1543001 1554195 1565454
59907 1565454 1577291 1590883 1606643 1623388 1640187 1657965 1678133 1700879 1726210 1755581 1790856
59896 1790856 1832459 1879856 1932789 1990293 2048846 2102617 2145127 2170227 2173270 2153381 2114292
59885 2114292 2061811 2000974 1936059 1871565 1811209 1756523 1707646 1664679 1627171 1593488 1562426
59874 1562426 1534884 1512656 1496283 1485267 1479514 1479214 1484055 1493915 1509681 1532185 1561057 1595898
59862 1595898 1637950 1689492 1752222 1827102 1914794 2015097 2126874 2249520 2383165 2525837
59852 2525837 2671169 2810106 2934002 3035206 3106727 3144203 3148342 3124097 3077783 3015767 2944378
59841B944378p5755p7925q0126q3194q8032r5511j04276j10917j13329j12047
59831B003266j07872j00495r0331p9340o8864n8429m7604l7217k7915j9299j1253
59820A354647m394J377O902J1839J4693J5278J5211J5405J5270J4931J5959J9033
59808A496151K2973K6755L0311L2613L1308K5566J7538J0289O067O872J4055K6112
59796A746610L8865M8845N4847N6047N1442M2235L2171K4062J7821J2738R215
59785B134898P113M883K082N06J254K424J343k566q412j5529k3106k9686l4356
59772B040848l7221l7934l5431k9951k3453j7106j0274k772L892Q638J2043J4406
59760A885685J4582J2073Q276M394o8n469j0622j4589j8038k1548k4363k6101
$$ plain form
59841 2944378 2868623 2790698 2710572 2627378 2539346 2443835 2339559 2228642 2115313 2003266
59831 2003266 1895394 1794899 1704568 1625228 1556364 1497935 1450331 1413114 1385199 1365900 1354647
59820 1354647 1350253 1351630 1358532 1370371 1385064 1400342 1415553 1430958 1446228 1461159 1477118 1496151
59808 1496151 1519124 1545879 1576190 1608803 1640111 1665677 1683215 1693504 1699571 1706443 1720498 1746610
59796 1746610 1785475 1834320 1889167 1945214 1996656 2038891 2071062 2095124 2112945 2125683 2134898
59785 2134898 2142011 2146894 2148976 2149482 2150736 2153160 2154503 2151937 2143525 2127996 2104890 2075204 2040848
59772 2040848 2003627 1965693 1930262 1900311 1876858 1859752 1849478 1846706 1850598 1859236 1871279 1885685
59760 1885685 1900267 1912340 1920616 1925010 1924942 1919473 1908851 1894262 1876224 1854676 1830313 1804212
59748A804212k7825l0116l1812l2053l1749l1666l0835k8307k4899k1763j8776
59737A494411j5634j3127j1944j1584j1412j1426j1169r604o925m668l133o92
59725A383093L436P860J1599J5731K0974K5768K8398K9263K9491K9039K7675K6186
59713A638513K5041K3435K0969J8768J7686J7008J6136J5855J6758J8135J9591
59702A847895K2013K5778K9848L3636L7736M1800M3962M3682M2896M3057M3328
59691B255631M3120M3763M5796M7073M5686M2541L8889L3455K4450J2641P0j2684
59679B620431k5740l7917m7748n5300o0984o3907o3254o0081n6049n1588m6830
59668B051033m2753l9731l6461l2027k7541k4187k1355j8348j6189j5942j6905
$$ plain form
59748 1804212 1776387 1746271 1714459 1682406 1650657 1618991 1588156 1559849 1534950 1513187 1494411
59737 1494411 1478777 1465650 1453706 1442122 1430710 1419284 1408115 1398511 1391586 1386918 1383785 1383093
59725 1383093 1386529 1394389 1405988 1421719 1442693 1468461 1496859 1526122 1555613 1584652 1612327 1638513
59713 1638513 1663554 1686989 1707958 1726726 1744412 1761420 1777556 1793411 1810169 1828304 1847895
59702 1847895 1869908 1895686 1925534 1959170 1996906 2038706 2082668 2126350 2169246 2212303 2255631
59691 2255631 2298751 2342514 2388310 2435383 2481069 2523610 2562499 2595954 2620404 2633045 2633115 2620431
59679 2620431 2594691 2556774 2509026 2453726 2392742 2328835 2265581 2205500 2149451 2097863 2051033
59668 2051033 2008280 1968549 1932088 1900061 1872520 1848333 1826978 1808630 1792441 1776499 1759594
59657A759594j8321k1093k5798l0657l3582l4850l5860l6637l6534l5968l5604
59646A414690l5012l3747l2369l0937k8171k3621j8883j5142j1447p064l287j001
59634A174009J222M398O712O316M460L223K094l87l344m920n418o248p004o364
59620A168749m819l862l450k753k326k973l561k542o67K27J93N31J151R62Q3o28
59604A144315j357k512l094k095m74L38P71J829K791K622K336L378M780M462K508
59589A160598N73r80k798m239m037k579j195K43K727N819Q187R701J0894J1174
59575A194088R782P737O612O159N229M103L799L950L561K929K767K546J903K403
59561A257568N480R718J2704J4527J6906J9826K1637K1685K0413J7701J3516R400
$$ plain form
59657 1759594 1741273 1720180 1694382 1663725 1630143 1595293 1559433 1522796 1486262 1450294 1414690
59646 1414690 1379678 1345931 1313562 1282625 1254454 1230833 1211950 1196808 1185361 1178297 1175010 1174009
59634 1174009 1175231 1179629 1186341 1192657 1197117 1200340 1202434 1202047 1198703 1193783 1188365 1182117 1175113 1168749
59620 1168749 1163930 1160068 1156618 1153865 1151539 1148566 1145005 1142463 1141796 1142023 1142216 1142747 1143898 1144860 1144943 1144315
59604 1144315 1142958 1140446 1137352 1135257 1134783 1135121 1135892 1137721 1140512 1143134 1145470 1148848 1153628 1158090 1160598
59589 1160598 1161171 1160191 1157393 1153154 1149117 1146538 1145343 1145586 1148313 1154132 1162319 1172020 1182914 1194088
59575 1194088 1203870 1211607 1218219 1224378 1229607 1233710 1237509 1241459 1245020 1247949 1250716 1253262 1255165 1257568
59561 1257568 1263048 1272766 1285470 1299997 1316903 1336729 1358366 1380051 1400464 1418165 1431681 1441081
59549A441081P068O429O699P740P990L361q203k2470l2653l6507l6512l4457k9900
59536A279666k3422j7276j2316p476k532J442M356P050R048R112P871P197P089
59523A269809N988L948K618K112P31k062n010p542j0433j3788j6761j9154k1213
59510A189243k2160k1296k0088k0589k2243k2820k2079k1695k1864k1000j8739
59499I54670j6340j4105j1173p968o089n579m918l821l411l503k369M19L413N797
59485H85023Q173J0579J2045J2352J2199J1580R970P872O175M340J408j729l465
59472I76522m282n922q264r681j0031j0565j1230j0858r735r188q979p805o099
59459H63883n408n390m360k460j212l37J795M775O607P371R064J1781J3650J4607
$$ plain form
59549 1441081 1448149 1454578 1461277 1469017 1477007 1480368 1472165 1449695 1417042 1380535 1344023 1309566 1279666
59536 1279666 1256244 1238968 1226652 1219176 1216644 1218086 1222442 1229492 1238540 1247652 1255523 1262720 1269809
59523 1269809 1275797 1279745 1282363 1284475 1285206 1283144 1278134 1270592 1260159 1246371 1229610 1210456 1189243
59510 1189243 1167083 1145787 1125699 1105110 1082867 1060047 1037968 1016273 994409 973409 954670
59499 954670 938330 924225 913052 905084 898995 893416 888498 884677 881266 877763 875394 875813 879226 885023
59485 885023 893196 903775 915820 928172 940371 951951 961921 969793 975968 980308 981716 979987 976522
59472 976522 972240 966318 958054 948373 938342 927777 916547 905689 895954 886766 877787 869982 863883
59459 863883 858475 853085 848725 846265 845053 844716 846511 851286 857893 865264 874328 886109 899759 914366
59445I14366J6609J9776K1909K2508K3673K6204K8218K8669K8965L0016L0759
59434A191672L0705L1018L2040L2497L2262L3114L5677L8374M0518M3777M9048
59423A590702N4090N5703N2673M5980L7991L2011L0480L2852L6794M1471M7798
59412B058545N5672O3226O8610P0178O5687N4451M0204K8598K1603J7147J3777
59401B557698J2156J2079J2049J2397J5025J9275K1658K0562J7597J3595P288
59390B721379p75p090r886j1350j3278j3908j1398p347m360k509m73J848L906
59377B644759N905P900R091R236R250R504R427R327J0442J2499J3556J2936J1897
59364B775729J0815Q383M340J72l784r095j6050k2478k6933l0481l4183l7426
$$ plain form
59445 914366 930975 950751 972660 995168 1018841 1045045 1073263 1101932 1130897 1160913 1191672
59434 1191672 1222377 1253395 1285435 1317932 1350194 1383308 1418985 1457359 1497877 1541654 1590702
59423 1590702 1644792 1700495 1753168 1799148 1837139 1869150 1899630 1932482 1969276 2010747 2058545
59412 2058545 2114217 2177443 2246053 2316231 2381918 2436369 2476573 2505171 2526774 2543921 2557698
59401 2557698 2569854 2581933 2593982 2606379 2621404 2640679 2662337 2682899 2700496 2714091 2721379
59390 2721379 2720604 2713514 2703628 2692278 2679000 2665092 2653694 2646347 2641987 2639478 2639005 2640853 2644759
59377 2644759 2650664 2658564 2667655 2676891 2686141 2695645 2705072 2714399 2724841 2737340 2750896 2763832 2775729
59364 2775729 2786544 2794927 2799267 2799439 2795655 2786560 2770510 2748032 2721099 2690618 2656435 2619009
59352B619009l9760m1806m3326m2988m1129m0036m0624m1585m2611m5403n0336
59341B149405n5209n8616o1511o4154o4688o2272n8703n5297n1089m5693m0963
59330A531210l8007l5363l1909k8836k6958k4732k0849j6312j2113p337j230N187
59318A292751J1279J8186K6487L4766M1810M7795N2071N2496M8669M3170L8351
59307A707831L4439L1956L2679L6365L9624M0032L8709L7200L4927L1629K9195
59296B094586K8691K8252K6157K3317K0705J7113J1737O240J780l414j1071j9804
59284B224289k7366l3621l9026m2498m3154m2035l9980l5950k9446k2313j6089
59273A852811r894k840L875R333J4636K0236K4180K5479K6518K9583L3352L5441
$$ plain form
59352 2619009 2579249 2537443 2494117 2451129 2410000 2369964 2329340 2287755 2245144 2199741 2149405
59341 2149405 2094196 2035580 1974069 1909915 1845227 1782955 1724252 1668955 1617866 1572173 1531210
59330 1531210 1493203 1457840 1425931 1397095 1370137 1345405 1324556 1308244 1296131 1288794 1287564 1292751
59318 1292751 1304030 1322216 1348703 1383469 1425279 1473074 1525145 1577641 1626310 1669480 1707831
59307 1707831 1742270 1774226 1806905 1843270 1882894 1922926 1961635 1998835 2033762 2065391 2094586
59296 2094586 2123277 2151529 2177686 2201003 2221708 2238821 2250558 2256798 2258578 2255164 2244093 2224289
59284 2224289 2196923 2163302 2124276 2081778 2038624 1996589 1956609 1920659 1891213 1868900 1852811
59273 1852811 1842917 1840077 1843952 1853285 1867921 1888157 1912337 1937816 1964334 1993917 2027269 2062710
59261B062710L6230L7609L9985M3039M7524N4035O1543O8566P3388P1853N8685
59250B655167L3876N192j8431l3818m2176m4513m1718l6259k9932k1621j0138
59239B415629K702J4554K5689L6494M3974M4172L6644K3944Q547o956j8806k4607
59227B601980k5874k5596k4741k3270k2312k2597k2635k1143j9414j8789j7930
59216B357679j5207j1550q136l543L679J1797J8521K4813L2723M1286M7910N2250
59204B552222N5385N6683N4736N0202M4633L7797K8975J9431J0769K309p119j6509
59192B889514k4747l3578m5267n8715p0938q0873q8721r3161r2711q8673q3461
59181B128669p7026o7869n6562m5184l4273k3019j1509j41J1960K5502L9234N1967
$$ plain form
59261 2062710 2098940 2136549 2176534 2219573 2267097 2321132 2382675 2451241 2524629 2596482 2655167
59250 2655167 2689043 2694235 2675804 2641986 2599810 2555297 2513579 2477320 2447388 2425767 2415629
59239 2415629 2418331 2432885 2458574 2495068 2539042 2583214 2619858 2643802 2652349 2645393 2626587 2601980
59227 2601980 2576106 2550510 2525769 2502499 2480187 2457590 2434955 2413812 2394398 2375609 2357679
59216 2357679 2342472 2330922 2322786 2319243 2322922 2334719 2353240 2378053 2410776 2452062 2499972 2552222
59204 2552222 2607607 2664290 2719026 2769228 2813861 2851658 2880633 2900064 2910833 2913142 2906023 2889514
59192 2889514 2864767 2831189 2785922 2727207 2656269 2575396 2486675 2393514 2300803 2212130 2128669
59181 2128669 2051643 1983774 1927212 1882028 1847755 1824736 1813227 1813086 1825046 1850548 1889782 1941749
59169A941749O4660P7989Q9608R6653R9114R8035R2461Q1556O8127N6590M8744
59158B815286M4500M5020N1765O3672P8367R4737J11381J24212J29115J25957
59148C684012J17327J05306R2427Q3364Q1273Q3492Q4247Q0374P1306N5731L2538
59137D571397L852k7036n9765r5278j31040j61815j84377j98204k02759j97845
59127C317130j85811j69849j50929j29420j08105q9892p4086n8691m4859l4805
59117B270683k6934j7879q464k832k045l182m626p795j3287j9387k4853k9799
59105B109600l3658l5448l5832l5894l4412k9579k2584j6049r788j879P041J4552
59093A876070K0829K8047L6029M2631M8166N5282O4639P4715Q5642R8789J12403
$$ plain form
59169 1941749 2006409 2084398 2174006 2270659 2369773 2467808 2560269 2641825 2709952 2766542 2815286
59158 2815286 2859786 2904806 2956571 3020243 3098610 3193347 3304728 3428940 3558055 3684012
59148 3684012 3801339 3906645 3999072 4082436 4163709 4247201 4331448 4411822 4483128 4538859 4571397
59137 4571397 4575249 4548213 4488448 4393170 4262130 4100315 3915938 3717734 3514975 3317130
59127 3317130 3131319 2961470 2810541 2681121 2573016 2483124 2409038 2350347 2305488 2270683
59117 2270683 2243749 2225870 2217406 2214574 2212529 2209347 2204721 2196926 2183639 2164252 2139399 2109600
59105 2109600 2075942 2040494 2004662 1968768 1934356 1904777 1882193 1866144 1856356 1854477 1861518 1876070
59093 1876070 1896899 1924946 1960975 2003606 2051772 2107054 2171693 2246408 2332050 2430839 2543242
59082B543242J21551J22774J15464R9534P6222N1259L2613K4086K4338L1755M6111
59071C288949O5652Q7421J11476J40829J76450K15865K56411K94594L20433L17252
59061E275332K71064J80381N7966p3937j91144k76491l25613l44157l39909l19064
59051C914428k87603k51200k12771j73104j33806r6855o2465l1665j0449o484
59041B648026k0758m5904p2919r5843j10534j14380j08968r9156q8020p5497o2082
59030A753965m9833l8962k7478j5168m357M280J3054K3327L3685M2948N1654N9573
59018A846688O4992O7394O7802O5764N9222M8063L4799K1256P890l306q962q203
59006B263399l049N573J8739L5909N4210P2229R1085J10693J28337J41787J50575
$$ plain form
59082 2543242 2664793 2787567 2903031 3002565 3078787 3130046 3162659 3186745 3211083 3242838 3288949
59071 3288949 3354601 3442022 3553498 3694327 3870777 4086642 4343053 4637647 4958080 5275332
59061 5275332 5546396 5726777 5784743 5710806 5519662 5243171 4917558 4573401 4233492 3914428
59051 3914428 3626825 3375625 3162854 2989750 2855944 2759089 2696624 2664959 2654510 2648026
59041 2648026 2627268 2581364 2508445 2412602 2302068 2187688 2078720 1979564 1891544 1816047 1753965
59030 1753965 1704132 1665170 1637692 1622524 1618167 1622447 1635501 1658828 1692513 1735461 1787115 1846688
59018 1846688 1911680 1979074 2046876 2112640 2171862 2219925 2254724 2275980 2283870 2280564 2271602 2263399
59006 2263399 2260350 2265923 2284662 2320571 2374781 2447010 2538095 2648788 2777125 2918912 3069487
58995C069487J53398J47707J32927J11145Q4085N2695K0337p209k5978l5270l4803
58984C668521k4062n010J8233M3246O9415R3757J10553J16126J10700R4995O8950
58973D365424L4757k484l8401p0476r5246j08428j09168j00819q6651o8019m7342
58962C673147k9002j6180j0114j2808k6353m8445p2242r1796j04557j08669j02580
58951C050401q8481p1994n7030m4356l5455l3019l6477m1588m6189n2173o0370
58940B483269o7915p2486p4955p5908p3570o7283n9402n1827m4032l5996k9364
58929A830531k4185j8420j2111q104o999n507j566K991O879J2239K0775L0779
58917A827302M0386N0359O1319P1463P9019Q3969Q5825Q3041P6197O8368O1044
$$ plain form
58995 3069487 3222885 3370592 3503519 3614664 3698749 3751444 3771781 3764572 3738594 3703324 3668521
58984 3668521 3644459 3639449 3657682 3700928 3770343 3864100 3974653 4090779 4201479 4296474 4365424
58973 4365424 4400181 4397697 4359296 4288820 4193574 4085146 3975978 3875159 3788508 3720489 3673147
58962 3673147 3644145 3627965 3617851 3605043 3578690 3530245 3458003 3366207 3261650 3152981 3050401
58951 3050401 2961920 2889926 2832896 2788540 2753085 2720066 2683589 2642001 2595812 2543639 2483269
58940 2483269 2415354 2342868 2267913 2192005 2118435 2051152 1991750 1939923 1895891 1859895 1830531
58929 1830531 1806346 1787926 1775815 1767711 1760712 1755205 1753639 1756630 1763509 1775748 1796523 1827302
58917 1827302 1867688 1918047 1979366 2050829 2129848 2213817 2299642 2382683 2458880 2527248 2588292
58906B588292N3284M5950M2483M3891M7249N0938N7043O6742P7799Q8918J02146
58895C264735J18368J34127J44923J47435J36672J06344N6110m916o4867j16417
58885C922514j56069j81479j93354j96481j95222j90288j81833j72025j62125
58876B293638j50725j37535j25248j15219j05093r3379q2476p4295o6805n8035
58866A284828m9757m3940l9128l3533k8405k5089k1993j7647j3645j1490r644
58855I90557o576l595j880L1L009M999M782M653O391Q052P769P196P991Q507P309
58840A049195O527Q116J0044R879R119J0316J2693J4142J4923J5975J6117J4145
58828A191191J1277Q599M704j249o913r985j1299j2096j1333q463n669m301k253
$$ plain form
58906 2588292 2641576 2687526 2730009 2773900 2821149 2872087 2929130 2995872 3073671 3162589 3264735
58895 3264735 3383103 3517230 3662153 3809588 3946260 4052604 4108714 4103798 4038931 3922514
58885 3922514 3766445 3584966 3391612 3195131 2999909 2809621 2627788 2455763 2293638
58876 2293638 2142913 2005378 1880130 1764911 1659818 1566439 1483963 1409668 1342863 1284828
58866 1284828 1235071 1191131 1152003 1118470 1090065 1064976 1042983 1025336 1011691 1000201 990557
58855 990557 983981 980386 978506 978537 981546 986545 991327 995980 1002371 1010423 1018192 1025388 1033379 1041886 1049195
58840 1049195 1055722 1063838 1073882 1083761 1092880 1103196 1115889 1130031 1144954 1160929 1177046 1191191
58828 1191191 1202468 1211067 1215771 1214522 1207609 1197624 1186325 1174229 1162896 1154433 1148764 1144463 1142210
58815A142210K193P035J0107J2647J6330J9943K2113K4105K6789K8088K6572K4294
58803A362426K2924K0495J5207R012M080q63p225j3078j6509j9063k2297k4356
58791A330753k3596k2138k2115k1742j8952j5456j3315j0879o079m53M078R005
58779A189111J5709K1515K3663K4095K5990K8639L0111L1947L6747M3777N1429
58768A522733O1367P5918R3917J13285J35147J61415J90968K22339K57558K99517
58758C134164L48216M03344M67164N39987O14428O76684P09977O94574O11707
58749H200245M56537K47279J7651j98693l76224m99210n64903n84067n72131n39779
58739E586705m93922m42731l93397l47506l04046k64901k32663k05893j81793
$$ plain form
58815 1142210 1144403 1151438 1161545 1174192 1190522 1210465 1232578 1256683 1283472 1311560 1338132 1362426
58803 1362426 1385350 1405845 1421052 1430064 1434144 1433281 1426056 1412978 1396469 1377406 1355109 1330753
58791 1330753 1307157 1285019 1262904 1241162 1222210 1206754 1193439 1182560 1176481 1176028 1180106 1189111
58779 1189111 1204820 1226335 1249998 1274093 1300083 1328722 1358833 1390780 1427527 1471304 1522733
58768 1522733 1584100 1660018 1753935 1867220 2002367 2163782 2354750 2577089 2834647 3134164
58758 3134164 3482380 3885724 4352888 4892875 5507303 6183987 6893964 7588538 8200245
58749 8200245 8656782 8904061 8921712 8723019 8346795 7847585 7282682 6698615 6126484 5586705
58739 5586705 5092783 4650052 4256655 3909149 3605103 3340202 3107539 2901646 2719853
58730B719853j61181j45943j34129j22590j11909j03723r5888q5498p4081o4614
58720A620297n5939m5377l4279k5652j8874j2229q055r637j5211k0597k5367l0973
58708A318107l5315l5227l2273l0139k8163k3308j6544j1387p710k857K712O689
58696A104585J0215J6255K4013L0505L6283M4317N4707O5750P8605R5619J15607
58685A676461J35962J57597J82492K08107K29166K42668K46118K34187K04103
58676C516861J62629J21285Q5920N6109L1681J2373p367l5532p4063j18103j62090
58665C589703k01058k28201k38446k34155k21834k04479j82414j59134j39283
58656A780699j22251j04441q6714p3072o3279n3594m3841l7031l2840k8143k3240
$$ plain form
58730 2719853 2558672 2412729 2278600 2156010 2044101 1940378 1844490 1758992 1684911 1620297
58720 1620297 1564358 1518981 1484702 1459050 1440176 1427947 1419892 1410255 1395044 1374447 1349080 1318107
58708 1318107 1282792 1247565 1215292 1185153 1156990 1133682 1117138 1105751 1098041 1095184 1097896 1104585
58696 1104585 1114800 1131055 1155068 1185573 1221856 1266173 1320880 1386630 1465235 1560854 1676461
58685 1676461 1812423 1970020 2152512 2360619 2589785 2832453 3078571 3312758 3516861
58676 3516861 3679490 3800775 3886695 3942804 3974485 3986858 3979491 3943959 3869896 3751793 3589703
58665 3589703 3388645 3160444 2921998 2687843 2466009 2261530 2079116 1919982 1780699
58656 1780699 1658448 1554007 1467293 1394221 1330942 1277348 1233507 1196476 1163636 1135493 1112253
58645A112253k0993k0579j8613j5669j5188j6634j6304j4247j3780j4705j3594
58634I31947j0395q279p415n146j891n32n81R23L469M302M496P350J1721J3650
58620I43619J3665J5653J9431K1389K1725K3999K8216L1316L3744L8427M4025
58609A235209M6607M7227N0378N5532N7888N6978N6729N7405N5588N2112N1860
58598A823513N5409N8719O1422O7471P7286Q7288R7803J13401J34688J57660J81967
58587B916627K11896K48308K87727L30471L81839M44077N14996N95556O90304
58578F621801P97837R07492J005846J078088J101563J047586Q95739O45000L14302
58569A4415254n8797m21404p21166r28254j041358j074686j046578r78488q91831
$$ plain form
58645 1112253 1091260 1070681 1052068 1036399 1021211 1004577 988273 974026 960246 945541 931947
58634 931947 921552 913273 905858 900712 898821 898289 897708 898631 902100 906402 910898 918248 929969 943619
58620 943619 957284 972937 992368 1013757 1035482 1059481 1087697 1119013 1152757 1191184 1235209
58609 1235209 1281816 1329043 1379421 1434953 1492841 1549819 1606548 1663953 1719541 1771653 1823513
58598 1823513 1878922 1937641 1999063 2066534 2143820 2231108 2328911 2442312 2577000 2734660 2916627
58587 2916627 3128523 3376831 3664558 3995029 4376868 4820945 5335941 5931497 6621801
58578 6621801 7419638 8327130 9332976 10411064 11512627 12560213 13455952 14100952 14415254
58569 14415254 14356457 13935053 13213887 12285633 11244275 10169589 9123011 8144523 7252692
58560G252692p99461p05440o14193n32717m62960m00730l44362k96901k58148
58551B837780k22948j89649j62180j41501j22976j04658r0181q0811p2431o3090
58541A587355n5941n1950m7194m0074l3943l0019k4927j7758j2205r316n302J138
58529A259864O613J0161J5174K2176K7332L0217L5338M3811N1381N6787O4008
58518A622862P4054Q2764Q9290R8443J11990J25924J39138J56523J80688K08751
58508B890427K40087K78988L26701L79071M34396M94574N54755O00241O17232
58499F816472N99860N46151M58117L49477K42258J48707O2517k9360j33717k50693
58489H809789l74371m88453n71315o12363o17853n98370n59452n07231m52178
$$ plain form
58560 7252692 6453231 5747791 5133598 4600881 4137921 3737191 3392829 3095928 2837780
58551 2837780 2614832 2425183 2263003 2121502 1998526 1893868 1803687 1722876 1650445 1587355
58541 1587355 1531414 1479464 1432270 1392196 1358253 1328234 1303307 1285549 1273344 1264028 1258726 1259864
58529 1259864 1266477 1276638 1291812 1313988 1341320 1371537 1406875 1450686 1502067 1558854 1622862
58518 1622862 1696916 1779680 1868970 1967413 2079403 2205327 2344465 2500988 2681676 2890427
58508 2890427 3130514 3409502 3736203 4115274 4549670 5044244 5598999 6199240 6816472
58499 6816472 7416332 7962483 8420600 8770077 9012335 9161042 9223559 9194199 9060482 8809789
58489 8809789 8435418 7946965 7375650 6763287 6145434 5547064 4987612 4480381 4028203
58480D028203m00979l52585l06640k67517k36134k07050j78156j54287j37005
58471A787850j20368j01558q6031p7074o9708o0330n2821m9533m5671l8525l3035
58460A053196l2231l1224k6709k3314k4265k4803k1258j7901j8280j8462j5313
58449G99436j2967j4490j5451j2194q364p125n232q06J600l39j639N75J499j576
58435G22927l390p45J128j176k352J326M470K629L90K082L796K138J614N536Q843
58420G49216P665O854J0381J3553J2622J2497J6900K0511J9116J7859K1003K3378
58408I31555K0795J9021K3302K8865L1074L4991M5262N6722O5075P6568R6561
58397A429791J19065J39085J64807K05253K56754L15308L89629M80439N50701
$$ plain form
58480 4028203 3627224 3274639 2967999 2700482 2464348 2257298 2079142 1924855 1787850
58471 1787850 1667482 1565924 1479893 1402819 1333111 1272781 1219960 1170427 1124756 1086231 1053196
58460 1053196 1020965 989741 963032 939718 915453 890650 869392 851491 833211 814749 799436
58449 799436 786469 771979 756528 744334 735970 728845 723613 722807 724407 724068 722429 723004 724503 722927
58435 722927 719537 718792 719920 718744 716392 717718 722188 724817 725207 727289 731085 733223 734837 740373 749216
58420 749216 756881 763735 774116 787669 800291 812788 829688 850199 869315 887174 908177 931555
58408 931555 952350 971371 994673 1023538 1054612 1089603 1134865 1191587 1256662 1333230 1429791
58397 1429791 1548856 1687941 1852748 2058001 2314755 2630063 3019692 3500131 4050832
58388D050832N38186M06351J78410p6435k84866m06236m44647m31710l96272l50828
58378B782785l01648k57224k20820j86627j51657j22383j02793q6443o8083n2512
58368A232595m3707l6126k5678j8266j7977j7847j2199p117q460j0585p597m587
58356A022449o637p899l043J553k87k578J085N107L364J655O126J0690Q940P134
58342A047659J1907J6681J4180J0966J5074K0582J9349J6836K0971K6297K4871
58331A245373K2076K5685K9768K5776J9264J9309K1468J7771J3495J7100K3376
58320A480461K3399K1655K6411L2918L3078L1904L7467M4468M4921M4797N2696
58309A874175O2549O5318O7072P7280R0133R6258J01932J17499J37716J53246
$$ plain form
58388 4050832 4589018 4995369 5173779 5097344 4812478 4406242 3961595 3529885 3133613 2782785
58378 2782785 2481137 2223913 2003093 1816466 1664809 1542426 1439633 1353190 1285107 1232595
58368 1232595 1188888 1152762 1127084 1108818 1090841 1072994 1060795 1053678 1045218 1034633 1027036 1022449
58356 1022449 1015812 1007913 1004870 1006423 1006136 1003558 1004643 1009750 1013114 1014769 1020895 1031585 1040525 1047659
58342 1047659 1059566 1076247 1090427 1101393 1116467 1137049 1156398 1173234 1194205 1220502 1245373
58331 1245373 1267449 1293134 1322902 1348678 1367942 1387251 1408719 1426490 1439985 1457085 1480461
58320 1480461 1503860 1525515 1551926 1584844 1617922 1649826 1687293 1731761 1776682 1821479 1874175
58309 1874175 1936724 2002042 2069114 2146394 2236527 2332785 2434717 2552216 2689932 2843178
58299B843178J70569K00406K37327K71511L09697L63562M28200M93470N65642
58290E883562O55541P55214Q47281R25839R85770J003278R51331Q25959O37638
58281A3471413L91416J00055j96729m53982o54323p98419q78806q90615q54700
58272I235310q00301p34080o51634n65904m94945m33757l67978l04065k56764
58263D625882k19168j75956j34074j09014r2972o8663m2359l0434k5808j1434
58253C716000N798R296P639J9560L7358M1949M0873N3392P1554P5308P2543Q3674
58241D234944J00508J02165R7620J09179J28260J32221J30108J45329J68404J75147
58231E523885J75735J95482K23410K32429K33641K55737K88004L01269L07189
$$ plain form
58299 2843178 3013747 3214153 3451480 3722991 4032688 4396250 4824450 5317920 5883562
58290 5883562 6539103 7294317 8141598 9067437 10053207 11056485 12007816 12833775 13471413
58281 13471413 13862829 13962884 13766155 13312173 12657850 11859431 10980625 10090010 9235310
58272 9235310 8435009 7700929 7049295 6483391 5988446 5554689 5186711 4882646 4625882
58263 4625882 4406714 4230758 4096684 3987670 3894698 3826035 3783676 3753242 3727434 3716000
58253 3716000 3721798 3731094 3738733 3758293 3795651 3837600 3878473 3931865 4003419 4078727 4151270 4234944
58241 4234944 4335452 4437617 4535237 4644416 4772676 4904897 5035005 5180334 5348738 5523885
58231 5523885 5699620 5895102 6118512 6350941 6584582 6840319 7128323 7429592 7736781
58222G736781L36463L77020L97250M10868M51970N06483N39192N66873O29419
58213A1952319P11477P73149Q33985R40536J076475J197648J328857J526103J773041
58204B2113590K024334K319928K737597L267742L866123M588492N523006O634748
58196E3075560P847796R231859J0917982J2903643J5189976J8047259K1865450
58189A49079525K6847728L3176101M1080153M9639717N5200737N2280850L7688908
58182D44993719J4104976j1057074l0652524m1724674m5339090m4066625m0195245
58175B46063463l5369565l0608855k6281479k2366524j8862550j5853617j3320663
58168H3400210j1146765r287547p763434o521325n458202m548417l816798l223919
$$ plain form
58222 7736781 8073244 8450264 8847514 9258382 9710352 10216835 10756027 11322900 11952319
58213 11952319 12663796 13436945 14270930 15211466 16287941 17485589 18814446 20340549 22113590
58204 22113590 24137924 26457852 29195449 32463191 36329314 40917806 46440812 53075560
58196 53075560 60923356 70155215 81073197 93976840 109166816 127214075 149079525
58189 149079525 175927253 209103354 250183507 299823224 355023961 407304811 444993719
58182 444993719 459098695 448041621 417389097 375664423 330325333 286258708 246063463
58175 246063463 210693898 180085043 153803564 131437040 112574490 96720873 83400210
58168 83400210 72253445 62965898 55202464 48681139 43222937 38674520 34857722 31633803
58160C1633803k697003k235829j879411j605379j358917j139093r65368q02035
58152A8950768o01370l77816j61945P0101L49266O52017R56247J298524J712065
58143B2847857K180699K719147L417431M350568N549634P081228Q896043J0396014
58135F7438621J0396427P966412L425519j697231n779740q099832q852647q577608
58127E6219921p762024o767769n814039m959482m184375l494852k913955k426355
58119A7897070k000548j636213j340107j087221q50441o39081m69855l28620j94219
58110I350765p1323K9813J15879J84313K04188J51957M2406r6403k50524m02469
58100I258602n18397n79099n99857n99435n74597n23553m66695m22296l84952
$$ plain form
58160 31633803 28936800 26700971 24821560 23216181 21857264 20718171 19752803 18950768
58152 18950768 18349398 17971582 17809637 17879738 18229004 18881021 19837268 21135792 22847857
58143 22847857 25028556 27747703 31165134 35515702 41065336 48146564 57042607 67438621
58135 67438621 77835048 85801460 89226979 87529748 81750008 73650176 64797529 56219921
58127 56219921 48457897 41690128 35876089 30916607 26732232 23237380 20323425 17897070
58119 17897070 15896522 14260309 12920202 11832981 10982540 10343459 9873604 9544984 9350765
58110 9350765 9279442 9309255 9425134 9609447 9813635 9965592 10007998 9911595 9661071 9258602
58100 9258602 8740205 8161106 7561249 6961814 6387217 5863664 5396969 4974673 4589721
58091D589721l46602l15220k94992k71923k37357k03927j81898j61804j36156
58082B439842j15741j08260j02484q9497p8730p7639p6127o6302n7569n7240n5739
58071A554514m5744l6912l7077l7413l0413k4541k6932k9094k3679j8509k0484
58060A223716k1954j6280j1045j3024j5482j2601j1108j5708j8247j3177q686
58049A066404j0994j2511p108k218m067n402L71O782P539Q589J5713K3051K4814
58036A110963K5560K8513K6879J7285R012R355J2342J2045J4185K4039L5512M3171
58024A368861N3104P1172R2023J10245J31039J59599J90921K20210K52196K89990
58014B939360L25195L48601L59896L57559L30880K73039J92540J02376Q148q4305
$$ plain form
58091 4589721 4243119 3927899 3632907 3360984 3123627 2919700 2737802 2575998 2439842
58082 2439842 2324101 2215841 2113357 2023860 1945130 1867491 1791364 1725062 1667493 1610253 1554514
58071 1554514 1508770 1471858 1434781 1397368 1366955 1342414 1315482 1286388 1262709 1244200 1223716
58060 1223716 1201762 1185482 1174437 1161413 1145931 1133330 1122222 1106514 1088267 1075090 1066404
58049 1066404 1055410 1042899 1035791 1033573 1029506 1024104 1024475 1031257 1038796 1047385 1063098 1086149 1110963
58036 1110963 1136523 1165036 1191915 1209200 1218212 1227567 1239909 1251954 1266139 1290178 1325690 1368861
58024 1368861 1421965 1493137 1585160 1695405 1826444 1986043 2176964 2397174 2649370 2939360
58014 2939360 3264555 3613156 3973052 4330611 4661491 4934530 5127070 5229446 5237594 5153289
58004E153289j61676k15296k51222k78132k94286k95767k87548k75848k58483
57995B835031k32937k05346j81810j59226j33982j10962r4507p9197n9247l8693
57985A539124k2839q120R839K6289L5328L9924M4363M4315L4244J7737J156j5918
57973A745442l4900n0191n6552n8007o0446o1796n8148n2852n0523m8442m2793
57962A170792l7136l5824l5243l0435k4387k1993k0783j6356j1239r533q283k923
57950I16657L997P959J1176J7793K5526L0276L4011L9887M4346M2128L4563K5415
57938A233734J3578k362j7533k6721l2173l7893m1348l8775l3615l1314l0307
57927I55271k6319k1006j8218j6154j1508p303q227j1953j3247j3052j5448j9124
$$ plain form
58004 5153289 4991613 4776317 4525095 4246963 3952677 3656910 3369362 3093514 2835031
57995 2835031 2602094 2396748 2214938 2055712 1921730 1810768 1716261 1637064 1577817 1539124
57985 1539124 1516285 1508165 1518004 1544293 1579621 1619545 1663908 1708223 1742467 1760204 1761360 1745442
57973 1745442 1710542 1660351 1603799 1545792 1485346 1423550 1365402 1312550 1262027 1213585 1170792
57962 1170792 1133656 1097832 1062589 1032154 1007767 985774 964991 948635 937396 927863 919580 916657
57950 916657 920654 928613 939789 957582 983108 1013384 1047395 1087282 1131628 1173756 1208319 1233734
57938 1233734 1247312 1244950 1227417 1200696 1168523 1130630 1089282 1050507 1016892 985578 955271
57927 955271 928952 907946 889728 873574 862066 854763 846536 834583 821336 808284 792836 773712
57915G73712j9911j8745j9299k0662j9733j7952j8378j9114j6730j3101j1879
57904E78208j1392q301n030o136j0072j1827j1180j1335j2044j1044r879j1369
57892D58599j3548j2654r825q508p920n390k559k656m120l374j493j766l092k229
57878C79465k06j68j175l89J049M71m43J397M162M050K169K212L576L268K392
57863D01830M167P442Q624Q209R202J0897J0581R540J1096J4216J5193J4148J3901
57850E39046J4124J2632J0717J1085J2127J0293O696N174N361L868R53k88j63
57837F31625j674m474n556n085n727p034o308m200l816m953m796l543l718m687
57823E66054l341K53L228N219Q070J1116J2066J1823J3208J5623J6218J5523J6624
$$ plain form
57915 773712 753801 735056 715757 695095 675362 657410 639032 619918 603188 590087 578208
57904 578208 566816 558515 553485 547349 537277 525450 514270 502935 490891 479847 469968 458599
57892 458599 445051 432397 422572 414064 406144 400754 398195 395539 391419 388045 386552 384786 381694 379465
57878 379465 379259 379091 377916 377527 378576 379047 378604 380001 384163 388213 390382 392594 396170 399438 401830
57863 401830 405997 413439 422063 430272 439474 450371 460952 470492 481588 495804 510997 525145 539046
57850 539046 553170 565802 576519 587604 599731 610024 616720 621894 627255 631123 632076 631788 631625
57837 631625 629951 625477 619921 614836 609109 602075 595767 591567 587751 582798 578002 574459 570741 566054
57823 566054 562713 562966 566194 571413 579483 590599 602665 614488 627696 643319 659537 675060 691684
57810F91684J9501K1681K3768K8757L6235M2697M7273N1796N5355N4153M7011
57799A119911L6160K2815O835r370k1747k9602l5282l9137l9449l7038l5028l3956
57787I05112l1714k8246k5723k4295k2181k0033k0577k3856k7042k8907l0278
57776F22260l0499k8002k4215k2342k2244k0842j7438j4373j2463j0264p814o752
57764D05012o650n440l351k365k030m9L214N148N554O474P593O383K803n19k845
57749D18932n652q481r008p398o158n523l425k16J171J93n88j96l28j276j177
57734C70870P9M02l94j23J534K397J966K196L443L771K887K785L699L501J789
57719D00802P09P94P8j864k858k100j395j443o27J491L068L439M226N972P134
$$ plain form
57810 691684 711185 732866 756634 785391 821626 864323 911596 963392 1018747 1072900 1119911
57799 1119911 1156071 1178886 1185721 1176351 1154604 1125002 1089720 1050583 1011134 974096 939068 905112
57787 905112 873398 845152 819429 795134 772953 752920 732343 708487 681445 652538 622260
57776 622260 591761 563759 539544 517202 494958 474116 456678 442305 429842 419578 411764 405012
57764 405012 398362 392922 389571 387206 385176 385127 388341 393489 399043 405517 413110 419493 422296 421777 418932
57749 418932 413280 404799 395791 388393 382235 376712 373287 373071 374242 374435 373847 373651 373323 372047 370870
57734 370870 370949 371351 370957 370834 372368 374765 376731 378927 382370 386141 389028 391813 395512 399013 400802
57719 400802 401511 402305 402383 400519 397661 395561 394166 392723 392096 393587 396655 400094 404320 410292 417426
57704D17426P372Q419J0652J2122J1957J1570J1606J0929R489Q982R674R740Q514
57691E48452P356O569M722J917L85Q25J242M56j06Q50K845N578R860J5622K1628
57676F28201K7828L5636M5394N6105O8021Q2928J01693J24143J51559J86370K28164
57665A736042K70615L00705K99728K50220J50061K0950j02188j92868k43726k60190
57655B229349k51504k28443k01549j76278j52225j28735j07915r0976p6082o2027
57645G53615n0392m2045l4953k7557k1100j6632j2818q634n286l620k365o50M76
57632E28039L98R7k87k060m868o240n587n496p437r504j0020j0140j0942j1224
57618D44729j0263r744j0668j1186r765p838p104o686n272l782l532l833l506
$$ plain form
57704 417426 424798 433217 443869 455991 467948 479518 491124 502053 511542 520524 530198 539938 548452
57691 548452 555808 562377 567099 569016 569401 570226 571468 571924 571818 572668 575513 581091 590951 606573 628201
57676 628201 656029 691665 737059 793164 861185 944113 1045806 1169949 1321508 1507878 1736042
57665 1736042 2006657 2307362 2607090 2857310 3007371 3028321 2926133 2733265 2489539 2229349
57655 2229349 1977845 1749402 1547853 1371575 1219350 1090615 982700 891724 815642 753615
57645 753615 703223 661178 626225 598668 577568 560936 548118 539484 534198 530578 528213 527563 528039
57632 528039 528437 528534 528247 526187 521319 515079 509492 503996 496559 487055 477035 466895 455953 444729
57618 444729 434466 424722 414054 402868 393103 385265 378161 371475 366203 362421 358889 355056 351550
57605C51550k944k798k443j483r10j204j175k01M11k44r95p62l40n57o87q2M95
57588C35631N15O88J189R90K6k26N43O35o10j458q72k78p41r74L9R03K70q24r42
57569C34504m85k41K19R96Q47n71j523r31j81n01p74K38J595K062K289L191L982
57552C44716L739L181L167L134K687K924M543O348P254P920Q963R522R131Q890
57538D26119R189Q409N661K622Q24o35k766m392m356l926m671n796n928n675o108
57523D08571o417n485m222l923l833k606q35J07M18R17J156N84K11R67J764J319
57507C88693N12P14J223O69k74n4J046J681J898K489K927K274J309J456K406K920
57491D11889L187M170N456N934N918O454P182P034O441O645P386P350O584O301
$$ plain form
57605 351550 348606 345808 343365 341882 340972 339768 338593 338392 338803 338559 337564 336802 336462 335905 335218 335136 335631
57588 335631 336146 336834 338023 339013 339039 338813 339356 339991 339381 337923 337051 336773 336032 335058 335097 336000 336270 335446 334504
57569 334504 334019 333778 333997 334993 335840 335269 333746 332815 332634 332133 331359 331597 333192 335254 337543 340734 344716
57552 344716 348455 351636 354803 357937 360624 363548 368091 374439 381693 389613 398576 408098 417229 426119
57538 426119 435308 443717 449378 452000 452824 452189 449423 445031 440675 436749 432078 426282 420354 414679 408571
57523 408571 402154 396669 392447 388524 384691 382085 381250 381357 381775 382692 383848 384432 384643 385610 387374 388693
57507 388693 389205 389919 391142 391811 391537 391483 392529 394210 396108 398597 401524 403798 405107 406563 408969 411889
57491 411889 415076 419246 424702 430636 436554 443008 450190 457224 463665 470310 477696 485046 491630 497931
57477D97931O559O047M064J143k086n115p082p577p557q084q745q585p835p195
57463D45883o318m702l260l176l757l326j830p75r17j645k308k616k023l19J466
57448D10377K075J656J245J175J249J756K921L888L779L210L317L843L659K644
57434D46794J636J004O87J019K089K788K095Q21N73J427K094J976J612J466J641
57419D69722K405L692M547M287L734L929M388M011L099K833L306L659L759M168
57405E21539M790N055N095N358N487M971M446M828N653N814N450N468N704N258
57391E94916M358M115M631N016N124N577O252O419O357P091Q551R538R628R572
57377F87145R777R942J0251J1289J2570J2670J1185R235P771O737O083O220P017
$$ plain form
57477 497931 504490 510537 514601 515744 513658 508543 501461 493884 486327 478243 469498 460913 453078 445883
57463 445883 439565 434863 431603 428427 424670 421344 419514 418739 417822 416177 413869 411253 409230 408911 410377
57448 410377 412452 414108 415353 416528 417777 419533 422454 426342 430121 433331 436648 440491 444150 446794
57434 446794 448430 449434 450121 451140 453229 456017 458112 458933 459506 460933 463027 465003 466615 468081 469722
57419 469722 472127 475819 480366 484653 488387 492316 496704 500715 503814 506647 509953 513612 517371 521539
57405 521539 526329 531384 536479 541837 547324 552295 556741 561569 567222 573036 578486 583954 589658 594916
57391 594916 599274 603389 608020 613036 618160 623737 629989 636408 642765 649856 658407 667945 677573 687145
57377 687145 696922 706864 717115 728404 740974 753644 764829 774064 781835 788572 794655 800875 807892
57364H07892P635P711P660P494O531M558K273K48j571l043l616l273k787k675
57350H35037k643k265j429q4J644K953K948J889J051J217K024K890L703M507N279
57335H58721O193P352Q338Q728Q997R989J1510J2419J2219J1631J1413J1559J1884
57322I90953J2486J3203J3413J2854J2175J2198J3020J4084J4861J5294J5684
57311A140225J6231J6658J6500J5830J5270J5071J4769J4076J3482J3484J3807
57300A305403J4042J4344J4821J4891J4145J3298J3317J4071J4721J5003J5163
57289A463219J5118J4763J4694J5516J6692J7235J7295J7911J9377K1046K2625
57278A655491K4518K6785K8898L0656L2295L3602L3929L3313L2687L2670L2966
$$ plain form
57364 807892 815527 823238 830898 838392 844923 849481 851754 852002 850431 847388 843772 840499 837712 835037
57350 835037 832394 830129 828700 828616 830260 833213 836161 838050 839101 840318 842342 845232 848935 853442 858721
57335 858721 864914 872266 880604 889332 898329 908318 919828 932247 944466 956097 967510 979069 990953
57322 990953 1003439 1016642 1030055 1042909 1055084 1067282 1080302 1094386 1109247 1124541 1140225
57311 1140225 1156456 1173114 1189614 1205444 1220714 1235785 1250554 1264630 1278112 1291596 1305403
57300 1305403 1319445 1333789 1348610 1363501 1377646 1390944 1404261 1418332 1433053 1448056 1463219
57289 1463219 1478337 1493100 1507794 1523310 1540002 1557237 1574532 1592443 1611820 1632866 1655491
57278 1655491 1680009 1706794 1735692 1766348 1798643 1832245 1866174 1899487 1932174 1964844 1997810
57267A997810L3170L3463L4120L4946L5451L5273L4393L3225L2284L1366K9531
57256B365032K6551K3820K2936K3689K4514K4628K4584K4845K5100K5173K5438
57245B636310K5972K6279K6315K6852K8327L0091L1322L2120L3156L4674L6394
57234B967812L8080L9717M1244M2418M3017M3101M3066M3293M3684M3755M3246
57223C432433M2367M1327M0053L8650L7491L6541L5166L3223L1777L1945L3491
57212C834464L5272L6766L8267M0020M2041M4581M7762N0866N2955N4145N5258
57201D332397N6218N5956N4192N2261N1506N1669N1548N0697M9658M8790M7735
57190D902627M6126M4219M2512M1039L9467L7758L6308L5316L4450L3398L2422
$$ plain form
57267 1997810 2030980 2064443 2098563 2133509 2168960 2204233 2238626 2271851 2304135 2335501 2365032
57256 2365032 2391583 2415403 2438339 2462028 2486542 2511170 2535754 2560599 2585699 2610872 2636310
57245 2636310 2662282 2688561 2714876 2741728 2770055 2800146 2831468 2863588 2896744 2931418 2967812
57234 2967812 3005892 3045609 3086853 3129271 3172288 3215389 3258455 3301748 3345432 3389187 3432433
57223 3432433 3474800 3516127 3556180 3594830 3632321 3668862 3704028 3737251 3769028 3800973 3834464
57212 3834464 3869736 3906502 3944769 3984789 4026830 4071411 4119173 4170039 4222994 4277139 4332397
57201 4332397 4388615 4444571 4498763 4551024 4602530 4654199 4705747 4756444 4806102 4854892 4902627
57190 4902627 4948753 4992972 5035484 5076523 5115990 5153748 5190056 5225372 5259822 5293220 5325642
57179E325642L1930L1780L1565L1399L1754L2636L3551L4276L4914L5205L4667
57168E689319L3626L3198L3811L4453L3751L1378K8164K5402K4233K4902K6334
57157F018571K7024K6630K6138K6363K7036K7475K7303K6340K4625K2673K0894
57146F301072J8702J5228J0912P181M529K357Q99J597M996R769J4629J9770K5571
57133F437212L1250L5777L9027M1179M2058M1848M1297M0477L8327L4201K8866
57122F851519K3643J9717J8542K1358K7809L6326M6125N7268O8857P9457Q9596
57111G340217J01738J17482J37241J62743J96784K39989K91024L50654M22424
57102I360296N09094O12701P39003Q97252J094262J333266J619375J959681K355635
$$ plain form
57179 5325642 5357572 5389352 5420917 5452316 5484070 5516706 5550257 5584533 5619447 5654652 5689319
57168 5689319 5722945 5756143 5789954 5824407 5858158 5889536 5917700 5943102 5967335 5992237 6018571
57157 6018571 6045595 6072225 6098363 6124726 6151762 6179237 6206540 6232880 6257505 6280178 6301072
57146 6301072 6319774 6335002 6345914 6353095 6357624 6359981 6360880 6362477 6367473 6377242 6391871 6411641 6437212
57133 6437212 6468462 6504239 6543266 6584445 6626503 6668351 6709648 6750125 6788452 6822653 6851519
57122 6851519 6875162 6894879 6913421 6934779 6962588 6998914 7045039 7102307 7171164 7250621 7340217
57111 7340217 7441955 7559437 7696678 7859421 8056205 8296194 8587218 8937872 9360296
57102 9360296 9869390 10482091 11221094 12118346 13212608 14545874 16165249 18124930 20480565
57093B0480565K801383L292089L826997M401518N004190N623620O247123O847664
57085E8525149P384173P816483Q092431Q100648P669291O671893N155620L339194
57077A12754882J467979l14768j958739l422807m647120n594471o274835o717995
57069H5292126o945470o977557o847234o592517o243806n826388n366448m886472
57061C5606234m400667l920795l461343l034156k643167k289080j974850j702314
57053A2179862j467761j265272j091421r43392q16128p05183o09668n29201m60618
57044D291218m00611l48918l05892k69418k37060k08975j85862j66164j48085
57035B020233j32294j19889j09586r9547r0235q2854p6516o9646o2726n7182n2764
$$ plain form
57093 20480565 23281948 26574037 30401034 34802552 39806742 45430362 51677485 58525149
57085 58525149 65909322 73725805 81818236 89918884 97588175 104260068 109415688 112754882
57077 112754882 114222861 113908093 111949354 108526547 103879427 98284956 92010121 85292126
57069 85292126 78346656 71369099 64521865 57929348 51685542 45859154 40492706 35606234
57061 35606234 31205567 27284772 23823429 20789273 18146106 15857026 13882176 12179862
57053 12179862 10712101 9446829 8355408 7412016 6595888 5890705 5281037 4751836 4291218
57044 4291218 3890607 3541689 3235797 2966379 2729319 2520344 2334482 2168318 2020233
57035 2020233 1887939 1768050 1658464 1558917 1468682 1385828 1309312 1239666 1176940 1119758 1066994
57024A066994m8337m4118m0870l8043l4807l1806k9942k8563k6754k5158k4545
57013F94051k3984k2400k0614j9659j8548j5848j2178q822n277n61M393Q262J1960
57000E70775J6957K2263K5971K8710L2436L6907M0727M4947N2039O1899P2660
56989A006291Q4887J01040J21435J45286J75694K18621K76981L50766M40377N37293
56979C458671O06122N89216M47795K03251o9003k90328m23655m76280m74242m41400
56969C130147l94594l44944k98109k55421k16878j82712j52772j26252j02507
56960A055958q1269o1945m3595k5864r758K294P104K513j0248k6118l9031m5631
56948G24410m6196m2727l7049l0431k3768j7434j1440o034j809R98K882M520O182
$$ plain form
57024 1066994 1018657 974539 933669 895626 860819 829013 799071 770508 743754 718596 694051
57013 694051 670067 647667 627053 607394 588846 572998 560820 551998 546721 546160 550553 558815 570775
57000 570775 587732 609995 635966 664676 697112 734019 774746 819693 871732 933631 1006291
56989 1006291 1091178 1192218 1313653 1458939 1634633 1853254 2130235 2481001 2921378 3458671
56979 3458671 4064793 4654009 5101804 5305055 5236052 4945724 4522069 4045789 3571547 3130147
56969 3130147 2735553 2390609 2092500 1837079 1620201 1437489 1284717 1158465 1055958
56960 1055958 974689 912744 869149 843285 833527 835821 842925 845438 835190 809072 770041 724410
56948 724410 678214 635487 598438 568007 544239 526805 515365 509331 507522 508520 511402 515922 522104
56935E22104P954J0151J3241J7697K4050L2158L9397M0325L0038Q933j6427l7849
56923F91772n0820n5616n4736n0595m5124l9829l5400l1589k7864k4030k0340
56912B55829j7345j5491j4529j3464j1596r433q031p610p434o858n828m409k637
56899A31164r45lJ18N2L05Q64J654K730L939N063O409Q613J1733J5199J8461K0715
56883B26071K0053J4354L816q361j8401k4458k6495k5041k1103j6374j2199q633
56871A03229n132j679J553N010R192J3679J7817K2070K7736L5386M4530N4685
56859C28076O5327P4056P5795O5476M2512J2629j5222l4408m3708m5776m3620
56848D81137l9040l3239k7164k0956j4137o795K71O775J3395K0729K8741L7599
$$ plain form
56935 522104 530058 540209 553450 571147 595197 627355 666752 707077 737115 746048 729621 691772
56923 691772 640952 585336 530600 480005 434881 395052 359652 328063 300199 276169 255829
56912 255829 238484 222993 208464 195000 183404 173971 165940 158330 150896 144038 138210 133801 131164
56899 131164 130219 130216 130334 130386 130691 131555 133209 135939 139878 144941 151350 159963 171696 186895 205356 226071
56883 226071 246124 260478 264294 255933 237532 213074 186579 161538 140435 124061 111862 103229
56871 103229 98097 96418 97971 102981 112173 125852 143669 165739 193475 228861 273391 328076
56859 328076 393403 467459 543254 608730 651242 663871 648649 614241 570533 524757 481137
56848 481137 442097 408858 381694 360738 346601 339806 340077 346852 360247 380976 409717 447316
56836D47316M8183O1383P7616R6311J13714J21018J08023P1789K1250k8439o5902
56825A072262q7776r5901r3845q5862p5912o5859n5403m4183l2929k2448j2806
56814C99338l889M242J2011K0458L0324M1810N5426P1685Q8570R9669R6510P4543
56802I90697L7848k251l4192n2806n9927n9828n5467m8616m1156l4490k8611k2954
56790E88247j7670j3175r243n526k291M16L675Q719J5571K3400L1098L6255L4756
56777F94232K3614M439j7175l5602m7864n3415n3333m9868m5256m0434l5395l0407
56765C13536k5983k2128j8717j6202j4830j3732j1993j0151r227q835p798o199
56753A47741n160m842m299l285k600k559k573k391k324k214j472k35P50J435K377
$$ plain form
56836 447316 495499 556882 634498 730809 844523 965541 1073564 1145353 1166603 1138164 1072262
56825 1072262 984486 888585 794740 708878 632966 567107 511704 467521 434592 412144 399338
56814 399338 395449 399691 411702 432160 462484 504294 559720 631405 719975 819644 916154 990697
56802 990697 1028545 1026294 992102 939296 879369 819541 764074 715458 674302 639812 611201 588247
56790 588247 570577 557402 548159 542633 540342 540758 544433 553152 568723 592123 623221 659476 694232
56777 694232 717846 722285 705110 669508 621644 568229 514896 465028 419772 379338 343943 313536
56765 313536 287553 265425 246708 230506 215676 201944 189951 179800 170573 161738 153940 147741
56753 147741 142581 137739 133440 130155 127555 124996 122423 120032 117708 115494 114022 113787 114537 115972 118349
56738A18349L492M139M410N018O032O990Q053R684J1416J2446J3230J5001J7725
56725B35985K0289K2450K4963K7714K9492K9741K8933K7091K3617J8860J4185
56714E03320J0292O873M070K571K184J888J477J583K027J928J511J942L207M100
56700E48973M504N601P399Q100O742M524K743J129r56l381o052r374j3058j5890
56686E41004j7408j8522j9895k0989k1151k0316j8359j5197j1776r407p866n802
56674C54316l249j842k263l346m139m862n320m529k644j200o85K54K345M413N467
56659C32716O187P345Q420Q777Q610Q001O616M980M320M555M321L541L746N214
56645D17349O044N019L144J316j161m459o985p769q026q832r226q094o113m238
$$ plain form
56738 118349 121841 125980 130390 135408 141440 148430 156483 166167 177583 190029 203259 218260 235985
56725 235985 256274 278724 303687 331401 360893 390634 419567 446658 470275 489135 503320
56714 503320 513612 520485 524555 527126 529310 531198 532675 534258 536285 538213 539724 541666 544873 548973
56700 548973 553477 559078 566477 574577 581319 585843 588586 589715 588759 585378 579326 569952 556894 541004
56686 541004 523596 505074 485179 464190 443039 422723 404364 389167 377391 367984 360118 354316
56674 354316 351067 349225 346962 343616 339477 334615 329295 324766 322122 320922 320237 320491 322836 327249 332716
56659 332716 338903 346248 354668 363445 372055 380056 386672 391652 395972 400527 404848 408389 412135 417349
56645 417349 423393 428412 431556 432872 431711 427252 420267 412498 404472 395640 386414 378320 372207 367969
56631C67969k069P69L362N102O807Q900J0239J0203J0013J0455J0200Q148N636
56618D55734M409M066L368K491K151J923J320J210K344L683L932L556L619L855
56604D97661L480K820K474K011R59R0K06P65R78J148J701K063J842J904L037M672
56588E27811N993P015P657P207N736M492L930L055J638J193K581M706O813R935
56574E99762J4692J9904K4989L1555M0727N1054O0981P1375Q3482R6322J08203
56563A203046J19065J29147J37003J41093J41928J40684J37161J30960J23068
56554B403155J14309J03778R0639P5736N9644M1078J9367l247k3991m2593o0000
56543B777875p5942q9971j03097j15996j27141j34922j40004j43482j44436j41587
$$ plain form
56631 367969 365900 366669 370031 375133 381940 390840 401079 411282 421295 431750 441950 450098 455734
56618 455734 460143 464209 467577 470068 472219 474142 475462 476672 479016 482699 486631 490187 493806 497661
56604 497661 501141 503961 506435 508446 509405 509495 509701 510466 511444 512592 514293 516356 518198 520102 523139 527811
56588 527811 533804 540819 548476 555683 561419 565911 569841 572896 574534 575727 578308 583014 589827 599762
56574 599762 614454 634358 659347 690902 731629 782683 843664 915039 998521 1094843 1203046
56563 1203046 1322111 1451258 1588261 1729354 1871282 2011966 2149127 2280087 2403155
56554 2403155 2517464 2621242 2711881 2787617 2847261 2888339 2907706 2904459 2880468 2837875 2777875
56543 2777875 2701933 2611962 2508865 2392869 2265728 2130806 1990802 1847320 1702884 1561297
56533A561297j35629j27759j17728j05662r3841q4099p5227o5487n5861m8205
56523F51799m2015l5840l0203k6340k3600k0838j8817j8487j8510j7249j5606
56512C84294j5088j4850j3499j2105j2225j2658j1502r862j0053j1410j1421r961
56500B39660q980q860q359p381o723n869m036k431k566l307k574r18l32o00jJ343
56484A78066J990K157L008L878L360K260K318K906K125L29o39q06j566k623k719
56469A94044k478l373m717m847m361m861n572m634k897k729l822l797k415j554
56455A41987j486p39N88R60N45J000K252K674K212K262K812K581J568P02l53k175
56439A57390l388k452o82k86o52J41J374J017j58K51J863K244J376J435K649L253
$$ plain form
56533 1561297 1425668 1297909 1180181 1074519 980678 896579 821352 755865 700004 651799
56523 651799 609784 573944 543741 517401 493801 472963 454146 435659 417149 399900 384294
56512 384294 369206 354356 340857 328752 316527 303869 292367 282505 272452 261042 249621 239660
56500 239660 230680 221820 213461 206080 199357 193488 189452 187021 184455 181148 178574 177656 177324 176724 176723 178066
56484 178066 180056 182213 185221 189099 192459 194719 197037 199943 202068 202397 201758 200952 199386 196763 194044
56469 194044 191566 188193 183476 178629 174268 169407 163835 159201 156304 153575 149753 145956 143541 141987
56455 141987 140501 139762 140350 141310 141855 142855 145107 147781 149993 152255 155067 157648 159216 159918 159565 157390
56439 157390 154002 151550 150868 150582 149930 150071 151445 152462 152304 152555 154418 156662 158038 159473 162122 165375
56423A65375L129L673M504M079L112L640N166N455M570M368M675L856K525K672
56409B20799L587K789N50n79k68m51j329j377r14j552k658k379j575k563m572
56394B07508m883l737l646m477l972k626l064m924n239l818l303m022l713k317
56380A53767k083k855k208m00j41j357j228L95P65l77l83R72J043l89n87Q01J139
56363A46874Q1J89J642J639j84r65n1R9q35k86J804K353R13N49J938K113L84j57
56345A58100J521K508J564J159K242K278L82p31K41J109P76J002K149K018L90
56330A76708k29M41j15j810j503Q64J447o52j641J37J550Q27M35J691K181R27
56314A81258N64K012K439P78r8J090J772R85J435L883N167M164L989N840O522
$$ plain form
56423 165375 168504 172177 176681 180760 183872 187512 192678 198133 202703 207071 211746 215602 218127 220799
56409 220799 224386 227175 227725 227146 226878 226427 225098 223721 222807 221255 218597 216218 214643 212080 207508
56394 207508 202625 198888 195242 190765 186793 184167 181103 176179 170940 167122 163819 159797 156084 153767
56380 153767 151684 148829 146621 146221 146080 144723 143495 143890 144655 144278 143895 144867 145910 145521 144934 145735 146874
56363 146874 146955 147144 148786 150425 150241 149276 149225 149324 148489 148203 150007 152360 153273 153822 155760 157873 158257 158100
56345 158100 159621 162129 163693 164852 167094 169372 169754 169023 169264 170373 171149 172151 174300 176318 176708
56330 176708 176479 176920 176805 174995 173492 174356 175803 175151 173510 173647 175197 176024 176459 178150 180331 181258
56314 181258 181822 183834 186273 187051 186953 188043 189815 190800 192235 196118 201285 205449 209438 215278 221800
56299B21800M658L519M905N995N123M860O434O903N019M125O016P562O693O058
56285B99670P449Q171O499N231O227O866N406M556O137P428O466N827P611R610
56271C93154R950J0547J2763J4574J5147J7049K0894K3399K3725K5997L2178L8316
56259F37693M1374M3979M8549N2502N3378N3266N4149N4029N1388M8396M6247
56248A184950M2554L6566L1401K7969K2626J4063O328J655l212j0111j5609j7959
56236A321221k1052k7295l3261l6569m0201m5610m8633m7019m4948m5264m4254
56225H87115l9341l4714l3817l3184k9576k6268k6340k6460k3535k0880k1623
56214E71377k2417k0056j7914j9254k0515j7872j4411j4036j4053j0533n492k338
$$ plain form
56299 221800 226458 229977 234882 240877 246000 250860 257294 264197 269216 273341 279357 286919 293612 299670
56285 299670 307119 315290 321789 327020 333247 340113 345519 350075 356212 363640 370106 375933 383544 393154
56271 393154 403104 413651 426414 440988 456135 473184 494078 517477 541202 567199 599377 637693
56259 637693 679067 723046 771595 824097 877475 930741 984890 1038919 1090307 1138703 1184950
56248 1184950 1227504 1264070 1295471 1323440 1346066 1360129 1366457 1368112 1364900 1354789 1339180 1321221
56236 1321221 1300169 1272874 1239613 1203044 1162843 1117233 1068600 1021581 976633 931369 887115
56225 887115 847774 813060 779243 746059 716483 690215 663875 637415 613880 593000 571377
56214 571377 548960 528904 510990 491736 471221 453349 438938 424902 410849 400316 394824 392486
56202C92486K45L777N142K393m02QN10j408j897J749M891L517J524L070M685K434
56186D22724NJ786M452L448J585L034M931L155O15J621L643K687J206K733M299
56171D61924K177n10K76J763K66j230P66K719P21j638j38J783l4j949M13L233
56155D70542J611q75J030M320L908K401M238O396M488K022L895O828N854M098
56141E20756O334R204P816N676Q019J1683J1850J2227J7949K4894K6835K6632
56129F89875K9599L2446L0161K7116K9616L3818L2763K8866K7695K5950J7990
56118A005895P924K665o84q057j5552j6374j4321j7128k2313k2909k1209k3323
56106H54614k5995k2630j6700j5514j6357j2532p230p303r219n579K31L86k263
$$ plain form
56202 392486 392731 396508 401650 404043 403641 403649 404159 402751 400854 402603 407494 411011 412535 415605 420290 422724
56186 422724 422729 424515 428967 432415 434000 437034 441965 445120 445735 447356 450999 453686 454892 457625 461924
56171 461924 464101 463591 463867 465630 465896 464666 465432 468151 468872 467234 467096 468879 468845 466896 467309 470542
56155 470542 472153 471278 472308 476628 480536 482937 487175 493571 498059 500081 503976 510804 516658 520756
56141 520756 527090 536294 544110 549786 557805 569488 581338 593565 611514 636408 663243 689875
56129 689875 719474 751920 782081 809197 838813 872631 905394 934260 961955 987905 1005895
56118 1005895 1013819 1016484 1015800 1007743 992191 975817 961496 944368 922055 899146 877937 854614
56106 854614 828619 805989 789289 773775 757418 744886 737656 730353 721134 715555 715786 716172 713909
56093G13909q7M255L470M74K483O284M648J369M252R338Q116M216O533J1830J1101
56078G92191P189Q864J3247J1682P292Q939J3339J1250N892O907J1626J0796P265
56065I16479J0125J5961J5159J1092J3589J9258J8245J4382J7999K4823K3322
56054A100434J7038J7797K2764K0644J4714J6568K2634K0696J4389J6869K5360
56043A309907K6696K3113K7141L5804L5921L0517L3370M1507M0064L0553K7093
56032A661686K8681K2994J3626J4909K3467K3845J8519K2636L3269L4619K9717
56021A927968L5144M8025N0889M5785N0038O1593O3080N7092O1917P5116P7790
56010B554437P2128P7196R0337R1536Q3548Q7387J00406J00549R0153R2347J05669
$$ plain form
56093 713909 713822 718077 721547 722021 724504 730788 735436 736805 741057 750395 758511 762727 769260 781090 792191
56078 792191 799380 808244 821491 833173 840465 849404 862743 873993 879885 886792 898418 909214 916479
56065 916479 926604 942565 957724 968816 982405 1001663 1019908 1034290 1052289 1077112 1100434
56054 1100434 1117472 1135269 1158033 1178677 1193391 1209959 1232593 1253289 1267678 1284547 1309907
56043 1309907 1336603 1359716 1386857 1422661 1458582 1489099 1522469 1563976 1604040 1634593 1661686
56032 1661686 1690367 1713361 1726987 1741896 1765363 1789208 1807727 1830363 1863632 1898251 1927968
56021 1927968 1963112 2011137 2062026 2107811 2157849 2219442 2282522 2339614 2401531 2476647 2554437
56010 2554437 2626565 2703761 2794098 2885634 2969182 3056569 3156975 3257524 3347677 3440024 3545693
55999C545693J06961R8101J03473J21777J28255J24420J35851J60620J71458J69634
55989D866243J83222K11193K24802K25514K43339K76325K92728K95003L17627
55980G135996L59138L83684L92827M24509M77426N11936N30354N76147O48359
55971A1440376P02279P41299Q16801R29699J030380J124938J275570J485921J701901
55962B1249164J938402K279162K737664L257667L865748M664443N655275O749345
55954E2396870P978796R494856J1337240J3465238J6063802J9523418K4083473
55947A54343693K9879118L7241305M5914877N3226737N3887924M3374387K2317873
55940D40185914k932678k4578193l8177776m3764808m3691210m0411435l5772063
$$ plain form
55999 3545693 3652654 3750755 3854228 3976005 4104260 4228680 4364531 4525151 4696609 4866243
55989 4866243 5049465 5260658 5485460 5710974 5954313 6230638 6523366 6818369 7135996
55980 7135996 7495134 7878818 8271645 8696154 9173580 9685516 10215870 10792017 11440376
55971 11440376 12142655 12883954 13700755 14630454 15660834 16785772 18061342 19547263 21249164
55962 21249164 23187566 25466728 28204392 31462059 35327807 39992250 45647525 52396870
55954 52396870 60375666 69870522 81207762 94673000 110736802 130260220 154343693
55947 154343693 184222811 221464116 267378993 320605730 374493654 417868041 440185914
55940 440185914 437253236 412675043 374497267 330732459 287041249 246629814 210857751
55933B10857751l1002806k6655806k2754722j9238727j6179631j3610519j1424931
55926F9990609r539363p975892o723287n676477m769090m028785l456189k974331
55918B4847195k538634k182460j915674j682594j455019j269666j140288j022044
55910A1640816q93464p89526p24302o59538n77738n12012m76740m38765l83025
55901F185706l40126l23718l03739k65986k38124k32869k22678j94013j72207
55892C892246j69997j63387j40518j24504j26474j23713j05074r2073r4849r1810
55882B659847p2820n9437o2645o2025m6292l4204l5986l2963j4801K05O04J433
55870B240916J0440J0055q553k7100l3583m1439n8395o8697o4020o0827o9399
$$ plain form
55933 210857751 179854945 153199139 130444417 111205690 95026059 81415540 69990609
55926 69990609 60451246 52475354 45752067 40075590 35306500 31277715 27821526 24847195
55918 24847195 22308561 20126101 18210427 16527833 15072814 13803148 12662860 11640816
55910 11640816 10747352 9957826 9233524 8573986 7996248 7484236 7007496 6568731 6185706
55901 6185706 5845580 5521862 5218123 4952137 4714013 4481144 4258466 4064453 3892246
55892 3892246 3722249 3558862 3418344 3293840 3167366 3043653 2938579 2846506 2751657 2659847
55882 2659847 2587027 2527590 2464945 2402920 2356628 2322424 2286438 2253475 2238674 2238879 2239483 2240916
55870 2240916 2251356 2261411 2252858 2225758 2192175 2150736 2092341 2023644 1959624 1898797 1829398
55859A829398p5489o9800o6321p4203p9814p3775o8374p1389o9439n4169l9273
55848A087352l5167l1581k0963j4327j8067j9077q889N81O37K388J4617K7112
55836I84616L0616L1594L3212K3977M09k0356k5697k5027k8465k8974k0397j2804
55824I42704j4312j6495j2487j1090j8636k5113k2669k0008k4455k7364k1321
55813G28754j4560j4312j2778l442N286O444Q232J7814K7444L0219L3845M5280
55801H58226N7067O2305O7736P8447Q4581P7037O2154M7749K9195K813k1514l5204
55789A370592m5143n9445p2237p5928p5710p8238p8342p0366o0815n6664n2670
55778F45034m3048l4106l2556l2581k7111k1029k0705k1346j7016j2639j3899
$$ plain form
55859 1829398 1753909 1684109 1617788 1543585 1463771 1389996 1321622 1250233 1180794 1126625 1087352
55848 1087352 1052185 1020604 999641 985314 967247 948170 939281 939862 940499 942887 957504 984616
55836 984616 1015232 1046826 1080038 1104015 1104424 1084068 1058371 1033344 1004879 975905 955508 942704
55824 942704 928392 911897 899410 888320 869684 844571 821902 801894 777439 750075 728754
55813 728754 714194 699882 687104 683662 688948 695392 703624 721438 748882 779101 812946 858226
55801 858226 915293 977598 1045334 1123781 1208362 1285399 1347553 1395302 1424497 1427310 1405796 1370592
55789 1370592 1325449 1266004 1193767 1117839 1042129 963891 885549 815183 754368 697704 645034
55778 645034 601986 567880 535324 502743 475632 454603 433898 412552 395536 382897 368998
55767C68998j5562j1728p430q420r692n741j879l880o478l671l53k302m724k181
55753B84957J47l391p473o066m203p886j1927r658n441n767p017l829o39l075
55739B08732o486m680j627l050m899j706K039M44k125N12M297K956J08J739M284
55724B00538J937j531J03L592K920J035L606P724P959P107R956J2947J0855P273
55710B76021P645Q480M286j317k245j213l546o248m256j254l130o681n821l061
55696B57660l839n359k283K245K436J265M853J0764J2964J3375J7493K3475K6566
55683C61615K9480L7250M6442N0600N2135N7885O6961P3632P8043Q3277Q5710
55672A023030P9115O5084M9445L2231J1170r168k2107k9030l4779l7165l1463
$$ plain form
55767 368998 353436 341708 334278 325858 316166 310425 308546 304666 298188 294517 294164 291862 287138 284957
55753 284957 285104 281713 274240 268174 263971 256085 244158 234500 229059 223292 216275 212446 211807 208732
55739 208732 202246 197566 195939 192889 187990 186284 188323 188767 186642 187154 191451 194407 194515 196254 200538
55724 200538 202475 200944 201047 204639 207559 208594 212200 219924 227883 234990 244946 257893 268748 276021
55710 276021 283666 292146 296432 295115 292870 291657 288111 281863 277607 276353 273223 266542 260721 257660
55696 257660 253821 248462 246179 248424 250860 252125 256978 267742 280706 294081 311574 335049 361615
55683 361615 391095 428345 474787 525387 577522 635407 702368 776000 854043 937320 1023030
55672 1023030 1102145 1167229 1216674 1248905 1260075 1250907 1228800 1199770 1164991 1127826 1096363
55661A096363k1297j4133r391j469Q800J6232K1408K7946L2620K8837J7517M526
55649A207959r876k8900m9256o3819p2074p8267q1630p8300p0634o4623o0054
55638E50526n2710m4042l8989l6445l1483k5087k2163k1900j9600j5942j5064
55627B27101j5509j2713q448q081j0302r310n561m548o295n814k991k442m305
55614A30782m366k648k952m656l696q85o74k602k408n94j245l511k895n1L85j258
55598I6726n72K056K111j78k59K016K493R62J069K532J647r73j130J003J499M24
55582A11426J272L481L440J907K585M460L541R92J282L507K981L71N37L278L931
55567A48991K432K929M988M152Q94J20J908J527j354k221n85o11k643k696o27
$$ plain form
55661 1096363 1075066 1060933 1051542 1050073 1058873 1075105 1096513 1124459 1157079 1185916 1203433 1207959
55649 1207959 1198083 1169183 1119927 1056108 984034 905767 824137 745837 675203 610580 550526
55638 550526 497816 453774 414785 378340 346857 321770 299607 277707 258107 242165 227101
55627 227101 211592 198879 190431 182350 172048 162738 157177 152629 146334 140520 137529 135087 130782
55614 130782 126416 123768 120816 116160 112464 111579 110905 108303 105895 105301 104056 100545 97650 97599 97984 96726
55598 96726 96154 98210 100321 100143 99884 101900 104393 105355 106424 108956 110603 109630 108500 109503 111002 111426
55582 111426 112698 116179 119619 121526 124111 128571 132112 133104 134386 137893 140874 141245 141782 145060 148991
55567 148991 151423 154352 159340 163492 164386 164506 166414 167941 166587 164366 163781 163170 160527 157831 157204
55552A57204l77j709k81L784N833N562P402J1599J3563J2872J4334J9193K3523
55539B72502K6305L0747L6782M0591M2593M7462N5096N9887O0201O0060O0012
55528G92238N4830M2167K5565P303j3699l5179n0992n9466o4782o8421o7060o0644
55516E01860n4404n0515m5531l8338l2851l0407k7156k1667j7784j7172j6170
55505A49865j2839j0283j0156r625p414o365p412p339n005l556m189m025k291
55492E9366k167m351n166l267j868k296j771L19N99j638k499n88M42j208k413
55477C1494j384o75j605j804o29p87k513k391l3N60j600k447m26P64m93p30J533
55460A6834K633P70n36P24J406l22j337J01Q06r90j949k7J529L81o10P85J735
$$ plain form
55552 157204 156827 155118 154837 158621 164454 170016 177418 189017 202580 215452 229786 248979 272502
55539 272502 298807 329554 366336 406927 449520 496982 552078 611965 672166 732226 792238
55528 792238 847068 889235 914800 922103 908404 873225 822233 762767 697985 629564 562504 501860
55516 501860 447456 396941 351410 313072 280221 249814 222658 200991 183207 166035 149865
55505 149865 137026 126743 116587 106962 99548 93183 85771 78432 73427 69871 65682 61657 59366
55492 59366 57199 52848 47682 44415 42547 40251 38480 38799 39398 37760 35261 34673 35115 33907 31494
55477 31494 30110 29435 27830 26026 25397 24610 22097 19706 19673 20233 18633 16186 15760 16524 16031 15301 16834
55460 16834 19467 20237 19701 20425 21831 21509 20172 20273 21079 20089 18140 18113 19642 20023 19413 20198 21933
55443B1933j40k191j667k45M2N48K144K568R79L35J931K571M10j427m75Q80K87
55426B8483m24N01J115r7r82O3J033N37N69K085K493N83o86O44K208J949J446
55409D1520J854J379l60m77J761K711M88j705j403q03j757k122n39L69r28j664
55393C8324j49P30j049k686j743m01q16j117K84J178O9o42M28M94j838l089j006
55376B6971R62l53k316j573J39p9r09j39P62m2p93J73O90j024k432j211L74q6
55358A9114n52J115K459Q67j260p85N32l43j963j411J15j68j364j003J23j51j036
55341A4289o79Qn73j226l81N56j26j040n08J21n76q93P01K231J751J043K015K770
55323A9483J126j090j251l62m71p07K66Q82l63j653j180n94j540k137o78O76j81
$$ plain form
55443 21933 21793 19602 17935 17690 17732 18280 20424 22992 23971 24306 26237 28808 29218 27791 27316 28196 28483
55426 28483 28059 28560 29675 29578 28596 28659 29692 30229 30798 32883 35376 35959 35273 35917 38125 40074 41520
55409 41520 43374 44753 44393 43916 45677 48388 48876 47171 45768 44965 43208 41086 40547 40916 39988 38324
55393 38324 38175 38905 37856 35170 33427 33026 32210 31093 31377 32555 32624 31982 32410 32904 31066 27977 26971
55376 26971 27933 27580 25264 23691 23830 23751 22842 22703 23465 23423 22630 22803 23493 22469 20037 18826 19200 19114
55358 19114 18562 19677 22136 23003 21743 20958 21490 21147 19184 17773 17888 17720 16356 15353 15476 15325 14289
55341 14289 13610 13618 13045 11819 11438 11994 11868 10828 10320 10441 9865 8972 9673 11904 13655 14698 16713 19483
55323 19483 20609 19519 18268 17906 17435 16728 16994 17876 17513 15860 14680 14086 12546 10409 9731 10407 10226
55306A0226j211j23J242O00k42J002K454J566j0K62R60k24j687j041J00p19j802
55289A1353m61J677J511J4p4N19m05j680r34O04L23q93o18M43K91j10R92J988
55271A4540N98j552j618n68q43j461k82J214M88r38k8K081K119N44K32J019O68
55254A6213k85K78J407O23j184j197J95M11m49m07J12o19j509k81K001K530J558
55237A9397J240J164l37j934j174P31P72n03k80J071Q89m94l18J379J927R12L36
55220B4778N37J83l18L82J222K91j206q10M75j75k167k484j059m48r44o13L92
55203A8036J36r90q79R1k16j353j077J99J05j096j014K78N45j99L9J012O61o52
55185A3626o37N73Q06J22M35J362Q27o38n72P31O70p77j054K13Q00K03K02J046
$$ plain form
55306 10226 9015 8892 10134 10734 10492 11494 13948 15514 15504 15766 16726 16502 14815 13774 13874 13155 11353
55289 11353 10892 12569 14080 14094 14020 14539 14134 12454 11520 12124 12447 11554 10936 11379 11670 11560 12552 14540
55271 14540 15138 13586 11968 11400 10557 9096 8814 10028 10516 9578 9550 11631 13750 14294 14526 15545 16213
55254 16213 15928 16206 17613 18236 17052 15855 16050 16461 16012 15605 15717 15098 13589 13308 15309 17839 19397
55237 19397 20637 21801 21464 19530 18356 19087 19859 19356 19076 20147 21036 20542 20224 21603 23530 24442 24778
55220 24778 25315 25498 25180 25562 26784 27075 25869 25059 25534 25359 23192 20708 19649 19201 18257 17644 18036
55203 18036 18172 17182 16303 16394 16178 14825 13748 13947 14052 12956 11942 12220 12765 12566 12605 13617 14278 13626
55185 13626 12989 13562 14368 14490 14925 16287 17114 16476 15904 16635 17305 16528 15474 15687 16487 16690 16892 17938
55167A7938J113L69K93N77l13j663j501m61o59j359j54K175K574J003K59Q09M74
55150B1474q86j116k05k86j192o54R45Q20r72j360K08R09j48n26O84J251J87n78
55132A8555j21Po08j33J755K754J827P06M87J39o57n52O35J278Q91P31J053Q01
55114B9548K53P22J601J060l79n10M38J99j082r39O88J088m42j503j034p07j263
55097B7738j275m40l58j220j324n13m66j136o27R30J217j9m44N64J059N13O21
55080B4820J476J044o78j091M31J379N13m19l44l86p52j7J482J447j47o02O88
55063B8844J069m94j482l73Q49M81j97J12L92k71r16q37p41o94K58J627J686O91
55045C0004O54J495J035p30j261n2M53n98j165m79l97j430j580l84J7q36o65R89
$$ plain form
55167 17938 19051 19420 19713 20290 19977 18314 16813 16352 15693 14334 14180 16355 18929 19932 20191 21000 21474
55150 21474 20588 19472 19267 18981 17789 17135 18080 18900 17928 16568 16776 17685 17537 17011 17695 18946 19133 18555
55132 18555 18434 18441 17833 17700 19455 22209 24036 24742 25229 25368 24711 24159 24794 26072 26963 27694 28747 29548
55114 29548 29801 30523 32124 33184 32805 32295 32733 32932 31850 30911 31599 32687 32245 30742 29708 29001 27738
55097 27738 26463 26023 25665 24445 23121 22608 22142 21006 20379 21309 22526 22507 22063 22627 23686 24199 24820
55080 24820 26296 27340 26662 25571 26002 27381 27894 27475 27131 26745 25993 25976 27458 28905 28758 28156 28844
55063 28844 29913 29419 27937 27564 28413 28894 28697 28809 29201 28930 28014 27177 26436 25742 26000 27627 29313 30004
55045 30004 30658 32153 33188 32458 31197 31145 31598 31000 29835 29356 28959 27529 25949 25565 25582 24746 24081 25070
55027B5070J484n9r71K8N59o99j325L47K073J662M59K81L51l06n94J58N31k7K48
55008B9270J996L072K343J734K468K807J692J101K291L176K007M90N28R58K69
54993E6202l40N61J816J983K033L198M509M854N205O596Q096Q868R974J2221J4512
54978A40288J6159J8330K1519K4016K4671K4507K4012K1515J6088R320K587m592
54966C38420j1863j6895j8830j9863k1485k2253k1141j9732j8975j7127j3356
54955A36900j0087r118q593o525m339l940m101k780o20P36J587K765L532L330
54941I8747L556N240P152Q216R500J1807J3905J5220J7423K1159K4022K4182K3019
54928B83148K1688J8255J1092K330n100j1233j6980k1061k2266k2261k2919k2990
$$ plain form
55027 25070 26554 26495 25524 25552 26111 25412 24087 24434 26507 28169 28628 28909 29260 28954 28360 28518 29049 29022 29270
55008 29270 31266 34338 36681 38415 40883 43690 45382 46483 48774 51950 53957 54447 54975 55933 56202
54993 56202 55862 56423 58239 60222 62255 65453 69962 74816 80021 86617 94713 103581 113555 125776 140288
54978 140288 156447 174777 196296 220312 244983 269490 293502 315017 331105 340425 343012 338420
54966 338420 326557 309662 290832 270969 249484 227231 206090 186358 167383 150256 136900
54955 136900 126813 117695 109102 102577 98238 94298 90197 87417 86797 87533 89120 91885 95417 98747
54941 98747 102303 107543 114695 122911 132411 144218 158123 173343 190766 211925 235947 260129 283148
54928 283148 304836 323091 334183 336513 331413 320180 303200 282139 259873 237612 214693 191703
54916A91703k0578j6813j4006j2110j0017q329p918p627o273m989m915m665k901
54903G0562j297j874l414l574k744k640k861j961m67J42J70O86J139N88j59n7
54887E2239M7q66j824j780j789k839l494k268m72l9l80o0L25l04r00j32Q63L71
54869C6698q50j071n79n53o10m4K24n33q48N02K019J987J520K283L232K562J047
54852D6986M12K28o08j180l93L89l32j091N4J784J691M55L15R91Q02L83J504L327
54834E5717L651K960L589N550O766O913P643R350J0852J2007J3776J6091J8176
54821A73041K0435K3414K5696K5340K2622J8926J4032P190k96o433j1425j6416
54809B96126k0451k1702k0712j9482j8212j5898j3186j1600j0693q926o675n470
$$ plain form
54916 191703 171125 154312 140306 128196 118179 109850 101932 94305 88032 83043 78128 73463 70562
54903 70562 69265 67391 63977 60403 57659 55019 52158 50197 49730 49872 50042 50728 51867 52455 52296 52239
54887 52239 52286 51420 49596 47816 46027 43188 39694 37426 36954 36915 36535 36475 36800 36496 35596 35464 36327 36698
54869 36698 35848 34777 34198 33645 33035 32991 33215 32682 31834 32336 34355 36342 37862 40145 43377 45939 46986
54852 46986 47398 47626 47018 45838 45445 45834 45502 44411 44465 46249 47940 48395 48710 49701 50503 50886 52390 55717
54834 55717 59368 62328 65917 71467 78233 85146 92789 102139 112991 124998 138774 154865 173041
54821 173041 193476 216890 242586 267926 290548 309474 323506 330696 330400 323967 312542 296126
54809 296126 275675 253973 233261 213779 195567 179669 166483 154883 144190 135264 128589 123119
54797A23119m982l695j848q62m83P25K645M000M876O228P757Q776J0164J2855
54783A69275J5404J5939J5446J6188J7922J8767J8749J9216J9525J7672J3666
54772C57769R145M249k039q995j4676j8888k2673k5419k5553k3606k1630k0005
54760A87679j7675j4979j3212j1973r952p824p274p660o830m855l781l931l641
54747G4092k525j922k107j959j364j269j521j258j050k017l207k721r59L0l8J80
54731E0385O76K80n48k08J005J362Q39Q43J196N21o69m44J144K138J994J862J798
54714F4174Q44m03l16P82J174R70J690K990L035J965J642K133J848J032J602L363
54698H8525L963K862J972K025J697Q00Q51J877J983P88J69Q82J472J223J254J942
$$ plain form
54797 123119 118137 114442 112594 111732 111249 111974 114619 118619 123495 129723 137480 146256 156420 169275
54783 169275 184679 200618 216064 232252 250174 268941 287690 306906 326431 344103 357769
54772 357769 366914 371163 369124 360129 345453 326565 303892 278473 252920 229314 207684 187679
54760 187679 170004 155025 141813 129840 119888 112064 104790 97130 90300 85445 81664 77733 74092
54747 74092 71567 69645 67538 65579 64215 62946 61425 60167 59117 57100 53893 51172 50213 50243 50205 50385
54731 50385 51061 51341 50793 50585 51590 52952 53791 54634 55830 56351 55682 55238 56382 58520 60514 62376 64174
54714 64174 65018 64615 64299 65081 66255 67225 68915 71905 74940 76905 78547 80680 82528 83560 85162 88525
54698 88525 92488 95350 97322 99347 101044 101844 102695 104572 106555 107343 107512 108394 109866 111089 112343 114285
54682A14285K162J714J790K494K656K529L798O400Q167Q220P910P921P306N912
54668A83264M885M168K271q93l646n451p444r677j0697j0317j0010j0025r051
54655A17377p201o317o673o345m589k924k228j545o11o56j838k491j834r78o31
54640G0516k22K16j08p20l47L99l54k194k641j220j54m82p53k46j61q42r46l02
54622E9439m24j372j202N37J853J770J611J964J609M25R5R06R88j04m37O40J236
54605F9534N90N20J746K212Q81j72O36J750J439N69M63O38M90P53J541J520N91
54588H5701P28K611M131L850L143L188K814J251J75Q49J877J885J855K668K927
54573A19653J549J60M36J259Q99N3K68J127J290R23J019J524J971K629L609M142
$$ plain form
54682 114285 116447 118161 119951 122445 125101 127630 131428 137828 145995 154215 162125 170046 177352 183264
54668 183264 188149 192317 194588 193695 190049 184598 177154 167477 156780 146463 136453 126428 117377
54655 117377 110176 103859 97186 90841 86252 83328 81100 79555 78944 78288 76450 73959 72125 71147 70516
54640 70516 70294 70510 70402 69682 69335 69734 69380 67186 64545 63325 63171 62689 61936 61690 61529 60687 59741 59439
54622 59439 59015 57643 56441 56978 58831 60601 62212 64176 65785 66210 66305 67211 68199 68095 67658 68298 69534
54605 69534 70124 70644 72390 74602 75483 75311 75947 77697 79136 79705 80168 80806 81296 82049 83590 85110 85701
54588 85701 86429 89040 93171 97021 100164 103352 106166 107417 107592 108441 110318 112203 114058 116726 119653
54573 119653 121202 121362 121798 123057 123956 124009 124277 125404 126694 127617 128636 130160 132131 134760 138369 142511
54557A42511M002M068M463L935K117L68o82k204m612o322o400o101o320n989m477
54542A18357l222l230l289k373j582j886k232j700j263j645j605k90R21P73L03
54527I6037O90J040K59q13j037r02j060p81L36J061N73r4j26l74j225j336j73
54510I2075N74j18o96J54J193J108Q40J288J208k99j523q43N48J030J323K376
54494A00238K744J027j152j474n46k83m44K71J176P36l76k87Q48J318Q27M90N81
54477A05694M29N9n4k15q21j256r30m42l89k73J32q4j134j598q73n38j649k676
54459I3382k155j282j664k452k074j055p36p77k85J63j32k57M87P49n47j827j278
54442G8260Q9L83R7O68J387O82p73j128m75j96l09p6j57j498l015k985j801j011
$$ plain form
54557 142511 146513 150581 155044 158979 161096 161464 160782 158578 153966 147644 141244 135143 128823 122834 118357
54542 118357 115135 111905 108616 106243 104661 102775 100543 98843 97580 95935 94330 94040 94961 95734 96037
54527 96037 96727 97767 98026 97213 96176 95274 94214 93433 93769 94830 95403 95309 95183 94809 93584 92248 92075
54510 92075 92649 92531 91835 91989 93182 94290 95130 96418 97626 97327 95804 94961 95509 96539 97862 100238
54494 100238 102982 104009 102857 101383 100837 100554 100110 100381 101557 102293 101917 101630 102478 103796 104623 105113 105694
54477 105694 106123 106182 106128 105913 105092 103836 102906 102464 102075 101802 101934 101850 100716 99118 98245 97707 96058 93382
54459 93382 91227 89945 88281 85829 83755 82700 81964 81187 80902 81065 80933 80676 81163 81912 81365 79538 78260
54442 78260 78349 78732 78829 79497 80884 81566 80793 79665 79190 78994 78685 78609 78452 76954 73939 70954 69153 68142
54424F8142o05K57R84N69j75J11Q08N32j68Q3P68M66l68k63M89N08L4L17J028
54405G3517P83k90r45j084j410j571q61k3j31n90l42kn21r64j19R50O53n9P15
54386F7706K249K224O18n21n90p12r86l99P19J006O48J024K031K277J680J419
54370H0393J561J202O43R41J616J271J77j88J88J8o89o98Q6O25Q33J333J596O82
54352I1590o46r05m81p58j324p18N66O63m55j191j416k370l609l233j298q5n42
54335G3788j173r91q85j475j968j869j775j924j808j535j738k063j562n30j05
54320E2387j92J89P68M32n47q80o83j184k185k215j146l05PO34J312P89o24j094
54302D5463j37P55O87L21J41k14o27n35l12o77r88j72R27N71p97j092j04K66o10
$$ plain form
54424 68142 67537 67794 68778 69347 69172 69283 70091 70623 70455 70538 71306 71772 71404 71141 71630 72138 72172 72489 73517
54405 73517 74300 74010 73065 71981 70571 69000 68139 68116 67985 67395 67053 67051 66530 65566 65447 66397 67050 66991 67706
54386 67706 69955 72179 72797 72276 71686 70974 69988 69589 70308 71314 71962 72986 75017 77294 78974 80393
54370 80393 81954 83156 83799 84740 86356 87627 87804 87616 87804 87822 87133 86435 86521 87146 87979 89312 90908 91590
54352 91590 90944 90039 89558 88800 87476 86758 87324 87987 87532 86341 84925 82555 78946 75713 74415 74330 73788
54335 73788 72615 71624 70739 69264 67296 65427 63652 61728 59920 58385 56647 54584 53022 52492 52387
54320 52387 52195 52384 53152 53584 53037 52157 51474 50290 48105 45890 44744 44439 44446 45080 46392 47181 46557 45463
54302 45463 45326 46081 46768 47089 47230 47016 46389 45854 45542 44865 43877 43705 44632 45203 44406 43314 43210 43476 42866
54283D2866j192o85j90l67l65K95Q73R35Q62N48m04j162m35J144J607O54j86k95
54265D4503n07r22p10k13o32j490j033O11J417Q50N17R50P34n27j153l28N21L29
54247D2917o6M7j7o04p92k67rl42k29O52J182Q70N97O87K90o35q89k43jo03q14
54226D1731p6M33q0q45j212j539j780j186p5J97l55j56J133J836J096J77P7N5
54208C9431m92q23n35m11o82m02N20P56j07p47m81l29q08p96K73J182R88M36K29
54189C7202j57r32j197p16o06j224j345m19K85r2n55j97K87K02J39N37O57J43
54171C2012j33K13K04n95j086n89o6k58l49L33R47O67J10J00L60L71K40K9m99
54152C2011r16m44N02P57N62J212K299J829l58j870j361l05j03j5O75R22k6r65
$$ plain form
54283 42866 41674 40989 40799 40432 40067 40362 41235 42170 43032 43580 43176 42014 41579 42723 44330 44984 44798 44503
54265 44503 43996 43074 42364 42151 41519 40029 38996 39607 41024 41874 42391 43341 44075 43548 42395 42067 42588 42917
54247 42917 42851 42898 42881 42277 41485 41218 41209 40867 40638 41290 42472 43342 43939 44626 44916 44281 43392 43149 43148 42545 41731
54226 41731 41655 42088 42008 41163 39951 38412 36632 35446 35371 35568 35213 35057 36190 38026 39122 39299 39376 39431
54208 39431 38939 38116 37581 37170 36488 36086 36606 37362 37255 36508 36027 35698 34890 34094 34367 35549 36537 36973 37202
54189 37202 37045 36113 34916 34200 33594 32370 31025 30606 30891 30799 30244 30047 30334 30536 30675 31212 31869 32012
54171 32012 31879 32092 32296 31701 30615 30026 29960 29702 29353 29686 30633 31300 31410 31510 31870 32241 32481 32510 32011
54152 32011 31095 30651 31153 31910 32472 33684 35983 37812 37454 35584 34223 33918 33815 33800 34475 35397 35371 34406
54134C4406p78k10k00k22K50M49j26n57j84K60K65N00J113R73k47j222j228j233
54116C2009j697j517l66K77l00p46k96k45j244j635l21J108J072N57R11J316O70
54099B9553p2K91Q95N94K63J074K094J843P70K9o12j571j743k78J326J249J43
54082C5848j80L51O64P19R89Q99m6p05L6J128Q91l40j085j131j141r15o6N68J86
54063C6670k95L29J405J560R59N46J85n59r01q7Q60P17K67R10K024K000J024N71
54045D8185P98O58J17J43P66J096R89J098J497J730J782J809J514J013J324K696
54029F7215L613K925J826K006L043L492L410L797M475M550M264M386M485L706
54015A17193K625K434K860K732J962J277O54j96n56K70J329J225L66J24M54K47
$$ plain form
54134 34406 33628 33418 33218 32996 33246 33695 33569 33012 32828 33088 33353 33853 34966 35939 35692 34470 33242 32009
54116 32009 30312 28795 28429 28706 28406 27660 27364 27119 25875 24240 23919 25027 26099 26656 27567 28883 29553
54099 29553 29481 29772 30667 31261 31524 32598 34692 36535 37305 37334 36722 35151 33408 33130 34456 35705 35848
54082 35848 35668 36019 36683 37402 38391 39290 39244 38539 38575 39703 40594 40254 39169 38038 36897 35982 35916 36484 36670
54063 36670 36375 36704 38109 39669 40628 41174 41359 40800 39899 39812 40672 41389 41656 42566 44590 46590 47614 48185
54045 48185 48983 49641 49758 49901 50667 51763 52752 53850 55347 57077 58859 60668 62182 63195 64519 67215
54029 67215 70828 73753 75579 77585 80628 84120 87530 91327 95802 100352 104616 109002 113487 117193
54015 117193 119818 122252 125112 127844 129806 131083 131737 131541 130985 131255 132584 133809 134175 134299 134753 135000
53999A35000n48r99j014j291j837k141k364k858l046k342j512j574k052j868j209
53984A08345q92p47l53m68j800l215l155k171k009k755k929j992q40j56k7p62
53968H4074k313l397k926j775j452j706j303l92q7l05j33J89k38r05m79P95J397
53951F9044J018P18P38J77j080j980j935j315l65Q37J640J525J245J755K488K272
53935G6782J436J243J736K023K174K900L771L725L007K721K766K199J303J245
53921A09031J895K008J458J232J438J343J292K376M208N053M448L712L718L983
53907A47195M156M592N180N290N073N292N802N773N348N368N600M969L543K464
53893B15645J947J210K96Q2L79mj146j840j743j821k419k705k408k331k773l057
$$ plain form
53999 135000 134452 133453 132439 131148 129311 127170 124806 121948 118902 116560 115048 113474 111422 109554 108345
53984 108345 107453 106706 106353 105885 104085 100870 97715 95544 93535 90780 87851 85859 85019 84863 84836 84074
53968 84074 81761 78364 75438 73663 72211 70505 69202 68810 68723 68418 68285 68474 68236 67331 66852 67647 69044
53951 69044 70062 70780 71518 71695 70615 68635 66700 65385 65020 65857 67497 69022 70267 72022 74510 76782
53935 76782 78218 79461 81197 83220 85394 88294 92065 95790 98797 101518 104284 106483 107786 109031
53921 109031 110926 112934 114392 115624 117062 118405 119697 122073 126281 131334 135782 139494 143212 147195
53907 147195 151351 155943 161123 166413 171486 176778 182580 188353 193701 199069 204669 209638 213181 215645
53893 215645 217592 218802 219098 219180 219559 219555 218409 216569 214826 213005 210586 207881 205473 203142 200369 197312
53877A97312l063l547m549m989m353l414k931k847l057l603l964l400k231j585
53863A49779j842k450l066l659l787l151k538k756l093k499j756k452m122m606
53849A08002l232j526o43k35r1o89j677j816j094r66j916k536j803n82j07l57
53833H8732p38j123j442j318o55J22P11J031Q10J1o31n53m47j095j696q89R68
53816H1798K329K812L225L513K820J489R34J366J565J045N48L17j68o00m1J096
53800A04048J253K42m55j30L38M62Q05J320J073J55m1R56K085K821L864N228N622
53783A29646M561L236K571K098J421J028J000N60l16n56J21O15L62J05J63k80
53767A46335j430k063j466n98n67j237j993k597k716k039j220j317k006j898r26
$$ plain form
53877 197312 194249 190702 186153 181164 176811 173397 170466 167619 164562 160959 156995 153595 151364 149779
53863 149779 147937 145487 142421 138762 134975 131824 129286 126530 123437 120938 119182 116730 112608 108002
53849 108002 104770 103244 102601 102366 102275 101586 99909 98093 96999 96033 94117 91581 89778 89196 89089 88732
53833 88732 87994 86871 85429 84111 83456 83578 84289 85320 86130 86141 85510 84957 84510 83415 81719 80830 81798
53816 81798 84127 86939 90164 93677 96497 97986 98920 100286 101851 102896 103444 103761 103593 102993 102952 104048
53800 104048 105301 105543 105088 104958 105296 105758 106563 107883 108956 109111 109070 110026 112111 114932 118796 124024 129646
53783 129646 134207 137443 140014 142112 143533 144561 145561 146121 145805 145249 145370 145985 146347 146452 146615 146335
53767 146335 144905 142842 141376 140778 140211 138974 136981 134384 131668 129629 128409 127092 125086 123188 122262
53752A22262n58j336k125k268k462k946k770j686q33p91q13o14r71j785j649l21
53736I8334M39m19j615j795j460j390r98K71J520J775J451J194O94j93n47J34
53720I7395Q84Q64P04J151J675J591J341J486J549R33l1q06j397j684j261n78
53704A03816q11j915k294j223L1L14K16N60R11P05L95L28j32j208j869j470q84
53687I5470r08r59m40L8n4l0N93R68M42j30J71P92Q84P68J043J363J304J270J515
53668A04100J400P18M49J159J955K093K228K923L397L049K689K953K910J808P41
53653A34572R83J847J957J530J596J945J584O01o3j43OL82J036J379R99N31O61
53636A51403R89R15Q16J229J700J510Q67L33j13n01k97N70J036L67n86o31J5M03
$$ plain form
53752 122262 121704 120368 118243 115975 113513 110567 107797 106111 105278 104487 103674 103060 102089 100304 98655 98334
53736 98334 98773 98354 96739 94944 93484 92094 91096 91367 92887 94662 96113 97307 98001 97808 97261 97395
53720 97395 98279 99143 99847 100998 102673 104264 105605 107091 108640 109573 109542 108736 107339 105655 104394 103816
53704 103816 103005 101090 98796 97573 97604 97918 98134 98694 99605 100310 100705 101033 100901 99693 97824 96354 95470
53687 95470 94562 93603 93163 93201 93147 93117 93710 94678 95120 94990 95161 95953 96837 97605 98648 100011 101315 102585 104100
53668 104100 105500 106218 106667 107826 109781 111874 114102 117025 120422 123471 126160 129113 132023 133831 134572
53653 134572 135555 137402 139359 140889 142485 144430 146014 146615 146552 146409 146415 146797 147833 149212 150211 150742 151403
53636 151403 152392 153307 154123 155352 157052 158562 159429 159762 159649 159148 158851 159421 160457 160824 160238 159607 159622 160025
53618A60025M15N46Q37R67R38Q32N76M02P59J304J098K13j17M47O54k20j141j124
53600A67411p21p65j021j167j617k309k247j314q88j485j617l11J046J040N59
53585A54594J019J842J767J245J435J990J846J245J063J121R55J187K271K970
53571A76550K115Q68J124K504L127K707K626L303L705L371L028L120L294L342
53557B14784L347L058K255J459J178R74L22k56q2M15N01L95M81J79j019k236k360
53540B23395j738j316r83k87J06o69j962k425j965j470j214r30p60p99m56M41
53524B06968Q73K71j66N98J493J071K4m4O74Q75N87P08Q48L5j006o83P14J385
53506B15225R55P57J316J752J790K289L420M246M391M540N037N517O051P153Q541
$$ plain form
53618 160025 160440 160986 161823 162790 163728 164560 165136 165538 166297 167601 168699 168912 168795 169242 169896 169676 168535 167411
53600 167411 166690 165925 164904 163737 162120 159811 157564 156250 155362 153877 152260 151949 152995 154035 154594
53585 154594 155613 157455 159222 160467 161902 163892 165738 166983 168046 169167 170122 171309 173580 176550
53571 176550 178665 179533 180657 183161 186288 188995 191621 194924 198629 202000 205028 208148 211442 214784
53557 214784 218131 221189 223444 224903 226081 227055 227377 227121 227039 227454 227955 228350 228831 229010 227991 225755 223395
53540 223395 221657 220341 219358 219071 219177 218508 216546 214121 212156 210686 209472 208542 207782 206983 206527 206968
53524 206968 207841 208112 207946 208544 210037 211108 211132 211088 211762 212637 213224 213932 214780 214815 213809 213126 213840 215225
53506 215225 216180 216937 218253 220005 221795 224084 227504 231750 236141 240681 245718 251235 257286 264439 272980
53491B72980R322R412R529R823R930J0132J1010J2142J2608J2691J3525J5169
53479D08273J6561J7325J8142J9307K0316K0941K1399K1462K0672J9391J8539
53468F22328J8431J8887K0148K2440K5064K7202K9226L1949L4957L7062L7988
53457I25682L8208L7571L5538L2429K9075K5580K1723J8003J5021J2417R947Q831
53445A210025J0385J3869J7414K0360K2920K4329K3524K1335J9832J9531J9220
53434A422744J8237J7024J5456J2673Q663M334L4m392q277j0696j2217j4329j7295
53421A431959k0300k3375k7155l0890l2792l2433l0954k8960k6328k4086k4139
53410A130547k6713k9920l2311l4070l5398l5600l4295l2009k9145k5799k2685
$$ plain form
53491 272980 282302 291714 301243 311066 320996 331128 342138 354280 366888 379579 393104 408273
53479 408273 424834 442159 460301 479608 499924 520865 542264 563726 584398 603789 622328
53468 622328 640759 659646 679794 702234 727298 754500 783726 815675 850632 887694 925682
53457 925682 963890 1001461 1036999 1069428 1098503 1124083 1145806 1163809 1178830 1191247 1201194 1210025
53445 1210025 1220410 1234279 1251693 1272053 1294973 1319302 1342826 1364161 1383993 1403524 1422744
53434 1422744 1440981 1458005 1473461 1486134 1494797 1499131 1499165 1494773 1486496 1475800 1463583 1449254 1431959
53421 1431959 1411659 1388284 1361129 1330239 1297447 1265014 1234060 1205100 1178772 1154686 1130547
53410 1130547 1103834 1073914 1041603 1007533 972135 936535 902240 870231 841086 815287 792602
53399G92602k0699j9401j7500j4799j2207r851p009l777r40J721N080Q604J0805
53386G12629J1896J3802J7094K0098K1580K2349K3411K4422K4864K5200K6025
53375I43370K7277K8786L0480L1845L2523L3428L5833L9401M2729M5664M9229
53364A340565N3247N6122N7251N7679N8087N8181N8300N9585O2020O4314O6002
53353A991353O7739O9056O8141O4526N9942N5901N2427M9800M9293N1097N3513
53342B632788N5187N6567N8273N9942O1458O3448O5548O5882O3092N7223M7916
53331C287324L3856J5302m687k2824l7985n0184n9102o4889o8885p2130p4505
53320B881291p6260p8738q2342q5302q5896q4634q3096q1888q1006q0939q1923
$$ plain form
53399 792602 771903 752502 735002 720203 707996 698145 691136 687359 686419 688140 693220 701824 712629
53386 712629 724525 738327 755421 775519 797099 819448 842859 867281 892145 917345 943370
53375 943370 970647 999433 1029913 1061758 1094281 1127709 1163542 1202943 1245672 1291336 1340565
53364 1340565 1393812 1449934 1507185 1564864 1622951 1681132 1739432 1799017 1861037 1925351 1991353
53353 1991353 2059092 2128148 2196289 2260815 2320757 2376658 2429085 2478885 2528178 2579275 2632788
53342 2632788 2687975 2744542 2802815 2862757 2924215 2987663 3053211 3119093 3182185 3239408 3287324
53331 3287324 3321180 3336482 3331795 3308971 3270986 3220802 3161700 3096811 3027926 2955796 2881291
53320 2881291 2805031 2726293 2643951 2558649 2472753 2388119 2305023 2223135 2142129 2061190 1979267
53309A979267q3036q3242q2534q1223p9090p6120p3054p0310o7279o3434n9134
53298A160811n4662m9630m4041l8741l4044k9143k3635j8469j4619j1937r994
53287H31896q843q213p235n732m543l952l077j462J45J279K558M244N536O158
53273H08759P167R101J0772J1049J0532J0454J1007J1890J3239J5007J6413J6958
53261I52348J7118J7396J7755J8561K0711K4148K7537L0039L2020L3413L3215
53250A224261L1494L0163L0620L2154L3762L5954L9364M3008M5277M5568M3909
53239A635534M0232L5114K9891K4929J9087J1891M683j512p668j4922k2535k9192
53227A725532l4947m0329m4754m7430m8894n0078n0749n0149m8361m5824m2498
$$ plain form
53309 1979267 1896231 1812989 1730455 1649232 1570142 1494022 1420968 1350658 1283379 1219945 1160811
53298 1160811 1106149 1056519 1012478 973737 939693 910550 886915 868446 853827 841890 831896
53287 831896 823053 814840 807605 801873 797330 793378 790301 788839 788984 790263 792821 797065 802601 808759
53273 808759 815926 825027 835799 846848 857380 867834 878841 890731 903970 918977 935390 952348
53261 952348 969466 986862 1004617 1023178 1043889 1068037 1095574 1125613 1157633 1191046 1224261
53250 1224261 1255755 1285918 1316538 1348692 1382454 1418408 1457772 1500780 1546057 1591625 1635534
53239 1635534 1675766 1710880 1740771 1765700 1784787 1796678 1801361 1799849 1792181 1777259 1754724 1725532
53227 1725532 1690585 1650256 1605502 1558072 1509178 1459100 1408351 1358202 1309841 1264017 1221519
53216A221519l8647l5413l3449l2116l1072l1430l4004l7621m0622m2933m5318
53205H18894m7625m9197m9975m9824m7742m3239l7674l2920k9464k6817k4707
53194C79710k2723j9976j6441j3558j2184j1146r149o931n978o190o438o438o545
53181B36013o525o062n660n754n731n161m858n474o073n619m731m405m179l243
53167A62538k290k452l228l274k533j955j784j699j906k498k633j884j404k162
53153A30836k954k149m30K39k97m68K89R40Q24L64j01o48j048j060j065j275r40
53136A21057L20J285P93k74m21r6p74k138k409j177J55P10R51J189J046N40J77
53119A20934j10p26j316j198o94o32r16r12q04r81p69M74J596R78p59j473p65
$$ plain form
53216 1221519 1182872 1147459 1114010 1081894 1050822 1019392 985388 947767 907145 864212 818894
53205 818894 771269 722072 672097 622273 574531 531292 493618 460698 431234 404417 379710
53194 379710 356987 337011 320570 307012 294828 283682 274533 267602 261624 255434 248996 242558 236013
53181 236013 229488 223426 217766 212012 206281 201120 196262 190788 184715 179096 174365 169960 165781 162538
53167 162538 160248 157796 154568 151294 148761 146806 145022 143323 141417 138919 136286 134402 132998 130836
53153 130836 127882 125733 125303 125542 125245 124777 125066 126006 126830 127194 127093 126445 125397 124337 123272 121997 121057
53136 121057 121377 122662 123455 123181 122760 122664 121890 119752 117343 116166 116321 117031 117982 119171 120217 120757 120934
53119 120934 120824 120098 118782 117584 116890 116258 115342 114430 113626 112645 111876 112350 113946 114924 114165 112692 111927
53102A11927l45j056j671j140q3N72Q30R46Q33O31P46J041J087J167J834K579
53086A19898K289J005k19j136k401l808m163l192k054j542j243q18p01r80r71
53071I9964m74k57p48j281j188p44m63k93J4M49Q96J196R69P3p87o72L26J139
53053I8119J084M21l01p12n52R7O23O44O22J014J304Q38J39K09Q68R95L16l18
53035A05410l79k75m74r96j766k595k925k429j689j493j676j516r10k53L21P11
53019H7066L87q03j884j963j615j870k452k359j632j097q42m02p4m88j191j182
53003F7599o12m82r34j311j606k169k421j548k73r6q46r24L4O91L90O4L33N12
52985E6401J33j52J03L10Ll50l06p7J51N40Q51M98l83r53r86j091j448j543j304
$$ plain form
53102 111927 111582 110526 108855 107715 107632 108204 109034 109980 110813 111444 112190 113231 114318 115485 117319 119898
53086 119898 122187 123192 122973 121837 119436 115628 111465 108273 106219 104677 103434 102616 101915 100935 99964
53071 99964 99490 99233 98485 97204 96016 95272 94809 94516 94530 94979 95875 97071 98040 98113 97326 96654 96980 98119
53053 98119 99203 99624 99323 98611 98059 98156 98779 99423 100045 101059 102363 103201 103340 103549 104417 105412 105728 105410
53035 105410 105031 104756 104282 103286 101520 98925 96000 93571 91882 90389 88713 87197 86287 86034 86355 87066
53019 87066 87453 86650 84766 82803 81188 79318 76866 74507 72875 71778 70936 70534 70460 69972 68781 67599
53003 67599 66987 66505 65571 64260 62654 60485 58064 56516 56243 56147 55301 54377 54411 55102 55492 55556 55889 56401
52985 56401 56534 56382 56485 56795 56798 56448 56142 56065 56216 56756 57607 58105 57722 56769 55783 54692 53244 51701 50397
52966E0397j335j717j716j001q0O85J404J793J135m29j681j737r31l8N34O26K77
52949D6186o7M0M02O35R17J468J690R62j09m60k43m10q96p07K61J021J117J014
52931E2821Q17P0r91j334n88N25J294J543J080j26j234j233l23M61P58Q63N86
52914E4989m00j414j461q95q44j246j089l67NJL62Q21M09m89m66M29O38j87o39
52895D8157j14K43j84l52L84R93N74j79l43j67k25l99n22q44j235j081m34p7q1
52876D4114L91J501K298K192J544N95p22j705j304N5O75M6n82l30K34N64Q32P84
52858E1182j81j356j106N49J725J595J432J948K002R36K9J75K09r71k331k382
52842E3455j436o39j56K56J18q29j658j547j051r99j173j112j137j504j643j216
$$ plain form
52966 50397 49062 47345 45629 44628 44548 45233 46637 48430 49565 49136 47455 45718 44787 44749 45283 45909 46186
52949 46186 46119 46159 46561 47196 48113 49581 51271 52233 52124 51664 51421 51011 50115 49408 49669 50690 51807 52821
52931 52821 53638 53708 52717 51383 50795 51320 52614 54157 55237 55111 53877 52644 52321 52782 53540 54403 54989
52914 54989 54589 53175 51714 50819 49975 48729 47640 47273 47278 47279 47641 48462 48871 48382 47916 48345 48983 48796 48157
52895 48157 48043 48286 48102 47750 48134 49127 49701 49522 49179 49012 48787 48388 47866 47022 45787 44706 44272 44195 44114
52876 44114 44505 46006 48304 50496 52040 52635 51913 50208 48904 48959 49634 49680 49098 48768 49002 49566 50398 51182
52858 51182 51001 49645 48539 49088 50813 52408 53840 55788 57790 58726 58755 58930 59139 58168 55837 53455
52842 53455 52019 51380 51224 51480 51598 50769 49111 47564 46513 45514 44341 43229 42092 40588 38945 37729
52826C7729q12p15k05R58J670J177L94M58J106J483J486J237M24p79j292o91m8
52809D3580l25j003j251j227j232q03K43J028R35O75R61J280R29K52j55l98n60
52792D2929j44Q51J408R33Q2n01j060j632j554q19m19n28n4J149J486K65q50m12
52774D1130N72N19k20n51o83j181j324l32Q55Q99K04N8N34Q77J049J369J424Q14
52756D6013J81J55K52l8j69K29L32k92n09M66J409J066L25O02J354J216M19j4
52738E2997l93j497k509k075o60J71K30L99N65J2o87k53J110K067K285K377K186
52721E6325J118j84m44K05N53M10N51R17P23J49N8K57j69r67j007l65k75r95j416
52702E5444r64k63J43L23J91l84p96l56M16M79k5k23k40q56j719j687q58n52j165
$$ plain form
52826 37729 36917 36202 35997 36955 38625 39802 40196 40654 41760 43243 44729 45966 46390 45611 44319 43628 43580
52809 43580 43255 42252 41001 39774 38542 37739 37982 39010 39945 40620 41581 42861 43790 44042 43887 43489 42929
52792 42929 42785 43636 45044 45977 46059 45558 44498 42866 41312 40493 40074 39546 39492 40641 42127 42392 41542 41130
52774 41130 41702 42221 42001 41450 40767 39586 38262 37930 38785 39684 39888 39946 40480 41357 42406 43775 45199 46013
52756 46013 46194 46349 46601 46563 46394 46623 46955 46663 46154 46620 48029 49095 49420 50022 51376 52592 53011 52997
52738 52997 52604 51107 48598 46523 45863 46034 46264 46663 47228 47240 46553 46300 47410 49477 51762 54139 56325
52721 56325 57443 57259 56815 57020 57573 57983 58534 59451 60174 60323 60381 60638 60469 59502 58495 58130 57855 56860 55444
52702 55444 54480 54217 54360 54683 54874 54490 53694 53338 53754 54233 54208 53985 53745 52889 51170 49483 48625 48073 46908
52683D6908j691j509j082p01m1Q44J321J218R21M76k49p12l04L92K96l86n16L7
52665D5222L37J46J75N39N09q8n96p86r77r04K9J323J672Q66Qk88m96p69m93M03
52645D5832R99P60K00j56l90n13k46J97J21n66j210j491j691j783j282k27O01
52628C9155P28M40J65P5K79O89Q25M25j6n3j88r80j762j451k13Q55J332J572J507
52609D3384P55k45n90k39R4K08L53L22j56m35J91R97P53j64k13Q34J565J141K16
52590D8771m60q36p96q1P59P75J49j1M64N61r4o29m81j63q7J08O24J030J074J018
52570E1695R12M65j51l54j25k5k32m04m24l75l8O97J256J216J233J935K570K113
52552F1964J069O13N25j74j102j058l24k82q46m94R58J880J402M46k04q46j410
$$ plain form
52683 46908 45217 43708 42626 41925 41884 42728 44049 45267 46188 46664 46415 45703 45399 45791 46087 45701 45185 45222
52665 45222 45559 45705 45880 46419 46928 46840 46244 45458 44481 43577 43606 44929 46601 47467 47475 47187 46691 45922 45429 45832
52645 45832 46831 47591 47791 47635 47245 46732 46486 46683 46804 46238 45028 43537 41846 40063 38781 38554 39155
52628 39155 39883 40323 40488 40563 40842 41531 42356 42781 42765 42712 42524 41544 39782 38331 38118 38973 40305 41877 43384
52609 43384 44139 43894 43304 43065 43159 43367 43720 44042 43886 43451 43642 44639 45392 45228 45015 45849 47414 48555 48771
52590 48771 48311 47475 46679 46598 47357 48132 48281 48270 48734 49295 49201 48572 48091 47928 47841 47949 48573 49603 50677 51695
52570 51695 52607 53072 52921 52567 52442 52417 52185 51781 51357 50982 50944 51641 52897 54113 55346 57281 59851 61964
52552 61964 63033 63646 64171 63997 62895 61837 61513 61231 60385 59891 60849 62729 64131 64577 64373 63527 62117
52535F2117j067R4Q28O82M83M81p2j012r95J33O72k87j407j231j29Q08J251J140
52517F2489K60p55o13O40J292N19l55j01O11P55O58Q96R06J62n35k63M98Q21Q30
52498F8715J089J320R18J15l56k98%K15jp65j406j013J26P60N61M88R59J122N08
52479G3057j06k30n07j278j702j225n95m63l52O5J13m32m89N13J310O26q25j502
52461F5978j249r60q80n90k0O01J275J809J571N01m26m83j18J04N00J355K011
52444G0979J837J212P52M42K39N35J193J275N23M1N96J422J614J430J266O57n13
52427H5500j098l29Q03J121J018J327J638J236O43N65M05n68j494j233m73o65
52411H8396j503j538p62n27j098j301p11k90n72q34n38j78k24l54j93J14M33Q87
$$ plain form
52535 62117 61050 61144 61972 62654 63137 63618 63546 62534 61539 61672 62344 62057 60650 59419 59290 60098 61349 62489
52517 62489 62749 61994 61381 62021 63313 63832 63477 63376 63987 64742 65400 66296 67202 67364 66829 66566 67064 67885 68715
52498 68715 69804 71124 72042 72157 71801 71503 71503 71718 71717 70952 69546 68533 68659 69419 69980 70468 71427 72549 73057
52479 73057 72951 72721 72214 70936 69234 68009 67414 66951 66599 66664 66777 66345 65856 66369 67679 68305 67480 65978
52461 65978 64729 63769 62889 62299 62279 62880 64155 65964 67535 68036 67610 67127 67009 67113 67613 68968 70979
52444 70979 72816 74028 74780 75222 75461 75996 77189 78464 78987 79028 79624 81046 82660 84090 85356 86013 85500
52427 85500 84402 84073 84876 85997 87015 88342 89980 91216 91859 92424 92829 92261 90767 89534 89061 88396
52411 88396 86893 85355 84593 84066 82968 81667 80956 80666 80094 79260 78722 78544 78320 77966 77773 77887 78320 79207
52393G9207J331J330Q71M68M54O90R77J157R04Q7p49q74k90L88Q10J056J078O80
52375H9575K9l38p3O99J562K058J968J618J585J924K123J907J493R43Q1o97m90
52358A05967P14J660J462P15L62M01N19R98K037K953L108K908K918K735J846Q53
52342A32156O64R86Q37J43m12p54j348j979j844r16j86l67j151j824j957j453
52326A20595n17L65Q59J089J283J367J207Q76L70l76r22n03P59J617J329O39M55
52309A30492M34j52q71p17K47R04O01k75j004j066k41J026J670J120J18k06L03
52292A32383R27J206J206J060R31J167J876K599K870K756K497K162J991K472L529
52277A61632M338M412M157L947L563K978K742K846K380J093K10O72J625J800J376
$$ plain form
52393 79207 80538 81868 82739 83207 83661 84351 85328 86485 87389 87476 86727 85853 85563 85951 86761 87817 88895 89575
52375 89575 89604 89266 89193 89892 91454 93512 95480 97098 98683 100607 102730 104637 106130 107073 107154 106457 105967
52358 105967 106681 108341 109803 110518 110880 111281 111800 112798 114835 117788 120896 123804 126722 129457 131303 132156
52342 132156 132820 133806 134643 134786 134374 133620 132272 130293 128449 127533 127347 126980 125829 124005 122048 120595
52326 120595 120078 120443 121302 122391 123674 125041 126248 127124 127494 127118 126196 125693 126452 128069 129398 130037 130492
52309 130492 130926 130774 129903 129186 129433 130337 130938 130663 129659 128593 128352 129378 131048 132168 132286 132080 132383
52292 132383 133310 134516 135722 136782 137713 138880 140756 143355 146225 148981 151478 153640 155631 158103 161632
52277 161632 165970 170382 174539 178486 182049 185027 187769 190615 192995 194088 194298 194970 196595 198395 199771
52262A99771J292J570J706J863K338K529J866J071J097J464J138M28M36J095J382
52247B21046J221J450K033J967J093M60O61J146J515K215L515M767N186M690L736
52232B56701K886K592K822K976K698K523L071L933M160L558K729K130J880K170
52218B96829K934L444L089K294J906K006K168K397K859L109K668K010J921K202
52204C31836K063J512J239J345J335J254J664K547L223L407L429L454L326L123
52190C64757L086L182L342L884M960N981O331O195N927N327M399M042M838N799
52176D32050N679M893M731N204N228M660M438M787M892M441M034L926L620K977
52162D95560K554K560K598K460K282J856Q81j77n01j58P0m1j07j77o20j118j040
$$ plain form
52262 199771 201063 202633 204339 206202 208540 211069 212935 214006 215103 216567 217705 218133 218569 219664 221046
52247 221046 222267 223717 225750 227717 228810 229270 229931 231077 232592 234807 238322 243089 248275 252965 256701
52232 256701 259587 262179 265001 267977 270675 273198 276269 280202 284362 287920 290649 292779 294659 296829
52218 296829 299763 303207 306296 308590 310496 312502 314670 317067 319926 323035 325703 327713 329634 331836
52204 331836 333899 335411 336650 337995 339330 340584 342248 344795 348018 351425 354854 358308 361634 364757
52190 364757 367843 371025 374367 378251 383211 389192 395523 401718 407645 412972 417371 421413 426251 432050
52176 432050 437729 442622 447353 452557 457785 462445 466883 471670 476562 481003 485037 488963 492583 495560
52162 495560 498114 500674 503272 505732 508014 509870 510751 510574 510073 509915 509985 509944 509837 509660 509040 507922 506882
52145E06882o98r98j907k538k682l007l663m026l841l415k713j551o10p40j353
52130D73140j062p3j71j928l638l708k597j601j081q30j014j706k343k498k564
52115D46326k961l317l070k341j631j098o17k08r1m89j455k553k852j837j74R30
$$ plain form
52145 506882 506184 505186 503279 500741 498059 495052 491389 487363 483522 480107 477394 475843 475233 474493 473140
52130 473140 472078 472005 471834 469906 466268 462560 459963 458362 457281 456451 455437 453731 451388 448890 446326
52115 446326 443365 440048 436978 434637 433006 431908 431291 431083 430992 430503 429048 426495 423643 421806 421632 422562
$$ [...]
##END NTUPLES=NMR SPECTRUM
##END=
