##TITLE=NES1011_936994_9232868_sNZciP7wDI
##JCAMPDX= 6.0         $$ Bruker NMR JCAMP-DX V2.0
##DATA TYPE= NMR SPECTRUM
##DATA CLASS= NTUPLES
##ORIGIN= BRUKER
##OWNER= Administrator
$$ 1.72 TOPSPIN		Version 2.1
$$ 2015-06-17 23:27:28.925 -0700  Administrator@X
$$ Compression mode = diff/dup
##.OBSERVE FREQUENCY= 400.02188249412
##.OBSERVE NUCLEUS= ^1H
##.ACQUISITION MODE= SIMULTANEOUS (DQD)
##.ACQUISITION SCHEME= undefined
##.AVERAGES= 8
##.DIGITISER RES= 22
##SPECTROMETER/DATA SYSTEM= spect
##.PULSE SEQUENCE= zg30
##.SOLVENT NAME= COFFEE_meoh
##.SHIFT REFERENCE= INTERNAL, COFFEE_meoh, 1, 14.98509
##AUDIT TRAIL= $$ (NUMBER, WHEN, WHO, WHERE, PROCESS, VERSION, WHAT)
$$ ##TITLE= Audit trail, TOPSPIN		Version 2.1
$$ ##JCAMPDX= 5.01
$$ ##ORIGIN= Bruker BioSpin GmbH
$$ ##OWNER= Administrator
$$ $$ E:\/data/COFFEE/nmr/NES1011_936994_9232868_sNZciP7wDI/10/pdata/1/auditp.txt
$$ ##AUDIT TRAIL=  $$ (NUMBER, WHEN, WHO, WHERE, PROCESS, VERSION, WHAT)
(   1,<2015-06-17 23:27:21.550 -0700>,<Administrator>,<X>,<go>,<TOPSPIN 2.1>,
      <created by zg
	started at 2015-06-17 23:26:15.847 -0700,
	POWCHK enabled, PULCHK disabled,
       configuration hash MD5:
       21 0F 79 D6 B3 7B B4 F6 88 20 88 DB 03 48 BD 9F
       data hash MD5: 64K
       D7 13 3F 25 2F C8 2B FA 6A 81 EF 46 81 79 B9 A7>)
(   2,<2015-06-17 23:27:24.878 -0700>,<Administrator>,<X>,<proc1d>,<TOPSPIN 2.1>,
      <Start of raw data processing
       efp LB = 0 FT_mod = 6 PKNL = 1 PHC0 = 0 PHC1 = 0 SI = 32K 
       data hash MD5: 32K
       36 31 73 9F 86 AA FE 37 A4 3A 62 9F 51 E1 BE EC>)
(   3,<2015-06-17 23:27:25.159 -0700>,<Administrator>,<X>,<proc1d>,<TOPSPIN 2.1>,
      <pk PHC0 = 93.86719 PHC1 = 0 
       data hash MD5: 32K
       F8 9D 48 84 0D 54 00 CE 3F 59 68 4F 82 4A 48 FC>)
(   4,<2015-06-17 23:27:25.269 -0700>,<Administrator>,<X>,<proc1d>,<TOPSPIN 2.1>,
      <abs ABSG = 1 
       data hash MD5: 32K
       77 08 47 6A 01 FF AC CC 8E 50 59 08 BB C7 18 D9>)
(   5,<2015-06-17 23:27:25.331 -0700>,<Administrator>,<X>,<proc1d>,<TOPSPIN 2.1>,
      <abs ABSG = 2 
       data hash MD5: 32K
       A6 41 A1 51 42 76 7A 42 0C 7C ED 3B 44 E1 30 AE>)
(   6,<2015-06-17 23:27:25.394 -0700>,<Administrator>,<X>,<proc1d>,<TOPSPIN 2.1>,
      <abs ABSG = 3 
       data hash MD5: 32K
       9A 1C D5 B6 94 D9 D0 E2 EE 25 00 BA BA 48 6E F3>)
(   7,<2015-06-17 23:27:25.456 -0700>,<Administrator>,<X>,<proc1d>,<TOPSPIN 2.1>,
      <abs ABSG = 4 
       data hash MD5: 32K
       A1 5E D1 17 54 2F 4F D9 AF 20 92 54 D3 E4 C4 50>)
(   8,<2015-06-17 23:27:25.519 -0700>,<Administrator>,<X>,<proc1d>,<TOPSPIN 2.1>,
      <abs ABSG = 5 
       data hash MD5: 32K
       5E FF 46 CD 08 E4 95 6C 49 C6 65 88 D2 E8 AD CD>)
$$ ##END=
$$ 
$$ $$ hash MD5
$$ $$ 48 8E 10 BD 66 19 76 BF C3 6F 4D 49 6F 8C 68 32
##$RELAX= 
##$RELAX= 
##$RELAX= 
##$RELAX= 
##$RELAX= 
##$RELAX= 
##$RELAX= 
$$ Bruker specific parameters
$$ --------------------------
##$DU= <E:\>
##$EXPNO= 10
##$NAME= <NES1011_936994_9232868_sNZciP7wDI>
##$PROCNO= 1
$$ [...]
150 150 150 150 150 150 150 150
##$TP07= 0
##$TPNAME0= <>
##$TPNAME1= <>
##$TPNAME2= <>
##$TPNAME3= <>
##$TPNAME4= <>
##$TPNAME5= <>
##$TPNAME6= <>
##$TPNAME7= <>
##$TPOAL= (0..7)
0.5 0.5 0.5 0.5 0.5 0.5 0.5 0.5
##$TPOFFS= (0..7)
0 0 0 0 0 0 0 0
##$TUNHIN= 0
##$TUNHOUT= 0
##$TUNXOUT= 0
##$USERA1= <user>
##$USERA2= <user>
##$USERA3= <user>
##$USERA4= <user>
##$USERA5= <user>
##$V9= 5
##$VALIST= <valist>
##$VCLIST= <CCCCCCCCCCCCCCC>
##$VD= 0
##$VDLIST= <DDDDDDDDDDDDDDD>
##$VPLIST= <PPPPPPPPPPPPPPP>
##$VTLIST= <TTTTTTTTTTTTTTT>
##$WBST= 2048
##$WBSW= 25
##$XGAIN= (0..3)
0 0 0 0
##$XL= 0
##$YL= 0
##$YMAX_a= 620450
##$YMIN_a= -521025
##$ZGOPTNS= <>
##$ZL1= 120
##$ZL2= 120
##$ZL3= 120
##$ZL4= 120
##$ABSF1= 14.98509
##$ABSF2= -5.573092
##$ABSG= 5
##$ABSL= 3
##$ALPHA= 0
##$AQORDER= 0
##$ASSFAC= 0
##$ASSFACI= 0
##$ASSFACX= 0
##$ASSWID= 0
##$AUNMP= <proc_prof1d_extract_pilot.lims>
##$AXLEFT= 0
##$AXNAME= <>
##$AXNUC= <1H>
##$AXRIGHT= 0
##$AXTYPE= 0
##$AXUNIT= <>
##$AZFE= 0.1
##$AZFW= 0.1
##$BCFW= 0
##$BC_mod= 0
##$BYTORDP= 0
##$COROFFS= 0
##$CY= 15
##$DATMOD= 1
##$DC= 0
##$DFILT= <>
##$DTYPP= 0
##$F1P= 0
##$F2P= 0
##$FCOR= 0.5
##$FTSIZE= 32768
##$FT_mod= 6
##$GAMMA= 0
##$GB= 0
##$INTBC= 1
##$INTSCL= 1
##$ISEN= 128
##$LB= 0
##$LEV0= 0
##$LPBIN= 0
##$MAXI= 10000
##$MC2= 0
##$MEAN= 0
##$ME_mod= 0
##$MI= 0
##$NCOEF= 0
##$NC_proc= -8
##$NLEV= 6
##$NOISF1= 0
##$NOISF2= 0
##$NSP= 0
##$NTH_PI= 0
##$NZP= 0
##$OFFSET= 14.98509
##$PC= 1
##$PHC0= 93.86719
##$PHC1= 0
##$PH_mod= 1
##$PKNL= yes
##$PPARMOD= 0
##$PPDIAG= 0
##$PPIPTYP= 0
##$PPMPNUM= 2147483647
##$PPRESOL= 1
##$PSCAL= 4
##$PSIGN= 0
##$PYNMP= <proc.py>
##$REVERSE= no
##$SF= 400.02
##$SI= 32768
##$SIGF1= 0
##$SIGF2= 0
##$SINO= 400
##$SIOLD= 32768
##$SPECTYP= <>
##$SREGLST= <1H.CDCl3>
##$SSB= 0
##$STSI= 32768
##$STSR= 0
##$SW_p= 8223.68421052631
##$SYMM= 0
##$S_DEV= 0
##$TDeff= 65536
##$TDoff= 0
##$TI= <>
##$TILT= no
##$TM1= 0
##$TM2= 0
##$TOPLEV= 0
##$USERP1= <user>
##$USERP2= <user>
##$USERP3= <user>
##$USERP4= <user>
##$USERP5= <user>
##$WDW= 1
##$XDIM= 32768
##$YMAX_p= 439147801
##$YMIN_p= -709157
##$CURPLOT= <Network HP LaserJet P1505>
##$CURPRIN= <$Network HP LaserJet P1505>
##$DFORMAT= <normdp>
##$LAYOUT= <+/1D_H.xwp>
##$LFORMAT= <normlp>
##$PFORMAT= <normpl>
##$SURQMSG= 1
$$ End of Bruker specific parameters
$$ ---------------------------------
##NTUPLES= NMR SPECTRUM
##VAR_NAME=  FREQUENCY,     SPECTRUM/REAL,   SPECTRUM/IMAG
##SYMBOL=    X,             R,               I
##VAR_TYPE=  INDEPENDENT,   DEPENDENT,       DEPENDENT
##VAR_FORM=  AFFN,          ASDF,            ASDF
##VAR_DIM=   32768,         32768,           32768
##UNITS=     HZ,            ARBITRARY UNITS, ARBITRARY UNITS
##FACTOR=    0.250966925370066, 1,           1
##FIRST=     8223.43324360094, 15226,        -236004
##LAST=      0,             -32533,          -90635
##MIN=       0,             -709157,         0
##MAX=       8223.43324360094, 439147801,    0
$$ Real data points
##PAGE= N=1
##DATA TABLE= (X++(R..R)), XYDATA
$$ [...]
19502i2650M10A88052g3228a8960j97108J02261m16780a49065H2630a40126c556
19490e5820k2670A72946i9553l40357a65378k67300A51455b23697C86848c2292
19479a42904l5037j01861a37148A54264a96223A6324q110J92680C2018g2331A28990
19467a39424o7774O9293A77897a3081k58837Q7849g6525K6186l3017L395m1389
19456a21350j87229K1721Q1201B27648c32688a294j23789j67192D4129I133e55588
19444B2587L348a28391j03196K2500A41087c95414K7133A74183d43335A28645
19433a03064D9499A7329a41436j09928P5345F6658d280j14992j54560M6369A60081
19421A64369b9356j04107l0887K1364A01051K8375b84984d36k11303G8240c05771
$$ plain form
19502 -92650 -92240 188052 -73228 -18960 -216068 -113807 -530587 -149065 82630 -140126 -3556
19490 -55820 -78490 172946 -99553 -439910 -165378 -432678 151455 -223697 386848 -32292
19479 -142904 -177941 -279802 -137148 154264 -196223 16324 8214 200894 32018 -72331 128990
19467 -139424 -207198 -137905 177897 -13081 -271918 -184069 -76525 -50339 -83356 -79961 -121350
19456 -121350 -308579 -286858 -205657 227648 -332688 -1294 -125083 -292275 44129 9133 -555588
19444 22587 25935 -128391 -231587 -209087 141087 -395414 -368281 174183 -443335 128645
19433 -103064 49499 17329 -141436 -251364 -176019 66658 -4280 -119272 -273832 -227463 160081
19421 164369 -29356 -133463 -164350 -142986 101051 129426 -284984 -436 -211739 78240 -305771
19409A3045M16191A57408C007b2143B17875R9833c5075C8596I884a0733k47004
19398b57737k56320F6543i5428b1956F7511b34297r4712J18345g1652j14811a8139
19386I5260Q3622a39384j26766J08471e4827k29470i3062A05248L79269g4913
19375B80802b13467o1562C09835h2392L9530C377a11519M8673l37646I1256c13616
19363a89479b7568n0768I749Q3305b2509C7786Q5357n5939a62165h0246B06733
19351b81148N5689c2629a1534m6620n8600B73811a49700K9123k9057m6237A9194
19339c17790j54639a63400k8411C20938e3303K5356j04700A03037A6411b0648
19328b70411l3040n8777R8645I4802a94761G7097h0328m9602b9855l42085a69164
$$ plain form
19409 13045 429236 157408 3007 -22143 217875 317708 -35075 38596 9884 -10733 -257737
19398 -257737 -514057 66543 -95428 -21956 67511 -234297 -329009 -210664 -71652 -186463 -18139
19386 95260 178882 -139384 -266150 -157679 -54827 -284297 -93062 105248 484517 -74913
19375 280802 -213467 -275029 309835 -82392 -42862 3377 -111519 -62846 -400492 91256 -313616
19363 -189479 -27568 -78336 9749 93054 -22509 37786 123143 67204 -162165 -80246 206733
19351 -281148 -225459 -32629 -11534 -58154 -116754 273811 -149700 -120577 -149634 -195871 19194
19339 -317790 -472429 -163400 -191811 320938 -53303 -27947 -132647 103037 16411 -20648
19328 -270411 -303451 -362228 -263583 94802 -194761 77097 -80328 -129930 -29855 -371940 -169164
19316C3144a77882c2400D1636h3074B168a66915D04c57031H8651b10100e4070
19304A11133j5710c22718d2802k40863A04443e9063J5581J0881j33039a7121A79204
19292a97476d5451Q070n717j85331k12977H605J10417f2219b4991K20j8920j92143
19280b35834a13676H9372k6034J64285a4582F1700a56196A41637g3421A97335
19269a27516H3834m0694d40105K17085e0865a7655n44414b24659b4436A34530
19258d0001B2097b92233A9744a12397e5227A2971J31619F5381c788j18393M3024
19247g9157A4462a72330D51859a89819j0928J6937C27552a4265j72040P9813j38931
19236b45423j57921J99562a01554G1096f5505m9520J5323k00816A13217b87201
$$ plain form
19316 33144 -177882 -32400 41636 -83074 2168 -166915 404 -357031 88651 -210100 -54070
19304 111133 95423 -322718 -42802 -283665 104443 -59063 -43482 -32601 -165640 -17121 179204
19292 -197476 -45451 -37381 -43098 -228429 -441406 8605 119022 -62219 -24991 -24771 -43691 -235834
19280 -235834 -113676 89372 63338 227623 -14582 61700 -156196 141637 -73421 197335
19269 -127516 83834 43140 -440105 -223020 -50865 -17655 -562069 -224659 -24436 134530
19258 -40001 22097 -292233 19744 -112397 -55227 12971 144590 65381 -3788 -122181 -79157
19247 -79157 14462 -172330 451859 -189819 -200747 -183810 327552 -14265 -186305 -106492 -245423
19236 -245423 -403344 -203782 -101554 71096 -65505 -115025 -99702 -300518 113217 -287201
19225a28969B1262g9925A94680p5944N1221c24580i5336b4764r3086N6958k85292
19214c46184A4618a29161L8346A63814F3594a49971O1686k14771Q9703d8107n8760
19203a06867F957b40156e122k19406g4258j18071f8221A557J60914B0705a90867
19191a12805K2405F0711b906j86458j0403c1127k91042b2957A29817i8434A99004
19179C6902m000b48258a6920l1459o861F7071J9575K40811j37404J09305j40883
19168A58475p2298e0991a7793j07887j62388a43203f5619A07299g8157j67908
19158b46065A64834a48072A09763a00139k9086B61052b37728E7472d7231A3310
19147A41562g3707B67211b73140F2152b58264a22845F7864a79084r0370B76916
$$ plain form
19225 -128969 21262 -79925 194680 118736 169957 -324580 -95336 -24764 -117850 -60892 -346184
19214 -346184 14618 -129161 -90815 163814 63594 -149971 -88285 -303056 -213353 -48107 -106867
19203 -106867 6957 -240156 -5122 -224528 -74258 -192329 -68221 1557 162471 20705 -190867
19191 -112805 -90400 60711 -2906 -189364 -199767 -31127 -322169 -22957 129817 -98434 199004
19179 36902 32902 -248258 -16920 -48379 -55240 67071 86646 327457 190053 299358 158475
19168 158475 86177 -50991 -17793 -125680 -288068 -143203 -65619 107299 -78157 -246065
19158 -246065 164834 -148072 109763 -100139 -129225 261052 -237728 57472 -47231 13310
19147 141562 -73707 267211 -273140 62152 -258264 -122845 67864 -179084 -269454 276916
19136c1844j10625A79019g3810J8414o3091c6667E7792c08991B71735b27925c8153
19124e9017E1202a46569g1245B23276A1797f5464L1844j91802A00038j3357a25760
19112E7131b60495D1419b7568A03982j0173d4740I1722a52739B5906b76929B8037
19100a70218m96k00259H209L9174e0513D3503K33519a28867b0391B28588c93753
19088a49227L967m8637f9915k00490M511d4422m4216A7585J03116J04367b90086
19076a53327f8049j86329B9732Q2024L7583A7577J64498c78295D5065d8261B9010
19064A56299J48763a64969N6129M1456o9862A03782b08622a7307G5259J34893
19054B10152p4943a90888A16915l2897b66450A53103a81999a6746r4348d2419
$$ plain form
19136 -31844 -142469 179019 -73810 -55396 -118487 -36667 57792 -308991 271735 -227925 -38153
19124 -59017 51202 -146569 -71245 223276 11797 -65464 -33620 -225422 100038 86681 -125760
19112 57131 -260495 41419 -27568 103982 93809 -44740 91722 -152739 25906 -276929 28037
19100 -170218 -170714 -370973 8209 47383 -50513 43503 277022 -128867 -20391 228588 -393753
19088 -149227 -145260 -193897 -69915 -270405 -265894 -44422 -88638 17585 120701 225068 -290086
19076 -153327 -68049 -254378 29732 111756 149339 17577 182075 -378295 45065 -48261 29010
19064 156299 305062 -164969 -108840 -67384 -137246 103782 -208622 -17307 75259 210152
19054 210152 135209 -190888 116915 84018 -266450 153103 -181999 -16746 -111094 -42419
19043A03589b10828J8550F341L12319f217j96602J6087f9029k50905a11081d6347
19031A10179a28184m9998P2460L1074C21377E134c34665M9862b2109o4849C02583
19019a72097A85555a09773E6104L1599O631M5379M1291a46990D3091K2401a27860
19007b96230P6051G9244M6844i6478a614A72308a30821F4930e8664A98181c83901
18995A54807G2720b11184l8802b9412H6250c1297E0300e6428o1482l2302B52914
18983a76573A370a69344j02292a04594M6887q5806q2319K5819H3568b3032A51732
18971D26759j19431O661K18575G0829P3216M0361q3633a75955A58414O0252r7262
18960A21404d0217m440j35506l0543a8217I5800b09373J638A32792h5155M67n02152
$$ plain form
19043 103589 -210828 -192278 6341 318660 -6217 -202819 -186732 -69029 -319934 -111081 -46347
19031 110179 -128184 -178182 -105722 -74648 321377 5134 -334665 -284803 -22109 -86958 302583
19019 -172097 185555 -109773 56104 87703 94334 139713 181004 -146990 43091 65492 -127860
19007 -296230 -220179 79244 126088 -96478 -1614 172308 -130821 64930 -58664 198181 -383901
18995 154807 72720 -211184 -249986 -29412 86250 -31297 50300 -56428 -117910 -150212 252914
18983 -176573 1370 -169344 -271636 -104594 -57707 -143513 -225832 -200013 83568 -23032 151732
18971 426759 307328 313989 532564 70829 144045 184406 100773 -175955 158414 218666 121404
18960 121404 -40217 -44657 -180163 -210706 -18217 95800 -209373 -207735 132792 -85155 -84688 -586840
18948e86840K58406a18658b0009j19697j96643a4661A73687a92081j23705B15985
18937A39132k1736g4029j6313m47511G0961g8985J3722B2374c6410m1526b5404
18925A69470a95097f7088A51459F8137Q1755j3082a087l01111D3639a58750H0141
18913c90153a23806l7527C33933a60553C10463J19915A16256b29137A99313C8298
18902G5533J92251L3288D5436b51914B6798c09497d5834D8169a80288A21132a26266
18890a75521a4402p656A82436a32809I3047J87673A02701i8925K2762O856E6049
18878D5894J73236d14209a55377h170m44261A73965h6165j57380K177Q0327A64410
18866f1065j14019B2141a95435A49736n0743b65862J10423F0900d7348K2826n0240
$$ plain form
18948 -586840 -328434 -118658 -20009 -139706 -336349 -14661 173687 -192081 -315786 215985
18937 139132 117396 -74029 -90342 -537853 70961 -78985 -65263 22374 -36410 -77936 -25404
18925 169470 -195097 -67088 151459 68137 149892 136810 -1087 -302198 43639 -158750 80141
18913 -390153 -123806 -161333 333933 -160553 310463 430378 116256 -229137 199313 38298
18902 75533 267784 301072 45436 -251914 26798 -309497 -45834 48169 -180288 121132 -126266
18890 -175521 -14402 -22058 182436 -132809 93047 280720 102701 -98925 -76163 -69307 56049
18878 45894 219130 -414209 -155377 -8170 -452431 173965 -86165 -243545 -241368 -161041 164410
18866 -61065 -175084 22141 -195435 149736 98993 -265862 -155439 60900 -47348 -24522 -74762
18855g4762g751A4238a1936A7795g3561j02641l5913A00582P6493P2116A5604
18843H9346c06311I5816k2407f5037G7721j7406A4942J02983J21398F8077c67346
18831a714l83545a78525H559a16052M5177k34443q7534a66792p6860g0219j12718
18820a82937J0437c6743j20893A245Q3207d4198p7827B01022a8140B72344B1541
18808A50292N0577D2633a54403A24527b7900B19052b0056D3612c1619k196m8241
18797h2056j628D8330a55721M3051A69551B2175a72309d4142A96784a04741M2075
18786f2666H1808i5261l49346A54226K2758C0186c48494h9288d4349k9251b0971
18774b49627H0832a0852k78009J42740M6872L3496A33487a32033A51619a28425
$$ plain form
18855 -74762 -7751 14238 -11936 17795 -73561 -176202 -212115 100582 177075 249191 15604
18843 89346 -306311 95816 73409 -65037 77721 60315 14942 117925 239323 68077 -367346
18831 -1714 -385259 -178525 8559 -116052 -70875 -305318 -392852 -166792 -243652 -70219 -182937
18820 -182937 -172500 -36743 -157636 1245 84452 -44198 -122025 201022 -18140 272344 21541
18808 150292 200869 42633 -154403 124527 -27900 219052 -20056 43612 -31619 -33815 -82056
18797 -82056 -83684 48330 -155721 -112670 169551 22175 -172309 -44142 196784 -104741 -62666
18786 -62666 81808 -95261 -444607 154226 176984 30186 -348494 -89288 -44349 -73600 -20971
18774 -249627 80832 -10852 -288861 -146121 -99249 -65753 133487 -132033 151619 -128425
18763a37135F5209a9943l2125F055a39243A81045c5783j55218f5723G7346c7430
18751a26894m7569j64798e5089j13751j21577a35334f2710B50731h8876b4906
18740A94693h9450A09659i2084j48369C1953Q8688b14754D8816e4136k7633J3021
18729f8748J5881k1427j78893i4554n8639g2311n5712j75077B49193c26361F2249
18717b88740C7291R6365f3643l3903F2003a60391q7284h1144F0426a92513c1078
18705A0741a38992A00118g8147k39728J00343D3514a60217j70658B30300O8043
18695B98343C4482b01560j57972A91511g4653b1250j31016b7278F842g6063A46993
18683a75021A38009a35266l1244B45640b01223D8315b9827G7760i9040A08017
$$ plain form
18763 -137135 65209 -19943 -52068 6055 -139243 181045 -35783 -191001 -65723 77346 -37430
18751 -126894 -174463 -339261 -55089 -168840 -290417 -135334 -62710 250731 -88876 -24906
18740 194693 -89450 109659 -92084 -240453 31953 120641 -214754 48816 -54136 -81769 -68748
18729 -68748 -52867 -74294 -253187 -94554 -153193 -72311 -128023 -303100 249193 -326361 62249
18717 -288740 37291 133656 -63643 -97546 62003 -160391 -247675 -81144 60426 -192513 -31078
18705 10741 -138992 100118 -78147 -317875 -217532 43514 -160217 -330875 230300 298343
18695 298343 34482 -201560 -359532 191511 -74653 -21250 -152266 -27278 6842 -76063 146993
18683 -175021 138009 -135266 -166510 245640 -201223 48315 -29827 77760 -99040 108017
18672H430b89711B6227a47116A21232N4836q7303a40946j76765a41626A861b81395
18660f0106k6962r5521C0536M3418c67595D5332a72034o3674k02821C81550a38509
18648b60029g8210j55181h4716l5451J6001j11312B18641b76832J13696p0660
18638b33796c8515j99707A9964a31034A0666h7303D0649b69107G0920b9139k98671
18627c27810A41005a38119n9062H1308e888A09247f5160o6573c0122k10059C9567
18615C55394B148c44357b7330C44250f225H5388J38670i3985l1007A74229h3468
18603a9694E5326b7240c337B35734k9393D7516c02080A24446a74134b9239A21599
18591i3428F9420b36334a07504A411b14508c7686j87995c3158q8272J0225l1417
$$ plain form
18672 8430 -289711 26227 -147116 121232 176068 88765 -140946 -317711 -141626 1861 -281395
18660 -60106 -87068 -182589 30536 73954 -367595 45332 -172034 -235708 -438529 381550 -138509
18648 -260029 -78210 -233391 -84716 -120167 -104166 -215478 218641 -276832 -163136 -233796
18638 -233796 -38515 -238222 19964 -131034 10666 -87303 40649 -269107 70920 -29139 -327810
18627 -327810 141005 -138119 -197181 81308 -5888 109247 -65160 -131733 -30122 -240181 39567
18615 355394 2148 -344357 -27330 344250 -6225 85388 224058 -93985 -124992 174229 -83468
18603 -19694 55326 -27240 -3337 235734 206341 47516 -302080 124446 -174134 -29239 121599
18591 -93428 69420 -236334 -107504 1411 -214508 -37686 -225681 -33158 -121430 -111205 -142622
18580a42622I9897L15461d73935e9695k25313a10919E530a19988K4715A26526
18569a85100j0565D6657J5737a7226j959D4668b04223h2499H8831b04463I0769
18557A49836j266b14877A50220b11361H3294i9614l7976j69936A1514M9J27767
18546A39330e9628b6631A63557g09157D7285h5297K6064k22508i8575A37476a67352
18534b8147k44976a23895H4747D1328a62712c7036n3988j76845D08517A14964
18523B4982a96889P8482C5349h5809o702r1864N3608c1165o1571J6457A57087
18511a71664A7893a21243B58003a2782A06902a69211b2378A20030b3920E8406
18500h8962J0906m301A11241H03a96248C86706a65127O5025j04452j05012B5298
$$ plain form
18580 -142622 99897 415358 -473935 -59695 -285008 -110919 5530 -119988 -95273 126526
18569 -185100 -195665 46657 62394 -17226 -19185 44668 -204223 -82499 88831 -204463 90769
18557 149836 148570 -214877 150220 -211361 83294 -99614 -137590 -307526 11514 11563 139330
18546 139330 -59628 -26631 163557 -709157 47285 -85297 -59233 -281741 -98575 137476 -167352
18534 -28147 -273123 -123895 84747 41328 -162712 -37036 -91024 -267869 408517 114964
18523 24982 -196889 -118407 35349 -85809 -92511 -184375 -130767 -31165 -92736 -76279 157087
18511 -171664 17893 -121243 258003 -12782 106902 -169211 -22378 120030 -23920 58406
18500 -88962 -78056 -82357 111241 803 -196248 386706 -165127 -100102 -204554 -309566 25298
18488B2819i9906M8307D3424Q0887D2306j3920b40006R4394E5534a61225p2809
18477b34034E7264L5166a09452j10684B5996a15239C01844r4980B1848a15090
18466d16741A0112c701G747b34465j40g4654r3840d0233q1178j01942C70376a51848
18453i4353B09398d6229D47315j35360A35074a40462A82947L2194f0001A39769
18442A62086A3673b29285N1533N7140A26706b4618j14865A52165E7649g8299K0589
18431e7710A00347a91277g0463q1213l33097A7835a05041D945a85573e9600a5438
18419A36066m4344J96847G4101Q9666i4995C81887a01871j6884A36788m3555b64099
18407B5470Q0418F53J93223c30777A18186L5152j4603a32862I7936L9112F0595
$$ plain form
18488 22819 -99906 -51599 43424 124311 42306 28386 -240006 -145612 55534 -161225 -234034
18477 -234034 57264 92430 -109452 -220136 25996 -115239 301844 206864 21848 -115090
18466 -416741 10112 -3701 7747 -234465 -234605 -74654 -168494 -40233 -121411 -223353 370376 -151848
18453 -94353 209398 -46229 447315 311955 135074 -140462 182947 215141 -60001 139769
18442 162086 13673 -229285 -177752 -120612 126706 -24618 -139483 152165 57649 -78299 -57710
18431 -57710 100347 -191277 -70463 -151676 -484773 17835 -105041 4945 -185573 -59600 -15438
18419 136066 91722 288569 74101 163767 -94995 381887 -101871 -118755 136788 93233 -264099
18407 25470 105888 653 193876 -330777 118186 153338 138735 -132862 97936 137048 60595
18395c3106M640l10264E6429B837c13053J3572g8070k45181h3023B1692d21952
18383c52331e8595j50385a02019m8192I8027b63372G6810A6060b37440M9208a4880
18371A65724i4971a8798A2847a32247C3704K32577A02677j8181f448D3963A6191
18359A14845E915c29484h4188I839J30638J1218F5492K04488D3517L3963b40657
18347I0065a3052k0671A2179f1396c308l8285k7312n1221q6501K1096H3527e0069
18334A64001d15630E0665K1019l648q798b24024A56844F860c23408q4879B02310
18322c9198m0486j67466R3656A34566b31914j6802l8630R1976B4077d1374j1879
18311e3253j14259r3290H6069J95420l4610n4103a15005A497J3167L0107b21945
$$ plain form
18395 -33106 -28466 -338730 56429 2837 -313053 -299481 -78070 -323251 -83023 21692 -421952
18383 -352331 -58595 -208980 -102019 -150211 98027 -263372 76810 16060 -237440 -188232 -14880
18371 165724 -94971 -18798 12847 -132247 33704 266281 102677 84496 -6448 43963 16191
18359 114845 5915 -329484 -84188 9839 140477 151695 65492 269980 43517 77480 -240657
18347 90065 -13052 -33723 12179 -61396 -3308 -41593 -68905 -120126 -206627 -185531 83527 -50069
18334 164001 -415630 50665 71684 68036 59238 -224024 156844 6860 -323408 -408287 202310
18322 -39198 -79684 -247150 -153494 134566 -231914 -248716 -287346 -195370 24077 -41374 -53253
18311 -53253 -167512 -260802 86069 281489 246879 192776 -115005 1497 14664 44771 -221945
18299B2249c48798a08703D5869c1567C96733d2876l832d818k26774N7866A29448
18287C868b10131m1624J21409m8086h4806m78025B31113R530a77017e0719k6936
18276g7655q4502N0606M0440k1054j67652A42977L72M7459b09980m256A78183
18264b06446B37381A03149a57786B36345a77436m9311J12944i301D7230O9317
18254A16547a08392G0329g3878b911E741f086o7160n3042b9014m9891F655i0989
18241C14400i0107r5800F7937g3461j3165A61388J34971f2369b7414j12970B06934
18229B21902a82780O9540B2810K25930c2765H9557P0259G8171e3186j27293q8180
18218b68659a02615j8208j61869a22205B01119D3048a27430j64951F7224J98182
$$ plain form
18299 22249 -348798 -108703 45869 -31567 396733 -42876 -46708 -4818 -231592 -173726 129448
18287 3868 -210131 -251755 -130346 -178432 -84806 -562831 231113 240643 -177017 -50719 -77655
18276 -77655 -162157 -111551 -71111 -92165 -259817 142977 143349 190808 -209980 -214236 178183
18264 -206446 237381 103149 -157786 236345 -177436 -226747 -113803 -9301 47230 116547
18254 116547 -108392 70329 -73878 -2911 5741 -6086 -73246 -126288 -29014 -78905 6655 -90989
18241 314400 -90107 -185907 67937 -73461 -86626 161388 296359 -62369 -27414 -140384 206934
18229 221902 -182780 -113240 22810 248740 -32765 89557 159816 78171 -53186 -180479 -268659
18218 -268659 -102615 -120823 -282692 -122205 201119 43048 -127430 -292381 67224 265406
18208B65406a44293K5408B5131b11018F7362b61618J00250m2071F3821J06430
18198A70251l4874Q8478a66024b8383o647j41598B983N8865k0863i067B28855
18186H7906i5469F862J00406a96432f60m6344j64244P6880H0118G926b30393b2589
18173b25572J06978m6759d2583H9945b42153E9088f6180p078K6098B42509F1996
18161C4797a5186j79176c4718I4536J63303E6752a86780J1312K6309I6520A0590
18149c24345c1039q6438B3706e8502F3807a65084A19567C3671a55767E93b28251
18137i6872q146c0324a3666l78597c8691k10824c5938j02340e4754k04579n581
18126b64914R8037A16714d8621H4459g1672k8779B83745b7636A91823a53276A03236
$$ plain form
18208 265406 -144293 -118885 25131 -211018 67362 -261618 -161368 -203439 63821 170251
18198 170251 135377 223855 -166024 -28383 -35030 -176628 2983 61848 40985 -9067 228855
18186 87906 -95469 6862 107268 -196432 -660 -47004 -211248 -134368 80118 7926 -230393 -22589
18173 -225572 -118594 -165353 -42583 89945 -242153 59088 -66180 -73258 -47160 242509 61996
18161 34797 -15186 -194362 -34718 94536 257839 56752 -186780 -175468 -149159 96520 10590
18149 -324345 -31039 -117477 23706 -58502 63807 -165084 119567 33671 -155767 593 -228251
18137 -96872 -105018 -30324 -13666 -392263 -38691 -249515 -35938 -138278 -54754 -259333 -264914
18126 -264914 -166877 116714 -48621 84459 -71672 -100451 283745 -27636 191823 -153276 103236
18114a14275a2946l68461B0972c21460a12659I8359b0194k07259o9856G7238J02582
18103A79820c5331A59394p4842l7286b10171q1882B84241a38195c3632G4327K5715
18092A00042a14655k20657K5849F7408a32503f1458E0029A2006J7967c8285j69764
18081b08049l0038h9650M4411A8015J35264M315G1897J04091a08108e1450a3226
18069a46525A80660n1584K5357i9501J6165A20555n5686a41694A52634k7052d750
18057C5635e5954B67175a45323k23453D5501a15668B93642L5034f7020k48360
18047c15380J42659D6709b07439A2217g3300B41516j8760F0575c47059A48946
18036D5893J35284F3518c20313C2420a74445O4510A87286a16609K7844k67639
$$ plain form
18114 -114275 -12946 -381407 20972 -321460 -112659 98359 -20194 -227453 -297309 77238 179820
18103 179820 -35331 159394 84552 47266 -210171 -292053 284241 -138195 -33632 74327 100042
18092 100042 -114655 -335312 -309463 67408 -132503 -61458 50029 12006 29973 -38285 -208049
18081 -208049 -238087 -89650 -45239 18015 153279 157594 71897 175988 -108108 -51450 -13226
18069 -146525 180660 129076 154433 -99501 -83336 120555 64869 -141694 152634 125582 -4750
18057 35635 -55954 267175 -145323 -368776 45501 -115668 293642 328676 -67020 -315380
18047 -315380 -172721 46709 -207439 12217 -73300 241516 222756 60575 -347059 148946
18036 45893 181177 63518 -320313 32420 -174445 -109935 187286 -116609 -88765 -356404
18026c56404a11390B52758c48604E614K9781j4077a26991j14652G8011a63330
18015c26901G7906c66864b3725A4347b540A43245c4299C88897a8855I4931J9390
18004A14321a89549h4851G8783a23482B4213K22115h5148q8541A02054L2484b2821
17992a35701J8825b9775q0376c2392A96721k3279m5526c14617D8225j8428h6749
17980F9461M0068e8671A31420a42245k67303A09851R7839b90807j6830a33236
17969b07659A11433l4387A1085J03915a92412O4578D1106a40797B79812G0146
17958A2860K69685b39784K0904j03414J35810b9804k16078B7122b78941A76541
17947C15528A17737N3635n8851n418R833Q5984B117J20967a60599A82935N7452
$$ plain form
18026 -356404 -111390 252758 -348604 5614 35395 21318 -126991 -241643 78011 -163330
18015 -326901 77906 -366864 -23725 14347 -2540 143245 -34299 388897 -18855 94931 114321
18004 114321 -189549 -84851 78783 -123482 24213 246328 -85148 -173689 102054 134538 -22821
17992 -135701 -116876 -29775 -110151 -32392 196721 173442 127916 -314617 48225 29797 -86749
17980 69461 109529 -58671 131420 -142245 -409548 109851 207690 -290807 -307637 -133236
17969 -207659 111433 77046 11085 115000 -192412 -127834 41106 -140797 279812 70146
17958 12860 282545 -239784 -218880 -322294 -186484 -29804 -245882 27122 -278941 176541
17947 315528 117737 171372 112521 107103 116936 202920 2117 123084 -160599 182935 240387
17936B40387b949A87965d6852B1657J03460D2604m81Q4958b23964j34587a48097
17924D8416h4663n4914B19622J46582i3256k13013A25981J51097a52538B7094
17913A13060a53295a2901A23626C1639M5595f4616j26451a4815k8162n5799G3572
17901A54624i0858A59152f8866A99044J39156C7570H70a22528j93626G6040J54666
17890B30706o3366h9367A56856a83636C1645Q8382J57567A35629b0023B6611J14382
17879A40993n3982K1356c41774J23409a5084A8538J66845e2589b338C38305c5438
17867d608A73205K357H7237M9095m7237e5011r6163L2491k6429A21503J74888
17856B96391K3848d0564o7296N3264j11874p2371A67791B3161J19294e8301B33541
$$ plain form
17936 240387 -2949 187965 -46852 21657 125117 42604 42123 127081 -223964 -358551 -148097
17924 48416 -84663 -139577 219622 366204 -93256 -306269 125981 277078 -152538 27094
17913 113060 -153295 -12901 123626 31639 77234 -64616 -191067 -14815 -42977 -98776 73572
17901 154624 -90858 159152 -68866 199044 338200 37570 870 -122528 -316154 76040 230706
17890 230706 167340 -89367 156856 -183636 31645 120027 277594 135629 -20023 26611 140993
17879 140993 87011 108367 -341774 -218365 -15084 18538 185383 -52589 -2338 338305 -35438
17867 -4608 173205 175562 87237 136332 89095 -55011 -151174 -118683 -145112 121503 296391
17856 296391 320239 -40564 -107860 -54596 -166470 -238841 167791 23161 142455 -58301 233541
17844a44113c6997n6848k83520I1319b2742k3474J9585j08643F7150i6872C34446
17832B27648P9757g4486A28642g7386A77509j2207b53260K2755c4848B59393B953
17820a43526C3366i8614C9659Q3480J34931A17825i1027B80823i4371A57010b5057
17808A23652f1537A2801b11609A60060a88437b6635F41a43970f4602B05271D7520
17796B96962e6440D9779L47425a09336D00894f7879F9759h6976C09375G4719J31036
17785B05755p8285J55712k2399F4246N2828J09960b60990F0409a52028k4767B07476
17773i703E4957J1323J8271N8086M7920f3548j3728a6432I5796b05290k2727A10515
17760A97657L8933j13410A7988b62330A09158J47336b801H1024O2053p145G331
$$ plain form
17844 -144113 -36997 -93845 -377365 91319 -22742 -46216 -26631 -135274 67150 -96872 334446
17832 227648 307405 -74486 128642 -77386 177509 165302 -253260 -230505 -34848 259393 2953
17820 -143526 33366 -98614 39659 123139 258070 117825 -91027 280823 -94371 157010 -25057
17808 123652 -61537 12801 -211609 160060 -188437 -26635 641 -143970 -64602 205271 47520
17796 296962 -56440 49779 397204 -109336 400894 -67879 69759 -86976 309375 74719 205755
17785 205755 127470 283182 260783 64246 117074 227034 -260990 60409 -152028 -176795 207476
17773 -9703 54957 66280 84551 142637 190557 -63548 -77276 -16432 95796 -205290 -228017 110515
17760 197657 236590 123180 17988 -262330 109158 256494 -2801 81024 143077 135932 7331
17748b5184B14789I7161K10072C3401c610F0155J5902b6138j226A19511f3809
17736G026J84292a39811j17473A13803c36969A89920G8719a75463H9954M1319
17726A31273L9549f4391k6127B49280i3736B95346i4560d4641C4364a31989B49914
17714B58810a9292A7491J24428F2300e9828q1185N3272B11964o8024F1202J1685
17703G2887L49071B05446C2610a76512D90980j83567a0543j69594M1604B9008
17692a12967A50703n9326l0166h2331G0121c22835i4092c045k666B5732K27082
17681B52814B3079h0559A93195k7774l2736J12022A08085j3764L0811m5131k536
17670G7465B7705c37495L8289D1714M4919J05636q0496a45023L9139r728c6542
$$ plain form
17748 -25184 214789 97161 307233 33401 -3610 60155 76057 -26138 -27364 119511 -63809
17736 7026 191318 -139811 -257284 113803 -336969 189920 78719 -175463 89954 131273
17726 131273 170822 -64391 -90518 249280 -93736 295346 -94560 -44641 34364 -131989 249914
17714 258810 -19292 17491 141919 62300 -59828 -141013 -87741 211964 143940 61202 72887
17703 72887 421958 205446 32610 -176512 490980 307413 -10543 -180137 -138533 29008
17692 -112967 150703 91377 61211 -82331 70121 -322835 -94092 -3045 -5711 25732 252814
17681 252814 23079 -80559 193195 165421 132685 244707 108085 94321 125132 80001 77465
17670 77465 27705 -337495 -299206 41714 86633 192269 111773 -145023 -105884 -115612 -36542
17658A09883D2343K365L78736p5671b5213l4801E5625K39219j15862a1226F5191
17646c0347B15271H0859b37765N8054f0774b0692C13816d7313k0731E3907J50029
17635B03936J09543a2653D20744h0942B46331A03040e636k29868E680J40712J6131
17624A62523b1820I7387M60513B3198d8239B73561A11581P1776K42334j43065
17614B82626A5369a35188q2327D2540J66707a87190D1170D71M20487A37001a9651
17602A90357n530i4677B35736e0438A56638P4643h6947J7118E0300A3200K13810
17591B27010a9398C76155H4905K42158A04947a97364J5118D4146M003j012N9390
17580A06527K54754B6328L76466j21874j06091J4971Q7270E555J96433K54586
$$ plain form
17658 109883 42343 44708 423444 347773 -25213 -60014 55625 294844 178982 -11226 65191
17646 -30347 215271 80859 -237765 -179711 -60774 -20692 313816 -47313 -68044 53907 203936
17635 203936 313479 -12653 420744 -80942 246331 103040 -5636 -235504 5680 146392 162523
17624 162523 -21820 97387 557900 23198 -48239 273561 111581 183357 425691 282626
17614 282626 15369 -135188 -217515 42540 209247 -187190 41170 471 420958 137001 -19651
17602 190357 184827 -94677 235736 -50438 156638 231281 -86947 -69829 50300 13200 227010
17591 227010 -19398 376155 84905 327063 104947 -197364 -182246 44146 48149 47137 106527
17580 106527 361281 26328 402794 280920 174829 189800 277070 5555 201988 456574
17570D56574d2918C79042A39578m6499K83307A29328N0724J23252j11632L29570
17560E21242c980C2433K4831L59K32841I4103j2071C6127j4787J33470F1788B1923
17547h6369j0177k4205M0630I9704A7744a1693B66667j04412a80844A625J62878
17536A64503J9674Q0612L20022k89525r1589K87662C5755J50400G6643L77703
17526D54346K5645O7011L68651M50802o50971k97476N26241C50632N6178p5476
17516C31334j61952J18802N1757P9119R8869J82910J1084K06092P8172L83963
17506A380150o83047K9159B68139G6732P8814J22936j02179J39142O4199n7170
17496C22474B6504J60398b304C04187O5321j82128D2233n235J60240K83554E4036
$$ plain form
17570 456574 -42918 379042 139578 93079 376386 129328 180052 303304 191672 521242
17560 521242 -3980 32433 57264 57623 290464 94103 82032 36127 21340 154810 61788 21923
17547 -86369 -96546 -120751 -80121 99704 17744 -11693 266667 162255 -180844 1625 164503
17536 164503 184177 264789 584811 295286 203697 491359 35755 186155 76643 454346
17526 454346 479991 547002 915653 1366455 715484 418008 944249 350632 406810 331334
17516 331334 169382 288184 339941 419060 517929 700839 711923 918015 996187 1380150
17506 1380150 697103 726262 268139 76732 155546 278482 176303 315445 379644 322474
17496 322474 26504 186902 -2304 304187 369508 187380 42233 36998 197238 480792 54036
17484A67688K09788e3021A53448J65744j58558K8419l4813o3121N38686A02253
17473C50198J7249B2214K78949o4383p2911L1052J60779R0894j86979j7126P8135
17462C20624p4861K57479G3270k3276J28547m2856J99070J41734A31424l2935
17452I8489K40908j02303L4073J76818l8096j75795J96932J03381r1200r0464
17442C52743K03809j70860q2274q3272K3336J6041J52143j07144H6383K29131
17432C15514L6276j54948L3595K04751M7046H8451O4575r888K82123f0026B54193
17420B96762I9157C8866L73626j38709J71291B19936I6792J60394K7443L0257
17410C14886j11984J38049m2151g557C01104n8469p8021J54370Q2600G8512J80566
$$ plain form
17484 167688 377476 -53021 153448 319192 160634 189053 154240 91119 629805 102253
17473 350198 367447 22214 301163 236780 163869 194921 355700 446594 259615 242489 320624
17462 320624 245763 503242 73270 49994 178541 135685 334755 476489 131424 98489
17452 98489 339397 237094 271167 447985 409889 234094 431026 534407 443207 352743
17442 352743 556552 385692 303418 220146 243482 259523 411666 304522 86383 315514
17432 315514 351790 196842 230437 435188 482234 88451 153026 143138 425261 -60026 254193
17420 296762 99157 38866 412492 273783 445074 219936 96792 257186 284629 314886
17410 314886 202902 340951 298800 -7557 301104 242635 164614 318984 401584 78512 259078
17399B59078O3906n8701B2149J13360J41148C0462J87933J51013A50885G4267
17388B96324L2167A18522J21349N3204j15220N8236E9378K70792q3869I7053L64562
17377D61615m9516o6295A65344J67752r0522a15866D81722k00746c4787B4230
17366A90696J59261m3186J342A48189b4324j17109E62320G1146K42147l7169r7923
17355A78201l6343K42768A78098J76726J6764A55246O5521J83186A99246J30177
17345C29423R4661I6879K75870J545j38977k383J5061O7048J76450j96138D3274
17333A54367O9714I9095k6606J1671L90667H9380J85868K63595j24757a4510C69447
17321B71877R0412C2734A4236J11868K54420K15989B39143o0661Q6583N05487
$$ plain form
17399 259078 322984 264283 22149 135509 276657 30462 218395 369408 150885 74267
17388 296324 328491 118522 239871 293075 177855 236091 59378 330170 246301 97053 461615
17377 461615 412099 345804 165344 333096 242574 -115866 481722 280976 -34787 24230
17366 190696 349957 306771 308113 148189 -24324 -141433 562320 71146 313293 276124 178201
17355 178201 141858 384626 178098 354824 371588 155246 220767 403953 199246 329423
17345 329423 424084 96879 372749 374294 235317 232934 247995 315043 491493 295355 43274
17333 154367 224081 99095 72489 84160 474827 89380 275248 538843 414086 -14510 369447
17321 271877 362289 32734 14236 126104 380524 596513 239143 178482 265065 770552
17311G70552A27436m0649K82563D9844K43379a96176B35435G1228R4531L64464
17301E30223B04832K48358B22749e3435J4580C58774A58731J19358j23828o9679
17291H4582O40247E658K61613J69991F036K43902Q7260r7949J8483J72650F2807
17279F47587j99492B14661L41653B53387O5674A45110M15432a7932C87064J20599
17269E07663j73149D1677N41211k03683J12279j44671q5601l736J19949G4811
17258C37207q6027J37193P356R5664k37481h9447C29182j1403G6617K42519K2923
17247C42059k7548j52940e0142l8097A96415J24783r47J6629J65565j72767A31383
17235C34902M150l6934J2558o4882M22638A98834K93176j39766A23390K87312
$$ plain form
17311 770552 127436 86787 369350 49844 293223 -196176 235435 71228 165759 530223
17301 530223 204832 453190 222749 -53435 -38855 358774 158731 278089 154261 84582
17291 84582 724829 5658 267271 437262 6036 249938 337198 239249 257732 430382 62807
17279 647587 448095 214661 556314 253387 319061 145110 560542 -17932 387064 507663
17269 507663 334514 41677 582888 379205 491484 346813 261212 257476 377425 74811
17258 337207 251180 388373 395729 491393 253912 -89447 329182 317779 76617 319136 342059
17247 342059 314511 161571 -50142 -88239 196415 321198 320251 336880 502445 329678 131383
17235 334902 339052 302118 314676 249794 672432 198834 492010 352244 123390 410702
17225D10702n8957J12573o8725J39185j84338m1625L6357j10681j750J77386j11803
17214B98324P52297D01169J04175K05139k53773j0049j08493Q3585q3777J78949
17204E16925R0518k77245K55333J43604C54606M5072P3575M2822j33493L00789
17194F83371k52969J6711H983M60484p4340O3590q2692j19783L02189j43346l1308
17183C83777k849J25842j04145J5698m86R3186j9317q0998j98359J09704J25744
17172D47797j84561M62848j56244L6568p1565K00015O3638j99166N8785l1550
17162F26565K74755C00807N1353L39295k21046R4348j8449j56156K59746k25703
17152D24195K06665k02947Q0129P5328k82352K47820p139j79979J15633j99943
$$ plain form
17225 410702 351745 464318 395593 534778 350440 308815 345172 234491 232741 410127 298324
17214 298324 1050621 401169 505344 710483 456710 446661 338168 421753 337976 516925
17204 516925 607443 330198 585531 729135 354606 399678 473253 516075 382582 683371
17194 683371 430402 447113 8983 469467 395127 458717 376025 256242 558431 415085 383777
17183 383777 380928 506770 402625 418323 417837 511023 491706 410708 212349 322053 447797
17172 447797 263236 726084 569840 606408 534843 734858 798496 599330 658115 626565
17162 626565 901320 300807 352160 691455 470409 564757 546308 390152 649898 424195
17152 424195 630860 427913 508042 583370 301018 548838 541699 361720 477353 277410
17142B77410L88106r203k70603P1165A72756M91415r2336j08071L78049k32480
17132F09333j87424p8364K68943k66095K36019j03570K06886K79347B80526K03350
17122D83876K16361O4275j18565j40297m635M4473M62J08539O1934J27562l17544
17111E26441M49802k63137j60607k9151J53997B53162L77190M6277j24938j4254
17101E37437j89608L16486l16625O82987p4379j89695j60652l01872M96590k06153
17091E94516K57377o0384j89836j6440J55842k58639K65290l1214p0885M16323
17081A061950k19863j33977k82124M77134j62924K05666O4199k86913p122N3477
17071G69503j06360L17921j5119l45615L1872L43166l3698k31396q0598O1923
$$ plain form
17142 277410 665516 656313 385710 456875 172756 664171 571835 463764 841813 609333
17132 609333 421909 343545 612488 346393 582412 478842 685728 965075 280526 483876
17122 483876 700237 764512 645947 505650 501015 545488 545950 654489 716423 843985 526441
17111 526441 976243 713106 552499 523348 677345 253162 630352 676629 551691 537437
17101 537437 347829 664315 347690 1030677 956298 766603 605951 304079 800669 594516
17091 594516 851893 791509 601673 585233 741075 482436 747726 716512 645627 1061950
17081 1061950 842087 708110 425986 903120 740196 945862 1010061 723148 716026 769503
17071 769503 663143 981064 965945 620330 652202 995368 961670 730274 649676 711599
17061G11599J57390p4005K53894k89054R8371j05978J32908J52057n16619K76467
17051G97030r5344L54446m8907o4837J81452j26555l81106R7538K88243J55641
17041A157601J51398k86261j26763L2508P357N3554K72057o9021m96928L08084
17031A003586M55753l26019j02633L78531N9729n94106L65454n46197M78190K15631
17021A387919l43167K51493n04020J47437j23463L59238j34034j32060L20178
17012A229521r8437r9856J71584M2444l8832o7645j7891K19362K3741J41292k38481
17001A266802J65037m13427K53441j02071m8134j16436K17759K00830r622Q0327
16991A494506l22213N28241m10712r1610K86615j75113L90989m17033J18172K0773
$$ plain form
17061 711599 868989 794984 1048878 759824 858195 752217 885125 1037182 520563 797030
17051 797030 701686 1056132 1007225 942388 1123840 997285 616179 713717 1001960 1157601
17041 1157601 1308999 1022738 895975 928483 935840 989394 1261451 1192430 695502 1003586
17031 1003586 1459339 1133320 1030687 1409218 1468947 874841 1240295 694098 1172288 1387919
17021 1387919 1044752 1296245 792225 939662 816199 1175437 1041403 909343 1229521
17012 1229521 1131084 1031228 1202812 1245256 1206424 1138779 1120888 1340250 1363991 1505283 1266802
17001 1266802 1431839 1018412 1271853 1169782 1121648 1005212 1222971 1423801 1414179 1494506
16991 1494506 1172293 1700534 1289822 1198212 1484827 1309714 1700703 1283670 1401842 1422615
16981A422615J41917J25284k46595J23009J10526k3402j7041r8337K20127j78536
16971A579567P466K3264L1575n0475J1562j0016J2219K56749j76230J29694k50565
16960A564810K16537n50310O81675j98773J44544p2124K46920m71071R4201R2775
16950A749184k1448K69089n13983J37074K60853K12737k50623k7791K62788l3337
16940B044543n579M45444o79525O07159j64163k67598P7550K92664m86857K98179
16930B161817p5740M07314L5136o3042j73688N0516J12956j49603K26767L949
16920B536382M9675L8355j20509K08373r4796K097P5170k34960Q3651R8943j43164
16909B499217m6673M65128m4487J29942K16314l86485L21237l4696j59673p9672
$$ plain form
16981 1422615 1564532 1689816 1443221 1566230 1676756 1653354 1636313 1537976 1758103 1579567
16971 1579567 1587033 1610297 1641872 1591397 1602959 1592943 1605162 1861911 1685681 1815375 1564810
16960 1564810 1781347 1231037 1912712 1713939 1858483 1786359 2033279 1562208 1656409 1749184
16950 1749184 1727736 1996825 1482842 1619916 1880769 2093506 1842883 1815092 2077880 2044543
16940 2044543 2038964 2484408 1804883 2412042 2247879 1980281 2057831 2350495 1863638 2161817
16930 2161817 2086077 2493391 2528527 2465485 2291797 2342313 2455269 2305666 2532433 2536382
16920 2536382 2586057 2624412 2503903 2712276 2617480 2619577 2694747 2459787 2543438 2642381 2499217
16909 2499217 2452544 2917672 2873185 3003127 3219441 2832956 3154193 3119497 2959824 2880152
16899B880152M01208k05168M02808N0014k31950j87635J84300L46945n96691N77662
16889C621645n8973l1503N6012K12683k61803L10218m35451O30702l27447N7437
16879C773520K26811J87299r0339J50723J06647j5041J12550K9123k00470L16096
16869D596919O6800J51670j26500J62880j08831M08576m5306o6063l9357J86599
16859E187387j04055N04518k62694J85690J29619R2425L66345m24326L27271j7450
16849E984730J60016J69323J77339j64405M42582j51398J67407O04R4369L42555
16839G223122j21533J81046L2192K14941M87445r1652Q4695K19361J10690K67018
16829H607325R6018j39431M43310J46709M5070Q1950N10763l05892P87835r4884
$$ plain form
16899 2880152 3281360 3076192 3479000 3529014 3297064 3109429 3293729 3640674 3043983 3621645
16889 3621645 3562672 3531169 3587181 3799864 3538061 3848279 3412828 4043530 3716083 3773520
16879 3773520 4000331 4187630 4097291 4248014 4354661 4339620 4452170 4481293 4280823 4596919
16869 4596919 4663719 4815389 4688889 4851769 4742938 5151514 5106208 5040145 5000788 5187387
16859 5187387 5083332 5587850 5325156 5510846 5640465 5732890 6099235 5674909 6002180 5984730
16849 5984730 6144746 6314069 6491408 6327003 6769585 6618187 6785594 6786198 6880567 7223122
16839 7223122 7101589 7282635 7314827 7529768 8017213 7925561 8010256 8229617 8340307 8607325
16829 8607325 8703343 8563912 9007222 9153931 9199001 9280951 9791714 9485822 10273657 10178773
16819A0178773L96267k30757P12991P1220J2266M42963n0849J89569N47395K65072
16809A2534910R8920M86182L84918K7280R18038l8458J19201L63294Q3862Q75769
16799A5853916J44064L76739J13690O49700M22127Q0617R67136M49321L73128
16790A9430438N47436N28802O76231M19914Q28913K70186P24418Q55063N24812
16781B4806213P54953O68148P06219P34108O54706J248282P13936Q19675J142642
16772C2248882Q24756P79277J445354J175207R12657J016050J393690J264674
16764D1060547J278338J258261J417201J742339J633050J390367J663719J369720
16756E2813542J872021J781902K208597K008670J817302J982156J931565K141266
$$ plain form
16819 10178773 10575040 10344283 11057274 11128494 11140760 11583723 11532874 11722443 12269838 12534910
16809 12534910 12633830 13120012 13504930 13532210 14450248 14411790 14530991 14894285 14978147 15853916
16799 15853916 15997980 16374719 16488409 17138109 17560236 17640853 18607989 19057310 19430438
16790 19430438 19977874 20506676 21182907 21602821 22431734 22701920 23426338 24281401 24806213
16781 24806213 25561166 26229314 26935533 27669641 28324347 29572629 30286565 31106240 32248882
16772 32248882 33073638 33852915 35298269 36473476 37386133 38402183 39795873 41060547
16764 41060547 42338885 43597146 45014347 46756686 48389736 49780103 51443822 52813542
16756 52813542 54685563 56467465 58676062 60684732 62502034 64484190 66415755 68557021
16748F8557021J817985K565481J824935K600799K184929K191453J843687K490413
16740H6076703K017577K037946J827209K048410J699133K116950J437713J575071
16732A00836712R88938J121387Q41704P46591K34482N24709j51444j29022o01384
16723A04412673o87989r18394q14116j151502j539614j363952j729315j606414
16715I4601377k036766k052025k203221k136502j960097k074867k243466k254060
16707G7640373k329040k214361k351719k164203j766066k545882j803539k088309
16699F0377254j723510j987072j742155j834427j768517j392368j708364j431223
16691D6789618j749355j274905j716868j078707j253775j190337j169509j162167
$$ plain form
16748 68557021 70375006 72940487 74765422 77366221 79551150 81742603 83586290 86076703
16740 86076703 88094280 90132226 91959435 94007845 95706978 97823928 99261641 100836712
16732 100836712 101825650 102947037 103788741 104535332 104769814 105294523 105143079 105014057 104412673
16723 104412673 103724684 102806290 101992174 100840672 99301058 97937106 96207791 94601377
16715 94601377 92564611 90512586 88309365 86172863 84212766 82137899 79894433 77640373
16707 77640373 75311333 73096972 70745253 68581050 66814984 64269102 62465563 60377254
16699 60377254 58653744 56666672 54924517 53090090 51321573 49929205 48220841 46789618
16691 46789618 45040263 43765358 42048490 40969783 39716008 38525671 37356162 36193995
16683C6193995j113756q89918j430142p62958j067129q67898r75120n72097r38739
16674B7576238o34260q80890q18247j038537l09358o43501o82978m96714o10592
16665B1461161p50464k62236m22175n71514n14801m69651k30970q71906m76864
16656A6890580k30671k91120n00432n29965l69555j81374m70335j60394l40965
16647A3815769l02229J36680o65052k86545j58841J89982q78389K85338o98330
16638A1438383k76953q3748k96995l48114J40111o61318j39379R8871m46520Q3135
16628I507473k44266j83663l00955M0373J3117k61787k59384j60745J61287l17717
16618G993733l62395R0820n05273q563J46099l31614K44326k16048m61519K53415
$$ plain form
16683 36193995 35080239 34190321 32760179 31997221 30930092 30062194 29087074 28514977 27576238
16674 27576238 26941978 26061088 25242841 24204304 23894946 23251445 22568467 22071753 21461161
16665 21461161 20710697 20448461 20026286 19454772 18939971 18470320 18239350 17367444 16890580
16656 16890580 16659909 16368789 15868357 15338392 14968837 14787463 14317128 14156734 13815769
16647 13815769 13513540 13650220 12985168 12698623 12539782 12729764 11851375 12136713 11438383
16638 11438383 11161430 11077682 10780687 10432573 10572684 9911366 9771987 9870858 9424338 9507473
16628 9507473 9263207 9079544 8778589 8818962 8832079 8570292 8310908 8150163 8311450 7993733
16618 7993733 7631338 7722158 7216885 7208322 7354421 7022807 7267133 7051085 6589566 6842981
16608F842981l19902N0460j3210k98154l34960J49169n1985O9927o73259K60024
16598E681091L6746l0353N2691k40548j50206P0951N4284j79023j61510O1928
16588E196051r794l28198q9747j43354o0674q6180p0564L6051p643J89520m98752
16577D126716j49482K38089L0904j65212J05730m84409L55949J9221k75665J54830
16567C956671o3700l64395J61514K80750n73326L67257m01679K66273j57818j79623
16557C291924j60303J57283K85487m61835J8493J875j97478N12652l59222K7032
16547C115908l23635k13467K92413o6829L47199k52783J56514l43695j6334P4584
16537B769875l66936K77929J04911j11195p0148J79411p8787l03295M8659N4451
$$ plain form
16608 6842981 6523079 6573539 6560329 6262175 5927215 6076384 6024399 6094326 5421067 5681091
16598 5681091 5717837 5687484 5740175 5499627 5349421 5420372 5474656 5295633 5134123 5196051
16588 5196051 5186257 4858059 4768312 4624958 4564284 4478104 4407540 4443591 4435948 4625468 4126716
16577 4126716 3977234 4215323 4246227 4081015 4186745 3702336 4058285 4077506 3801841 3956671
16567 3956671 3892971 3528576 3690090 3970840 3397514 3764771 3363092 3629365 3471547 3291924
16557 3291924 3131621 3288904 3574391 3112556 3131049 3132924 2935446 3448098 3088876 3115908
16547 3115908 2792273 2578806 2871219 2804390 3151589 2898806 3055320 2711625 2695291 2769875
16537 2769875 2402939 2680868 2785779 2674584 2604436 2783847 2705060 2401765 2450424 2504875
16527B504875L8894N1748o8542j90821j5133J85824K8250k17416l81632J82471
16517B118518M84223k49017k46185k00817K00584L5020J47454n63217L29267K47075
16507B302905n320l62078l6461K05340k96696N02356n16187m84403N86693L30035
16497B226184P4735n31038P1752M8105J56007l82920M62403m77286J07520L9338
16487A794800j33439J59578k40573K59507r5486j88542o7533m8798K08874Q14
16477A649202j12547M7100K68951l62848O2288j6528j23134K38498N0221l73978
16467A327225L27531P594k05799K85404k79077J45745l30336L66937j14423M5132
16457A575933j47853j27299J5573m4863M9892m8453P651j49989J52672J33387
$$ plain form
16527 2504875 2543769 2595517 2526975 2336154 2321021 2506845 2535095 2317679 1936047 2118518
16517 2118518 2602741 2353724 2107539 1906722 2107306 2142326 2289780 1726563 2055830 2302905
16507 2302905 2297585 1935507 1899046 2104386 1807690 2310046 1793859 1309456 1896149 2226184
16497 2226184 2300919 1769881 1841633 1889738 2045745 1662825 2125228 1647942 1755462 1794800
16487 1794800 1661361 1820939 1580366 1839873 1744387 1555845 1488312 1439514 1648388 1649202
16477 1649202 1536655 1583755 1852706 1489858 1552146 1535618 1412484 1650982 1701203 1327225
16467 1327225 1654756 1662350 1456551 1741955 1462878 1608623 1278287 1645224 1530801 1575933
16457 1575933 1428080 1300781 1316354 1271491 1321383 1272930 1280581 1130592 1283264 1416651
16447A416651j1429J59992j59554k95612M06144m13206J06637M8492j91071K79681
16437A346725k66413K22665m75599J40384J65740J69988j81314l4660r6551J17802
16427A108767K2426n5641q3712L4849L95491j89427j33892j98451M29074n67517
16417G61967L73284k52335j19565J95812m4839N6915J82976r8834j40801L24263
16407A238843k00934n0887J53697l13214k0138M25262m87641L96801l57620M15062
16397A199231L5869k42501r7493M38098j96813k26851o0587J57265n1583R5930
16387A050565D60564N00802m76635M04335j45640n4456L60874j95524K1660o0085
16377H15895j54356J7643M37J21754M0904K09417j03341j60752j62981K28017
$$ plain form
16447 1416651 1405222 1565214 1405660 1110048 1516192 1102986 1209623 1258115 1067044 1346725
16437 1346725 1080312 1302977 827378 967762 1133502 1303490 1122176 1087516 990965 1108767
16427 1108767 1131193 1075552 991840 1026689 1422180 1232753 1098861 900410 1329484 761967
16417 761967 1135251 882916 763351 959163 914324 971239 1154215 1055381 914580 1238843
16407 1238843 1037909 987022 1140719 827505 807367 1232629 744988 1141789 784169 1199231
16397 1199231 1235100 992599 895106 1333204 1136391 909540 848953 1006218 954635 1050565
16387 1050565 460564 961366 484731 889066 743426 688970 1049844 854320 875980 815895
16377 815895 661539 679182 679619 801373 842277 1051694 948353 787601 624620 852637
16367H52637p8468J88834k49156k59977K14523k04311J32321K59510r9832p5213
16357F80868J30218l04890r5644L37832K1519J78445j80948K01202o8282D02227
16346F65063K6179r9627J7822K04513l25446K48615l13496K67109j29039q5104
16336D76589J54996Q0397R1410K4593k60268j1518j54556Q0788M4691K63139j78478
16325F11783K52730r4185k71045J17510j31330K44893k19202k5525J96110O1223
16315G42962j65699B06077N7921M48111k06327M9624N2869M3416B06524M49923
16305F56447j96961j64272j7663J4578M8906J2787K63721j7663j52353L70066
16295H17593k77946k8015B32639J40043L29292k23992j02215M92818D00789J6532
$$ plain form
16367 852637 774169 963003 713847 453870 668393 464082 596403 855913 756081 680868
16357 680868 811086 506196 410552 748384 769903 948348 767400 968602 900320 402227
16346 665063 691242 591615 609437 813950 488504 737119 423623 690732 561693 476589
16336 476589 631585 711982 803392 827985 567717 556199 401643 482431 527122 790261 611783
16325 611783 864513 770328 499283 616793 485463 730356 511154 485629 681739 742962
16315 742962 577263 206077 263998 712109 505782 555406 608275 651691 206524 656447
16305 656447 459486 295214 277551 292129 341035 353822 617543 599880 447527 817593
16295 817593 539647 511632 232639 372682 701974 477982 375767 868585 400789 417321
16285D17321K37587O7776P7685C17307K18555L877J8726A95988L77826j20331
16275D53483K25615j11141j38558q5291K48155k56327m471A49410K0077J78647
16265C48134q3616N89684j67598p3538j45665j30988j10390L5451J63361j45187
16255B79648M61973C43408j14631J02917J55889J98093B38987J73061A55594M17987
16245E73581j50974J53448j48114k6001j1212J349M7614j31084K7787J45891m7282
16234D35003j217r955C040R4503N74832j29742k00863j42278q7841A4841M76241
16223D91082A58187J37875J9671j23844F7001L39651q7867M08766k67834H3472
16212D45551k16145O5852R4047j74108r1874n6701J86245J34783a8866B61745
$$ plain form
16285 417321 654908 722684 800369 317307 535862 539739 558465 195988 573814 453483
16275 453483 679098 567957 429399 344108 592263 335936 331465 149410 169487 348134
16265 348134 264518 854202 686604 613066 467401 336413 226023 261474 424835 279648
16255 279648 741621 343408 228777 331694 487583 685676 238987 412048 155594 573581
16245 573581 422607 576055 427941 401940 390728 392077 439691 308607 336394 482285 435003
16234 435003 433786 423831 3040 97543 672375 542633 341770 199492 111651 14841 491082
16223 491082 158187 296062 315733 191889 67001 406652 318785 727551 459717 83472
16212 445551 229406 295258 389305 215197 123323 66622 252867 387650 -18866 261745
16201B25542Q2971A52904K53358M6307j8324j15525N5094C3279N39121k67390
16191C05010K32066k60070R8489b36469C09923J06114A40632J17598Q8671A0950
16180A83496O7363O3136K63404A73863l3055q906K27665j55757P65o9359J91829
16169C27045N8924J439I4418L0797M4096K2890J00352E1120K30656a25550C91796
16157B98037O0852j35642a77178C03783a36821A5379J59858n624l9082J76136
16147C06667i6965a9245B66924B7578P01J53429d6447B80697O9048A33164K1121
16136A54285J24141I4861d5918D6853J05453p1715J21209j653K02890E6907N5560
16125A12467m0859K80861q4948G8009D213J31536J58496O2302g8826a9403n1828
$$ plain form
16201 225542 308513 152904 406262 452569 434245 318720 373814 33279 572400 305010
16191 305010 537076 277006 375495 -236469 309923 416037 140632 258230 346901 10950
16180 183496 250859 313995 577399 173863 140808 131902 359567 203810 204575 135216 327045
16169 327045 385969 387408 94418 125215 169311 192201 292553 51120 281776 -125550 391796
16157 298037 358889 223247 -177178 303783 -136821 15379 175237 169613 130531 306667
16147 306667 -96965 -19245 266924 27578 28279 181708 -46447 280697 349745 133164 154285
16136 154285 278426 94861 -45918 46853 152306 80591 201800 200147 403037 56907 112467
16125 112467 71608 352469 267521 78009 4213 135749 294245 356547 -78826 -19403 -71231
16114g1231C40131j10354m9704J4154A8969L30165e6613A04943M2053K36178j11056
16103B72118p6026p673N0769r1897N2687j9186J06554A1093h1408E4136K60671
16092C14807A13338K18601j2654j07707J55238A57251J37705b7697C8585K76880
16082C15465F2533k9192K2747K8009c6951A0447a63367B8742c491A1908L55681
16071C67589a14988A74290l2217C232K10376a50540B12010A03927L23006D2119
16060A78061C3533L20508D9183j8103i6660F5356J20799a2902k35591A38230b04897
16048a30826B23532b8571A11384b39260A95294c36484B51888I3307a59230c5347
16037D5170N9720a8382q2063A32213B2005a21870a1764A83170c2639F1760J93347
$$ plain form
16114 -71231 340131 229777 180073 194227 18969 349134 -56613 104943 146996 383174 272118
16103 272118 196092 188419 239188 147291 199978 180792 287346 11093 -81408 54136 314807
16092 314807 113338 331939 319285 211578 366816 157251 294956 -27697 38585 315465
16082 315465 62533 33341 56088 84097 -36951 10447 -163367 28742 -3491 11908 367589
16071 367589 -114988 174290 142073 3232 213608 -150540 212010 103927 426933 42119
16060 178061 33533 354041 49183 31080 -96660 65356 186155 -12902 -248493 138230 -204897
16048 -130826 223532 -28571 111384 -239260 195294 -336484 251888 93307 -159230 -35347
16037 45170 104890 -18382 -100445 132213 22005 -121870 -11764 183170 -32639 61760 255107
16026B55107l7155k7941f7649a1063C52445K08108A96212o0876k4816J67226H8923
16014c08977A99784M1490R5039A57137c571C04148F6660J09583e4629p211A32298
16002C634J00498Q1595m376p2831L87197E5529L4790a03945A87109L2627Q1191
15991C00927a14582F52633k70792p4108L81424M47311N441N4166k40697k85526
15981F69852j48806j12268A84927B1286K45507A08984J49168c6034a4384A06431
15970G5090A9002f004E2170L43246j56742b6721A97340A4561i4380o7203e869
15958C05010I7198m1978J95583l8011b3803E8934e0279n5938J476C8541J25812
15947A64353f4766G6117a79243d1175k0295p7140d3534k22212C0277J86471b14268
$$ plain form
16026 255107 217952 190011 -67649 -11063 352445 560553 196212 135336 110520 277746 88923
16014 -308977 199784 241274 336313 157137 -3571 304148 66660 176243 -54629 -61840 132298
16002 3634 104132 185727 181351 108520 495717 55529 90319 -103945 187109 219736 300927
15991 300927 -114582 652633 381841 307733 689157 1136468 1141909 1196075 955378 669852
15981 669852 521046 408778 184927 21286 266793 108984 258152 -36034 -14384 106431
15970 75090 19002 -6004 52170 395416 238674 -26721 197340 14561 -94380 -161583 -5869
15958 305010 97198 55220 250803 212792 -23803 58934 -50279 -106217 -104741 38541 164353
15947 164353 -64766 76117 -179243 -41175 -61470 -138610 -43534 -265746 30277 216748 -214268
15935B00140A7147K02225d518B04560J54617c3119j64686j93645C0529g9721I7607
15923A44605I622J17238a18959a9016B01871A1650O4657b49764d9550I0751b27095
15911a91340b2531k4426A10875a07104a0060A23885L8923n6761g38I8478h1062
15899A25475n5894M0504M0939G0147J79140b64594H3753M9360C4796b27935d8871
15887a24244l2607C44770A50972d1001j38040A6224N6928J52038A1309a51988
15876a11882k14788A08431l1487C4525a37913C6189g9206j66235j2390P0308B00479
15864I0973P8902d62488A88498h5559H8841e6460j84583G9473f673p4709m9148
15853a30530a1310j39278E9426e0857m221I6367a2043l5668k92725h6561J4588
$$ plain form
15935 200140 17147 219372 -4518 204560 359177 -33119 -197805 -391450 30529 -79721 97607
15923 144605 9622 126860 -118959 -19016 201871 11650 76307 -249764 -49550 90751 -227095
15911 -191340 -22531 -46957 110875 -107104 -10060 123885 162808 106047 -738 98478 -81062
15899 125475 69581 110085 151024 70147 249287 -264594 83753 133113 34796 -227935 -48871
15887 -124244 -156851 344770 150972 -41001 -179041 16224 73152 225190 11309 -151988
15876 -111882 -326670 108431 76944 34525 -137913 36189 -79206 -245441 -257831 -187523 200479
15864 90973 169875 -462488 188498 -85559 88841 -56460 -241043 79473 -6673 -81382 -130530
15853 -130530 -11310 -150588 59426 -50857 -55078 96367 -12043 -47711 -340436 -86561 -71973
15842g1973C48194A27132J23894J2399I419M4881c57894E3232b00844d6217F0988
15830b87115I8420b85846a204C7494E244O5485a935I04J640a05910F1165j1144
15818E0021f870B4680g9370j54081J2318j07768B65444B1365b89874d884p0395
15807g5279k51892h3951j87807b1929A9337k610J71107H3559a06831J1033k2484
15796a18282a6274j39272E9293b82259b858n1602I4885c37817A2673J72331b6318
15784a05186G7280e4767j08761C34345L5158C761a00626d5420A08J0874Q9074
15773A00056b28691B4793M5800a22906d9198q1106l0684G9957f9884j50799g4437
15761B92516a10042H6152a56077B31195A9156J9345J44102l1158M36230G7870
$$ plain form
15842 -71973 348194 127132 251026 263425 9419 54300 -357894 53232 -200844 -46217 60988
15830 -287115 98420 -285846 -1204 37494 5244 70729 -1935 904 2544 -105910 61165 50021
15818 50021 -6870 24680 -79370 -233451 -221133 -328901 265444 21365 -289874 -4884 -75279
15807 -75279 -327171 -83951 -271758 -21929 19337 16727 187834 83559 -106831 -95798 -118282
15796 -118282 -16274 -155546 59293 -282259 -2858 -54460 94885 -337817 12673 185004 -26318
15784 -105186 77280 -54767 -163528 334345 369503 3761 -100626 -45420 108 10982 100056
15773 100056 -228691 24793 70593 -122906 -49198 -130304 -160988 79957 -69884 -220683 -74437
15761 292516 -110042 86152 -156077 231195 19156 38501 182603 151445 587675 77870
15750B94847a42643A01176K1378a30094j2908E5972J17888p8181a19910j40110
15740b60020B38063a67723q2469A54118d31569i7151H2632b42693A32260a75931
15729G2427a23537c1709A2320b20573A02500G515C665a8203q032E9748p974c29586
15716B0314N3003a99005A8479J06041J05510b53611Q8195d4668I8806R287b09511
15704b03034O7311N3784A13551b77401C35643b33697p371a8599k45909B3985J12704
15693A36689c83192A38694R5512p0120p1189d1567C78537A04897a51257I9371
15682c0033k92408G0877L7861a18479B78232G8683a18445B68919C0838K7137J45503
15671B03478G3749K32096d03490a78846H9415f891D1099d8752k84733B39521a25065
$$ plain form
15750 294847 -142643 101176 122554 -130094 -143002 55972 173860 95679 -119910 -260020
15740 -260020 238063 -167723 -250192 154118 -431569 -97151 82632 -242693 132260 -175931
15729 72427 -123537 -31709 12320 -220573 102500 7515 3665 -18203 -26235 59748 51774 -329586
15716 20314 73317 -199005 18479 124520 230030 -253611 -165416 -44668 98806 108093 -209511
15704 -203034 -135723 -81939 113551 -277401 335643 -233697 -241068 -18599 -264508 23985 136689
15693 136689 -383192 138694 234206 164086 92897 -41567 378537 104897 -151257 99371
15682 -30033 -322441 70877 108738 -118479 278232 78683 -118445 268919 30838 57975 203478
15671 203478 73749 305845 -403490 -178846 89415 -6891 41099 -48752 -333485 239521 -125065
15659B00507c00629e3185k85336d8431M823a1632j95753o5837d0505l10221f3897
15647a33377B02275A9543L22889c7103C01674a01725H0578a96623I2406e3927
15636A5706l894b9400D9539a17266j21709r6672a27601J8525M0158D03545b97225
15624d1701l93410B04622a56663F2772i1889A60403b30154F9658a26471C6292
15613G517J3566h3551A19980a42077m4917F3670P5252a06199l57000a03199k8876
15602a32075I4810a5434p9370H94L1621b43906c7090A62777O1609p4863J720O4526
15590B15769b31941c1384E7344J139K13917f5485A17001A8215L9547c7894C7133
15578H6194a92601h4515A714Q852a45199A63844f0614A9508Q0885e7787p4641
$$ plain form
15659 200507 -300629 -53185 -338521 -48431 -43608 -11632 -207385 -273222 -40505 -350726 -63897
15647 -133377 202275 19543 342432 -37103 301674 -101725 80578 -196623 92406 -53927
15636 15706 11812 -29400 49539 -117266 -238975 -335647 -127601 -109076 -68918 403545 -297225
15624 -41701 -435111 204622 -156663 62772 -91889 160403 -230154 69658 -126471 36292
15613 7517 21083 -83551 119980 -142077 -186994 63670 138922 -106199 -463199 -103199 -132075
15602 -132075 94810 -15434 -94804 894 32515 -243906 -37090 162777 224386 149523 151243 215769
15590 215769 -231941 -31384 57344 58483 272400 -65485 117001 18215 57762 -37894 37133
15578 86194 -192601 -84515 1714 10566 -145199 163844 -60614 19508 100393 -57787 -132428
15567a32428k8775f9188j4345B6721J9165d3668D0641K51094g4351r7587d4781
15555d31286B04914a74129C069a91914J4363M6014j98983A24510B4121a27713
15544b0061p3715B86860J02076b18040A43158J36140a88328G6763L8551i8581
15533f7500l5283a7328A60795a68630e0102B22242q5944J05102b6687C0980M6581
15522G7561h527B4472a30978C0008N0540O7774b01334P0499C11957j42755a97924
15510E2389J42187b8089k2253B58598a49088J3994C78202a0651C61996B4452N6025
15499H0477a3195A2952K3247a95253A0547Q8301b5776k26639g8566A74655D6261
15487A88807D842f4867B30861a57752P1002A92321a32148j18919B66220a11833
$$ plain form
15567 -132428 -161203 -69188 -83533 26721 45886 -43668 40641 291735 -74351 -171938 -44781
15555 -431286 204914 -174129 3069 -191914 -177551 -131537 -330520 124510 24121 -127713
15544 -20061 -93776 286860 388936 -218040 143158 279298 -188328 76763 115314 -98581
15533 -67500 -102783 -17328 160795 -168630 -50102 222242 136298 241400 -26687 30980 77561
15522 77561 -8527 24472 -130978 30008 80548 148322 -201334 -130835 311957 169202 -197924
15510 52389 194576 -28089 -50342 258598 -149088 -135094 378202 -10651 361996 24452 80477
15499 80477 -13195 12952 36199 -195253 10547 98848 -25776 -252415 -78566 174655 46261
15487 188807 4842 -64867 230861 -157752 -86750 192321 -132148 -251067 266220 -111833
15476B99646J4190M17555j96665j57377n5839e9566C880J00029b81878D05547
15465B17411a0669B23021D7354g0655k03667H398c08733J43964A53621J32108
15455B85729a72592g2145A99044h4758e557A6094J31588f2022G8082O1788K28424
15444C68294n7585O91231j37875K45614r1773m94348j50602D9606K93767D0078
15433C28247j42320B2152L0500R0514E939O2995J53220G9163b31886C15123A39865
15421C4568b50169k7029a13989A25529K33899A23020N8197G88K83723a1722j60015
15410a71737G2916K04511d3770D5530b11062C7457L0418a65687B23497a91626
15399h6885A47518f556j54093g5559m4406B16194r7559g7682a2842j29148e1367
$$ plain form
15476 299646 313836 731391 534726 377349 321510 -59566 3880 103909 -281878 405547
15465 217411 -10669 223021 47354 -70655 -274322 8398 -308733 -164769 153621 285729
15455 285729 -172592 -72145 199044 -84758 -5557 16094 147682 -62022 78082 139870 368294
15444 368294 310709 1001940 864065 1109679 1017906 523558 372956 49606 343373 40078
15433 328247 185927 22152 52652 143166 5939 68934 222154 79163 -231886 315123 139865
15421 34568 -250169 -277198 -113989 125529 359428 123020 181217 788 284511 -11722 -171737
15410 -171737 72916 277427 -43770 45530 -211062 37457 67875 -165687 223497 -191626
15399 -86885 147518 -6556 -160649 -75559 -119965 216194 118635 -77682 -12842 -141990 -51367
15387A08878f0263k60835e8851C7495a03240D9198g2808i367l52947B30928a8808
15375a0479C75637a97786I5583A1992N7306L03471f3931B46277b41062A27841
15364A84417F5240f2234A7458a20382A14765J81817C1867N5327A2381J54634i883
15352a2442A84213C2732J08070J64724p640j09207K48565k1719n8112j6117O8015
15341D09311j51782J84492A59493P1269H817L2510J42257A4528Q914b75512I0849
15329B09439n5525e121m627C04659F9780B5616K28949F4158L9797P8489a5831
15317b6187A50387J20334E6218c0071k53763D9839K36306I2193J2487J88536p018
15306B86198k8831b0777A64096A3396e1933A30573E6411a33435B19837l9038J68750
$$ plain form
15387 108878 -60263 -321098 -58851 37495 -103240 49198 -72808 -9367 -362314 230928 -18808
15375 -10479 375637 -197786 95583 11992 69298 372769 -63931 246277 -241062 127841
15364 184417 65240 -62234 17458 -120382 114765 296582 31867 87194 12381 167015 -9883
15352 -12442 184213 32732 140802 305526 297886 188679 437244 415525 357413 341296 409311
15341 409311 257529 442021 159493 230762 8817 41327 183584 14528 23442 -275512 90849
15329 209439 153914 -5121 -9748 304659 69780 25616 254565 64158 103955 182444 -15831
15317 -26187 150387 270721 56218 -30071 -283834 49839 286145 92193 104680 293216 286198
15306 286198 257367 -20777 164096 13396 -51933 130573 56411 -133435 219837 180799 349549
15295C49549j27676K08063A878f8004K0710D07708b26616h2567A38897a63113
15284b71588B28555o1192J17346b4829B23937A05910J31178A11098d48109J34415
15274c13694A53177n5377b83947A78402E7811c50922a53987d9086A19330a4163
15263B74026H4161b11775J0810A73918b02352a5511B10143A4342J39814a54109
15252a39364A93011b8646D71O931M32169a53381e8123m775B93796L62401N96407
15241A252604O27762m10282L68015H91019B31000j14503n4252K95933j02026K6057
15231B82209A02805a69341P6626o6062A32070l8868Q564a91109q7666B59005a18444
15219B35576c6744A5673K33323q1296a61228d8317C55302A70333J37833H3198
$$ plain form
15295 349549 221873 429936 1878 -68004 -47294 407708 -226616 -82567 138897 -163113
15284 -271588 228555 167363 284709 -24829 223937 105910 237088 111098 -448109 -313694
15274 -313694 153177 97800 -283947 178402 57811 -350922 -153987 -49086 119330 -14163
15263 274026 84161 -211775 -200965 173918 -202352 -15511 210143 14342 154156 -154109
15252 -139364 193011 -28646 471 7402 439571 -153381 -58123 -62898 293796 656197 1252604
15241 1252604 1880366 1470084 1838099 891019 231000 116497 62245 358178 256152 282209
15231 282209 102805 -169341 -92715 -158777 132070 93202 101766 -191109 -278775 259005 -118444
15219 235576 -36744 15673 248996 167700 -161228 -48317 355302 170333 308166 83198
15208A42594d1490A42079j1107H038a63958C01392F0928J01007o5245K56890c6976
15196a60851A89439J50827d2108H8042g2237A76530q6435J45400a36546G5363
15185A94366b78505C9291g6000G0850c7635a038A44949e0034B48363j22951a758
15173a45243k34A04134d8382B6807d078H1802J13115a64861A27106e6226B5988
15161B34668K3026r205j02087a420A47383o823J8997o8815e303j21416k5773f4895
15148G2055b20058c3140I9369J2513M064c6314j17640J1550F6881Q2456J49419
15137B98756A11551K7295J49772k5775A06366E1879I954e595D1973h8064C29769
15125e628j1848l9355B04616J65374p4715I4191K05570J7798l9317q7339a4210
$$ plain form
15208 142594 -41490 142079 130972 8038 -163958 301392 60928 161935 96690 353580 -36976
15196 -160851 189439 340266 -42108 88042 -72237 176530 90095 235495 -136546 75363
15185 194366 -278505 39291 -76000 70850 -37635 -1038 144949 -50034 248363 125412 -1758
15173 -145243 -145477 104134 -48382 26807 -4078 81802 194917 -164861 127106 -56226 25988
15161 234668 257694 248489 146402 -1420 147383 140560 159557 90742 -5303 -126719 -152492 -64895
15148 72055 -220058 -33140 99369 111882 115946 -36314 -153954 -142404 66881 149337 298756
15137 298756 111551 138846 288618 262843 106366 51879 9954 -5595 41973 -88064 329769
15125 -5628 -17476 -56831 204616 369990 295275 94191 299761 317559 278242 190903 -14210
15113I0334f8154c0041a672m5861B02472b51491A40322P4220a13758H7428J18259
15102B05687c9460h957B4776M36718a89503C6149a24467k13990A43701d4879n4456
15091i9335A50101o8496J13752c248B95179r4577L57802b1429j6507D8552L16585
15080C65137b3809C0895K70456F8564Q0364J72320H8794P0588J09670h0679B75862
15068A57295o0450a52030A84781b91871f3588A02448c3536j55283A84752K48403
15058D33155e5501C87187A22858N7185B8557J94262K41110j15698K09634J09266
15048F67131C11979A02952L95335r7419p6648A12843J85259A44663L74614B50620
15037F0754L80510q2369r2113J6128K04951B22226J39160m2095L51372l00361
$$ plain form
15113 90334 -68154 -30041 -1672 -47533 202472 -251491 140322 214542 -113758 87428 205687
15102 205687 -39460 -8957 24776 461494 -189503 36149 -124467 -338457 143701 -44879 -99335
15091 -99335 150101 81605 195357 -3248 295179 200602 558404 -21429 -37936 48552 365137
15080 365137 -23809 30895 301351 68564 148928 321248 88794 159382 269052 -80679 275862
15068 157295 96845 -152030 184781 -291871 -63588 102448 -33536 -188819 184752 433155
15058 433155 -55501 387187 122858 180043 28557 222819 463929 348231 557865 667131
15048 667131 311979 102952 498287 400868 324220 112843 298102 144663 519277 250620
15037 60754 441264 358895 266782 282910 487861 222226 361386 319291 670663 370302
15027C70302K29950K83991n4696C43671J09438j16546O1648I3070N08376j36957
15017D64489O8994k2947j62632j50939K90394o0884j74787N2222n3254K21197
15007D71853N8155r7388j58731N18974C58174K677J3808r6445J22944J42665q9868
14996D53955j43007j36119K77681e3223A14417J36408p010L29927k37258l4716
14986C01768K25160B20985P5439J04601K29505q1675l4540K04822j05225j93931
14976D19981n8657L84752B06698J61529J09470K37374r3932L5409k14050j9775
14966D22723A31105J20304P356m5179J0211J82965j54957J29673J05063L9127
14956E25668j75484m6760o3286L4195N4048K2581j46440M45312j08311C8171K85005
$$ plain form
15027 370302 600252 884243 829547 343671 453109 336563 398211 93070 601446 464489
15017 464489 533483 510536 347904 196965 487359 426475 251688 303910 250656 471853
15007 471853 530008 432620 273889 792863 358174 360851 374659 278214 401158 543823 453955
14996 453955 310948 174829 452510 -53223 114417 250825 243815 573742 336484 301768
14986 301768 526928 220985 296424 401025 630530 548855 514315 719137 613912 419981
14976 419981 361324 746076 206698 368227 477697 715071 621139 656548 442498 422723
14966 422723 131105 251409 258765 213586 223797 406762 251805 381478 486541 525668
14956 525668 350184 303424 240138 274333 328381 350962 204522 649834 541523 38171 323176
14945C23176L13157j99776L68227k17863r0121A72930G0390K79338p9640l7018
14935B33070K68070j20806p943K71150M5927L33531J3498j15460L11190N33247
14925A765474l36919L6467k49172k73170K97087L45902n1260R3958M96377j46213
14915A978531p0086n30415j09745r6161l18615k9098k52549B77067L02697B70129
14904A43233M19016j43096L8891E8080L00956q0982J85397A45078K51593J31637
14894E28308A22086J06343J31103q9137h3405B92720M97553j10859j28037k2280
14884E29097K84295l21124j56621J76036J48606j94311j45515J42650J60561K01873
14874H25547C98810J03026k14325M42935B34183L42667k78712O4950L52813k05646
$$ plain form
14945 323176 636333 436557 804784 586921 496800 172930 70390 349728 270088 233070
14935 233070 501140 380334 372391 643541 689468 1022999 1036497 921037 1232227 1765474
14925 1765474 1428555 1465022 1215850 942680 1239767 1585669 1534409 1628367 2124744 1978531
14915 1978531 1908445 1378030 1268285 1172124 853509 824411 571862 277067 579764 270129
14904 143233 562249 419153 458044 58080 359036 278054 463451 145078 396671 528308
14894 528308 122086 228429 359532 270395 -83405 292720 790273 679414 551377 529097
14884 529097 813392 492268 335647 511683 660289 465978 320463 463113 623674 825547
14874 825547 398810 501836 287511 730446 234183 576850 298138 363088 715901 510255
14864E10255m3005K73439l24716j33043q5071K54934n2040C2458M90831j92994
14854C30295J43841J16594B46755K69292j19612L23080l18724N70938k86347j98303
14844D87079K07095O2244L11878j6570k27258M94619j65232l17420j57038J5062
14834F94459j20058B16346K21225N70712m30068j34030K47149j36475B38802L83962
14824F22764R5324n8701M3982L1815n3157m047L6812J07111K45341D25160K75309
14813G00469P1733j53033J4767j86874K90287j70202K77770J24794N5835k17935
14803H07611j20643L13423m91095R7221J56218l09611j87885J71972J36992m7866
14793E26337R4559J1459j76818L20335J5733k80720n6528J86169k15536J44853
$$ plain form
14864 510255 467250 740689 415973 282930 197859 452793 400753 32458 523289 330295
14854 330295 474136 590730 246755 516047 396435 719515 400791 971729 685382 487079
14844 487079 694174 756418 1068296 1051726 824468 1319087 1153855 836435 679397 694459
14834 694459 574401 216346 437571 1008283 578215 444185 691334 554859 238802 622764
14824 622764 718088 659387 703369 735184 682027 677980 714792 821903 1067244 425160 700469
14813 700469 772202 619169 633936 447062 737349 567147 844917 969711 1025546 807611
14803 807611 686968 1000391 509296 606517 762735 453124 265239 437211 574203 526337
14793 526337 620896 632355 455537 775872 791605 510885 454357 640526 424990 569843
14783E69843J85561l02241p8532P0407L64198j05775o0814k8045P7598J84027
14773H76227k13627J48235r990l9022l49243L35391l26231J21687q4993K38069
14763F96503k3132k00958L60803k40865M4213L3417B52816K76722A84298N39494
14753G23792j03647J5143K00653k06379k30711J23527J0035J82186B27356M52145
14743F79501n4380Q6916l44343K78160j98195N4679J59144R823M12667k23878
14733H60094j10894K2186K16593j16948k04550Q32287k0722N59458p52557L73530
14723A658477m68941k5490p645k51318l6637p2657P2476L7696k81463l7979J58447
14712G44966L87723l56477k05129p151K73407l00069K30423M81184p3418J37714
$$ plain form
14783 569843 755404 453163 374631 445038 809236 703461 642647 614602 692200 876227
14773 876227 662600 810835 800845 761823 412580 747971 421740 543427 458434 696503
14763 696503 673371 472413 833216 592351 636564 669981 252816 529538 184298 723792
14753 723792 620145 635288 835941 629562 398851 522378 532413 714599 227356 679501
14743 679501 625121 712037 367694 645854 447659 502338 661482 671305 1083972 860094
14733 860094 749200 771386 987979 871031 666481 1498768 1478046 2037504 1284947 1658477
14723 1658477 1189536 1164046 1156401 905083 868446 795789 868265 905961 624498 586519 744966
14712 744966 1132689 776212 571083 563932 837339 537270 767693 1248877 1175459 1313173
14702A313173M13746m64962L97241k10484J77211l66803j39341n6924J78081o09261
14692F31677K71733q0977R5012L7579m34581J0211K65296M23145l60384j94222
14682F64489o2337L09640J86907l22903J06660k80786J30495M1697L10092R41
14672A084895J42799D22318N46785j07905n7496L6679M01447j84352j78670j59844
14662G18962L5327K46173q6459m417j3776J2844P3070r6151J51079l8446K25873
14651A224079j24877J09564j66019l7219N10476l81304J98243m96866K38260L1028
14641A105365q3187J37379J5204j86577P0752O9047n5570K10900j14043R4764
14631A264034j8397m98491L46125L44051l70399J13450L98394K2705k20440N3879
$$ plain form
14702 1313173 1726919 1261957 1659198 1448714 1625925 1259122 1119781 1062857 1240938 631677
14692 631677 903410 822433 917445 955024 520443 530654 795950 1219095 858711 664489
14682 664489 602152 911792 1098699 775796 882456 601670 732165 773862 1083954 1084895
14672 1084895 1227694 422318 969103 861198 803702 840381 1241828 1057476 878806 718962
14662 718962 754289 1000462 914003 909586 895810 908654 981724 885573 1036652 998206 1224079
14651 1224079 1099202 1208766 1042747 1005528 1516004 1134700 1332943 836077 1074337 1105365
14641 1105365 1022178 1159557 1174761 988184 1058936 1127983 1072413 1283313 1169270 1264034
14631 1264034 1245637 747146 1093271 1437322 1066923 1180373 1578767 1601472 1381032 1434911
14621A434911Q1059j49044L4219j54846n5659J50060N2388r8077J37587p2320
14611A360278k26459N14642J0351l28594q4133J37873k0597L3683R2043L03700
14601A792787j48161K9705l49033R5575j55008J21366L31344J9909j10794j3848
14591A613842J97532j85222K19364k23093n1913N8414J01744K37537q5829k59478
14581A622898L39138r4330l34184K74463P8405k17757L38516p0607p5676k02477
14571A658389L43327j92672J21441N4368J65082K8927J6778L5196M1879J59364
14561B432079K75042K5482k65676J25707Q7573J44575K49158K30975L06131J97516
14551C808562Q76718J122138K352192M158628P366122J6026951N313444A7440523
$$ plain form
14621 1434911 1515970 1366926 1401145 1246299 1190640 1340700 1393088 1295011 1432598 1360278
14611 1360278 1133819 1648461 1658812 1330218 1246085 1383958 1363361 1397044 1489087 1792787
14601 1792787 1644626 1674331 1325298 1420873 1265865 1387231 1718575 1738484 1627690 1613842
14591 1613842 1811374 1626152 1845516 1622423 1570510 1628924 1730668 1968205 1882376 1622898
14581 1622898 1962036 1867706 1533522 1807985 1886390 1668633 2007149 1936542 1860866 1658389
14571 1658389 2001716 1809044 1930485 1984853 2149935 2178862 2195640 2230836 2272715 2432079
14561 2432079 2707121 2732603 2466927 2592634 2680207 2824782 3073940 3304915 3611046 3808562
14551 3808562 4685280 5807418 8159610 12318238 19684360 35711311 41024755 17440523
14542G445266l598872j008856m24034N73342L51538K298671k423416q12049m00354
14533B001236P5089q0757l35411L1292J09553J95264J285K37905l02023K75211
14523B208644k82262K05647J02815M8650J28959k63057K55772k4692k5644k17403
14513B137429L67113k65769J82806J14204j23868J94351N276K5359o954Q1992
14503B711939P9255j2308O7417j55288J67085m2812k81701L04163J6131J94878
14493C048759O0356R7074m29316L80010L07077q4894j5927p9696j52072K17302
14483C348673K83395k13569O0268K61480J14675R3957m46411J01122M44580m09495
14473C638675L4310J06686J06622J79390J15831k14832p2419N03100j93833O5089
$$ plain form
14542 7445266 3846394 2837538 2413504 2986846 3338384 5637055 3213639 2401590 2001236
14533 2001236 2076325 1995568 1660157 1691449 1801002 1996266 1997551 2235456 1933433 2208644
14523 2208644 1926382 2132029 2234844 2283494 2412453 2149396 2405168 2380476 2354832 2137429
14513 2137429 2504542 2238773 2421579 2535783 2411915 2606266 2611542 2636901 2629947 2711939
14503 2711939 2791194 2778886 2846303 2691015 2858100 2815288 2533587 2837750 2853881 3048759
14493 3048759 3109115 3206189 2776873 3156883 3463960 3379066 3363139 3283443 3131371 3348673
14483 3348673 3632068 3418499 3478767 3740247 3854922 3948879 3502468 3603590 4048170 3638675
14473 3638675 3672985 3779671 3886293 4065683 4181514 3966682 3894263 4397363 4203530 4268619
14463D268619K13207k20853J76148l24155J23804N02702K796r4453J80779j72024
14453D656570K27845J98108l77577L54317l4399J77175K05258j49476k73763M36866
14443E420924P3896K05721J2736Q1308k16577J68666K80644M3843q9769J36569
14433F117961j21359K07087p1913Q19895l42869j92871L25186J49567J3218L21707
14423G225609l47240M47082K73309L57797J38470m2299k81427K89096O9197q0681
14413H048913k29238L85093J72964L30418M5023l7678L00000L21288K55331j87787
14403I404327K68970n7890L00725j20493M62593j95221J19370M62061O3092N390
14393A0712924L37259p0914O23580l88961Q45480n06133N53805n0608N96683L56472
$$ plain form
14463 4268619 4481826 4260973 4437121 4112966 4236770 4739472 4742268 4647815 4828594 4656570
14453 4656570 4884415 5082523 4704946 5059263 5024864 5202039 5407297 5257821 4984058 5420924
14443 5420924 5494820 5700541 5713277 5794585 5578008 5746674 6027318 6071161 5981392 6117961
14433 6117961 5996602 6203689 6131776 6951671 6608802 6415931 6741117 6890684 6903902 7225609
14423 7225609 6878369 7325451 7598760 7956557 8095027 8052728 7771301 8060397 8129594 8048913
14413 8048913 7819675 8204768 8377732 8708150 8753173 8715495 9015495 9336783 9592114 9404327
14403 9404327 9673297 9615407 9916132 9795639 10258232 10063011 10182381 10644442 10707534 10712924
14393 10712924 11050183 10979269 11602849 11213888 12059368 11553235 12107040 12056432 12653115 13009587
14383A3009587N21874O4573P8568L18200O15926l86663L70577P81373k05942M73200
14373A5641273N0602Q03768M6280L55855K76636L27277N67927N93539R3426M06223
14363A9162806r702Q46285J44662M46582M12420R26165O0248O23726N56971M15602
14353B3585765O25174K41250J017677P32273K35585J095793L76464O15427R44409
14344B9469817Q00383M91389R75205J177252N55395J123650J147570R96855R57678
14335C7695194J124315Q35108J166924J328476J424550J201551J609364J373542
14327D7759024J706904J676544J276907J733388K031823J957793J954917K287248
14319F2384548K143641K405225K109442K325404K669734K884479L164577L131744
$$ plain form
14383 13009587 13531461 13596034 13674602 13992802 14608728 14222065 14592642 15374015 15168073 15641273
14373 15641273 15691875 16495643 16541923 16897778 17174414 17501691 18069618 18663157 18756583 19162806
14363 19162806 19153104 19999389 20144051 20590633 21003053 21929218 21989466 22613192 23170163 23585765
14353 23585765 24210939 24452189 25469866 26202139 26437724 27533517 27909981 28525408 29469817
14344 29469817 30270200 30761589 31736794 32914046 33469441 34593091 35740661 36737516 37695194
14335 37695194 38819509 39654617 40821541 42150017 43574567 44776118 46385482 47759024
14327 47759024 49465928 51142472 52419379 54152767 56184590 58142383 60097300 62384548
14319 62384548 64528189 66933414 69042856 71368260 74037994 76922473 80087050 83218794
14311H3218794L235300L644602L733980M180532M068160M199425M671116N360321
14303A16312230N139979N639767N936694O203650O493250P383420P397031P842815
14295A68348836Q154366Q989312R375112R541420J0548499J1069746J0878621
14288B36905912J1763080J2214989J2673882J3082535J3127231J4041108J3583621
14281C27392358J4308657J4465073J3636043J3558878J2653917J2046822J1006556
14274D19068304P892355L616078J315437J906659K717263K631705k843113l221624
14266D33083064m317532p398857r073224j1470772j2599779j3720812j4233587
14259C60268501j4503898j5241130j4650055j4721385j4634363j3684014j3562924
$$ plain form
14311 83218794 86454094 90098696 93832676 98013208 102081368 106280793 110951909 116312230
14303 116312230 121452209 127091976 133028670 139232320 145725570 153108990 160506021 168348836
14295 168348836 176503202 185492514 194867626 204409046 214957545 226027291 236905912
14288 236905912 248668992 260883981 273557863 286640398 299767629 313808737 327392358
14281 327392358 341701015 356166088 369802131 383361009 396014926 408061748 419068304
14274 419068304 426960659 430576737 431892174 433798833 436516096 439147801 436304688 433083064
14266 433083064 428765532 421366675 412293451 400822679 388222900 374502088 360268501
14259 360268501 345764603 330523473 315873418 301152033 286517670 272833656 259270732
14252B59270732j2960991j1949946j1957921j1388328r608724q512564j0013077
14245A82879181r098182p936718q035796p255064p430116o546943n968128n760481
14237A24847753n366752n237666n148403m690534m316771l941113l685591l982433
14229H8478490l502232l383707k853883l105947k919276k656840k550124k314886
14221F5191595k084413k324706k307951j867422j567932k124008j481009j640304
14213D9793850j395125j433947j614054j615141j219542r89784j096184r51653
14205C9478420j013310j451171p12426j161168r03525l46562j202762p94007j461014
14196C0432475m05384o49889o62142p09758n30666q24211p37256m38658p22407
$$ plain form
14252 259270732 246309741 234359795 222401874 211013546 201404822 192892258 182879181
14245 182879181 173780999 165844281 157808485 150553421 143123305 136576362 130608234 124847753
14237 124847753 119481001 114243335 109094932 104404398 100087627 96146514 92460923 88478490
14229 88478490 84976258 81592551 78738668 75632721 72713445 70056605 67506481 65191595
14221 65191595 63107182 60782476 58474525 56607103 55039171 52915163 51434154 49793850
14213 49793850 48398725 46964778 45350724 43735583 42516041 41526257 40430073 39478420
14205 39478420 38465110 37013939 36301513 35140345 34236820 33890258 32687496 31893489 30432475
14196 30432475 30027091 29377202 28715060 28005302 27474636 26650425 25913169 25474511 24752104
14187B4752104n64616p70190m44993k16548r50993k61215j30066o86943n79273
14178B0147267l92664j22341n32338j96151m82452l90100o95997j64146j69071
14169A7002007j89217o30133j71574m51886j18003k19793n26294l63510j30192
14160A4201405O1977k50637k31871l29104l72201r4809k82966j86542j08416l48976
14150A2057860k25748j01815m7116m11875m1487O4008m32437k9765r9846m58306
14140A0273473O6625j99788j67497l42345j1033r4143j74300k45429m5979n4648
14130I004936J64747k88822k71745R8858j95385k30636k78958j37725N2860K18105
14120H136235m05293P3484k35394j7608k1187n70718Q6325j49747J14615k52222
$$ plain form
14187 24752104 24187488 23417298 22972305 22755757 21804764 21543549 21413483 20726540 20147267
14178 20147267 19754603 19632262 19099924 18903773 18421321 18031221 17335224 17171078 17002007
14169 17002007 16812790 16182657 16011083 15559197 15441194 15221401 14695107 14331597 14201405
14160 14201405 14263382 14012745 13780874 13451770 13079569 12984760 12701794 12515252 12406836 12057860
14150 12057860 11832112 11730297 11683181 11271306 11229819 11293827 10861390 10831625 10731779 10273473
14140 10273473 10340098 10140310 9972813 9630468 9619435 9525292 9350992 9105563 9059584 9004936
14130 9004936 9169683 8880861 8609116 8707974 8512589 8281953 8002995 7865270 7918130 8136235
14120 8136235 7730942 7804426 7569032 7551424 7530237 6959519 7045844 6896097 7010712 6758490
14110F758490J31296j88155o9300j2542m42400L9647l87340J48665J41598l00484
14100E819475L68869k66001l75887L99551l24666k54979M71640m95433J85804
14091E528373K6879k94086j59704K10446L180p3234j50970j67322M56107m44824
14081D934845l20835K80404k26657N0153R1306k14568K16788j44667l30927K35908
14071D571750k99937j38025J6870J69980m3328o6582j18452K07031J12878j61172
14061D251013l61578L46030m63511J68565J90515k62383r1283M3636j08907K61019
14051C973116m21689k9162m2999J49992j03459l13349J97726n9400l436Q1877
14041C429217k21754J13075N6335n79131O50055m81286K88921j80392j69081J21563
$$ plain form
14110 6758490 6889786 6701631 6632331 6619789 6177389 6217036 5829696 5978361 6119959 5819475
14100 5819475 6188344 5922343 5546456 5946007 5621341 5366362 5838002 5342569 5528373
14091 5528373 5555252 5261166 5101462 5311908 5315088 5241854 5090884 4923562 5379669 4934845
14081 4934845 4614010 4894414 4667757 4717910 4809216 4594648 4811436 4666769 4335842 4571750
14071 4571750 4271813 4133788 4150658 4320638 4277310 4210728 4092276 4299307 4412185 4251013
14061 4251013 3889435 4235465 3771954 3940519 4131034 3868651 3777368 3821004 3712097 3973116
14051 3973116 3551427 3522265 3479266 3629258 3525799 3212450 3410176 3350776 3347340 3429217
14041 3429217 3207463 3320538 3376873 2797742 3447797 2966511 3255432 3075040 2905959 3027522
14031C027522n7556k30903J59732J60778J17823Q46k55457k34212K84719m354
14021B968938m35485L32717k28314P4875j57694p6998L12831n31277J85452P8419
14011B523464j68219j6538K64165l4730k59134l7061k73477M23347n22905J15667
14001B014579K68369o4878O9861n288k99430J35211Q790K8376M0550J50460J07008
13990B453608N54297J608004K728045N731562J4466085J7944900k0510534j1526309
13982A3449658n458424k073646j370782n45102j81596k49508q25690M67406p48473
13973B463843K43074J23097k17248l78215J55614O7121o5596K50539m48447l6960
13963B156822L25604n50418K00847J37881k97977M9797n5268M55973k41479k12303
$$ plain form
14031 3027522 2969966 2739063 2898795 3059573 3177396 3178242 2922785 2688573 2973292 2968938
14021 2968938 2533453 2866170 2637856 2712731 2555037 2478039 2790870 2259593 2445045 2523464
14011 2523464 2355245 2338707 2602872 2568142 2309008 2271947 1998470 2421817 1898912 2014579
14001 2014579 2282948 2218070 2287931 2282643 1983213 2118424 2127214 2155590 2196140 2346600 2453608
13990 2453608 3007905 4615909 7343954 13075516 27541601 45486501 24975967 13449658
13982 13449658 7991234 5917588 4546806 4001704 3820108 3570600 2744910 3212316 2463843
13973 2463843 2706917 2830014 2612766 2234551 2390165 2457286 2391690 2642229 2193782 2156822
13963 2156822 2482426 1932008 2132855 2270736 1972759 2022556 1967288 2423261 2181782 1969479
13953A969479K61465m77278P8004L16556l43096J55993k05312L22047q8992m09912
13943A578954M76892r7910k12114M6932j14l2999j33512M2532K78915n95959J52306
13932A503923O5381J78223n8181j98537K92220p4062j73377j64952J07927n6605
13922A421960K13595M9065K38607o41524J8093K42294J31220p7787O3633k0811
13912A638345m77810L37037j14773J71692l77289J84737J14369j83688J13511
13903A406131K88914l06880m07131P58076m24207K32989k95034o5051M42800l86394
13893A244213o7905k1312k6389J88817L7920J45820k30599j14347L26877k31762
13883A251333j46265J53974J53805l65118K36404r495j75027K55973k44803J17247
$$ plain form
13953 1969479 2230944 1753666 1831670 2148226 1805130 1961123 1755811 2077858 1988866 1578954
13943 1578954 2055846 1957936 1745822 1792754 1792640 1759641 1626129 1668661 1947576 1351617 1503923
13932 1503923 1569304 1747527 1689346 1490809 1783029 1708967 1535590 1370638 1478565 1421960
13922 1421960 1635555 1684620 1923227 1281703 1299796 1542090 1673310 1595523 1659156 1638345
13912 1638345 1160535 1497572 1382799 1554491 1177202 1361939 1476308 1292620 1406131
13903 1406131 1695045 1388165 981034 1739110 1314903 1547892 1252858 1187807 1630607 1244213
13893 1244213 1176308 1154996 1128607 1317424 1355344 1501164 1270565 1156218 1483095 1251333
13883 1251333 1105068 1259042 1412847 1047729 1284133 1274638 1099611 1355584 1110781 1228028
13873A228028n4748n31284N69321o1073q9681o3970J58426j18233K00121j65310
13863A071597P4548k83049l1818L36473j36338J20984j7708K7136l89841L58321
13853A130305j17521J9793N8901N0435k52232L45921l23895K79307k89997O5773
13843I66790M0523k37563K24644j46807J36573r0444K0621J23480J22583l23871
13833H36529L09139p4262j81415j41485M03304P4306l33009J29003k56240M00040
13823A165910l26257K27155k81531j33184Q8033J50027R2338r8599J0550L4745
13813I29187j46542J48968l65904j26116N40560k93755l5315n6913K78025Q3846
13803I56041m57661J60801m6721N59236k99677K47885R7013D80084L34621k31101
$$ plain form
13873 1228028 1173280 641996 1211317 1150244 1060563 996593 1155019 1036786 1236907 1071597
13863 1071597 1146145 863096 831278 1167751 1031413 1152397 1134689 1161825 771984 1130305
13853 1130305 1012784 1032577 1091478 1141913 889681 1235602 911707 1191014 901017 966790
13843 966790 1007313 769750 994394 847587 984160 893716 914337 1037817 1160400 836529
13833 836529 1145668 1071406 889991 748506 1151810 1226116 893107 1022110 765870 1165910
13823 1165910 839653 1066808 785277 652093 740126 890153 982491 883892 894442 929187
13813 929187 782645 931613 565709 439593 980153 686398 651083 594170 872195 956041
13803 956041 498380 659181 612460 1171696 872019 1119904 1216917 480084 814705 583604
13793E83604J51655J83635j9253j09757P1350q7839j89370K13142J94306k60455
13783G31018j45845L82639l34470j1200K75143q2041k32805j46366K90320j39550
13773E86843l1687K98554o8777J82254m32842L27411l74405J88634k02133L4728
13763E08580M14581m54545L11058K2257j09096K02278l44246K30315l09224J75799
13753F47757K56227m26001P8820p7815p9368K60930j83198J24031J53437l05824
13743D48996M2989r4332L31715j16675J68538r2033K9466j02787J15159k36033
13733D95003k184j1739J08254J32336M8076P400l72558K05540J07830K21225l75052
13722E64131o2049K20551j69689M2331n3666K23829l61478K03454p3980K12114
$$ plain form
13793 583604 735259 918894 899641 789884 861234 773395 584025 797167 991473 731018
13783 731018 585173 967812 633342 622142 897285 815244 582439 436073 726393 586843
13773 586843 555156 853710 784933 967187 534345 861756 487351 675985 473852 508580
13763 508580 923161 468616 779674 801931 692835 895113 550867 781182 471958 647757
13753 647757 903984 477983 556803 478988 399620 660550 477352 601383 754820 448996
13743 448996 491985 397653 729368 612693 781231 689198 718664 615877 731036 495003
13733 495003 492819 481080 589334 721670 769746 777146 404588 610128 717958 939183 564131
13722 564131 502082 722633 552944 595275 541609 765438 403960 607414 533434 745548
13712G45548k83127j4355K2532J7001R6372j87326K8709N5174j88113K38497R8149
13701F29061l4880j25391J76861k16571l6951L6685j80736K90573L25895k57430
13691F07116R8719l37022K25225k6369l4177K63636k13926j45420J46665r0244
13681D94203J90767j2244k01263j01193K50663N2926o3715K67046k01378k83213
13671C92599l6241K07747J09494B10685K46262Q5092k01719K14840q0703j17681
13661C56776Q8639A13971K66816Q7688j45837L92789j48141J8144k23554A62349
13650C56165J29910k01986j3017j06330J96818Q8379k2319M5384J31262D5225
13639E46500H3705N40978K36460B95278R4547j0995L43570l28375Q1838A79375
$$ plain form
13712 745548 462421 448066 470598 487599 583971 396645 425354 480528 292415 530912 629061
13701 629061 594181 468790 645651 429080 392129 428814 248078 538651 864546 607116
13691 607116 705835 368813 594038 567669 533492 797128 583202 437782 584447 494203
13681 494203 684970 672726 471463 370270 620933 673859 610144 877190 675812 392599
13671 392599 356358 564105 673599 210685 456947 542039 340320 555160 474457 356776
13661 356776 445415 113971 380787 468475 322638 715427 567286 585430 361876 162349
13650 356165 486075 284089 271072 164742 361560 449939 427620 473004 604266 45225
13639 546500 83705 624683 861143 295278 389825 378830 722400 394025 475863 179375
13628B45755K14076o2225m475J99214M4444k15481N4754N4906A55833k279K95384
13617D48938P3606r8004M9493H4826J29541J16282j17440K7860J64663R3050p1834
13606D26948j32800K64568k37895A44379J04786J74626r7713K02576k16132K96935
13596F09457B43144J04624n5114J99808A49947L70652j51006A15905O35093j37085
13586F13913k53218n960J62120A58099K60874A19850N04727H9233J68940L00666
13576E58839M2994A0212J04518M49839A43116J83900K1367I2580K59301p7813
13566B74068j6083B9923K44635J09222r8072J47185A71654J7748m2127l3847J71441
13555B84869M806r1614r4880K33475o5087K35005j79242E9807K69439L09023A65204
$$ plain form
13628 245755 459831 397606 393131 592345 636789 421308 476062 530968 155833 153554 448938
13617 448938 522544 424540 474033 84826 214367 330649 213209 241069 405732 498782 426948
13606 426948 294148 558716 320821 144379 249165 423791 326078 528654 312522 609457
13596 609457 243144 347768 292654 492462 149947 520599 369593 115905 750998 613913
13586 613913 360695 354735 516855 158099 418973 119850 624577 89233 258173 558839
13576 558839 601833 10212 114730 564569 143116 327016 348383 92580 351881 274068
13566 274068 257985 29923 274558 383780 285708 432893 171654 189402 147275 113428 284869
13555 284869 289675 198061 103181 336656 271569 506574 327332 59807 329246 638269 165204
13543A90164L43404m4408B31760K18615C0469L31501K63839A33279K50626K53183
13533F37088k54319k4551R2558j99356j15366J00372J22571R8116K22163k46803
13523D32473j12407K45989A50036M43169B4770L40537n8962m5195R9004I8583
13512f2056D99519j53898A2694K11043m8518F9336a33629B98240K5495R4914j64016
13501B54633J50151j40122L66080G4381M47161p7781A01063m7537J57926J97867
13491D09319j04338R2581c1582B95449J63959j52532C6987M66768q8830A06514
13480D72047H5273K01701r8565L85612b1130F70202j62798n5161j19449q4052
13470B48742C7776K86830J68569b18557e4565E34021B07587j7875J71614a1827
$$ plain form
13543 190164 533568 489160 231760 450375 30469 361970 625809 133279 383905 637088
13533 637088 382769 358218 450776 251420 136054 236426 358997 457113 679276 432473
13523 432473 320066 566055 150036 593205 24770 365307 306345 261150 360154 98583
13512 -62056 499519 345621 12694 223737 175219 69336 -133629 298240 323735 418649 254633
13501 254633 404784 264662 630742 74381 521542 443761 101063 53526 211452 409319
13491 409319 304981 397562 -31582 295449 459408 306876 36987 503755 414925 106514
13480 472047 85273 286974 188409 574021 -21130 670202 507404 452243 332794 248742
13470 248742 37776 324606 493175 -218557 -54565 534021 207587 189712 361326 -11827
13459A99267d1707H5210J85640k6859N26L5645j0442r8333J05601A28305K67973
13448C96278j08259a62597C24451P8970j12106j44080L67933k45514o4104F7429
13437B14629O2731j4955L5789K7970H6785L57659F1341J46422G3347J35293K42507
13426D51147B11762q5697L1495J39727k3997c4203J447D08795A17959b12972B66658
13414C20189a07743B29460h0993C93147E6560K00154M3969K2495a00685A36169
13403G0593a43307F9392O7386o1336j8442A8672K5072K66854A09058J63763K1481
13392B94302J07510o0686o1035O4283o9540D2182J40376J10953e6061B63964A29971
13380C1716K3362N04668k02771r7533q4883E1583K17398l5753j0803J34135l140
$$ plain form
13459 199267 -41707 85210 270850 243991 244517 280162 269720 171387 276988 128305 396278
13448 396278 288019 -162597 324451 403421 291315 147235 515168 269654 205550 67429
13437 214629 277360 262405 298194 326164 86785 444444 61341 207763 73347 208640 451147
13426 451147 211762 126065 157560 297287 273290 -34203 -32756 408795 117959 -212972 266658
13414 320189 -107743 229460 -80993 393147 56560 256714 300683 323178 -100685 136169
13403 70593 -143307 69392 136778 75442 57000 18672 43744 310598 109058 272821 294302
13392 294302 401812 341126 280091 344374 274834 42182 182558 293511 -56061 263964 129971
13380 31716 55078 559746 356975 259442 174559 51583 268981 233228 222425 356560 353420
13369C53420J15229I4164L97186A24372K26072a49081A36157b199n962A64913
13358A17820e2614B32925a26624i30C26686H2773J15391J22117j21839m6750d592
13346A10001K48300A53489J28516K53074j32017A33918J20559J23565F3425J0950
13336G4375K30889H7208J47344J14395j27010p1081K92253A17162P3796K28796
13326D19754j65611Q4639J49667B06534k3288P7564P6323N7105o7953A37247J04105
13315B41352N2282L88483A91260o2191M16819j85067n069q0488J30901M42217
13305H48382B25239J54373E9601K91607A806J92526J13124A22017a17364C54269
13294A46528J69511j23186J24644J19898A88610F1807J88969K2734A34053D5322
$$ plain form
13369 353420 468649 94164 491350 124372 350444 -149081 136157 -2199 -8161 164913
13358 117820 -52614 232925 -126624 -930 326686 82773 198164 320281 198442 151692 -4592
13346 110001 358301 153489 282005 535079 403062 133918 254477 378042 63425 74375
13336 74375 305264 87208 234552 348947 221937 150856 443109 117162 190958 419754
13326 419754 254143 338782 488449 206534 183246 260810 337133 394238 326285 137247 241352
13315 241352 293634 682117 191260 129069 545888 360821 355752 275264 406165 848382
13305 848382 225239 379612 59601 351208 1806 194332 307456 122017 -117364 354269
13294 146528 316039 192853 317497 437395 188610 61807 250776 273510 134053 45322
13283A18664K86445j00879E5511K76207j60719E0417J57559o6777j912b7848C89119
13271D0648a13450A42569M0893l3091D5902J58646h6152G2R5985K18626K66121
13260E80804k42134f2032B96798l9457g6280A97640E5046J97534P8836I1664J4480
13249A06144J10840K74487k04913q5049j8175J8740p409F2976P5230i3637I1736
13237b26734a06472E44836A7392P5458L0684J1927a89876A85406J8902o6388m2
13226A37878G164L49148A3711J45862j2490J70628A40687F7827K1195J63934d0953
13214B5484K12561a9342i79F8172b9923B41754H852K07319C174N7011R194J01725
13202A71104b12151C10002d1438F253L96763a81283O2852A48647n6858J6121O028
$$ plain form
13283 118664 405109 304230 55511 331718 170999 50417 207976 141199 139287 -27848 389119
13271 40648 -113450 142569 183462 150371 45902 204548 -86152 72 96057 314683 580804
13260 580804 338670 -62032 296798 257341 -76280 197640 55046 252580 331416 91664 106144
13249 106144 216984 491471 286558 201509 183334 202074 194665 62976 138206 -93637 91736
13237 -226734 -106472 544836 17392 92850 123534 135461 -189876 185406 204308 137920 137878
13226 137878 7164 356312 13711 159573 147083 317711 140687 67827 89022 252956 -40953
13214 25484 238045 -19342 -979 68172 -29923 241754 8852 216171 3174 60185 69379 171104
13202 171104 -212151 310002 -41438 6253 403016 -181283 -118431 148647 91789 107910 113938
13191A13938D9369K0496k2771J22998h5437K6311A0283J29228A4338a7757j10483
13180a28240B07524d967B58915b52708A71034h1658B42254g9917b5957G9209a15578
13168D19765l6785c7666E5716A2349i0253C9033J54602c3508A42600J38406j08222
13157A72784J6750f3254A45416J35739B6653a60933C06697i5329B59261h0011
13146A33665E0662L53705b6916A31399B6689b11314c4404I6900J22176a32195
13135g5835n9568Q394H185f0974A87440K31332g4113E2513e0990B08799n1009
13124A57790J27147n5620d0060D8314J25549F6548b6408j2487G5667K10854a1948
13112b70708K7025a4001j27942B97454j40787O1706d7475j5305E8427h8940I4359
$$ plain form
13191 113938 49369 69865 47094 170092 -85437 -59126 10283 139511 14338 -17757 -128240
13180 -128240 207524 -4967 258915 -252708 171034 -81658 242254 -79917 -25957 79209 -115578
13168 419765 382980 -37666 55716 12349 -90253 39033 193635 -33508 142600 281006 172784
13157 172784 189534 -63254 145416 281155 26653 -160933 306697 -95329 259261 -80011
13146 133665 50662 404367 -26916 131399 26689 -211314 -34404 96900 219076 -132195
13135 -75835 -135403 -127009 8185 -60974 187440 418772 -74113 52513 -50990 208799 157790
13124 157790 284937 229317 -40060 48314 173863 66548 -26408 -38895 75667 286521 -11948
13112 -270708 -243683 -14001 -141943 297454 156667 218373 -47475 -62780 58427 -88940 94359
13100B280J18483J24284d683G401P4393N32461H1231P4692f6320I0802K96586
13089C87388a4099A96519r4237J4041m5601M6415J00060a81939c7736B48617a83589
13077H3764K7130M6539O717P346D0916g1786B83558c2172F7788K32499C1026K23086
13065B54112p2024Q7290A26505b02151B77299M4922F9848c39358A53857M0150
13055A94007d35279f326q8367B33908P0174d2033A34027m3266K0244n3115K8533
13044H6423M5347K00930j37578o7536b04619I8555L7168J36701I4122J96913I6101
13032a16923B14688e7379n5943I879B048J47780k5150J35871L8318a41586F6474
13020B39280j5501H9833J10248c26995A10145Q6382l6728p4197J05853k5743J45482
$$ plain form
13100 2280 120763 245047 -4683 7401 81794 614255 81231 155923 -66320 90802 387388
13089 387388 -14099 196519 102282 116323 70722 117137 217197 -181939 -37736 248617 -183589
13077 83764 110894 157433 164150 171496 40916 -71786 283558 -32172 67788 300287 31026 254112
13065 254112 182088 269378 126505 -202151 277299 322221 69848 -339358 153857 194007
13055 194007 -435279 -6326 -94693 233908 304082 -42033 134027 90761 111005 57890 86423
13044 86423 131770 332700 195122 127586 -204619 98555 135723 272424 94122 291035 96101
13032 -116923 214688 -57379 -113322 9879 2048 149828 124678 260549 298867 -141586 66474
13020 239280 223779 89833 200081 -326995 110145 196527 159799 85602 191455 165712 311194
13009C11194f4144F2127g5823B15872l9297j1932i3705c3425D97748j67925A19007
12997B23856P8277b44950D72566A62296m4009K29945A49445I597J27747K53688
12987C91032j03749L9490a0874H9967K02420e882o7674J5753K0562G2670C499
12975a30592H390C489b1642e903p5931C703a17696d6914q242o5467C7580a01336
12962B4889b1806D147b73819g9044C66264j06456B0765J41265c0854A0590J98935
12951B09525E5692J76485e0963J3429A97076H2687d8388A96254J70754j24913
12941B42095h7029C9264b83613a34095l5756A12507C384J20045a27702D8900M4032
12930I2932a21245j4950A00060f2558j9271C6055Q215b21167A55941o0389b26647
$$ plain form
13009 311194 -64144 62127 -75823 215872 176575 164643 -93705 -33425 497748 329823 119007
12997 223856 302133 -244950 472566 162296 118287 348232 149445 9597 137344 391032
12987 391032 287283 326773 -10874 89967 292387 -5882 -73556 -57803 -37241 72670 3499
12975 -130592 8390 3489 -21642 -5903 -81834 3703 -117696 -46914 -55156 -120623 37580 -101336
12962 24889 -21806 4147 -273819 -79044 366264 259808 20765 162030 -30854 10590 209525
12951 209525 55692 232177 -50963 -37534 197076 82687 -48388 196254 367008 242095
12941 242095 -87029 39264 -283613 -134095 -169851 112507 3384 123429 -127702 48900 92932
12930 92932 -121245 -136195 100060 -62558 -81829 36055 44270 -221167 155941 95552 -226647
12918b55588D82929D0508a66750A81225b8740l4455k66645A58379e0644E1472
12907h6567F8642j6907a17096A29543n4230j7282K74840j03970o3308f1390E7645
12895C8522a8511B43235R7766A5978K12618b14888R8256A13644i1503c3542A2764
12883i7258B78890b36096A4931J26647k3794k8944m0906K40496a53849f2633D0315
12871a5591m2203B96727H5191h5494H5876J04943a63377C26237H6406a27050A11057
12859B09477q6497a04013j49762B52733B9095a42141a2931k2393F9911j6027K34889
12848B88773i9408d7402H2347a39643A44867E5055G978J06945b40295C36385a73739
12836a6211B99091d1749j43231J3177C9163d1399A50196a28346a3945H9364a33758
$$ plain form
12918 -255588 482929 40508 -166750 181225 -28740 -63195 -329840 158379 -50644 51472
12907 -86567 68642 51735 -117096 129543 75313 58031 332871 228901 165593 -61390 57645
12895 38522 -18511 243235 341001 15978 228596 -214888 -116632 113644 -91503 -33542 12764
12883 -97258 278890 -236096 14931 141578 117784 88840 47934 288430 -153849 -62633 40315
12871 -15591 -57794 296727 85191 -85494 85876 190819 -163377 326237 86406 -127050 111057
12859 209477 122980 -104013 -253775 252733 29095 -142141 -12931 -35324 69911 53884 288773
12848 288773 -99408 -47402 82347 -139643 144867 55055 7978 114923 -240295 336385 -173739
12836 -16211 299091 -41749 -184980 -171803 39163 -41399 150196 -128346 -13945 89364 -133758
12824H490a47933G0714B42K09543b34449G0240b64156Q2033H7453p871a61971
12812i8693M5132m8420C6275b70442a17565A08615J1476h7903E2570k2054Q790
12801C9306J19816A5474P4691J18713a9775B13943a47193N0456J6190A11697k3183
12790H8514J93066c37084E6298b56095B76561e5782p1405A84017e2992A09690
12779A8099a87858M3032j25699f4388C35J56692c62883D8353A4157J17457d519
12767e0610k10708C9009c5127j40711K4712C07288d9268A48826c4461B38399b8756
12755c916k9445B48770g5606B8769g7662A16448Q2022a04319I3008L7079D7934
12743a4794A12374L0704J32513C6794K60692b80609b8720B87075A18394c5372
$$ plain form
12824 8490 -147933 70714 242 209785 -234449 70240 -264156 -182123 87453 79582 -161971
12812 -98693 -53561 -101981 36275 -270442 -117565 108615 120091 -87903 52570 30516 39306
12801 39306 159122 15474 90165 208878 -19775 213943 -147193 -96737 -80547 111697 88514
12790 88514 281580 -337084 56298 -256095 276561 -55782 -127187 184017 -52992 109690
12779 18099 -187858 -144826 -270525 -64388 335 157027 -362883 48353 14157 131614 -4519
12767 -50610 -261318 39009 -35127 -175838 -151126 307288 -49268 148826 -34461 238399 -28756
12755 -3916 -33361 248770 -75606 28769 -77662 116448 198470 -104319 93008 130087 47934
12743 -14794 112374 143078 275591 36794 297486 -280609 -28720 287075 118394 -35372
12732g7141n7297c7378A0951M802J06916a20520H9020c77995a45910C37389e9998
12720E7917a98318I5306f191j65828g8482G3591a84084Q0229H9619K50076j29375
12709B10320Q5127P0457j49938R3572j06772K58977Q8732F7115J12183f8435D58793
12697a36220j0166c5428A78299q5980a23022P873j37442e6190I9949Q2762E0363
12685B6645J09934E137K11024J47815H4472d611j07494D20488F0381J779f5826
12673a81193f6313B63546h3615H5312e0500B29082d5055k06161I8061J00313f4689
12661c46334C6521a82858B83465O5971j38639m5073o4572b21941A83014n4802
12651A28212k2454J18070k5784I3035g8179H7931c5197o0357j01165A51371m7619
$$ plain form
12732 -77141 -134438 -37378 10951 15753 122669 -120520 89020 -377995 -145910 337389 -59998
12720 57917 -198318 95306 -6191 -172019 -78482 73591 -184084 -103855 89619 339695 210320
12709 210320 295447 365904 215966 309538 202766 461743 550475 67115 179298 -68435 458793
12697 -136220 -146386 -35428 178299 92319 -123022 -115149 -252591 -56190 99949 182711 50363
12685 26645 136579 5137 216161 363976 84472 -4611 -112105 420488 60381 62160 -65826
12673 -181193 -66313 263546 -83615 85312 -50500 229082 -45055 -251216 98061 198374 -64689
12661 -346334 36521 -182858 283465 349436 210797 165724 101152 -221941 183014 128212
12651 128212 105758 223828 198044 93035 -78179 87931 -35197 -95554 -196719 151371 103752
12640A03752J43277b87641A19868J6883E1843k5728B908a05643h17j82858A83753
12628B49594q4148j5136k4889J03883c14733d9641G9793n895J4953B7377J60185
12617A87562a16416o4898P7080a8894N886C02094r1906E6437K26699A37215a90003
12605A24816D2155a61248B5712K3522a32875f093k36698D18240c09098O2473A30354
12593C36981b8782I7736J17691a01049F8250h1449B71549j29603e3622F4466a36611
12581D63952I5265J8054k3443a62675P6470A4258b03790D04118p9196j57262a97189
12569B92395a95060N9810k9657P9310A86760G5438C6894a13748j67015E0018b00154
12557A4293e0506A10745R8440g9593j17186b2865j73321E7441i5288A7850a10743
$$ plain form
12640 103752 247029 -287641 119868 136751 51843 26115 2908 -105643 -817 -183675 183753
12628 249594 165446 150310 125421 229304 -314733 -49641 79793 73898 88851 27377 187562
12617 187562 -116416 -181314 -104234 -18894 -13008 302094 210188 56437 283136 137215 -190003
12605 124816 42155 -161248 25712 49234 -132875 -6093 -242791 418240 -309098 -246625 130354
12593 336981 -28782 97736 215427 -101049 68250 -81449 271549 141946 -53622 64466 -136611
12581 463952 95265 113319 89876 -162675 -86205 14258 -203790 404118 324922 167660 -197189
12569 292395 -195060 -135250 -164907 -85597 186760 75438 36894 -113748 -280763 50018 -200154
12557 14293 -50506 110745 209185 -79593 -196779 -22865 -196186 57441 -95288 17850 -110743
12545H4731a22372A76065d2923A9407a42940d3132i30B24787a31256k557a0044
12533A71693F2217f2210A15927C5735K03136a11040D6071O2630m0632J56700I0161
12521h305j00989J0284K8189D9568j390a9791Q039B3774J08171F3M4123J61935
12509B06121q5737b08595G9498e5193l4241K9735B47969J5620a20313K1945c7507
12497b8163k54205e8082A35882j6764a07590d3094j88734c4363B0634a42360A43825
12485A32934a28252a1776E2953A3483c56173A03140n1087b53773a5543o129b680
12473A31962a51559F51M99181A19392j6855N2744a46001j11824a09030k9388l9661
12462a78079B18737I7998A1042M9774J58232o6560L1209I1241b03405e4716A27986
$$ plain form
12545 84731 -122372 176065 -42923 19407 -142940 -43132 -930 224787 -131256 -133813 -10044
12533 171693 62217 -62210 115927 35735 238871 -111040 46071 108701 68069 224769 90161
12521 -8305 -109294 -99010 -70821 49568 48178 -19791 -11752 23774 131945 63 44186 206121
12509 206121 120384 -208595 79498 -55193 -89434 -59699 247969 263589 -120313 -98368 -37507
12497 -28163 -282368 -58082 135882 119118 -107590 -43094 -231828 -34363 20634 -142360 143825
12485 132934 -128252 -11776 52953 13483 -356173 103140 52053 -253773 -15543 -21672 -2680
12473 131962 -151559 651 499832 119392 102537 155281 -146001 -257825 -109030 -138418 -178079
12462 -178079 218737 97998 11042 60816 219048 152488 183697 91241 -203405 -54716 127986
12450I3564b62389c8077o6050B74702i4563k45273A10382O0065o0969M2121b9288
12438b04713A1162a51946B0559b83568D725a64321j99400I995N0484d8600a3766
12426B44553a09726A74616d5640j00562b4196B11904c5029J5797F3336P1956A1033
12414B32752J94840h8775A96276J3424L8289d054B2286e1034o349K3022A98054
12402B77413a57380K4190b5089q4072E7914Q1844a03986D0471J87732h6434K6738
12391e9696D3637b9527B57858I8466K3726A9558f4727D1486K14270o6913O0700
12380B49543H6701a76192A33168a58919A35576K3857Q5729n1149Q7740c24150
12369a09903K5747F5646d7265A00212J22562n2876K2650g5153B00781a43107C4877
$$ plain form
12450 93564 -262389 -38077 -104127 274702 -94563 -339836 110382 170447 109478 151599 -29288
12438 -204713 11162 -151946 20559 -283568 4725 -164321 -363721 9995 60479 -48600 -13766
12426 244553 -109726 174616 -45640 -146202 -24196 211904 -35029 -19232 63336 135292 11033
12414 232752 427592 -88775 196276 209700 247989 -4054 22286 -51034 -57383 -34361 198054
12402 277413 -157380 -133190 -25089 -109161 57914 139758 -103986 40471 228203 -86434 -59696
12391 -59696 43637 -29527 257858 98466 122192 19558 -64727 41486 255756 188843 249543
12380 249543 86701 -176192 133168 -158919 135576 159433 245162 194013 281753 -324150
12369 -109903 -84156 65646 -47265 100212 222774 169898 192548 -75153 200781 -143107 34877
12357c03635n6808A68206b33883h3414a9779m3097E2043M08477j54715b6892C46776
12345g6837j10815C59950A26573J94508b44216B41279H9021d7434b1978A82902
12334e4373K6372A24228D8077P37905F816M28772G731J22586Q7260j5922b38431
12322C05081F3432K02342a5856I6582L79570e4649q7727j3496D52190A9420J68496
12311A87916g6963G4613K37471a65975e7295D16045h683l1040F5408N1318b15065
12299a72053f6336k8417b4855k40377D9847k0774a9559A61105M754b8569A67519
12287a07751C06707C7868C889g680A08257J19476k6596L5646G4206Q3615O6534
12276B24355K3591h4859A14873a57199A0446M0662J35820a97085B83171J28J16721
$$ plain form
12357 -303635 -360443 168206 -233883 -83414 -19779 -62876 52043 460520 305805 -26892 346776
12345 -76837 -187652 359950 126573 321081 -244216 241279 89021 -47434 -21978 182902
12334 -54373 -28001 124228 48077 785982 6816 435588 7731 130317 217577 201655 -238431
12322 305081 63432 265774 -15856 96582 476152 -54649 -142376 -155872 452190 19420 187916
12311 187916 -76963 74613 312084 -165975 -57295 416045 -8683 -39723 65408 116726 -215065
12299 -172053 -66336 -94753 -24855 -265232 49847 29073 -19559 161105 165859 -28569 167519
12287 -107751 306707 37868 3889 -7680 108257 227733 201137 236783 74206 157821 224355
12276 224355 247946 -84859 114873 -157199 10446 51108 186928 -197085 283171 283299 400020
12265D00020A91316K07954A79395a205A39511n427P4364c41191c3798A79514A0695
12253a08826A88497a401E3101a3818k28617B27862C6314j4090L49203e5580A84602
12241i0421K6265D13980A95810a58716B00813P4571a60353E480c9279F3966J61487
12230B25453I2499K87413F6277R2090J43967R0074A10993J12264j8102j1435O7486
12219B61206B7711L32319J18619J10955k74910P5313A62567a33626B54268J33999
12209C88267A37174J03656A742f655j6713A65536G2682j5507L25157j67657F8744
12197a9356q1749A75466G5201a99500B27093P6226a16094B48671q6975C1706L28005
12186C59711A72823e9037p223B8343J45683J45023A17472J72249a13265B89136
$$ plain form
12265 400020 191316 399270 179395 -1205 139511 134084 208448 -341191 -33798 179514 10695
12253 -108826 188497 -1401 53101 -13818 -242435 227862 36314 22224 371427 -55580 184602
12241 -90421 -64156 413980 195810 -158716 200813 275384 -160353 5480 -39279 63966 225453
12230 225453 92499 379912 66277 158367 302334 392408 110993 223257 205155 193720 261206
12219 261206 27711 360030 478649 589604 314694 390007 162567 -133626 254268 388267
12209 388267 137174 240830 1742 -6655 -23368 165536 72682 57175 382332 214675 68744
12197 -19356 -101105 175466 75201 -199500 227093 303319 -116094 248671 161696 31706 359711
12186 359711 172823 -59037 -66260 28343 174026 319049 117472 289721 -113265 289136
12175B15746L63544B0253K22598J23934B1613P4446l413P3482K07849n5829m6046
12164B72102J96097k23101j18411J05912r7860E1697N3155N8760J23424A22217
12153e750B39000p0120O3361K16045D6785Q4538C6324O1155k0282k1658K35591
12142B91130a57659K4538b2323H8387J03128l3582a60332B5965p625K53976C8977
12130C86353c4569A24249J92072H2899k1589a50392D12547k02366c21332B57810
12119H8929j7483J43943A05686b10330D14L07420m4564C1088J78011p3228Q4015
12108B19886m4514a9643B04885e203p4602D7023M5071J63518m6605j2526N1610
12097B48091L9065a0998A14837A7434J62707C9568L03984a77684A55665a7269
$$ plain form
12175 215746 579290 20253 242851 366785 21613 96059 92646 166128 373977 318148 272102
12164 272102 468199 245098 126687 232599 134739 51697 104852 163612 287036 122217
12153 -5750 239000 168880 232241 448286 46785 131323 36324 97479 77197 55539 291130
12142 291130 -157659 -133121 -22323 88387 191515 157933 -160332 25965 18340 272316 38977
12130 386353 -34569 124249 316321 82899 61310 -150392 412547 210181 -321332 257810
12119 88929 71446 215389 105686 -210330 414 307834 263270 31088 209099 135871 219886
12108 219886 175372 -19643 204885 -5203 -79805 47023 92094 255612 209007 196481 248091
12097 248091 287156 -10998 114837 17434 180141 39568 343552 -177684 155665 -17269
12086a05440C0631J28629R7694g430C70669E5510J7669M21641A27524D8672O381
12075E5053a01525F7293k3823J99621j04361o1631a46189B10122m379D7737J56427
12064B04164b29544G0286B1924e4677B19020b04330G3746j4457J23073C018b84182
12052B39592q0052b41104Q6642A10340a62537E3232a05819A5642h6974A21934
12041b4739o8668C56629a0899A87293n4415a98865a582l68725a05509C55004j59496
12030A95508D4847a2457p4101D2509J7659K96226i5830A33294e4503A913P666
12019I579b45306Q5726C4262g8182b5766B56874p6679a08831F0883J00742J24589
12008B86214j33732a08071A91719O333e6242C22444b73703J27591A18425a38679
$$ plain form
12086 -105440 30631 159260 256954 -7430 370669 55510 73179 494820 127524 48672 55053
12075 55053 -101525 67293 43470 243091 138730 77099 -146189 210122 205743 47737 204164
12064 204164 -229544 70286 21924 -54677 219020 -204330 73746 59289 182362 3018 -284182
12052 239592 159540 -241104 -154462 110340 -162537 53232 -105819 15642 -86974 121934
12041 -24739 -93407 356629 -10899 187293 132878 -198865 -1582 -370307 -105509 355004 195508
12030 195508 44847 -12457 -86558 42509 60168 356394 -95830 133294 -54503 1913 9579
12019 9579 -245306 -159580 34262 -78182 -25766 256874 180195 -108831 60883 161625 286214
12008 286214 152482 -108071 191719 198052 -56242 322444 -273703 -146112 118425 -138679
11997f2393A77877L4320g0234K5483E4790K83501a53991B70090A18272a42034
11986g2635o4750B16967a83775b7618m7499o4679E6264c4017J281C8834F920Q6646
11974I3566K65622h6679p3414p874d445A34358E0774K40058e9109j35553B17859
11962a05059B9391N9447l7563J55499K8469i301r2442B08281a12051M7135n964
11951g0880B7828P0421b2382I0248a82156O9933B19958b40151D3261a16383B2440
11939a16069A36221a59961A69196o3258C4651c1430C13085G6767a84940H3092
11928a26765D35171j02458c05938a08272d8488I0374b49614B04635a82378B5898
11917C40370a18586n1346A83204h0222c9594k0927j82870O0521F0497K12995b37496
$$ plain form
11997 -62393 177877 212197 -70234 -44751 54790 338291 -153991 270090 118272 -142034
11986 -72635 -137385 216967 -183775 -27618 -75117 -139796 56264 -34017 -32736 38834 6920 93566
11974 93566 359188 -86679 -160093 -167967 -4445 134358 50774 290832 -59109 -194662 217859
11962 -105059 29391 88838 51275 206774 235243 -9301 -101743 208281 -112051 -64916 -70880
11951 -70880 27828 98249 -22382 90248 -182156 -112223 219958 -240151 43261 -116383 22440
11939 -116069 136221 -159961 169196 105938 34651 -31430 313085 76767 -184940 83092
11928 -126765 435171 332713 -305938 -108272 -48488 90374 -249614 204635 -182378 25898
11917 340370 -118586 -169932 183204 -80222 -39594 -60521 -243391 -182870 60497 273492 -237496
11905C76756d0740k8978B42875A7419b38820r2879R2580A58460J61111b39786
11894a69592A16870B5048J31131a99766P3791B65692i3492d393A78294r077a04789
11882A64929a969A96972M0330a77547L3906j59290j59876a36899I7229j3691l7620
11871D5918O6696l033J30671g8393B97337A1482R0464B5945M55446G6576h1815
11859a45686k8700D42462a023I4769P9170a66522k9196G4590J56848d45246f8093
11847a07205n7514c659p0183A43237h2125k73217F7508c8346k48953b7603B6231
11835a34019B24683k2681o660f2972A8211b08972h9511p6888k17693A57276A9037
11823d9327A59626g2232j85186A90121D360a21235c6835A82103a45552d188n8067
$$ plain form
11905 376756 -40740 -69718 242875 17419 -238820 -331699 -239119 158460 319571 -239786
11894 -169592 116870 25048 156179 -199766 -125975 265692 -93492 -4393 178294 169217 -104789
11882 164929 -1969 196972 237302 -177547 -143641 -302931 -462807 -136899 97229 83538 45918
11871 45918 112614 109581 240252 -78393 297337 11482 101946 25945 481391 76576 -81815
11859 -145686 -174386 442462 -1023 94769 173939 -166522 -195718 74590 231438 -445246 -68093
11847 -107205 -164719 -3659 -73842 143237 -82125 -355342 67508 -38346 -287299 -27603 26231
11835 -134019 224683 202002 195342 -62972 18211 -208972 -89511 -166399 -384092 157276 19037
11823 -49327 159626 -72232 -257418 190121 4360 -121235 -36835 182103 -145552 -4188 -62255
11812f2255B09954d5528m8428B70511Q7121c68449a04914B20167a58254H4452
11801B00799a78424P9677a9524p3856k33808b2782j75262N581g3865k03870n3812
11790c31547J28607c8873o226j19457e1566A23573C1555b4993G7103b56917Q2342
11779a74575j8977o2707f3721A53681a33118E7291a21159B00288C5261h9129j17137
11768b06266C74J03938a47046a8021B16898F7285b02841M5778j13403g5800q620
11757h4420K2287P780A25237a81340i037A69836e0382j08179A73897d5799A07990
11745C164N9584K66597b88444c6597D9231M5766c0218l70027d3631A90791a47839
11733a7285k8864j11921A13395i0379E955c9895B62768q5479e9045D4465j0326
$$ plain form
11812 -62255 209954 -45528 -93956 270511 357632 -368449 -104914 220167 -158254 84452
11801 200799 -178424 -98747 -19524 -93380 -327188 -22782 -198044 -192463 -73865 -277735 -331547
11790 -331547 -202940 -38873 -45099 -164556 -51566 123573 31555 -24993 77103 -256917 -174575
11779 -174575 -193552 -256259 -63721 153681 -133118 57291 -121159 200288 35261 -89129 -206266
11768 -206266 374 104312 -147046 -18021 216898 67285 -202841 -157063 -270466 -75800 -84420
11757 -84420 -62133 -54353 125237 -181340 -9037 169836 -50382 -158561 173897 -45799 107990
11745 3164 62748 329345 -288444 -36597 49231 94997 -30218 -400245 -43631 190791 -147839
11733 -17285 -46149 -158070 113395 -90379 5955 -39895 262768 177289 -59045 44465 34139
11722C4139b5929j3669A95021f9461k0058A39019R3499J38380a36681A10459K87580
11711C98039G193Q643a2771A54765L3420i9906D0597f0755A24870j0798n6682
11700E7390j7928c59753g6676J5039N076B54780f1610E6972g2820j05564P8981
11689i9403j24912I6967L2373A8190J55914E8176J85048I4058a13412j43557C52243
11677A14538J00544K6085o4028A3120J89913D156J0547c4211C52783F2838a17351
11665b3970j74589D54670A70930H3609A7052g9193A24775a65443H8047A9127a53731
11653A81132E5704L2665a48741B15285q1591c3791A83267K41274g8232k9709F4480
11641C2186O3532K26594B2186Q1279a4108B23623D9030R5469D3204N1996B1149
$$ plain form
11722 34139 -25929 -39598 195021 -69461 -89519 139019 232518 370898 -136681 110459 398039
11711 398039 7193 15836 -12771 154765 188185 -99906 40597 -60755 124870 114072 57390
11700 57390 39462 -359753 -76676 -61637 -56561 254780 -61610 56972 -72820 -178384 -99403
11689 -99403 -224315 96967 129340 18190 174104 58176 243224 94058 -113412 -256969 352243
11677 114538 215082 241167 177139 13120 203033 4156 14703 -34211 352783 62838 -117351
11665 -23970 -198559 454670 170930 83609 17052 -79193 124775 -165443 88047 19127 -153731
11653 181132 55704 88369 -148741 215285 133694 -33791 183267 424541 -78232 -107941 64480
11641 32186 95718 322312 22186 103465 -14108 223623 49030 144499 43204 95200 21149
11629C53978j73754l9583b9615B17456a82307l256C1665K16491b77121A96896
11618E0076K32651B9651c0828A45112a3543k02723A62961a87443q9993q4801J50853
11607b11384E3491a3384j77600B4430J36402J1903M9006j0700L7604H0051a91226
11595b38920B58708G3061J10028e6368j20995b4756k38306J00614K7143e7308
11584f8912A50229m1029m6974c6145B20084E1011L4771L9397h2202C6108K2681
11573E8789J57134R8054A29787F0269J31107K46895A17815B4286N0722K70696
11563C45704h8418L0615a4680D13212c53230E2139B4635a06456C40568B8832K04056
11552B32888M1721g9504o3848B15131C8917c9962r463A12528j0188a8079j52870
$$ plain form
11629 353978 180224 140641 -29615 217456 -182307 -185563 31665 248156 -277121 196896
11618 50076 282727 29651 -30828 145112 -13543 -216266 162961 -187443 -277436 -362237 -211384
11607 -211384 53491 -13384 -190984 24430 160832 172735 221741 211041 248645 80051 -191226
11595 -238920 258708 73061 183089 -56368 -177363 -24756 -263062 -162448 -135305 -57308
11584 -68912 150229 109200 62226 -36145 220084 51011 85782 125179 -82202 36108 58789
11573 58789 215923 313977 129787 60269 191376 438271 117815 24286 75008 345704
11563 345704 -88418 -57803 -14680 413212 -353230 52139 24635 -106456 340568 28832 232888
11552 232888 274609 -79504 -143352 215131 38917 -39962 -49425 112528 102340 -18079 -170949
11541a70949A70871J59478A32426a42044F9129l0550g1939f366I7843i5706E38087
11529G2909Q2294A6965a88755B08008i785G4312a03675H5195J06961L07I5851
11517a79627A1560N5462a30363A10932j0068J90979D3146K22875H9963L05770
11507C95733D6088a05027B29471g7706B20437J14922A58363p8083a24995l13083
11497d38078h343B18970e1430B624P8546k1802M039K1191J48386l2370J21381
11486C21995g9057A36091a78268D3729J48928N6851q8308b2739B77108a0488A43900
11474a46850A89141Q8680p9098k3340p1413A4666d6928H3696B5265L46845H831
11462d8173H9803c4101B90645C9982L40192A76395L9284P3121f8164C33558r8647
$$ plain form
11541 -170949 170871 330349 132426 -142044 69129 38579 -71939 -6366 97843 -95706 538087
11529 72909 155203 16965 -188755 208008 -9785 74312 -103675 85195 192156 192463 95851
11517 -179627 11560 67022 -130363 110932 100864 291843 43146 266021 89963 395733
11507 395733 46088 -105027 229471 -77706 220437 335359 158363 80280 -124995 -438078
11497 -438078 -8343 218970 -51430 2624 81170 59368 63407 84598 232984 200614 321995
11486 321995 -79057 136091 -178268 43729 192657 249508 161200 -22739 277108 -10488 143900
11474 -146850 189141 277821 198723 175383 103970 14666 -46928 83696 25265 372110 8831
11462 -48173 89803 -34101 290645 39982 380174 176395 215679 288800 -68164 333558 234911
11451B34911B8415J92526C9137J0845a30328O3831H4923f1352K5462C18905e9395
11439A65992p3185R0379K09860f6783G8646J5342J38839a20427n0235h3416c6756
11427A88303P8103b90646a38661A79693g9583B88186A25824l8231b82154j0272
11417b92426B29479J0876o6736b17049e3248k26130D3815K3025a14043m6825O5449
11406i5419p3733c6545j83632B8970J87015k6475h9490K4661A76713m2271c82111
11394a08049K7987F4769A588J55354b36316B1729f583F1568c69537F3108d9323
11382B1028b89684c5425B42332F4116J278b13803I117K30895f7312j64450A65767
11370C31853b29461I6495K8360a08100c6010p4018k11155C27765A07928a10006
$$ plain form
11451 234911 28415 220941 39137 49982 -130328 -66497 84923 -61352 -35890 318905 -59395
11439 165992 92807 183186 393046 -66783 78646 93988 232827 -120427 -170662 -83416 -36756
11427 188303 266406 -290646 -138661 179693 -79583 288186 125824 87593 -282154 -292426
11417 -292426 229479 240355 173619 -217049 -53248 -279378 43815 66840 -114043 -160868 -95419
11406 -95419 -169152 -36545 -220177 28970 215985 189510 -89490 -64829 176713 134442 -382111
11394 -108049 -80062 64769 1588 156942 -236316 21729 -6583 61568 -369537 63108 -49323
11382 21028 -289684 -35425 242332 64116 65394 -213803 9117 240012 -67312 -231762 165767
11370 331853 -229461 96495 124855 -108100 -36010 -110028 -321183 327765 107928 -110006
11359A38897h2965B7470a88496C72567a2396I8745a3062C954b3991j17812A6255
11347a93211j6448n3634A00226a9677p2150F82N707b82531i4108L7876D9689N4994
11335A04683D0892a23912j15051B01642a6484j88520B73312a26146e5731I0679
11324B76680G0466b8380l32973A87000b96627F1414J17326K28548j53776A8425
11313c01887B68124j13622M2287I0213a37029G939c95577F7076b17419F6430b1502
11301h3699B37958I8016l1855K15134F6902a41025k85899A95396A4144e2015C6836
11289D9518P0999m280k0236K14325b3837j1691C44806A06548O2786j7446a65053
11277a54754N0773e0976a7166o6313j72534A59670M7105a29531I3958a06183A22823
$$ plain form
11359 138897 -82965 27470 -188496 372567 -12396 98745 -13062 3954 -23991 -141803 16255
11347 -193211 -209659 -263293 100226 -19677 -91827 682 6389 -282531 -94108 -56232 49689 104683
11335 104683 40892 -123912 -238963 201642 -16484 -205004 273312 -126146 -55731 90679
11324 276680 70466 -28380 -361353 187000 -296627 61414 178740 407288 253512 18425
11313 -301887 268124 154502 196789 90213 -137029 7939 -395577 67076 -217419 66430 -21502
11301 -83699 237958 98016 66161 281295 66902 -141025 -426924 195396 14144 -52015 36836
11289 49518 120517 116237 96001 310326 -23837 -35528 344806 106548 169334 151888 -165053
11277 -154754 -103981 -50976 -17166 -83479 -256013 159670 206775 -129531 93958 -106183 122823
11265F7276I873f4483j42852a1832j42124a9583f465A3883b68352c1857J5791
11254a6066C3447I321b04195j58241G722N3063a58349A55877c08606J31098r3384
11243b70892G0670b36225C71539b23241A30202B5125h5741m4673B9567J66596
11233A96163M9029b5721j29964C24295c18948h7660D6149a57096B5631M7881a94202
11221c66209J42924M233f5049H0432d29236A04307N6686b9671j54769B35576D9113
11209h1737J0853C3368f7598q071n1819d4986R209l4312A6817J91584b15468P226
11197b08242H1706a12005j41028A6225a9880k96387J13969g1076A28554f9907
11186a43878A845c05587e5143k2102n9422j3998B4938c89895A51513J7898E3998
$$ plain form
11265 67276 9873 -64483 -207335 -11832 -153956 -19583 -6465 13883 -268352 -31857 -16066
11254 -16066 33447 9321 -204195 -362436 7722 60785 -158349 155877 -308606 -177508 -270892
11243 -270892 70670 -236225 371539 -223241 130202 25125 -85741 -130414 29567 196163
11233 196163 245192 -25721 -155685 324295 -318948 -87660 46149 -157096 25631 73512 -194202
11221 -366209 -223285 -219052 -65049 80432 -429236 104307 160993 -29671 -184440 235576 49113
11209 -81737 -70884 33368 -67598 -75669 -127488 -44986 -35777 -70089 16817 208401 -215468 -208242
11197 -208242 81706 -112005 -253033 16225 -19880 -316267 -202298 -71076 128554 -69907
11186 -143878 1845 -305587 -55143 -77245 -136667 -150665 24938 -389895 151513 169411 53998
11174B3327f9343H1881e7050A31637f0407a0205r6427A28263c5363C33218b31150
11162b05148E3445J01184f4843E0409k2278c4864E1911Q2153a59471j56792J01701
11151b14562n7608B42220a90679h5880B23798a0623j05471E7103a9066A0486e0302
11139D9373K9463b26999M2143m4027Q8729B5619Q6303Q338E5302a4345A30466
11127G0831b5174j17788B15622a03366B10186J26285c9830j1357k9055C0954p773
11116B3181Q4170f4475c1030j12043j00469B85233a18221A41726g4670D1055J70457
11105B11512b6352A70491D3255b40340B40489E2174A5095K51478n0307L09486
11095E25752c39156B18302a51506k8174c5699F6607L6017J8970J4517d3739K0332
$$ plain form
11174 23327 -69343 81881 -57050 131637 -60407 -10205 -106632 128263 -35363 333218 -231150
11162 -205148 53445 154629 -64843 50409 28131 -34864 51911 134064 -159471 -316263 -214562
11151 -214562 -272170 242220 -190679 -85880 223798 -10623 -116094 57103 -19066 10486 -50302
11139 49373 78836 -226999 -184856 -228883 -140154 25619 111922 120260 55302 -14345 130466
11127 70831 -25174 -142962 215622 -103366 210186 336471 -39830 -51187 -80242 30954 23181
11116 23181 107351 -64475 -31030 -143073 -243542 285233 -118221 141726 -74670 41055 211512
11105 211512 -26352 170491 43255 -240340 240489 52174 15095 266573 216266 525752
11095 525752 -339156 218302 -151506 -179680 -35699 66607 102624 121594 136111 -43739 -23407
11084b3407D0472J75777r1823r065K47906G2746J15328J8052K34130B19256N8206
11073B77462c3466A11393k1061g436A15675L44943K39194l22036M0853j04290
11063C14339J8607j8155J33206Q1958l1695k6496N437J4260P908l59N4381o5783
11051D87608j94605M60744j22924k08777Q5530K55457J35746m29621K02137J30632
11041H01927k9366M9929l06282J43736Q7190L01489m61959k3580J83309p1553
11031F74840j25382P8371P922Q9685p2782K30372j06504j37807l3655J35656J56323
11020H97039j9658m02277K19486p3672k26280N77750C53516J60143j13596R8608
11010D98671p6704L15207j56034B78820K13785L45927J5608j66487M036R5868
$$ plain form
11084 -23407 40472 216249 124426 115361 363267 72746 188074 206126 440256 219256 277462
11073 277462 -33466 111393 90332 -7436 115675 460618 699812 377776 418629 314339
11063 314339 332946 314791 447997 529955 498260 471764 477201 491461 499369 499010 553391 487608
11051 487608 293003 753747 630823 422046 507576 763033 898779 469158 671295 801927
11041 801927 772561 822490 516208 659944 747134 1048623 586664 563084 746393 674840
11031 674840 549458 627829 635751 725436 652654 883026 776522 638715 605060 740716 897039
11020 897039 877381 475104 694590 620918 394638 972388 353516 513659 400063 498671
11010 498671 421967 737174 581140 278820 492605 838532 854140 687653 691689 787557
11000G87557N6319D18322n9539L96225r5543k89600M76104N5257k15989k9450
10990F55787j42826n750K56412N9060J02438J45849k43969o8028k74883M56938
10980I41028J06992J7878n5876q239L97869l56774k6235M45936L66007j1555K57147
10969B074178J2080M8104K49206q7916J1736j54812M04482k80651L7691l31730
10959A982368p0433r6508j31453M7630k98808J03720L99445L701L0840n99909
10949A370593K74805o65067M10884o54932j44193L28388m26382N4442A83819P1697
10939B55516J27376r7253q2989A0178K07307k8129L228J63264D938b87940D05890
10927a98760K9673C9346b21935A61725N3060a57708L2646C9518c61048d4103C7723
$$ plain form
11000 787557 843876 418322 358783 755008 659465 369865 845969 901226 685237 655787
10990 655787 512961 507211 763623 822683 925121 1070970 827001 758973 484090 941028
10980 941028 1048020 1065898 1010022 1001783 1399652 1042878 1016643 1462579 1828586 1817031 2074178
10969 2074178 2086258 2134362 2383568 2295652 2307388 2152576 2557058 2276407 2314098 1982368
10959 1982368 1911935 1815427 1683974 1731604 1432796 1536516 1935961 1939662 1970502 1370593
10949 1370593 1645398 980331 1391215 736283 592090 920478 494096 548538 183819 255516
10939 255516 382892 285639 202650 10178 217485 189356 192584 355848 4938 -287940 405890
10927 -198760 -169087 39346 -221935 161725 214785 -157708 -125062 39518 -361048 -44103 37723
10915c36454C20654A19402E8127a20132l7931A13875L8201a37840A47549e5324
10904G8736b29057C321d7731J6855D3250c66162B69240r7957a74742b0029j6354
10893c6383k7998B37753a36394H0391a20433f044A3228Q4517c05148a44251f1021
10881a28062k8188b5363B45972E2741R3994a17684p1418O0577a940B0632a94985
10869a91177e2267D1407J25925a63510B06871d0843A26828k7854B0998K51353
10859B72351I2830a00834j67609J9144h1668J4683B42535b40699f2803r3336r1339
10848b47478H0014a61983A5028e6885I6558b12556J0411h9790B35278q141a21983
10836C2726a12274N3904b0798B33279F7678J92276a55238j26683P3879I2480A5478
$$ plain form
10915 -336454 320654 119402 58127 -120132 -158063 113875 152076 -137840 147549 -55324
10904 78736 -229057 3321 -47731 -30876 43250 -366162 269240 171283 -174742 -20029 -36383
10893 -36383 -64381 237753 -136394 80391 -120433 -6044 13228 97745 -305148 -144251 -61021
10881 -128062 -156250 -25363 245972 52741 146735 -117684 -189102 -128525 -1940 20632 -194985
10869 -191177 -52267 41407 167332 -163510 206871 -40843 126828 98974 20998 272351
10859 272351 92830 -100834 -268443 -249299 -81668 -66985 242535 -240699 -62803 -156139 -247478
10848 -247478 80014 -161983 15028 -56885 96558 -212556 -202145 -89790 235278 227137 -121983
10836 32726 -112274 -58370 -20798 233279 67678 259954 -155238 -281921 -208042 92480 15478
10824G5343b45749C5612L3633K29265b0618A2259d09912A7621c51343D2880b10673
10812c49101B39021a30889m2968I661i706q4172p4401A0313a01394B32948d3967
10800H2915K80369b98390a10852m9737j3211C4545P913a00700d9136E26950A77782
10788f5985l13494C5882Q6809m7046b79224J34317H320b11492g6113A19595a04157
10776f1675b8381o8302M4281a3846B56018f1186A5563f4761B16414a01316E9421
10764A10590c6959j06974L5501m8759N2292J6824C936a57343j09988j7707F85
10752a56397A91124j2105a66375F684e7147q4860D0271K17603d5655A01863b02789
10740C642a32658H2437k96b59622A27643a56304H2314b88787a23135A31487n3603
$$ plain form
10824 75343 -245749 35612 69245 298510 -20618 12259 -409912 17621 -351343 42880 -210673
10812 -349101 239021 -130889 -173857 9661 -9706 -93878 -168279 10313 -101394 232948 -43967
10800 82915 363284 -298390 -110852 -160589 -173800 34545 42458 -100700 -49136 526950 177782
10788 -65985 -379479 35882 122691 75645 -279224 -144907 8320 -211492 -76113 119595 -104157
10776 -61675 -28381 -96683 -52402 -13846 256018 -61186 15563 -64761 216414 -101316 59421
10764 110590 -36959 -143933 -108432 -157191 -104899 -88075 3936 -157343 -267331 -285038 685
10752 -156397 191124 179019 -166375 6684 -57147 -142007 40271 257874 -45655 101863 -202789
10740 3642 -132658 82437 82141 -259622 127643 -156304 82314 -288787 -123135 131487 77884
10729G7884c19895a11608F5120j2721a29601F2593b01196e4537D5948f3097A32982
10717a24292D1235J216a86945k00087A46246k2211c54908A74714h6082j40253
10707b26335B1859d04092a96406J9046B64473I5577O671J55104A01252I168P2074
10696H1242c04523e2619A48995j7156b47639f0704m0882j98609E7967M9438e159
10684b9328j93911A68196G834f7473j21657A08087A1966J9638J77490L089a43885
10672b67876h1580c0906B8454O0387b46660f4905j13635g0401m0088b0149k14516
10661b34665b3379I5021a41433B05968b66466k716e6090E2793b48555L3439B82980
10649b36624A8735M173a73154c1417B5814d21298R9330g8400L0741m8475a2349
$$ plain form
10729 77884 -319895 -111608 65120 52399 -129601 62593 -201196 -54537 45948 -63097 132982
10717 -124292 41235 42451 -186945 -387032 146246 124035 -354908 174714 -86082 -226335
10707 -226335 21859 -404092 -196406 -177360 264473 95577 102248 257352 101252 9168 81242
10696 81242 -304523 -52619 148995 131839 -247639 -60704 -101586 -300195 57967 107405 -5159
10684 -29328 -223239 168196 7834 -67473 -189130 108087 11966 31604 209094 212183 -143885
10672 -267876 -81580 -30906 28454 88841 -246660 -64905 -178540 -70401 -110489 -20149 -234665
10661 -234665 -23379 95021 -141433 205968 -266466 -269182 -56090 52793 -248555 -215116 282980
10649 -236624 18735 22908 -173154 -31417 25814 -421298 -321968 -78400 -47659 -96134 -12349
10637a76051N59e6073l24854A91016a94287R0283j52833K4287H4218d91635a12160
10625A45162b71809a07271r9767l29071A16525a42323M5263k14333A10050L0498
10615A40548c1199I8622b12412M5952d5517j81553B16325f0280D7282b98852h9466
10603b07423F2638g3847A39105a26953j93033g0406F444c21162d3054A7142a91128
10591A71403q0931a47814A92184d3482n0429k65175B1215j448d260B55631a70193
10579G1872c10798C6475a26942F06849f1036p5194C24024e5104j86634P7626j44382
10568c08494A72574J0827c3370j34509G9616l2378a38158l653B38847b9748l4654
10557f4402B10613c53298a63165F2607c43096G1377o21L24225E557a50538L5816
$$ plain form
10637 -176051 -175492 -56073 -380927 191016 -194287 -104004 -256837 -232550 84218 -491635 -112160
10625 145162 -271809 -107271 -207038 -536109 116525 -142323 -97060 -311393 110050 140548
10615 140548 -31199 98622 -212412 -166460 -45517 -227070 216325 -60280 47282 -298852 -89466
10603 -207423 62638 -73847 139105 -126953 -319986 -70406 6444 -321162 -43054 17142 -191128
10591 171403 90472 -147814 192184 -43482 -93911 -359086 21215 19767 -4260 255631 -170193
10579 71872 -310798 36475 -126942 606849 -61036 -136230 324024 -55104 -241738 -164112 -308494
10568 -308494 172574 183401 -33370 -167879 79616 47238 -138158 -141811 238847 -29748 -64402
10557 -64402 210613 -353298 -163165 62607 -343096 71377 70756 394981 5557 -150538 -114722
10546a14722B95944H2718B7762O9234b45034A54i5776j5883A71940J59272D6348
10534b2317A86672A5276M341L41261A78998a76000E0558d39753E3225J04175d9697
10522B47619i9878L5224J6479G4204P7839b25809B5723b57681A07759P3191a00405
10510F2634K41946H0592J81637i1088m1542r2018J01737e0734I7138a27834q8234
10499b16068O3235j25392j24330a7014l59682A19203a19140g636I397k162N4677
10488F1912N2591a0608k81142h8920C18518a84574a3193G3440A9439c9625B9399
10476A30405M23557I8941K24637K9526l3141Q7514A50303M9956H2624K15981c1942
10464b7375j8307l0103j40838I2686c33271h6556D0881b78445O2589G4519A2170
$$ plain form
10546 -114722 295944 82718 27762 96996 -245034 154 -95776 -111659 171940 331212 46348
10534 -22317 186672 15276 19617 360878 178998 -176000 50558 -439753 53225 157400 -49697
10522 247619 -99878 -64654 -48175 74204 152043 -225809 25723 -257681 107759 180950 -100405
10510 62634 304580 80592 262229 -91088 -132630 -224648 -122911 -50734 97138 -127834 -216068
10499 -216068 -152833 -278225 -402555 -17014 -376696 119203 -119140 -7636 9397 7235 61912
10488 61912 114503 -10608 -291750 -88920 318518 -184574 -13193 73440 19439 -39625 29399
10476 130405 553962 98941 323578 353104 319963 407477 150303 200259 82624 298605 -31942
10464 -27375 -45682 -75785 -216623 92686 -333271 -86556 40881 -278445 -215856 74519 12170
10452f6691B27783a50712g362l6800E5712b23523K579C3902d9404A60992b74652
10440A81168a45B54099p9865a41927I8920A0156c08002B25840h6466G6942a18068
10428b24619G0346a41986B45022B2511d3604a7767j74230A77549f2201A05097
10417H7682P3734b57731O6564I318K55408b56574M228B43989b17146J05893j22813
10406b34066k6165i0737j44743C77116a14113B2917b38126B11032b16688c8808
10395b07395f962j31227I15a39651F7412J69171b32781A14709K5540a7641B49147
10383b61876B0360a25421C8306a44869j63089B24170P2556a93506B49152C8897
10372I1411r149i7397B85329F7830K77137E2193K30444J75664B24030J19597K9934
$$ plain form
10452 -66691 227783 -150712 -7362 -44162 55712 -223523 -220944 33902 -49404 160992 -274652
10440 181168 -145 254099 174234 -141927 98920 10156 -308002 225840 -86466 76942 -118068
10428 -224619 70346 -141986 245022 22511 -43604 -17767 -191997 177549 -62201 105097
10417 87682 161416 -257731 -191167 9318 264726 -256574 -252346 243989 -217146 -111253 -234066
10406 -234066 -260231 -90737 -235480 377116 -114113 22917 -238126 211032 -216688 -38808
10395 -207395 -6962 -138189 915 -139651 67412 236583 -232781 114709 140249 -17641 249147
10383 -261876 20360 -125421 38306 -144869 -307958 224170 296726 -193506 249152 38897
10372 91411 82262 -97397 285329 67830 344967 52193 282637 458301 224030 343627 373561
10361C73561A62363a3410A94705J6147d134B06231k982C845J73650n1617K10801
10350C36679D6139L46160r6256J99669r4662N3490A85947J54133j19512J65251
10340C85819A06286J51446L7900N2202p6559A27948R7898K7225j25466g1961A03326
10328a1571A27312J44311F8230c6428a4483A53305h3947B31793H3728a40863A69535
10316C0276K65531B1101L47962a43431j253A60958a38110D6338d4105A0179a45975
10304a5739k18858g2519P29K8150j9680G4308a43609f984G4819K23929A23748
10292I4085j7630c35587A11298m7458a77151e0735A60946b91085J41987J8250
10282a30848l2226K5102A96112C6542J15761d4477m6202c1421l9932j96465G61
$$ plain form
10361 373561 162363 -13410 194705 210852 -4134 206231 203249 3845 177495 125878 336679
10350 336679 46139 392299 296043 495712 401050 454540 185947 340080 220568 385819
10340 385819 106286 257732 295632 347834 271275 127948 225846 253071 127605 -71961 103326
10328 -11571 127312 271623 68230 -36428 -14483 153305 -83947 231793 83728 -140863 169535
10316 30276 295807 21101 369063 -143431 -144684 160958 -138110 46338 -44105 10179 -145975
10304 -15739 -234597 -72519 -71790 -43640 -63320 74308 -143609 -6984 74819 298748 123748
10292 94085 76455 -335587 111298 63840 -177151 -50735 160946 -291085 -149098 -130848
10282 -130848 -163074 -137972 196112 36542 152303 -44477 -90679 -31421 -71353 -267818 761
10270A49356D7674c3869j0508m9249G5752a4201B6999a85971Q6615E5843a3474
10258a39478g026j19141H165J72136h0977A91521E9950L69176M7677q2927M6209
10247D40085A97714J71228A08880K61170b06404e5288I4851J04467D6007b91437
10236a61325N4440I7004b17481C3731J31359a97075A12836i8985p678K9817B35805
10224A18845h8384r2919k77942E3708e1544H1764j1907P4178c75789a02250j22648
10213b24898N8910B2031a19703c422A35257J06807b2844k93148A33402L4170g6601
10201b23450j69546E0045L7254J89783a08716j120K822M3085j30285e6068A40607
10189a25764B93767l6868o2808J41251a02456n7175C5407b47063h5723l296A42027
$$ plain form
10270 149356 47674 -33869 -44377 -93626 75752 -14201 26999 -185971 -99356 55843 -13474
10258 -139478 -7026 -126167 8165 180301 -80977 191521 59950 429126 476803 393876 440085
10247 440085 197714 368942 108880 370050 -206404 -55288 94851 199318 46007 -291437
10236 -161325 -106885 97004 -217481 33731 165090 -197075 112836 -98985 -106663 -76846 235805
10224 118845 -88384 -181303 -459245 53708 -51544 81764 69857 144035 -375789 -102250 -224898
10213 -224898 -165988 22031 -119703 -3422 135257 242064 -22844 -315992 133402 167572 -76601
10201 -223450 -392996 50045 87299 277082 -108716 -109836 -107014 -63929 -194214 -56068 140607
10189 -125764 293767 256899 194091 335342 -102456 -159631 35407 -247063 -85723 -89019 142027
10177G1625a63751D3953K51241D4118M5001A0171e7335R794j4A02345b52069i3412
10164I0670K80500e4375A9107K1930K48298b7841j93j46853O1153C55905a83594
10152a44905B94741a77693E5593N4826a50074O3776l3662j81449A60608J35433
10142B96041a24088B10615b4752A59706a71394A18555b5849L490A05799d26599
10131a42935p4336A00997b46527a14804A92477a52270B00317b07056a2499k77842
10121b90341k69939b22615R5159n6827M4074A02417b2331D3158c73152D1933e8622
10109H1417a38110A5600e4461G5159c6694j20162f5082k0163p5304L7630o0736
10098a83655g808B5081a45560m338j30144L1017h901j14115E9560a68015A84144
$$ plain form
10177 71625 -163751 43953 295194 44118 89119 10171 -57335 -47541 -47555 102345 -252069 -93412
10164 90670 371170 -54375 19107 41037 289335 -27841 -28034 -174887 -113734 355905 -183594
10152 -144905 294741 -177693 55593 110419 -150074 -86298 -119960 -301409 160608 296041
10142 296041 -124088 210615 -24752 159706 -171394 118555 -25849 -22359 105799 -426599
10131 -142935 -217271 100997 -246527 -114804 192477 -152270 200317 -207056 -12499 -290341
10121 -290341 -560280 -222615 -127456 -184283 -140209 102417 -22331 43158 -373152 41933 -58622
10109 81417 -138110 15600 -54461 75159 -36694 -156856 -65082 -85245 -160549 -122919 -183655
10098 -183655 -7808 25081 -145560 -149898 -280042 -249025 -8901 -123016 59560 -168015 184144
10086b69614e4668D1651c2300j80323i4225L2719j10753j11596B30253e9784k45188
10075c04972G4202f9474j61090e3663l39303g0407b776n1071j25471a9619j9231
10064c8850A3507b33972M1248A02582b87307h77A08024i5855B68751H7062c40735
10052B31380f3969G2100J00818c5045j36762j17462l6793J02922H9786N6825Q1459
10041B28070b12453e9486A322a71748M4431A76678B0360a58482f4939A31403b41928
10029c4025k35251J03016A1760b98694R9068i2593l1620K0995j26926n9167b1272
10017a87823A42485a58510I0515c89740a33705j41987R8588p2863a10969A62313
10006c02402a01238G9749a65546N5451r3560k12071D228O5574c77798c7489C41603
$$ plain form
10086 -269614 -54668 41651 -32300 -212623 -94225 -61506 -172259 -283855 230253 -59784 -304972
10075 -304972 74202 -69474 -230564 -53663 -392966 -70407 -2776 -53847 -179318 -19619 -38850
10064 -38850 13507 -233972 -192724 102582 -287307 -877 108024 -95855 268751 87062 -340735
10052 231380 -63969 72100 172918 -35045 -171807 -289269 -326062 -223140 89786 146611 228070
10041 228070 -212453 -59486 1322 -171748 -127317 176678 20360 -158482 -64939 131403 -241928
10029 -34025 -269276 -166260 11760 -298694 -199626 -92593 -124213 -103218 -230144 -289311 -21272
10017 -187823 142485 -158510 90515 -389740 -133705 -275692 -177104 -249967 -110969 162313
10006 -302402 -101238 79749 -165546 -110095 -203655 -415726 4228 69802 -377798 -37489 341603
9994b59357d292k25892c1058G6967a96898N4892A11985b74733a36334O6399I6784
9982F3191k3283b99740f5830o1597j33897H1655f0646A20078J4206L7028a53397
9970E8451b85655C12230b01326b339H142a82395J4554n975C839a25002k88245
9959d13247C68405h4478I0437i3818j07065M6898L9186A2841b9449I8446J87688
9948B86134p8517a62414G5995a85814P8081o2983e694p8867j41112f6427K8033
9937c8394E8328N7846a78666A5002J28877F6808R1287d32333i1385l02670i1416
9925C9965a02584j62726g7881j7025d4268n8551A05074f5768L1716m0364k4740
9914i9156r1228O7802A5277a20516d7034n1540n9241k6541B70163F6374c2093
$$ plain form
9994 -259357 -4292 -230184 -31058 76967 -196898 -142006 111985 -274733 -136334 -69935 96784
9982 63191 39908 -299740 -65830 -127427 -261324 81655 -60646 120078 134284 171312 -153397
9970 58451 -285655 312230 -201326 -2339 8142 -182395 -167841 -173816 3839 -125002 -413247
9959 -413247 368405 -84478 90437 -93818 -200883 -153985 -114799 12841 -29449 98446 286134
9948 286134 207617 -162414 75995 -185814 -107733 -170716 -5694 -84561 -225673 -66427 -38394
9937 -38394 58328 116174 -178666 15002 143879 66808 158095 -432333 -91385 -394055 -91416
9925 39965 -102584 -265310 -77881 -94906 -44268 -102819 105074 -65768 -34052 -74416 -99156
9914 -99156 -190384 -122582 15277 -120516 -47034 -98574 -157815 -184356 270163 66374 -32093
9902a24104n3436B70a02662k18136d773j32373j64251B43467e6765H7167B5151
9890b46477h6090c4355A9901J5459O6903N6970a39662f166C2525a93635B2109
9878a41455K5445J8698m2625B69865B2968a17083d3631k40426g7284B65474i7066
9866C9418c17942a03905I3208a81932M1601j03725B5883J6203L70499G1545e9658
9854a08888b7811p5616K5798o7176A81767a7082p2412l4661j4431B53032b84011
9842a68374A63762o4986a36670e92j98220J5948b8577A02815A3581K1789j3401
9831B1969M9255a41696o5242c075H6776a95352M8655q4536a14231I3273l6076
9820E7197b17230M2755Q6526j16385a0366k63632B9128a51379B5151K74684A11643
$$ plain form
9902 -124104 -177540 270 -102662 -320798 -4773 -137146 -301397 243467 -56765 87167 25151
9890 -246477 -86090 -34355 19901 35360 102263 159233 -139662 -6166 32525 -193635 22109
9878 -141455 -116010 -97312 -139937 269865 22968 -117083 -43631 -284057 -77284 265474 -97066
9866 39418 -317942 -103905 93208 -181932 -140331 -244056 25883 42086 412585 71545 -59658
9854 -108888 -27811 -103427 -77629 -144805 181767 -17082 -89494 -124155 -138586 253032 -284011
9842 -168374 163762 98776 -136670 -592 -198812 -182864 -28577 102815 13581 35370 21969
9831 21969 71224 -141696 -206938 -3075 86776 -195352 -146697 -231233 -114231 93273 57197
9820 57197 -217230 -174475 -87949 -204334 -10366 -273998 29128 -151379 25151 299835 111643
9808e9801B01332p0109a80969j04872A84167b39106C3738J0190f4183j27052B4823
9796F2291a23770A40019h2896A33233G19O0209f2815C54297j36188d29912a49034
9784a26868b720k34244N764r7713H066J85810a70303O0h4803j7958m7468A09168
9771d0408J273E7385M39d02704a0370k773B03185b77019N9020k9251A88818d9485
9758g2724r7015A98579i9729I6210J59247a21663A63756e4986o10111C34763j60734
9747A74029d77059A68396b24089F6115a18158c8849I098c07814A43683a71656
9736i0319j37488A50507C0864b06472f9278C92384a64477b0188F620c4907q2262
9725a17169J4289A04149e6823m6911h453k93646A00345a8241E0005K3625q954
$$ plain form
9808 -59801 201332 131223 -180969 -285841 184167 -239106 33738 43928 -64183 -191235 24823
9796 62291 -123770 140019 -82896 133233 719 60928 -62815 354297 218109 -429912 -149034
9784 -126868 -2720 -236964 -231200 -328913 8066 193876 -170303 -170243 -84803 -102761 -150229 109168
9771 -40408 -39135 57385 57824 -402704 -10370 -13143 203185 -277019 -217999 -247250 188818 -49485
9758 -72724 -169739 198579 -99729 96210 255457 -121663 163756 -54986 -665097 334763 174029
9747 174029 -477059 168396 -224089 66115 -118158 -38849 9098 -307814 143683 -171656
9736 -90319 -227807 150507 30864 -206472 -69278 392384 -164477 -20188 6620 -34907 -117169
9725 -117169 -102880 104149 -56823 -103734 -8453 -302099 100345 -18241 50005 73630 64676
9714F4676a82573L2157N7162K169I2555b46070i9627F4972g2653E1636a9877l24686
9702c44563b7698A80708H0980a81368B12391a63804E2054c18213j90258a73966
9691H5838a19480A43132a4679j47432k8363F1686k1603d2277a7682j20835F3302
9679E6965f3248j42142B95024A09080e2721B5412c18850C4503b12954h4358l6468
9668a20826l83122H9746c06151g2171L2440k80623G0302a67659K1687m5327k6761
9657b18060e7567A89260a17220j33731E4972b94533a19309m4205P3648B17095
9646b77090I3688c52496h2990k3091M0645D0456i1088k03467H1674g5160B71664
9634A16745h9740o5668o1217M1770A02009b58403B8190e9946n30514d1640E0912
$$ plain form
9714 64676 -182573 -150416 -93254 -91085 92555 -246070 -99627 64972 -72653 51636 -19877 -344563
9702 -344563 -27698 180708 80980 -181368 212391 -163804 52054 -318213 -508471 -173966
9691 85838 -119480 143132 -14679 -162111 -190474 61686 40083 -42277 -17682 -138517 63302
9679 56965 -63248 -205390 295024 109080 -52721 25412 -318850 34503 -212954 -84358 -120826
9668 -120826 -503948 89746 -306151 -72171 -39731 -320354 70302 -167659 -145972 -191299 -218060
9657 -218060 -57567 189260 -117220 -250951 54972 -294533 -119309 -163514 -89866 217095
9646 -277090 93688 -352496 -82990 -106081 -65436 40456 -91088 -294555 81674 -75160 271664
9634 116745 -89740 -155408 -216625 -174855 102009 -258403 28190 -59946 -590460 -41640 50912
9622D0979a92112j56952f7803a8179A90822D923J68649a48974j889G6997a82717
9610c0411q5523H5442e1904A66948C314f7435j02777d6680l10496J50692b7321
9598A30468a80295L0659k37535i6403A61722d4728j49349f7928B7107J25041K06204
9587C58352b56846f8219k5438F7752d9935j02134J0311n2241a254j76224K834
9576a74644l7021E9002b02613R394c6874a1423C9140b4574B8376J43453j8494
9565A53335R2433a82554k83210D2847a20355e6869j21397D3741J9843L3976A0380
9553h1854E84L21521a94360j22575L8012D669J79767h9261b3591p8940B44336
9541A10666d1561l2325m6669D0954P4436b42623p0570J21808b9099j93732A41653
$$ plain form
9622 40979 -192112 -349064 -67803 -18179 190822 4923 173572 -148974 -150863 76997 -182717
9610 -30411 -115934 85442 -51904 166948 3314 -67435 -170212 -46680 -357176 -206484 -27321
9598 130468 -180295 -149636 -387171 -96403 161722 -44728 -194077 -67928 27107 152148 358352
9587 358352 -256846 -68219 -93657 67752 -49935 -152069 -141758 -193999 -1254 -177478 -174644
9576 -174644 -211665 59002 -202613 -193219 -36874 -11423 39140 -24574 28376 171829 153335
9565 153335 245768 -182554 -465764 42847 -120355 -56869 -178266 43741 63584 97560 10380
9553 -81854 584 322105 -194360 -316935 -278923 4669 184436 -89261 -23591 -102531 244336
9541 110666 -41561 -73886 -120555 40954 115390 -242623 -313193 -191385 -29099 -222831 141653
9529G6634L4789b70694D5066d64137g6440j9162d5965k3891k23514m3133b5874
9517a27602B7435e22366a69331j05556J19012O4156j93008A76353a9866j41909
9507a61775C4687a62850n3068R9145j2786d1816A26753K66733i5641k3797k71600
9496c91038c8651k98726H9601R1647c20549R9591J07141P337j09562j12475A29734
9484b08276k64347a62136A06282b49815I3498a09814k17519f8344m31570b07930
9473C38185A07220a14007j35631g4559j09940C4429L2633a12903l19261F3772
9462A51241n3961L03587A98871h3658G8612N9576a97967A44619i0266e543E0581
9450a30444B18862A3682a00386A51230a19252M3217A98682r1909c1095F4852N1127
$$ plain form
9529 76634 111423 -270694 45066 -464137 -76440 -95602 -45965 -69856 -293370 -336503 -25874
9517 -127602 27435 -522366 -169331 -274887 -155875 -91719 -284727 176353 -19866 -161775
9507 -161775 34687 -162850 -215918 -116773 -129559 -41816 126753 393486 -95641 -119438 -391038
9496 -391038 -38651 -337377 89601 181248 -320549 -220958 -113817 -106480 -216042 -328517 129734
9484 -208276 -472623 -162136 106282 -249815 93498 -109814 -327333 -68344 -499914 -207930
9473 338185 107220 -114007 -249638 -74559 -184499 34429 67062 -112903 -432164 63772
9462 151241 97280 400867 198871 -83658 78612 138188 -197967 144619 -90266 -5543 50581
9450 -130444 218862 13682 -100386 151230 -119252 -76035 198682 106773 -31095 64852 115979
9439A15979a07465k49166J51540k0439P8740D1070g1920j33333A86485E615b39796
9427B26392e6394j765j27064A27555a55153G3824a17528o2640k6074P1801M338
9416a30103A05927b65905j2128A64788F0658A5208b37308c0782k6594G5733b67811
9404a33044r7961J14727B45176c85961A30728a14202K7478K7073k70836a32060
9393A87967A6790J84244a31370r0430b5875j65874M8363e5418o0819b3997k02777
9382b26774Q3372I074b29800j58555A6438P965a66817A90624b3955H0721a43343
9370H8724a59748d8633k39969O0815o8335a0291l5548k40017D922B394N5671d4822
9357a4026k82323A31805a32201M2654B51058b4429n4371j19139f3532j68975A64726
$$ plain form
9439 115979 -107465 -356631 -205091 -225530 -146790 41070 -71920 -205253 186485 5615 -239796
9427 226392 -56394 -58159 -185223 127555 -155153 73824 -117528 -180168 -206242 -134441 -130103
9416 -130103 105927 -265905 -278033 164788 60658 15208 -237308 -30782 -57376 75733 -267811
9404 -133044 -231005 -116278 245176 -385961 130728 -114202 -86724 -59651 -330487 -132060
9393 187967 16790 201034 -131370 -221800 -25875 -191749 -143386 -55418 -116237 -23997 -226774
9382 -226774 -143402 9074 -229800 -388355 16438 24403 -166817 190624 -23955 80721 -143343
9370 88724 -159748 -48633 -288602 -227787 -296122 -10291 -45839 -285856 4922 2394 58065 -44822
9357 -14026 -296349 131805 -132201 -89547 251058 -24429 -78800 -197939 -63532 -232507 164726
9345f9616k5958L5741j06058j05774a06217F8616b54745j414A10323b18645R5098
9334a23547C85919b87146c6990l55852J00055G3095c0428C3348a08065C47382
9323A31082b88712g3860C6457d7925n0863m668q7211M9596O9029J4578A61635
9311a51859A16632a80901A46815a2154j52517B7190f0104I2463a98247A27576
9300C51418i496m29544J76700P8297r9992j02619A08981c42500J18320L514C6223
9288d477k57332Q0303r8444k6378H8828c25135g0267N292k62673B10335a22722
9276C06728b62312B3491b36062H4116c1917j8921L530j05803O3083k33823i7679
9264a05315j88636a14145A10986J53317I1458a86384d7636j55578A70230o391
$$ plain form
9345 -69616 -95574 -59833 -165891 -271665 -106217 68616 -254745 -256159 110323 -218645 -123547
9334 -123547 385919 -287146 -36990 -392842 -292787 73095 -30428 33348 -108065 347382
9323 131082 -288712 -73860 36457 -47925 -98788 -103456 -190667 -141071 -72042 -57464 161635
9311 -151859 116632 -180901 146815 -12154 -164671 27190 -60104 92463 -198247 127576
9300 351418 -9496 -439040 -262340 -184043 -284035 -386654 108981 -342500 -224180 -220666 36223
9288 -4477 -261809 -181506 -279950 -306328 88828 -325135 -70267 -64975 -327648 210335 -122722
9276 306728 -262312 23491 -236062 84116 -31917 -50838 -47308 -153111 -90028 -323851 -97679
9264 -105315 -293951 -114145 110986 264303 91458 -186384 -47636 -203214 170230 163839
9254A63839E7445A7377f029k9951O03B06228a74399j18453a33964J5736J7632
9243a00596j23760L0040G5545l5616c21722H5845H825g0202D5236J25231Q8965
9232B59432B834f44j43066B59972o6492E8401b52083I9940J03595B8744L752N8612
9220I1108b89324q051B9857c13025a01727r0496J1450B14438a14054G9980m129
9209G5851a46551B30118A13627J27557o0278o2166c90579c215B44025a79363A35496
9197b94754P7480A79585L7615b44046k9240f7165q2074M9585b1097N83D330g6027
9184A84982b64623J07264B8999i0456k17222A01016M4134a00949i850d278j98492
9173b02770f6494B76237A20401a18427j9190A2093c05674H9105b54425a4785k36671
$$ plain form
9254 163839 57445 17377 -6029 -35980 -35377 206228 -174399 -292852 -133964 -118228 -100596
9243 -100596 -224356 -194316 75545 39929 -321722 85845 8825 -70202 45236 170467 259432
9232 259432 2834 -644 -143710 259972 193480 58401 -252083 99940 203535 28744 32496 91108
9220 91108 -289324 -297375 29857 -313025 -101727 -192223 -180773 214438 -114054 79980 75851
9209 75851 -146551 230118 113627 241184 180906 118740 -390579 -3215 244025 -179363 135496
9197 -294754 -217274 179585 217200 -244046 -273286 -67165 -149239 -99654 -21097 -20514 4330 -76027
9184 184982 -264623 -157359 28999 -90456 -307678 101016 145150 -100949 -9850 -4278 -202770
9173 -202770 -66494 276237 120401 -118427 -137617 12093 -305674 89105 -254425 -14785 -251456
9162b51456F4589i9522a404j58567j37653G0001a9810g966m7781B6101e8979A11419
9149b26170A27264K6304E311b92830b813j52663d7775G523b7835A78877a1138
9137h2619D3268e6885C22144C5369a68482B7505a46473H8997a80155r831j03721
9126b93707B46899d59887a9291G8548b20252A44280a95850H7153d86011b9018
9115C7372c79956A43827i5906M6673A13971b39138Q3270j67559J03229A42368
9104D0741b02572G7667c00136A86836A5263a63281j18121a03094n6115A26136
9093d2181n6258j01776J9825c9682r7168A21079a93979q0501P0873j88958P7164
9082c15401M7745a23080L9878r3133B26279a38606c4491j12491q4532g0078A2293
$$ plain form
9162 -251456 64589 -99522 -1404 -159971 -297624 70001 -19810 -7966 -55747 26101 -58979 111419
9149 -226170 127264 153568 5311 -292830 -2813 -155476 -47775 7523 -27835 178877 -11138
9137 -82619 43268 -56885 322144 35369 -168482 27505 -146473 88997 -180155 -189986 -293707
9126 -293707 246899 -459887 -19291 78548 -220252 144280 -195850 87153 -486011 -29018
9115 37372 -379956 143827 -95906 -49233 113971 -239138 -155868 -323427 -220198 142368
9104 40741 -202572 77667 -300136 186836 15263 -163281 -281402 -103094 -159209 126136
9093 -42181 -98439 -200215 -180390 -39682 -136850 121079 -193979 -274480 -203607 -392565 -315401
9082 -315401 -267656 -123080 -83202 -176335 226279 -138606 -34491 -146982 -231514 -70078 12293
9070h6123b3088j81591D5794a15702c1097C6929a85630j81184e7968m5709a2782
9058A33906a020A61056k9235b6485A39519b20489B3314c05849Q3573A61747a03618
9046b0814k6063F7305e5192A47696L5708a00866b4640j9465B4895b14557A01896
9034A8526e06958A4331c4507j36214A76699C0444L3153Q5143N4285b13398l9552
9023b52950N1825N6227b6993l42449b9287H9808a6586k43711p5252A09572D1270
9011g1402K7883K0060l2724j9477G6533a78261g4570r2184A63630i1965a5342
8999b09437I3329j0154K8654a41168F876a78247K2621j6002A54117l2866b16215
8987a79423D2792c14460b063j12368r0399c2852C40152a28600C22593b41940N5705
$$ plain form
9070 -86123 -23088 -204679 45794 -115702 -31097 36929 -185630 -366814 -57968 -103677 -12782
9058 133906 -1020 161056 131821 -26485 139519 -220489 23314 -305849 -222276 161747 -103618
9046 -20814 -46877 67305 -55192 147696 183404 -100866 -24640 -44105 24895 -214557 101896
9034 18526 -506958 14331 -34507 -170721 176699 30444 63597 148740 203025 -213398 -252950
9023 -252950 -201125 -144898 -26993 -369442 -29287 89808 -16586 -260297 -335549 109572 41270
9011 -71402 -43519 -23459 -56183 -75660 76533 -178261 -74570 -166754 163630 -91965 -15342
8999 -209437 93329 83175 111829 -141168 6876 -178247 -155626 -171628 154117 121251 -216215
8987 -179423 42792 -314460 -2063 -114431 -204830 -32852 340152 -128600 322593 -241940 -186235
8976a86235b727k17598e4949k89852a06916M6612E9215J96046a50381M8212B23673
8964h880B2605j295a27896j3576k23793A2765M0951a06601d6873H7094b93996
8952a72169l0105N4154C2814a8120B8205J53224a74432j85770j95186A13001E4764
8940c12140a4457n4123K8565j65802B69156j19877F3531c3734j272B15068a00555
8928a6617k11676P5892A00344N8963J01135c9300B10713a75054C60295K28652
8918E88947P76077D76271B568K54770e08763b41498f6835I0848a18035k3733C3088
8906c95131G1733a11398C8652A0431f9890C2968O4965d0461A83339B8847c37059
8894A00833c30466c7661k74540a36496A63421d9094k482A25780n8156a83345E7913
$$ plain form
8976 -186235 -2727 -220325 -54949 -344801 -106916 -60304 59215 255261 -150381 -102169 223673
8964 -8880 22605 21310 -127896 -141472 -365265 12765 53716 -106601 -46873 87094 -293996
8952 -172169 -202274 -148120 32814 -18120 28205 181429 -174432 -360202 -555388 113001 54764
8940 -312140 -14457 -68580 -40015 -205817 269156 149279 63531 -33734 -35006 215068 -100555
8928 -16617 -228293 -152401 100344 159307 260442 -39300 210713 -175054 360295 588947
8918 588947 1365024 476271 2568 257338 -508763 -241498 -66835 90848 -118035 -141768 33088
8906 -395131 71733 -111398 38652 10431 -69890 32968 97933 -40461 183339 28847 -337059
8894 100833 -330466 -37661 -312201 -136496 163421 -49094 -51576 125780 67624 -183345 57913
8882c7096l68805C41392A52268i0267J171j46403E181J75905b29055j07707d2959
8870G7200a2071E8923b40359A98403B743K56747b5534B33417d6465r3072i097
8858b26306J09588j37683A84650J02477j14854D6036k2219a17579H1015p330L8103
8847A11788J29589i8376C8J84311e8875A8248f7035j64071F2046a67924J3555
8836a54369k54887C22379c2126I195b62792J06421a1302l60373a83214B44130
$$ plain form
8882 -37096 -405901 341392 152268 -90267 -89096 -235499 5181 181086 -229055 -336762 -42959
8870 77200 -12071 58923 -240359 198403 2743 259490 -25534 233417 -46465 -139537 -9097
8858 -226306 -116718 -254401 184650 287127 172273 46036 23817 -117579 81015 73685 111788
8847 111788 241377 -98376 38 184349 -58875 18248 -67035 -231106 62046 -167924 -154369
8836 -154369 -409256 322379 -32126 9195 -262792 -156371 -11302 -371675 -183214 244130
$$ [...]
##END NTUPLES=NMR SPECTRUM
##END=
