##TITLE=NES1011_936994_9232868_sNZciP7wDI
##JCAMPDX= 6.0         $$ Bruker NMR JCAMP-DX V2.0
##DATA TYPE= NMR SPECTRUM
##DATA CLASS= NTUPLES
##ORIGIN= BRUKER
##OWNER= Administrator
$$ 1.72 TOPSPIN		Version 2.1
$$ 2015-06-17 23:40:32.722 -0700  Administrator@X
$$ Compression mode = diff/dup
##.OBSERVE FREQUENCY= 400.02188249412
##.OBSERVE NUCLEUS= ^1H
##.ACQUISITION MODE= SIMULTANEOUS (DQD)
##.ACQUISITION SCHEME= undefined
##.AVERAGES= 64
##.DIGITISER RES= 22
##SPECTROMETER/DATA SYSTEM= spect
##.PULSE SEQUENCE= noesygpps1d.comp
##.SOLVENT NAME= COFFEE_meoh
##.SHIFT REFERENCE= INTERNAL, COFFEE_meoh, 1, 14.96277
##AUDIT TRAIL= $$ (NUMBER, WHEN, WHO, WHERE, PROCESS, VERSION, WHAT)
$$ ##TITLE= Audit trail, TOPSPIN		Version 2.1
$$ ##JCAMPDX= 5.01
$$ ##ORIGIN= Bruker BioSpin GmbH
$$ ##OWNER= Administrator
$$ $$ E:\/data/COFFEE/nmr/NES1011_936994_9232868_sNZciP7wDI/12/pdata/1/auditp.txt
$$ ##AUDIT TRAIL=  $$ (NUMBER, WHEN, WHO, WHERE, PROCESS, VERSION, WHAT)
(   1,<2015-06-17 23:40:27.316 -0700>,<Administrator>,<X>,<go>,<TOPSPIN 2.1>,
      <created by zg
	started at 2015-06-17 23:28:57.847 -0700,
	POWCHK enabled, PULCHK disabled,
       configuration hash MD5:
       21 0F 79 D6 B3 7B B4 F6 88 20 88 DB 03 48 BD 9F
       data hash MD5: 64K
       38 1B 99 2C 66 DA 28 51 DD 6C 03 93 7F 35 62 4A>)
(   2,<2015-06-17 23:40:30.597 -0700>,<Administrator>,<X>,<proc1d>,<TOPSPIN 2.1>,
      <Start of raw data processing
       efp LB = 0.3 FT_mod = 6 PKNL = 1 PHC0 = 0 PHC1 = 0 SI = 128K 
       data hash MD5: 128K
       35 86 78 0B F2 15 06 5B 27 28 FF C7 2D 66 3F EB>)
(   3,<2015-06-17 23:40:31.534 -0700>,<Administrator>,<X>,<proc1d>,<TOPSPIN 2.1>,
      <pk PHC0 = -84.32556 PHC1 = 0 
       data hash MD5: 128K
       B3 4E 1B DA 63 AD 4B 17 41 AE F8 EA C6 07 01 3C>)
(   4,<2015-06-17 23:40:31.894 -0700>,<Administrator>,<X>,<proc1d>,<TOPSPIN 2.1>,
      <abs ABSG = 1 
       data hash MD5: 128K
       24 56 6A D3 E5 C4 67 57 22 05 E9 26 71 32 77 00>)
(   5,<2015-06-17 23:40:32.003 -0700>,<Administrator>,<X>,<proc1d>,<TOPSPIN 2.1>,
      <abs ABSG = 2 
       data hash MD5: 128K
       0F B8 07 B0 E4 D5 A1 2C 9C C1 D1 F4 B7 21 39 CD>)
(   6,<2015-06-17 23:40:32.081 -0700>,<Administrator>,<X>,<proc1d>,<TOPSPIN 2.1>,
      <abs ABSG = 3 
       data hash MD5: 128K
       7B 0B 3C 71 88 8E A2 DB 7A C7 41 94 7F DD 90 04>)
(   7,<2015-06-17 23:40:32.191 -0700>,<Administrator>,<X>,<proc1d>,<TOPSPIN 2.1>,
      <abs ABSG = 4 
       data hash MD5: 128K
       79 B8 70 19 7F 53 F2 40 EF 81 D1 A4 F0 3C 9A DF>)
(   8,<2015-06-17 23:40:32.269 -0700>,<Administrator>,<X>,<proc1d>,<TOPSPIN 2.1>,
      <abs ABSG = 5 
       data hash MD5: 128K
       B2 66 DE ED 05 08 9E B6 2F 10 09 FC 6E 59 EB 08>)
$$ ##END=
$$ 
$$ $$ hash MD5
$$ $$ 89 50 E8 BE CF 4C 2D 25 20 9E F2 DE 77 7D D9 98
##$RELAX= 
##$RELAX= 
##$RELAX= 
##$RELAX= 
##$RELAX= 
##$RELAX= 
##$RELAX= 
##$RELAX= 
$$ Bruker specific parameters
$$ --------------------------
##$DU= <E:\>
##$EXPNO= 12
$$ [...]
##$TP07= 0
##$TPNAME0= <>
##$TPNAME1= <>
##$TPNAME2= <>
##$TPNAME3= <>
##$TPNAME4= <>
##$TPNAME5= <>
##$TPNAME6= <>
##$TPNAME7= <>
##$TPOAL= (0..7)
0.5 0.5 0.5 0.5 0.5 0.5 0.5 0.5
##$TPOFFS= (0..7)
0 0 0 0 0 0 0 0
##$TUNHIN= 0
##$TUNHOUT= 0
##$TUNXOUT= 0
##$USERA1= <user>
##$USERA2= <user>
##$USERA3= <user>
##$USERA4= <user>
##$USERA5= <user>
##$V9= 5
##$VALIST= <valist>
##$VCLIST= <CCCCCCCCCCCCCCC>
##$VD= 0
##$VDLIST= <DDDDDDDDDDDDDDD>
##$VPLIST= <PPPPPPPPPPPPPPP>
##$VTLIST= <TTTTTTTTTTTTTTT>
##$WBST= 2048
##$WBSW= 25
##$XGAIN= (0..3)
0 0 0 0
##$XL= 0
##$YL= 0
##$YMAX_a= 7658118
##$YMIN_a= -16502472
##$ZGOPTNS= <>
##$ZL1= 120
##$ZL2= 120
##$ZL3= 120
##$ZL4= 120
##$ABSF1= 14.96277
##$ABSF2= -5.595411
##$ABSG= 5
##$ABSL= 3
##$ALPHA= 0
##$AQORDER= 0
##$ASSFAC= 0
##$ASSFACI= 0
##$ASSFACX= 0
##$ASSWID= 0
##$AUNMP= <proc_prof1d_extract.lims>
##$AXLEFT= 0
##$AXNAME= <>
##$AXNUC= <1H>
##$AXRIGHT= 0
##$AXTYPE= 0
##$AXUNIT= <>
##$AZFE= 0.1
##$AZFW= 0.1
##$BCFW= 0
##$BC_mod= 0
##$BYTORDP= 0
##$COROFFS= 0
##$CY= 15
##$DATMOD= 1
##$DC= 0
##$DFILT= <>
##$DTYPP= 0
##$F1P= 0
##$F2P= 0
##$FCOR= 0.5
##$FTSIZE= 131072
##$FT_mod= 6
##$GAMMA= 0
##$GB= 0
##$INTBC= 1
##$INTSCL= 1
##$ISEN= 128
##$LB= 0.3
##$LEV0= 0
##$LPBIN= 0
##$MAXI= 10000
##$MC2= 0
##$MEAN= 0
##$ME_mod= 0
##$MI= 0
##$NCOEF= 0
##$NC_proc= -2
##$NLEV= 6
##$NOISF1= 0
##$NOISF2= 0
##$NSP= 0
##$NTH_PI= 0
##$NZP= 0
##$OFFSET= 14.96277
##$PC= 1
##$PHC0= -84.32556
##$PHC1= 0
##$PH_mod= 1
##$PKNL= yes
##$PPARMOD= 0
##$PPDIAG= 0
##$PPIPTYP= 0
##$PPMPNUM= 2147483647
##$PPRESOL= 1
##$PSCAL= 4
##$PSIGN= 0
##$PYNMP= <proc.py>
##$REVERSE= no
##$SF= 400.020008928439
##$SI= 131072
##$SIGF1= 0
##$SIGF2= 0
##$SINO= 400
##$SIOLD= 131072
##$SPECTYP= <>
##$SREGLST= <1H.CDCl3>
##$SSB= 0
##$STSI= 131072
##$STSR= 0
##$SW_p= 8223.68421052631
##$SYMM= 0
##$S_DEV= 0
##$TDeff= 65536
##$TDoff= 0
##$TI= <>
##$TILT= no
##$TM1= 0
##$TM2= 0
##$TOPLEV= 0
##$USERP1= <user>
##$USERP2= <user>
##$USERP3= <user>
##$USERP4= <user>
##$USERP5= <user>
##$WDW= 1
##$XDIM= 131072
##$YMAX_p= 409678002
##$YMIN_p= -11184
##$CURPLOT= <Network HP LaserJet P1505>
##$CURPRIN= <$Network HP LaserJet P1505>
##$DFORMAT= <normdp>
##$LAYOUT= <+/1D_H.xwp>
##$LFORMAT= <normlp>
##$PFORMAT= <normpl>
##$SURQMSG= 1
$$ End of Bruker specific parameters
$$ ---------------------------------
##NTUPLES= NMR SPECTRUM
##VAR_NAME=  FREQUENCY,     SPECTRUM/REAL,   SPECTRUM/IMAG
##SYMBOL=    X,             R,               I
##VAR_TYPE=  INDEPENDENT,   DEPENDENT,       DEPENDENT
##VAR_FORM=  AFFN,          ASDF,            ASDF
##VAR_DIM=   131072,        131072,          131072
##UNITS=     HZ,            ARBITRARY UNITS, ARBITRARY UNITS
##FACTOR=    0.0627417313425164, 1,          1
##FIRST=     8223.62146879497, 2035,         -55109
##LAST=      0,             4512,            -55086
##MIN=       0,             -11184,          0
##MAX=       8223.62146879497, 409678002,    0
$$ Real data points
##PAGE= N=1
##DATA TABLE= (X++(R..R)), XYDATA
$$ [...]
63239D41834Q923J0290J2243J3374J3353J3572J5156J7460J9261K0377K1273K2050
$$ 441834 450757 461047 473290 486664 500017 513589 528745 546205 565466 585843 607116 629166
63227F29166K2806K4074K5808K6670K5564K3347K1787K1279K0753J9635J8593
$$ 629166 651972 676046 701854 728524 754088 777435 799222 820501 841254 860889 879482
63216H79482J8311J8560J8728J8504J7983J7553J7546J7533J6250J2898Q097L031
$$ 879482 897793 916353 935081 953585 971568 989121 1006667 1024200 1040450 1053348 1061445 1064476
63204A064476j935p033j2058j6547k0643k4697k8259l0443l1152l0976l0128k8422
$$ 1064476 1062541 1055508 1043450 1026903 1006260 981563 953304 922861 891709 860733 830605 802183
63192H02183k6111k3621k0593j6371j1429p179m207j773Q02L423O002Q864J1897
$$ 802183 776072 752451 731858 715487 704058 696879 692672 690899 691701 695124 701126 709990 721887
63179G21887J4376J6053J7576J9343K0817K1432K1426K1316K1250K1305K1686
$$ 721887 736263 752316 769892 789235 810052 831484 852910 874226 895476 916781 938467
63168I38467K2249K2443K2098K1617K1034J9656J7141J4166J1369Q288M069j237
$$ 938467 960716 983159 1005257 1026874 1047908 1067564 1084705 1098871 1110240 1118528 1122597 1121360
63156A121360o776j2001j6959k1649k5630k8320k9445k9335k8875k8846k9157
$$ 1121360 1114584 1102583 1085624 1063975 1038345 1010025 980580 951245 922370 893524 864367
63145H64367k8970k7747k5733k3416k1054j8918j7384j6344j5094j3244j1274
$$ 864367 835397 807650 781917 758501 737447 718529 701145 684801 669707 656463 645189
63134F45189r733q367o637m731l374k812k569k137j403m66M87J081J000N07L75
$$ 645189 635456 627089 620452 615721 612347 609535 606966 604829 603426 602960 603447 604528 605528 606035 606410
63119F06410J099K335L309L661L750M119M781N247N186M848M722M980N444N886
$$ 606410 607509 609844 613153 616814 620564 624683 629464 634711 639897 644745 649467 654447 659891 665777
63105F65777O116N934N393M875M636M394L760K916K361K120J740J087N85N44P19
$$ 665777 671893 677827 683220 688095 692731 697125 700885 703801 706162 708282 710022 711109 711694 712238 712957
63090G12957P49N36J48k94m76p5P12J249J323J490K310L512M295M332M168M589
$$ 712957 713706 714242 714390 714096 713620 713545 714257 715506 716829 718319 720629 724141 728436 732768 736936 741525
63074G41525N765P047P695P709P754Q156Q506Q479Q624R652J1291J2617J3433
$$ 741525 747290 754337 762032 769741 777495 785651 794157 802636 811260 820912 832203 844820 858253
63061H58253J4532J6495J8911K1098K2910K4545K6073K7560K9327L1698L4582
$$ 858253 872785 889280 908191 929289 952199 976744 1002817 1030377 1059704 1091402 1125984
63050A125984L7500L9985M1941M3733M5796M7962M9518N0160N0493N1054N1305
$$ 1125984 1163484 1203469 1245410 1289143 1334939 1382901 1432419 1482579 1533072 1584126 1635431
63039A635431N0393M8549M6875M5873M5136M4431M3996M3649M2727M1188L9739
$$ 1635431 1685824 1734373 1781248 1827121 1872257 1916688 1960684 2004333 2047060 2088248 2127987
63028B127987L8493L6480L2960K8255K2657J5534O350m106j4460k4239l3800m3181
$$ 2127987 2166480 2202960 2235920 2264175 2286832 2302366 2308716 2304610 2290150 2265911 2232111 2188930
63016B188930n1701n8512o2990o4870o4577o3086o0962n7826n3166m7230m0659
$$ 2188930 2137229 2078717 2015727 1950857 1886280 1823194 1762232 1704406 1651240 1604010 1563351
63005A563351l3712k6549j9765j3848q273k020M976J1549J6593K0216K3419K6928
$$ 1563351 1529639 1503090 1483325 1469477 1461204 1459184 1464160 1475709 1492302 1512518 1535937 1562865
62993A562865L0492L3239L4706L5410L6148L6846L6634L5153L3168L1576L0377
$$ 1562865 1593357 1626596 1661302 1696712 1732860 1769706 1806340 1841493 1874661 1906237 1936614
62982A936614K8992K7021K4202K0128J4610Q011P13p340j6161k5178l3749m1795
$$ 1936614 1965606 1992627 2016829 2036957 2051567 2059578 2060291 2052951 2036790 2011612 1977863 1936068
62970A936068m9373n6051o1310o5198o7913o9124o8497o6621o4493o2194n8941
$$ 1936068 1886695 1830644 1769334 1704136 1636223 1567099 1498602 1431981 1367488 1305294 1246353
62959A246353n4465m9554m5058m1114l7496l4072l0648k6971k3216k0061j7976
$$ 1246353 1191888 1142334 1097276 1056162 1018666 984594 953946 926975 903759 883698 865722
62948H65722j6731j5861j5142j4474j3642j2608j1719j1269j1002j0459r681r227
$$ 865722 848991 833130 817988 803514 789872 777264 765545 754276 743274 732815 723134 713907
62936G13907r384r756r765r320q713q103p452o890o663o600o214n510n191n580
$$ 713907 704523 694767 685002 675682 666969 658866 651414 644524 637861 631261 625047 619537 614346 608766
62922F08766n937n484m642m360m596m505m005l924m492m939m928n152n852n966
$$ 608766 602829 597345 592703 588343 583747 579242 575237 571313 566821 561882 556954 551802 545950 539984
62908E39984m689k907k065k240k396k069j649j381j162j163j640k246k363k146
$$ 539984 535295 532388 530323 528083 525687 523618 521969 520588 519426 518263 516623 514377 512014 509868
62894E09868k369l206l964m118l933l880m037m191m123l691l009k478k359k406
$$ 509868 507499 504293 500329 496211 492278 488398 484361 480170 476047 472356 469347 466869 464510 462104
62880D62104k325k259k348k174j341l82k20q44j318j063l42N24J543K469K681
$$ 462104 459779 457520 455172 452998 451657 451275 451055 450211 448893 447830 447488 448012 449555 452024 454705
62865D54705K026J183Q19R11J138J393J585J438R00M01L59O72Q99P71L27j83m12
$$ 454705 456731 457914 458733 459644 460782 462175 463760 465198 466098 466499 466858 467530 468429 469200 469527 469344 468932
62848D68932k18R8J02k29n95r10j233j217l35J154K115J822Q02J1l77p76j238
$$ 468932 468714 468812 468914 468685 468090 467180 465947 464730 464395 465549 467664 469486 470288 470299 469922 469146 467908
62831D67908j371j102q55q67q43n47k76m62j021j484j700j959k358k469j896r25
$$ 467908 466537 465435 464580 463713 462870 462323 462047 461585 460564 459080 457380 455421 453063 450594 448698 447773
62815D47773j59K75P01J162J309J127J197J843K473K303J469J005J732L465N261
$$ 447773 447614 447889 448590 449752 451061 452188 453385 455228 457701 460004 461473 462478 464210 467675 472936
62800D72936O257O404O471P193Q380R275R720J0415J1764J3201J4066J4612J5556
$$ 472936 479193 485597 492068 499261 507641 516916 526636 537051 548815 562016 576082 590694 606250
62787F06250J7113J9091K1476K4295K7228L0110L3367L7283M1251M4642M8053
$$ 606250 623363 642454 663930 688225 715453 745563 778930 816213 857464 902106 950159
62776I50159N2564N7872O2417O5555O8461P2388P6889Q0398Q1929Q1584P9737
$$ 950159 1002723 1060595 1123012 1188567 1257028 1329416 1406305 1486703 1568632 1650216 1729953
62765A729953P6317P0846O2907N2642M0760K7931J4257l29j5265k9431m2028n2894
$$ 1729953 1806270 1877116 1940023 1992665 2033425 2061356 2075613 2075284 2060019 2030588 1988560 1935666
62753A935666o2058o9431p5025p8948q1179q1756q1129p9766p7470p3707o8661
$$ 1935666 1873608 1804177 1729152 1650204 1569025 1487269 1406140 1326374 1248904 1175197 1106536
62742A106536o3326n8460n4060m9902m5980m2186l8359l4740l1727k9013k5743
$$ 1106536 1043210 984750 930690 880788 834808 792622 754263 719523 687796 658783 633040
62731F33040k1886j8616j6777j5743j4407j2666j1216j0256r279p981o657n652
$$ 633040 611154 592538 575761 560018 545611 532945 521729 511473 502194 494213 487556 481904
62719D81904m850l867k475q18P02J811K735L948N548P090Q223R140J0293J1895
$$ 481904 477054 473187 470712 469894 470596 472407 475142 479090 484638 491728 499951 509091 519384 531279
62705E31279J3888J6089J8234K0216K2351K5123K8457L1729L4723L8142M2732
$$ 531279 545167 561256 579490 599706 622057 647180 675637 707366 742089 780231 822963
62694H22963M8194N3411N7608O0925O3899O6678O8868P0004O9992O8945O6521
$$ 822963 871157 924568 982176 1043101 1107000 1173678 1242546 1312550 1382542 1451487 1518008
62683A518008O1815N4251M4370L3244K1318Q444n020j7967k9583l9942m9280n7309
$$ 1518008 1579823 1634074 1678444 1711688 1733006 1741450 1736430 1718463 1688880 1648938 1599658 1542349
62671A542349o3630o8251p1208p2233p1335o9303o6999o4392o0887n6449n1883
$$ 1542349 1478719 1410468 1339260 1267027 1195692 1126389 1059390 994998 934111 877662 825779
62660H25779m7891m4327m0491l6036l1503k7948k5949k4924k3674k1576j9006
$$ 825779 777888 733561 693070 657034 625531 597583 571634 546710 523036 501460 482454
62649D82454j6622j4620j2894j1444j0385r741r450r318q954q078p009o397o376
$$ 482454 465832 451212 438318 426874 416489 406748 397298 387980 379026 370948 363939 357542 351166
62636C51166o438o260o057n915n402m375l489l339l484l046k024j256j212j420
$$ 351166 344728 338468 332411 326496 321094 316719 313230 309891 306407 303361 301337 300081 298869 297449
62622B97449j173l51O10J231J396J367J479J806K196K582L016L370L396L224L375
$$ 297449 296276 295925 296535 297766 299162 300529 302008 303814 306010 308592 311608 314978 318374 321598 324973
62607C24973M070M927N572O168P017Q034R026J0154J1676J3430J4983J6227J7496
$$ 324973 329043 333970 339542 345710 352727 360761 369787 379941 391617 405047 420030 436257 453753
62594D53753J9270K1849K5072K8195L0528L2403L4949L8517M1933M3758M3841
$$ 453753 473023 494872 519944 548139 578667 611070 646019 684536 726469 770227 814068
62583H14068M2924M1343L8867L5504L1490K6607K0404J3113N575j805r236j6584
$$ 814068 856992 898335 937202 972706 1004196 1030803 1051207 1064320 1069895 1068090 1058854 1042270
62571A042270k3083k8274l2502l6043l8388l8946l8070l6761l5541l4124l2165
$$ 1042270 1019187 990913 958411 922368 883980 845034 806964 770203 734662 700538 668373
62560F68373k9882k7821k6151k4461k2295j9863j8045j7390j7287j6538j4762
$$ 668373 638491 610670 584519 560058 537763 517900 499855 482465 465178 448640 433878
62549D33878j2802j1552j0865j0043r061q612q935r216q477o711m761l333k521
$$ 433878 421076 409524 398659 388616 379555 370943 362008 352792 344315 337604 332843 329510 326989
62536C26989k141j970j642q01M37J519K152K562K924L030K894L175M372O044P411
$$ 326989 324848 322878 321236 320435 320872 322391 324543 327105 330029 333059 335953 339128 343500 349544 356955
62521C56955Q460R616J0659J1006J1029J2044J4587J7658K0102K2000K4081K6486
$$ 356955 365415 375031 385690 396696 407725 419769 434356 452014 472116 494116 518197 544683
62509E44683K8799L0912L3086L5350L7360L8737L9254L8782L7382L5227L2278
$$ 544683 573482 604394 637480 672830 710190 748927 788181 826963 864345 899572 931850
62498I31850K8245K3014J6785R682J771o430j3934k0130k5159k9260l2258l4042
$$ 931850 960095 983109 999894 1009576 1011347 1004917 990983 970853 945694 916434 884176 850134
62486H50134l4939l5213l4711l3378l1603k9630k7257k4505k1975j9988j8097
$$ 850134 815195 779982 745271 711893 680290 650660 623403 598898 576923 556935 538838
62475E38838j5958j3975j2449j0897r062p712p408p212n932m077l147l269l029
$$ 538838 522880 508905 496456 485559 476497 468785 461377 454165 448233 444156 441009 437740 434711
62462D34711j660J3J003J347J489J611J952K854M071M820M850M749M885M923M647
$$ 434711 433051 433064 434067 435414 436903 438514 440466 443320 447391 452211 457061 461810 466695 471618 476265
62447D76265M384M224L575K113M21p70j532k488m099o442r124j1168j1672j0926
$$ 476265 480649 484873 488448 490561 490982 490212 488680 486192 482093 475651 466527 455359 443687 432761
62433D32761j0218j0150r982q994p681o831o213n064l408j959r80r3R44J959K846
$$ 432761 422543 412393 402411 393417 385736 378905 372692 367628 364220 362261 361281 361188 362132 364091 366937
62418C66937L680M397M859N273N996P027Q055Q992R963J0822J1138J0780J0128
$$ 366937 370617 375014 379873 385146 391142 398169 406224 415216 425179 436001 447139 457919 468047
62405D68047R569R064Q311P114N542L823K173O44p98k054k930l454l960m659n305
$$ 468047 477616 486680 494991 502105 507647 511470 513643 514287 513489 511435 508505 505051 501091 496432 491127
62390D91127n516n261m815m417m176m097l960l304j832J91K234M036N715P500
$$ 491127 485611 480350 475535 471118 466942 462845 458885 455581 453749 453940 456174 460210 465925 473425
62376D73425R507J1730J4037J6291J8621K1383K4618K7784L0375L2635L5261L8466
$$ 473425 482932 494662 508699 524990 543611 564994 589612 617396 647771 680406 715667 754133
62364G54133M1738M4476M6457M7604M7771M6941M5383M3218M0010L5049K8093
$$ 754133 795871 840347 886804 934408 982179 1029120 1074503 1117721 1157731 1192780 1220873
62353A220873J9743J1045K860m499j1080j6971k2138k6491k9930l2362l3833l4707
$$ 1220873 1240616 1251661 1254521 1250022 1238942 1221971 1199833 1173342 1143412 1111050 1077217 1042510
62341A042510l5487l6323l6842l6585l5507l3833l1661k9031k6208k3553k1080
$$ 1042510 1007023 970700 933858 897273 861766 827933 796272 767241 741033 717480 696400
62330F96400j8565j6103j4149j2813j1561r933q239p100o557o092n381m550l694
$$ 696400 677835 661732 647583 634770 623209 613276 605037 597937 591380 585288 579907 575357 571663
62317E71663k668j531p38n99r17j402k091l118m343n526o580p383p660p383o970
$$ 571663 568995 567464 566726 566127 565210 563808 561717 558599 554256 548730 542150 534767 527107 519724 512754
62302E12754o702o271n400m490l957l363k066m73L64L68N10J151J552J429J731
$$ 512754 506052 499781 494381 489891 485934 482571 480505 480032 480396 480764 481274 482425 483977 485406 487137
62287D87137L084M608N275N526O305P194O974N687M709M769N268N678O417P762
$$ 487137 490221 494829 500104 505630 511935 519129 526103 531790 536499 541268 546536 552214 558631 566393
62273E66393R099R847J0411J1485J3019J4545J6096J8125K0766K3675K6539K9289
$$ 566393 575492 585339 595750 607235 620254 634799 650895 669020 689786 713461 740000 769289
62261G69289L1927L4469L7010L9565M1853M3347M3475M1799L8205L3040K6855
$$ 769289 801216 835685 872695 912260 954113 997460 1040935 1082734 1120939 1153979 1180834
62250A180834J9914J2209M015l865j0637j6149k0797k4955k8655l1725l4067l5729
$$ 1180834 1200748 1212957 1216972 1213107 1202470 1186321 1165524 1140569 1111914 1080189 1046122 1010393
62238A010393l6767l7036l6273l4403l1679k8449k5029k1846j9340j7410j5376
$$ 1010393 973626 936590 900317 865914 834235 805786 780757 758911 739571 722161 706785
62227G06785j2889j0580r245q623p733o250m784l758k844j812j156j322j860j873
$$ 706785 693896 683316 674071 665448 657715 651465 646681 642923 640079 638267 637111 635789 633929 632056
62213F32056j069J06J158J925K415K705L019L690M877O322P440P799P696Q030
$$ 632056 630987 631093 632251 634176 636591 639296 642315 646005 650882 657204 664644 672443 680139 688169
62199F88169R330J1121J2627J3838J5315J7052J8315J8849J9488K1148K3644K5877
$$ 688169 697499 708620 721247 735085 750400 767452 785767 804616 824104 845252 868896 894773
62187H94773K6880K6402K4793K2649K0340J7727J4554J1198Q559P159O743O930
$$ 894773 921653 948055 972848 995497 1015837 1033564 1048118 1059316 1067875 1075034 1081777 1088707
62175A088707P705R044J0675J2609J5323J8932K2632K5472K7327K8619K9424K9425
$$ 1088707 1096412 1105456 1116131 1128740 1144063 1162995 1185627 1211099 1238426 1267045 1296469 1325894
62163A325894K8437K6359K2935J8072J2370O856K265j137l391n006o938r733j2787
$$ 1325894 1354331 1380690 1403625 1421697 1434067 1440923 1443188 1442051 1438660 1433654 1426716 1416983 1404196
62150A404196j5015j6215j7075j7896j8041j6871j4658j2194r956q012o436n369
$$ 1404196 1389181 1372966 1355891 1337995 1319954 1303083 1288425 1276231 1266275 1258263 1251827 1246458
62138A246458m735m181l345k086n01J150K572L596M329N184O602Q569J0445J1505
$$ 1246458 1241723 1237542 1234197 1232111 1231610 1232760 1235332 1238928 1243257 1248441 1255043 1263612 1274057 1285562
62124A285562J1760J2014J2951J4397J5702J6612J7467J8646K0087K1425K2400
$$ 1285562 1297322 1309336 1322287 1336684 1352386 1368998 1386465 1405111 1425198 1446623 1469023
62113A469023K3102K3877K4995K6336K7488K8169K8486K8704K8978K9366K9903
$$ 1469023 1492125 1516002 1540997 1567333 1594821 1622990 1651476 1680180 1709158 1738524 1768427
62102A768427L0566L1298L2114L3064L4070L5134L6640L9068M2209M5083M6920
$$ 1768427 1798993 1830291 1862405 1895469 1929539 1964673 2001313 2040381 2082590 2127673 2174593
62091B174593M7852M8321M8291M7459M5979M4461M3428M3204M4062M5997M8360
$$ 2174593 2222445 2270766 2319057 2366516 2412495 2456956 2500384 2543588 2587650 2633647 2682007
62080B682007N0225N1039N0591M8593M4912M0238L5945L3038L1586L1286L2057
$$ 2682007 2732232 2783271 2833862 2882455 2927367 2967605 3003550 3036588 3068174 3099460 3131517
62069C131517L3877L6376L8940M1058M2411M2770M2036M0279L7627L4232L0428
$$ 3131517 3165394 3201770 3240710 3281768 3324179 3366949 3408985 3449264 3486891 3521123 3551551
62058C551551K6675K3225J9959J6667J3323R973O555L026m38l592o413r037j1452
$$ 3551551 3578226 3601451 3621410 3638077 3651400 3661373 3667928 3670954 3670516 3666924 3660511 3651474 3640022
62045C640022j3441j4943j6173j7219j7662j7010j5572j4507j4721j5842j6703
$$ 3640022 3626581 3611638 3595465 3578246 3560584 3543574 3528002 3513495 3498774 3482932 3466229
62034C466229j6752j6584j6896j7419j7186j5767j3838j2466j2096j2297j2393
$$ 3466229 3449477 3432893 3415997 3398578 3381392 3365625 3351787 3339321 3327225 3314928 3302535
62023C302535j2084j1448j0517r074p043m809k941j615n19P23K181L638M824N693
$$ 3302535 3290451 3279003 3268486 3259412 3252369 3247560 3244619 3243004 3242485 3243208 3245389 3249027 3253851 3259544
62009C259544O628Q180J0339J2258J3086J2979J2793J2896J2761J1819J0033P479
$$ 3259544 3266172 3274352 3284691 3296949 3310035 3323014 3335807 3348703 3361464 3373283 3383316 3390795
61997C390795M031j67m491q692j3466j9530k6316l2187l6035l8177l9627m0907
$$ 3390795 3394826 3394659 3390168 3381476 3368010 3348480 3322164 3289977 3253942 3215765 3176138 3135231
61985C135231m1770m1848m1280m0591m0061l9414l8255l6652l5018l3589l2385
$$ 3135231 3093461 3051613 3010333 2969742 2929681 2890267 2852012 2815360 2780342 2746753 2714368
61974B714368l1539l1149l0766k9629k7610k5440k3723k2346k1065k0090j9637
$$ 2714368 2682829 2651680 2620914 2591285 2563675 2538235 2514512 2492166 2471101 2451011 2431374
61963B431374j9313j8592j7516j6481j5581j4688j3870j3237j2549j1536j0405
$$ 2431374 2412061 2393469 2375953 2359472 2343891 2329203 2315333 2302096 2289547 2278011 2267606
61952B267606r528q780p662o053m342k888j661m07J168L217N494P411Q670R688
$$ 2267606 2258078 2249298 2241636 2235583 2231241 2228353 2226692 2226285 2227453 2230670 2236164 2243575 2252245 2261933
61938B261933J1087J2973J5030J7047J9043K1160K3757K7257L1387L5029L7418
$$ 2261933 2273020 2285993 2301023 2318070 2337113 2358273 2382030 2409287 2440674 2475703 2513121
61927B513121L9165M1585M5248M9917N5578O2668P1427Q1814R4106J08798J25891
$$ 2513121 2552286 2593871 2639119 2689036 2744614 2807282 2878709 2960523 3054629 3163427 3289318
61916C289318J45030J66400J90725K18247K48460K80990L15976L53407L92902
$$ 3289318 3434348 3600748 3791473 4009720 4258180 4539170 4855146 5208553 5601455
61907E601455M34482M78577N24497N69313O08590O37624O51389O43859O08430
$$ 5601455 6035937 6514514 7039011 7608324 8216914 8854538 9505927 10149786 10758216
61898A0758216N39527M34509K95545J30998m5222k17096l70663m96194n88252
$$ 10758216 11297743 11732252 12027797 12158795 12113573 11896477 11525814 11029620 10441368
61889A0441368o45529o71008o71014o52778o22151n83259n39526m94201m49735
$$ 10441368 9795839 9124831 8453817 7801039 7178888 6595629 6056103 5561902 5112167
61880E112167m07149l66543l28213k92980k61455k33417k08209j85479j65176
$$ 5112167 4705018 4338475 4010262 3717282 3455827 3222410 3014201 2828722 2663546
61871B663546j47112j31006j16873j04791r4212q4058p3805o4116n6009m9565
$$ 2663546 2516434 2385428 2268555 2163764 2069552 1985494 1911689 1847573 1791564 1741999
61861A741999m3849l8037l2217k7005k2562j8376j4011r795o341l594q27K193
$$ 1741999 1698150 1660113 1627896 1600891 1578329 1559953 1545942 1536147 1529806 1526212 1525385 1527578
61849A527578M680N822N887N739N545M726L123J430K73n10j295j881j710o47Q45
$$ 1527578 1532258 1538080 1543967 1549706 1555251 1559977 1563100 1564530 1564803 1564293 1562998 1561117 1559407 1558760 1559605
61834A559605K239L425M632O002P316Q196Q502Q333P604O083M075K543K055K008
$$ 1559605 1561844 1565269 1569901 1575903 1583219 1591415 1599917 1608250 1615854 1621937 1626012 1628555 1630610 1632618
61820A632618J584J104J543K972M497N872P972J1321J5141J8471K1430K4589K7908
$$ 1632618 1634202 1635306 1636849 1639821 1644318 1650190 1658162 1669483 1684624 1703095 1724525 1749114 1777022
61807A777022L1114L4650L9268M4941N0979N7118O3709P0918P8429Q6064R4007
$$ 1777022 1808136 1842786 1882054 1926995 1977974 2035092 2098801 2169719 2248148 2334212 2428219
61796B428219J02317J10843J19879J30405J43374J58964J76693J96086K17248
$$ 2428219 2530536 2641379 2761258 2891663 3035037 3194001 3370694 3566780 3784028
61787C784028K41004K68511L00363L36161L75411M18796M67894N23386N84208
$$ 3784028 4025032 4293543 4593906 4930067 5305478 5724274 6192168 6715554 7299762
61778G299762O48954P17573P90848Q68300R47214J023385J091604J144616J172130
$$ 7299762 7948716 8666289 9457137 10325437 11272651 12296036 13387640 14532256 15704386
61769A5704386J161818J101864R83415Q02634N63036K77453l2523l40558o21298
$$ 15704386 16866204 17968068 18951483 19754117 20317153 20594606 20562083 20221525 19600227
61760A9600227q55063j030239j143640j199341j206422j176273j120155j047619
$$ 19600227 18745164 17714925 16571285 15371944 14165522 12989249 11869094 10821475
61752A0821475r65990q80783p96308p15724o40793n72069n09636m53533m03561
$$ 10821475 9855485 8974702 8178394 7462670 6821877 6249808 5740172 5286639 4883078
61743D883078l59219l20040k85717k55708k29076k05038j83376j64119j47081
$$ 4883078 4523859 4203819 3918102 3662394 3433318 3228280 3044904 2880785 2733704
61734B733704j31931j18405j06166r4877q4605p5778o8382o1687n5179m9314m4823
$$ 2733704 2601773 2483368 2377202 2282325 2197720 2121942 2053560 1991873 1936694 1887380 1842557
61723A842557m1725l9536l7990l6837l5434l3471l1726l1131l1239l0610k8727
$$ 1842557 1800832 1761296 1723306 1686469 1651035 1617564 1585838 1554707 1523468 1492858 1464131
61712A464131k6459k4620k3120k1778k0838k0299j9555j8316j7117j6485j6237
$$ 1464131 1437672 1413052 1389932 1368154 1347316 1327017 1307462 1289146 1272029 1255544 1239307
61701A239307j6069j6146j6540j6723j6197j5195j4197j3209j2079j1098j0668
$$ 1239307 1223238 1207092 1190552 1173829 1157632 1142437 1128240 1115031 1102952 1091854 1081186
61690A081186j0653j0536j0046r253q302p446o970o802o499n910n452n369n278
$$ 1081186 1070533 1059997 1049951 1040698 1032396 1024950 1017980 1011178 1004679 998769 993317 987948 982670
61677I82670m848m445m508m742m588m093l723l580l474l545m045m653m703m159
$$ 982670 977822 973377 968869 964127 959539 955446 951723 948143 944669 941124 937079 932426 927723 923564
61663I23564l661l621l850m094m438m860m991m564l816l194k817k461j954j405
$$ 923564 919903 916282 912432 908338 903900 899040 894049 889485 885669 882475 879658 877197 875243 873838
61649H73838j068j012j008p89m06j20NJ25K42K31L13R99K280L447M084M721N950
$$ 873838 872770 871758 870750 869961 869555 869435 869440 869565 869807 870038 870351 871350 873630 877077 881161 885882 891832
61632H91832P332P884P386O597O250O487P126P811P863O683M421J818p21l335
$$ 891832 899164 907048 914434 921031 927281 933768 940894 948705 956568 963251 967672 969490 968769 965434
61618I65434n979q039r004r096q988r152r636j0246j0742j1038j1209j1235j0812
$$ 965434 959455 951416 942412 933316 924328 915176 905540 895294 884552 873514 862305 851070 840258
61605H40258r800q721q315q540q551p832o882o394o218n602m313l039k634l165
$$ 840258 830458 821737 813422 804882 796331 788499 781617 775223 769005 763403 759090 756051 753417 750252
61591G50252l746l243j267J362L204L518K959K889M013N848P468Q505R317J0327
$$ 750252 746506 743263 741996 743358 746562 750080 753039 755928 759941 765789 773257 781762 791079 801406
61577H01406J1465J2378J2992J3712J5042J7057J9345K1283K2474K3018K3471
$$ 801406 812871 825249 838241 851953 866995 884052 903397 924680 947154 970172 993643
61566I93643K4368K5656K6614K6499K5271K3699K2725K2710K3178K3266K2499
$$ 993643 1018011 1043667 1070281 1096780 1122051 1145750 1168475 1191185 1214363 1237629 1260128
61555A260128K1206K0104J9571J9363J8940J7946J6382J4594J3075J1941J0593
$$ 1260128 1281334 1301438 1321009 1340372 1359312 1377258 1393640 1408234 1421309 1433250 1443843
61544A443843Q202M711J004k105m770p660j0854j3606j5162j5530j5377j5380
$$ 1443843 1452045 1456756 1457760 1455655 1450885 1443225 1432371 1418765 1403603 1388073 1372696 1357316
61532A357316j5715j5959j5449j3834j1404q827o550m490k271L19L181O215R664
$$ 1357316 1341601 1325642 1310193 1296359 1284955 1276128 1269578 1265088 1262817 1263136 1266317 1272532 1282196
61519A282196J3839J8561K3158K7314L1585L6741M2797M9214N5896O3431P2212
$$ 1282196 1296035 1314596 1337754 1365068 1396653 1433394 1476191 1525405 1581301 1644732 1716944
61508A716944Q1944R2118J02595J13534J25244J38203J52689J68162J83487J97989
$$ 1716944 1798888 1891006 1993601 2107135 2232379 2370582 2523271 2691433 2874920 3072909
61498C072909K11675K24065K33385K37390K34518K23723K03923J74484J36345
$$ 3072909 3284584 3508649 3742034 3979424 4213942 4437665 4641588 4816072 4952417
61489D952417R2104M5034j747m5627q4693j17722j43717j61767j71831j75269
$$ 4952417 5044521 5089555 5087808 5042181 4957488 4839766 4696049 4534282 4362451 4187182
61479D187182j73945j68949j60712j50098j38488j26628j14127j00418q5797p1285
$$ 4187182 4013237 3844288 3683576 3533478 3394990 3268362 3154235 3053817 2968020 2896735
61469B896735n7808m5673l4594k4035j3736l999M663J2155J8913K5440L1903L8093
$$ 2896735 2838927 2793254 2758660 2734625 2720889 2716890 2721553 2733708 2752621 2778061 2809964 2848057
61457B848057M3464M7356M9494N0248N0206M9577M8276M6419M4391M2487M0873
$$ 2848057 2891521 2938877 2988371 3038619 3088825 3138402 3186678 3233097 3277488 3319975 3360848
61446C360848L9840L9709M0461M1703M3038M4208M5012M5387M5506M5423M4726
$$ 3360848 3400688 3440397 3480858 3522561 3565599 3609807 3654819 3700206 3745712 3791135 3835861
61435C835861M2878L9928L6411L2526K7791K1663J4236O179j827r461j6716k3631
$$ 3835861 3878739 3918667 3955078 3987604 4015395 4037058 4051294 4057473 4055646 4046185 4029469 4005838
61423D005838k9983l5348l9456m2374m4228m4961m4486m2859m0116l6211l1353
$$ 4005838 3975855 3940507 3901051 3858677 3814449 3769488 3725002 3682143 3642027 3605816 3574463
61412C574463k6115k0929j5819j0833o410k914j92J969L329L620L021J678q03
$$ 3574463 3548348 3527419 3511600 3500767 3494357 3491443 3491251 3493220 3496549 3500169 3503190 3504868 3504065
61399C504065m581q633j1531j3030j3964j4537j3731j0628n430J264R442J9476
$$ 3504065 3499484 3490851 3479320 3466290 3452326 3437789 3424058 3413430 3408000 3409264 3418706 3438182
61387C438182L1431M5027N9952P5873R2567J10157J28882J48417J67909J86797
$$ 3438182 3469613 3514640 3574592 3650465 3743032 3853189 3982071 4130488 4298397 4485194
61377D485194K05048K22350K37644K49713K57581K59993K55040K40977K17229
$$ 4485194 4690242 4912592 5150236 5399949 5657530 5917523 6172563 6413540 6630769
61368F630769J84425J43987R8187N0046K441m2679q3940j19942j49730j73762
$$ 6630769 6815194 6959181 7057368 7107414 7109855 7067176 6983236 6863294 6713564 6539802
61358F539802j93608k10416k24063k33892k39867k42656k42797k40095k33930
$$ 6539802 6346194 6135778 5911715 5677823 5437956 5195300 4952503 4712408 4478478
61349D478478k24141k11481j97213j82348j67347j52377j37562j22925j08454
$$ 4478478 4254337 4042856 3845643 3663295 3495948 3343571 3206009 3083084 2974630
61340B974630r4359q1033o8647n6928m5518l4424k3973j4423n657K703J0870J8548
$$ 2974630 2880271 2799238 2730591 2673663 2628145 2593721 2569748 2555325 2549668 2552371 2563241 2581789
61328B581789K5186L0721L5768M0692M4859M7348M8299M8805M9363M9288M7987
$$ 2581789 2606975 2637696 2673464 2714156 2759015 2806363 2854662 2903467 2952830 3002118 3050105
61317C050105M5990M4100M2092L9088L4974L0549K6328K1952J7020J1764O642
$$ 3050105 3096095 3140195 3182287 3221375 3256349 3286898 3313226 3335178 3352198 3363962 3370604
61306C370604J693l111p367j0598j3034j5429j8059k0510k2590k4880k7938l1404
$$ 3370604 3372297 3369186 3361819 3351221 3338187 3322758 3304699 3284189 3261599 3236719 3208781 3177377
61294C177377l4477l7034l9587m2193m4205m5196m5424m5077m3748m1092l7468
$$ 3177377 3142900 3105866 3066279 3024086 2979881 2934685 2889261 2844184 2800436 2759344 2721876
61283B721876l3406k9013k4382k0081j6520j3272r789o448m129k991k462k313
$$ 2721876 2688470 2659457 2635075 2614994 2598474 2585202 2575413 2568965 2564836 2561845 2559383 2557070
61271B557070k813l958n364p037r400j2428j5543j8398k1072k3289k4277k3632
$$ 2557070 2554257 2550299 2544935 2537898 2528498 2516070 2500527 2482129 2461057 2437768 2413491 2389859
61259B389859k1542j7990j2468m860M168J4016K4707L6234M8060N9709P1219Q2557
$$ 2389859 2368317 2350327 2337859 2332999 2337167 2351183 2375890 2412124 2460184 2519893 2591112 2673669
61247B673669R3230J02874J11556J18857J23287J23316J18555J09323R5543P6740
$$ 2673669 2766899 2869773 2981329 3100186 3223473 3346789 3465344 3574667 3670210 3746950
61237C746950N2884K4601p091m0534p3164j02159j25477j42142j51966j55528
$$ 3746950 3799834 3824435 3817344 3776810 3703646 3601487 3476010 3333868 3181902 3026374
61227C026374j54140j49147j41338j31318j20155j09097r8779q9206q0361p2380
$$ 3026374 2872234 2723087 2581749 2450431 2330276 2221179 2122400 2033194 1952833 1880453
61217A880453o5277n8868n2926m7141m1121l4769k8424k2406j6664j1164o141
$$ 1880453 1815176 1756308 1703382 1656241 1615120 1580351 1551927 1529521 1512857 1501693 1495552
61206A495552j662K631O944J0890J4037J6386J7828J7807J6113J3497J0734P672
$$ 1495552 1493890 1496521 1503465 1514355 1528392 1544778 1562606 1580413 1596526 1610023 1620757 1628429
61194A628429M160J232J34M26L93p49k300l793n843q833j2014j4699j7311k0468
$$ 1628429 1632589 1633821 1633955 1634381 1634774 1634025 1631725 1627932 1622089 1613256 1601242 1586543 1569232 1548764
61180A548764k3705k5997k7077k7520k7815k7990k7926k7455k6348k4645k2822
$$ 1548764 1525059 1499062 1471985 1444465 1416650 1388660 1360734 1333279 1306931 1282286 1259464
61169A259464k1336k0190j9203j8343j7523j6468j5229j4293j3803j3091j1664
$$ 1259464 1238128 1217938 1198735 1180392 1162869 1146401 1131172 1116879 1103076 1089985 1078321
61158A078321j0215r916j0975j2653j4559j7017k0095k3121k5435k6941k7625
$$ 1078321 1068106 1058190 1047215 1034562 1020003 1002986 982891 959770 934335 907394 879769
61147H79769k7183k5564k3345k1065j8612j5724j2756j0315q385o401m172k149
$$ 879769 852586 827022 803677 782612 764000 748276 735520 725205 716820 710419 706247 704098
61135G04098p49J09P23J331K204L577N279O823Q031R165J0272J0903J0844J0684
$$ 704098 703349 703458 704181 705512 707716 711293 716572 723395 731426 740591 750863 761766 772610 783294
61121G83294J1130J2093J2995J3695J4474J5217J5379J4823J4056J3323J2140
$$ 783294 794424 806517 819512 833207 847681 862898 878277 893100 907156 920479 932619
61110I32619J0068P435M845K310n76l783o660q603r552r834r823r785r864j0097
$$ 932619 942687 950122 954967 957277 956701 952918 946258 937655 928103 918269 908446 898661 888797 878700
61096H78700j0552j1295j2122j2479j1996j1069j0628j1203j2352j3106j2945
$$ 878700 868148 856853 844731 832252 820256 809187 798559 787356 775004 761898 748953
61085G48953j2227j1683j1560j1432j0879j0077r452q935q042o676n309m219l099
$$ 748953 736726 725043 713483 702051 691172 681095 671643 662708 654666 647990 642681 638462 635363
61072F35363j740n88q2J18O55J451J890J894K058K656L174L144K886K980L416
$$ 635363 633623 633035 632953 633071 633726 635177 637067 638961 641019 643675 646849 649993 652879 655859 659275
61057F59275L662L382K793K357K412K901L329L131K297J471J296J811K656L621
$$ 659275 662937 666319 669112 671469 673881 676782 680111 683242 685539 687010 688306 690117 692773 696394
61043F96394M745N994P160Q049Q564Q735Q813R161R888J0672J1222J1668J2212
$$ 696394 701139 707133 714293 722342 730906 739641 748454 757615 767503 778175 789397 801065 813277
61030H13277J2553J2216J1359J0813J1119J1910J2371J2100J1400J0975J1399
$$ 813277 825830 838046 849405 860218 871337 883247 895618 907718 919118 930093 941492
61019I41492J2644J4058J4956J5288J5526J6065J7069J8640K0711K2931K5236
$$ 941492 954136 968194 983150 998438 1013964 1030029 1047098 1065738 1086449 1109380 1134616
61008A134616K8347L2812L7736M1594M4437M8051N3381N9118O3581O6850P0007
$$ 1134616 1162963 1195775 1233511 1275105 1319542 1367593 1420974 1480092 1543673 1610523 1680530
60997A680530P3541P7817Q4158R3702J05846J19301J34104J51031J69807J89900
$$ 1680530 1754071 1831888 1916046 2009748 2115594 2234895 2368999 2520030 2689837 2879737
60987B879737K12653K40620K75276L17604L70205M35654N13082O00168O99067
$$ 2879737 3092390 3333010 3608286 3925890 4296095 4731749 5244831 5844999 6544066
60978F544066Q16439R57262J124509J327215J580539J887918K222155K525901
$$ 6544066 7360505 8317767 9442276 10769491 12350030 14237948 16460103 18986004
60970A8986004K724538K733672K472457J910180J129102L32002k48613m80587
$$ 18986004 21710542 24444214 26916671 28826851 29955953 30287955 30039342 29558755
60962B9558755l90542j12809J97152M00211L70398K0709o29315j421403k126943
$$ 29558755 29168213 29055404 29252556 29652767 30023165 30043874 29414559 27993156 25866213
60953B5866213k573184k718928k629435k401609k114002j818679j546460j308610
$$ 25866213 23293029 20574101 17944666 15543057 13429055 11610376 10063916 8755306
60945H755306j102551r23581p70805o43286n37105m48858l77948l23216k80604
$$ 8755306 7652755 6729174 5958369 5315083 4777978 4329120 3951172 3627956 3347352
60936C347352k46231k18845j97403j79078j61803j46238j33164j21114j08594
$$ 3347352 3101121 2882276 2684873 2505795 2343992 2197754 2064590 1943476 1834882
60927A834882r6469q6065p6915o8472o2161n9266n8376n7181n5420n3795n1457
$$ 1834882 1738413 1652348 1575433 1506961 1444800 1385534 1327158 1269977 1214557 1160762 1109305
60916A109305m7167m1913l7693l4465l0706k6480k3409k1860k0558j8872j7383
$$ 1109305 1062138 1020225 982532 948067 917361 890881 867472 845612 825054 806182 788799
60905G88799j6051j3972j1185q946p836p130o255n445m718l583k019n95M83J452
$$ 788799 772748 758776 747591 738645 730809 723679 717424 711979 707261 703678 701659 701064 701547 702999
60891G02999K211K601L201M618O233O887O599O214N709M414K683J599R96m67l026
$$ 702999 705210 707811 711012 715630 721863 728750 735349 741563 747272 751686 754369 755968 756964 756497 753471
60876G53471n340o609p550q762r714r977j0049j0193r783q507p180o537o201n480
$$ 753471 748131 741522 733972 725210 715496 705519 695470 685277 675494 666987 659807 653270 647069 641589
60862F41589m385l245k102j061m08K9R27K424L799M591N233O299P808R593J1559
$$ 641589 637204 633959 631857 630796 630388 630417 631344 633768 637567 642158 647391 653690 661498 671091 682650
60847F82650J3283J4239J4694J5477J6643J7336J7242J7111J7350J7222J6021
$$ 682650 695933 710172 724866 740343 756986 774322 791564 808675 826025 843247 859268
60836H59268J4040J1784R216O534M738M488N093N441N280M834L869K033k90k333
$$ 859268 873308 885092 894308 900842 905580 910068 915161 920602 925882 930716 934585 936618 936328 933995
60822I33995l838m927n473n343m967n042n862p306r141j0922j2028j2371j2643
$$ 933995 930157 925230 919757 914414 909447 904405 898543 891237 882096 871174 859146 846775 834132
60809H34132j3326j3835j3386j2232j1349j1079j0862j0242r381q505p482o190
$$ 834132 820806 806971 793585 781353 770004 758925 748063 737821 728440 719935 712453 706263
60797G06263m841l665k565j352j63P06J308K145L553N212O480P167P602P987Q124
$$ 706263 701422 697757 695192 693840 693677 694383 695691 697836 701389 706601 713081 720248 727850 735837 743961
60782G43961P927P689P519P046O139N428N485N943O080N941O077O517O782O825
$$ 743961 751888 759577 767096 774142 780281 785709 791194 797137 803217 809158 815235 821752 828534 835359
60768H35359P061P572Q089Q672R607J0552J0679R762Q368O941N473M156L481L414
$$ 835359 842420 849992 858081 866753 876360 886912 897591 907353 915721 922662 928135 932291 935772 939186
60754I39186L271K670J985J660J715K049K554K792K218R48l26j292k293l552m803
$$ 939186 942457 945127 947112 948772 950487 952536 955090 957882 960100 961048 960722 959430 957137 953585 948782
60739I48782n806o566o981o954o836p061p362p168o752p054q269r562j0298j0547
$$ 948782 942976 936410 929429 922475 915639 908578 901216 894048 887296 880242 871973 862411 852113 841566
60725H41566j0317r407q269p906q439q832q464q023q245q698q490p501o318n477
$$ 841566 831249 821842 813573 805667 797228 788396 779932 771909 763664 754966 746476 738975 732657 727180
60711G27180n187n308n267m513l261k179j352k34J341K966M425N645N989M826
$$ 727180 721993 716685 711418 706905 703644 701465 700113 699879 701220 704186 708611 714256 720245 725071
60697G25071K887J721J633J485O65k69j209k976n540p486q180q847j0434j1986
$$ 725071 727958 729679 731312 732797 733462 733193 731984 729008 723468 715982 707802 698955 688521 676535
60683F76535j2378j2157j2236j2102j0881r156q141p823p433o922o539n722l927
$$ 676535 664157 652000 639764 627662 616781 607625 599484 591661 584228 577306 570767 565045 561118
60670E61118j915p51q7J054K390K911K773L059L803M004L521L347L865M262L995
$$ 561118 559203 558452 558365 559419 561809 564720 567493 570552 574355 578359 581880 585227 589092 593354 597349
60655E97349L559L391L166K624K283K796M082N449O176O011N437N273N661N812
$$ 597349 600908 604299 607465 610089 612372 615168 619250 624699 630875 636886 642323 647596 653257 659069
60641F59069N210M610N125O782Q719J0386J1720J2519J2597J2369J2443J2786
$$ 659069 664279 668889 674014 680796 689515 699901 711621 724140 736737 749106 761549 774335
60629G74335J3026J3193J3419J3267J2305J1013J0142R467Q061N643K771m6k548
$$ 774335 787361 800554 813973 827240 839545 850558 860700 870167 878228 883871 886642 886596 884048
60616H84048m257m894n080n733o831p639p977q311q699q636p922o826n415l542
$$ 884048 879791 874897 869817 864084 857253 849614 841637 833326 824627 815991 808069 801243 795828 792286
60602G92286j548j81J46l92j346k036j789r45r25k346l729l283j499m81r46j515
$$ 792286 790738 790557 790703 790311 788965 786929 785140 784195 783270 780924 777195 773912 772413 771932 770986 769471
60586G69471r66L00J354J921K055J793J479J483J378M56q42j258p27p44k132l695
$$ 769471 768505 768805 770159 772080 774135 775928 777407 778890 780268 780724 779882 778624 777897 777153 775021 771326
60570G71326l945l130k717l480m951o263o909o921o796o975p221o967o278n854
$$ 771326 767381 764251 761534 758054 753103 746840 739931 733010 726214 719239 712018 705051 698773 692919
60556F92919n896n707m731l266j771j40J901M200O413Q392J0019J1098J1757J2605
$$ 692919 687023 681316 676585 673319 671548 671408 673309 677509 683922 692314 702333 713431 725188 737793
60542G37793J4186J6575J9634K3247K7219L1379L5876M0768M5279M8125M8795
$$ 737793 751979 768554 788188 811435 838654 870033 905909 946677 991956 1040081 1088876
60531A088876M7784M5201L9891L0626J7840L604r912k1469l0466l6316l8546l7426
$$ 1088876 1136660 1181861 1221752 1252378 1270218 1273822 1263910 1242441 1211975 1175659 1137113 1099687
60519A099687l4071k9625k4403j8235j1534n447o93L074O346Q847J0183J0706
$$ 1099687 1065616 1035991 1011588 993353 981819 976372 975679 978753 985099 993946 1004129 1014835
60507A014835J1072J1300J1239J1501J3020J5791J9053K2662K7378L3702M1268
$$ 1014835 1025907 1037207 1048446 1059947 1072967 1088758 1107811 1130473 1157851 1191553 1232821
60496A232821M9567N8561O8519P9747R2524J06634J21003J34348J46197J56958
$$ 1232821 1282388 1340949 1409468 1489215 1581739 1688373 1809376 1943724 2089921 2246879
60486B246879J67361J78480J91878K08719K28681K50251K71502K89495K99099
$$ 2246879 2414240 2592720 2784598 2993317 3221998 3472249 3743751 4033246 4332345
60477D332345K93736K67910K19189J48815O1885l3285j27479k12767k82559l31102
$$ 4332345 4626081 4893991 5113180 5261995 5323880 5290595 5163116 4950349 4667790 4336688
60467D336688l55411l57793l44619l21978k93511k62087k31060k02746j77165
$$ 4336688 3981277 3623484 3278865 2956887 2663376 2401289 2170229 1967483 1790318
60458A790318j53557j32186j13818r8471q5692p5223o6560n8651n0926m4025l8727
$$ 1790318 1636761 1504575 1390757 1292286 1206594 1131371 1064811 1006160 955234 911209 872482
60447H72482l4694l0929k6951k2983j9460j6912j5692j5324j4679j3287j1824
$$ 872482 837788 806859 779908 756925 737465 720553 704861 689537 674858 661571 649747
60436F49747j0919j0198r158q213q082q560q626p553n509l350k038j925k356k403
$$ 649747 638828 628630 619472 611259 603177 594617 585991 578438 572929 569579 567541 565616 563260 560857
60422E60857k039j906j962j323K86J859K493K484K550K708K658K485K303J828
$$ 560857 558818 556912 554950 553627 553913 555772 558265 560749 563299 566007 568665 571150 573453 575281
60408E75281J003N04Q74J684K246K656L397M301M699M395L840L523L639M283N392
$$ 575281 576284 576788 577662 579346 581592 584248 587645 591946 596645 601040 604880 608403 612042 616325 621717
60393F21717O632P566P925P597O636N424M503L997L527K705J475p4j767l219m149
$$ 621717 628349 635915 643840 651437 658073 663497 668000 671997 675524 678229 679704 679630 677863 674644 670495
60378F70495m714n125n130m484l721l571l775l515k857k650k916k637j473m30
$$ 670495 665781 660656 655526 651042 647321 643750 639975 636460 633603 630953 628037 625400 623927 623497
60364F23497l30p20q42o52l27L30J331K211K798L441M109M218L786L698M286M704
$$ 623497 623167 622447 621605 620953 620626 620956 622287 624498 627296 630737 634846 639064 642850 646548 650834 655538
60348F55538M347L809L754L888L760L580L488L057K250J833K071K074J316N92
$$ 655538 659885 663694 667448 671336 675096 678676 682164 685221 687471 689304 691375 693449 694765 695357
60334F95357N89O43P8m31m5P00R63J198K182L286L366K740K619L023K845J809
$$ 695357 695946 696589 696667 696236 696191 696891 697854 699052 701234 704520 707886 710626 713245 716268 719113 720922
60318G20922P89K20l74j230j903k175k327k430k222j718j176n97pM3q31j964k313
$$ 720922 721711 721931 721557 720327 718424 716249 713922 711492 709270 707552 706376 705779 705772 705815 704984 703020 700707
60301G00707j842j368j284j341j393j439j116j34R43J300J092J134J561J732J433
$$ 700707 698865 697497 696213 694872 693479 692040 690924 690790 691733 693033 694125 695259 696820 698552 699985
60286F99985J176J307J631J958K305K570K661K861L477M304N062N906O895P401
$$ 699985 701161 702468 704099 706057 708362 710932 713593 716454 719931 724235 729297 735203 742098 749499
60272G49499O942O202O243P030P744Q181Q848R895J1068J2484J4382J6258J7434
$$ 749499 756441 762643 768886 775916 783660 791841 800689 810584 821652 834136 848518 864776 882210
60259H82210J8296J9881K2257K4495K6286K8329L0996L3786L6403L9367M3126
$$ 882210 900506 920387 942644 967139 993425 1021754 1052750 1086536 1122939 1162306 1205432
60248A205432M7437N1960N6753O1888O7224P2796P8776Q4944R0795R6241J01615
$$ 1205432 1252869 1304829 1361582 1423470 1490694 1563490 1642266 1727210 1818005 1914246 2015861
60237B015861J06874J11362J14295J15043J13163J08793J02778R5651Q6908P5999
$$ 2015861 2122735 2234097 2348392 2463435 2576598 2685391 2788169 2883820 2970728 3046727
60227C046727O3562N0660L7257K2792P960n553j7104k7366l6482m3394m7414m9027
$$ 3046727 3110289 3160949 3198206 3220998 3228958 3223405 3206301 3178935 3142453 3099059 3051645 3002618
60215C002618m8623m5722m0106l2566k3845j3829k600Q732J9194K9323M0486N3200
$$ 3002618 2953995 2908273 2868167 2835601 2811756 2797927 2795327 2804059 2823253 2852576 2893062 2946262
60203B946262O6736P9952R1915J02043J10188J16475J20752J22433J20899J15780
$$ 2946262 3012998 3092950 3184865 3286908 3397096 3513571 3634323 3756756 3877655 3993435
60193C993435J06895R4549P9870O4103M7451K9348R997r310k7586m4882o1184
$$ 3993435 4100330 4194879 4274749 4338852 4386303 4415651 4425648 4416338 4388752 4343870 4282686
60182D282686p5447q6468r3967r8193r9028r6306r0540q2664p3133o1884m8933
$$ 4282686 4207239 4120771 4026804 3928611 3829583 3733277 3642737 3560073 3486940 3425056 3376123
60171C376123l4569j9137l027J3190K8901M3616N6889O8242P7180Q3068Q5019
$$ 3376123 3341554 3322417 3319390 3332580 3361481 3405097 3461986 3530228 3607408 3690476 3775495
60160C775495Q2461P5895O6634N5636M3050K9045J4473L46j2717k4191l3193l9022
$$ 3775495 3857956 3933851 4000485 4056121 4099171 4128216 4142689 4143035 4130318 4106127 4072934 4033912
60148D033912m1863m2363m0550l5675k7260j5898k686J1945K8474M7226O7426
$$ 4033912 3992049 3949686 3909136 3873461 3846201 3830303 3827617 3839562 3868036 3915262 3982688
60137C982688Q7805J08007J28854J51084J74487J98553K23297K48827K74560K99469
$$ 3982688 4070493 4178500 4307354 4458438 4632925 4831478 5054775 5303602 5578162 5877631
60127E877631L22762L43762L61372L74315L81751L83198L78174L66397L47933
$$ 5877631 6200393 6544155 6905527 7279842 7661593 8044791 8422965 8789362 9137295
60118I137295L22632K90037K50583K06289J59185J09405N6044l82n7505j13029
$$ 9137295 9459927 9749964 10000547 10206836 10366021 10475426 10531470 10531088 10473583 10360554
60108A0360554j65856k15063k58921k95415l22998l40688l48184l46216l36081
$$ 10360554 10194698 9979635 9720714 9425299 9102301 8761613 8413429 8067213 7731132
60099G731132l18767k94997k66062k33739j99415j63965j28425r3779o0188k7434
$$ 7731132 7412365 7117368 6851306 6617567 6418152 6254187 6125762 6031983 5971795 5944361
60089E944361L849L2339N7418P9208R7126J09672J15970J16324J10927R9308Q1748
$$ 5944361 5948210 5980549 6037967 6117175 6214301 6323973 6439943 6556267 6667194 6766502 6848250
60078F848250O0105L6488J2009j2596l6069n7273p6075r2973j08359j22527j35604
$$ 6848250 6908355 6944843 6956852 6944256 6908187 6850914 6774839 6681866 6573507 6450980 6315376
60067F315376j46970j55585j61341j65265j67801j67905j64502j57922j49051
$$ 6315376 6168406 6012821 5851480 5686215 5518414 5350509 5186007 5028085 4879034
60058D879034j37968j24525j09528r4117p8427o1839m4283k6263p903J1011L0064
$$ 4879034 4741066 4616541 4507013 4412896 4334469 4272630 4228347 4202084 4194181 4205192 4235256
60047D235256M8320O5400Q1699R7270J11238J22406J29988J33548J32714J27268
$$ 4235256 4283576 4348976 4430675 4527945 4639183 4761589 4891577 5025125 5157839 5285107
60037E285107J17276J02990Q4779O3273L9453J4478j0644l5291n9087q1523j01791
$$ 5285107 5402383 5505373 5590152 5653425 5692878 5707356 5696712 5661421 5602334 5520811 5419020
60026E419020j19087j32859j42578j47685j48165j44871j38712j29799j18042
$$ 5419020 5299933 5167074 5024496 4876811 4728646 4583775 4445063 4315264 4197222
60017D197222j04296q9938p5265n9383m1921k3948o735R717K6289M3489O1075
$$ 4197222 4092926 4002988 3927723 3868340 3826419 3802471 3795736 3805453 3831742 3875231 3936306
60006C936306P8680R6220J13817J31396J48148J62565J73316J80001J82517J80045
$$ 3936306 4014986 4111206 4225023 4356419 4504567 4667132 4840448 5020449 5202966 5383011
59996E383011J71557J57223J38317J15669Q9341O0112L0031Q05k7483n5317q2165
$$ 5383011 5554568 5711791 5850108 5965777 6055118 6115230 6145261 6146066 6118583 6063266 5981101
59985E981101j06646j27655j44499j56424j62735j63298j58432j48588j34466
$$ 5981101 5874455 5746800 5602301 5445877 5283142 5119844 4961412 4812824 4678358
59976D678358j17151r7784p7331n6764l6942j8072K61J8261L5527N1671O6672
$$ 4678358 4561207 4463423 4386092 4329328 4292386 4274314 4274575 4292836 4328363 4380034 4446706
59965D446706Q0430R2474J02427J10292J15981J19066J19204J16288J10130J00695
$$ 4446706 4527136 4619610 4722037 4832329 4948310 5067376 5186580 5302868 5412998 5513693
59955E513693Q8788P5806O2557M9094L5835K3967J4323O757J167j553j41N955
$$ 5513693 5602481 5678287 5740844 5789938 5825773 5849740 5864063 5870820 5871987 5870434 5870293 5876248
59943E876248J6525L1152M9467P1423R7487J27856J61364J95997K30716K65914
$$ 5876248 5892773 5923925 5973392 6044815 6142302 6270158 6431522 6627519 6858235 7124149
59933G124149L01636L36314L67711L94152M14189M25769M26395M13607L85128
$$ 7124149 7425785 7762099 8129810 8523962 8938151 9363920 9790315 10203922 10589050
59924A0589050L39530K77436K01543J15353K2696p1437j61111k41322l09003l62001
$$ 10589050 10928580 11206016 11407559 11522912 11545608 11474171 11313060 11071738 10762735 10400734
59914A0400734l98634m19018m25477m20523m05346l81115l50400l16098k79760
$$ 10400734 10002100 9583082 9157605 8737082 8331736 7950621 7600221 7284123 7004363
59905G004363k42147k04370j67217j30293r3222n7070k3248Q380L8971O8775R7004
$$ 7004363 6762216 6557846 6390629 6260336 6167114 6110044 6086796 6095176 6134147 6202922 6299926
59894F299926J23073J46531J66116J80163J87865J88914J82198J66168J40460
$$ 6299926 6422999 6569530 6735646 6915809 7103674 7292588 7474786 7640954 7781414
59885G781414J06179O4667J7038l5036q8987j41760j90008k30383k60785k81312
$$ 7781414 7887593 7952260 7969298 7934262 7845275 7703515 7513507 7283124 7022339 6741027
59875F741027k93236k97280k93609k83099k67525k48576k27521k05631j84017
$$ 6741027 6447791 6150511 5856902 5573803 5306278 5057702 4830181 4624550 4440533
59866D440533j63107j43039j24484j08380r5091q4547p6872p2054o9279o7366
$$ 4440533 4277426 4134387 4009903 3901523 3806432 3721885 3645013 3572959 3503680 3436314
59856C436314o5671o3849o1136n6720n0581m3229l4998k6312j8160j1455o338
$$ 3436314 3370643 3306794 3245658 3188938 3138357 3095128 3060130 3033818 3015658 3004203 2997865
59845B997865k974k380n343j1024j7802k5109l3222m1581m8685n3584n6229n6489
$$ 2997865 2994891 2992511 2987168 2976144 2958342 2933233 2900011 2858430 2809745 2756161 2699932 2643443
59833B643443n4083m9534m4021l8154l1781k4971j8115j1146l653M219J1980J9745
$$ 2643443 2589360 2539826 2495805 2457651 2425870 2400899 2382784 2371638 2367985 2372204 2384184 2403929
59821B403929K7859L5746M2194M6836N0242N2763N4554N6545N9782O3614O5930
$$ 2403929 2431788 2467534 2509728 2556564 2606806 2659569 2714123 2770668 2830450 2894064 2959994
59810B959994O5513O2716N7593M9071L6922K3228J0808R51o518j1791j4611j4736
$$ 2959994 3025507 3088223 3145816 3194887 3231809 3255037 3265845 3266796 3260278 3248487 3233876 3219140
59798C219140j2074o672J009J0193K0503L2089M4968N8849P3897R0876J10100
$$ 3219140 3207066 3200394 3201403 3211596 3232099 3264188 3309156 3368005 3441902 3532778 3642878
59787C642878J30987J53129J77124K03775K32920K63620K95002L26152L55066
$$ 3642878 3773865 3926994 4104118 4307893 4540813 4804433 5099435 5425587 5780653
59778E780653L77830L88702L81038L49053K89861K04976J00815j1790j19600k10591
$$ 5780653 6158483 6547185 6928223 7277276 7567137 7772113 7872928 7861138 7741538 7530947
59768G530947k77321l17881l34469l31572l14625k88733k57733k24443j91408
$$ 7530947 7253626 6935745 6601276 6269704 5955079 5666346 5408613 5184170 4992762
59759D992762j60539j32233j05795q0991n8438l8403k0185k932J3656K9747M5671
$$ 4992762 4832223 4699990 4594195 4513204 4454766 4416363 4396178 4393246 4406902 4436649 4482320
59748D482320O1457P6778R1712J07028J23271J40239J57737J76244J96336K17863
$$ 4482320 4543777 4620555 4712267 4819295 4942566 5082805 5240542 5416786 5613122 5830985
59738E830985K40320K63757K88837L16104L45521L76715M09413M43500M78736
$$ 5830985 6071305 6335062 6623899 6940003 7285524 7662239 8071652 8515152 8993888
59729H993888N14366N49124N81448O09435O30643O42577O43745O33930O13415
$$ 8993888 9508254 10057378 10638826 11248261 11878904 12521481 13165226 13799156 14412571
59720A4412571N82827N44371N02475M62463M28865M05272L94487L97456M12482
$$ 14412571 14995398 15539769 16042244 16504707 16933572 17338844 17733331 18130787 18543269
59711A8543269M36643M67499N02355N36544N64271N81106N84290N70901N37760
$$ 18543269 18979912 19447411 19949766 20486310 21050581 21631687 22215977 22786878 23324638
59702B3324638M83789M11168L23798K26003J23159K1946p1225j51506k15116k58975
$$ 23324638 23808427 24219595 24543393 24769396 24892555 24914501 24843276 24691770 24476654 24217679
59692B4217679k81720k84209k68144k34849j85858j23730n1268K9550J17206K09835
$$ 24217679 23935959 23651750 23383606 23148757 22962899 22839169 22787901 22817451 22934657 23144492
59682B3144492L05553M03132N01697O00014O96231P87642Q70006R37494R83636
$$ 23144492 23450045 23853177 24354874 24954888 25651119 26438761 27308767 28246261 29229897
59673B9229897J001769R84488R24019Q14780O56092M52652K13477m8758l17965
$$ 29229897 30231666 31216154 32140173 32954953 33611045 34063697 34277174 34228416 33910451
59664C3910451n76005q05348r91901j127171j209165j241371j230361j183998
$$ 33910451 33334446 32529098 31537197 30410026 29200861 27959490 26729129 25545131
59656B5545131j111355j023054r30533q44720p75265p29965p13486p25682p60811
$$ 25545131 24433776 23410722 22480189 21635469 20860204 20130239 19416753 18691071 17930260
59647A7930260q08305q55071q89015r02529q93935q66119q23848p71851p14246
$$ 17930260 17121955 16266884 15377869 14475340 13581405 12715286 11891438 11119587 10405341
59638A0405341o54618n95927n40171m88191m40036l95738l55585l19540k86847
$$ 10405341 9750723 9154796 8614625 8126434 7686398 7290660 6935075 6615535 6328688
59629F328688k56672k28878k03741j81173j60661j41852j24564j08526r3595q0100
$$ 6328688 6072016 5843138 5639397 5458224 5297563 5155711 5031147 4922621 4829026 4748926
59619D748926o8419n8469n0200m4233m1182m0624m1605m4083m8839n5861o3851
$$ 4748926 4680507 4622038 4571838 4527605 4486423 4445799 4404194 4360111 4311272 4255411 4191560
59608D191560p1499p8493q4968r0551r4349r5504r3773q9905q5259q0536p5126
$$ 4191560 4120061 4041568 3956600 3866049 3771700 3676196 3582423 3492518 3407259 3326723 3251597
59597C251597o8298o0567n2999m5649l7824k9647k2031j5152q228j088N339J0427
$$ 3251597 3183299 3122732 3069733 3024084 2986260 2956613 2934582 2919430 2911202 2910114 2915453 2925880
59585B925880J4723J8975K3112K6576K8932K9961K9874K9461K9295K8900K7669
$$ 2925880 2940603 2959578 2982690 3009266 3038198 3068159 3098033 3127494 3156789 3185689 3213358
59574C213358K6404K6767K9259L3012L7564M3357N0378N7855O5771P5096Q6014
$$ 3213358 3239762 3266529 3295788 3328800 3366364 3409721 3460099 3517954 3583725 3658821 3744835
59563C744835R7360J08478J20186J33137J46666J60159J74321J89961K06642K23446
$$ 3744835 3842195 3950673 4070859 4203996 4350662 4510821 4685142 4875103 5081745 5305191
59553E305191K40043K55917K69616K79950K87151K91738K92980K89575K81275
$$ 5305191 5545234 5801151 6070767 6350717 6637868 6929606 7222586 7512161 7793436
59544G793436K68835K52937K34210K13840J93110J72621J52540J33128J14120
$$ 7793436 8062271 8315208 8549418 8763258 8956368 9128989 9281529 9414657 9528777
59535I528777R4268P2683N0678L1629J8876J3996J6650K5540L9531N7993P9849
$$ 9528777 9623045 9695728 9746406 9778035 9796911 9810907 9827557 9853097 9892628 9950621 10030470
59524A0030470J02553J22694J37493J44830J42084J26656R8214N9030J1476m3509
$$ 10030470 10133023 10255717 10393210 10538040 10680124 10806780 10904994 10964024 10975500 10931991
59514A0931991j04591j68248k30173k87530l38583l80987m12106m30899m38331
$$ 10931991 10827400 10659152 10428979 10141449 9802866 9421879 9009773 8578874 8140543
59505H140543m36076m25609m08255l85250l57836l27688k96818k66620k37423
$$ 8140543 7704467 7278858 6870603 6485353 6127517 5799829 5503011 5236391 4998968
59496D998968k09368j82945j58249j34720j12313r1959p4012n7154l9920k2554
$$ 4998968 4789600 4606655 4448406 4313686 4201373 4109414 4035402 3978248 3938328 3915774
59486C915774o170R329K5326M2680O0892P8934R6216J12927J29916J47907J66414
$$ 3915774 3909604 3918933 3944259 3986939 4047831 4126765 4222981 4335908 4465824 4613731 4780145
59475D780145J83964J99759K14339K28064K39853K48011K51393K48966K39224
$$ 4780145 4964109 5163868 5378207 5606271 5846124 6094135 6345528 6594494 6833718
59466F833718K21150J95001J61247J19730P0996J7677l6729q9819j40007j85153
$$ 6833718 7054868 7249869 7411116 7530846 7601842 7619519 7582790 7492971 7352964 7167811
59456G167811k23090k53070k75331k89615k95558k94269k88068k78550k65991
$$ 7167811 6944721 6691651 6416320 6126705 5831147 5536878 5248810 4970260 4704269
59447D704269k50653k33529k15782j98221j81436j65618j50424j35669j21890
$$ 4704269 4453616 4220087 4004305 3806084 3624648 3459030 3308606 3172937 3051047
59438C051047j09504r7915q6381p5319o5676n7336m9310m1283l3860k7265k1001
$$ 3051047 2941543 2843628 2757247 2681928 2616252 2558916 2509606 2468323 2434463 2407198 2386197
59427B386197j4843r204m360n7L931P535J0728J3556J5935J7958K0232K3291K6897
$$ 2386197 2371354 2362150 2357790 2357733 2361664 2369199 2379927 2393483 2409418 2427376 2447608 2470899 2497796
59414B497796L0509L4099L7721M0454M0758L8087L3739L0191K9840L3916M1934
$$ 2497796 2528305 2562404 2600125 2640579 2681337 2719424 2753163 2783354 2813194 2847110 2889044
59403B889044N2252O3611P5875Q9054J02263J14160J23864J31118J36399J41681
$$ 2889044 2941296 3004907 3080782 3169836 3272099 3386259 3510123 3641241 3777640 3919321
59393C919321J50236J64590J84873K09680K37769K68312L00553L34395L70632
$$ 3919321 4069557 4234147 4419020 4628700 4866469 5134781 5435334 5769729 6140361
59384F140361M09460M49217M87507N22759N53444N76663N89209N89774N78807
$$ 6140361 6549821 6999038 7486545 8009304 8562748 9139411 9728620 10318394 10897201
59375A0897201N56675N23567M81190M32964L82333L31815K83552K39282J99470
$$ 10897201 11453876 11977443 12458633 12891597 13273930 13605745 13889297 14128579 14328049
59366A4328049J63343J29877R7889O5399L0199q741n1216r6970j45798j96271
$$ 14328049 14491392 14621269 14719158 14784557 14814756 14806015 14754799 14657829 14512031 14315760
59356A4315760k45382k89794l26990l55451l74859l86344l91972l93823l93810
$$ 14315760 14070378 13780584 13453594 13098143 12723284 12336940 11944968 11551145 11157335
59347A1157335l93829l95146l97734m00788m03589m05209m04047l98719l89097
$$ 11157335 10763506 10368360 9970626 9569838 9166249 8761040 8356993 7958274 7569177
59338G569177l75652l58406l37543l14484k90931k67130k42400k17155j93080
$$ 7569177 7193525 6835119 6497576 6183092 5892161 5625031 5382631 5165476 4972396
59329D972396j71209j51049j31715j12880r4627p7286o1475m7442l4453k1676
$$ 4972396 4801187 4650138 4518423 4405543 4310916 4233630 4172155 4124713 4090260 4068584
59319D068584r324J955J2353K2383L1527L8801M4460M9648N4312N6895N6383N3294
$$ 4068584 4059260 4061215 4073568 4095951 4127478 4166279 4210739 4260387 4314699 4371594 4427977 4481271
59307D481271M8392M1646L3001K3148J2963K887o817j5772k3670l0199l4770l6815
$$ 4481271 4529663 4571309 4604310 4627458 4640421 4643308 4636491 4620719 4597049 4566850 4532080 4495265
59295D495265l6352l3776k9316k3104j5323n772O098K0015L4535M8647O3024P8544
$$ 4495265 4458913 4425137 4395821 4372717 4357394 4351622 4357720 4377735 4412270 4460917 4523941 4602485
59283D602485R4408J09031J22044J33939J44262J51747J55853J56703J53859J46684
$$ 4602485 4696893 4805924 4927968 5061907 5206169 5357916 5513769 5670472 5824331 5971015
59273E971015J35629J21622J04541Q3888O0646L6695J2527j2627l8226o1671q0314
$$ 5971015 6106644 6228266 6332807 6416695 6477341 6514036 6526563 6513936 6475710 6414039 6333725
59262F333725r2964r9571j00999r9226r6271r2846q9132q6261q5297q5260q4265
$$ 6333725 6240761 6141190 6040191 5940965 5844694 5751848 5662716 5576455 5491158 5405898 5321633
59251E321633q2414q1437q1464q0516p7459p3119o8039o1325n2428m1915k9711
$$ 5321633 5239219 5157782 5076318 4995802 4918343 4845224 4777185 4715860 4663432 4621517 4591806
59240D591806j4633L423K2825M2688O4193Q8426J14757J42510J72421K05079K39221
$$ 4591806 4577173 4580596 4603421 4646109 4710302 4798728 4913485 5055995 5228416 5433495 5672716
59229E672716K72927L05265L35638L62502L83746L97369M00996L91872L68183
$$ 5672716 5945643 6250908 6586546 6949048 7332794 7730163 8131159 8523031 8891214
59220H891214L29577K76056K07971J27753M0157n0133j39912k25860l03360l68191
$$ 8891214 9220791 9496847 9704818 9832571 9872728 9822595 9682683 9456823 9153463 8785272
59210H785272m18212m52542m70602m73241m63465m44709m19251l89064l56819
$$ 8785272 8367060 7914518 7443916 6970675 6507210 6062501 5643250 5254186 4897367
59201D897367l24648k93025k62062k32937k06850j83606j62395j43150j26054
$$ 4897367 4572719 4279694 4017632 3784695 3577845 3394239 3231844 3088694 2962640
59192B962640j10688r6769q4865p5255o7008n9228n2261m6512m1033l4675k7901
$$ 2962640 2851952 2755183 2670318 2595063 2528055 2468827 2416566 2370054 2329021 2294346 2266445
59181B266445k2038j7277j2654p706k934J178M655P758J0897J4556J8711K2712
$$ 2266445 2244407 2227130 2214476 2206770 2203836 2205014 2209669 2217427 2228324 2242880 2261591 2284303
59169B284303K6143K9399L3084L7341M2094M7172N1978N5953N9597O3972O8820
$$ 2284303 2310446 2339845 2372929 2410270 2452364 2499536 2551514 2607467 2667064 2731036 2799856
59158B799856P2448P4026P4697P5704P6569P6010P3432O8741O1793N3003M3470
$$ 2799856 2872304 2946330 3021027 3096731 3173300 3249310 3322742 3391483 3453276 3506279 3549749
59147C549749L3569K2545J0305j524j1449j9843k7739l4938m0499m4201m6249
$$ 3549749 3583318 3605863 3616168 3614644 3603195 3583352 3555613 3520675 3480176 3435975 3389726
59136C389726m6290m3923l9591l4017k7349j9730j1851l914N025J5717K7435L9049
$$ 3389726 3343436 3299513 3259922 3225905 3198556 3178826 3166975 3163061 3168086 3183803 3211238 3250287
59124C250287N0604O2774P5532Q8428J01547J15144J28860J42218J55359J68512
$$ 3250287 3300891 3363665 3439197 3527625 3629172 3744316 3873176 4015394 4170753 4339265
59114D339265J81386J93800K06151K18464K29802K39291K46889K52333K54258
$$ 4339265 4520651 4714451 4920602 5139066 5368868 5608159 5855048 6107381 6361639
59105F361639K51169K42321K26883K03416J71249J31362Q5047L3002k3120p9537
$$ 6361639 6612808 6855129 7082012 7285428 7456677 7588039 7673086 7706088 7682968 7603431
59095G603431j32322j79703k21145k55294k80602k97272l06880l10425l08138
$$ 7603431 7471109 7291406 7070261 6814967 6534365 6237093 5930213 5619788 5311650
59086E311650l00770k89651k75746k59733k42733k25868k09463j93539j78535
$$ 5311650 5010880 4721229 4445483 4185750 3943017 3717149 3507686 3314147 3135612
59077C135612j64739j51670j39025j27521j17803j09233j00831r2669q5273p8381
$$ 3135612 2970873 2819203 2680178 2552657 2434854 2325621 2224790 2132121 2046848 1968467
59067A968467p1535o5207o0105n5962n2047m8226m4469m0200l5329l1091k8516
$$ 1968467 1896932 1831725 1771620 1715658 1663611 1615385 1570916 1530716 1495387 1464296 1435780
59056A435780k6760k4353k1466j9417j8483j7710j6560j5377j4361j3252j1893
$$ 1435780 1409020 1384667 1363201 1343784 1325301 1307591 1291031 1275654 1261293 1248041 1236148
59045A236148j0212q007n539l789l251l080k327j166k2J574M021O559Q449J0418
$$ 1236148 1225936 1217929 1212390 1208601 1205350 1202270 1199943 1198777 1198755 1200329 1204350 1210909 1219358 1229776
59031A229776J3449J6895J9265K0260K0618K0532J9616J7936J5649J2239P536
$$ 1229776 1243225 1260120 1279385 1299645 1320263 1340795 1360411 1378347 1393996 1406235 1413771
59020A413771K826l60k005k823k605r49J180K497L414N151P316Q354Q141Q102
$$ 1413771 1416597 1416237 1414232 1411409 1408804 1407855 1409035 1411532 1414946 1420097 1427413 1435767 1443908 1452010
59006A452010Q763Q941P649N213K291q06l602n543o801p998r121r701r842r944
$$ 1452010 1460773 1469714 1477363 1482576 1484867 1484061 1480459 1474916 1468115 1460117 1450996 1441295 1431453 1421509
58992A421509r658q276n995l766k075q49j28K54J175L198N474O863P625Q783J0319
$$ 1421509 1411851 1403575 1397580 1393814 1391739 1390890 1390762 1391016 1392191 1395389 1400863 1407726 1415351 1424134 1434453
58977A434453J1383J1923J2744J4266J6376J9023K1867K3914K4793K5648K7506
$$ 1434453 1445836 1457759 1470503 1484769 1501145 1520168 1542035 1565949 1590742 1616390 1643896
58966A643896K9594L0769L1650L3494L5824L7194L7662L8369L9136L8693L7172
$$ 1643896 1673490 1704259 1735909 1769403 1805227 1842421 1880083 1918452 1957588 1996281 2033453
58955B033453L6149L6262L6705L7167L8337M0419M2943M6163N0870N6684O2316
$$ 2033453 2069602 2105864 2142569 2179736 2218073 2258492 2301435 2347598 2398468 2455152 2517468
58944B517468O7573P3481Q0335Q7412R4593J02512J10945J18861J26341J34788
$$ 2517468 2585041 2658522 2738857 2826269 2920862 3023374 3134319 3253180 3379521 3514309
58934C514309J44992J56571J69391J83943K00116K17295K35830K56838K80401
$$ 3514309 3659301 3815872 3985263 4169206 4369322 4586617 4822447 5079285 5359686
58925E359686L05595L32366L61726L93886M27844M62957M99399N36914N74735
$$ 5359686 5665281 5997647 6359373 6753259 7181103 7644060 8143459 8680373 9255108
58916I255108O12584O50005O84679P13285P33934P45740P45908P29673O93550
$$ 9255108 9867692 10517697 11202376 11915661 12649595 13395335 14141243 14870916 15564466
58907A5564466O36593N58203M57485L36016J99272N4143r3422k37389l70589m86515
$$ 15564466 16201059 16759262 17216747 17552763 17752035 17806178 17712756 17475367 17104778 16618263
58897A6618263n81472o54133p04354p33403p44040p39129p20795o91540o55022
$$ 16618263 16036791 15382658 14678304 13944901 13200861 12461732 11740937 11049397 10394375
58888A0394375o14804n73097n31349m91169m53886m19827l88565l59475l31942
$$ 10394375 9779571 9206474 8675125 8183956 7730070 7310243 6921678 6562203 6230261
58879F230261l05766k81412k59298k39009k20038k02839j87932j74383j60626
$$ 6230261 5924495 5643083 5383785 5144776 4924738 4721899 4533967 4359584 4198958
58870D198958j46620j33705j22438j12121j02373r3552q5514p7537o9588o2252
$$ 4198958 4052338 3918633 3796195 3684074 3581701 3488149 3402635 3325098 3255510 3193258
58860C193258n5426m8504m1784l6055l0909k5146j8780j2814p220j051N464J1106
$$ 3193258 3137832 3089328 3047544 3011489 2980580 2955434 2936654 2923840 2916620 2915569 2921033 2932139
58848B932139J5999K1566K7980L3971L9416M5796N3381O0418O5974P1429P8172
$$ 2932139 2948138 2969704 2997684 3031655 3071071 3116867 3170248 3230666 3296640 3368069 3446241
58837C446241Q5836R3809J02586J12526J22920J33445J44953J57969J71869J86393
$$ 3446241 3532077 3625886 3728472 3840998 3963918 4097363 4242316 4400285 4572154 4758547
58827D758547K02432K20542K40191K61210K84472L10410L38432L68400M01133
$$ 4758547 4960979 5181521 5421712 5682922 5967394 6277804 6616236 6984636 7385769
58818G385769M36670M73659N11120N49236N87665O24631O58196O86835P08096
$$ 7385769 7822439 8296098 8807218 9356454 9944119 10568750 11226946 11913781 12621877
58809A2621877P18404P14682O94673O55445N93857N09281M04075K81117J43339
$$ 12621877 13340281 14054963 14749636 15405081 15998938 16508219 16912294 17193411 17336750
58800A7336750l579j50743k89813m15593n24327o12180o77123p20311p43983p49601
$$ 17336750 17333171 17182428 16892615 16477022 15952695 15340515 14663392 13943081 13199098 12449497
58790A2449497p39285p17037o86851o51012o11316n70160n28993m87421m45343
$$ 12449497 11710212 10993175 10306324 9655312 9043996 8473836 7944843 7457422 7012079
58781G012079m04443l66317l30743k97118k66082k38512k14670j95537j83209
$$ 7012079 6607636 6241319 5910576 5613458 5347376 5108864 4894194 4698657 4515448
58772D515448j78353j78648j80838j82703j82242j77327j67908j56668j45813
$$ 4515448 4337095 4158447 3977609 3794906 3612664 3435337 3267429 3110761 2964948
58763B964948j34808j22720j10657r9976q9996p9612o9590o1188n3952m6891m0524
$$ 2964948 2830140 2707420 2596763 2496787 2406791 2327179 2257589 2196401 2142449 2095558 2055034
58752B055034l5749l1928k8002k4363k1704j9284j6238j3493j2409j2518j2524
$$ 2055034 2019285 1987357 1959355 1934992 1913288 1894004 1877766 1864273 1851864 1839346 1826822
58741A826822j2573j3639j5556j7545j9957k3587k7749l0714l1729l1356l0381
$$ 1826822 1814249 1800610 1785054 1767509 1747552 1723965 1696216 1665502 1633773 1602417 1572036
58730A572036k9462k9109k8988k8160k6808k6509k7859k9260k9259k8579k8445
$$ 1572036 1542574 1513465 1484477 1456317 1429509 1403000 1375141 1345881 1316622 1288043 1259598
58719A259598k8423k7553k6194k5117k3950k2112k0149j8640j6978j4759j3005
$$ 1259598 1231175 1203622 1177428 1152311 1128361 1106249 1086100 1067460 1050482 1035723 1022718
58708A022718j2519j2315j1326j0263j0146j0319r717q814q467q086o842n500
$$ 1022718 1010199 997884 986558 976295 966149 955830 946113 937299 928832 920746 913904 908404
58696I08404n162n314m924m412m660n089m683l896l794m182m319m450m984n164
$$ 908404 903242 897928 893004 888592 883932 878843 874160 870264 866470 862288 857969 853519 848535 843371
58682H43371m323l292k849k044J64K833M571N896Q039J0609J2583J4448J7147
$$ 843371 839048 835756 832907 830863 831027 833860 838431 844327 852366 862975 875558 890006 907153
58669I07153K0056K2245K4746K9092L4455L8566M0611M0695L7239K7791J2669
$$ 907153 927209 949454 974200 1003292 1037747 1076313 1116924 1157619 1194858 1222649 1235318
58658A235318m428j9534l0518l6595l8029l6368l3359k9357k3987j7862j2284
$$ 1235318 1230890 1211356 1180838 1144243 1106214 1069846 1036487 1007130 983143 965281 952997
58647I52997p701l790m33K561N922R760J2840J4463J5985J8916K2585K5403K7427
$$ 952997 945296 941506 941073 943634 949556 959316 972156 986619 1002604 1021520 1044105 1069508 1096935
58634A096935K9935L3348L7374M2253M8120N3913N8813O3934P0949P9826Q9468
$$ 1096935 1126870 1160218 1197592 1239845 1287965 1341878 1400691 1464625 1535574 1615400 1704868
58623A704868R9679J10937J23109J35960J49834J64482J78452J91075K03417K15602
$$ 1704868 1804547 1915484 2038593 2174553 2324387 2488869 2667321 2858396 3061813 3277415
58613C277415K24863K28221K25233K15999J98380J70049J31967Q7344L8467j2819
$$ 3277415 3502278 3730499 3955732 4171731 4370111 4540160 4672127 4759471 4797938 4785119
58603D785119o2891j07610j45124j75048j96119k07316k10378k08439k02834j93526
$$ 4785119 4722228 4614618 4469494 4294446 4098327 3891011 3680633 3472194 3269360 3075834
58593C075834j81636j68988j56116j43039j30910j20440j10062r8303q6632p7146
$$ 3075834 2894198 2725210 2569094 2426055 2295145 2174705 2064643 1966340 1879708 1802562
58583A802562o8928n9796n0327m2720l6822l0870k5172k1438j9133j6273j3395
$$ 1802562 1733634 1673838 1623511 1580791 1543969 1513099 1487927 1466489 1447356 1431083 1417688
58572A417688j2902j4646j5746j4963j3758j2896j1324q879p088o808p593r508
$$ 1417688 1404786 1390140 1374394 1359431 1345673 1332777 1321453 1312574 1305486 1298678 1291085 1281577
58560A281577j2941j6714j8997j9925k0666k0451j7479j2429p956m919k242l21
$$ 1281577 1268636 1251922 1232925 1213000 1192334 1171883 1154404 1141975 1134019 1129100 1126858 1126537
58548A126537j083m621q809j2532j6288j9590k1025k1042k1604k2817k2874k1505
$$ 1126537 1125454 1120833 1112024 1099492 1083204 1063614 1042589 1021547 999943 977126 954252 932747
58536I32747k0402j9983j8845j6802j5446j5248j4869j3783j2921j2506j1838
$$ 932747 912345 892362 873517 856715 841269 826021 811152 797369 784448 771942 760104
58525G60104j1257j1629j2083j1104r565r545j0431r619o975n042m661l997k343
$$ 760104 748847 737218 725135 714031 704466 694921 684490 674871 667896 662854 658193 654196 651853
58512F51853j249j277r78J21O92M52Q14K067K873L001L651M759M958M462M922
$$ 651853 650604 649327 648349 648470 649162 649614 650428 652495 655368 658369 662020 666779 671737 676199 681121
58497F81121O238O756O688P966J0453J1828J1584J1566J2158J1629R738Q365P942
$$ 681121 687359 694115 700803 708769 719222 731050 742634 754200 766358 777987 787725 796090 804032
58484H04032O876N058M217M168K592o84l071l737m871p446r622j0493j1588j3379
$$ 804032 810908 815966 820183 824351 826943 826259 823188 819451 814580 807134 797512 787019 775431 762052
58470G62052j4123j3473j3576j5124j5891j4659j3078j2214j0796q394o824o796
$$ 762052 747929 734456 720880 705756 689865 675206 662128 649914 639118 630724 623900 617104
58458F17104o412m569k721j864r18N20J000J55k75N13J230J380K107L380L655
$$ 617104 610692 606123 603402 601538 600620 601140 602140 602295 602020 602533 603763 605143 607250 610630 614285
58443F14285L123L780N592O309N744O259Q115Q633P034N761N777M966K690J392
$$ 614285 617408 621188 626780 633089 638833 645092 653207 661840 668874 674635 680412 685378 688068 689460
58429F89460J979K009L70n54O00J790J695K080L854M932M269L921M869M842K696
$$ 689460 691439 693448 693818 693264 693864 695654 697349 699429 703283 708215 712484 716405 721274 726116 728812
58414G28812J004J753L193L343L030L253L069K207K219L090K461p7j817j684j906
$$ 728812 729816 731569 734762 738105 741135 744388 747457 749664 751883 754973 757434 757357 755540 753856 751950
58399G51950l293l482j882j474l386m428k660o42m66k39J499K603J608P95J825
$$ 751950 748657 745175 743293 741819 738433 734005 731345 730703 730237 729998 731497 734100 735708 736503 738328
58384G38328K679J892J472K555K645M13j260k21J348J459J906M079N680N130M797
$$ 738328 741007 742899 744371 746926 749571 749984 748724 748503 749851 751310 753216 757295 762975 768105 772902
58369G72902O408P658O826O211P523Q406P156O207P263P720N791M410N919P688
$$ 772902 779310 786968 793794 800005 807528 815934 823090 829297 836560 844280 850071 854481 860400 868088
58355H68088P155O605Q437J0285R336P344O863O626M919L382L319K526j93j740
$$ 868088 875243 881848 890285 900570 909906 917250 924113 930739 935658 939040 942359 944885 944692 942952
58341I42952l1K012J807J609L522N129M583M894Q305J1437J1030R602J0410J1716
$$ 942952 942921 944933 946740 948349 951871 957000 961583 966477 974782 986219 997249 1006851 1017261 1028977
58327A028977J1142J0760J2653J4214J3053J1810J3003J4176J3164J2836J5397
$$ 1028977 1040119 1050879 1063532 1077746 1090799 1102609 1115612 1129788 1142952 1155788 1171185
58316A171185J7406J5990J4355J5526J6328J3605J0622J1006J2039J0378Q737
$$ 1171185 1188591 1204581 1218936 1234462 1250790 1264395 1275017 1286023 1298062 1308440 1317177
58305A317177J0353J2396J1614J0882J3397J6100J5666J5208J7993K0609J9520
$$ 1317177 1327530 1339926 1351540 1362422 1375819 1391919 1407585 1422793 1440786 1461395 1480915
58294A480915J8270K0659K3125K1664J9965K2535K6062K5984K5253K8017L1041
$$ 1480915 1499185 1519844 1542969 1564633 1584598 1607133 1633195 1659179 1684432 1712449 1743490
58283A743490L0248K9373L2999L7451L7882L7896M2488M8043M9169M8800N1419
$$ 1743490 1773738 1803111 1836110 1873561 1911443 1949339 1991827 2039870 2089039 2137839 2189258
58272B189258N3122M9064M3907M3962M5683M3145L9935M1910M5251M3883M1904
$$ 2189258 2242380 2291444 2335351 2379313 2424996 2468141 2508076 2549986 2595237 2639120 2681024
58261B681024M6003N2392N4110N4472O0064O7241O9248O9849P5964Q3674Q5833
$$ 2681024 2727027 2779419 2833529 2888001 2948065 3015306 3084554 3154403 3230367 3314041 3399874
58250C399874Q6503R3120J01503J03907J04479J11040J19147J20871J21530J30428
$$ 3399874 3486377 3579497 3681000 3784907 3889386 4000426 4119573 4240444 4361974 4492402
58240D492402J42706J48374J51589J62282J76515J84633J91026K05616K23624
$$ 4492402 4635108 4783482 4935071 5097353 5273868 5458501 5649527 5855143 6078767
58231F078767K34673K43997K62939K86682L03889L19762L45921L76533L99386
$$ 6078767 6313440 6557437 6820376 7107058 7410947 7730709 8076630 8453163 8852549
58222H852549M21297M56310M98505N34098N70194O22110O83144P38467P97681
$$ 8852549 9273846 9730156 10228661 10762759 11332953 11955063 12638207 13376674 14174355
58213A4174355Q79824R77993J075139J182611J323969J494032J676862J890689
$$ 14174355 15054179 16032172 17107311 18289922 19613891 21107923 22784785 24675474
58205B4675474K168747K510991K906609L388290M005575M759156N623494O615034
$$ 24675474 26844221 29355212 32261821 35650111 39655686 44414842 50038336 56653370
58197E6653370P767452R067224J0507860J2188583J4253205J6753910J9706206
$$ 56653370 64420822 73488046 83995906 96184489 110437694 127191604 146897810
58190A46897810K3239139K7452962L2017562L6033218L8315479L7635599L2744350
$$ 146897810 170136949 197589911 229607473 265640691 303956170 341591769 374336119
58183C74336119K2771744Q255285q225912k2971074l3138163l7996504l8534766
$$ 374336119 397107863 405363148 397137236 374166162 341027999 303031495 264496729
58176B64496729l6281184l2556318k8336030k4245801k0544400j7261255j4401030
$$ 264496729 228215545 195659227 167323197 143077396 122532996 105271741 90870711
58169I0870711j1979900r948537q215936o740987n517793m497983l610679k835028
$$ 90870711 78890811 68942274 60726338 53985351 48467558 43969575 40358896 37523868
58161C7523868k175352j589088j014114m40849J19782P11849J388686K102120
$$ 37523868 35348516 33759428 32745314 32304465 32424247 33136096 34524782 36626902
58153C6626902K713179L091935L118488K616771J443012k85499k131401l590833
$$ 36626902 39340081 42432016 45550504 48167275 49610287 49324788 47193387 43602554
58145D3602554m400728m601203m383400l942378l425880k924918k475053k081186
$$ 43602554 39201826 34600623 30217223 26274845 22848965 19924047 17448994 15367808
58137A5367808j745403j467363j236042j039964q77688p47745o39684n45227m66909
$$ 15367808 13622405 12155042 10919000 9879036 9001348 8253603 7613919 7068692 6601783
58128F601783m06974l59211l18988k89322k70179k53871k37002k24709k17497
$$ 6601783 6194809 5835598 5516610 5227288 4957109 4703238 4466236 4241527 4024030
58119D024030k06673j88493j70284j56803j42836j25006j08843r8165q8810p8553
$$ 4024030 3817357 3628864 3458580 3301777 3158941 3033935 2925092 2826927 2738117 2659564
58109B659564p2401p2691p4201p3898p5327p9008p8922p3047o7345o4859o0896
$$ 2659564 2587163 2514472 2440271 2366373 2291046 2212038 2133116 2060069 1992724 1927865 1866969
58098A866969n3268m7277m5905m4636m0576l7645l8267l8682l6729l5736l6865
$$ 1866969 1813701 1766424 1720519 1675883 1635307 1597662 1559395 1520713 1483984 1448248 1411383
58087A411383l6014l2073k9894l1349l1890k9388k7987k9520k9637k6323k3966
$$ 1411383 1375369 1343296 1313402 1282053 1250163 1220775 1192788 1163268 1133631 1107308 1083342
58076A083342k4888k4955k1648j8747j8780j8401j5461j3377j4261j4654j2216
$$ 1083342 1058454 1033499 1011851 993104 974324 955923 940462 927085 912824 898170 885954
58065H85954r978r973r299o390m714o289p792o899o386q241r769r268r529j2048
$$ 885954 875976 866003 856704 850314 845600 839311 831519 824620 818234 809993 800224 790956 781427 769379
58051G69379j3499j1670r354q800p886n166l260l707l822j963p25j585j743M69
$$ 769379 755880 744210 734856 726056 718170 713004 709744 706037 702215 700252 699527 697942 696199 696668
58037F96668K303J955J970L981N284M039K791L443L641J578m08m39n45k192l075
$$ 696668 698971 700926 702896 706877 712161 716200 718991 722434 726075 727653 727245 726806 726261 724069 720994
58022G20994j737p63j980k959j769q21k406m559m847m379m702m599l192k522l834
$$ 720994 719257 718494 716514 713555 711786 710965 708559 704000 699153 694774 690072 685473 682281 679759 675925
58007F75925m889l914k634k675k618j366p02j699k383j596j372k913m066l501
$$ 675925 671036 667122 664488 661813 659195 657829 657127 655428 653045 651449 650077 647164 643098 639597
57993F39597l374n063o240n137l757l921l953k340q63j020j008O28K049J782J709
$$ 639597 636223 631160 624920 619783 616026 612105 608152 605812 604949 603929 602921 603549 605598 607380 609089
57978F09089L318M589L695K307K140J850L82l11Q52J220j120l634l623k721l374
$$ 609089 612407 616996 620691 622998 625138 626988 627370 627059 627911 629131 628011 624377 620754 618033 614659
57963F14659m247l128j366j302j906r42Q42J427J229J627J861Q11k09M16J591
$$ 614659 610412 607284 605918 604616 602710 601768 602610 604037 605266 606893 608754 609565 609356 609772 611363
57948F11363J672J517K528L705L583K951K889K276K9k475l861n320q011j0366
$$ 611363 613035 614552 617080 620785 624368 627319 630208 632484 632513 630038 626177 620857 612846 602480
57934F02480j0876j1088j2832j4756j4718j3397j2585j1963j0555r240q923q289
$$ 602480 591604 580516 567684 552928 538210 524813 512228 500265 489710 480470 471547 463258
57922D63258o193m108l406k527K12L373M947N875P771R497R301Q346Q698R682
$$ 463258 457065 452957 449551 447024 447236 450609 455556 461431 469202 478699 488000 496346 505044 514726
57908E14726R540Q871R196R760R005P540O670N672L523J438O18n12l567o653p106
$$ 514726 524266 533137 542333 552093 561098 568638 575308 580980 584503 585941 586559 586047 582480 575827 568721
57893E68721n923n960p349q283q763r768j0172q324n602m654n043m306k405j416
$$ 568721 562798 556838 549489 541206 532443 522675 512503 504179 498577 493923 488880 484574 482169 480753
57879D80753j455o07J367K719K978L403M349M964N357O392P660Q045P928Q394
$$ 480753 479298 478691 480058 482777 485755 489158 493507 498471 503828 510220 517880 525925 533853 542247
57865E42247Q908Q192O734N924N415L862J581n7j129k609m087m545m581n417o448
$$ 542247 551155 559347 566081 572005 577420 581282 582863 582806 581677 579068 574981 570436 565855 560438 553990
57850E53990o303n441n233n337m588l554l553m080l799l221l604m235l647k659
$$ 553990 547687 542246 537013 531676 527088 523534 519981 515901 512102 508881 505277 501042 497395 494736
57836D94736l140m518m698l804l851n105n923o013o770q429r680j0147j0607j0833
$$ 494736 491596 487078 482380 478576 474725 469620 463697 457684 450914 442485 432805 422658 412051 401218
57822D01218r875q366p930q435q320p474p164p285o359m273k526j681r89l71l95
$$ 401218 391343 382977 375047 366612 358292 350818 343654 336369 330010 325737 323211 321530 320541 320170 319775
57807C19775m47O15K158K601K290L036M893O145O455P363R439J1515J3017J4599
$$ 319775 319328 319943 322101 324702 326992 330028 334921 341066 347521 354884 364323 375838 388855 403454
57793D03454J6135J6328J4787J2489J0063P412N022L561K391M46j704k759l219
$$ 403454 419589 435917 450704 463193 473256 480668 485690 489251 491642 492088 490384 487625 484406
57780D84406m638o759p890p934q454r894j1154j1838j2422j2345j0601q151o973
$$ 484406 479768 473009 465119 457185 448731 438837 427683 415845 403423 391078 380477 372326 365353
57767C65353o732n253k403n46o79j036j98J092J954K726L490L552L127L402M338
$$ 365353 358621 353368 350965 350419 349740 348704 348506 349598 351552 354278 357768 361320 364447 367849 372187
57752C72187M547L771L341L737M010L987M648N796N826M502L544L768M005L601
$$ 372187 376734 380505 383846 387583 391593 395580 400228 406024 411850 416352 419896 423664 427669 431270
57738D31270L610M527N075M412L545L553M161M988O300P779Q321P857P743Q650
$$ 431270 434880 439407 444482 448894 452439 455992 460153 465141 471441 479220 487541 495398 503141 511791
57724E11791R774J0623J1772J3349J4590J5432J6655J8083J8589J8374J9046K0931
$$ 511791 521565 532188 543960 557309 571899 587331 603986 622069 640658 659032 678078 699009
57712F99009K2496K3087K3972K5939K8093K9989L2732L6953M1602M5879N0446
$$ 699009 721505 744592 768564 794503 822596 852585 885317 922270 963872 1009751 1060197
57701A060197N5848O1581O7630P5024Q3928R3069J02022J12165J24428J37943
$$ 1060197 1116045 1177626 1245256 1320280 1404208 1497277 1599299 1711464 1835892 1973835
57691A973835J51910J66758J82404J97262K10121K21160K29868K33687K30008
$$ 1973835 2125745 2292503 2474907 2672169 2882290 3103450 3333318 3567005 3797013
57682C797013K17981J97342J67335J28252Q2846L5107j1200n2236q4293j05483
$$ 3797013 4014994 4212336 4379671 4507923 4590769 4625876 4614676 4562440 4478147 4372664
57672D372664j15925j15618j03981q2453n5701k9212p658L361l282l2022p9726
$$ 4372664 4256739 4141121 4037140 3954687 3898986 3869774 3862116 3865477 3862195 3830173 3750447
57661C750447j35863j87088k22272k36250k31217k14080j91290j66328j41363
$$ 3750447 3614584 3427496 3205224 2968974 2737757 2523677 2332387 2166059 2024696
57652B024696j18514r8465q0078o2834m7982l6231k6149j6322p274K93P472J5717
$$ 2024696 1906182 1807717 1727639 1664805 1616823 1580592 1554443 1538121 1530847 1531140 1538612 1554329
57640A554329K4831L3862M2863N2308O2062P2127Q3277R5690J08251J20302J32691
$$ 1554329 1579160 1613022 1655885 1708193 1770255 1842382 1925659 2021349 2129600 2249902 2382593
57629B382593J45892J58571J69329J78388J86027J90628J89703J81717J65750
$$ 2382593 2528485 2687056 2856385 3034773 3220800 3411428 3601131 3782848 3948598
57620C948598J40717J06508O4984J8785k9667p7124j19276j53135j78532j96136
$$ 3948598 4089315 4195823 4260807 4279592 4249925 4172801 4053525 3900390 3721858 3525722
57610C525722k05627k07195k03214j96441j87651j76484j63510j49882j36053
$$ 3525722 3320095 3112900 2909686 2713245 2525594 2349110 2185600 2035718 1899665
57601A899665j22342j09764r8936q9157p9786p1385o4331n7806n1423m6336m3164
$$ 1899665 1777323 1667559 1568623 1479466 1399680 1328295 1263964 1206158 1154735 1108399 1065235
57590A065235m0377l6446l2137k8874k6278k3306k0501j8998j8245j6842j4831
$$ 1065235 1024858 988412 956275 927401 901123 877817 857316 838318 820073 803231 788400
57579G88400j3277j2344j1463j0663r996q639o222m065l348l146k068o96k77j69
$$ 788400 775123 762779 751316 740653 730657 722018 715796 711731 708383 705237 703169 702473 702196 702027
57565G02027J143L275M661N351O756Q922J0553J1448J2739J4655J6200J7144J8418
$$ 702027 703170 706445 711106 716457 723213 732135 742688 754136 766875 781530 797730 814874 833292
57552H33292K0434K2718K5281K8626L2376L5577L8390M2053M7018N2650N8688
$$ 833292 853726 876444 901725 930351 962727 998304 1036694 1078747 1125765 1178415 1237103
57541A237103O5530P3069Q0718Q8622R7535J07444J17547J27446J37193J46235
$$ 1237103 1302633 1375702 1456420 1545042 1642577 1750021 1867568 1995014 2132207 2278442
57531B278442J53543J58511J60498J57834J48603J32236J09189P9687M4397N854
$$ 2278442 2431985 2590496 2750994 2908828 3057431 3189667 3298856 3378543 3422940 3428794
57521C428794l2533o8679j01500j28842j47950j58265j62016j61501j57248j49203
$$ 3428794 3396261 3327582 3226082 3097240 2949290 2791025 2629009 2467508 2310260 2161057
57511B161057j38259j25907j13367j01486r0740q0993p1900o3562n6214m9521
$$ 2161057 2022798 1896891 1783524 1682038 1591298 1510305 1438405 1374843 1318629 1269108
57501A269108m2970l6609l0663k4899j9266j4564j1320q557m915n23L547P119
$$ 1269108 1226138 1189529 1158866 1133967 1114701 1100137 1088817 1080260 1075345 1074822 1078369 1085488
57489A085488J0851J4747J8336K2027K6764L2416L7976M3347M9493N6866O4937
$$ 1085488 1096339 1111086 1129422 1151449 1178213 1210629 1248605 1291952 1341445 1398311 1463248
57478A463248P3292Q2004R0908R9729J08816J18712J28965J38255J45515J49928
$$ 1463248 1536540 1618544 1709452 1809181 1917997 2036709 2165674 2303929 2449444 2599372
57468B599372J50283J45390J34787J18029R4040O2519K5505j3736n2833q9864
$$ 2599372 2749655 2895045 3029832 3147861 3241901 3304420 3329925 3316189 3263356 3173492
57458C173492j21817j45604j60601j68524j70984j68688j62677j54355j44253
$$ 3173492 3051675 2906071 2745470 2576946 2405962 2237274 2074597 1920242 1775989
57449A775989j32411j19922j08490r8406q8615p8834o9995o2512n5771m9445m3844
$$ 1775989 1643578 1523656 1415166 1316760 1228145 1149311 1079316 1016804 961033 911588 867744
57438H67744l8910l4283l0353k7712k5736k3291k0686j9160j8523j7208j4835
$$ 867744 828834 794551 764198 736486 710750 687459 666773 647613 629090 611882 597047
57427E97047j2791j1960j1619j0947j0019r007p845o949o793o743n851m686m569
$$ 597047 584256 572296 560677 549730 539711 530704 522859 515910 509117 502374 496523 491837 487268
57414D87268n160m846l579k959l283k958j431k62l30l14Q94K275K550K127J891
$$ 487268 482108 477262 473683 470724 467441 464483 463052 462790 462460 462146 463040 465315 467865 469992 471883
57399D71883J606R09M84R37J687K096K522L265L670L312K919L101L303K983K683
$$ 471883 473489 474398 474882 475819 477506 479602 482124 485389 489059 492371 495290 498391 501694 504677 507360
57384E07360K965L336L212K919K842K651K198K117K697L192L086K975L351L627
$$ 507360 510325 513661 516873 519792 522634 525285 527483 529600 532297 535489 538575 541550 544901 548528
57370E48528L254K746K682K738K592K714L338L739L496L424M194N060N096M703
$$ 548528 551782 554528 557210 559948 562540 565254 568592 572331 575827 579251 583445 588505 593601 598304
57356E98304M817N396N860O253O764O837N956M815M572N263N945O111O036O040
$$ 598304 603121 608517 614377 620630 627394 634231 640187 645002 649574 654837 660782 666893 672929 678969
57342F78969O168O463O900P180P043O626O302O418P238Q631R796R997R611R694
$$ 678969 685137 691600 698500 705680 712723 719349 725651 732069 739307 747938 757734 767731 777342 787036
57328G87036J0443J1018J0939J0693J0700J0805J0961J1428J2023J2267J2505
$$ 787036 797479 808497 819436 830129 840829 851634 862595 874023 886046 898313 910818
57317I10818J3600J5269J6063J5424J4500J4371J4828J5464J6563J8151J9386
$$ 910818 924418 939687 955750 971174 985674 1000045 1014873 1030337 1046900 1065051 1084437
57306A084437J9789K0015K0697K1558K2280K3219K4564K5870K6935K8158K9574
$$ 1084437 1104226 1124241 1144938 1166496 1188776 1211995 1236559 1262429 1289364 1317522 1347096
57295A347096L0661L1508L2865L4660L5922L6599L7821L9755M0983M0781M0232
$$ 1347096 1377757 1409265 1442130 1476790 1512712 1549311 1587132 1626887 1667870 1708651 1748883
57284A748883M0046L9143L6593L3231K9894K5712J9796J3236P667L016j656o066
$$ 1748883 1788929 1828072 1864665 1897896 1927790 1953502 1973298 1986534 1994201 1997217 1995561 1989495
57272A989495r168j0890j1859j2045j1054r193o994m313j039K105M521O704R195
$$ 1989495 1980327 1969437 1957578 1945533 1934479 1925286 1918292 1913979 1912940 1915045 1919566 1926270 1935465
57259A935465J1433J2780J3808J5401J7402J9253K1048K2936K4417K5332K6619
$$ 1935465 1946898 1959678 1973486 1988887 2006289 2025542 2046590 2069526 2093943 2119275 2145894
57248B145894K8834L1004L2009L2146L2174L2010L1657L2184L4197L6463L7552
$$ 2145894 2174728 2205732 2237741 2269887 2302061 2334071 2365728 2397912 2432109 2468572 2506124
57237B506124L7916L8785M0067M0983M1781M3077M4227M4201M3391M2986M3160
$$ 2506124 2544040 2582825 2622892 2663875 2705656 2748733 2792960 2837161 2880552 2923538 2966698
57226B966698M3361M3683M4323M4400M3042M1048L9839L9339L8582L7789L8085
$$ 2966698 3010059 3053742 3098065 3142465 3185507 3226555 3266394 3305733 3344315 3382104 3420189
57215C420189L9483M0884M1845M2883M4313M6112M8550N1683N4700N6969N9017
$$ 3420189 3459672 3500556 3542401 3585284 3629597 3675709 3724259 3775942 3830642 3887611 3946628
57204C946628O1228O2485O1643N9495N7605N6026N3981N1831N0377M8961M6404
$$ 3946628 4007856 4070341 4131984 4191479 4249084 4305110 4359091 4410922 4461299 4510260 4556664
57193D556664M3353M1409M0324L8350L5281L2881L2077L1855L1247L0619L0505
$$ 4556664 4600017 4641426 4681750 4720100 4755381 4788262 4820339 4852194 4883441 4914060 4944565
57182D944565L0780L1333L2273L3257L3776L4159L5115L6499L7634L8485L9296
$$ 4944565 4975345 5006678 5038951 5072208 5105984 5140143 5175258 5211757 5249391 5287876 5327172
57171E327172L9574L8981L8563L9518M1225M2251M2811M4314M6890M9347N1305
$$ 5327172 5366746 5405727 5444290 5483808 5525033 5567284 5610095 5654409 5701299 5750646 5801951
57160E801951N3304N4865N4296N0554M3769L4426K3945J5483J1851J2490J4436
$$ 5801951 5855255 5910120 5964416 6014970 6058739 6093165 6117110 6132593 6144444 6156934 6171370
57149F171370J5869J6612J5661J1277L908l607r468j4253j8425k0912k1060j9832
$$ 6171370 6187239 6203851 6219512 6230789 6234697 6231090 6221622 6207369 6188944 6168032 6146972 6127140
57137F127140j7996j4980j0426n225j31N048J0185J4148J6027J5697J2923P457
$$ 6127140 6109144 6094164 6083738 6078513 6078382 6083430 6093615 6107763 6123790 6139487 6152410 6159867
57125F159867L67o395j2059j7048k0804k1662j9314j5505j1701p904m185j309
$$ 6159867 6160234 6153839 6141780 6124732 6103928 6082266 6062952 6047447 6035746 6027842 6023657 6022348
57113F022348Q68L773Q282J4332K2818L5758N3836P5805J01096J31153J67476
$$ 6022348 6023216 6026989 6035271 6049603 6072421 6108179 6162015 6237820 6338916 6470069 6637545
57102F637545K10548K61695L24006M00253M91485N98248P20995Q58228J006306
$$ 6637545 6848093 7109788 7433794 7834047 8325532 8923780 9644775 10503003 11509309
57093A1509309J162119J324003J488852J650357J801242J935023K043774K115458
$$ 11509309 12671428 13995431 15484283 17134640 18935882 20870905 22914679 25030137
57085B5030137K135064K088654J968430J778053J533369J253182R46840O14323
$$ 25030137 27165201 29253855 31222285 33000338 34533707 35786889 36733729 37348052
57077C7348052K60686r4626m28053p29190j002827j255196j483630j680273j840640
$$ 37348052 37608738 37514112 37086059 36356869 35354042 34098846 32615216 30934943 29094303
57068B9094303j965343k055521k109108k121331k088111k009838j892838j747483
$$ 29094303 27128960 25073439 22964331 20843000 18754889 16745051 14852213 13104730
57060A3104730j585107j416363j250474j093979r50148q20451p06066o07259n22392
$$ 13104730 11519623 10103260 8852786 7758807 6808659 5988208 5282142 4674883 4152491
57051D152491m49190l86572l34209k90859k54465k23485j97054j74218j54107
$$ 4152491 3703301 3316729 2982520 2691661 2437196 2213711 2016657 1842439 1688332
57042A688332j36479j21246j07848r5862q5567p7142o9907o3175n7058n1735m6814
$$ 1688332 1551853 1430607 1322759 1226897 1141330 1064188 994281 931106 874048 822313 775499
57031G75499m2217l8693l6489l4560l2072k9638k7945k6341k4013k1467j9510
$$ 775499 733282 694589 658100 623540 591468 561830 533885 507544 483531 462064 442554
57020D42554j7787j5696j3716j2398j0969q493n527l156j222J079L798O844J1032
$$ 442554 424767 409071 395355 382957 371988 363495 357968 354812 353590 354669 358467 365311 376343
57007C76343J6897K3463K9821L6902M5919N6323O7363Q0324R6451J13605J27768
$$ 376343 393240 416703 446524 483426 529345 585668 653031 733355 829806 943411 1071179
56996A071179J37008J40035J30768R9457M2863k8160r3765j37988j56555j54790
$$ 1071179 1208187 1348222 1478990 1578447 1621310 1593150 1499385 1361397 1204842 1050052
56986A050052j41002j21964j02040q3909o9009n7536m8957m2951l9472l7713l5839
$$ 1050052 909050 787086 685046 601137 532128 474592 425635 382684 343212 305499 269660
56975B69660l2448k7772k2747j7676j2594q170n059k809n33J726L431M886O969
$$ 269660 237212 209440 186693 169017 156423 148253 143194 140385 139852 141578 145009 149895 156864
56962A56864R781J2724J5673J8996K2524K5515K7384K7444K4255J6631N440o511
$$ 156864 166645 179369 195042 214038 236562 262077 289461 316905 341160 357791 363231 356720
56950C56720j6490k3107k6064k5815k3515k0340j6716j2716q835n576k636N56
$$ 356720 340230 317123 291059 265244 241729 221389 204673 191957 183122 177546 174910 175466
56938A75466L766O405Q810J2122J6815K2169K7046L0566L2110L1208K7299J9547
$$ 175466 179232 185637 194447 206569 223384 245553 272599 303165 335275 366483 393782 413329
56926D13329P736o162j8409k6473l0778l2869l2980l0660k6679k2604j9069j5882
$$ 413329 421065 414903 396494 370021 339243 306374 273394 242734 216055 193451 174382 158500
56914A58500j3232j1392r746p581n402m130l543k870k291k284k160r44P57J594
$$ 158500 145268 133876 124130 116549 111147 107017 103474 100604 98313 96029 93869 92925 93682 95276
56900I5276J748K491L816M543M698N673P788R635J0268J0355J0767J1641J3200
$$ 95276 97024 99515 103331 107874 112572 118245 126033 135668 145936 156291 167058 178699 191899
56887A91899J5861J8996K0976K0886J8959J5174R068J521n079r189j1451j2915
$$ 191899 207760 226756 247732 268618 287577 302751 311819 313340 308261 299072 287621 274706
56875B74706j3336j2077r555o703l756n22K744N584Q148J1130J5062J9935K5351
$$ 274706 261370 249293 239738 233035 229279 228757 231501 237085 245233 256363 271425 291360 316711
56862C16711L0841L6210M1367M5547M6975M3824L5312K1748M466j3536k8027l6118
$$ 316711 347552 383762 425129 470676 517651 561475 596787 618535 623001 609465 581438 545320
56850E45320l8298l6952l3488k8076k1387j4745q606k495L665R527J5596K2948
$$ 545320 507022 470070 436582 408506 387119 372374 363768 361273 364938 374465 390061 413009
56838D13009L1555M0338M8987N8242O7989P6238Q0108P6724O3507L9656Q330k3867
$$ 413009 444564 484902 533889 592131 660120 736358 816466 893190 956697 996353 1004683 980816
56826I80816n0422o7800p5507p5029o9129o0644n1068m0719l0236k0829j2986
$$ 980816 930394 862594 787087 712058 642929 582285 531217 490498 460262 439433 426447
56815D26447o026Q04P731J4999K2955L1415L9825M7956N5321N9839N8249M8271
$$ 426447 420421 421225 428956 443955 466910 498325 538150 586106 641427 701266 759515 807786
56803H07786K9975N681k0409m3099n8457o5671o6139o1490n3554m5057l8096l2160
$$ 807786 837761 843442 823033 779934 721477 655806 589667 528177 474623 429566 391470 359310
56791C59310k5529j8314j2152p161j690M784J0788J5423J9575K3933K7738L0127
$$ 359310 333781 315467 303315 296154 294464 299248 310036 325459 345034 368967 396705 426832
56779D26832L0718K8186K0377P151q374k2297l2463l8145l9244l6871l3149k9333
$$ 426832 457550 485736 506113 513264 504890 482593 450130 411985 372741 335870 302721 273388
56767B73388k5164k0644j6834j4173j1664q693o220n105m719m214l869m108m324
$$ 273388 248224 227580 210746 196573 184909 176216 169996 164891 160172 155958 152089 147981 143657
56754A43657l760k601j411m45j00q69k181k547j574n69n14p99p13o93j156j474
$$ 143657 139897 137296 135885 135440 135340 134471 132290 129743 128169 127600 127086 126287 125574 124881 123725 122251
56738A22251j143p38q24j025j046j330j938k036j432j187j803k167j391m14m42
$$ 122251 121108 120370 119546 118521 117475 116145 114207 112171 110739 109552 107749 105582 104191 103777 103335
56723A03335j013r27j54M18L99J8n34q96n36L64Q02L62j59j14R8R6K32N73M32
$$ 103335 102322 101395 101241 101659 102058 102076 101542 100646 100110 100474 101276 101638 101479 101365 101463 101559 101791 102364 102796
56704A02796k91o45k75j88q90j252m09N55J81j097j681r54M14J611K078J552N91
$$ 102796 102505 101860 101585 101397 100507 99255 98846 99401 99582 98485 96804 95850 96264 97875 99953 101505 102096
56687A02096L13R43J487J378J302J723J967J638J444J763J676O61k21m5L71n5
$$ 102096 102409 103352 104839 106217 107519 109242 111209 112847 114291 116054 117730 118391 118170 118125 118496 118441
56671A18441p89p44j59J8k18k62j46j85j13L08N34O5o78j143j414j495r56r2j04
$$ 118441 117652 116908 116749 116767 116549 116287 116141 115956 115843 116151 116685 116750 116072 114929 113515 112020 111064 110972 110868
56652A10868j115j472k33J105P85n82j237r49p48r02q66o63p24q57o32k83j46
$$ 110868 109753 108281 108048 109153 109938 109356 108119 107170 106422 105520 104654 103991 103267 102410 101778 101495 101349
56635A01349J76R65J506J186O15O00Q25O53L30K86J78k53l77J35L95k03o97j42
$$ 101349 101525 102490 103996 105182 105797 106397 107222 107875 108205 108491 108669 108416 108039 108174 108569 108366 107669 107527
56617A07527O63N10j37m6O98J089R77Q96Q22M61K12N09Q50O69M56P71J000L90
$$ 107527 108190 108700 108563 108517 109215 110304 111281 112177 112999 113460 113672 114181 115031 115700 116156 116927 117927 118317
56599A18317m42m03L41P95O49L16R0K35J048J999J843N63j42O89J780J793J423
$$ 118317 117875 117472 117813 118608 119257 119573 119663 119898 120946 122945 124788 125351 125209 125898 127678 129471 130894
56582A30894J796K359K159J827K328K962K545J579J294J561J595J813K994M522
$$ 130894 132690 135049 137208 139035 141363 144325 146870 148449 149743 151304 152899 154712 157706 162228
56568A62228N314N649O208O322N254M214M952O968Q239Q159P805P831Q003Q311
$$ 162228 167542 173191 179399 185721 190975 195189 200141 207109 215348 223507 231312 239143 247146 255457
56554B55457Q731Q396O732M820L932L539K412Q53q4p02j954l471m281m764n869
$$ 255457 264188 272584 279316 284136 288068 291607 294019 294872 294788 294086 292132 288661 284380 279616 273747
56539B73747p126p481p338p719q156p608o652o546o901o535n882o160o754o012
$$ 273747 266621 259140 251802 244083 235927 228319 221667 215121 208220 201685 195803 189643 182889 176877
56525A76877m181l094l204l314k928k627k386j779j490k360l390k972j662j273
$$ 176877 172696 169602 166398 163084 160156 157529 155143 153364 151874 149514 146124 143152 141490 140217
56511A40217j731j457m78l79j255j532q87p19j441j819j399j135j331j103k68
$$ 140217 138486 137029 136551 136172 134917 133385 132498 131779 130338 128519 127120 125985 124654 123551 123283
56496A23283L29N90J184J782J437O75R97K262K791K182J689J818J769J473J820
$$ 123283 123612 124202 125386 127168 128605 129280 130277 132539 135330 137512 139201 141019 142788 144261 146081
56481A46081K671K909K581K752L219K784J828K072L533M294L660L008L058K840
$$ 146081 148752 151661 154242 156994 160213 162997 164825 166897 170430 174724 178384 181392 184450 187290
56467A87290K014J783K670L532L500L009K472J815J599K523L610L042J013m28
$$ 187290 189304 191087 193757 197289 200789 203798 206270 208085 209684 212207 215817 218859 219872 219444
56453B19444n73o76j249j269n93n50j478k023j544r86p89j83Q28J001P4p50r97
$$ 219444 218871 218195 216946 215677 215084 214534 213056 211033 209489 208503 207714 207531 208359 209360 209434 208684 207687
56436B07687j426j983j538k34L21k43n72l15q56k570l820l596k915k662k279j446
$$ 207687 206261 204278 202740 202506 202827 202584 202012 201697 200841 198271 194451 190855 187940 185278 182999 181553
56420A81553r99j277j466j326j582k069j609k64L82k30q95r02q53q74l25L77K5
$$ 181553 180554 179277 177811 176485 174903 172834 171225 170961 171343 171113 170218 169316 168463 167589 167264 167641 167666
56403A67666q57l79J418K287J365L27L28N14L66P38J656J744P51J37L75L19l6
$$ 167666 166809 166430 167848 170135 171500 171827 172155 172669 173035 173773 175429 177173 177924 178061 178436 178755 178719
56386A78719Q61K926L780K501J089J015J173N95L04R31J251O48N20J706K877K982
$$ 178719 179580 182506 186286 188787 189876 190891 192064 192659 192963 193894 195145 195793 196313 198019 200896 203878
56370B03878K806K861K249R60P16K035K987K347J477J619J872J381R95J253J116
$$ 203878 206684 209545 211794 212754 213470 215505 218492 220839 222316 223935 225807 227188 228183 229436 230552
56355B30552K50J06J234J963J278N66R73J532J387J360J856J735Q01P99K393L759
$$ 230552 230802 230908 232142 234105 235383 235949 236922 238454 239841 241201 243057 244792 245593 246392 248785 252544
56339B52544L708L567M252M355L000J901K622M130M959N388N860N691M973N235
$$ 252544 256252 259819 264071 268426 271426 273327 275949 280079 285038 290426 296286 301977 306950 312185
56325C12185O622P108N982N270O026O324M830L276L245L470K535J435J211Q57
$$ 312185 318807 325915 331897 337167 343193 349517 354347 357623 360868 364338 366873 368308 369519 370376
56311C70376k59o91K00N00q92k090j621r56j364j387KR54K07j46J638L579L435
$$ 370376 370117 369426 369626 370126 369234 367144 365523 364567 363203 361816 361818 362772 362979 362833 364471 368050 371485
56294C71485K700L771N726O305N811N841O253O369P138R215J1055J1549J2219
$$ 371485 374185 377956 383682 389987 395798 401639 407892 414261 421399 430614 441669 453218 465437
56281D65437J4184J5620J5084J4618J6436J9178K0740K2237K5643K9933L3094
$$ 465437 479621 495241 510325 524943 541379 560557 581297 603534 629177 659110 692204
56270F92204L5783L9595M3752M6919N0282N5553O1859O7757P4237Q2607R1518
$$ 692204 727987 767582 811334 858253 908535 964088 1025947 1093704 1167941 1250548 1342066
56259A342066R9200J06410J14094J20537J24184J26797J30299J32739J31065J25631
$$ 1342066 1441266 1547676 1661770 1782307 1906491 2033288 2163587 2296326 2427391 2553022
56249B553022J18410J09004R6203Q1470O7028N2427L6576K1156Q371k636j3486
$$ 2553022 2671432 2780436 2876639 2958109 3025137 3077564 3114140 3135296 3143667 3141031 3127545
56238C127545k2861k8890l3101l8059m3047m6100m8324n2234n7514o2413o7600
$$ 3127545 3104684 3075794 3042693 3004634 2961587 2915487 2867163 2814929 2757415 2695002 2627402
56227B627402p4618q2200q8026r2554r7363j01374j02551j01686j00818r9560
$$ 2627402 2552784 2470584 2382558 2290004 2192641 2091267 1988716 1887030 1786212 1686652
56217A686652r6571r2753q9381q5057p8243p0686o4640n9046n2286m6089m2528
$$ 1686652 1590081 1497328 1407947 1322890 1244647 1173961 1109321 1050275 997989 951900 909372
56206I09372l9717l5005k9917k7267k5846k2818j9087j7229j6338j4054j1555
$$ 909372 869655 834650 804733 777466 751620 728802 709715 692486 676148 662094 650539
56195F50539j1295j1763r985p258o839p712o317l043j228r95K42K226K483J585
$$ 650539 639244 627481 617496 610238 603399 595687 589370 586327 585099 584104 584346 586572 589055 590640
56181E90640K341M500N508N592O861Q408P675N722N808P602Q126P440Q006R334
$$ 590640 592981 597481 602989 608581 615442 623850 631525 637247 643055 650657 658783 666223 674229 683563
56167F83563Q793O880O301O682N648M148N142P788Q657P916Q727J1285J3125J4467
$$ 683563 692356 699236 705537 712219 717867 722015 727157 734945 743602 751518 760245 771530 784655 799122
56153G99122J7530K1358K3240K4523K8974L6085M2045M6721N3569O3042P2387
$$ 799122 816652 838010 861250 885773 914747 950832 992877 1039598 1093167 1156209 1228596
56142A228596Q1711R4150J10100J27036J44598J63971J82567J95220K00247J98794
$$ 1228596 1310307 1404457 1514557 1641593 1786191 1950162 2132729 2327949 2528196 2726990
56132B726990J89473J70320J45306J22144J03932Q9002P7655P1515O6815N6254
$$ 2726990 2916463 3086783 3232089 3354233 3458165 3547167 3624822 3696337 3763152 3819406
56122C819406L8268J7768k075k1714l9285n0820n7444o5418p8126r4248j13556
$$ 3819406 3857674 3875442 3873367 3851653 3812368 3761548 3704104 3638686 3560560 3466312 3352756
56111C352756j37052j60898j77676j84752j85044j79618j66746j48556j30929
$$ 3352756 3215704 3054806 2877130 2692378 2507334 2327716 2160970 2012414 1881485
56102A881485j15899j01028q6520p5643o7872n9303n0262m4804m2355l7869l0844
$$ 1881485 1765586 1664558 1578038 1502395 1434523 1375220 1324958 1280154 1237799 1199930 1169086
56091A169086k6009k4338k1567j6612j3257j2348j0370o860n272n525l759k25
$$ 1169086 1143077 1118739 1097172 1080560 1067303 1054955 1044585 1037725 1032453 1026928 1023169 1022944
56079A022944P95m65O99M237N175L313L895P553R089P427P384J0055J1082R937
$$ 1022944 1023739 1023274 1023973 1028210 1033385 1036698 1040593 1048146 1057235 1064662 1072046 1082101 1093183 1103120
56065A103120J1248J5158J6153J3351J2227J4317J4987J3215J3516J6336J6751
$$ 1103120 1114368 1129526 1145679 1159030 1171257 1185574 1200561 1213776 1227292 1243628 1260379
56054A260379J4521J5093J8839J9957J7841J8391K2181K2920J9830J9686K3985
$$ 1260379 1274900 1289993 1308832 1328789 1346630 1365021 1387202 1410122 1429952 1449638 1473623
56043A473623K6182K4414K4776K8947L0983K9584L0998L6362L8924L7281L8340
$$ 1473623 1499805 1524219 1548995 1577942 1608925 1638509 1669507 1705869 1744793 1782074 1820414
56032A820414M3576M5760M3153M3216M8152N0766M8961M9991N5701N8287N5580
$$ 1820414 1863990 1909750 1952903 1996119 2044271 2095037 2143998 2193989 2249690 2307977 2363557
56021B363557N5663O1098O3847O1323O1823O8246P2334P1172P3212Q1495Q7347
$$ 2363557 2419220 2480318 2544165 2605488 2667311 2735557 2807891 2879063 2952275 3033770 3121117
56010C121117Q7417R0114R8394J03477J02664J05548J15248J21920J22364J26930
$$ 3121117 3208534 3298648 3397042 3500519 3603183 3708731 3823979 3945899 4068263 4195193
56000D195193J39051J47926J49895J56294J71156J82701J86544J94950K12817
$$ 4195193 4334244 4482170 4632065 4788359 4959515 5142216 5328760 5523710 5736527
55991E736527K27705K34590K46353K68075K86229K95897L12422L42477L70951
$$ 5736527 5964232 6198822 6445175 6713250 6999479 7295376 7607798 7950275 8321226
55982H321226L91036M18496M60524N00657N31711N72260O31823O92692P46274
$$ 8321226 8712262 9130758 9591282 10091939 10623650 11195910 11827733 12520425 13266699
55973A3266699Q12939R04199J001723J097408J215756J371327J545617J733924
$$ 13266699 14079638 14983837 15985560 17082968 18298724 19670051 21215668 22949592
55965B2949592J970801K278974K642119L062643L592806M268306N067082N975942
$$ 22949592 24920393 27199367 29841486 32904129 36496935 40765241 45832323 51808265
55957E1808265P033085Q257903R620539J1148689J2979845J5229832J7912404
$$ 51808265 58841350 67099253 76719792 87868481 100848326 116078158 133990562
55950A33990562K1088442K4942491K9477475L4139625L7868704L9414176L7437081
$$ 133990562 155079004 180021495 209498970 243638595 281507299 320921475 358358556
55943C58358556L0618235J8432127K269084j4494927k8105718l6417798l9506574
$$ 358358556 388976791 407408918 409678002 395183075 367077357 330659559 291152985
55936B91152985l8758505l5721959l1620865k7318556k3300894j9712743j6553464
$$ 291152985 252394480 216672521 185051656 157733100 134432206 114719463 98165999
55929I8165999j3837745j1568031r676140q083310o764699n703122m837430m107712
$$ 98165999 84328254 72760223 63084083 55000773 48236074 42532952 37695522 33587810
55921C3587810l503092l020968k623442k274039j976785j741232j544682j362799
$$ 33587810 30084718 27063750 24440308 22166269 20189484 18448252 16903570 15540771
55913A5540771j203541j078556r71763q66063p72124p02371o43159n79264n20638
$$ 15540771 14337230 13258674 12286911 11420848 10648724 9946353 9303194 8723930 8203292
55904H203292m79519m44805m03349l64331l39262l18808k91590k66067k52398
$$ 8203292 7723773 7278968 6875619 6511288 6172026 5853218 5561628 5295561 5043163
55895E043163k41391k22072k02379j92662j85545j71227j56584j50606j46183
$$ 5043163 4801772 4579700 4377321 4184659 3999114 3827887 3671303 3520697 3374514
55886C374514j34310j21752j17325j14586j04885r4268r1085q9672q2101p3828
$$ 3374514 3240204 3118452 3001127 2886541 2781656 2687388 2596303 2506631 2424530 2350702
55876B350702p2285p1827o5029n7470n6667n7243n1529m4420m3705m5581m3220
$$ 2350702 2278417 2206590 2141561 2084091 2027424 1970181 1918652 1874232 1830527 1784946 1741726
55865A741726m0159m1903m3674l9301l3420l2402l1963k5830j8054j4864j2831
$$ 1741726 1701567 1659664 1615990 1576689 1543269 1510867 1478904 1453074 1435020 1420156 1407325
55854A407325o773j085j694m919n602q032j7384k8177l2682l3400l6199l8549
$$ 1407325 1400552 1399467 1397773 1392854 1387252 1379220 1361836 1333659 1300977 1267577 1231378 1192829
55842A192829l5685l1321l1078l1840k8421k4250k4883k7225k5667k2758k3459
$$ 1192829 1157144 1125823 1094745 1062905 1034484 1010234 985351 958126 932459 909701 886242
55831H86242k4910k2110j7961j7568j8248j5123j1033j0975j2223r875o875q507
$$ 886242 861332 839222 821261 803693 785445 770322 759289 748314 736091 726216 719341 710834
55819G10834j1990j1456q547q298r129o592k794k448l607j571J806J805p5M19
$$ 710834 698844 687388 678841 670543 661414 654822 652028 649580 645973 644402 646208 648013 647938 648357
55805F48357J563p68m498n030l917n347p606o654m609o073r350r877r055j1074
$$ 648357 649920 649152 644654 639624 635707 630360 622754 616100 611491 605418 596068 586191 577136 566062
55791E66062j4116j3444j0444j0036j1572j0742q122p572q298o556l301k360k996
$$ 566062 551946 538502 528058 518022 506450 495708 487586 480014 471716 465160 461859 459499 456503
55778D56503j861l79k570p362j0353j1435j3536j5780j5054j2633j2144j2726
$$ 456503 454642 454263 451693 444331 433978 422543 409007 393227 378173 365540 353396 340670
55766C40670j1000p952p040p426n974l940m760o996o563m156l586m436l354j009
$$ 340670 329670 321718 314678 307252 301278 297338 292578 285582 279019 274863 271277 266841 263487 262478
55752B62478q04k098j591n3q96l310l674k485l143n039m686k648k556m152l982
$$ 262478 261674 259576 257985 257932 257036 253726 250052 247567 244424 239385 234699 232051 229495 225343 221361
55737B21361k257k366m165m229k340j465j801j004K59q41l386l723j998j681l116
$$ 221361 219104 216738 212573 208344 206004 204539 202738 201734 201993 201152 197766 194043 192045 190364 187248
55722A87248l439k459k621l592k731o96o88k478k871j702j574k121n05K621L671
$$ 187248 183809 181350 178729 175137 172406 171710 171022 168544 165673 163971 162397 160276 159771 162392 166063
55707A66063K577K773M689N191L738L263M459M725L341K425K299J126n66j65J801
$$ 166063 168640 171413 176102 181293 185031 188294 192753 197478 200819 203244 205543 206669 206103 205938 207739
55692B07739J866m90k194k067k056k656k131p13o95j896j691J46J257J418K710
$$ 207739 209605 209115 206921 204854 202798 200142 198011 197298 196603 194707 193016 193162 194419 195837 198547
55677A98547M867N387M355M351N404N045L494L609N391N695L900K716K827J948
$$ 198547 203414 208801 213156 217507 222911 227956 231450 235059 240450 246145 250045 252761 255588 257536
55663B57536j28p81K04k14k794m514l867k984l240l214k325k174l046l120k251
$$ 257536 257408 256627 256831 256617 253823 249309 245442 242458 239218 236004 233679 231505 228459 225339 223088
55648B23088k502m110m982m859n768p659q010o523n784o472o329m859m383n432
$$ 223088 220586 216476 211494 206635 200867 193208 185198 178675 172891 166419 160090 155231 150848 145416
55634A45416n575m102l391m312m563l108j991k298k352j424j242k358k856k053
$$ 145416 139841 135739 132348 128036 123473 120365 118374 116076 113724 112300 111058 108700 105844 103791
55620A03791j668k150j743m04n36k517l570k541j680k141j899P8J576J081K23
$$ 103791 102123 99973 98230 97826 97290 94773 91203 88662 86982 84841 82942 83020 84596 85677 85900
55605H5900L92L93n85j096l92N5l99k49Q27P79j008k077r39N49N75M9R5k4p72
$$ 85900 86292 86685 86100 85004 84612 84667 84268 84019 84846 85625 84617 82540 81601 82150 82725 82774 82869 82845 82073
55586H2073j016n09p49j962k213r35j90r04j105M07J806J410K33l43o62r88l52
$$ 82073 81057 80548 79799 77837 75624 74689 74499 73595 72490 72897 74703 76113 76346 76003 75341 74353 74001
55569G4001J268K286K306K878M386N148M636M444M894M035J381q02j298j657k742
$$ 74001 75269 77555 79861 82739 87125 92273 96909 101353 106247 110282 111663 110861 109563 107906 105164
55554A05164l086k296k370l818m149k263p16j279j858l57J683K065J550J681J812
$$ 105164 102078 99782 97412 93594 89445 87182 86466 85187 83329 82972 84655 86720 88270 89951 91763
55539I1763J020N38J537K732K726K495L216L818L052J863J457J117J10m20L64
$$ 91763 92783 93321 94858 97590 100316 102811 106027 109845 112897 114760 116217 117334 117444 117024 117388
55524A17388R71Mj389j657j474k164l294l903m359n108n308m539m036m628n164
$$ 117388 118359 118363 116974 115317 113843 111679 108385 104482 100123 95015 89707 85168 81132 76504 71340
55509G1340m640l964l994l845k718j513j117j016q92j512k655k591j009j4o92
$$ 71340 66700 62736 58742 54897 52179 50666 49549 48533 47641 46129 43474 40883 39874 39860 39168
55494C9168j253l30N70p5j100r98o35j310k138j684m44L08M94L94l21j236r09
$$ 39168 37915 37585 38155 38080 36980 35982 35347 34037 31899 30215 29771 30079 30573 30967 30646 29410 28501
55477B8501O41J307K98m25L74R95kj143q28j87p36j510j039p4R3K4N74R39L82
$$ 28501 29142 30449 30747 30322 30696 31691 31689 30546 29718 29531 28795 27285 26246 26172 26265 26289 26863 27802 28184
55458B8184n9L32K82r42j683p79J18m74j009K28J746J330j18k88O78J014N82M41
$$ 28184 28125 28457 28739 27797 26114 25335 25453 24979 23970 24198 25944 27274 27156 26868 27546 28560 29142 29583
55440B9583M77M1k80J19K68n48r97RJ038N98n2Q03K047J665L36J00P92P42n2l34
$$ 29583 30060 30101 29821 29940 30208 29660 28663 28672 29710 30308 30256 31059 33106 34771 35107 35207 35999 36741 36689 36355
55420C6355j64l69m90K63R55L47p20p22j10j18k55N54J519J379R44J584K349J471
$$ 36355 36191 35822 35332 35595 36550 36897 36177 35455 35345 35227 34972 35526 37045 38424 39368 40952 43301 44772
55402D4772k82o72L29Q29K62l30o96j441k100j685p50o35j133j056n58o83j222
$$ 44772 44490 43818 44147 44976 45238 44908 44212 42771 40671 38986 38236 37601 36468 35412 34854 34171 32949
55385C2949j126n10k13j20J87N2r74j588o60M78J8j193j128j04n5j092j600j191
$$ 32949 31823 31313 31100 30980 31167 31219 30245 28657 27997 28475 28493 27300 26172 26068 26013 24921 23321 22130
55367B2130q80p50l6P96N63l43n54j34k14o48m54q7p85j997j976o67L08L72M20
$$ 22130 21250 20500 20464 21260 21823 21480 20926 20792 20578 19930 19476 19389 18604 16607 14631 13964 14272 14644 15064
55348A5064O86M84n4l7M52N84M72P87J087N36k36k4O69L53q53j443j000m29q1
$$ 15064 15750 16234 16180 16143 16595 17179 17651 18438 19525 20061 19825 19801 20470 20823 19970 18527 17527 17098 17017
55329A7017L78O15J07m46n2P02O05m7j44J35m6k41M05J129O61l49l34M68O15J37
$$ 17017 17395 18010 18117 17671 17619 18321 18926 18879 18735 18870 18824 18583 18988 20117 20778 20429 20095 20563 21178 21315
55309B1315J43M33K4n65j32O66K77p66n97O51J097M53K76R50J165N39J13J09l41
$$ 21315 21458 21891 21915 21350 21218 21884 22161 21395 20798 21449 22546 22999 23275 24225 25390 25929 26042 26151 25810
55290B5810j087j002j97J01j64j7K85l58j449j457o65q08j827j839m71N43M33
$$ 25810 24723 23721 23524 23625 23461 23444 23729 23371 21922 20465 19800 18992 17165 15326 14855 15398 15831
55273A5831L17O60N39r8jR60J363Q02M47O19K47p37r06J15R65R66R65J256R55
$$ 15831 16148 16808 17347 17249 17248 18208 19571 20373 20820 21439 21686 20949 20043 20158 21123 22089 23054 24310 25265
55254B5265P3r8O80J073N30K4n8m83j184j023j19n2j154j888j513j044r76m36
$$ 25265 25338 25240 25920 26993 27523 27547 27489 27006 25822 24799 24680 24628 23474 21586 20073 19029 18053 17617
55236A7617O62J049M25O1L50J61o18m70R19J677P71l31k55K83L17L24Q24J180
$$ 17617 18279 19328 19753 19814 20164 20325 19707 19237 20156 21833 22604 22273 22018 22301 22618 22942 23766 24946
55218B4946J026J007J167N19q62j371n52o5q66j604j059o0L77P28J436J622Q21
$$ 24946 25972 26979 28146 28665 27803 26432 25880 25815 24949 23345 22286 22226 22603 23331 24767 26389 27210
55201B7210J33K61K32n28q48PP20J61o00k71M14K59j74J48O12R7q53r14k24M7
$$ 27210 27343 27604 27836 27308 26460 26467 27187 27348 26748 26477 26891 27150 26976 27124 27736 27833 26980 26066 25842 25889
55181B5889l45o95p05n24l7P59J267J060N32J9p75j737j887q21M00P08L54Ql40
$$ 25889 25544 24849 24144 23620 23583 24342 25609 26669 27201 27220 26445 24708 22821 22000 22400 23108 23462 23470 23130
55162B3130p15n74J89P40O24N33R02R90K72m71m12M4J49n9l29q18j397j419q62
$$ 23130 22415 21841 22030 22770 23394 23927 24829 25819 26091 25620 25208 25252 25401 25342 25013 24195 22798 21379 20517
55143B0517n72p25m50M27P81J74j45P89K107K611K413K077J476O30L17P74J080
$$ 20517 19945 19220 18770 19197 19978 20152 20007 20796 22903 25514 27927 30004 31480 32110 32427 33201 34281
55126C4281P30N47J026J323Q71N05P62O93l06j066n40K21k74j605k312k081j528
$$ 34281 35011 35558 36584 37907 38778 39283 40045 40738 40432 39366 38826 39047 38773 37168 34856 32775 31247
55109C1247p95R8M42j25o03J6J142J655J633J754J902J683J439J419Q68o46j976
$$ 31247 30452 30550 30992 30867 30264 30280 31422 33077 34710 36464 38366 40049 41488 42907 43775 43129 41153
55092D1153j882r64o07p61l60O85J441J523J333R99L45l48n77l65k1M65J010J077
$$ 41153 39271 38307 37700 36939 36579 37264 38705 40228 41561 42560 42905 42557 41980 41615 41594 42059 43069 44146
55074D4146M71q1O2N88R71J241J342P31n81j495j238l83K72P94J306J298P06M71
$$ 44146 44617 44536 44598 45186 46157 47398 48740 49471 48890 47395 46157 45774 46046 46840 48146 49444 50150 50621
55056E0621J024J383Q03M4j05k76j132j852j473n98k33m0O85J331R51M4k95k20
$$ 50621 51645 53028 53831 53875 53770 53494 52362 50510 49037 48439 48206 48166 48851 50182 51133 51177 50882 50662
55038E0662m82p52k84M47M99K47P17J604J715R84M05K17j96q18r03l59J13K45
$$ 50662 50180 49428 49144 49591 50090 50337 51054 52658 54373 55357 55762 55979 55783 54965 54062 53703 53816 54061
55020E4061L60M59K36j33k38k10l39l30R8L58k02j090j398j202j139j054l45O85
$$ 54061 54421 54880 55116 54983 54745 54535 54196 53866 53964 54322 54120 53030 51632 50430 49291 48237 47892 48577
55002D8577J061N21l44j112j723k014j907j727j603j093q0O87P76R22J688K239
$$ 48577 49638 50159 49815 48703 46980 44966 43059 41332 39729 38636 38556 39243 40019 40941 42629 44868
54986D4868J630M75k4J48L18O73J725K852L007K457K322K688K650K005J507J581
$$ 44868 46498 46973 46949 47097 47415 48088 49813 52665 55672 58129 60451 63139 65789 67794 69301 70882
54970G0882J968K492L061L241K903K889L971N523O422O761P409Q433R302J0249
$$ 70882 72850 75342 78403 81644 84547 87436 91407 96930 103352 110113 117522 125955 135257 145506
54956A45506J1923J3869J4839J4543J3861J3324J2470J0724Q009M576Q87k572
$$ 145506 157429 171298 186137 200680 214541 227865 240335 251059 259068 263644 264531 261959
54944B61959n949r896j4133j7036j7542j6494j5145j3525j1490j0008r680r125
$$ 261959 256010 246114 231981 214945 197403 180909 165764 152239 140749 130741 121061 111936
54932A11936o902m042k648k687k457j636j354j520o74J248K421J929J075J276
$$ 111936 105034 100992 98344 95657 93200 91564 90210 88690 88016 89264 91685 93614 94689 95965
54918I5965K454M073O069Q073R249R649J0398J1961J3416J3963J3892J3565J2535
$$ 95965 98419 102492 108561 116634 125883 135532 145930 157891 171307 185270 199162 212727 225262
54905B25262J0348P156L155j654o704j0798j3297j4601j5269j5374j4868j3788
$$ 225262 235610 242766 245921 244267 237563 226765 213468 198867 183598 168224 153356 139568
54893A39568j2050r817p980p323p295o607n007l408k394j755j464j776k240j827
$$ 139568 127518 117701 109721 102398 95103 88496 83489 80081 77687 75932 74468 72692 70452 68625
54879F8625m48P42R29N71M62O21M64m19j789k706k263q53j51j092k521k826k164
$$ 68625 68177 68919 69848 70419 70881 71502 71966 71547 69758 67052 64789 63936 63785 62693 60172 57346 55182
54862E5182j797j986k047j905j929j605j53J694K284J439N59L11rp60j277j279
$$ 55182 53385 51399 49352 47447 45518 43913 43760 45454 47738 49177 49736 50047 50038 49278 48001 46722
54846D6722j291j337q40k5M9o41q02J23J085J132N51j38r27j574j429n68J61O40
$$ 46722 45431 44094 43254 43229 43278 42637 41835 41958 43043 44175 44726 44588 43661 42087 40658 40090 40251 40891
54828D0891J656L090L536K344P60K16O89J447K155K547K155J168N75P99J226J539
$$ 40891 42547 45637 49173 51517 52277 52493 53182 54629 56784 59331 61486 62654 63229 64028 65254 66793
54812F6793K279L490M172L902L809M946O728P987Q624R199R749J0095J0733J2307
$$ 66793 69072 72562 76734 80636 84445 89391 96119 104106 112730 121929 131678 141773 152506 164813
54798A64813J4489J6142J6453J5316J2976R727N772J193l616p615r877j0680j1113
$$ 164813 179302 195444 211897 227213 240189 249916 255688 256881 253265 245650 235773 225093 213980
54785B13980j1617j1755j1341j0722r894q540p123o634p028p037o034m773l892
$$ 213980 202363 190608 179267 168545 158651 150111 142988 136354 129326 122289 116255 111482 107590
54772A07590k936j483n0Q79J625K465L018L117L366M159N091N988P410R531J1512
$$ 107590 104654 103171 103121 104000 105625 108090 111108 114225 117591 121750 126841 132829 140239 149770 161282
54757A61282J2686J3466J4260J4659J4432J4211J4160J3017R616M659k17m415
$$ 161282 173968 187434 201694 216353 230785 244996 259156 272173 281789 286448 286231 281816
54745B81816q299j1723j3949j4815j4917j4676j4096j3270j2420j1558j0612r793
$$ 281816 273517 261794 247845 233030 218113 203437 189341 176071 163651 152093 141481 131688
54733A31688r274q721p625o032m525l600l306l380l478l370l005k288j140k4M
$$ 131688 122414 113693 106068 100036 95511 91911 88605 85225 81747 78377 75372 73084 71944 71920 71924
54718G1924j413k962k924j352O3L08L8J12L49K57j8j00O4M81J202J804J654R71
$$ 71924 70511 67549 64625 63273 63336 63644 63682 63794 64143 64400 64382 64282 64346 64827 66029 67833 69487 70458
54700G0458P21J133J333Q31K14q5n71j463j823q80O22J345J012L18k28o23q83
$$ 70458 71179 72312 73645 74476 74690 74605 74034 72571 70748 69868 70490 71835 72847 73165 72937 72314 71431
54683G1431r15n91K53J515K382K041R15L65Q69J575J845K105K638K830K336J890
$$ 71431 70516 69925 70178 71693 74075 76116 77031 77396 78265 79840 81685 83790 86428 89258 91594 93484
54667I3484K091K397K247K140K641L161K857K042J606J589J337O48m5l41l0R35
$$ 93484 95575 97972 100219 102359 105000 108161 111018 113060 114666 116255 117592 118240 118195 117854 117824 118759
54651A18759K054K433J914J479J899K735L235L475L815L988L678L365L693M431
$$ 118759 120813 123246 125160 126639 128538 131273 134508 137983 141798 145786 149464 152829 156522 160953
54637A60953M890M861M407L276J361o94k213l394m802o315p353p740p729p447
$$ 160953 165843 170704 175111 178387 179748 179054 176841 173447 168645 162330 154977 147237 139508 132061
54623A32061o984o524n893m517k439p30k30m19l61j10k95p92q74l80J68M90P94
$$ 132061 125077 118553 112660 108143 105704 104974 104744 104325 103964 103854 103559 102767 101893 101513 101681 102171 102965
54606A02965J149J267R13J52o95j145r12m16m73j247k088k561k988l571l842l460
$$ 102965 104114 105381 106294 106446 105751 104606 103694 103278 102805 101558 99470 96909 93921 90350 86508 83048
54590H3048k800k220j560q65p86j486k044j735j097r06q77l69L10L74j75p08j000
$$ 83048 80248 78028 76468 75603 74817 73331 71287 69552 68455 67549 66672 66303 66613 66987 66812 66104 65104
54573F5104j230j347j310j530k207k628j996o02N79J111J160Q21K26q2K76Q11
$$ 65104 63874 62527 61217 59687 57480 54852 52856 52254 52833 53944 55104 55925 56151 56069 56345 57156
54557E7156Q13L56k6k31m02k68M52J284J490J067O28M95N83Q55J223J332J076
$$ 57156 57969 58325 58299 58068 57666 57398 57850 59134 60624 61691 62319 62814 63397 64252 65475 66807 67883
54540F7883R23J203J501J380J162J342J752K074K588L555M283L840K410J140Q03
$$ 67883 68806 70009 71510 72890 74052 75394 77146 79220 81808 85363 89646 93486 95896 97036 97839
54525I7839J264J998K387J811K24j588k790l354l655l755l593l380l169k594j661
$$ 97839 99103 101101 103488 105299 105523 103935 101145 97791 94136 90381 86788 83408 80239 77645 75984
54510G5984j127j406j742j271l43J18L7P5N38J229J980K517K270J134m2m94n39
$$ 75984 74857 73451 71709 70438 70095 70213 70250 70325 70863 72092 74072 76589 78859 79993 79951 79457 78918
54493G8918p78r32m24M37Q81Q35P47O46L05q5k48l99p02o75LO97P44M81M51K83
$$ 78918 78140 77208 76784 77221 78102 78937 79684 80330 80635 80550 80302 79903 79201 78526 78529 79226 79970 80451 80902 81185
54473H1185m48j045o58J87L95J21K69O94M83k02k15O30J196P44k63j174j771j776
$$ 81185 80737 79692 79034 79221 79616 79737 80006 80700 81183 80981 80766 81396 82592 83336 83073 81899 80128 78352
54455G8352r67M8K88k47o06l77j27l00o69r60j126r40j99O53Q76M26j44n39p36
$$ 78352 77385 77433 77721 77474 76868 76491 76364 76064 75395 74435 73309 72369 72170 72823 73699 74125 73981 73442 72706
54436G2706m92K07O15J17o84q49n94o96q41j35J034J274L65m20l07J41L64N41
$$ 72706 72214 72421 73036 73153 72469 71620 71026 70330 69489 69354 70388 71662 72027 71607 71300 71441 71805 72346
54418G2346O75L75j10L6P01P67l9n72q2O90R39J091J816K743L081K833K592K636
$$ 72346 73021 73396 73286 73322 74023 74790 74751 74179 74097 74787 75726 76817 78633 81376 84457 87290 89882 92518
54400I2518K792K890K841K711K832L421M062M113L643L185K661J494j19j104r80
$$ 92518 95310 98200 101041 103752 106584 110005 114067 118180 121823 125008 127669 129163 129044 127940 126960
54385A26960n37o53j303k044k654k971k788k304k013j959j715j279j150j416j559
$$ 126960 126423 125770 124467 122423 119769 116798 114010 111706 109693 107734 106019 104740 103590 102174 100615
54370A00615j447j645k380l015k943k342j705j217q82o80m06O9L57K9m38o1J155
$$ 100615 99168 97523 95143 92128 89185 86843 85138 83921 83039 82359 81953 82022 82379 82408 81970 81909 83064
54353H3064J990J606N83M8L98J266K083K465K438K466K841L148K921K532K647
$$ 83064 85054 86660 87243 87291 87689 88955 91038 93503 95941 98407 101248 104396 107317 109849 112496
54338A12496L000K800K216K256K967K973J341j069k708l047k740k649l140l941
$$ 112496 115496 118296 120512 122768 125735 128708 130049 128980 126272 123225 120485 117836 114696 110755
54324A10755m441m370m084l866l375k406j669j829k237j787p55m38j101j704j699
$$ 110755 106314 101944 97860 93994 90619 88213 86544 84715 82478 80691 79936 79498 78397 76693 74994
54309G4994j605j680j453r28q20j213j317r33q19j156j110m91l81j288k038j469
$$ 74994 73389 71709 70256 69328 68508 67295 65978 65045 64226 63070 61960 61469 61088 59800 57762 56293
54293E6293j20P25P62N04K37M0J17L86L43j26m66m25m85q30q74l42J33J43K44
$$ 56293 56173 56898 57660 58164 58401 58441 58558 58944 59287 59161 58695 58270 57785 56955 56081 55739 55872 56015 56259
54274E6259Q51J353J127O15N27P02O35L67J65p2l56j86O35J412J388P29jo23j106
$$ 56259 57110 58463 59590 60205 60732 61434 62069 62436 62601 62529 62173 61987 62622 64034 65422 66151 66150 65527 64421
54255F4421j175p79l22P2Q00J783K083J217O9k46K40P75J020J033P34J49l13l98
$$ 64421 63246 62467 62145 62217 63017 64800 66883 68100 68169 67923 68163 68938 69958 70991 71725 71874 71561 71163
54237G1163l83m39l39j26l32j060j663j793j845j873j159L41J286O75o33j198
$$ 71163 70780 70341 70002 69876 69544 68484 66821 65028 63183 61310 60151 60492 61778 62453 61820 60622
54221F0622q94n02k45J12K85j20o55n98j26M8j40k29j73k09j44L19Q16P83M66
$$ 60622 59728 59226 58981 59093 59378 59258 58603 58005 57879 57927 57787 57558 57385 57176 57032 57351 58167 58950 59416
54202E9416N70J102J425J278J029Q90O48J13n70j055r99l23M69O66K11k98n89
$$ 59416 59986 61088 62513 63791 64820 65710 66358 66471 65901 64846 63847 63524 63993 64659 64870 64572 63983
54185F3983r68j356j079j05N39K52j94j1L07L3l64m8N80M64m30j159j281j158
$$ 63983 63015 61659 60580 60475 61014 61266 61072 61061 61368 61401 61037 60989 61569 62033 61603 60444 59163 58005
54167E8005j033p90m83k58J13P75J218Q87J40k02JL03M95O22M56p8l49K55J196
$$ 58005 56972 56182 55699 55441 55554 56329 57547 58434 58574 58372 58373 58676 59171 59793 60249 60171 59822 60077 61273
54148F1273J325M35m96n62K19J165J514R26o7m42M0M44L0n75l48N43J019N46m73
$$ 61273 62598 63033 62537 61975 62194 63359 64873 65799 65732 65290 65330 65774 65804 65229 64881 65424 66443 66989 66516
54129F6516j430j839j374l85O3n90j468j413n77J1l7k71m13n41n37k43P5J81L99
$$ 66516 65086 63247 61873 61488 61551 60961 59493 58080 57503 57514 57477 57206 56793 56252 55715 55472 55547 55728 56127
54110E6127Q94R91J68p52n63N46J338J348J095P59l0j069j490j009k55K47N28
$$ 56127 57021 58012 58180 57428 56865 57411 58749 60097 61192 61951 61921 60852 59362 58353 58098 58345 58873
54093E8873N46J16m05k85N34J269J323Q03L1o97r27m32J91O6p61j353j081k06
$$ 58873 59419 59535 59130 58845 59379 60648 61971 62774 62805 62108 61181 60749 60940 61006 60245 58892 57811 57605
54075E7605O12P93O1j089j432l60J111J591J172J037J470J567Q92J46n8K7J5k2
$$ 57605 58217 59010 59071 57982 56550 56190 57301 58892 60064 61101 62571 64138 65030 65176 65118 65145 65160 65138
54057F5138j8j44l32k87o4N9L07J115K167K596K250J827J658J373R16Q74J469
$$ 65138 65120 64976 64644 64357 64293 64352 64659 65774 67941 70537 72787 74614 76272 77645 78561 79435 80904
54040H0904K130K451K723L160L408L213K909K796K802L014L814N052N843N684
$$ 80904 83034 85485 88208 91368 94776 97989 100898 103694 106496 109510 113324 118376 124219 129903
54026A29903N236N441O322P071P077O513O047O126O416O059M747L292K632K643
$$ 129903 135139 140580 146902 153973 161050 167563 173610 179736 186152 192211 196958 200250 202882 205525
54012B05525K530K126J853J558N02j375l107l920l986l738l283k871l058l922
$$ 205525 208055 210181 212034 213592 214094 212719 209612 205692 201706 197968 194685 191814 188756 184834
53998A84834m696m750m394m315m577m679m249l326k215j318q98q50q92j026j458
$$ 184834 180138 175388 170994 166679 162102 157423 153174 149848 147633 146315 145417 144567 143675 142649 141191
53983A41191k055k274j794j029q01j575k878l466k468n18P29N68J29P14K018K804
$$ 141191 139136 136862 135068 134039 133238 131663 128785 125319 122851 122333 123062 123630 123759 124473 126491 129295
53967A29295K725K363J932J151L27K01O76Q38M51L33Q96J399J104L19k37l87l67
$$ 129295 132020 134383 136315 137466 137793 137994 138670 139508 139959 140292 141188 142587 143691 144010 143773 143386 143019
53950A43019k27J11N47Q63R39Q26Q37J399K437L220L346L389L933M389L834K645
$$ 143019 142792 142903 143450 144313 145252 146078 146915 148314 150751 153971 157317 160706 164639 169028 172862 175507
53934A75507K076K318K303J516P71P19Q58M67l93j238j767j691p57O27J570J831
$$ 175507 177583 179901 182204 183720 184491 185210 186068 186535 186142 184904 183137 181446 180689 181316 182886 184717
53918A84717K044K605L097L202L269L631M063M290M388M410M278M256M787N589
$$ 184717 186761 189366 192463 195665 198934 202565 206628 210918 215306 219716 223994 228250 233037 238626
53904B38626N784N202M664M638M475L505K040P84Mk83j5M27J68j132k753l837
$$ 238626 244410 249612 254276 258914 263389 266894 268934 269718 269722 269439 269424 269851 270019 268887 266134 262297
53888B62297m310m460m306l889l692m107m885n521n832n931n979o153o404o255
$$ 262297 257987 253527 249221 245332 241640 237533 232648 227127 221295 215364 209385 203232 196828 190573
53874A90573n401m439m229m567m440l635l069l227l461l247l033l217l320k889
$$ 190573 185172 180733 176504 171937 167497 163862 160793 157566 154105 150858 147825 144608 141288 138399
53860A38399k442k664l375l947m153l985l283k167j280j019j017q62p11p61q00
$$ 138399 135957 133293 129918 125971 121818 117833 114550 112383 111103 110084 109067 108205 107494 106733 105933
53845A05933p51r51j380j410q67n77j097j686j330k18O65Q99P63M34j11o42p74
$$ 105933 105182 104231 102851 101441 100574 99997 98900 97214 95884 95666 96331 97230 97993 98427 98316 97674 96900
53828I6900m68lL75M98L66K83N41Q28N45j80n65l94k21j95K25J007J255P75O15
$$ 96900 96432 96429 96804 97302 97668 97951 98492 99320 99865 99685 99120 98726 98505 98310 98535 99542 100797 101572 102187
53809A02187J320J831J277O18J192K520L108K697K280K253K176K124K790M127
$$ 102187 103507 105338 106615 107233 108425 110945 114053 116750 119030 121283 123459 125583 128373 132500
53795A32500N140N287N044M865M569M036L677L752L835L422K684K277K514K947
$$ 132500 137640 142927 147971 152836 157405 161441 165118 168870 172705 176127 178811 181088 183602 186549
53781A86549K812J894R02O97J216J596J349P73R4r32k190k814k301j429j359k230
$$ 186549 189361 191255 192157 192854 194070 195666 197015 197788 197882 196950 194760 191946 189645 188216 186857 184627
53765A84627l214l562l177k510k321l010l912l866k834k013j979j836r42k51p02
$$ 184627 181413 177851 174674 172164 169843 166833 162921 159055 156221 154208 152229 150393 149451 149200 148498
53750A48498j365o82J034J960J337K05m22o65q89q74l31N05J188J420J056K26
$$ 148498 147133 146451 147485 149445 150782 150987 150565 149900 149011 148137 147806 148311 149499 150919 151975 152201
53734A52201n49q57q70r54j044r43q67j079j318j252j157j417j715j501r49o00
$$ 152201 151652 150795 149925 148971 147927 146984 146117 145038 143720 142468 141311 139894 138179 136678 135729 135129
53718A35129m19pM41L64j79o29q76j251j600j289j60J173K039K135J483N73K62
$$ 135129 134710 134703 135144 135508 135329 134700 133824 132573 130973 129684 129524 130697 132736 134871 136354 136927 137189
53701A37189Q35J461J386J233K096L753M885M937M540M123L412K419J823J957
$$ 137189 138024 139485 140871 142104 144200 147953 152838 157775 162315 166438 169850 172269 174092 176049
53687A76049K340K561K777L135L394L442L437L318K888K389K255K217J597N63
$$ 176049 178389 180950 183727 186862 190256 193698 197135 200453 203341 205730 207985 210202 211799 212362
53673B12362M9K95M38k8m92l52Ok4l81p98j397k206k712k555k149j984j853j338
$$ 212362 212411 212706 213144 213116 212624 212272 212278 212254 211873 211075 209678 207472 204760 202205 200056 198072 196219 194881
53655A94881o31j97kK32L06k10j110j593j227m65n0j97m43k09N09J054Q77K62
$$ 194881 194250 194053 194051 194283 194589 194379 193269 191676 190449 189984 189934 189737 189294 189085 189594 190648 191525 191787
53637A91787j9K40M18M9m51l90K18P62Q95Q25P47N34J57M1N98J547K084J851J391
$$ 191787 191768 192008 192426 192475 192024 191634 191852 192614 193509 194334 195081 195615 195772 195813 196411 197958 200042 201893 203284
53618B03284J380J709J771J507J496J999K471K382K018K028K527L095L397L428
$$ 203284 204664 206373 208144 209651 211147 213146 215617 217999 220017 222045 224572 227667 231064 234492
53604B34492L279L090L064L240L374L249K911K548K391K850M128N591O081N283
$$ 234492 237771 240861 243925 247165 250539 253788 256699 259247 261638 264488 268616 274207 280288 285571
53590B85571M139L586L491L383L406L800M086L773L346L590M207M171L285K408
$$ 285571 289710 293296 296787 300170 303576 307376 311462 315235 318581 322171 326378 330549 333834 336242
53576C36242K159K279K335K258K110J917J786J693J318O09K38P86J751K144J790
$$ 336242 338401 340680 343015 345273 347383 349300 351086 352779 354097 354706 354944 355730 357481 359625 361415
53561C61415J269Q56M46K45M87O97L03j68K71J344J723J133P50J189J517R07J4
$$ 361415 362684 363540 363986 364231 364718 365415 365718 365550 365821 367165 368888 370021 370771 371960 373477 374384 374398
53544C74398k33q6k09k91M20J642K244J776R59O63R93J499J731J514J032P03R56
$$ 374398 374165 374079 373870 373579 373999 375641 377885 379661 380620 381283 382276 383775 385506 387020 388052 388755 389711
53527C89711J927L336M555N029M865M816N372O136O459O471O870P809Q765R393
$$ 389711 391638 394974 399529 404558 409423 414239 419611 425747 432206 438677 445547 453356 462121 471514
53513D71514R858J0247J0398J0421J0770J1572J2480J3337J4340J5463J6284J6631
$$ 471514 481372 491619 502017 512438 523208 534780 547260 560597 574937 590400 606684 623315
53501F23315J6851J7270J7923J8873K0169K1472K2342K2987K3937K4949K5163
$$ 623315 640166 657436 675359 694232 714401 735873 758215 781202 805139 830088 855251
53490H55251K4588K4398K5270K6343K6458K5756K5217K5199K5194K4792K4156
$$ 855251 879839 904237 929507 955850 982308 1008064 1033281 1058480 1083674 1108466 1132622
53479A132622K3670K3529K3663K3792K3751K3761K4151K4629K4386K3100K1433
$$ 1132622 1156292 1179821 1203484 1227276 1251027 1274788 1298939 1323568 1347954 1371054 1392487
53468A392487K0284J9896J9939J9976J9584J8435J6611J4597J2757J1083R522
$$ 1392487 1412771 1432667 1452606 1472582 1492166 1510601 1527212 1541809 1554566 1565649 1575171
53457A575171Q143O896N614M334L166J816j48k561m829o955r546j2526j4716j5242
$$ 1575171 1583314 1590210 1595824 1600158 1603324 1605140 1604992 1602431 1597602 1590647 1581101 1568575 1553859 1538617
53443A538617j4677j4297j4719j5789j7236j8770k0016k0879k1728k2724k3427
$$ 1538617 1523940 1509643 1494924 1479135 1461899 1443129 1423113 1402234 1380506 1357782 1334355
53432A334355k3488k3288k3342k3482k3225k2643k2165k1688k0595j8666j6504
$$ 1334355 1310867 1287579 1264237 1240755 1217530 1194887 1172722 1151034 1130439 1111773 1095269
53421A095269j4869j3902j3091j1833j0074q361p195o376n287l827k588j918j308
$$ 1095269 1080400 1066498 1053407 1041574 1031500 1023139 1015944 1009568 1004281 1000454 997866 995948 994640
53408I94640p1J778L730N596P648R990J2238J3937J5094J6183J7557J9020K0145
$$ 994640 994569 996347 1000077 1005673 1013321 1023311 1035549 1049486 1064580 1080763 1098320 1117340 1137485
53395A137485K1008K2185K3872K5536K6832K8327L0561L2914L4385L5282L6933
$$ 1137485 1158493 1180678 1204550 1230086 1256918 1285245 1315806 1348720 1383105 1418387 1455320
53384A455320L9631M2064M3231M3854M5194M7271M9087N0144N0902N1949N3278
$$ 1455320 1494951 1537015 1580246 1624100 1669294 1716565 1765652 1815796 1866698 1918647 1971925
53373A971925N4416N4880N4591N3878N3023N1899N0417M9068M8394M7900M6297
$$ 1971925 2026341 2081221 2135812 2189690 2242713 2294612 2345029 2394097 2442491 2490391 2536688
53362B536688M2989L8635L4093K9542K4948K0617J6781J3272R884O601L147r40
$$ 2536688 2579677 2618312 2652405 2681947 2706895 2727512 2744293 2757565 2767449 2774050 2777197 2776257
53350B776257n466r499j2598j5469j8886k2619k6041k9225l2729l6666m0594m4090
$$ 2776257 2770791 2761292 2748694 2733225 2714339 2691720 2665679 2636454 2603725 2567059 2526465 2482375
53338B482375m7031m9398n1118n1910n1330m9356m6919m5217m4457m3981m3587
$$ 2482375 2435344 2385946 2334828 2282918 2231588 2182232 2135313 2090096 2045639 2001658 1958071
53327A958071m3715m4153m3791m2210m0487l9662l9346l8582l7257l5694l3747
$$ 1958071 1914356 1870203 1826412 1784202 1743715 1704053 1664707 1626125 1588868 1553174 1519427
53316A519427l1235k8747k6862k5087k2542j9452j6967j5734j5427j5494j5624
$$ 1519427 1488192 1459445 1432583 1407496 1384954 1365502 1348535 1332801 1317374 1301880 1286256
53305A286256j5546j5081j4301j3288j1900j0172q520p131n667m032k774k157
$$ 1286256 1270710 1255629 1241328 1228040 1216140 1205968 1197448 1190317 1184650 1180618 1177844 1175687
53293A175687j456j9J656K713L268M032N098O064O989Q185R416J0312J1299J3082
$$ 1175687 1174231 1174212 1175868 1178581 1181849 1185881 1190979 1197043 1204032 1212217 1221633 1231945 1243244 1256326
53279A256326J5387J7302J8733K0405K2446K4060K4751K4818K4501K3625K2404
$$ 1256326 1271713 1289015 1307748 1328153 1350599 1374659 1399410 1424228 1448729 1472354 1494758
53268A494758K1644K1600K1432K0313J8507J6827J5462J3912J1872R714P954O538
$$ 1494758 1516402 1538002 1559434 1579747 1598254 1615081 1630543 1644455 1656327 1666041 1673995 1680533
53256A680533M869K677O36m11q69k197m961p838r413j0215j1858j4572j6898j7952
$$ 1680533 1685402 1688079 1688715 1688304 1687435 1685238 1680277 1672439 1663026 1652811 1640953 1626381 1609483 1591531
53242A591531j8588j9894k1577k2709k3270k3998k5058k5709k5381k4475k3828
$$ 1591531 1572943 1553049 1531472 1508763 1485493 1461495 1436437 1410728 1385347 1360872 1337044
53231A337044k3736k3803k3655k3396k3249k3015k2297k1128k0045j9434j9162
$$ 1337044 1313308 1289505 1265850 1242454 1219205 1196190 1173893 1152765 1132720 1113286 1094124
53220A094124j8915j8528j7885j6974j6147j5945j6394j6822j6542j5302j3215
$$ 1094124 1075209 1056681 1038796 1021822 1005675 989730 973336 956514 939972 924670 911455
53209I11455j0773q962q587r265r866j0165j1052j2799j4322j4812j4917j5395
$$ 911455 900682 891720 883133 873868 864002 853837 842785 829986 815664 800852 785935 770540
53197G70540j5742j5329j4911j5446j6162j5479j3533j2135j2226j2930j3265
$$ 770540 754798 739469 724558 709112 692950 677471 663938 651803 639577 626647 613382
53186F13382j3295j3222j2729j1852j1452j2100j3195j3832j3871j3719j3573
$$ 613382 600087 586865 574136 562284 550832 538732 525537 511705 497834 484115 470542
53175D70542j3364j2996j2316j1224j0081r529r638r718r235q499q087p975p684
$$ 470542 457178 444182 431866 420642 410561 401032 391394 381676 372441 363942 355855 347880 340196
53162C40196p012o288n919n930n995n796n296m647l989l563l748m546n101m481
$$ 340196 333184 326896 320977 315047 309052 303256 297960 293313 289324 285761 282013 277467 272366 267885
53148B67885k977j955k074k564k638k628k936k882j749k49K48l69j005j036p48
$$ 267885 264908 262953 260879 258315 255677 253049 250113 247231 245482 245233 245481 245112 244107 243071 242323
53133B42323l93N3K42j90o76k48Q67J373P95J26K59Q86J341J641K065K452K434
$$ 242323 241930 241983 242225 242035 241359 241111 241978 243351 244146 244272 244531 245417 246758 248399 250464 252916 255350
53116B55350J902R24k97j260j525j358j508k219l112l979m898n545n348m550m205
$$ 255350 257252 258176 257879 256619 255094 253736 252228 250009 246897 242918 238020 232475 227127 222577 218372
53101B18372m715n248m981m207l657l423l148k770k480k227j832j400j250j510
$$ 218372 213657 208409 203428 199221 195564 192141 188993 186223 183743 181516 179684 178284 177034 175524
53087A75524k009k436k594k617k859l311l398k717j730j220j253j239q74l62N4
$$ 175524 173515 171079 168485 165868 163009 159698 156300 153583 151853 150633 149380 148141 147267 146905 146959
53072A46959K04j59r18j249n32N47P47j6p14q37q46r90q51l84k90q70j438j326
$$ 146959 147163 147004 146086 144837 144305 144852 145599 145583 144869 144032 143186 142196 141345 140961 140671 139801 138363 137037
53054A37037p13j02K83K40m71j466j808j111K4Q86J320J299P23j09n45m26k18
$$ 137037 136324 136222 136505 136745 136274 134808 133000 131889 131913 132799 134119 135418 136141 136032 135487 135061 134843
53037A34843j52o8j72r32j943k059j063r5O1o3R9N1o59j350j253p26m67k51M66
$$ 134843 134691 134623 134451 133519 131576 129517 128454 128359 128420 128357 128456 128507 127848 126498 125245 124519 124052 123801 124267
53018A24267J289J363P04J07rJ55L21K75k66j193j761j406n56K2J87K05Pn24r36
$$ 124267 125556 126919 127623 127730 127721 127876 128197 128472 128206 127013 125252 123846 123290 123312 123499 123704 123711 123187 122251
52999A22251o71NK48k66j017j294p77L39J413J815J598J433J655J929K051K333
$$ 122251 121580 121585 121833 121567 120550 119256 118479 118818 120231 122046 123644 125077 126732 128661 130712 133045
52983A33045K777K697J841J101J287J928K162K226K950M182M897M694M119L647
$$ 133045 135822 138519 140360 141461 142748 144676 146838 149064 152014 156196 161093 165787 169906 173553
52969A73553L244K943K849K516J281n88j877j909j395j389j973k361k025j270
$$ 173553 176797 179740 182589 185105 186386 185798 183921 182012 180617 179228 177255 174894 172869 171599
52955A71599q06r52j411j713j767j760j667j332r71j102j710k074j785j279j032
$$ 171599 170793 169841 168430 166717 164950 163190 161523 160191 159220 158118 156408 154334 152549 151270 150238
52940A50238p91j45O22R57Q89P65N19p3o75o78j57J88M0k06j80m3r5k71k30K10
$$ 150238 149447 149302 149924 150881 151770 152535 153054 152981 152306 151628 151471 151659 151699 151493 151313 151270 151175 150904 150674 150884
52920A50884P82R32M42j21K5Q04J236P63n8m19k91j13J6K12L43K83K52L85L73
$$ 150884 151666 152598 153040 152919 152944 153748 154984 155747 155689 155270 154979 154866 154882 155094 155437 155720 155972 156357 156730
52901A56730J11J91J043K033K272J921J805K037J964J447J135J382J708J605J171
$$ 156730 156841 157032 158075 160108 162380 164301 166106 168143 170107 171554 172689 174071 175779 177384 178555
52886A78555P28L50M8n0P4K62M61P75J217J635J897J906J553R33M13J52j36o09
$$ 178555 179283 179633 179681 179631 179705 179967 180428 181203 182420 184055 185952 187858 189411 190344 190757 190909 190773 190164
52868A90164p72j07J007J641J460R81P22P02P80R41J201J577K121K631K600J937
$$ 190164 189392 189285 190292 191933 193393 194374 195096 195798 196578 197519 198720 200297 202418 205049 207649 209586
52852B09586J475K065L238L638K819J870J888K565K708J753L00p25r81q35q64
$$ 209586 211061 213126 216364 220002 222821 224691 226579 229144 231852 233605 233905 233180 232199 231364 230500
52837B30500j332k143l100l952m285l746k599j720j724k311k696k475j876j369
$$ 230500 229168 227025 223925 219973 215688 211942 209343 207623 205899 203588 200892 198417 196541 195172
52823A95172j323j745k140j993j473j301j700k054j914j709j984k519k757k545
$$ 195172 193849 192104 189964 187971 186498 185197 183497 181443 179529 177820 175836 173317 170560 168015
52809A68015j898o73P87J381N21q07j261r08p70j020r73o87j005j905k169j226
$$ 168015 166117 165444 166231 167612 168133 167326 166065 165157 164387 163367 162394 161707 160702 158797 156628 155402
52793A55402j63k06j138j862j884j510j086p26n56o77r67j224j348j261r00m41
$$ 155402 155239 155033 153895 152033 150149 148639 147553 146827 146271 145594 144627 143403 142055 140794 139894 139453
52777A39453k11k72l89m55o20r40j274j571j916k205k160j752j246q00l81j41
$$ 139453 139242 138970 138581 138126 137506 136566 135292 133721 131805 129600 127440 125688 124442 123642 123261 123120
52761A23120l92j102j771j956j660j140o73n24p84j185j362j324j324j401j361
$$ 123120 122728 121626 119855 117899 116239 115099 114426 113902 113118 111933 110571 109247 107923 106522 105161
52746A05161j211j125j085r76r79j386j948j950j092R1P98P00O9n03n14kM75N35
$$ 105161 103950 102825 101740 100764 99785 98399 96451 94501 93409 93500 94298 94998 95067 94564 94050 94048 94523 95058
52728I5058L92L18K3p93j619j609q06j29r8l64n02n65n63k15M76R79R48P68R89
$$ 95058 95450 95768 95791 94998 93379 91770 90964 90835 90737 90373 89871 89306 88743 88528 89004 89983 90931 91699 92688
52709I2688J583K044J913J164K98R8Q81K004K563K509K456K498J970O90m88p89
$$ 92688 94271 96315 98228 99392 99690 99788 100669 102673 105236 107745 110201 112699 114669 115359 114871 114082
52693A14082n94q43j776k764l144k762j932j225j151j683k149j825p06L82M35
$$ 114082 113488 112645 110869 108105 104961 102199 100267 99042 97891 96208 94059 92234 91528 91910 92345
52678I2345q08k452l194k605j539r88r34q23o61q97j367j381q08k43nK19M83L06
$$ 92345 91537 89085 85891 83286 81747 80759 79825 79002 78341 77444 76077 74696 73888 73645 73640 73859 74342 74648
52660G4648l47o63j20O30O39p6p99j169j272j044l16O17J031N64l83j103j288
$$ 74648 74301 73638 73518 74148 74787 74711 73912 72743 71471 70427 70111 70728 71759 72323 71940 70837 69549
52643F9549j215j305j535j396n12P81J734J895J370N43k6K39J357K356K145Q14
$$ 69549 68334 67029 65494 64098 63586 64367 66101 67996 69366 69909 69883 70122 71479 73835 75980 76794
52627G6794m42p43l31P1R3k53p18q04j61P73J119O67J08l0O6J80N41J211J637
$$ 76794 76352 75609 75278 75349 75442 75189 74471 73667 73506 74279 75398 76065 76173 76143 76209 76389 76930 78141 79778
52608G9778J360O71J29j58l33l51j26K77Q49J566J946J349R5n38j8N52L6j027
$$ 79778 81138 81809 81938 81780 81447 81096 80970 81247 82096 83662 85608 86957 87052 86514 86496 87048 87084 86057
52590H6057j272n61K3J3J61J030K049K400K080J571J030L77j46p2O29J379J559
$$ 86057 84785 84224 84247 84260 84421 85451 87500 89900 91980 93551 94581 94958 94812 94740 95369 96748 98307
52573I8307J116N19K72M93J022J671K342K881L052K752K131J473R71O29L51J15
$$ 98307 99423 99942 100214 100707 101729 103400 105742 108623 111675 114427 116558 118031 119002 119631 119982 120097
52557A20097R0M72J113J493J252O19J58J97P18J483K011J763P76j28k56O8K8m73
$$ 120097 120187 120659 121772 123265 124517 125136 125294 125491 126209 127692 129703 131466 132242 132114 131858 131926 131954 131481
52539A31481q11o31j41N25J409K141K047J130K15l3K98Q77J477J643Q82m52j252
$$ 131481 130670 130039 129898 130423 131832 133973 136020 137150 137365 137332 137630 138507 139984 141627 142509 142057 140805
52522A40805j004l99j82j63J01L89K63p7j05K21N50P23P75N86O5n67j047j361
$$ 140805 139801 139402 139220 139057 139158 139547 139810 139733 139628 139849 140399 141122 141897 142483 142548 141981 140934 139573
52504A39573j464j145n04j63m82r93j060p50n75o14m71R2Q68J418J375O96j54
$$ 139573 138109 136964 136460 136297 135815 134822 133762 133012 132437 131823 131352 131444 132312 133730 135105 135801 135647
52487A35647n34l75j60j03K13J082K161K942L207K824J747N72L38J185J886J373
$$ 135647 135113 134738 134578 134475 134688 135770 137931 140873 144080 146904 148651 149223 149561 150746 152632 154005
52471A54005R3p46o95j43N11R40O81k49r43o70kK7m45l85M83J377J759J902J986
$$ 154005 154098 153352 152657 152514 153025 153965 154646 154397 153454 152784 152782 152809 152364 151979 152462 153839 155598 157500 159486
52452A59486J642P61m4j61L20R00J271J390J375J492J889K268K161J540Q65N19
$$ 159486 161128 161889 161845 161684 162004 162904 164175 165565 166940 168432 170321 172589 174750 176290 177155 177674
52436A77674N75R86J554J763J195K17l11j67j46j028k542l606l519k702k185k414
$$ 177674 178249 179235 180789 182552 183747 183964 183653 183486 183340 182312 179770 176164 172645 169943 167758 165344
52420A65344k709k149r30k79q14j610j420l42M26J59p66j660k113j856q41L04
$$ 165344 162635 160486 159556 159277 158463 156853 155433 155091 155517 155676 154910 153250 151137 149281 148440 148744
52404A48744N89k27j267j517q57J11Q35J188J284J283J297J353J435J507J454
$$ 148744 149333 149106 147839 146322 145465 145576 146411 147599 148883 150166 151463 152816 154251 155758 157212
52389A57212J064L46k67k23N78J657K359K290J499M81j50j08M11J076J682J998
$$ 157212 158276 158622 158355 158132 158710 160367 162726 165016 166515 166996 166846 166738 167149 168225 169907 171905
52373A71905J792J270J129J777K679K897K195J239Q08J088J626J833J567J312
$$ 171905 173697 174967 176096 177873 180552 183449 185644 186883 187691 188779 190405 192238 193805 195117
52359A95117J573K091K146J696J608K342L201L387L283L712M393M127K563P96
$$ 195117 196690 198781 200927 202623 204231 206573 209774 213161 216444 220156 224549 228676 231239 232035
52345B32035j4J68P37J410K176K718K568J890J582K285L410L622K469J130J051
$$ 232035 232021 232189 232926 234336 236512 239230 241798 243688 245270 247555 250965 254587 257056 258186 259237
52330B59237K096K799K398J666J448J476J202J038J627K590K984K764K731L135
$$ 259237 261333 264132 266530 268196 269644 271120 272322 273360 274987 277577 280561 283325 286056 289191
52316B89191L316K884K372K498L286M252M914N038M805M838N648O936P788P689
$$ 289191 292507 295391 297763 300261 303547 307799 312713 317751 322556 327394 333042 339978 347766 355455
52302C55455P080O815P261Q023Q502Q686R320J0936J2871J3866J3734J3655J4447
$$ 355455 362535 369350 376611 384634 393136 401822 411142 422078 434949 448815 462549 476204 490651
52289D90651J5430J5615J5224J5119J5362J5391J5255J5565J6386J7193J7780
$$ 490651 506081 521696 536920 552039 567401 582792 598047 613612 629998 647191 664971
52278F64971J8243J8268J7428J6179J5499J5465J5133J4000J2668J1814J1346
$$ 664971 683214 701482 718910 735089 750588 766053 781186 795186 807854 819668 831014
52267H31014J0889J0339R642Q654P509O552N775M821L690K804K288J778J094M38
$$ 831014 841903 852242 861884 870538 878047 884599 890374 895195 898885 901689 903977 905755 906849 907287
52253I07287j42q67j667k114k065j847j701j618j719k130k481k221j446o69K05
$$ 907287 907145 906278 904611 902497 900432 898585 896884 895266 893547 891417 888936 886715 885269 884600 884805
52238H84805J678L511M746N220N897P340Q881R831J0524J1436J2165J2208J2024
$$ 884805 886483 889994 894740 899960 905857 913197 922078 931909 942433 953869 966034 978242 990266
52225I90266J2382J3063J3182J2521J1734J1330J1132J0757J0114R281Q308P231
$$ 990266 1002648 1015711 1028893 1041414 1053148 1064478 1075610 1086367 1096481 1105762 1114070 1121301
52213A121301O102M992M018L268K625J834P63n73k149l869n421o557p427q252
$$ 1121301 1127403 1132395 1136413 1139681 1142306 1144140 1144903 1144330 1142181 1138312 1132891 1126334 1118907 1110655
52199A110655q831q905q851r254r905j0011r484r100r147q840p577n962n015m905
$$ 1110655 1101824 1092919 1084068 1074814 1064909 1054898 1045414 1036314 1027167 1018327 1010750 1004788 999773 994868
52185I94868n053n017m759m400m170m289m567m532m159l983m180m133l406k548
$$ 994868 989815 984798 980039 975639 971469 967180 962613 958081 953922 949939 945759 941626 938220 935672
52171I35672k393k950l574l817l603k895j776p33l40o84j390k064k445k416k116
$$ 935672 933279 930329 926755 922938 919335 916440 914664 913931 913591 912907 911517 909453 907008 904592 902476
52156I02476j888j929k175k639l404m190m416l991l555l604l876l922l817l857
$$ 902476 900588 898659 896484 893845 890441 886251 881835 877844 874289 870685 866809 862887 859070 855213
52142H55213l986m017m084m343m558m446m268m541n301o033o284o114n922o041
$$ 855213 851227 847210 843126 838783 834225 829779 825511 820970 815669 809636 803352 797238 791316 785275
52128G85275o322o172n224l984l366l583l979m052l974l934l727l364l341l735
$$ 785275 778953 772781 767557 763573 760207 756624 752645 748593 744619 740685 736958 733594 730253 726518
52114G26518l732k789j697j607k351k593j585K6J213J764K265L247M621N826O534
$$ 726518 722786 719997 718300 716693 714342 711749 710164 710190 711403 713167 715432 718679 723300 729126 735660
52099G35660P068P947R132J0163J1038J2268J3777J4573J4108J3409J4030J6188
$$ 735660 742728 750675 759807 769970 781008 793276 807053 821626 835734 849143 863173 879361
52087H79361J8671K0381K1212K1512K1491K1380K1527K1903K1932K1180K0023
$$ 879361 898032 918413 939625 961137 982628 1004008 1025535 1047438 1069370 1090550 1110573
52076A110573J9297J9193J8914J7578J5333J3142J1502R933Q030O365N688N620
$$ 1110573 1129870 1149063 1167977 1185555 1200888 1214030 1225532 1235465 1243495 1249860 1255548 1261168
52064A261168N031L511J676O0j378k641l554m371n590o916p450p142p042p660
$$ 1261168 1266199 1269710 1271386 1271446 1270068 1267427 1263873 1259502 1253912 1246996 1239546 1232404 1225362 1217702
$$ [...]
##END NTUPLES=NMR SPECTRUM
##END=
