##TITLE=NES1012_872015020_9232956_eXCmcOgfq0
##JCAMPDX= 6.0         $$ Bruker NMR JCAMP-DX V2.0
##DATA TYPE= NMR SPECTRUM
##DATA CLASS= NTUPLES
##ORIGIN= BRUKER
##OWNER= Administrator
$$ 1.72 TOPSPIN		Version 2.1
$$ 2015-06-17 21:38:35.956 -0700  Administrator@X
$$ Compression mode = diff/dup
##.OBSERVE FREQUENCY= 400.02188249412
##.OBSERVE NUCLEUS= ^1H
##.ACQUISITION MODE= SIMULTANEOUS (DQD)
##.ACQUISITION SCHEME= undefined
##.AVERAGES= 8
##.DIGITISER RES= 22
##SPECTROMETER/DATA SYSTEM= spect
##.PULSE SEQUENCE= zg30
##.SOLVENT NAME= COFFEE_meoh
##.SHIFT REFERENCE= INTERNAL, COFFEE_meoh, 1, 14.98509
##AUDIT TRAIL= $$ (NUMBER, WHEN, WHO, WHERE, PROCESS, VERSION, WHAT)
$$ ##TITLE= Audit trail, TOPSPIN		Version 2.1
$$ ##JCAMPDX= 5.01
$$ ##ORIGIN= Bruker BioSpin GmbH
$$ ##OWNER= Administrator
$$ $$ E:\/data/COFFEE/nmr/NES1012_872015020_9232956_eXCmcOgfq0/10/pdata/1/auditp.txt
$$ ##AUDIT TRAIL=  $$ (NUMBER, WHEN, WHO, WHERE, PROCESS, VERSION, WHAT)
(   1,<2015-06-17 21:38:28.800 -0700>,<Administrator>,<X>,<go>,<TOPSPIN 2.1>,
      <created by zg
	started at 2015-06-17 21:37:22.972 -0700,
	POWCHK enabled, PULCHK disabled,
       configuration hash MD5:
       21 0F 79 D6 B3 7B B4 F6 88 20 88 DB 03 48 BD 9F
       data hash MD5: 64K
       C6 4F 20 6A 3D 2B EC 05 C4 34 DF B7 5D AB 7C 55>)
(   2,<2015-06-17 21:38:31.941 -0700>,<Administrator>,<X>,<proc1d>,<TOPSPIN 2.1>,
      <Start of raw data processing
       efp LB = 0 FT_mod = 6 PKNL = 1 PHC0 = 0 PHC1 = 0 SI = 32K 
       data hash MD5: 32K
       1E 64 D9 32 D3 23 5B B0 CF 0B 66 9C E2 74 7C 36>)
(   3,<2015-06-17 21:38:32.222 -0700>,<Administrator>,<X>,<proc1d>,<TOPSPIN 2.1>,
      <pk PHC0 = 93.04321 PHC1 = 0 
       data hash MD5: 32K
       F9 EC 84 C7 EE 2B 3A 1B D9 8C 63 64 87 73 AE EF>)
(   4,<2015-06-17 21:38:32.331 -0700>,<Administrator>,<X>,<proc1d>,<TOPSPIN 2.1>,
      <abs ABSG = 1 
       data hash MD5: 32K
       2C 09 FA 69 F2 4E 8A 68 C6 3F 96 8F 3F 6A 66 F1>)
(   5,<2015-06-17 21:38:32.394 -0700>,<Administrator>,<X>,<proc1d>,<TOPSPIN 2.1>,
      <abs ABSG = 2 
       data hash MD5: 32K
       E1 FA AE FB B5 B5 B3 B4 E2 BD 85 70 88 5E 9C D3>)
(   6,<2015-06-17 21:38:32.456 -0700>,<Administrator>,<X>,<proc1d>,<TOPSPIN 2.1>,
      <abs ABSG = 3 
       data hash MD5: 32K
       63 1B C1 D2 68 C1 54 B3 B4 56 2B 0C D4 CA F3 16>)
(   7,<2015-06-17 21:38:32.534 -0700>,<Administrator>,<X>,<proc1d>,<TOPSPIN 2.1>,
      <abs ABSG = 4 
       data hash MD5: 32K
       2B D0 80 8D E9 27 A9 75 29 45 E7 C9 BC 64 AC DC>)
(   8,<2015-06-17 21:38:32.612 -0700>,<Administrator>,<X>,<proc1d>,<TOPSPIN 2.1>,
      <abs ABSG = 5 
       data hash MD5: 32K
       02 83 B6 2B 32 B8 56 96 68 91 6A 65 14 5F 26 72>)
$$ ##END=
$$ 
$$ $$ hash MD5
$$ $$ 31 C6 60 8F 0E F2 38 B0 50 77 6B 1B 28 52 85 47
##$RELAX= 
##$RELAX= 
##$RELAX= 
##$RELAX= 
##$RELAX= 
##$RELAX= 
##$RELAX= 
$$ Bruker specific parameters
$$ --------------------------
##$DU= <E:\>
##$EXPNO= 10
##$NAME= <NES1012_872015020_9232956_eXCmcOgfq0>
$$ [...]
150 150 150 150 150 150 150 150
##$TP07= 0
##$TPNAME0= <>
##$TPNAME1= <>
##$TPNAME2= <>
##$TPNAME3= <>
##$TPNAME4= <>
##$TPNAME5= <>
##$TPNAME6= <>
##$TPNAME7= <>
##$TPOAL= (0..7)
0.5 0.5 0.5 0.5 0.5 0.5 0.5 0.5
##$TPOFFS= (0..7)
0 0 0 0 0 0 0 0
##$TUNHIN= 0
##$TUNHOUT= 0
##$TUNXOUT= 0
##$USERA1= <user>
##$USERA2= <user>
##$USERA3= <user>
##$USERA4= <user>
##$USERA5= <user>
##$V9= 5
##$VALIST= <valist>
##$VCLIST= <CCCCCCCCCCCCCCC>
##$VD= 0
##$VDLIST= <DDDDDDDDDDDDDDD>
##$VPLIST= <PPPPPPPPPPPPPPP>
##$VTLIST= <TTTTTTTTTTTTTTT>
##$WBST= 2048
##$WBSW= 25
##$XGAIN= (0..3)
0 0 0 0
##$XL= 0
##$YL= 0
##$YMAX_a= 628286
##$YMIN_a= -528138
##$ZGOPTNS= <>
##$ZL1= 120
##$ZL2= 120
##$ZL3= 120
##$ZL4= 120
##$ABSF1= 14.98509
##$ABSF2= -5.573092
##$ABSG= 5
##$ABSL= 3
##$ALPHA= 0
##$AQORDER= 0
##$ASSFAC= 0
##$ASSFACI= 0
##$ASSFACX= 0
##$ASSWID= 0
##$AUNMP= <proc_prof1d_extract_pilot.lims>
##$AXLEFT= 0
##$AXNAME= <>
##$AXNUC= <1H>
##$AXRIGHT= 0
##$AXTYPE= 0
##$AXUNIT= <>
##$AZFE= 0.1
##$AZFW= 0.1
##$BCFW= 0
##$BC_mod= 0
##$BYTORDP= 0
##$COROFFS= 0
##$CY= 15
##$DATMOD= 1
##$DC= 0
##$DFILT= <>
##$DTYPP= 0
##$F1P= 0
##$F2P= 0
##$FCOR= 0.5
##$FTSIZE= 32768
##$FT_mod= 6
##$GAMMA= 0
##$GB= 0
##$INTBC= 1
##$INTSCL= 1
##$ISEN= 128
##$LB= 0
##$LEV0= 0
##$LPBIN= 0
##$MAXI= 10000
##$MC2= 0
##$MEAN= 0
##$ME_mod= 0
##$MI= 0
##$NCOEF= 0
##$NC_proc= -8
##$NLEV= 6
##$NOISF1= 0
##$NOISF2= 0
##$NSP= 0
##$NTH_PI= 0
##$NZP= 0
##$OFFSET= 14.98509
##$PC= 1
##$PHC0= 93.04321
##$PHC1= 0
##$PH_mod= 1
##$PKNL= yes
##$PPARMOD= 0
##$PPDIAG= 0
##$PPIPTYP= 0
##$PPMPNUM= 2147483647
##$PPRESOL= 1
##$PSCAL= 4
##$PSIGN= 0
##$PYNMP= <proc.py>
##$REVERSE= no
##$SF= 400.02
##$SI= 32768
##$SIGF1= 0
##$SIGF2= 0
##$SINO= 400
##$SIOLD= 32768
##$SPECTYP= <>
##$SREGLST= <1H.CDCl3>
##$SSB= 0
##$STSI= 32768
##$STSR= 0
##$SW_p= 8223.68421052631
##$SYMM= 0
##$S_DEV= 0
##$TDeff= 65536
##$TDoff= 0
##$TI= <>
##$TILT= no
##$TM1= 0
##$TM2= 0
##$TOPLEV= 0
##$USERP1= <user>
##$USERP2= <user>
##$USERP3= <user>
##$USERP4= <user>
##$USERP5= <user>
##$WDW= 1
##$XDIM= 32768
##$YMAX_p= 434635421
##$YMIN_p= -674004
##$CURPLOT= <Network HP LaserJet P1505>
##$CURPRIN= <$Network HP LaserJet P1505>
##$DFORMAT= <normdp>
##$LAYOUT= <+/1D_H.xwp>
##$LFORMAT= <normlp>
##$PFORMAT= <normpl>
##$SURQMSG= 1
$$ End of Bruker specific parameters
$$ ---------------------------------
##NTUPLES= NMR SPECTRUM
##VAR_NAME=  FREQUENCY,     SPECTRUM/REAL,   SPECTRUM/IMAG
##SYMBOL=    X,             R,               I
##VAR_TYPE=  INDEPENDENT,   DEPENDENT,       DEPENDENT
##VAR_FORM=  AFFN,          ASDF,            ASDF
##VAR_DIM=   32768,         32768,           32768
##UNITS=     HZ,            ARBITRARY UNITS, ARBITRARY UNITS
##FACTOR=    0.250966925370066, 1,           1
##FIRST=     8223.43324360094, -37021,       86495
##LAST=      0,             9222,            -146075
##MIN=       0,             -674004,         0
##MAX=       8223.43324360094, 434635421,    0
$$ Real data points
##PAGE= N=1
##DATA TABLE= (X++(R..R)), XYDATA
$$ [...]
19499g5932j64694c6730j92454A13685b06067R0269n1077B1699i2344j12989M1671
19488a63662A55468c4501l9230A19213b67180f064j20287F5403A6692b57762A47580
19476B1271e5111a8042F132a70597A55543a14782b0067E2462b12281j70346D0128
19464a66077E3287L5225B9102K7110c89791a9479A23759a06401F7935J24615a44612
19452a62989A90324f7517l2972B56828D9063A0972a03901d2145j38315M2004j42107
19441b80563J835B64590e4563A11959N5006f1111a3019A85002E5150a19358j56060
19430b75418C60390A53914K03944c48602P6958A14778L3899l4858g5488j69303
19420b44791f1540m5836j30175A5260b23127R8286j59967h8543A06228J8536B6644
$$ y = [-75932, -240626, -36730, -229184, 113685, -206067, -115798, -166875, 21699, -92344, -205333, -163662, 155468, -34501, -73731, 119213, -267180, -6064, -126351, 65403, 16692, -257762, 147580, 21271, -55111, -18042, 6132, -170597, 155543, -114782, -20067, 52462, -212281, -382627, 40128, -166077, 53287, 88512, 29102, 56212, -389791, -19479, 123759, -106401, 67935, 192550, -144612, -162989, 190324, -67517, -100489, 256828, 49063, 10972, -103901, -42145, -180460, -138456, -280563, -278728, 264590, -54563, 111959, 166965, -61111, -13019, 185002, 55150, -119358, -275418, 360390, 153914, 357858, -348602, -271644, 114778, 148677, 113819, -75488, -244791, -61540, -107376, -237551, 15260, -223127, -124841, -284808, -88543, 106228, 124764, 26644]
19408a33919j24834c9661j97838J08968R651D8205a91061A21166a5785A34340
19397b98291J19957F0803b06811D6812i440j56391A41123E7764a87035P2915B31972
19385E2807b4022k63993A0715d185m6498A20639A2261i6469F6221K64622e5057
19373a48475k6949c673k54535R2609j5567O3564n6963E1822K1665a05390C8500
19361b35690r2620D4889a58882j06923a05619k04444C4338a42663B61836a75809
19350g5938B17957d4792j11186e1295r575k6929G8201a9896p5324A3549f9518
19338G034i6070d3894j13182C8824b46001B30628b5070J62j81970J347p4373C2660
19325c83227C382a76035E418J22468E1168Q7006J30670a24531K4365A44545l3563
$$ y = [-133919, -258753, -39661, -237499, -128531, -118880, 48205, -191061, 121166, -15785, 134340, -298291, -178334, 60803, -206811, 46812, -9440, -165831, 141123, 57764, -187035, -114120, 231972, 52807, -24022, -288015, 10715, -4185, -50683, 120639, 12261, -96469, 66221, 330843, -55057, -148475, -175424, -3673, -258208, -165599, -181166, -117602, -174565, 51822, 73487, -105390, 38500, -235690, -328310, 44889, -158882, -265805, -105619, -310063, 34338, -142663, 261836, -175809, -75938, 217957, -44792, -155978, -51295, -60870, -87799, 78201, -19896, -95220, 13549, -69518, 7034, -96070, -43894, -157076, 38824, -246001, 230628, -25070, -24908, -206878, -205531, -279904, 32660, -383227, 3382, -176035, 5418, 127886, 51168, 138174, 268844, -124531, -100166, 144545, 110982]
19314A10982l7648c47403J65121D6728b4071j8445k58331A85322c23298A19102
19303a0747A28893A3743K05234c4921k80794B07987p8918a05234A31436c6936
19292b7904n19307B07951g756r851j40091k15254J14069f6544I9097D6359a48448
19280E8231P258e1465j29662E2200b0522r6729j1102a2210j26580K3141K4415
19269i1234I0997d7091k26123J4630P1789k87864b17946B14290b33880n843h2435
19257f2870D3142d72370m4907b5171j32188A1050b12147k41508A20977g2753m6480
19246a19233I003b5583j58104b5163I4674g0081F4710b94143a30173a0139A87743
19234a61456B15245c00299h9664A50932c13782a08774p6655b8653F1909O7604
$$ y = [110982, 73334, -347403, -182282, 46728, -24071, -42516, -300847, 185322, -323298, 119102, -10747, 128893, 13743, 218977, -34921, -315715, 207987, 129069, -105234, 131436, -36936, -27904, -547211, 207951, -7756, -17607, -157698, -372952, -258883, -66544, 99097, 46359, -148448, 58231, 65489, -51465, -181127, 52200, -20522, -117251, -128353, -12210, -138790, -115649, -91234, 90997, -47091, -273214, -258584, -186795, -474659, -217946, 214290, -233880, -239723, -82435, -62870, 43142, -472370, -517277, -25171, -157359, 11050, -212147, -453655, 120977, -72753, -119233, 9003, -25583, -183687, -25163, 94674, -70081, 64710, -294143, -130173, -10139, 187743, -161456, 215245, -300299, -89664, 150932, -313782, -108774, -185429, -28653, 61909, 129513]
19224A29513a04147b7610I1838c92142B0350g4499C7978k487g5632b6955j46326
19213a73281a1734k72857D52926q3493b94377C02183c12004E0551a40330O0802
19203g9528A46740B1766R305a07397j53544H6185c2898P910A04403a40399M2249
19192i8150B8190J41092c71276a27224K0219N0783B11627a01567j39081A40104
19181a44869K7694j54322A01147d00328J31763A56332b53903N939K7487G0843
19170a59689A58523o5169a86095K6756q6816D14150A3661d02125a90223O3019
19160a27204A21306a31389A19014b19345D8323O9919h326I399b78072C5740a3775
19148A63520a88899l2323B3201c04735J43996e3464j76884B27923D1193a76967
$$ y = [129513, -104147, -27610, 91838, -392142, 20350, -74499, 37978, 35491, -75632, -26955, -173281, -11734, -284591, 452926, 369433, -294377, 302183, -312004, 50551, -140330, -79528, 146740, 21766, 31071, -107397, -260941, 86185, -32898, -24988, 104403, -140399, -98150, 28190, 169282, -371276, -127224, -107005, -56222, 211627, -101567, -240648, 140104, -144869, -117175, -271497, 101147, -400328, -268565, 156332, -253903, -247964, -220477, 70843, -159689, 158523, 93354, -186095, -159339, -246155, 414150, 13661, -402125, -190223, -127204, 121306, -131389, 119014, -219345, 48323, 118242, -8326, 9399, -278072, 35740, -13775, 163520, -188899, -221222, 23201, -304735, -160739, -53464, -230348, 227923, 41193, -176967]
19137f0222l23740a19915r3881M7185g8224b8045k79833C2214h3631A45042l0433
19126A14609L05450b14958a7550j33549l9967A68464c13695B6456h4462j7411
19116a01873F5825a20459j20040j27723c2531D9753B0344i8948q7714C2844b25520
19104a01719A5851J20899P6119I3217J18978b0460G2351d4751m08660j2425a44383
19092d05540A7812c1300j57168O7764A5138J87893j00854a77915j10846A80932
19081B02618G8236C6711J30976e1765J9973D347R4457K9426j2273m1649a29032
19069b65541a4541m12075J28159A83002o3903R6109h1394k4611j3930n4651a0720
19057c03299O8810O9579d1821j33946c5066j53148A43819c22420E0852a08674
$$ y = [-60222, -383962, -119915, -213796, -166611, -78224, -28045, -307878, 32214, -83631, 145042, 114609, 420059, -214958, -17550, -151099, -191066, 168464, -313695, 26456, -84462, -101873, 65825, -120459, -240499, -368222, -32531, 49753, 20344, -98948, -186662, 32844, -225520, -101719, 15851, 136750, 212869, 93217, 212195, -20460, 72351, -44751, -453411, -465836, -144383, -405540, 17812, -31300, -188468, -120704, 15138, 203031, 102177, -177915, -288761, 180932, 202618, 78236, 36711, 167687, -51765, -31792, 4347, 98804, 128230, 115957, 74308, -129032, -265541, -14541, -426616, -298457, 183002, 119099, 215208, -81394, -106005, -119935, -174586, -10720, -303299, -234489, -164910, -41821, -175767, -35066, -188214, 143819, -322420, 50852, -108674]
19046c0823p5140m4958O2373i582k1561H2089f6311j2595K0181a8672k3287l5799
19034g7758A19501a72059k1814b6409I6309c451A92377a6025k94979A91547B5874
19022E5957a18638N4116j7080A67481a20397A0070R3654d52396a80851e9622J5052
19011d4570m5843c7950C92311A274i5861A8491J23034C1181K45958d26049a90316
18999G8485J28377C2599J20404h7566d867F7398d3855G6887L3808b05385C89739
18987a5646k08139A88798a02385m2077l06871K24221P1918O7251L9816R810l02505
18976c40822g2671o1267K3146B7870c34905J6231b5911C55458j70715h254I5094
18964G9112h91E3140a85227C15386i2796B47081F8486a90602Q9314A42959b14975
$$ y = [-30823, -105963, -150921, -88548, -9582, -31143, 82089, -66311, -78906, -58725, -18672, -41959, -77758, 119501, -172059, -193873, -26409, 96309, -3451, 192377, -16025, -311004, 191547, 25874, 55957, -118638, -64522, -81602, 167481, -120397, 10070, 103724, -452396, -180851, -59622, -44570, -90413, -37950, 392311, 1274, -95861, 18491, 141525, 31181, 277139, -426049, -190316, 78485, 206862, 32599, 153003, -87566, -4867, 67398, -43855, 76887, 110695, -205385, 389739, -15646, -223785, 188798, -102385, -144462, -451333, -227112, -155194, -87943, -48127, -38317, -340822, -72671, -133938, -110792, 27870, -334905, -318674, -25911, 355458, 184743, -8254, 95094, 79112, -891, 53140, -185227, 315386, -92796, 247081, 68486, -190602, -101288, 142959, -214975]
18952A82050o8425b56712B5832e4163o251j24878l8098M6866P7119A46002b88174
18940e4297A70363i4917K2007K6426B800c84963J70976H4793L3525f511j97714
18929b04225L7942e7131B52671a87311D99069e7494A21175c45527F0426a39450
18918b01162L2317A24187P1440a48240j53288M2280i2865c067j57929j00065a9993
18906b05627B4553e8319h467r0588E88119A02991B4800J10637d39033A30380e3710
18894h6243n8799O9054m21931a61237H5813h9658b5882l898A10528g5764k03764
18883b79528J6221H8146a92136j20722A36770C937J59446a16026a89j71402j41094
18872c12685E0586g0577o9605B06384n4845a46655H0710J13J16502a78825C2702
$$ y = [182050, 113625, -256712, 25832, -54163, -60414, -185292, -223390, -176524, -99405, 146002, -288174, -54297, 170363, -94917, -72910, -46484, 2800, -384963, -213987, 84793, 118318, -6511, -204225, -166283, -57131, 252671, -187311, 499069, -57494, 121175, -345527, 60426, -139450, -201162, -168845, 124187, 195627, -148240, -301528, -259248, -92865, -3067, -160996, -261061, -19993, -205627, 24553, -58319, -8467, -99055, 588119, 102991, 24800, 135437, -439033, 130380, -53710, -86243, -145042, -75988, -497919, -161237, 85813, -89658, -25882, -29780, 110528, -75764, -279528, -263307, 88146, -192136, -312858, 136770, 3937, 163383, -116026, -189, -171591, -312685, 50586, -70577, -140182, 206384, 151539, -146655, 80710, 80823, 197325, -178825, 32702]
18860b39450O5841A67437k5868D3680N1723d6881C2010M9873L9651a9000A6295
18848a1364G2094f507I3998l0881i8071l0803B45148j10594b82092M5751E7871
18836A54573C247a05259A14630a2924l71748C233a45047B18341a19190j45905
18826b65095A08733a38892C45027b02726n3595e6027j3406B898L14094d6266k97788
18815c44054G0038b04890B82216b3773G7145i9488k8310L9830A89697L35799A45573
18803a35307a6046C36640a05308A2144g1466D4111h9439K6581j79237n8072a08186
18791A82368J1623e85324a74883C8169f215B6704a14949b1132l36602B06446D3476
18779B46349a54786M8517B54264D8689A8252a18288G7008L16638b43650j30072
$$ y = [-239450, -173609, 167437, 141569, 43680, 95403, -46881, 32010, 81883, 121534, -19000, 16295, -11364, 72094, -6507, 93998, 63117, -98071, -128874, 245148, 134554, -282092, -236341, 57871, 154573, 3247, -105259, 114630, -12924, -384672, 3233, -145047, 218341, -119190, -265095, 108733, -138892, 345027, -202726, -256321, -56027, -69433, 2898, 316992, -46266, -344054, 70038, -204890, 282216, -23773, 77145, -99488, -127798, -87968, 189697, 525496, 145573, -135307, -16046, 336640, -105308, 12144, -71466, 44111, -89439, -62858, -242095, -300167, -108186, 182368, 193991, -585324, -174883, 38169, -6215, 26704, -114949, -21132, -357734, 206446, 43476, 246349, -154786, -106269, 254264, 48689, 18252, -118288, 77008, 393646, -243650, -373722]
18769c73722D5018i5111O882k4056a0429j50326A19618A5328f1653B03275b80098
18757b25019N2966a0376c804B82428F6896P4149L803h0355A03341a05015B6434
18745a39521A45972O583a59094K1541M4728A53285B2886e015A41529P3073c45072
18733e1283F3274P0876i8180A31411c09612c397j09096n7360q7965E2621K63430
18722C16051a03880k7573C19753a36695A68784a66716k9623K7643A42187a25921
18711a7533H9607c46709K6289A86722b84535e8976C52673b24144a03614C182a57877
18699E3072b61140A53147C1261a83421O7762p4703E8095B0832L17470I0961b61574
18687b00394e0364j24711A20624B6155b34300A92169a01395k62246f981k27786
$$ y = [-373722, 45018, -95111, -88229, -112285, -10429, -160755, 119618, 15328, -61653, 203275, -280098, -225019, -172053, -10376, -3804, 282428, 66896, 141045, 144848, -80355, 103341, -105015, 26434, -139521, 145972, 152555, -159094, -137553, -92825, 153285, 22886, -5015, 141529, 214602, -345072, -51283, 63274, 134150, -98180, 131411, -309612, -3397, -112493, -169853, -257818, 52621, 316051, -103880, -131453, 319753, -136695, 168784, -166716, -196339, -168696, 142187, -125921, -17533, 89607, -346709, -320420, 186722, -284535, -58976, 352673, -224144, -103614, 3182, -157877, 53072, -261140, 153147, 31261, -183421, -115659, -190362, 58095, 20832, 338302, 90961, -261574, -200394, -50364, -175075, 120624, 26155, -234300, 192169, -101395, -363641, -6981, -234767]
18677b34767b4169j59267a7059p2082A03635D7477a04836F517c5348l1501A40568
18665h1676k3832a1835p3953q3143G99543B13566i4334C3794j2440h5189l12349
18654c97538a65949B97134D5447b1651H5489b73299d1833a3769j83552b8695q0643
18643a09338r6147A54110O1065f7236n4053N0565E31300D3240a88088C79933b32351
18631d20820a02747j00730j00765g1276A23224p744f0462k4126d956m71247d0597
18619a715B44107d1633I0970c476B48398e6975K6384A35239C7817d0154A05353
18607b10232b5497k08032A14453b59694D3689b14742N0946K9232B5574d1085k35503
18596b76588f7700C53420A8602b19926D911L2738b60426K5353a3735k9281l30967
$$ y = [-234767, -24169, -183436, -17059, -89141, 103635, 47477, -104836, 6517, -35348, -66849, 140568, -81676, -105508, -11835, -85788, -168931, 799543, 213566, -94334, 33794, 21354, -85189, -397538, -165949, 297134, 45447, -21651, 85489, -273299, -41833, -13769, -197321, -28695, -109338, -205485, 154110, 215175, -67236, -121289, -70724, 531300, 43240, -188088, 379933, -232351, -420820, -102747, -203477, -304242, -71276, 123224, 115480, -60462, -84588, -4956, -476203, -40597, -1715, 244107, -41633, 90970, -3476, 248398, -56975, -30591, 135239, 37817, -40154, 105353, -210232, -25497, -233529, 114453, -259694, 43689, -214742, -163796, -134564, 25574, -41085, -276588, -67700, 353420, 18602, -219926, 4911, 37649, -260426, -235073, -13735, -43016, -373983]
18585c73983a13654G6983a2275G0806k6624b12103e6158k9940B55728F499i9777
18573g0212J4489A62538a42981j3932e1716o5642c8534H1571a61471D0392a07757
18561a04319c0424k05514A34850m7958a06599P365N389A40755C7034a20521k5845
18550a46366m4819g3085G0457D656i081k40775B85127d3251k75993J03412A452
18538a18669A16712A5229c16351F6842a02799b888A7560b60787G7376R5833d7158
18526f2789H7884a54215q7990P8287J6655K0544r3362A67558b6152l87353A75000
18514b29615n2812e6107j30864L8799A52371a66432k06567a15961r2695I4685
18503C82752D130K6880g1162A38628l3187a55443g4688L2838A76985b88612J35444
$$ y = [-373983, -113654, 76983, -12275, 70806, 44182, -212103, -56158, -86098, 255728, 6499, -99777, -70212, -55723, 162538, -142981, -156913, -51716, -117358, -38534, 81571, -161471, 40392, -107757, -104319, -30424, -235938, 134850, 86892, -106599, -99234, -93845, 140755, 37034, -120521, -146366, -191185, -73085, 70457, 4656, -9081, -249856, 285127, -43251, -319244, -215832, 1452, -118669, 116712, 15229, -316351, 66842, -102799, -2888, 17560, -260787, 77376, 173209, -47158, -62789, 87884, -154215, -242205, -163918, -147263, -126719, -220081, 167558, -26152, -413505, 175000, -229615, -282427, -56107, -186971, -148172, 152371, -166432, -372999, -115961, -208656, 94685, 382752, 4130, 31010, -71162, 138628, 105441, -155443, -74688, -41850, 176985, -288612, -153168]
18492a53168M2852A74311a75125A98887k1045A4359h0442k89022E3890k1928c22200
18480a6110o243k9j06324c0405D7944P809c3426C28287c61396A72849h4291k70182
18468c54473a02736I4583b75491E3670b11800M5028M2901K0351A93295F9950b06341
18456a67893b6704l10318J32121J005G91J36319b21643B30242b2107B62864e6974
18444E3426a81446n4151D5608a71991k00728g7125B6800J20938M1179a41730L3948
18433a07782E0983a13746H9967a73352D9103d6358l9700k72324B7802a58742E2386
18421h9343p3644A82402N6456b46975F3956a09925B0944J35418D3191J12056A0145
18409B0695J34509A3097Q4515a61586n8371q9387A42042L8194c34341A53426a85824
$$ y = [-153168, -110316, 174311, -175125, 198887, 177842, 14359, -80442, -369464, 53890, 31962, -322200, -16110, -22353, -22382, -128706, -30405, 47944, 55753, -33426, 328287, -361396, 172849, -84291, -354473, -102736, 94583, -275491, 53670, -211800, -166772, -123871, -103520, 193295, 69950, -206341, -167893, -26704, -337022, -204901, -203896, 791, 137110, -221643, 230242, -22107, 262864, -56974, 53426, -181446, -235597, 45608, -171991, -372719, -77125, 26800, 147738, 188917, -141730, -107782, 50983, -113746, 89967, -173352, 49103, -46358, -86058, -358382, 27802, -158742, 52386, -89343, -162987, 182402, 238858, -246975, 63956, -109925, 20944, 156362, 43191, 155247, 10145, 20695, 155204, 13097, 97612, -161586, -219957, -309344, 142042, 180236, -334341, 153426, -185824]
18397A81775A1070a21893o3259c5552j3884n704A31201L40764e3209l8199k10663
18386c02071A92496n5168J82498A2999b3304F7147M5810c4023E4274b64803o1040
18375c25843A64726c33015A3005J75933B1177h3623l46583C2038J28359a62182
18364a18128M1350j27133k17973D2716d28658J38224B927L9435h8272E4390O4376
18353A18766k5085l7486q457M6143p334b72296I9734g7526a7391I7737K12482
18342C10219c2922A5879P2481L05436F7154a03855o7777C2981A283J38141c45847
18330a01308A33634l8484c4596A41755b82419f5899A79183a95019F933c973k19046
18319b23019g7622D2493c9739E2307J61178d6571r0976j40831a16092m5882H4753
$$ y = [181775, 11070, -121893, -185152, -35552, -49436, -55140, 131201, 471965, -53209, -91408, -302071, 192496, 137328, 319826, 12999, -23304, 67147, 112957, -34023, 54274, -264803, -325843, 164726, -333015, 13005, 188938, 21177, -83623, -430206, 32038, 160397, -162182, -118128, -76778, -203911, -421884, 42716, -428658, -290434, 2927, 42362, -88272, 54390, 118766, 93681, 56195, 47738, 93881, 86547, -272296, 99734, -77526, -17391, 97737, 310219, -32922, 15879, 88360, 393796, 67154, -103855, -171632, 32981, 1283, 139424, -345847, -101308, 133634, 95150, -34596, 141755, -282419, -65899, 179183, -195019, 6933, -3973, -223019, -77622, 42493, -39739, 52307, 213485, -46571, -137547, -278378, -116092, -161974, 84753]
18307I0358m586j3638J40236h6108G1006J06529B2549b7760A49971J84378e3873
18295A12843C8029b27840a12304l6942M6760b2569j91449q842B32995e09512A3339
18283C78202j4691L497a08474K3354n5407B49802b5508A28201a68981l9217d0140
18271B06908b33410A14075a71059A25346E1769a05452l6846B33432c64333d3700
18260a27450G6685J65725g6094C2555a7171A29587b81799B12637f312j1828k4161
18249d2301J9036C0093A2516a30651C2952R078K5319J59572a26281B2735N6088
18238G8823a06788D3954Q3593a16460A80804e0148J890D7208K41523b06961H0503
18226a32206A64765a7074q7491h431D3099a58552c4653j8375l43393i9514C03648
$$ y = [90358, 85772, 72134, 212370, -86108, 71006, 177535, 22549, -27760, 149971, 334349, -53873, 112843, 38029, -227840, -112304, -149246, -102486, -22569, -214018, -222860, 232995, -509512, 13339, 378202, 363511, 367008, -108474, -85120, -140527, 249802, -25508, 128201, -168981, -208198, -40140, 206908, -233410, 114075, -171059, 125346, 51769, -105452, -142298, 233432, -364333, -43700, -127450, 76685, 242410, -76094, 32555, -17171, 129587, -281799, 212637, -6312, -18140, -42301, -23265, 30093, 12516, -130651, 32952, 42030, 67349, 226921, -126281, 22735, 78823, -106788, 43954, 127547, -116460, 180804, -50148, -48258, 47208, 288731, -206961, 80503, -132206, 164765, -17074, -104565, -8431, 43099, -158552, -34653, -53028, -396421, -99514, 303648]
18214A11834i6154k40772A18430C6241a2268j51781B3966a82451M5013N1099p7782
18203a64121P9483A95020o0652n6045b5931l35203k6415a1575j21286f0160n6332
18192a16492H3123d04596I3122b13879B52245A18151M7917a20979j15236J08559
18182a27656J3964A6023O9758i6662C56301e2962P340a5986k4042k2925A38089
18170c44553J33387i5B17545a16550j39321B34726b36195M2271d1023A57641D6485
18158b13613J00059J4917K3205j07438A17682J86374B3562c61400b4535k97248
18148c21783b7149C24674A30179L0197e4557B6419a8923j28094C34824b17013
18137e1538k31078a20753e7923j39030G6996L534P0343c59208N2803k7062a09039
$$ y = [111834, -96154, -336926, 118430, 36241, -12268, -164049, 23966, -182451, -137438, -86339, -164121, -84638, 195020, 134368, 78323, -25931, -361134, -387549, -11575, -132861, -60160, -116492, 83123, -404596, 93122, -213879, 252245, 118151, 166068, -120979, -236215, -127656, -113692, 16023, 85781, -96662, 356301, -52962, -45622, -15986, -40028, -62953, 138089, -344553, -211166, -95, 217545, -116550, -255871, 234726, -236195, -193924, -41023, 157641, 46485, -213613, -113554, -98637, -75432, -182870, 117682, 304056, 23562, -361400, -24535, -321783, -27149, 324674, 130179, 160376, -54557, 26419, -18923, -147017, 334824, -217013, -51538, -282616, -120753, -57923, -196953, 76996, 80530, 150873, -359208, -306405, -333467, -109039]
18125I1888b51783C4808J19710i4997B4968c74254a14052g863C52661i2031A99848
18113a7821j61728K5422b1894j69108I0647a48086A67335h2755A96699c01613
18102a22208I0622J97115b74082J08988O8128I1755Q8654g7732p139B52452E0476
18090E6670a96942g121r5856H1190M0249b25573A23295J53954A32376a46065O2024
18079h4041G4536b34902f1351b1147p8311L3016j04218B75915F6000J09875J5103
18068A90978b67825f8507D2551K37655F6075b47290I513K26697a29636c3886k7707
18057f1593A33826h5329k46857H3712a33167A57425G7760b20994d602j75969P8585
18046a01986j94853c6809G5558h4765k05538a33208d1972A48309h2769C6487c1897
$$ y = [91888, -251783, 34808, 154518, -94997, 24968, -374254, -114052, -7863, 352661, -92031, 199848, -17821, -179549, -154127, -21894, -191002, 90647, -148086, 167335, -82755, 196699, -301613, -122208, 90622, 287737, -274082, -165094, -96966, 91755, 180409, -77732, -84871, 252452, 50476, 56670, -196942, -7121, -102977, 81190, 121439, -225573, 123295, 277249, 132376, -146065, -84041, 74536, -234902, -61351, -21147, -99458, -66442, -170660, 275915, 66000, 175875, 190978, -267825, -68507, 42551, 280206, 66075, -247290, 9513, 236210, -129636, -33886, -61593, 133826, -85329, -332186, 83712, -133167, 157425, 77760, -220994, -4602, -180571, -101986, -296839, -36809, 75558, -84765, -290303, -133208, -41972, 148309, -82769, 36487, -31897]
18034a90295I1772A4448J0290I826J01099b09415D4804L3571K26641A13849a41879
18022i1706F3710L9444a26814B48049a36241M7496b0922p9706A74059a65784B42341
18010D7499c15412a12541H4508l3435a61864a1558l1488D636J25913J21211f099
17998C26292A59290D1827d9339C74947j59921a9819I7225i362A88509R14o5137
17987A24286l8231B0062J18621a21472q7991I1436a53403f6219J6612j4448C01809
17975A84783a15538D1435c89648H1499a26783E8020c42517A21033K8643J0287
17965A59963J54181f2168H3419a39102o0378I2813k766O8120J05026m3965a961
17953a89222C65169i9986n0638B308g6807c1904a0978k73194B18219d1286m03900
$$ y = [-190295, 91772, 14448, 24738, 9826, 110925, -209415, 44804, 78375, 305016, 113849, -141879, -91706, 63710, 103154, -126814, 248049, -136241, -88745, -20922, -100628, 174059, -165784, 242341, 47499, -315412, -112541, 84508, 51073, -161864, -11558, -43046, 4636, 130549, 251760, -6099, 326292, 159290, 41827, -49339, 374947, 215026, -19819, 97225, -9362, 188509, 189423, 124286, 86055, 20062, 138683, -121472, -209463, 91436, -153403, -66219, -49607, -64055, 301809, 184783, -115538, 41435, -389648, 81499, -126783, 58020, -342517, 121033, 149676, 159963, 314144, -62168, 83419, -139102, -199480, 92813, 90047, 158167, 263193, 219228, -1961, -189222, 365169, -99986, -150624, 2308, -76807, -31904, -10978, -284172, 218219, -41286, -445186]
17942d45186f3065l2682A03146m2261B7510f0953j4846J0737l027A31180a76133
17930H6980l7105d0418p0952H8446J15324E425f6928H5971k2763J58132a15987
17918C84354d7240j09943E5886c36392A9510i8668a1173j5462q1371d1643r138
17907e0781A7016a54391C50055m3503D8627J77931J29204c97756a78267a8806
17896a61746p7971H8720a16549P001j57799A11898l2034C7786d7602a2127F93
17884b29729G032b29099A29837D5062J09390J00629c8446B55565j21180M1423
17874A75808j9466n2598C2544b01010F0556B4193a02027d9442C29662C0717J3812
17863D4529f9497F2940b51867A79826b11116j42265J67657A73904b2578o1474
$$ y = [-445186, -63065, -95747, 103146, 60885, 27510, -60953, -75799, -65062, -68089, 131180, -176133, 86980, 49875, -40418, -111370, 88446, 203770, 5425, -66928, 85971, 63208, 221340, -115987, 384354, -47240, -157183, 55886, -336392, 19510, -98668, -11173, -26635, -108006, -41643, -50781, 17016, -154391, 350055, 306552, 48627, 226558, 355762, -397756, -178267, -18806, -161746, -239717, 88720, -116549, -109548, -267347, 111898, 79864, 37786, -47602, -12127, 693, -229729, 7032, -229099, 129837, 45062, 154452, 255081, -38446, 255565, 134385, 175808, 156342, 103744, 32544, -201010, 60556, 24193, -102027, -49442, 329662, 30717, 44529, -69497, 62940, -251867, 179826, -211116, -353381, -185724, 173904, -22578, -84052]
17853h4052b3630A5899a50361A65019b16519C5967J76268G9614O9982k8595E0470
17841C7947N7378e1218L941B49198A16067J38545a42369C21307A42128n5446J48077
17830B34759a46632j80120A04475a74447B02377E5673a29171N2490k16716B44415
17819A1976d4338k09303A6790a0434A29888a48394I5979c5075k51489a29593C6111
17807d2974C06188b4250B11181j03219c7694A34682m2639K08499A24117b61419
17796a7209B86038c27532A27675d5325o4495A65092f920o8839o3002C5459c4044
17784d2402l1680r12j21903F5999A775c33913h6958A32236K7859p0158R7760h3298
17771d2712C43078a45677A89871J61741j47097Q8965a0968j45542A10982e087
$$ y = [-84052, -23630, 15899, -150361, 165019, -216519, 35967, 212235, 79614, 149596, 121001, 50470, 37947, 95325, -51218, -47277, 249198, 116067, 254612, -142369, 321307, 142128, 86682, 234759, -146632, -326752, 104475, -174447, 202377, 55673, -129171, -76681, -293397, 244415, 11976, -44338, -253641, 16790, -10434, 129888, -148394, 95979, -35075, -286564, -129593, 36111, -42974, 306188, -24250, 211181, 107962, -37694, 134682, 92043, 300542, 124117, -261419, -17209, 286038, -327532, 127675, -45325, -109820, 165092, -6920, -75759, -138761, 35459, -34044, -42402, -74082, -74994, -196897, 65999, 1775, -333913, -86958, 132236, 160095, 89937, 187697, -83298, -42712, 343078, -145677, 189871, 351612, 204515, 293480, -10968, -156510, 110982, -5087]
17760a54202f0540j77537Q1598B95827E8566a04866J8783A57848m9800K4095F5677
17748C2692a50766N9242j027H6952J66374A23586a8925A22120R1780g7142k0707
17737i7849J2362A25126E4323J37464a24857G5485K05131n6256C7916K62554d7663
17725c53156g2982K4974o4406B57535A3831d5808B8750a20042A68442G5515b27042
17713B88558h9099A69645B4782g0805A24076J32001C4870M8678J69339o2303J35332
17702C25916a6670D12687A31752g5277A3644L03802j17816a98531K5616B15930
17691G8723g4952D9217L28623h8363A78421o0921P0815m1109F5133c83437A43419
17679A05066k6087f0558D09590A58387F6994J85293B4614J463a30347j23746E5592
$$ y = [-154202, -60540, -238077, -156479, 295827, 58566, -104866, -86083, 157848, 108048, 132143, 65677, 32692, -150766, -91524, -92551, 86952, 253326, 123586, -18925, 122120, 213900, -77142, -97849, -85487, 125126, 54323, 191787, -124857, 75485, 280616, 224360, 37916, 300470, -47663, -353156, -72982, -48008, -112414, 257535, 13831, -45808, 28750, -120042, 168442, 75515, -227042, 288558, -89099, 169645, 24782, -70805, 124076, 256077, 34870, 83548, 252887, 190584, 325916, -16670, 412687, 131752, -75277, 13644, 317446, 199630, -198531, -172915, 215930, 78723, -74952, 49217, 377840, -88363, 178421, 117500, 188315, 147206, 65133, -383437, 143419, 105066, 78979, -60558, 409590, 158387, 66994, 252287, 24614, 26077, -130347, -254093, 55592]
17667a88009A29831m3891C543K7018Q2019b05871J3921G1552B2313f2357A71559
17655D8767J39424b8302o421A93848B3508h5150K4867p8170C18119A02510J765
17644A04275D9071h7932d1451C01498A38928D4870c22439A46268L2066a7615C88407
17632A19900a66276B074J98667F554J02274D0487L6528M9553j9116L0377A9097
17620C85622o3114b5012l3659j02642E5501J21940G6040a08347A87170l4127M1773
17609A94816G0747r248K3105J94988a51140C5557K2364a33448B97809j03448O8122
17598B62483h9295E9270J19411p3102a14194M6449C30793I5602d7060B7590J12385
17587A39975a88130c3977B98121f209j31150B40986R8990H9359h3403A53535J06900
$$ y = [-188009, 129831, 85940, 3543, 30561, 112580, -205871, -191950, 71552, 22313, -62357, 171559, 48767, 188191, -28302, -34723, 193848, 23508, -85150, -60283, -138453, 318119, 102510, 104275, 49071, -87932, -41451, 301498, 138928, 44870, -322439, 146268, 178334, -17615, 388407, 119900, -166276, 2074, 200741, 6554, 108828, 40487, 77015, 126568, 107452, 137829, 19097, 385622, 322508, -25012, -58671, -161313, 55501, 177441, 76040, -108347, 187170, 153043, 194816, 70747, 61499, 84604, 279592, -151140, 35557, 57921, -133448, 297809, 194361, 262483, -89295, 59270, 178681, 105579, -114194, -67745, 330793, 95602, -47060, 27590, 139975, -188130, -33977, 298121, -6209, -137359, 240986, 339976, 89359, -83403, 153535, 260435]
17576B60435A11633A2610e7016a3690A11562J56345i5223A58390k6765f9387A54078
17564C43479A12012q082R89O6510G5661L9778a6424C1006e2798J6428C7648L1748
17552F9396K34369I5300J26685a40710J4902A35738E3697Q9303J59343A1860J40040
17541A51900b38830F5057O0544b6306A71011P2861A2157K45685b11706l4266J22364
17530a23608A67592J83687K3927H4827J49515H0942a55428h805C32597A00908
17519A46349L05033J91259A89309J76282E9252K04987f1151A50658Q0077f9582
17508B01928J70473j37447j09982K70640j69353J60276j13821K53373A58930J41152
17498C00082a25183A58628E8867c8476B3754M1167K26998G0Q8456P3410R0383
$$ y = [260435, 111633, 12610, -57016, -13690, 111562, 267907, -95223, 158390, 131625, -69387, 154078, 343479, 112012, 103930, 104919, 171429, 75661, 115439, -16424, 31006, -52798, -36370, 37648, 69396, 303765, 95300, 221985, -140710, -125808, 135738, 53697, 143000, 302343, 11860, 151900, -238830, 65057, 125601, -26306, 171011, 243872, 12157, 257842, -211706, -245972, -123608, 167592, 351279, 375206, 84827, 234342, 80942, -155428, -8805, 332597, 100908, 146349, 451382, 642641, 189309, 365591, 59252, 264239, -61151, 150658, 230735, -69582, 201928, 372401, 234954, 124972, 395612, 226259, 386535, 272714, 526087, 158930, 300082, -125183, 158628, 58867, -38476, 23754, 64921, 291919, 70, 88526, 161936, 252319]
17487B52319I7119M63380A13444D6107L5616Q9830J91946j57840F9781J98597
17477B68378a93842A01237j5585O5289K772J44031c2724m8423A26760a72924C8129
17465B50952K00661A20837j3999J27614p9928K35917A42500F0548J37829j1631
17455A86746a12979b7393k3971C21886A25617K58268k1718A6219K81226J09581
17445D07026j34866n4943i6635A05038L06855l0348J18823A26778b30773c8722
17434A75242q3277J94143K76673j41752i8537h58C58953A07347O2056J56840A03515
17422D54811A11446j5992F339e7502B18475J88345j04668n6516F9726J7823K25992
17411C13541j02053C3286c80382A46768G1863J17164K58045b0150B27556n3397
$$ y = [252319, 97119, 560499, 113444, 46107, 81723, 171553, 363499, 205659, 69781, 268378, -193842, 101237, 85652, 150941, 153713, 297744, -32724, -81147, 126760, -172924, 38129, 250952, 451613, 120837, 106838, 234452, 154524, 390441, 142500, 60548, 198377, 186746, -112979, -27393, -51364, 321886, 125617, 383885, 362167, 16219, 297445, 407026, 272160, 217217, -96635, 105038, 411893, 381545, 500368, 126778, -230773, -38722, 175242, 91965, 286108, 562781, 421029, -98537, -858, 358953, 107347, 169403, 326243, 103515, 454811, 111446, 95454, 6339, -57502, 218475, 406820, 302152, 245636, 69726, 87549, 313541, 211488, 33286, -380382, 146768, 71863, 189027, 447072, -20150, 227556, 174159]
17401A74159a3979D09449J0896B09356G2428i2610A11266K10566l234F0079J09722
17390A69801b293A0966J93856a85867D09811G3876f5249e065B19504p5575J60670
17379C04599A31517f452C15838h7454F9265a51656A20013a88342r1850A59982
17368B08560L239K16997N4793f5826B15209J40909A53465c9292B76618q6179H8936
17356I7260L422a36926d6025C96263j49208A04116a43997B01277M04225B1931
17345D99103A02200c7521E28564A46895j0915c8408A19545M6617J06709G3927
17334B8512J308a81995A49490J07395A6957J09490j730K4625J91582r0047k4547
17323B26330m5661K90677k31728r5560k0424R1337I3460l0365L09861P9588p6297
$$ y = [174159, -13979, 409449, 420345, 209356, 72428, -92610, 111266, 321832, 318598, 60079, 169801, -2293, 10966, 204822, -185867, 409811, 73876, -65249, -5065, 219504, 143929, 304599, 131517, -6452, 315838, -87454, 69265, -151656, 120013, -188342, -280192, 159982, 208560, 211799, 428796, 483589, -65826, 215209, 356118, 153465, -39292, 276618, 190439, 88936, 97260, 100682, -136926, -46025, 396263, 247055, 104116, -143997, 201277, 605502, 21931, 499103, 102200, -37521, 528564, 146895, 135980, -38408, 119545, 166162, 272871, 73927, 28512, 29820, -181995, 149490, 256885, 16957, 126447, 124717, 149342, 340924, 250877, 226330, 180669, 471346, 239618, 144058, 123634, 214971, 93460, 63095, 372956, 452544, 376247]
17312C76247A32058K87568A09146b8141A54236m7867g6218G0303J23057n1267
17302A42093N9372J07899m0663J64324C6226K3086b11036C09966J7973p0642J16371
17291C73668F2183J30073q4230K59049n6256j49666K81313A50765k823J21462
17281B69404G5834L13535j17745A293K7764K47102d8787A57291l5244m4728N3834
17270A31153M35041A2902K37835j04943J49493F6335K64354j7120A36378L5995
17260A72373J2033J20031A25414C0099L09690j33792k5386O5430q1133J09706
17250B74614J96232F1654J30966r5012M19174j16567E7895k8384J75057J09332
17240C13900c6024A24788K7154K23918G2507J12687n1317K37543A63208K51882
$$ y = [376247, 132058, 419626, 109146, -28141, 154236, 106369, -76218, 70303, 193360, 142093, 201465, 309364, 268701, 433025, 36226, 59312, -211036, 309966, 327939, 257297, 373668, 62183, 192256, 108026, 367075, 310819, 161153, 442466, 150765, 147942, 269404, 75834, 389369, 271624, 1293, 29057, 276159, -48787, 157291, 122047, 77319, 131153, 566194, 12902, 250737, 145794, 295287, 66335, 330689, 313569, 136378, 172373, 184406, 304437, 125414, 30099, 339789, 205997, 180611, 246041, 164908, 274614, 470846, 61654, 192620, 97608, 516782, 400215, 57895, 29511, 204568, 313900, -36024, 124788, 151942, 375860, 72507, 185194, 133877, 371420, 163208, 415090]
17230D15090j33089H0636K75136a40776C95000q5377n8915I0564J50447q6194
17220A54817J22752P1311j20542J12866m5555A16914L47222j42471A14836A7124
17209D11423A82792P3664L6300m0595j6740N04621B84738a80471A37566K47654
17199C85220j75237J46714P2664L9050o9256j74478K40061c0433C9864J34923
17189A74787J17642J05184M3007j11529K0972J90657k2420D3802M78656F5934
17178B77514J90508k0057k2187j24883D6868J62957O9189K27257k45325H6471
17167D06995k2576J00824K4814D8805K7776J53366n1603q89B6333M30759G1116
17155B75610Q6502p8243O1696A18863N95537B54756M88116j88673L3420j42885
$$ y = [415090, 282001, 80636, 355772, -140776, 395000, 309623, 250708, 90564, 241011, 154817, 277569, 348880, 228338, 341204, 295649, 116914, 464136, 321665, 114836, 17124, 411423, 182792, 256456, 292756, 252161, 235421, 740042, 284738, -180471, 137566, 385220, 209983, 356697, 429361, 468411, 399155, 224677, 464738, -30433, 39864, 174787, 292429, 397613, 440620, 329091, 350063, 540720, 518300, 43802, 522458, 65934, 277514, 468022, 447965, 425778, 300895, 46868, 209825, 279014, 506271, 260946, 86471, 406995, 384419, 485243, 510057, 48805, 76581, 229947, 178344, 177455, 26333, 457092, 71116, 275610, 362112, 283869, 345565, 118863, 714400, 254756, 742872, 554199, 587619, 444734]
17145D44734p0603J00242j52192N4187L46201B86667J36908k1987J501J63289
17135E66378k0513p6237l4518A14607J83292R1328R0907J49108k8104J19166k28532
17124D91772J02905k15243J75573k65505R1225K2586K41746L831j58771j44665
17114C45454K3786j16842J71634k0141J34949o9137J71232j25920m7320j79045
17104B88650A10071J75843K54987A84302K29324M2400J28255J77166l22272O3661
17094E02836M5627M07174B61431K08897L8872k13392K39714L77391D00824p7947
17084C22877K65645j35651j35049m9551L10994j16429K24742o970O4999q0225
17074F65382k66081N69435j41675J78643m18261B90057O48123m33831j50189L84426
$$ y = [444734, 374131, 474373, 322181, 376368, 722569, 286667, 423575, 401588, 403089, 566378, 545865, 469628, 435110, 114607, 297899, 389227, 480134, 629242, 601138, 720304, 491772, 594677, 379434, 555007, 289502, 380727, 403313, 645059, 648890, 490119, 345454, 369240, 252398, 424032, 403891, 538840, 469703, 640935, 515015, 467695, 288650, 110071, 285914, 540901, 184302, 413626, 456026, 584281, 761447, 439175, 502836, 548463, 955637, 261431, 470328, 509200, 295808, 535522, 912913, 400824, 322877, 588522, 452871, 317822, 268271, 579265, 462836, 687578, 680608, 745607, 665382, 399301, 968736, 827061, 1005704, 587443, 290057, 938180, 504349, 354160, 738586]
17064G38586k2264k11177J57624q4484M8578j30022p7860k5466L31436j8847j7821
17053F88283j73014L23607L1246j08125j89013P603J13792j76075K41356J0216
17043G69876L6665j17232P4493k08269j22540J65696L8007m4704K28440l23617
17033D96815N71019k24810j3194o1405n7956j69890L51606q5932k060K37052k03696
17022H37549j20289K2004J9420j86096J37650J596P3311j69385K45043L5387n496
17011H90694J79835j77482J35035k05479J46105l7560k63994M02319l45036C47893
17000A201274k23328j58414N3054K48148n568j55121J94356q6332n0473j20181
16990H97415J13180M6445m9339J67861n87201N60870j69184j41660Q722K15380
$$ y = [738586, 716322, 505145, 662769, 578285, 626863, 496841, 418981, 393515, 724951, 706104, 688283, 515269, 838876, 870122, 761997, 572984, 580587, 694379, 518304, 759660, 769876, 806541, 689309, 763802, 555533, 432993, 598689, 636696, 591992, 820432, 496815, 1067834, 843024, 829830, 768425, 710469, 540579, 892185, 806253, 804193, 1041245, 837549, 717260, 739264, 758684, 572588, 710238, 711834, 785145, 615760, 860803, 896190, 890694, 1070529, 893047, 1028082, 822603, 968708, 931148, 667154, 1069473, 724437, 347893, 1201274, 977946, 819532, 872586, 1120734, 1115166, 960045, 1154401, 1068069, 1017596, 897415, 1010595, 1057040, 1007701, 1175562, 588361, 1149231, 980047, 838387, 847109, 1062489]
16980A062489K55230k56494r2824N62924l62620l5654J28302m11487K22497J42915
16970A215278o8447N0525L09235N6116R4274m11543j1586N26676m11634J59741
16960A508635q9309N9066N6531M4369n81332N07868j02744L03687K5259l03820
16950A428210j40992J96938K85718k46693J07724j06261L25914R7545m00671j47369
16940A400063J49413m9268n16L32525n28518L40948J11032J19339k34608K42451
16930A882861j22839J15835j66293J21161j53969O46024j78398K865l10606P4371
16920A911012L68066p1148l80845P03978l51540K26405k58561J33862J19530l6792
16910B363967l20l253k32990J04610J40487j40222K95286L36881j30396o7304
$$ y = [1062489, 1317719, 1061225, 968401, 1531325, 1168705, 1133051, 1261353, 849866, 1072363, 1215278, 1146831, 1197356, 1506591, 1562707, 1656981, 1245438, 1233852, 1760528, 1348894, 1508635, 1419326, 1478392, 1534923, 1579292, 997960, 1505828, 1403084, 1706771, 1732030, 1428210, 1287218, 1484156, 1769874, 1523181, 1630905, 1524644, 1850558, 1948103, 1547432, 1400063, 1549476, 1500208, 1499692, 1832217, 1303699, 1644647, 1755679, 1875018, 1640410, 1882861, 1760022, 1875857, 1709564, 1830725, 1676756, 2322780, 2144382, 2147247, 1836641, 1911012, 2279078, 2207930, 1827085, 2531063, 2179523, 2405928, 2147367, 2281229, 2400759, 2363967, 2363647, 2360394, 2127404, 2232014, 2372501, 2232279, 2527565, 2864446, 2734050, 2666746]
16900B666746l1497R0501j95344J01891J73916K56k01051J62433L45640R8073
16890C211564l90082J01572O3835L12385m98899M62679o4050m51484P02703K69961
16880C720184n92489J14002L43612l08775J96627P9957J18717L12589l38881L38391
16870C983934p9321M5115m9199K95425o3128N2336J88028n4749L03367k11189
16860D410619J03035K67496J70075p6293M4042k09182K49732l7392O42667k91018
16850E273781L82343k72464K26836J99377j30573K20811M6638J3311M17289k1842
16840F355507J3699N6301L48103J1687L93168J22185J03571J04885k1090J91315
16830G679331K06134L5159J52332K71162O5933J30034M22143N5882K09970K57153
$$ y = [2666746, 2635249, 2725750, 2530406, 2632297, 2806213, 2806469, 2605418, 2767851, 3113491, 3211564, 2821482, 2923054, 2986889, 3299274, 2800375, 3263054, 3199004, 2747520, 3450223, 3720184, 3127695, 3241697, 3585309, 3276534, 3473161, 3553118, 3671835, 3984424, 3645543, 3983934, 3904613, 3949728, 3900529, 4195954, 4132826, 4185162, 4373190, 4318441, 4621808, 4410619, 4513654, 4781150, 4951225, 4874932, 4918974, 4709792, 4959524, 4922132, 5564799, 5273781, 5656124, 5383660, 5610496, 5809873, 5679300, 5900111, 5946749, 5960060, 6377349, 6355507, 6369206, 6425507, 6773610, 6785297, 7178465, 7300650, 7404221, 7509106, 7488016, 7679331, 7885465, 7920624, 8072956, 8344118, 8410051, 8540085, 8962228, 9018110, 9228080, 9485233]
16820I485233L38087o8956N37592M7173q8501J88455O70319J1300K21020L22442
16810A1664164N21843O2944L05766M21401L30344K00381J59880L18622P90019
16801A4775364P03547j3964O01378L09889K34437P13091M52559O14732Q1299Q45805
16791A9318137L81198J023451N22736L90297R26946K77924O59280R02420Q47477
16782B5249866P45395O72267R21115O17731J472823J057406Q64335J012604J044993
16773C3658535J275461R53511J271161J233549J487691J334912J623024J768347
16765D4606191J496942J497196J827847J831537J816345K433285J829487J931451
16757E9270281K497805K224703K297710K808987K210560K160180L037131K762304
$$ y = [9485233, 9823320, 9754364, 10291956, 10339129, 10250628, 10439083, 11109402, 11120702, 11341722, 11664164, 12186007, 12248951, 12554717, 12976118, 13306462, 13506843, 13666723, 13985345, 14775364, 15478911, 15464947, 16066325, 16376214, 16610651, 17323742, 17776301, 18391033, 18472332, 19318137, 19699335, 20722786, 21245522, 21635819, 22562765, 22840689, 23499969, 24402389, 25249866, 25995261, 26667528, 27588643, 28206374, 29679197, 30736603, 31600938, 32613542, 33658535, 34933996, 35887507, 37158668, 38392217, 39879908, 41214820, 42837844, 44606191, 46103133, 47600329, 49428176, 51259713, 53076058, 55509343, 57338830, 59270281, 61768086, 63992789, 66290499, 69099486, 71310046, 73470226, 76507357, 79269661]
16749G9269661K556491K599764K692259K726292K854668K698136K610734K649147
16741A00657152K253181K721448K294757J658504K074634J573657J228265J415797
16733A15877395O60913R06123J32990L82621l78943n50572q25109r21457j327137
16724A13956824j705093j920992j886432k101896k371523k163683k749628k363070
16716I6694507k987197k353205k960676k550473k513534l026423k075227k755287
16708G5472485k245483k606571k722083k268718j774928k786941j893939k064068
16700E7109754k001616j958633j827639j253211k005864j629526j257058j829733
16692D3346474j326988j432111j542316j061177j380071j116590j089607j152956
$$ y = [79269661, 81826152, 84425916, 87118175, 89844467, 92699135, 95397271, 98008005, 100657152, 102910333, 105631781, 107926538, 109585042, 111659676, 113233333, 114461598, 115877395, 116538308, 117444431, 117577421, 117960042, 117581099, 117030527, 116205418, 115283961, 113956824, 112251731, 110330739, 108444307, 106342411, 103970888, 101807205, 99057577, 96694507, 93707310, 91354105, 88393429, 85842956, 83329422, 80302999, 78227772, 75472485, 73227002, 70620431, 67898348, 65629630, 63854702, 61067761, 59173822, 57109754, 55108138, 53149505, 51321866, 50068655, 48062791, 46433265, 45176207, 43346474, 42019486, 40587375, 39045059, 37983882, 36603811, 35487221, 34397614, 33244658]
16684C3244658o92579r12304j114021j034026r71227m92365j148615n69903p12393
16675B5597225o31029r35067k66715p39761r56068j87642q49132k93695o78699
16666B0059417p39614k58485m58738n32463n26077m59240l91405m48930j46567
16657A6097898k13608n65534k33236l69800l97517l3259n07015n61507K56505
16648A3472927o94343k02791l18552l24226M1644l14757l15596P7496k79064n19920
16638A0622818p8759k70691m23280K34314j60161k73736l7092k79186l26636l7377
16628H970214k37146Q4011l73397k82762J42304q683m65136J03832k77416M8501
16618G704322k2513m02562J30987j35995n13058J99062l684j75911j39172j70015
$$ y = [33244658, 32552079, 31639775, 30525754, 29491728, 28520501, 28028136, 26879521, 26309618, 25597225, 24966196, 24031129, 23764414, 23024653, 22068585, 21880943, 21031811, 20738116, 20059417, 19319803, 19061318, 18602580, 18070117, 17544040, 17084800, 16693395, 16244465, 16097898, 15884290, 15318756, 15085520, 14715720, 14318203, 14284944, 13777929, 13216422, 13472927, 12778584, 12575793, 12257241, 11933015, 11974659, 11659902, 11344306, 11421802, 11142738, 10622818, 10544059, 10273368, 9850088, 10084402, 9924241, 9650505, 9613413, 9334227, 9007591, 8970214, 8733068, 8817079, 8443682, 8160920, 8303224, 8294541, 7829405, 7933237, 7655821, 7704322, 7681809, 7279247, 7410234, 7274239, 6761181, 6960243, 6956559, 6780648, 6641476, 6471461]
16608F471461l16316K76851k61959l92028N00577k13993m84960q7736j0419K16811
16598E698289k10360J1586N3409k81541j45474J67075n44452N54486k6050k46776
16588E030192k23519J3065J72026j91863j65865k72138K75648j79626j04707j42996
16578D210217L72611l53768j33329j15352K2611K51563j38016l07287J65716m49173
16568C525793M25842k74941n2386K4589J08625Q6310J45312o86333J71385M9959
16558C524155k66930J01897L31504k29056l7339p9234O8423K22318m54766k83543
16548B897429M19247k20736M7376k37908J6669K36575l27755L09139l45237r6468
16538B698331Q8831q579K13701j26045N0734j75477p6450J95172k23851m01q7434
$$ y = [6471461, 6155145, 6431996, 6170037, 5778009, 6278586, 6064593, 5579633, 5491897, 5481478, 5698289, 5487929, 5499515, 5552924, 5271383, 5125909, 5292984, 4748532, 5303018, 5276968, 5030192, 4806673, 4819738, 4991764, 4799901, 4634036, 4361898, 4637546, 4457920, 4353213, 4210217, 4582828, 4229060, 4095731, 3980379, 4002990, 4254553, 4116537, 3809250, 3974966, 3525793, 3951635, 3676694, 3624308, 3648897, 3757522, 3843832, 3989144, 3302811, 3474196, 3524155, 3257225, 3359122, 3690626, 3461570, 3424231, 3344997, 3413420, 3635738, 3180972, 2897429, 3316676, 3095940, 3143316, 2905408, 2922077, 3158652, 2830897, 3140036, 2794799, 2698331, 2787162, 2778583, 2992284, 2866239, 2916973, 2741496, 2665046, 2860218, 2636367, 2635966, 2548532]
16527B548532p6255n2172k9077R7441K8033P0552Q9457m19358K20002p0732L71267
16516B777690m23392j42313M11487k30277j24465q3385L19895j98028j89002J85315
16506B303525J26837k31692j90707J16812K75309j11396R4900l38613n57L7979
16496B082397K86948m03790m14205J98505L41126l009J5548j72258K88798j51363
16486B068697p8839J55603j75923k13641j6182K94621M6190K7329n3684J03042
16476B157213n68721J13588J34003j34930J24670j402j16712J2966m6521L37418
16466B011572j15122J11826k30960j29777P4859J80246o01686J24022L65105L6964
16456A827049J62848l68927J84894r5510j44368q7415J50841j9462q098j33291
$$ y = [2548532, 2472277, 2420105, 2391028, 2488469, 2516502, 2587054, 2676511, 2257153, 2477155, 2406423, 2777690, 2354298, 2211985, 2623472, 2393195, 2268730, 2185345, 2505240, 2307212, 2118210, 2303525, 2430362, 2198670, 2007963, 2124775, 2400084, 2288688, 2383588, 2044975, 2044418, 2082397, 2369345, 1965555, 1551350, 1749855, 2090981, 2087972, 2103520, 1931262, 2220060, 2068697, 1989858, 2145461, 1969538, 1755897, 1739715, 2034336, 2080526, 2107855, 2054171, 2157213, 1588492, 1702080, 1836083, 1701153, 1825823, 1824421, 1707709, 1720675, 1674154, 2011572, 1896450, 2008276, 1777316, 1647539, 1722398, 1902644, 1300958, 1424980, 1790085, 1827049, 1989897, 1620970, 1805864, 1710354, 1565986, 1478571, 1629412, 1609950, 1601852, 1468561]
16446A468561p5147K15487K6211m8062K4167J68313m49402L95543J16456m84112
16436A358015m4313M9563K17755k57024J17110o5588q3144M67546l49213k71402
16426A139305L57880n7307p1511M89681l79955P54J01675k58011L79915l49904
16416A352522K30016m02816L42187l71357J66797K05106l36242M4593m0171M42505
16406A633140n46536N064N85618n34423J72066j60923L06892m09053K00705p9804
16396A172746L14901n05663N44853r9239j30293l08285K76933j17281o4181R9295
16386A183786K29057j73269p9404M2457M3337q2591k05820L05204J53622j16446
16376A299933r7229n415K88757l4432n41153J16818O4615P666J22378j84894J43646
$$ y = [1468561, 1393414, 1608901, 1635112, 1587050, 1611217, 1779530, 1330128, 1725671, 1842127, 1358015, 1313702, 1363265, 1581020, 1323996, 1441106, 1375518, 1292374, 1759920, 1410707, 1139305, 1497185, 1439878, 1368367, 1858048, 1478093, 1478847, 1580522, 1322511, 1702426, 1352522, 1582538, 1179722, 1521909, 1150552, 1317349, 1522455, 1186213, 1230806, 1190635, 1633140, 1086604, 1091668, 1677286, 1142863, 1314929, 1154006, 1460898, 1051845, 1252550, 1172746, 1487647, 981984, 1526837, 1427598, 1297305, 989020, 1265953, 1148672, 1084491, 1183786, 1412843, 1239574, 1160170, 1202627, 1245964, 1163373, 957553, 1262757, 1416379, 1299933, 1202704, 1197289, 1486046, 1451614, 910461, 1027279, 1091894, 1099560, 1221938, 1037044, 1180690]
16365A180690k04891J06524J16009K5946L1866j72626J7275K51659j76762K19484
16355A395174k69472L33766n96503K93784j07182k4158k20880M24467j4244J5744
16345A230496j7635N6053l22022L29193l73293J70747n9K14030l69326J39601
16335A057785j27357j84049K54489K72389j81163j88236O4894j13723J42713l16882
16325F80860L82922j75980J19383o3647j87464L84942l46274K77068K084m3066
16315A030828l58383J96121r4279J14135J04723R1393l53771K70672P2238J07692
16305A181369M0517l06425j46742L36650k55071L12696m87300L23205k09612J67307
16295I56594N0430l80650M15323n04798Q6717L60007P584J95648j21810m90788
$$ y = [1180690, 975799, 1082323, 1198332, 1224278, 1256144, 1083518, 1100793, 1352452, 1175690, 1395174, 1125702, 1459468, 862965, 1156749, 1049567, 1025409, 804529, 1228996, 1214752, 1230496, 1212861, 1268914, 946892, 1276085, 902792, 1073539, 1073480, 1287510, 918184, 1057785, 930428, 746379, 1000868, 1273257, 1092094, 903858, 968752, 855029, 997742, 680860, 1063782, 887802, 1007185, 943538, 756074, 1141016, 794742, 1071810, 1073894, 1030828, 672445, 868566, 774287, 888422, 993145, 1084538, 730767, 1001439, 1073677, 1181369, 1221886, 915461, 768719, 1105369, 850298, 1162994, 675694, 998899, 789287, 956594, 1007024, 626374, 1041697, 536899, 623616, 983623, 991207, 1186855, 1065045, 574257]
16285E74257L75751j90766J07822K38424k22561j89981J36327o5634J77196j33401
16275H07434k22409J90572J24770l14140L48833o6906k53494O4275J90630j86653
16265F82912J8844N2110Q8904D12696N86244j65328Q4204M1228o756l6364M9443
16254I65367m67886j37219M60061j55701K62781j04816l8430J07926R1833j09869
16244H74047J40373j68174k67112j02703K3987J9576K59607j01204K22756l19924
16234E81229q8315K2780P8948R5215j05343P2186j00065O2790O9216O7134Q0368
16223H36143k80143R0609k46934j7014N04473m10877q9525P816N22200k96345
16213F20403J87144k13535M6656J09096C37935L94468j99311j22780K49386k41775
$$ y = [574257, 950008, 759242, 867064, 1105488, 882927, 692946, 829273, 763639, 940835, 807434, 585025, 775597, 900367, 586227, 935060, 868154, 614660, 678935, 869565, 682912, 701756, 753866, 842770, 412696, 998940, 833612, 917816, 959044, 952288, 915924, 965367, 497481, 360262, 820323, 664622, 927403, 822587, 784157, 892083, 983916, 874047, 1014420, 846246, 579134, 476431, 500418, 519994, 779601, 678397, 901153, 581229, 492914, 515694, 594642, 689857, 584514, 656700, 556635, 619425, 688641, 755775, 836143, 556000, 646609, 399675, 382661, 887134, 476257, 386732, 394548, 916748, 620403, 807547, 594012, 640668, 749764, 337935, 732403, 533092, 410312, 659698, 417923]
16203D17923O6895O5473m0089J09899N7164j51342l1900O8534k67008I6302O88701
16192G85003B91646M2241L41870K65378k01549L2841k33297J23461P5491o7844
16182F70238r888k96233K13546l0994N2503P3056j30088A48303M24763l8415R3129
16171F27780j51089Q4337j34698K7820M53581B52821K48238J9935q6285Q85j01756
16160C33838L34856A59087N36382k86980j70164j2695K42275j70426K035K613
16150C02127j18978L7849j0215J85954n9799F0789L37744I9701a3571D48053j57549
16139B90504R5953R415J07857k20237J40414K8989K0577n5711J33008B56749M5984
16128C02733J87953j09098K8566m8519j25028G6790M41749k26086n6084J3473
$$ y = [417923, 484818, 550291, 510202, 620101, 677265, 525923, 494023, 562557, 295549, 96302, 785003, 291646, 333887, 675757, 941135, 739586, 772427, 539130, 662591, 738082, 670238, 660350, 364117, 577663, 546669, 599172, 672228, 542140, 148303, 573066, 534651, 627780, 476691, 561028, 426330, 454150, 907731, 252821, 501059, 520994, 434709, 435594, 333838, 668694, 159087, 695469, 408489, 238325, 225630, 467905, 297479, 299514, 302127, 183149, 220998, 210783, 396737, 336938, 60789, 398533, 99701, -13571, 448053, 290504, 386457, 395872, 503729, 283492, 423906, 452895, 473472, 417761, 550769, 256749, 302733, 490686, 381588, 410154, 361635, 236607, 76790, 518539, 292453, 236369, 249842]
16118B49842K56266A42407J11484q203p1390J31621j28864J62122N942J72056
16108E17175A64571M420c4824D74121k33958R601c4269D95975B4851J78776r2541
16097A11086O6429K72969m8912r4306J978N5914A26893J28707A0947J37064k2546
16086A25465J80495L6193e6617C26008J77510F8260N04922B15380C7575L17313
16076C54888m8260A30998J33078M7316O0506Q8644A01709L13532f1720C27160
16065A51817i195A29293m5175k1504A1346K3544L33323M270G2272N606L97635
16054D75513k01138G4252M0944i628A66657J02355K79980p584D9023J41047e6370
16042C8220M8379J40331E7136N1953p945a41222j8517A66191G5757K36138J33326
$$ y = [249842, 506108, 142407, 253891, 245688, 174298, 305919, 177055, 339177, 345119, 517175, 164571, 168991, -34824, 474121, 240163, 249764, -34269, 495975, 24851, 203627, 111086, 177515, 450484, 401572, 307266, 309244, 365158, 126893, 255600, 10947, 148011, 125465, 305960, 342153, -56617, 326008, 503518, 68260, 573182, 215380, 37575, 354888, 306628, 130998, 264076, 311392, 371898, 460542, 101709, 415241, -61720, 327160, 151817, -9195, 129293, 84118, 62614, 11346, 34890, 368213, 372483, 72272, 77878, 475513, 274375, 74252, 115196, -9628, 166657, 269012, 548992, 541408, 49023, 190070, -56370, 38220, 86599, 226930, 57136, 109089, 101144, -141222, -159739, 166191, 75757, 311895, 445221]
16031D45221H7344b7157C12126q7133F9708a39609M3172K8900A34770J55212a27958
16019C34344I7151J71687a48727A67547j2290a1786A5234a24304C8681M03655
16009D42336A86978K81710E7085a35726D67431I5589c55196d4487r4978A73467
15998C4985K26908p3713l0604b50015E8246L42583q9004F4172O3150J73776A09910
15986B31323L84183l5194J64345j52543B90898A00518L94265a63854A68213G1494
15975C35850B1897A958J29053E227b56417A12314a4840A86532F059j436N6474
15964F1097N8248a57036B7478K60353i704k57520E7846B1856J15252O3426j2101
15953A88433l8159K5240a54920P256O4367k7324j25784Q2542D4327g0558p0877
$$ y = [445221, 87344, -27157, 312126, 224993, 69708, -139609, -96437, -67537, 134770, 289982, -127958, 334344, 97151, 268838, -148727, 167547, 155257, -11786, 15234, -124304, 38681, 442336, 186978, 468688, 57085, -135726, 467431, 95589, -355196, -44487, -139465, 173467, 34985, 261893, 188180, 157576, -250015, 58246, 400829, 311825, 64172, 127322, 301098, 109910, 231323, 615506, 580312, 744657, 592114, 290898, 100518, 494783, -163854, 168213, 71494, 335850, 21897, 1958, 131011, 5227, -256417, 112314, -14840, 186532, 6059, 4623, 61097, 119345, -157036, 27478, 287831, -9704, -267224, 57846, 21856, 137108, 200534, 188433, 150274, 175514, -154920, -147664, -83297, -110621, -236405, -153863, 44327, -70558, -141435]
15942a41435k36401g6669A23693d1511j16684F3450k4978a0595k19295B56989
15931A33371B2911f0133C13173E4104a13928G0784J17754F2285a09208H0340j0204
15920G0136N9395g3170B02349o7864j9349O2664b9140k0919H6575b84838j66534
15909d51372h4380A28087D7217c75423d5913j4934E0515J04035F4205Q2813E6611
15897i8387J2883q6926e7345C4473i244m6912r8568H5960c9883a8059I4349J69971
15885B64320a5010n644a0322A43989a41429A39713M0408d10901J55990n0795A49029
15873I4896Q9340O1208h0591B8404I695b97272E2208a68764Q980C98131F5465
15861H2228K36264j52379o4602L2625j1277E8963L4089O7943c12871f6290k17079
$$ y = [-141435, -377836, -76669, 123693, -41511, -158195, 63450, 38472, -10595, -229890, 256989, 133371, 22911, -60133, 313173, 54104, -113928, 70784, 188538, 62285, -109208, 80340, 70136, 129531, -73170, 202349, 134485, 115136, 177800, -29140, -50059, 86575, -284838, -451372, -84380, 128087, 47217, -375423, -45913, -60847, 50515, 154550, 64205, 147018, 56611, -98387, -85504, -172430, -57345, 34473, -9244, -56156, -154724, 85960, -39883, -18059, 94349, 264320, -15010, -20654, -10322, 143989, -141429, 139713, 180121, -410901, -254911, -305706, 149029, 94896, 184236, 245444, -80591, 28404, 9695, -297272, 52208, -168764, -159784, 398131, 65465, 82228, 318492, 166113, 101511, 134136, 122859, 58963, 93052, 160995, -312871, -66290, -283369]
15850b83369i4504B25018G4855b73378a33085j93084a58224A26045K12794b58476
15839C3669f8993B7041J70994E0413b87229R0520F6499a8845A57470b22318j42300
15828c64618h3881D5260b82476K3229A26235P7301b53022A06422h4804b3133F4702
15816a16556f394n779D0681K03935a11957B87008H5125R7323c0558H768J04066
15805A12834a50639F7067E866e2388D6342K93343E4027k0416c303j06160M6363
15794f3100C342L1102a04218C09064a18836j09958f6985m4121A58413h1978b7642
15782c34007A97481m2175h4704G8860k3189P811K51343a7242j15872g056j20131
15771a27187R91l4402a3477A94971j7201b82099A72473a52853N6438C57272e8997
$$ y = [-283369, -94504, 225018, 74855, -273378, -133085, -326169, -158224, 126045, 338839, -258476, 33669, -68993, 27041, 198035, 50413, -287229, -196709, 66499, -18845, 157470, -222318, -364618, -83881, 45260, -282476, -259247, 126235, 203536, -253022, 106422, -84804, -23133, 64702, -116556, -6394, -12173, 40681, 244616, -111957, 287008, 85125, 182448, -30558, 8768, 112834, -150639, 67067, 5866, -52388, 46342, 339685, 54027, 33611, -3303, -109463, -63100, 3342, 34444, -104218, 309064, -118836, -228794, -66985, -111106, 158413, -81978, -27642, -334007, 197481, 155306, -84704, 78860, 55671, 63482, 314825, -17242, -133114, -7056, -127187, -126196, -160598, -13477, 194971, 177770, -282099, 172473, -152853, -96415, 357272, -58997]
15759b07540C8571N0238a33578r4182E7942N4612J02462n0741C0192M6246b51249
15747A92699G0964a73036q0005j188C4498J26242p403a03568G621b54868e0656
15735A67340f2343E7323Q8289i7864b8152j1244A2218h3827I3068d0894m35002
15724d75896B07917h407H922b50040G879J08188n6150c583l7734b544A06693H590
15711a25202m119A31578J27718D5282b81145N0675C9417M7426b86715a42584e1020
15699g374A68888o7627D0756a75244b1352j66606A1659a90406A67700H37d2237
15687e3819C1538J35619d54915C6127a46294c1436l07041a31301g535p0439A00492
15675B17513c05840F1536J36369C3775L02924B3468L07578A13810c62590G0210
$$ y = [-207540, 38571, 88809, -133578, -227760, 57942, 112554, 215016, 164275, 30192, 76438, -251249, 192699, 70964, -173036, -253041, -254229, 34498, 160740, 153337, -103568, 7621, -254868, -50656, 167340, -62343, 57323, 145612, -97864, -28152, -39396, 12218, -83827, 93068, -40894, -475896, 207917, -8407, 8922, -250040, 7879, 116067, 59917, -3583, -41317, -2544, 106693, 8590, -125202, -129321, 131578, 259296, 45282, -281145, -230470, 39417, 86843, -286715, -142584, -51020, -7374, 168888, 101261, 40756, -175244, -21352, -187958, 11659, -190406, 167700, 837, -42237, -53819, 31538, 167157, -454915, 36127, -146294, -31436, -338477, -131301, -7535, -77974, 100492, 217513, -305840, 61536, 197905, 33775, 336699, 23468, 331046, 113810, -362590, 70210]
15664F0534L0680Q800a85156I6580i9338d0144k74139I5285a00041j67738E08506
15652a53804l7612h940r1683B18943c3503J6632k15094E9329G700i2410j32973
15641b25383A73360B0439c56271A67961C3545b264j64774P320o8758i1987B01170
15629g5440E9082f2278o0453k09725A49681b59472a04949J8407A34055c17062
15618a92136B8734a64439E1716A3013P0478J91855B9940A0613J75932F023J56812
15607A62835h4957r9087j75730A31461C2352a59152A22467b99441B32232k7105
15597B05127P0293b52857A48322J12399e2074B39947O1530g6650E4052a52101
15586a25048k7025q500o8416C6795b27194R4806J0649A27413c7351k7694n1783
$$ y = [60534, 91214, 100014, -185156, 96580, -99338, -40144, -314283, 95285, -100041, -267779, 508506, -153804, -191416, -8940, -100623, 218943, -33503, -16871, -231965, 59329, 7700, -92410, -225383, 173360, 20439, -356271, 167961, 33545, -2264, -167038, -159718, -228476, -91987, 201170, -75440, 59082, -62278, -122731, -332456, 149681, -259472, -104949, -86542, 134055, -317062, -192136, 28734, -164439, 51716, 13013, 83491, 275346, 29940, 10613, 186545, 6023, 162835, -84957, -184044, -359774, 131461, 32352, -159152, 122467, -299441, 232232, 205127, 275420, -252857, 148322, 260721, -52074, 239947, 301477, -76650, 54052, -152101, -125048, -152073, -160573, -228989, 36795, -227194, -132388, -121739, 127413, -37351, -65045, -116828]
15575a16828A067e8772J1264A82024e0609k2952E2797b78494c5861j57772g8538
15563a08779A6388J52216B9230K74711j02155J4723a63916L5451q5077A32143
15552a71965A4649a44038d7418j1125j09230B3785j309b03867A78131a61933A90882
15540I9200R7210p6268c3806n8962A32146D4214a3858H233J93295j7348b17198
15528G8702a2513j65243A28401Q7261r6490k1051c02586a00203q6806j36530i4636
15516a28207N2090F8271j0873Q5456e8871j55477r1986a40196A07177c77150i7449
15504h9044B25549c9206k09322C20030I7684b23802H668a48577H5020l672j3983
15493F7365B6953R3244b37672A45337D1624L08472g849o7014k81590g0084a3965
$$ y = [-116828, 1067, -58772, -47508, 182024, -50609, -73561, 52797, -278494, -35861, -193633, -78538, -108779, 16388, 168604, 29230, 303941, 201786, 216509, -163916, -128465, -213542, 132143, -171965, 14649, -144038, -47418, -58543, -167773, 23785, 22476, -203867, 178131, -161933, 190882, 99200, 196410, 120142, -33806, -92768, 132146, 44214, -13858, 8233, 201528, 184180, -217198, 78702, -12513, -177756, 128401, 215662, 119172, 98121, -302586, -100203, -187009, -323539, -94636, -128207, -76117, 68271, 57398, 142854, -58871, -214348, -306334, -140196, 107177, -377150, -97449, -89044, 225549, -39206, -248528, 320030, 97684, -223802, 8668, -148577, 85020, 81348, 67365, 26953, 120197, -237672, 145337, 41624, 350096, -7849, -74863, -356453, -70084, -13965]
15481a57147D7257K19322r6753p4109G751M2984a5255C56541m0126b1946A85770
15469B48372m5656E4407b18419d3210B18962k5670f4443l74581g3426A47282a44587
15457A68691a4040F6660c15826E9201a02569L2231B22433e4873A33326N9359o6386
15446A26299a08172A8654J85501D4293J99431o9379K83299B20495a7336D501i0793
15434D2829A8184O7880f1897j31010I600K95698b00678g159A92783a61510A5770
15422b71283A48743l2181E869J35176J56351B3479N7190g0527j44355i9951j81346
15411b81297N6504B33747d2562A64987b27628I6810l6111o693b89522C45327C419
15399d2896E9053a47622B4483a14030E5457J92013a15877q5327e8291A0609a28344
$$ y = [-157147, 47257, 266579, 169826, 95717, 7751, 50735, -15255, 356541, 316415, -21946, 185770, 248372, 202716, 54407, -218419, -43210, 218962, 193292, -64443, -439024, -73426, 147282, -144587, 168691, -14040, 66660, -315826, 59201, -102569, -70338, 222433, -54873, 133326, 192685, 126299, -108172, 18654, 204155, 44293, 243724, 174345, 457644, 220495, -17336, 4501, -90793, 42829, 18184, 86064, -61897, -192907, 9600, 305298, -200678, -7159, 192783, -161510, 15770, -271283, 148743, 116562, 5869, 141045, 297396, 23479, 80669, -70527, -214882, -99951, -281297, -224793, 233747, -42562, 164987, -227628, 96810, 60699, 54006, -289522, 345327, 3419, -42896, 59053, -147622, 24483, -114030, 55457, 247470, -115877, -201204, -58291, 10609, -128344]
15387c174n0518A93150f8113B43602a54579B896P0931a22574l2016B65918d9351
15375g8032a53j95208h5051D8252J74885a37437A95449a36805B4972a915A11141
15363A04444b08933A80776L65926f8176A42203e4056R50A40829n7007K02411A10257
15351C5401N2986m1532P0195b52907i2578A11076c131o4293F7691a53861B27030
15339H3248L55241j87617R0879F4518a97635A22791C0767a15121A3668a48396
15328E5776a85693O7777A38265J22189F15L31461A29946n6166L09101c70578A51376
15316g998b835C59418A61933N1257e3810C52831H5295J39686D3170r692d05823
15304a6100G0095c51843A9286D006J60754a79159c6531B32473p1076H581a27550
$$ y = [-3174, -53692, 193150, -68113, 243602, -154579, 2896, 73827, -122574, -154590, 265918, -49351, -78032, -153, -195361, -85051, 48252, 223137, -137437, 195449, -136805, 24972, -1915, 111141, 104444, -208933, 180776, 546702, -68176, 142203, -54056, -53106, 140829, 83822, 286233, 110257, 35401, 88387, 46855, 117050, -252907, -92578, 111076, -3131, -67424, 67691, -153861, 227030, 83248, 438489, 250872, 341751, 64518, -197635, 122791, 30767, -115121, 13668, -148396, 55776, -185693, -117916, 138265, 260454, 615, 332076, 129946, 73780, 382881, -370578, 151376, -7998, -2835, 359418, 161933, 213190, -53810, 352831, 85295, 224981, 43170, 33478, -405823, -16100, 70095, -351843, 19286, 4006, 164760, -179159, -36531, 232473, 161397, 8581, -127550]
15292a25846M1371K13j12175B31167D9342A7454a16503A91953D0221g5294D1399
15280H371b17425C47708c6772A63100J56871F1626K4668J16503G4397g8497b3480
15268D6613a7876j4283I4524f2535q1609F4544b311o7387A85581a2108I9783E072
15255A62183a0128o2421A15510J15828m6983K50381R29797j01206K3445J64550
15245A451322o09878B93235j5728o2530a73573B54501F4813h7887C01428E9616
15234H4268b63429A79651n1014b8311j80155N4687B22521H7724c21402d351B111
15222a69786p5986B70551J76391c2856j18841B45211c36187A74480b4330k6796
15212e1126A76116K61409f7990K2942A69029g9706B70145C9954P8559L80690a71366
$$ y = [-125846, -84475, -84262, -196437, 231167, 49342, 17454, -116503, 191953, 40221, -75294, 41399, 8371, -217425, 347708, -36772, 163100, 319971, 61626, 86294, 202797, 74397, -78497, -23480, 46613, -17876, -32159, 94524, -62535, -144144, 64544, -2311, -69698, 185581, -12108, 99783, 5072, 162183, -10128, -72549, 115510, 231338, 184355, 434736, 1364533, 1263327, 1286772, 1451322, 841444, 293235, 277507, 214977, -173573, 254501, 64813, -87887, 301428, 59616, 84268, -263429, 179651, 128637, -28311, -208466, -153779, 222521, 87724, -321402, -4351, 2111, -169786, -245772, 270551, 446942, -32856, -151697, 245211, -336187, 174480, -24330, -51126, 176116, 437525, -67990, -45048, 169029, -79706, 270145, 39954, 118513, 499203, -171366]
15200c4013H4434C7069A0229K84767A23639B9418J48920E3968c2583Q834k68428
15189b92177B227i9800c1762l35116h2337C5539g7750B4408a9041C63087A41860
15177D1043b80666B72906E9462k7371b7393j7044D10528A4395L2139Q9755h2567
15165A66368M8366N1076c3986A30544Q3054b47907A36063b49221B01186d8843
15154A85342H5566l3277i583B61397H5434a50430E1371O1212n970a05283E1255
15142a61644A64191D570J71977c7512A72014a96957D11202j92147p3595D7095
15131C54434B4829J27866a5669D688K9721b1107C08811P4692k3691j44165B817
15119A54090J80445H8803O9210g7072b3616j97086B9283J32305L63309o0111C3235
$$ y = [-34013, 84434, 37069, 10229, 294996, 123639, 29418, 178338, 53968, -32583, -23749, -292177, 2227, -99800, -31762, -366878, -82337, 35539, -77750, 24408, -19041, 363087, 141860, 41043, -280666, 272906, 59462, 32091, -27393, -44437, 410528, 14395, 46534, 136289, -82567, 166368, 214734, 265810, -33986, 130544, 213598, -247907, 136063, -249221, 201186, -48843, 185342, 85566, 52289, -9583, 261397, 85434, -150430, 51371, 112583, 106613, -105283, 51255, -161644, 164191, 4570, 176547, -37512, 172014, -196957, 411202, 219055, 145460, 47095, 354434, 24829, 152695, -15669, 4688, 34409, -21107, 308811, 383503, 359812, 215647, 2817, 154090, 334535, 88803, 158013, -77072, -23616, -220702, 29283, 161588, 524897, 464786, 33235]
15107a29717j26441A68918H711a71163c0193B71248C0513J11324P9979F0231J89010
15096B49241b7652I0629J11013G9176N03367b03141B97569O9018B7247K48562
15086B75809k9611h3847B41444q5328j0976B1023K11255k0409C2405e9132A45237
15074A2493J23454J96479H2063b8511A23584c0543a3948B15700I8459Q2741L01719
15063D82919k33964b0278H5351a28419F5536N109J0601K33444a14188C03389E4078
15051B96377j2711N1865B9761M4456f3953D4371J50723g8769D66582j42750R7436
15040D21268g658A6250M60852A73177o3764b51878H2541J46348J48690m1374K9120
15029C65325G3065K22122j07584L07543M9371c7069C187K83104P0427J05222A55013
$$ y = [-129717, -256158, 168918, 8711, -171163, -30193, 271248, 30513, 141837, 221816, 60231, 249241, -27652, 90629, 201642, 79176, 582543, -203141, 297569, 366587, 27247, 275809, 246198, -83847, 241444, 156116, 145140, 21023, 232278, 211869, 32405, -59132, 145237, 12493, 135947, 332426, 82063, -28511, 123584, -30543, -13948, 215700, 98459, 181200, 482919, 248955, -20278, 85351, -128419, 65536, 70645, 81246, 314690, -114188, 303389, 54078, 296377, 283666, 335531, 29761, 74217, -63953, 44371, 195094, -78769, 466582, 323832, 421268, -7658, 16250, 477102, 173177, 109413, -251878, 82541, 228889, 377579, 336205, 365325, 73065, 295187, 187603, 495146, 544517, -37069, 3187, 286291, 356718, 461940, 155013]
15017A90465a2890A45479b09205O1098C77607E7153K05281b06766d6889E30091
15006A34349J71463A01534J61746o3860P4863m0117J08190A54991G6588K02936
14996B79524j19127G0976a5569C50006Q8984j36727J46816j15420j42417l5627
14986A55615L39630R303b23951C36659n21A25844J85519q6358R1404J84435J66009
14975F66853A56345L13313n9892r6401j15806q4255L87018q4917R9285o1033k17001
14964B36656M13442A38259K57869n2743A62441J88695j31402J03890J14920j36048
14954C02496J09824o5404K86806B51987k7484J21524j00234A3876K79159A26636
14943D39582J04186j87936K43219p3877A70011H762L53062p4231q5769J64451
$$ y = [190465, -12890, 145479, -209205, -148107, 377607, 57153, 262434, -206766, -46889, 530091, 134349, 305812, 101534, 263280, 199420, 274283, 234166, 342356, 154991, 76588, 279524, 160397, 70976, -15569, 350006, 438990, 302263, 449079, 333659, 191242, 155615, 495245, 504548, -223951, 336659, 336138, 125844, 311363, 225005, 316409, 500844, 666853, 156345, 469658, 409766, 313365, 197559, 113304, 500322, 415405, 514690, 453657, 236656, 650098, 138259, 396128, 343385, 162441, 351136, 219734, 323624, 438544, 302496, 412320, 346916, 633722, 251987, 224503, 346027, 245793, 13876, 293035, 126636, 439582, 543768, 355832, 599051, 525174, 170011, 8762, 361824, 287593, 201824, 366275]
14933C66275r2477J4412K0420K49704J04413A24400M16333J88357J14019l50045
14923D93064N2582L20716r7763j17568j78846K81713J27313l24889m9887j26796
14913C79639O06914l73821M30586l74039k57476j53206M1719O6433j75958P3447
14903B64238Q601a50566A58990K83379J2316k8939r6694j413A36849P4651K18084
14892D29584J43157B37462J22354j35641p3199M63345j29744B21642L193M21017
14882F45852l05376J64171q6174j19551L27021k20603j36552K29627p7846q3447
14872C37122K47169k85274K21250j07237j42396M85320l19960j95829L64191l137
14862F01219B46805K30172q9292A70115L27776j10421J87668k59675H8045J20246
$$ y = [366275, 273798, 288210, 308630, 558334, 662747, 124400, 540733, 729090, 843109, 493064, 545646, 866362, 768599, 651031, 472185, 753898, 881211, 556322, 506435, 379639, 986553, 612732, 1043318, 669279, 411803, 258597, 300316, 366749, 190791, 264238, 272839, -150566, 158990, 442369, 454685, 425746, 329052, 327639, 136849, 211500, 429584, 572741, 237462, 359816, 224175, 150976, 614321, 484577, 221642, 224835, 645852, 340476, 504647, 418473, 298922, 625943, 405340, 268788, 498415, 420569, 337122, 584291, 299017, 520267, 413030, 270634, 755954, 435994, 240165, 604356, 601219, 246805, 476977, 387685, 170115, 497891, 387470, 575138, 315463, 88045, 208291]
14852B08291L87230B05983M40127Q5602C39160O8612J31221B24709K95486A58854
14841B83552J61973j38644K50388K85725C64735J10036J88579J5735B75273K63988
14831E39261q5598j41064J11944J70315l8454A76437N70271B32366j1504N16825
14821G37687C17215R1699K48227B19678m4426J34772L86092C46699K53887k57584
14811C43002K6686J15558k13670q718J14303j34897K44107j89038K53922L8504
14801E89759J68451B89101L68381j63851P4706K1863j63356K13882k32271q3296
14791C25159K30248q2185k00932M32877C44555J87896O6693N119n9602K0052B37429
14779D82264o8343Q5883K109m3613P2432j64607R115K22428J78864C50205J56585
$$ y = [208291, 595521, 205983, 646110, 731712, 339160, 407772, 538993, 224709, 520195, 158854, 283552, 445525, 306881, 557269, 842994, 364735, 474771, 663350, 679085, 275273, 539261, 453663, 312599, 424543, 594858, 556404, 176437, 746708, 232366, 220862, 737687, 317215, 408914, 657141, 219678, 175252, 310024, 696116, 346699, 600586, 343002, 369688, 485246, 271576, 262858, 377161, 242264, 486371, 297333, 551255, 589759, 758210, 289101, 657482, 493631, 568337, 590200, 426844, 640726, 408455, 325159, 555407, 473222, 272290, 705167, 344555, 532451, 599144, 604263, 544661, 564713, 237429, 482264, 413921, 499804, 501913, 458300, 530732, 366125, 375240, 597668, 776532, 350205, 506790]
14768E06790M86049m26302r2429j19623K29314K01026k84049J22133L1153K6605
14758F80667j02291J2841l5396B48981N49950C58921K73236j24098j56782N22915
14748H74192D21475J33871J15112k60727L65603m8443L2573K76785l80186K44298
14738I00361l35040J65537L95335D24826J47919J75995j74174J47567M6863L62481
14728A131477n48896P9132J99159l60910K85339J52906j28526j24380j40467O15396
14718A160230j32804J62328l50319o9826L02609k65696j09952M6355M6813L6257
14708H25995k22381K74231J86444j43866O4125k04184K65111j67041J06448p0626
14698I14256l4889J41656n1076R2928K7933j71706L46498j61507l07026r470L2832
$$ y = [506790, 992839, 566537, 474108, 354485, 583799, 784825, 500776, 622909, 654062, 680667, 578376, 591217, 555821, 248981, 798931, 358921, 632157, 508059, 351277, 874192, 421475, 555346, 670458, 409731, 775334, 726891, 759464, 1036249, 656063, 900361, 565321, 730858, 1126193, 424826, 572745, 748740, 574566, 722133, 768996, 1131477, 582581, 661713, 860872, 499962, 785301, 938207, 809681, 685301, 544834, 1160230, 1027426, 1189754, 839435, 769609, 1072218, 806522, 696570, 742925, 789738, 825995, 603614, 877845, 1064289, 920423, 984548, 780364, 1045475, 878434, 984882, 914256, 879367, 1021023, 969947, 1062875, 1090808, 919102, 1265600, 1104093, 797067, 787597, 820429]
14687H20429N960J91081K7758k13460L75251k40897j76735J35657m8835J57031
14677A033240p3871j90310k5013J83562l937r2570K5046k42077K3800K67006J03634
14666A008510j46477L85297k66296j46964J99011L08211j18939l93657J73267
14657A001963K27130l9066k36085J3192L17172m03416J75284L72459k55296j02031
14647A071306N08K42724N3420k68285j31497m3849M73976k18803l43106J01788
14637I38182J26806N4024j467J9473L29420k58513K16023j80511P1811j52357
14627A162891o1735l2854L27003j7160j27952R2774j12760J32672R4129J76653
14617A633661n73904J91575J11347m1653K9828r8477O714L247j25771K64635k61327
$$ y = [820429, 826389, 1017470, 1045228, 831768, 1207019, 966122, 789387, 925044, 876209, 1033240, 959369, 769059, 744046, 927608, 923671, 831101, 856147, 614070, 637870, 904876, 1008510, 862033, 1247330, 981034, 834070, 1033081, 1341292, 1222353, 828696, 1001963, 1229093, 1190027, 953942, 967134, 1284306, 880890, 1056174, 1428633, 1173337, 1071306, 1071814, 1314538, 1367958, 1099673, 968176, 924327, 1398303, 1179500, 836394, 938182, 1064988, 1119012, 1117545, 1137018, 1466438, 1207925, 1423948, 1243437, 1315248, 1162891, 1101156, 1068302, 1395305, 1378145, 1250193, 1342967, 1230207, 1362879, 1457008, 1633661, 1059757, 1251332, 1362679, 1321026, 1350854, 1252377, 1259091, 1262338, 1136567, 1401202, 1139875]
14606A139875K71334L18050j53270M4218j08434j25014J78L43878K1612k02070
14596A550357J01919l156j21359L37270l04246J10446K4491r0903K40265j82548
14586A662536l24791L07846K22048Q8025k36796R5376o6189J81683K54068M629
14576B188435l08319L02262j49661J23246k91971K52406n35295L70229M86910
14567B438242l08334J19870J32657j53878L1266L77235k67319L40131j88662M9114
14557B570322K86603M47410l740J64206K68171P51354P54082J214261K577981
14548I030650M864822P082880J2176309J026488j5076963r153719m311577j662095
14540C976795j066597j0828k48832m14741Q5234J10980j57529r7057k06556L9784
$$ y = [1139875, 1411209, 1729259, 1575989, 1620207, 1511773, 1386759, 1386937, 1730815, 1752427, 1550357, 1652276, 1649120, 1527761, 1865031, 1560785, 1671231, 1695722, 1604819, 1845084, 1662536, 1337745, 1645591, 1867639, 1955664, 1718868, 1814244, 1748055, 1929738, 2183806, 2188435, 1880116, 2182378, 2032717, 2155963, 1863992, 2116398, 1581103, 1951332, 2438242, 2129908, 2249778, 2382435, 2228557, 2259823, 2637058, 2369739, 2709870, 2521208, 2570322, 2856925, 3304335, 3300595, 3464801, 3732972, 4484326, 5238408, 6452669, 9030650, 13895472, 20978352, 33154661, 34181149, 19104186, 9950467, 5638890, 3976795, 2910198, 2899370, 2650538, 2235797, 2321031, 2432011, 2274482, 2177425, 1970869, 2010653]
14530B010653r274K18729o9154j27571R6744J84616K59406k64938j52100K51444
14520B398555m12182L55039j77465N22229j90302K94174j91857j63075K83123
14511B718239L3777r8743L6401P9181l78238N09032O8959j13256m501K59148r5474
14500C014525l2694K08008Q9555n5904j19607L06558j33472L46269k07813j69626
14490C245799K77287m0452j06245o8627J24087K55883n3253K41851j45298n0476
14480C680556R9347j4011P4932L34839m8648k77377N8106j16201L27872o2287
14470D057128j27383K02159M50428l76980M2162K9213J28492J48194J09704K7008
14460D690125J26414n849l6127K36678j86998k49411M30505K04395K0453j65002
$$ y = [2010653, 2001379, 2220108, 2150954, 2023383, 2120127, 2304743, 2564149, 2299211, 2147111, 2398555, 1986373, 2341412, 2163947, 2686176, 2495874, 2790048, 2598191, 2435116, 2718239, 2752016, 2653273, 2689674, 2768855, 2390617, 2899649, 2968608, 2855352, 2850851, 3109999, 3014525, 2981831, 3189839, 3279394, 3223490, 3103883, 3410441, 3276969, 3623238, 3415425, 3245799, 3523086, 3482634, 3376389, 3307762, 3431849, 3687732, 3634479, 3876330, 3731032, 3680556, 3779903, 3765892, 3840824, 4175663, 4127015, 3849638, 3907744, 3791543, 4119415, 4057128, 3929745, 4131904, 4582332, 4205352, 4247514, 4276727, 4405219, 4553413, 4663117, 4690125, 4816539, 4810690, 4774563, 5011241, 4824243, 4574832, 5005337, 5209732, 5230185, 5065183]
14450E065183M45526o8209P7155p8749P0692K5045L23300j2539o8532M81816m53266
14439E807422K86855j35963L39162J43928j82453L15194l51564J31704M98857
14430F853142j17834J43139o5772L00513J3149K39551l13000M53082l12515M01493
14420G594948M8872K83277j07145L92997L12231k16082K81939N6697o5120J83915
14410H766529K55090o14893P17421L62260o8676J08596L0364N55200k46945M22528
14400A0287474K24067j50349M98378J00133l9489M28850K34455j62138O00634
14391A2022015j80309Q9818M52170J86020L85017J23720L75970o2630P7338O21149
14381A4090278M4985M99385J98740K06668L30773L95427L43243M07388K46796
$$ y = [5065183, 5510709, 5442500, 5519655, 5440906, 5511598, 5536643, 5859943, 5847404, 5778872, 6260688, 5807422, 6094277, 5958314, 6297476, 6441404, 6258951, 6574145, 6222581, 6354285, 6853142, 6735308, 6878447, 6812675, 7113188, 7126337, 7365888, 7052888, 7505970, 7193455, 7594948, 7643820, 7927097, 7819952, 8212949, 8525180, 8309098, 8591037, 8647734, 8582614, 8766529, 9021619, 8406726, 9124147, 9486407, 9417731, 9526327, 9556691, 10111891, 9864946, 10287474, 10511541, 10361192, 10859570, 10959703, 10920214, 11349064, 11583519, 11421381, 12022015, 11841706, 11931524, 12383694, 12569714, 12954731, 13078451, 13454421, 13391791, 13469129, 14090278, 14135263, 14634648, 14833388, 15040056, 15370829, 15766256, 16109499, 16516887, 16763683]
14372A6763683J54150J91246M75939J83105N59411M45894L09392J94903P01803
14363A9979526N10244N19895N01113M90082K56437M89045P6693Q55680L52172
14354B4030887P68234N05639N86778O88539N90607Q85127M65700J016741K86175
14345B9824427Q37570R27101P50238P09185J163456R82178R95799J073690N72605
14336C7836249J466482J227720Q61737J346097J005594J339999J277591J684914
14328D8046383J765907J391403J643080J629001K105787J738756J994389J909576
14320F2224282K616533J689142K676927K660525K466789K886503L397458K481580
14312H3099739L787772K964694M066418L369435M236659M323110M555701M755412
$$ y = [16763683, 16917833, 17109079, 17585018, 17768123, 18327534, 18773428, 19082820, 19277723, 19979526, 20489770, 21009665, 21510778, 22000860, 22257297, 22746342, 22823035, 23678715, 24030887, 24799121, 25304760, 25891538, 26580077, 27170684, 28055811, 28521511, 29538252, 29824427, 30661997, 31589098, 32339336, 33048521, 34211977, 35194155, 36189954, 37263644, 37836249, 39302731, 40530451, 41392188, 42738285, 43743879, 45083878, 46361469, 48046383, 49812290, 51203693, 52846773, 54475774, 56581561, 58320317, 60314706, 62224282, 64840815, 66529957, 69206884, 71867409, 74334198, 77220701, 80618159, 83099739, 86887511, 89852205, 93918623, 97288058, 101524717, 105847827, 110403528, 115158940]
14304A15158940N253640N373628N787490N841712O483401O708187P354571P282782
14296A65244351P971957Q206368Q637595R230132R684270J0356633J0529164J1126224
14288B40986694J1762110J2432208J2518147J2813318J3632725J3632701J3889905
14281C31667808J3524298J3392072J3371394J2693837J1948918J1004058R501817
14274D17104202P508476M387188J824840J497397K202746J10572l603595l227389
14266D27804437l958004o939265q632736j0515416j1696294j2364504j3226915
14259C60471303j3514056j4482649j4424598j3649677j3356386j3307632j3307493
14252B64428812j2383745j2212001j1594904j0924175j0313164j0087227r281243
$$ y = [115158940, 120412580, 125786208, 131573698, 137415410, 143898811, 150606998, 157961569, 165244351, 173216308, 181422676, 190060271, 199290403, 208974673, 219331306, 229860470, 240986694, 252748804, 265181012, 277699159, 290512477, 304145202, 317777903, 331667808, 345192106, 358584178, 371955572, 384649409, 396598327, 407602385, 417104202, 424612678, 428999866, 430824706, 432322103, 434524849, 434635421, 431031826, 427804437, 423846433, 416907168, 408274432, 397759016, 386062722, 373698218, 360471303, 346957247, 332474598, 318050000, 304400323, 291043937, 277736305, 264428812, 252045067, 239833066, 228238162, 217313987, 207000823, 196913596, 187632353]
14245A87632353q961477q028826q111150p381743p248000o734065o096427n902703
14237A29167962n738232m978463n148080m869497m558171l916767l694085m191985
14229I2072682l456999l444528l057241l221622l129022k468623k746471k606839
14221F7941337k190887k299445k363762j986437j951811j689554j598952j704533
14213E2155956j464804j896192j245104j384847j499435j042999q31456j586141
14205D1204978j463516j319025q68613p40185r80057n99835j093128p94508j528889
14196C1817222m18611p32690r49316m76231p72830q64742o76716n60610p02989
14187B5662487m40838n48961n59622m66342m82858n82309n59124n05319k42279
$$ y = [187632353, 178670876, 170642050, 162530900, 155149157, 147901157, 141167092, 135070665, 129167962, 123429730, 118451267, 113303187, 108433690, 103875519, 99958752, 96264667, 92072682, 88615683, 85171155, 82113914, 78892292, 75763270, 73294647, 70548176, 67941337, 65750450, 63451005, 61087243, 59100806, 57148995, 55459441, 53860489, 52155956, 50691152, 48794960, 47549856, 46165009, 44665574, 43622575, 42791119, 41204978, 39741462, 38422437, 37553824, 36813639, 35833582, 35233747, 34140619, 33346111, 31817222, 31398611, 30665921, 29716605, 29240374, 28467544, 27602802, 26926086, 26365476, 25662487, 25221649, 24672688, 24113066, 23646724, 23163866, 22581557, 22022433, 21517114, 21274835]
14178B1274835o40275m17717n20437n69319M2188q86804L7848o62323q5185n09247
14168A7063564k14045p6146p00513L26036o01214o74321q2435N9738l35610l20594
14158A4444460l97877j16338k70194l9210m41157J10646k89157n03591k24885
14149A2272697j93525j60556k72406J88124k80390k95861o6532m52456O3480m47533
14139A0355042J25943m56420j94755J0732k41883L32874o50570J41290k67976
14130I154277R5945j6052m97069j42258O7382j80163k08930J6447l30332l6704
14120G922543j40405k0285j9452k89048J09997k06523O2764l4074m18334M94873
14110G462056l64844O991n52600j33237J61794K10558j97383l44370j3669j90766
$$ y = [21274835, 20634560, 20216843, 19696406, 19127087, 19169275, 18282471, 18320319, 17657996, 17572811, 17063564, 16849519, 16773373, 16072860, 16398896, 15797682, 15123361, 15040926, 15100664, 14765054, 14444460, 14046583, 13930245, 13660051, 13620841, 13179684, 13290330, 13001173, 12497582, 12272697, 12079172, 11918616, 11646210, 11834334, 11553944, 11258083, 11191551, 10739095, 10802575, 10355042, 10480985, 10024565, 9829810, 9840542, 9598659, 9931533, 9280963, 9422253, 9154277, 9250222, 9234170, 8737101, 8594843, 8662225, 8482062, 8273132, 8289579, 7959247, 7922543, 7782138, 7761853, 7742401, 7453353, 7563350, 7356827, 7419591, 7385517, 6967183, 7462056, 7097212, 7104203, 6551603, 6418366, 6580160, 6790718, 6593335, 6248965, 6235296, 6044530]
14100F044530j02382L85250l94529l4444J61303J7630l26551J0210k86678n1992
14090E422347K15174j41255p9145k52737K37573l72006j15628J57309J27221l63083
14080D835770l6642K72421j18318l65039L3355N9659j05006j57687J31081j48428
14070D401166J77383m07181m0757j1841L03718l63308K78961N2960K1500k23400
14060D189201Q4998J4964k28062K93552m41119K48798m54571r3635K42099l9414
14050C816811m32466J45027n3344j02633J95917l41763K84032j71887l54311K51910
14040C237293M039j0018J47966k5210j47174k87465L89153p190k53424M22113
14030C470083l16259m5279J06487r0441n03126J67879k613K71501m04476J89123
$$ y = [6044530, 5942148, 6327398, 5932869, 5898425, 6059728, 6077358, 5750807, 5761017, 5474339, 5422347, 5637521, 5496266, 5417121, 5164384, 5401957, 5029951, 4914323, 5071632, 5198853, 4835770, 4799128, 5071549, 4953231, 4588192, 4621547, 4681206, 4576200, 4418513, 4549594, 4401166, 4578549, 4171368, 4130611, 4118770, 4422488, 4059180, 4338141, 4391101, 4412601, 4189201, 4274199, 4289163, 4061101, 4354653, 3913534, 4162332, 3707761, 3614126, 3856225, 3816811, 3384345, 3529372, 3476028, 3373395, 3569312, 3227549, 3511581, 3339694, 2985383, 3237293, 3241332, 3231314, 3379280, 3354070, 3206896, 2919431, 3308584, 3301394, 3047970, 3470083, 3153824, 3108545, 3215032, 3124591, 2621465, 2789344, 2786731, 3058232, 2653756, 2842879]
14020B842879R1609k78601o5227N6740J63133j30489L1251j30475J39063k11088
14010B508795j18342P1070J53413l49442O9605Q3090n7418J92689j27188J60334
14000B586606l29233k61675L57119j62981J50233J78461j6447j54712M65686L68572
13990C181629J99701J905659L274823O098930J1208876Q766315j0344152r241547
13982A5050234n479571k461522j298330p87730j062531l70490J31307m57565o9592
13973C194210l39144l71978J69473n5961p9568J9796o0239q1283L799r97n6999
13962B341109j58738O0678K32309l12456K30589n33000K37417J13390l38598N45857
13952B418557o07205L5655M55476j99146l58523j58598K73265K3800m6755K6651
$$ y = [2842879, 2934488, 2655887, 2590660, 2647400, 2810533, 2680044, 2711295, 2580820, 2719883, 2508795, 2390453, 2461523, 2614936, 2265494, 2335099, 2418189, 2360771, 2553460, 2426272, 2586606, 2257373, 1995698, 2352817, 2189836, 2340069, 2518530, 2502083, 2347371, 2813057, 3181629, 3381330, 5286989, 8561812, 14660742, 25869618, 34635933, 24291781, 15050234, 9570663, 7109141, 5810811, 5023081, 3960550, 3590060, 3721367, 3263802, 3194210, 2855066, 2483088, 2652561, 2596600, 2517032, 2536828, 2476589, 2395306, 2399105, 2398108, 2341109, 2182371, 2243049, 2475358, 2162902, 2393491, 1860491, 2097908, 2211298, 1872700, 2418557, 1811352, 1847007, 2302483, 2103337, 1744814, 1586216, 1859481, 1883281, 1836526, 1863177]
13942A863177L59317k95771k53444J45967k60191M50599k61380R837K54905k30284
13932A782732j02364J95174K8454k48161L59100J81746l11895j03543l79715J88680
13922A590208Q5898q3475Q1536l69721L13822j69816r8935L04857n4374p6208
13912A523792J34213j58763j86069J42428L2909k3278p5353k89890N25223j04832
13902A520380J02949l17981K29765k45392P0889l69773K68169O8840p6889K93063
13892A544020l90659M79658k42196j16545j48842J85918K43887l70581j6675m2841
13882A125144J76066j66348K36684r1071r7129j3715K3457K80894J0737p24193
13872G60526K69356j98459J73885j36353L93585m03858M26095r1738j86847L03770
$$ y = [1863177, 2222494, 1926723, 1673279, 1819246, 1559055, 2009654, 1748274, 1758111, 2013016, 1782732, 1680368, 1875542, 1903996, 1655835, 2014935, 2196681, 1884786, 1781243, 1401528, 1590208, 1676106, 1592631, 1674167, 1304446, 1618268, 1448452, 1349517, 1654374, 1600000, 1523792, 1658005, 1499242, 1313173, 1455601, 1488510, 1465232, 1389879, 1099989, 1625212, 1520380, 1623329, 1305348, 1535113, 1289721, 1360610, 990837, 1259006, 1327846, 1250957, 1544020, 1153361, 1633019, 1390823, 1274278, 1125436, 1311354, 1555241, 1184660, 1167985, 1125144, 1301210, 1134862, 1371546, 1280475, 1183346, 1169631, 1193088, 1473982, 1484719, 760526, 1029882, 831423, 1005308, 868955, 1262540, 858682, 1284777, 1193039, 1006192, 1309962]
13862A309962m15354K69561j15140K33110j39579r629k95163K74014k66947J86406
13852A031241P2696N8867R8691k03851o7032K98046J46353F89047L21196J62147
13842A172390j59342L8755l2908J18166j83698j26485P6310O5088J6333Q0664
13832A065273J6305n3386k54289K40330J5704j22355n6571L73362j36888o4155
13822A023330j07377J13729k83339K84635j83761J13477o14j01083L63729j96666
13812A026060j44082k46645P1964R3639J74993o8597J06959l20625J98028k21675
13802F70019K30863k49706O78305E28193J43131Q1199j049k08193j36697M23565
13792H30149n3744K42357l68064K37139k80718L22405n914r4820C13714J78457
$$ y = [1309962, 894608, 1164169, 1049029, 1282139, 1142560, 1132931, 837768, 1111782, 844835, 1031241, 1103937, 1162804, 1261495, 1057644, 990612, 1288658, 1435011, 689047, 1010243, 1172390, 1013048, 1051803, 1018895, 1137061, 953363, 826878, 903188, 968276, 984609, 1065273, 1081578, 1028192, 773903, 1014233, 1029937, 907582, 851011, 1224373, 1087485, 1023330, 915953, 1029682, 746343, 1030978, 847217, 960694, 960080, 858997, 1222726, 1026060, 881978, 635333, 707297, 800936, 975929, 907332, 1014291, 693666, 891694, 670019, 900882, 651176, 1329481, 528193, 671324, 752523, 751474, 543281, 406584, 830149, 776405, 1018762, 650698, 887837, 607119, 929524, 923610, 828790, 313714, 492171]
13782D92171J25770r8179L31545j18604j56449Q2503J32373r8092J76374j42536
13772G26876k09914N03091j68030l00980j38023J32302J88416m1448r4511M77498
13762A075277m26351r3520J33818k34998J61213J02781J93734k94778R5878C38046
13751G83658j85164J45994J56244k69097K37726j85307J44291j68902j28874L18398
13741H48967j5537D02322N07390l22038J090K17310j69628j35971n9889j47423
13731B93163K93816Q7610k58409J01096J33857J79741m13068J59080K62040C78841
13720B88537J41695N86023D39231M54718C21130L93807j79976j93590M1176L70779
13710G53326o8865n9564J85276k85551K17847j774j98842L72648j82822k94983
$$ y = [492171, 617941, 519762, 851307, 732703, 576254, 658757, 791130, 693038, 869412, 726876, 516962, 1020053, 852023, 551043, 413020, 545322, 733738, 692290, 597779, 1075277, 648926, 555406, 689224, 454226, 615439, 718220, 911954, 617176, 713054, 338046, 783658, 598494, 744488, 900732, 631635, 869361, 684054, 828345, 659443, 530569, 848967, 833430, 402322, 909712, 587674, 588764, 806074, 636446, 500475, 440586, 293163, 586979, 674589, 416180, 517276, 651133, 830874, 417806, 576886, 838926, 378841, 288537, 430232, 1016255, 439231, 893949, 321130, 714937, 534961, 341371, 382547, 753326, 684461, 624897, 810173, 524622, 742469, 740695, 541853, 914501, 731679, 436696]
13700D36696M90715l39020M7244r1577j27795B05789M67726k35224J39126J61414
13690G38831j69627M5765k21480L25806j76781j21374o0667K10156k12687K34380
13680E92322r4332m7401J2199Q8516A99013K61558L4634r2101J10465j67866J59152
13669E04855j25096Q8437n967j29101J00767L72916k12337j05473K5850J0672
13659E25523p6409r4779K5741Q3087Q8894J03744C12371J68977j23774n7024J53437
13648D53987j35589J12747J05448O3220k94316K43737J4534j67198J29397J44194
13638F70161j04671j50913l343K04159p886j14075B39686K43141Q098r3836L11528
13627G08617k73292o9497N0781n7679J05814k26348M23009C27878O4481M611M2700
$$ y = [436696, 927411, 588391, 635635, 544058, 416263, 205789, 673515, 438291, 577417, 738831, 569204, 614969, 393489, 719295, 542514, 421140, 360473, 570629, 357942, 592322, 497990, 450589, 462788, 551304, 199013, 460571, 495205, 403104, 513569, 345703, 504855, 379759, 468196, 462229, 333128, 433895, 806811, 594474, 489001, 514851, 525523, 449114, 354335, 380076, 463163, 552057, 655801, 312371, 481348, 357574, 300550, 453987, 318398, 431145, 536593, 599813, 305497, 549234, 563768, 396570, 525967, 670161, 565490, 414577, 411234, 615393, 607507, 493432, 239686, 482827, 490925, 397089, 708617, 435325, 365828, 416609, 358930, 464744, 238396, 661405, 327878, 392359, 396970, 439670]
13616D39670K69429j35528J3290j48539j23028A38027l7635L35903J0666J6158
13606D63119j42438A21711L35339J70136k88066k5374l9275B6205J09463K78928
13596D14596j46022A20136k5620N01675H8654K80016G2975K1066K17525m3865
13586B67701A05918m8270K68163M6683j77762K01231j86937M6944K08040A78362
13575A31004J70444M0002M8545j5584M0327j72544N0052G2777M17507m8638A66361
13563D48688A20624J96208A27918J84642r8669K36049K3769J0080A42767K39421
13553C82188J60778l1037j82860L75662C00616R4862D7888L53214M8859m7644
13543D02317j43760J27463q326j06093O8399m7970K35961B63728f8687K565E40249
$$ y = [439670, 709099, 573571, 586861, 438322, 315294, 138027, 100392, 436295, 446961, 463119, 320681, 121711, 457050, 627186, 339120, 313746, 274471, 26205, 135668, 414596, 268574, 120136, 94516, 596191, 88654, 368670, 72975, 94041, 311566, 267701, 105918, 57648, 325811, 372494, 194732, 395963, 209026, 255970, 464010, 178362, 131004, 301448, 341450, 389995, 374411, 414738, 242194, 292246, 72777, 490284, 441646, 166361, 448688, 120624, 316832, 127918, 312560, 213891, 449940, 473709, 483789, 142767, 382188, 542966, 511929, 329069, 704731, 300616, 395478, 47888, 401102, 449961, 402317, 258557, 386020, 377694, 271601, 340000, 292030, 527991, 263728, -68687, -66122, 540249]
13531E75098B29911K7867p1284H9344K01539A14019b39651A03389m8710O3627
13521A18306B6345L88033l9224A00701O9789L30049j40093q4596L2671K44385
13511E52906A80173Q3756L4712A38284M04715A69497N04030k11748j59018j32695
13501A70066f3774C19708j29713b7147D37286C8082K17670k7773J15813n1379
13491B92413O6697O7646k7818j14031q0400J37906A53503K92261A50996E5190
13480F01768k20558A80473J14258A59J70706K05386I1341K03095b25721B34329
13469D77877B11519F0163M68327B07832c0329D64877B16712J76833F8677L04695
13459C73372j81885J91097j59164j11376L24683A49214J49419K6931K55407o8737
$$ y = [575098, 229911, 257778, 186494, 89344, 290883, 114019, -239651, 103389, 54679, 118306, 26345, 414378, 375154, 100701, 170490, 500539, 360446, 275850, 308521, 552906, 180173, 263929, 298641, 138284, 542999, 169497, 673527, 461779, 302761, 170066, -63774, 319708, 189995, -27147, 437286, 38082, 255752, 227979, 343792, 292413, 359110, 426756, 398938, 284907, 204507, 342413, 153503, 445764, 150996, 55190, 601768, 381210, 180473, 294731, 159, 170865, 376251, 91341, 294436, -225721, 234329, 477877, 211519, 60163, 528490, 207832, -30329, 464877, 216712, 393545, 68677, 373372, 191487, 382584, 223420, 112044, 436727, 149214, 298633, 325564, 580971, 512234]
13449E12234k08479K04027j59348b1050C98391b66192C73083h6057F919J37353
13439A44272j0586K06274q8943J02950j39083A05815L19594o6185j2383J86754
13429E33595C9624N16095k68439p1974J4685J7832m8939l5542m8307L24104k06149
13418B32990p4174P6978m0526O6749n2829G5748J79777d2676A50207F6115o788
13407E9327K40254Q6638P9572I6428J94080J07523E2358J83804K44908o3101F2412
13395B20616J69977A00457b19881D63297k3845j61392N544A07963K17092A06710
13384B5527J93776K0911F4252K86964A58337o6984R4121P5048C3128M55855j39207
13373C49776J12494A45581J00232d3221B74771j32143e8190C82286H0091M38730
$$ y = [512234, 303755, 507782, 348434, -21050, 398391, -266192, 373083, -86057, 6919, 144272, 133686, 339960, 251017, 353967, 214884, 105815, 425409, 359224, 346841, 533595, 39624, 555719, 287280, 215306, 229991, 247823, 198884, 163342, 115035, 439139, 232990, 158816, 235794, 195268, 262017, 209188, 75748, 255525, -42676, 150207, 66115, 59327, 299581, 386219, 465791, 96428, 290508, 398031, 52358, 236162, 481070, 417969, 62412, 220616, 390593, 100457, -219881, 463297, 439452, 278060, 283604, 107963, 325055, 106710, 25527, 219303, 240214, 64252, 351216, 158337, 91353, 185474, 260522, 33128, 488983, 349776, 462270, 145581, 245813, -43221, 274771, 142628, -58190, 382286, 80091, 518821]
13363E18821c9128B54035r0052b959A99818m2350F4390J62544f9347A06200L02372
13352D08572A47249C419J05647J24583c2015D11531O804N1532j16772b6377A03619
13340B50051K29985N1059j57165B0323J94847F9602J82980I8095K77475o9244
13330C06326j44884J06429K74466B62570h306A15420Q9920G1752A9834e9550E18835
13318B98408A37551P7242F0313M89285B32484Q9492n9312G965L75725B2318J14785
13307A37103F8351A5823Q4400J84426c22847G5798M3479d3104C04734a83103G0094
13295A71411J13025A40292J51022o7546a60063I7583m5093L92223a73903A92041
13284A25403m3328N8833l5963R2285J22451J0056h2542B02764b67212B3527Q6307
$$ y = [518821, -39128, 254035, 163983, -2959, 199818, 157468, 64390, 226934, -69347, 106200, 408572, 147249, 3419, 109066, 233649, -32015, 411531, 418335, 469867, 353095, -26377, 103619, 250051, 480036, 531095, 373930, 20323, 215170, 69602, 252582, 98095, 375570, 306326, 161442, 267871, 542337, 262570, -8306, 115420, 205340, 71752, 19834, -59550, 518835, 298408, 137551, 214793, 60313, 549598, 232484, 321976, 262664, 7965, 383690, 22318, 137103, 68351, 15823, 100223, 284649, -322847, 75798, 119277, -43104, 304734, -183103, 70094, 171411, 284436, 140292, 291314, 223768, -160063, 97583, 52490, 444713, -173903, 192041, 125403, 82075, 140908, 104945, 197230, 319681, 329737, -82542, 202764, -267212, 23527, 109834]
13273A09834P6439l7301A1629R0565P2861a61656A24706b0683C56J1574L7419
13262D9349b68504D5658c1255F8860L4557K82628n7107I6940J09624E8241L38205
13251C96446j27640B2996a5070B24834O718F3011J87700H8780N7973B7664R9024
13240A26688d5542A93397P4647l150C6166J00544d9865B16820J26714p0917R4658
13229C67275B5197J89329I7000h506A47099a86991F9547a07879B06377R5267G9110
13217f7306n9017O0177j24893C16485F3979K35856A33199J3998P3760a00157C31328
13205B69691q0240c2286m9008A31135J77420q0877j05182J91986C5570K38835
13195B74405q5248A5684a27753j65379e2739C1309d3684I0901a06528A90321p6327
$$ y = [109834, 186273, 148972, 11629, 102194, 175055, -161656, 124706, -20683, 356, 11930, 49349, -268504, 45658, -31255, 68860, 103417, 386045, 328938, 96940, 206564, 58241, 396446, 268806, 22996, -15070, 224834, 231552, 63011, 250711, 88780, 146753, 27664, 126688, -45542, 193397, 268044, 264894, 36166, 136710, -49865, 216820, 343534, 272617, 367275, 25197, 214526, 97000, -8506, 147099, -186991, 69547, -107879, 206377, 301644, 79110, -67306, -126323, -66146, -191039, 316485, 63979, 299835, 133199, 147197, 220957, -100157, 331328, 269691, 189451, -32286, -81294, 131135, 308555, 227678, 122496, 314482, 35570, 274405, 189157, 15684, -127753, -293132, -52739, 31309, -43684, 90901, -106528, 190321, 113994]
13184A13994O9348m1286C3685b2251B8349b5798C91119j51314A00339K37183n3975
13173B83547l0053j02112L5404K55784H532Q9737J28872H6878a63176H7324K50713
13162C38037j51645o5616l5403M927M276b39125A71030b63651e0483A05047P5911
13151A80958e6244C14650j04689O7623k4488b4642j16696O2195B59969R0651A26945
13139D0584K62720j12702m2920a7586A1781K59963a1649A56331i6082B70885H0460
13127B33686H2914k3638I71J15316J8241r575M581J67675b01203q164O8248D00087
13114A89055a09836J7369C3618J42170I793J06362D728e1916A69084j6809R3191
13103B45466a49715A81644a05259k05135G538a71636c3633d846m3435A51627L4720
$$ y = [113994, 183342, 142056, 33685, -22251, 28349, -25798, 391119, 239805, 100339, 337522, 283547, 253494, 151382, 186786, 442570, 8532, 98269, 227141, 86878, -163176, 87324, 338037, 186392, 120776, 85373, 90300, 94576, -239125, 171030, -263651, -50483, 105047, 180958, -56244, 314650, 209961, 277584, 253096, -24642, -141338, -79143, 259969, 350620, 126945, 40584, 303304, 190602, 147682, -17586, 11781, 271744, -11649, 156331, -96082, 270885, 80460, 233686, 82914, 59276, 971, 116287, 134528, 124953, 129534, 297209, -201203, -209367, -141119, 400087, 189055, -109836, -92467, 33618, 175788, 9793, 116155, 4728, -51916, 169084, 152275, 245466, -149715, 181644, -105259, -310394, 7538, -171636, -33633, -4846, -48281, 151627, 186347]
13092A86347B9730J28174l1845l2160j2457B2295J63716a18222C5506a45202A97144
13080A25461c69040B19256o9265N254Q8012p5792J33052H6589j0376L767O9958
13069A49938p0353c9135D20901j90885I8414e1778H6218P7089b62424d9050C53535
13057I4228d8457p1777A50573k1862B8590N4637e5883k9331B83523p0676L0474
13046B43321F6950L17443F997K04631b66133A91825P4661A18835N8246b6300A80613
13034A42246J66329B1297b0812j29383G2017M01483c2564B07283D8515a4221E4418
13022B79510J2722H1405h3212K4315A25683L7402p6059K0772J84005G3399B0232
13010A84120F439J19162J48971j28016l7241c0640A43080R5370B9096J53505K16464
$$ y = [186347, 29730, 157904, 126059, 93899, 81442, 22295, 186011, -118222, 35506, -145202, 197144, 125461, -369040, 219256, 149991, 155245, 243257, 167465, 300517, 86589, 76213, 79980, 149938, 79585, -39135, 420901, 230016, 98414, -51778, 86218, 163307, -262424, -49050, 353535, 94228, -48457, -120234, 150573, 128711, 28590, 83227, -55883, -85214, 283523, 212847, 243321, 66950, 384393, 6997, 211628, -266133, 191825, 266486, 118835, 177081, -26300, 180613, 142246, 308575, 21297, -20812, -150195, 72017, 473500, -32564, 207283, 48515, -14221, 54418, 279510, 292232, 81405, -83212, -58897, 125683, 163085, 87026, 107798, 291803, 73399, 20232, 184120, 6439, 125601, 274572, 146556, 109315, -30640, 143080, 238450, 29096, 182601, 399065]
12999C99065n9860A34699a45710j28389B5367J19502b46825A56438a6671D2832
12988e6425A0878J23611i139G0816J9896C4440c38086L3086A03522e3999B25512
12976B8249P0350e3115B46038j05814a43995A67809P5645L6410a6863A33293m6476
12965H6817b8087r3169B501d7438A26543Q4118g85B42668A9055K51073j32107
12954A38021j7370K25593A09334D7067J66378I2233d2651E9670a04523j42571
12944b47094R3515A21989E3579M09885E1967e1399a2519m3359j52754d952r6010
12933a00962B97698a37439D14396A13975e6528A78469K628d02590a55434k5129
12923a80563A1821J12977B7640a843B99042A00976a05831M724A348J96116C5604
$$ y = [399065, 339205, 134699, -145710, -274099, 25367, 144869, -246825, 156438, -16671, 42832, -56425, 10878, 134489, -9139, 70816, 90712, 34440, -338086, -305000, 103522, -53999, 225512, 28249, 98599, -53115, 246038, 140224, -143995, 167809, 243454, 279864, -16863, 133293, 86817, -28087, -121256, 2501, -47438, 126543, 210661, -785, 242668, 19055, 270128, 138021, 120651, 346244, 109334, 47067, 213445, 92233, -42651, 59670, -104523, -247094, -153579, 121989, 53579, 463464, 51967, -51399, -12519, -55878, -208632, -4952, -100962, 297698, -137439, 414396, 113975, -56528, 178469, 181097, -402590, -155434, -180563, 11821, 124798, 27640, -1843, 299042, 100976, -105831, -101107, 1348, 197464, 35604]
12911d4136C5894O8558J32247b06398i9129A03601a19999K9189p3124E7793J31177
12900A88970F270M2182N7903b46694e6851B63041I3912g548B06831a45473O7285
12889g8188D25361A1658K63868r8841d8992B75774d6788C04935a47120l1167A57988
12877B49442j17460a97B45452h119A23531o1637O3075L23916a00781n0019A82309
12865d7821A31773a51558A850b80960g5762B49292a37455H895J15727D8044J03299
12854A51343d8724j65786j4866A97539a73172P2653A0871c05140c3260j39865
12844a73125A14749J02227c9823B65099F1354J71513c142B1024b14928A33837
12833a44463A77392b2809k27497A44599e08425H2717A5861b2354C45687i725j26222
$$ y = [-44136, 35894, 104452, 236699, -206398, -99129, 103601, -119999, -90810, -163934, 57793, 188970, 6270, 48452, 106355, -246694, -56851, 263041, 93912, -7548, 206831, -145473, -78188, 425361, 11658, 275526, 176685, -48992, 275774, -46788, 304935, -147120, -178287, 157988, 249442, 131982, -197, 245452, -8119, 123531, 61894, 124969, 448885, -100781, -150800, 182309, -47821, 131773, -151558, 1850, -280960, -75762, 249292, -137455, 8895, 124622, 48044, 151343, -48724, -214510, -229376, 197539, -173172, -100519, 10871, -305140, -33260, -173125, 114749, 216976, -39823, 265099, 61354, 232867, -3142, 21024, -214928, 133837, -144463, 177392, -22809, -250306, 144599, -508425, 82717, 15861, -22354, 345687, -9725, -135947]
12822a35947B66200j31485F7015J97016J8747b07211O0616d1406k0280j07531
12812a69217l4340B2191K4558J06498a96697G7500g7246K3049k7001F9648C1387
12800D3967c14280a47099K100k09416B88342d59809B7831h1556o6349A59903b24749
12788A42456h1916b2967m2490A79811A8521L7215j2020a19175l64154a76405A54347
12776g7315B030K47302i5607o6324I4652a60536K9215j97400G4345M9178a24059
12764b21129c2048l7037C5951K1803a66112K6997l8275H9685H325a66768j93311
12753c60079J56250B30306c28985d6342j60466D99405b75488a04079j14062D36942
12742C85434a64667C5480J30569J51521L4857A53820i4618k9473K6562I7073L44131
$$ y = [-135947, 266200, 134715, 67015, 264031, 282778, -207211, -146595, -41406, -61686, -169217, -203557, 22191, 46749, 153247, -196697, 77500, -77246, -54197, -81198, 69648, 31387, 43967, -314280, -147099, -144999, -354415, 288342, -459809, 27831, -81556, -147905, 159903, -224749, 142456, -81916, -22967, -65457, 179811, 18521, 55736, 43716, -119175, -483329, -176405, 154347, -77315, 2030, 249332, -95607, -161931, 94652, -160536, -131321, -328721, 74345, 123523, -124059, -221129, -32048, -69085, 35951, 57754, -166112, -139115, -177390, 89685, 8325, -166768, -360079, -203829, 230306, -328985, -46342, -206808, 499405, -275488, -104079, -218141, 436942, 385434, -164667, 35480, 166049, 317570, 352427, 153820, -94618, -124091, -97529, 97073, 441204]
12731D41204b47304B14392a71523b5282A65798d9260j11813A8543b1290A11835
12720b7653j77964e8879A64834Q6079a01226A86717J13437P5105j21204F7360
12709D30685A35538a93082B32024j00975J2503L07099k8096j87225m6095n94L1663
12698B20304F8624J19395a88067B63071C1886d6696C50343d8110l7456k11276
12688b96842a7025l6641p4729F2417j1108F988b62720G6769N8486J43599e4515
12676g1087D54740j57348J33391A83411J21034A45894b52041O8881N0639j09679
12666b42200b1972A40404c2703r0484k17395B1753J24107Q9712h395j9747B27785
12654h2097r9283A13862o386j6924f2429k0593B63804A05161d0798F5862b2050
$$ y = [441204, -247304, 214392, -171523, -25282, 165798, -49260, -161073, 18543, -21290, 111835, -27653, -205617, -58879, 164834, 250913, -101226, 186717, 300154, 375259, 254055, 67360, 430685, 135538, -193082, 232024, 131049, 143552, 450651, 422555, 235330, 189235, 188641, 220304, 68624, 188019, -188067, 263071, 31886, -46696, 350343, -48110, -85566, -296842, -17025, -53666, -128395, 62417, 51309, 6988, -262720, 76769, 135255, 278854, -54515, -71087, 454740, 297392, 430783, 183411, 304445, 145894, -252041, -183160, -132521, -242200, -21972, 140404, -32703, -123187, -340582, 21753, 145860, 235572, -8395, -28142, 227785, -82097, -181380, 113862, 107476, 90552, -62429, -83022, 263804, 105161, -40798, 65862, -22050]
12642B40612a57827J0820A63278P0070I3629a84745I5901J02233b22559B92058
12631C52930p0459B7816P8180d7413B59094n6429G9770J03540a03342A32278m2441
12620H9837m0410k3319c4329O865I8089h4913d2394j26341l7911d36C32745m1277
12608B91468B7339J7731J5421R846J31125a62689A99600p5629K04207d0250A541
12596A05454L02767b7384D33537b20238c4131k56520H5490N2348a8918E6610b81422
12584a0663A35774a23652N8282A09641J30049E8143K0721J63320a05664m9634
12574a55298e4468B5780b13870D33306B08782i4269n6626F1095J31301H348J45332
12563A53680C5261a56223C19275A51615A1261a04074a8288A14052I602N5455M4133
$$ y = [240612, -157827, -147007, 163278, 233348, 93629, -184745, 95901, 198134, -222559, 292058, 352930, 282471, 27816, 105996, -47413, 259094, 202665, 79770, 183310, -103342, 132278, 89837, 49427, 26108, -34329, -27464, 98089, -84913, -42394, -168735, -206646, -436, 332745, 291468, 27339, 45070, 60491, 70337, 201462, -162689, 199600, 123971, 328178, -40250, 1541, 105454, 408221, -27384, 433537, -220238, -34131, -290651, 85490, 137838, -18918, 56610, -281422, -10663, 135774, -123652, -65370, 109641, 239690, 58143, 78864, 242184, -105664, -155298, -54468, 25780, -213870, 433306, 208782, -94269, -150895, 61095, 192396, 8348, 153680, 35261, -156223, 319275, 151615, 11261, -104074, -18288, 114052, 9602, 65057, 109190]
12552A09190N20a41037e2607r1396A90746J84471b83401A28505D543a58033D3513
12540a08265A27129o3535f3499k32702J37205l0832j0681L0573c2323j17219J4883
12529a34659e985B4703J4869f1078b0171m5227j40992B42298d6529L089A76638
12517a48354B74183L1346a04849E89652B04629a50183d3786F6605A5853M27138
12507D42991c2016B0542h4288A226J4429O2017J04009B1030g7974k00986C6147
12495H1518N4898f1990n6391G8863H423L99847D0510J08979P7531a673j93012
12484a94685I8327B0818N8670a18080n538F763N3330Q1552L7181b3494k89160
12473c12654a03275l00519G0158e9932j04671d7354B62750F6575A5897L00186
$$ y = [109190, 109710, -141037, -52607, -144003, 190746, 375217, -283401, 128505, 4543, -158033, 43513, -108265, 127129, 63594, -63499, -296201, -158996, -189828, -200509, -169936, -32323, -149542, -134659, -5985, 24703, 39572, -61078, -20171, -65398, -206390, 242298, -46529, -43440, 176638, -148354, 274183, 305529, -104849, 589652, 204629, -150183, -43786, 66605, 15853, 442991, -32016, 20542, -84288, 1226, 15655, 77672, 181681, 21030, -77974, -278960, 36147, 81518, 136416, -61990, -118381, 78863, 8423, 408270, 40510, 149489, 227020, -1673, -194685, 98327, 20818, 79488, -118080, -123618, 6763, 60093, 141645, 178826, -23494, -312654, -103275, -403794, 70158, -59932, -164603, -47354, 262750, 66575, 15897, 316083]
12463C16083c10515N3481B90629L2806c9016C2345e3899j06531P1286p4864F5516
12451C9009J07925E9664A298i0303B35695a56539E5586b89410J31958M3582j58195
12440b72065B25687A3251b23967G8222K0081g7714b3791B82680M6561e25704C0793
12428F4536L6308a02097n6832A41990o6129a61909A6446a28218O07a6224l51296
12417c67520J36050M0232f9764j27565l8835P2180C719g6229C523a85383c1996
12405A34928P0055c83674B32902e0190B67568b33788E450b50878A82424a34622
12394a16449q5844L5005J3417A7906J64992K56188j20404c73691A8683b27001
12383B80862b41557f3218P037A36879g9225A84937a42470D3391J05290H293K39206
$$ y = [316083, -310515, -257034, 290629, 323435, -39016, 32345, -53899, -160430, -89144, -164008, 65516, 39009, 146934, 59664, 1298, -90303, 235695, -156539, 55586, -289410, -157452, -113870, -272065, 225687, 13251, -223967, 78222, 98303, -77714, -23791, 282680, 329241, -525704, 30793, 64536, 100844, -102097, -158929, 141990, 75861, -161909, 16446, -128218, -127611, -16224, -367520, -231470, -191238, -69764, -197329, -236164, -163984, 3719, -76229, 3523, -185383, -31996, 134928, 204983, -383674, 232902, -50190, 267568, -233788, 5450, -250878, 182424, -134622, -116449, -202293, -167288, -153871, 17906, 182898, 439086, 318682, -373691, 18683, -227001, 280862, -241557, -63218, -56181, 136879, -79225, 184937, -142470, 43391, 148681, 8293, 247499]
12372B47499a978G6085a65046G8836K38938f4703j81735B7209J30194a25502M1798
12361h3704B5637J68737I6028a68966E8486L40298c13964B93932q2200a50290
12350a21580j53855D7722a15796A2357M5231M3021P1021b16632F374b2132j89182
12339b11314c7850k63004J37861A57304H449K68115j12600b4950D64326G502f610
12327c93676A45087l3601a75208h7346D5558L06c6639j13087F0178a66536j79412
12316c45948d0501A24732E5852J87824b11783k5691j06235B54751a24285A02268
12305A56533d96850A57262R1651b07755J1179A88661j8751a28053N8589A393Q8807
12294I0200g7211c6810m0208A21975a5944A24757J564C6665g3548L3850A72897
$$ y = [247499, -1978, 76085, -165046, 78836, 317774, -64703, -246438, 27209, 157403, -125502, -83704, 25637, 194374, 96028, -168966, 58486, 398784, -313964, 293932, 211732, -150290, -121580, -275435, 47722, -115796, 12357, 57588, 100609, 171630, -216632, 6374, -22132, -211314, -37850, -300854, -162993, 157304, 8449, 276564, 163964, -24950, 464326, 7502, -6610, -393676, 145087, 111486, -175208, -87346, 45558, 45864, -36639, -149726, 60178, -166536, -345948, -40501, 124732, 55852, 243676, -211783, -237474, -343709, 254751, -124285, 102268, 156533, -496850, 157262, 248913, -207755, -196576, 188661, 169910, -128053, -69464, 1393, 90200, -77211, -36810, -77018, 121975, -15944, 124757, 126321, 36665, -73548, -39698, 172897]
12282B09365a38642A39000N6998K16481f6152C4674O8885L02013A39339N4608
12272A93947c26759C9818N943J13491D454a8431o5620C00608n4081f4538J6553
12261d7985j35763O909B16565j3411d0692m9794B2430N14b93724D09293A88541
12249a27179A31064i5858A53079o3068J85855H1947b17348A15549J14103A02754
12238B77241F3392j5070L2045L3925C8641N4830L2204A4385K08736K9399f1145
12226g5539B31676b0196A22446K39997j51177C8439A4034P2091R4039R344k6781
12215A62727p6451K33385r7890a65182A67220J4677l6956d4694E3862K1558J57810
12204B33230p401n8820A6694Q6798L28141j39432C2860L6555M29504A82907o9237
$$ y = [209365, -138642, 139000, 195998, 412479, -66152, 34674, 103559, 405572, 139339, 193947, -326759, 39818, 45761, 159252, 4454, -18431, -84051, 300608, 246527, -64538, -47985, -183748, -176839, 216565, 203154, -40692, -90486, 22430, 22944, -293724, 409293, 188541, -127179, 131064, -95858, 153079, 90011, 275866, 81947, -217348, 115549, 229652, 102754, 277241, 63392, 48322, 80367, 114292, 38641, 93471, 125675, 14385, 223121, 252520, -61145, -75539, 231676, -20196, 122446, 362443, 211266, 38439, 14034, 86125, 180164, 189508, 162727, 86276, 319661, 221771, -165182, 167220, 181897, 144941, -44694, 53862, 75420, 233230, 225829, 167009, 16694, 103492, 431633, 292201, 32860, 69415, 498919, 182907, 113670]
12193A13670c6603B9356j2031K51785A6712L99331E4971O3962J25548J7950D0827
12181B62544c6888F2531j7271a20019A08907a13215A04469a24033d5480F03935
12170C0696J07450i6690A32671Q0912J73215b413A09060j4315a16171j36454E1088
12158b71350A06666R5734H4476R9600g8190D29970A12509h2012B44379a48777
12147A28965f3867F6082a84734J0561A68410c6332m9002j07580k4807A71934c9514
12135A61630j9678J12954A07229B782R6174M55056i6184c9849H6312i8414J4197
12124h4217b0525n1199b2269B9847J03040b11935I9838q364C334L15246A25533
12112i6499m1958d3228j37596B49778a32B25033c477q0465m9825B0531J17860
$$ y = [113670, -36603, 29356, 17325, 269110, 16712, 416043, 54971, 118933, 244481, 262431, 40827, 262544, -36888, 62531, 45260, -120019, 108907, -113215, 104469, -124033, -45480, 603935, 30696, 138146, -96690, 132671, 213583, 386798, -2413, 109060, 94745, -116171, -252625, 51088, -271350, 106666, 202400, 84476, 184076, -78190, 429970, 112509, -82012, 244379, -148777, 128965, -63867, 66082, -184734, -174173, 168410, -36332, -85334, -192914, -217721, 171934, -39514, 161630, 141952, 254906, 107229, 2782, 98956, 554012, -96184, -39849, 86312, -98414, -84217, -20525, -71724, -22269, 29847, 132887, -211935, 99838, 91474, 3334, 318580, 125533, -96499, -138457, -43228, -180824, 249778, -132, 225033, -3477, -83942, -133767, 20531, 138391]
12101A38391F7290J44811J0663R059D3073h5368j33869D4105e203k73206h0920
12089b0430A68124h0147A35567k9125D4518i8828A71164B98R7000J5049e5226
12077F9558B6186a36170M1238m7104c3839A40912i6453a5814G5056K7069b99229
12065b0372B61814K0960n4068K3335h8672A07723c49595H7393P5206p5753c8570
12053B13993M73Q8739a70635b5451A31270a21B32786c28525R5496I4456b03309
12041H8755h1739j71835C2726M33877C0664d8613A26977k7046h0431B14459a41213
12029a90539g3625k28887A8790J44871C829K39311i2040B56287H5596c9448j34151
12018a73599P7113l11976R8831D5229J2396P1025a90968C88397A11745a59299
$$ y = [138391, 67290, 212101, 222764, 231823, 43073, -85368, -219237, 44105, -5203, -278409, -80920, -20430, 168124, -80147, 135567, 106442, 44518, -98828, 171164, 298, 97298, 112347, -55226, 69558, 26186, -136170, -94932, -142036, -33839, 140912, -96453, -15814, 75056, 102125, -299229, -20372, 261814, 282774, 228706, 252041, -88672, 107723, -349595, 87393, 162599, 86846, -38570, 213993, 214466, 303205, -170635, -25451, 131270, -121, 232786, -328525, -233029, 94456, -203309, 88755, -81739, -253574, 32726, 466603, 30664, -48613, 126977, 99931, -80431, 214459, -141213, -190539, -73625, -302512, 18790, 163661, 3829, 243140, -92040, 256287, 85596, -39448, -173599, -96486, -408462, -309631, 45229, 57625, 128650, -190968, 388397, 111745, -159299]
12007A71812e8666B92828a00825k6835A41021a29281k83907a23669l0731I6361
11996b07039L7286Q984F2773b46355b3967B4168R3901b95331i3103b2653j89248
11985b11901H3192c35742A62800E0814e461k40311f9713B09248e3151n6846D1181
11973a98037r569P2457k7634R732k30326G6652d21755B215d6272E0578a08189
11961c96404A4135R9894b18104k6135A20860a73146j4229p0638A72243c55616
11950G3163O1243R2102c16054E5809g4491B70750b2654D4564b69646k9485B69378
11938c7370A37597b13281B98947b02600f4893A51086b89926B06388J1047b58047
11927a36479A18820c05114B19906G0297b1501B90742j208E8707g7710b3701p1911
$$ y = [171812, -58666, 292828, -100825, -127660, 141021, -129281, -413188, -123669, -154400, 96361, -207039, -169753, -160769, 62773, -246355, -23967, 24168, 118069, -295331, -93103, -22653, -211901, 83192, -335742, 162800, 50814, -5461, -245772, -69713, 209248, -53151, -109997, 41181, -198037, -207606, -135149, -162783, -153051, -383377, 76652, -421755, 2215, -46272, 50578, -108189, -396404, 14135, 114029, -218104, -244239, 120860, -173146, -187375, -258013, 172243, -355616, 73163, 134406, 226508, -316054, 55809, -74491, 270750, -22654, 44564, -269646, -299131, 269378, -37370, 137597, -213281, 298947, -202600, -64893, 151086, -289926, 206388, 217435, -258047, -136479, 118820, -305114, 219906, 70297, -21501, 290742, 289534, 58707, -77710, -23701, -95612]
11916i5612B42942e2375r2993f7030A63218b17272O9470B44425c94377d2570A48589
11904a33374b8580B93322D3150a30121B6832a41200k8856G6801a86066A14233
11893a64371n418P1902p5619b0648I8420c13053a52795f510q0139j84583B49130
11881A28585E2111b83576i232D7282R6555a59900q9557I6910b85111o5967a06489
11869A82460h0195D40680a8832A65415F929f3010k90709j08799O0030A73364a6256
11857I826i5408j6346I0563k107l1159a72012A33595a4795j59078n5156i2435
11845b96193a26995D78915g0907j29304A4851J72621r3696A725R7016K03546g4312
11833a34883K1447l8022D1890a76893f3604q8089C394J87858C9440C370a63002
$$ y = [-95612, 242942, -52375, -145368, -67030, 163218, -217272, -147802, 244425, -394377, -42570, 148589, -133374, -28580, 293322, 43150, -130121, 26832, -141200, -170056, 76801, -186066, 114233, -164371, -169789, -97887, -173506, -20648, 98420, -313053, -152795, -6510, -86649, -271232, 249130, 128585, 52111, -283576, -9232, 47282, 143837, -159900, -249457, 96910, -285111, -351078, -106489, 182460, -80195, 440680, -18832, 165415, 6929, -63010, -353719, -462518, -402488, 173364, -16256, 9826, -95408, -111754, 90563, 88456, 57297, -172012, 133595, -14795, -173873, -229029, -92435, -296193, -126995, 478915, -70907, -200211, 14851, 187472, 93776, 1725, 98741, 302287, -74312, -134883, -113436, -151458, 41890, -176893, -63604, -151693, 3394, 191252, 39440, 3370, -163002]
11821A90817k7657l2618E0027K52220a2198l05k41131b6124B40076b09826p9871
11810b89697J11832g8642B24187A03633a57301F8888e6877p4958D5225f8353j04049
11799a72402B0124K16946N9677e6659A11918k9292b00812B38921a56550b1351
11788d9772G8194K4905a44598C3239a86025r6106C34583B0422K4050L91995j64863
11777B71604b7575j09866J650p3182O5013n6272Q2089c0231a833A19390B1050
11765E7560A6461M9093e6862G0075a85105J6288P0604j932B83879d4039L179q7840
11753a28700A24165J04537a17621M0166A23332e3399B1042M2117a15598c3347
11742I3940b40512M1308A48156E8456f9314n9483C53978C2963E44P8622e2093
$$ y = [190817, 163160, 130542, 50027, 302247, -12198, -12503, -253634, -26124, 240076, -209826, -289697, -177865, -78642, 224187, 103633, -157301, 68888, -56877, -131835, 45225, -68353, -172402, 20124, 237070, 296747, -56659, 111918, 82626, -200812, 238921, -156550, -21351, -49772, 78194, 103099, -144598, 33239, -186025, -282131, 334583, 20422, 44472, 436467, 271604, -27575, -137441, -135791, -208973, -143960, -200232, -118143, -30231, -1833, 119390, 21050, 57560, 16461, 65554, -56862, 70075, -185105, -168817, -98213, -100145, 283879, -44039, -40860, -128700, 124165, 228702, -117621, -77455, 123332, -53399, 21042, 63159, -115598, -33347, 93940, -240512, -199204, 148156, 58456, -69314, -128797, 353978, 32963, 544, 79166, -52093]
11730b41341I1163K15854a2964G3180K13993A20560c5923H5656a38703j73522
11720c12225a12356B00023a0839q2013D2542a20521A02540h5000B77592E3478
11709B96636c9362g365l51F6391d2856k52388D1705C305J01395M5579D2646Q1586
11697A24232a26131C7160j0508b72803A79859D5316O8573J26172c2450A38673
11686A10579Q1542Q8418j34046m4883L5828K02599A41341a82598A6248m596c3993
11674c7847l6729L0585r5553B31198c6072j28125a6636k20076O8663c443C0312
11662D6792b97022C56257c1764j15398j03171I5827a02663A14657R9843c22149
11651d14859a45692p2138M1087O9857j51483A00073a77395o5985J17933A66877
$$ y = [-241341, 91163, 307017, -12964, 73180, 287173, 120560, -35923, 85656, -138703, -312225, -112356, 200023, -10839, -92852, 42542, -120521, 102540, -85000, 277592, 53478, 296636, -39362, -7365, -7716, 66391, -42856, -295244, 41705, 3305, 104700, 150279, 42646, 124232, -126131, 37160, 26652, -272803, 179859, 45316, 113889, 240061, -32450, 138673, 110579, 192121, 280539, 146493, 101610, 137438, 340037, 141341, -182598, 16248, 11652, -33993, -37847, -74576, -43991, -139544, 231198, -36072, -164197, -16636, -236712, -168049, -3443, 30312, 46792, -297022, 356257, -31764, -147162, -250333, 95827, -102663, 114657, 214500, -322149, -414859, -145692, -217830, -176743, -106886, -258369, 100073, -177395, -243380, -125447, 166877]
11640a19236D7442d4917R105A807P9175a09950j12942J05329j3102d2251J9029
11629b3222E1901b65889b1867j61259G8499c2479n8402B07691m9294K52999a65167
11617B14878q3105f2845A12730J02399f8349l1481j36939A49192a68535j84034
11607c52569D8960M3256i0134D846d5954B69364j6749A5867b5760E4537K09360
11596B63897a36013b1274C2413K946j7067a42607A77795a32319a7787j77664D60889
11584A32767J44633I5098P1108A0928O7493h6898b7957l730l28717I5081P02L1729
11572A27512m7038L9287E0202J05779j3892K4017K09012i8366A19729L02830a31707
11560b13302f4701A98051n4897J9479J03758m6667P721R2353j20356J3342J4164
$$ y = [-119236, 47442, -44917, -35812, 1807, 80982, -109950, -222892, -117563, -130665, -42251, -23222, 51901, -265889, -21867, -183126, 78499, -32479, -90881, 207691, 158397, 411396, -165167, 214878, 131773, -62845, 112730, 215129, -68349, -99830, -236769, 149192, -168535, -352569, 48960, 92216, -90134, 4846, -45954, 269364, 252615, 15867, -25760, 54537, 263897, -136013, -21274, 32413, 35359, 18292, -142607, 177795, -132319, -17787, -195451, 460889, 132767, 277400, 95098, 166206, 10928, 78421, -86898, -27957, -31687, -360404, 95081, 95783, 127512, 80474, 119761, 50202, 155981, 142089, 166106, 375118, -98366, 119729, 422559, -131707, -213302, -64701, 198051, 143154, 162633, 266391, 219724, 227445, 319798, 199442, 212784, 226948]
11549B26948B9999g6715B4391K76414a44574B30040o5277b9368A98984G7431h3044
11537h1304F2281J88674p6323A707P1973K55300q0008b0214m785j71332Q0614
11526a15717B29604c43480P5376D12512j2353b31280A94829k9662O1396N90j3712
11515B13441c14325a35364J3039A31858c7072l9709A12736M5066a7495A23435
11504a14947E5769A5896O4582n213L6935J47916J23014A15197b22731a073j0922
11493a1995k6147B55438A00651g8027K5803a5030B65307n0416D2774L31900a75354
11481c65952D69031q7476c121j38305m9792E2136b7835j43530A48562J58533A26606
11469a35023j38320g0325r956A82516n7550F0690P0611c0450F5862K15025H08
$$ y = [226948, 29999, -76715, 24391, 300805, -144574, 230040, 164763, -29368, 198984, 77431, -83044, -81304, 62281, 250955, 174632, 1707, 73680, 328980, 248972, -20214, -24999, -196331, -115717, 229604, -343480, -268104, 412512, 400159, -231280, 194829, 165167, 226563, 227153, 213441, -314325, -135364, -122325, 131858, -37072, -76781, 112736, 157802, -17495, 123435, -114947, 55769, 15896, 80478, 75265, 112200, 260116, 383130, 115197, -222731, -1073, -11995, -38142, 255438, 100651, -78027, -52224, -15030, 265307, 214891, 42774, 374674, -175354, -365952, 469031, 381555, -3121, -141426, -191218, 52136, -27835, -171365, 148562, 307095, 126606, -135023, -273343, -70325, -80281, 182516, 124966, 60690, 131301, -30450, 65862, 280887, 808]
11457A72419a57341f8553r3910B67121a41478A26387e8436B07396B9676b58580
11446D94893A6023J07087k0226K86740j5542b1063h672q2585A89476H4931C2536
11434b14530F2601J92906G2018Q8846o0940Q319O4562J17632C3219a0647o2652
11423g3299C0831j1275P833g1605k86898D7697J22864C891R2454G63f0637j36996
11411a97633J2653J9674e6786j56927A41006J29495G8193a77374B32458o752P4312
11400C00018e5383J4761A01349m7329c2772H6781J56469b02698N0770r592j2767
11389a74287h4179b7465A14330b7601A93769D903d8488C47213e5921A97780a9718
11377C39466i0719n1577H9903a65299A82346B5078A0887J06666b41536N7423A83497
$$ y = [172419, -157341, -68553, -162463, 267121, -141478, 126387, -58436, 207396, 29676, -258580, 494893, 16023, 123110, 102884, 389624, 374082, -21063, -8672, -91257, 189476, 84931, 32536, -214530, 62601, 255507, 72018, 160864, 99924, 108243, 172805, 290437, 33219, -10647, -73299, 30831, 19556, 27389, -71605, -358503, 47697, 170561, 3891, 96345, 763, -60637, -197633, -184980, -165306, -56786, -213713, 141006, 270501, 78193, -177374, 232458, 225706, 300018, -55383, -40622, 101349, 54020, -32772, 86781, 243250, -202698, -151928, -161520, -174287, -84179, -27465, 114330, -27601, 193769, 4903, -48488, 347213, -55921, 197780, -19718, 339466, -90719, -142296, 89903, -165299, 182346, 25078, 10887, 117553, -241536, -184113, 183497]
11365A00604b9153m9780h208o7212b9349j67814B6423J1124d6100A82481c90714
11353B29988M7140C3260c15715I4287J45814a89920h5497A32940n8642b512j04696
11342a07208L4444A19835D7579J58558a28530K1033a2198m66733A685a44733j66782
11331c11515r6775A64821D5666a67644k09762Q4572B50655a04348l508c4523j76954
11320b11477J1241a733o4975j03720P3084n5773p2955k29053e7277p0013d3917
11308A03650c76187c1397k81685a15930c5397n1952a032j67140A51467c0800A00827
11296A1738a98595i3944A74923c7928r7268l8205f9535o5428A25332e0173C4736
11284a94102A78365a61196j51244C4800J29567E3960b85683J14638h3297A67189
$$ y = [100604, -29153, -78933, -8208, -75420, -29349, -197163, 26423, 37547, -46100, 182481, -390714, 229988, 277128, 33260, -315715, 94287, 240101, -189920, -85497, 132940, 74298, -2512, -107208, -72764, 119835, 47579, 206137, -128530, -107497, -12198, -478931, 1685, -144733, -311515, -408290, 164821, 45666, -167644, -377406, -292834, 250655, -104348, -107856, -34523, -211477, -200236, -1733, -66708, -170428, -97344, -153117, -226072, -455125, -57277, -127290, -43917, 103650, -376187, -31397, -313082, -115930, -35397, -87349, -1032, -168172, 151467, -30800, 100827, 11738, -198595, -93944, 174923, -37928, -135196, -173401, -69535, -134963, 125332, -50173, 34736, -194102, 178365, -161196, -312440, 34800, 164367, 53960, -285683, -171045, -83297, 167189]
11273A39279k0308d3598A39029d09846A38330C8423m030b73124a5656j57150h0594
11261G1714a4207l9109B7033a01516b8250A03620c42898c4607j12459H5647a55096
11249b19942H7768Q3408K93832b4941k8250k0076A08356K14531j21867b5758C92759
11237h633G5352b08816I5415l3884a16983m699D4972a06686M5268A16287c15280
11225B91414B681e8736k10122J01902G5369c5719k3048b5567l09997d3289o4619
11214a07908L5366j02955A30337b8851j92046Q8042c3130A86885B3138L50548
11204C73686h2777K7480G3317c9468A92829q5346a77458E658Q9572c25440B5072
11192b30219C01602E9245A2456b1302D7204b69876R9734A50854O878A3401e3231
$$ y = [139279, 118971, -43598, 139029, -409846, 138330, 38423, 34393, -273124, -15656, -172806, -80594, 71714, -14207, -53316, 27033, -101516, -28250, 103620, -342898, -34607, -147066, 85647, -155096, -219942, 87768, 171176, 465008, -24941, -53191, -73267, 108356, 322887, 201020, -25758, 392759, -8633, 75352, -208816, 95415, 61531, -116983, -121682, 44972, -106686, -61418, 116287, -315280, 291414, 2681, -58736, -268858, -166956, 75369, -35719, -58767, -25567, -335564, -43289, -107908, -72542, -175497, 130337, -28851, -220897, -132855, -33130, 186885, 23138, 373686, -82777, -55297, 73317, -39468, 192829, 107483, -177458, 5658, 95230, -325440, 25072, -230219, 301602, 59245, 12456, -21302, 47204, -269876, -170142, 150854, 157732, 13401, -53231]
11180A0032R8168m6525a79311r9543f632o6505B7766P2763L93715G571a4976E8173
11167e3493A26288K1158i2972A61542J22598D3065e9698B4909a89173o687P0913
11156a24947G6341B9698J11896n8995J07097m3810e8402H5923K766m0201D634
11144d2214A03270c6811j33296j55661a52746D8673a02477j12028E8938Q5163
11134A44101b10438B7053a88497k428I7048h4224C6776L8839g3695D13096A52279
11122G0870c53518b9215B07000J62023H0549J65390c3282m3617r1691e7784P679
11111e0105o2676r014P397B25220F9768L9784a8165l38914b6905j14971A19874
11099B28413m4891a50585H8110e8097C20711r8002I7509J47955N5325G892J26822
$$ y = [10032, 108200, 61675, -179311, -278854, -6632, -73137, 27766, 100529, 494244, 7571, -14976, 58173, -53493, 126288, 147446, -92972, 161542, 284140, 43065, -59698, 24909, -189173, -195860, -124947, 76341, 29698, 141594, 82599, 189696, 145886, -58402, 85923, 88689, 48488, 4634, -42214, 103270, -36811, -170107, -325768, -152746, 48673, -102477, -214505, 58938, 144101, -210438, 27053, -188497, -190925, 97048, -84224, 36776, 75615, -73695, 413096, 152279, 70870, -353518, -29215, 207000, 369023, 80549, 245939, -33282, -76899, -168590, -57784, -50105, -112781, -121795, -114398, 225220, 69768, 109552, -18165, -357079, -26905, -141876, 119874, 228413, 183522, -150585, 88110, -58097, 320711, 222709, 97509, 245464, 300789, 7892, 134714]
11088A34714Q1307D2190N6527O9207E4170b3483B12048J87722I5511J75478i6936
11076B77428l6191n4220J12179m9783L2610r1924L6470L72247k80881j20194j7959
11065A79782D5973O2476K18788J6435A66671M04987A77176M35755k43497A74782
11054A56618M88197B16215K06617K83221j75624j58335L6898J14725j02097J70321
11044E91941K64775k11524B53525L15382B52653N6156K61754J38593l35812K78656
11034F52000j92780M3j3464J29190l5161k970j80254M17180l26085K34205C10922
11022I00743k91993B91651M19020l42559A80091K83839j0118O9220Q8858k1746
11012E90144A60708L18518j99979N00081k55674M7007O558k79425N80987m09425
$$ y = [134714, 216021, 42190, 98717, 167924, 54170, -23483, 212048, 399770, 95511, 270989, -96936, 277428, 241237, 187017, 299196, 249413, 282023, 190099, 226569, 598816, 317935, 197741, 179782, 45973, 108449, 327237, 343672, 166671, 571658, 177176, 612931, 369434, 174782, 156618, 644815, 216215, 422832, 706053, 530429, 372094, 408992, 523717, 421620, 591941, 856716, 645192, 253525, 568907, 252653, 308809, 570563, 709156, 373344, 652000, 459220, 459263, 445799, 574989, 539828, 536858, 356604, 773784, 447699, 681904, 310922, 900743, 608750, 291651, 710671, 368112, 180091, 463930, 453812, 523032, 611890, 590144, 160708, 479226, 279247, 779328, 523654, 570661, 577219, 297794, 878781, 469356]
11002D69356K6088J5486K60982n7001j54091j35621J15253B42809L90137K40745
10992H73691A42972M75410k81176J72681j90695K98869j32187A72399M99139L2241
10982G03779j37761J73397q283L28478M6753k72042K69059R9030p4946J47091
10972A274555K8719N80499P3623j26872L7239M1976l27064J9911Q5100m26290
10962A261396m05586K16699L39399j54113K11075k64149K2401p4806M54840J19937
10952A727093j24072k52954l52324P9455j53536o2186k47353B71761N01172j73361
10942E99572B18420e8185C73617j14118a21019C85721d7912J0565I1705P9782
10932A71487K41274e7153C7934c35507F1234a38614d1907D33990j36470b31093
$$ y = [469356, 495444, 510930, 771912, 714911, 560820, 425199, 540452, 242809, 632946, 873691, 142972, 618382, 337206, 509887, 319192, 618061, 485874, 172399, 671538, 703779, 566018, 739415, 731132, 1059610, 1106363, 834321, 1103380, 1202410, 1127464, 1274555, 1303274, 1883773, 1957396, 1830524, 1867763, 1909739, 1582675, 1602586, 1687686, 1261396, 855810, 1072509, 1411908, 1257795, 1468870, 1204721, 1227122, 1152316, 1607156, 1727093, 1603021, 1350067, 997743, 1077198, 923662, 861476, 614123, 271761, 772933, 599572, 218420, -58185, 373617, 259499, -121019, 385721, -47912, -37347, 91705, 171487, 412761, -57153, 37934, -335507, 61234, -138614, -41907, 433990, 297520, -231093]
10921b6468N04B4786a95508i3330A5050f2655A83745g3944c2268B06240I3277
10909A50595a5449j20790A35655D1750k0094d04570a18351D01305C4854b55689
10898b42640J14499J761M0026a2552H8871a8136A15741b6893k98983J20654B12106
10886B15664b45219A88152K9160b26249A71516o363d11048b03956F1596e1699
10875b08998Q0353A51268o7241j7181K8025K32463c5684a3995m2486A09938l1854
10864G8084c67295c573G520i3165j05889f7371j09229B82181a18544k23255A37993
10852b4179n3049p454A73749O4029J2187g8993A50710h9296j82346g4797k16934
10841b91731i3638l2662k6048q3600I5363g0089m6793A49370c48713I5477b20895
$$ y = [-26468, -25964, 24786, -195508, -93330, 15050, -62655, 183745, -73944, -32268, 206240, 93277, 150595, -15449, -136239, 135655, 41750, 21656, -404570, -118351, 401305, 34854, -255689, -242640, -128141, -126380, -86354, -12552, 88871, -18136, 115741, -26893, -325876, -205222, 212106, 215664, -245219, 188152, 217312, -226249, 171516, 165153, -411048, -203956, 61596, -51699, -208998, -128645, 151268, 84027, 66846, 94871, 327334, -35684, -13995, -56481, 109938, 78084, -367295, -3573, 7520, -93165, -199054, -67371, -176600, 282181, -118544, -341799, 137993, -24179, -77228, -84682, 173749, 237778, 249965, -78993, 150710, -89296, -271642, -74797, -291731, -93638, -126300, -152348, -235948, 95363, -70089, -116882, 149370, -348713, 95477, -220895]
10829c65581F860J20822f6342l76534G1880a13878L4364D25302a99810h1026k44443
10818c25469b1791j6466j36233A6994d6911E8342d80527B06091I2633b46989a11365
10806b77889I4291e5088r9757c6798j058D9533j7O4487n3535a59150A01666l5737
10794F5929h4641F940e14423e7821L341A11279a25738A01636a09378D8708K7982
10783G6690b42110A42762k5688l4748f5469b9982A41768j1530e3456C3489g2941
10771b78041Q9884O231B53918h6293A0792L6182J01623E7717e8172I2599J52634
10760B45233i7368B32528a38278G9511b25095C79357d7559B35706e7219j69186
10750b26405B3772R7824A1532b47028B27976q6910c24281A21748c8157j01434
$$ y = [-365581, 6860, 127682, -66342, -442876, 71880, -113878, -79514, 425302, -199810, -81026, -325469, -21791, -38257, -174490, 16994, -46911, 58342, -480527, 206091, 92633, -246989, -111365, -277889, 94291, -55088, -154845, -36798, -37856, 49533, 49516, 114003, 60468, -159150, 101666, 65929, -84641, 6940, -514423, -57821, -54480, 111279, -125738, 101636, -109378, 48708, 76690, -242110, 142762, 117074, 82326, -65469, -29982, 141768, 130238, -53456, 33489, -72941, -278041, -188157, -181926, 253918, -86293, 10792, 46974, 148597, 57717, -58172, 92599, 245233, -97368, 232528, -138278, 79511, -225095, 379357, -47559, 235706, -57219, -226405, 23772, 121596, 11532, -247028, 227976, 141066, -324281, 121748, -38157, -139591]
10740a39591L0341B55323c34568Q3448h8964B18353a26055j46669H5533Q3550
10730A69083q4041a93821o6307b1241G5991A4919L4186a43400f9577j4125A87277
10718b94273J03246B06183h8974j21219D0810K21860f307C95627A35401J66260
10708C01661a64771d5955j58492A7611g3572K2149l42716a16350j54344B93085
10697a56962q3127K0674m1972P7732A7791a59458b9761j31230a7458A97837i3748
10685B31284F2318K08101c7577j34227b1350j61502A70876a04679k61339C6996
10674A5289b81014B8488J02801a61672B70697b34081J08627j75666J09128B29765
10663h8437k2975M738k07057a29290F2212a04842J6749B13411b99524q2604B9796
$$ y = [-139591, -109250, 255323, -334568, -251120, -88964, 218353, -126055, -272724, 85533, 169083, 85042, -193821, -260128, -21241, 75991, 14919, 49105, -143400, -69577, -83702, 187277, -294273, -191027, 206183, -88974, -210193, 40810, 262670, -6307, 395627, 135401, 301661, -164771, -45955, -204447, 17611, -73572, -51423, -394139, -116350, -270694, 293085, -156962, -240089, -219415, -261387, -183655, 17791, -159458, -29761, -160991, -17458, 197837, -93748, 231284, 62318, 270419, -37577, -171804, -21350, -182852, 170876, -104679, -366018, 36996, 15289, -281014, 28488, 131289, -161672, 270697, -234081, -125454, -301120, -191992, 229765, -88437, -111412, -106674, -313731, -129290, 62212, -104842, -88093, 213411, -299524, -382128, 29796]
10651A40052a42966M2527H4210a37975B00572M613Q2302i9628l7831A7820G134
10639D2039c7200A95195d2911f485k36015B46038H1902a8447A63788a45882e4581
10627b30633B65M4507e1724k6468B12098D7468K44555b50558A28649m4013d90881
10615E9593K00039a07368r5843L684j44174B02161m8489a87888B9308P7902c30475
10603a04218B4465J05689n6777O8032f7339B93553G0677a09656B95482d29054
10592A01332p849a1337n9393A22532f2185o5390C6679N648K92707B7051j1407
10581A5644K20257h0125j40563k41534h819l22814C9527G885h6493G2968J33639
10570B06607c08102A75116b06597Q1784A69746J7686g7989G3255e2584k50572
$$ y = [140052, -142966, -100439, 84210, -137975, 200572, 205185, 287487, -99628, -137459, 17820, 7134, 42039, -37200, 195195, -42911, -6485, -242500, 246038, 81902, -18447, 163788, -145882, -54581, -230633, 265, 44772, -51724, -78192, 212098, 47468, 292023, -250558, 128649, 84636, -490881, 59593, 259632, -107368, -203211, -199527, -343701, 202161, 153672, -187888, 29308, 107210, -330475, -104218, 24465, 130154, 73377, 141409, -67339, 293553, 70677, -109656, 295482, -429054, 101332, 93483, -11337, -70730, 122532, -62185, -127575, 36679, 42327, 335034, 27051, 15644, 235901, -80125, -220688, -462222, -8819, -331633, 39527, 7885, -86493, 72968, 206607, -308102, 175116, -206597, -124813, 169746, 187432, -77989, 73255, -52584, -303156]
10560c03156E1504J65957c8536B11257a34548j24136e6099H4710C4247b68733
10549B87017H4512Q5224c9194l79065A9522P9316a05535B56491f8056l925A72842
10537a6009A62268D7785a6381j95896A47404F8310h9700p0979j48912J20244B4988
10525c9656j83234F9061a70183A61137K17155H478a16738F1919J42812a85925
10514a82753A48062i126K079C5334J049a30115M530A6552J24254P8055i2529J7644
10502g4885B22125F5117a35046p7984L1934j70563G0952O1948J71677b85215A37859
10490d9569n15k9042k28235a9084r3568l51302B50156j2253A162c5760B06051
10478F92965k55958j56913d7355D61861k14255K2842a95553A35970a57250j64423
$$ y = [-303156, 51504, 217461, -38536, 211257, -134548, -258684, -56099, 84710, 34247, -268733, 287017, 84512, 169736, -39194, -418259, 19522, 98838, -105535, 256491, -68056, -71981, 172842, -16009, 162268, 47785, -16381, -212277, 147404, 68310, -89700, -160679, -309591, -189347, 24988, -39656, -222890, 69061, -170183, 161137, 378292, 8478, -116738, 61919, 204731, -185925, -182753, 148062, -9126, -7047, 35334, 36383, -130115, -125585, 16552, 140806, 218861, -92529, -74885, 222125, 65117, -135046, -213030, -181096, -351659, 70952, 132900, 304577, -285215, 137859, -49569, -50084, -79126, -307361, -19084, -112652, -463954, 250156, 237903, 1162, -35760, 206051, 692965, 437007, 280094, -47355, 461861, 247606, 270448, -195553, 135970, -157250, -321673]
10468c21673P7939a11589A7248c5746G4436c16515a8249l22A80115b2759P455
10457a5304j2261p0149j36774e0926E2607a8656G3465e4494o9306b5277j03330
10446a28607k28330C52298j09473f1856r9206e8629B27151b8227H021a5742B48485
10434h2261k1702j44172a18901r4293q748M0834O0133M2585B10172f9354j70584
10423b39938g664j80718F8572J77297d16925J44453B3651G250a23415j5481G0786
10411A21427m7938I598O8669d8080H6047J5825b04520B08464g6281A14875a82872
10399A74124a68510A06360e5667k22470E7490k7572a40089j0507A26079j5935
10389A10144m0251b0641B62078g7171C3136c08363A7646M50242B27355p0940j9481
$$ y = [-321673, -243734, -111589, 17248, -35746, 74436, -316515, -18249, -18571, 180115, -22759, -15304, -27565, -97714, -234488, -50926, 52607, -18656, 73465, -54494, -123800, -25277, -128607, -356937, 352298, 242825, -61856, -161062, -58629, 227151, -28227, 8021, -15742, 248485, -82261, -103963, -248135, -118901, -213194, -221942, -181108, -120975, -78390, 210172, -69354, -239938, -7664, -188382, 68572, 245869, -416925, -272472, 23651, 7250, -123415, -138896, 70786, 121427, 73489, 9598, 78267, -48080, 86047, 101872, -204520, 208464, -76281, 114875, -182872, 174124, -168510, 106360, -55667, -278137, 57490, 29918, -140089, -150596, 126079, 110144, 69893, -20641, 262078, -77171, 33136, -308363, 17646, 467888, 227355, 156415, 136934]
10378A36934o3630a47502A74948F0037J56534A4035J91453K28034j70746C7459
10367B11089Q4111A06225L08813J67215j93836j93451O6260H459J32985L6700
10357A78144R3545D3801J66747a2980A51332J16574j21560F9671M14375j16657
10347C67389j74955p5272J44814e2656B99346a59255A73775K35680p0050C7465
10336C19019J62102j66100I706K34753F6564g2197j67455D26449E7875k8527N7437
10325H6785K43066d17454B07112M4928i1308B51276a40972a4467C88504I5270
10314E405L31213a30528B43294b21103J09151j477l0018M971j91127a49701H3433
10302D8144J97635H6162b49786i3472L0255j9253n6731L3057D7601R1885a03271
$$ y = [136934, 73304, -147502, 174948, 60037, 216571, 14035, 205488, 433522, 262776, 37459, 211089, 295200, 106225, 415038, 582253, 388417, 194966, 261226, 8459, 141444, 178144, 271689, 43801, 210548, -12980, 151332, 267906, 146346, 69671, 484046, 367389, 192434, 117162, 261976, -52656, 299346, -159255, 173775, 409455, 339405, 37465, 319019, 481121, 315021, 9706, 244459, 66564, -72197, -239652, 426449, 57875, 29348, 86785, 329851, -417454, 207112, 252040, -91308, 251276, -140972, -14467, 388504, 95270, 5405, 336618, -130528, 243294, -221103, -111952, -113429, -143447, -138476, -329603, -149701, 83433, 48144, 245779, 86162, -249786, -93472, -63217, -82470, -139201, -106144, 47601, 139486, -103271]
10290B67601n453D7210O852a94166n8233A0909G39g4483b5289I441e1075j21935
10278a73010Q225A6397c4417C10068C7479K1193a01196J5557m715a0361I9050
10266c07632I8250J17584c06661D85757E1467d6253D8429N6398C4210K78802q828
10255C04184A43167L72416A90634c3534F0115B4810K9028a2778j3540A1958M31570
10244D43528A3798J47703P1347a10558D0558a63529P6620C4239O6364K54681a18747
10232B6701e2198k83063g0484c4364D04744A77008a0609l1697o0698C5178Q3426
10221A18604a21798A57084d03355a35194A30215c01458H0983J37001g3218j03266
10211a76484b3684k18026A35407Q6525a16914A945M9567I985a04407q3345a2991
$$ y = [267601, 262148, 47210, 54062, -194166, -252399, 10909, 739, -74483, -25289, 9441, -51075, -173010, -164785, 16397, -34417, 310068, 37479, 58672, -101196, -85639, -90354, -10361, 99050, -307632, 98250, 215834, -306661, 485757, 51467, -46253, 48429, 104827, 34210, 313012, 304184, 143167, 515583, 190634, -33534, 60115, 24810, 53838, -12778, -26318, 11958, 443528, 13798, 161501, 232848, -110558, 40558, -163529, -86909, 34239, 100603, 355284, -118747, 26701, -52198, -335261, -70484, -34364, 404744, 177008, -10609, -42306, -103004, 35178, 118604, -121798, 157084, -403355, -135194, 130215, -301458, 80983, 217984, -73218, -176484, -23684, -241710, 135407, 221932, -116914, 1945, 51512, 9985, -104407, -187752, -12991]
10199B8146f8268A10098k7147P3973g8011k3566A63991a30922H6741a95972c4213
10187e8627A39179a19953G3437b55383L0477o5226j43393A87338m1760D9013J270
10176E0283R4662N1940b23117j14870J35266a8905k83512K6083j2048j84455J73392
10165b99445g6726k65970C1088a90343F5392J60282a89258O4886j20913e9364
10154D4343O0394k8379J31805p6236i3029R069l07793E5443a76456l609A26231
10142B03291a34639l1600A64280d9131D8820a95319b5553m6305D9170c7047j86386
10131b23433N7366h0684A46313B9531b06147J01037d940B52208c32424E1041i6879
10119a69001j02156K7549J00336I9924J32368e01130A56318k1821Q4673H8937
$$ y = [28146, -68268, 110098, 82951, 156924, -78011, -101577, 163991, -130922, 86741, -195972, -34213, -58627, 139179, -119953, 73437, -255383, -224906, -290132, -433525, 187338, 145578, 49013, 50283, 144945, 196885, -223117, -337987, -202721, -18905, -302417, -276334, -288382, -472837, -299445, -76726, -342696, 31088, -190343, 65392, 225674, -189258, -124372, -245285, -59364, 44343, 104737, 76358, 208163, 131927, -93029, -83960, -391753, 55443, -176456, -180065, 126231, 203291, -134639, -166239, 164280, -49131, 48820, -195319, -25553, -71858, 49170, -37047, -223433, -166067, -80684, 146313, 29531, -206147, -105110, -4940, 252208, -332424, 51041, -96879, -169001, -271157, -243608, -143272, 99924, 232292, -501130, 156318, 134497, 219170, 88937]
10108b7586H6845a60768p1102i5776o0888A05842N1528B0280h0996K8162H4011
10096c54364a42772j20650B73334I5244n045c65858J41061i3519E1162k66a71981
10084g9275J6103j94208d6331B3654J280N2852a04292k9755f018B8157b1297k48997
10072b70294N3027f4090A6001a03910C0504a64145m9472a6986A38544h0336o1137
10061a41473C8604M7385d75736D9387p002e4007A11139c8147j04203L939F3776
10049B17458n6789k7213l7252f6998r1753a8889G7929c90j1532C068L8545a64722
10036B79471b1132B49931D7311A9328a79323f5762o3158j45B34808c9809A07701
10024a36562a2275C46768D272J54266B7092a52477b0041A04264c1278j37452l59098
$$ y = [-27586, 86845, -160768, -231870, -95776, -156664, 105842, 157370, 20280, -80996, -52834, 84011, -354364, -142772, -263422, 273334, 95244, 90199, -365858, -224797, -93519, 51162, 50896, -171981, -79275, -63172, -257380, -46331, 23654, 24934, 77786, -104292, -134047, -6018, 28157, -21297, -270294, -217267, -64090, 16001, -103910, 30504, -164145, -213617, -16986, 138544, -80336, -141473, 38604, 85989, -475736, 49387, 42385, -54007, 111139, -38147, -142350, -138411, 63776, 217458, 160669, 133456, 96204, -66998, -158751, -18889, 77929, -390, -11922, 3068, 41613, -164722, 279471, -21132, 249931, 47311, 19328, -179323, -65762, -128920, -129065, 234808, -39809, 107701, -136562, -12275, 346768, 4272, 158538, 27092, -152477, -20041, 104264, -31278, -168730, -527828]
10013e27828A16662M120a12294f525B84631F1200j7515h909o7200k09913d7991
10001A16209a83624h6714C17168B8315J25781G37f3392n8097d6834A15996b17086
9989E6267N800J75544b2180A74235i1579q5294g3082H9356b10485A67614a17677
9977a66891J2552O3698A5830b30352c3661o8870A59912g2847m3054b4105C7836
9965d45584a47557b2121j87910q0565a35669H4094b58000A15733h1969L1837A69267
9953d00064f1147C7068b19150A3031K91026a59393C62108d9178o7274D389J446
9942E835K86159G2128a50707N1551k59269b4693A7663b3667k17483I3342M7534
9931A40876c19735J39092B065a24449E1289g6109m09838i9947P038B09594b12017
$$ y = [-527828, 116662, 120782, -112294, -6525, 284631, 61200, 43685, -8909, -76109, -286022, -47991, 116209, -183624, -86714, 317168, 28315, 154096, 737, -63392, -121489, -46834, 115996, -217086, 56267, 62067, 237611, -22180, 174235, -91579, -176873, -73082, 89356, -210485, 167614, -117677, -166891, -154339, -90641, 15830, -230352, -33661, -102531, 159912, -72847, -115901, -24105, 37836, -445584, -147557, -22121, -210031, -290596, -135669, 84094, -258000, 115733, -81969, -50132, 169267, -400064, -61147, 37068, -219150, 13031, 304057, -159393, 362108, -49178, -116452, 4389, 5835, 291994, 72128, -150707, -99156, -358425, -24693, 17663, -23667, -241150, 93342, 140876, -319735, -180643, 2065, -124449, 51289, -76109, -485947, -99947, -92909, 209594, -212017]
9919A75588q1634m0490J42587H7299i6910J7193m7413b4707C16462D3503a81045
9907B721a61000Q645A8629b64226a14518I1375D2954A5778J3944K72380F029b70666
9894a26627M696G7465L5620b83603i7710j00816C7382r296J1274a77910d6289
9882b54583M8306P9601j44893e8655I1963b3995j33890A11868K55772c5939A84904
9870a34178J2012l01470A26236K8477c0774j14710O772G9705a01454b3921l17219
9859c41140a23507A31094E5743a04118b0680p5668A09250i8384L7016k7093j00143
9848a88604C7306K4130M3909l6737a32045A65682c31690C684a32731k44282h8816
9836D9814e7475b2050k08638l8710A01545a41124b3424a1362l2870A20537j263
$$ y = [175588, 93954, 53464, 196051, 87299, -96910, -79717, -127130, -24707, 316462, 43503, -181045, 2721, -161000, -152355, 18629, -264226, -114518, 91375, 42954, 15778, 29722, 302102, 6029, -270666, -126627, -121931, 77465, 113085, -283603, -97710, -198526, 37382, 28086, 39360, -177910, -46289, -254583, -206277, -126676, -271569, -58655, 91963, -23995, -157885, 111868, 367640, -35939, 184904, -134178, -122166, -423636, 126236, 154713, -30774, -145484, -138712, 79705, -101454, -23921, -341140, -123507, 131094, 55743, -104118, -20680, -96348, 109250, -98384, -61368, -88461, -188604, 37306, 61436, 105345, 68608, -132045, 165682, -331690, 3684, -132731, -377013, -88816, 49814, -57475, -22050, -230688, -269398, 101545, -141124, -23424, -11362, -44232, 120537, 119274]
9825A19274c42793J07938J14625M6934b9735R480q0671o2433j9570A40192D783
9813a89383k645A5038b72982A08235a55682d5546m4190j15468d4256k15946a18816
9801b06695A55457a1989I9L78d19294a54912O2533B0055e7958l64868N7131f7799
9788a7403o0727k07605A21497b62852I0062a15720H4241Q0879a90525m8244B24106
9776B8539K41316H1569a94967j07434d0075k8074G9260i2396r3666M1396A46899
9764a6485j11296j93341a6799l27458a2517j46129M1758k1315f4132A86824a39884
9752E4970k1256J92962A1911a71904e5904m43966a00829A58873d0951B18637a11410
9740a12590C8220K00691a23030a2309A06370a15813A38095a66030a494P9j18931
$$ y = [119274, -342793, -234855, -120230, -73296, -29735, -20255, -100926, -163359, -182929, 140192, 4783, -189383, -192028, 15038, -272982, 108235, -155682, -45546, -89736, -205204, -44256, -260202, -118816, -206695, 155457, -11989, 99, 477, -419294, -154912, -92379, 20055, -57958, -422826, -365695, -67799, -17403, -78130, -285735, 121497, -262852, 90062, -115720, 84241, 165120, -190525, -238769, 224106, 28539, 269855, 81569, -194967, -302401, -40075, -68149, 79260, -92396, -186062, -144666, 146899, -16485, -127781, -321122, -16799, -344257, -12517, -158646, -116888, -138203, -64132, 186824, -139884, 54970, 33714, 226676, 11911, -171904, -55904, -499870, -100829, 158873, -40951, 218637, -111410, -112590, 38220, 238911, -123030, -12309, 106370, -115813, 138095, -166030, -1494, -1415, -120346]
9729a20346e2586n3341g997k81663B3387a83704b3464B05251f6432A99388J13058
9718C12446a00847j57639B7921g840C10883A17252J18532e5368j39317o9722H4411
9706b42017g7801I018K53083d79168b10089L2899P4190d4685k93175A28224R1889
9695B20113d1880j30050l40011a0906j92953h8387l34432J17390D5911O01j587
9684D4925c39576f3502A93247a15685D0520L9696a4276j05809B59791j23400f8346
9672a92739j88426E5917K30690j25068a07223l4083o8521e7814m8701B43441A1426
9660a19218B90019a15941l5803A91009b42293J1002F4882a8217j03227a3980j35454
9649a49434Q977m8561b0172j09703F5619a86199A0676J3638i404j31642p3595
$$ y = [-120346, -52586, -105927, -7997, -289660, 23387, -183704, -23464, 205251, -66432, 199388, 312446, -100847, -258486, 27921, -7840, 310883, 117252, 235784, -55368, -194685, -264407, 84411, -242017, -77801, 9018, 262101, -479168, -210089, -177190, -103000, -44685, -337860, 128224, 220113, -41880, -171930, -511941, -10906, -203859, -88387, -422819, -305429, 45911, 46512, 44925, -339576, -63502, 193247, -115685, 40520, 80216, -14276, -120085, 259791, 136391, -68346, -192739, -381165, 55917, 286607, 161539, -107223, -141306, -209827, -57814, -106515, 243441, 11426, -119218, 290019, -115941, -151744, 191009, -242293, -231291, 64882, -18217, -121444, -13980, -149434, -140457, -189018, -20172, -129875, 65619, -186199, 10676, 24314, -9404, -141046, -214641]
9638b14641L3560C1160h2985B77156c02799C5015J2193h4066G6790a35727O7031
9627f8696n5009I8399m5485a03613m6161d8630B3246L8665c84811J64877j10058
9616c29992e3983j13290C9878b55348J16150L9177A53515a4214B02051d4057C11370
9604A08675A281K74060b28306L4762A64117g1153k69757c4977A40066a30600E2196
9592B2600a1072k6550o2410H9914a49480J8410j3290O9527J1870k639K2069D4364
9579F0456D232b0583D04365a17891A23897E6461a35097q6275H4618m2119f4575
9567c42118I04d0472B36596e1496a026j40677j29385B8010b63977G4694N4583
9556A29277b22412P4921O1675j23210H4802Q674g3099D14426I9203b33994m1679
$$ y = [-214641, -181081, 31160, -82985, 277156, -302799, 35015, 47208, -84066, 76790, -135727, -68696, -123705, 98399, 52914, -103613, -149774, -48630, 23246, 61911, -384811, -219934, -329992, -53983, -167273, 39878, -255348, -139198, -100021, 153515, -14214, 202051, -44057, 311370, 108675, 1281, 275341, -228306, -193544, 164117, -71153, -340910, -34977, 140066, -130600, 52196, 22600, -11072, -37622, -100032, 89914, -149480, -131070, -144360, -74833, -62963, -65602, -43533, 44364, 60456, 4232, -20583, 404365, -117891, 123897, 56461, -135097, -221372, 84618, 42499, -64575, -342118, 904, -40472, 236596, -51496, -1026, -141703, -271088, 28010, -263977, 74694, 129277, -222412, -147491, -85816, -209026, 84802, 93476, -73099, 414426, 99203, -233994, -275673]
9545b75673J16437B0724i4206A54030g4428k8297M717b2262m8101B27715c11824
9533b16325a1818j68656j28811b3663k33344A99795b61822P346K6102a8686A2378
9521h1286J9760b1046r0435E7601J94053a63685m9743a3413B16578G794f5107
9509b62873q1391d0554k29882e6086E1362g7661m1389A2761J33227b32898N0471
9498a82427M6453O7111l4533C700J000L47847b68016k8035c0601B2271N9188b00362
9485h0872o7237m5794h6955J1746B5989c60883A06614d2347j73383I9704a0056
9473F486M628f6958j96699A0162O4954L7398a86952M5329e2007K4248C27361b27395
9460h4703A27444f6958k74140a53715M485f8233F4150a07425J2702k06950A50584
$$ y = [-275673, -159236, 20724, -94206, 154030, -74428, -102725, -98008, -22262, -70363, 227715, -311824, -216325, -11818, -180474, -309285, -23663, -257007, 199795, -261822, -254476, -228374, -18686, 12378, -81286, -61526, -21046, -111481, 57601, 251654, -163685, -213428, -13413, 216578, 7794, -65107, -262873, -344264, -40554, -270436, -56086, 51362, -77661, -119050, 12761, 145988, -232898, -182427, -135974, -68863, -103396, 3700, 4700, 352547, -268016, -296051, -30601, 22271, 81459, -200362, -80872, -148109, -193903, -86955, -75209, 25989, -360883, 106614, -42347, -215730, 99704, -10056, 6486, 11114, -66958, -263657, 10162, 75116, 112514, -186952, -141623, -52007, -27759, 327361, -227395, -84703, 127444, -66958, -341098, -153715, -149230, -68233, 64150, -107425, -94723, -301673, 150584]
9448G4152J33264f7680E5557a41649B83693a14293c0068j24879F3528b54447d82
9436a48433f5232J5035b0161j67772H5019D85a96852d8095m8036r6776K6549A05115
9423b09547k38114J12420F5156j5031a92756e0596j9810A26763i8651A0509a93690
9411b02482D6897R2878a78644Q2194D53172d32617e4284E8930b37255F7800g4780
9399d967l3164j9135A51718b22896E491N3186A8052a17958j12884j4960L1191
9388b14611A42945i389j52547Q0032A67640N6933M6845A34840l4081c92780a0464
9376b5364j91847J0564I865d49692a21789j94232c9725j25330c2389o8700L485
9365i7604b8016B0020a86450A00690a99788E7782B5516N8676c1190j7528C0350
$$ y = [74152, 207416, -67680, 55557, -141649, 283693, -114293, -30068, -154947, 63528, -254447, -482, -148433, -65232, -50197, -20161, -187933, 85019, 485, -196852, -48095, -96131, -192907, -166358, 105115, -209547, -447661, -335241, 65156, 50125, -192756, -50596, -70406, 126763, -98651, 10509, -193690, -202482, 46897, 139775, -178644, -96450, 453172, -432617, -54284, 58930, -237255, 67800, -74780, -4967, -38131, -57266, 151718, -222896, 5491, 58677, 18052, -117958, -230842, -245802, -214611, 142945, -9389, -161936, -81904, 167640, 224573, 271418, 134840, 100759, -392780, -10464, -25364, -217211, -206647, 9865, -449692, -121789, -316021, -39725, -165055, -32389, -101089, -97604, -28016, 20020, -186450, 100690, -199788, 57782, 25516, 84192, -31190, -48718, 30350]
9353c16237A81025d4661B22798k5915h8856A6757a17268c2234l78159H2280f988
9341a70639A46128a17529k60989g4223o0694r0518L983g2821j72285O1516P3119
9330a10471C19098E7485a81775M1334f4287l1245C15304b78914B0487L9357a98632
9318a28435m7730L649F0811J43995B3133O1760b19488f637A14766a7264I6256
9306A34543h1434B45354b51853A16490n5060B3532a34334A29395b05624a00033
9295b6558j45331f6108n45633b31234i5706b7630j8893l1412a5457L98C22544
9283b01558H0496f2108H4252b9800j4698j49383f7415H9791k4100c90389h0076
9271b38405B85475d00028J80847j4203B34586k3049h4122A55837J6346C9254c30135
$$ y = [-316237, 181025, -44661, 222798, 196883, -88856, 16757, -117268, -32234, -410393, 82280, -6988, -170639, 146128, -117529, -378518, -74223, -134917, -225435, -221452, -72821, -245106, -183590, -110471, 319098, 57485, -181775, -140441, -64287, -95532, 315304, -278914, 20487, 59844, -198632, -128435, -176165, -172516, 60811, 204806, 23133, 84893, -219488, -6637, 114766, -17264, 96256, 134543, -81434, 245354, -251853, 116490, 61430, 23532, -134334, 129395, -205624, -100033, -26558, -171889, -66108, -611741, -231234, -95706, -27630, -46523, -77935, -15457, -15059, 322544, -201558, 80496, -62108, 84252, -29800, -44498, -193881, -67415, 89791, 65691, -390389, -80076, -238405, 285475, -400028, -219181, -233384, 234586, 211537, -84122, 155837, 172183, 39254, -330135]
9259A83514q2563N7571a18411d7227A8783c1733k53331b9867p9552C80189a24428
9247a20678c9526D03516b09640F5454c00070i0255C55282I3164d41587g9791n2882
9236a32673e9101J5169j33758j53411M3616A53390b16726a9038k22407J15889
9226a25556H1967b26989o4054A26263B4405J5096i5821K8051q5276C21780k5836
9215B95944a03387p2066A49706i7437j2039M6894k08155k19240A6989J97033a21460
9203a46460E8614i5917o0661B3339J17721c44882C06367H7474L4872a8296B0490
9191b29819R103d8034a4871F944L0520K14229E4726a67567P62b4859B75244a37368
9178D849J78224E6942e6116l9791J5984r0736B91971a56565k27307B1755c2445
$$ y = [183514, 100951, 158522, -118411, -47227, 18783, -31733, -285064, -29867, -109419, 380189, -124428, -120678, -39526, 403516, -209640, 65454, -300070, -90255, 355282, 93164, -441587, -79791, -132673, -59101, -43932, -177690, -331101, -287485, 153390, -216726, -19038, -241445, -125556, 81967, -226989, -291043, 126263, 24405, 39501, -95821, -67770, -153046, 321780, 295944, -103387, -175453, 149706, -97437, -109476, -62582, -270737, -489977, 16989, 214022, -121460, -146460, 58614, -95917, -156578, 23339, 141060, -344882, 306367, 87474, 122346, -18296, 20490, -229819, -220716, -48034, -14871, 6944, 37464, 251693, 54726, -167567, -166805, -24859, 275244, -137368, 4849, 183073, 56942, -56116, -95907, -79923, -170659, 291971, -156565, -383872, 21755, -32445]
9166d2043j55423k40244a50244B25402A4603c3569A39934h4551k10363h0612p1131
9155a51743A50987b0485Q464j13457b9919p569j98279J09583p8645D1656b76991
9143a76820A2708b13189d9026C04170a33870e6513M418k01906G7859B1718b9287
9131A87499i2724j97705L8283A2523b77185n8799a07336k8597e7431b2817k02080
9120b24897A54613P0n4431c7955i29j09729m18297g1601A62558m9315C8230b40056
9107c57835B6784a81289H6296d80539B28729A6648e5131A71931H4411h2278p8564
9096a60842j2175O8530h539E0156r593Q5352a35478A51216a57415N3135l25971
9085d30251O8263J43721j25379b4831j31972L2033A70628b37259A77207b45680
$$ y = [-42043, -197466, -437710, -150244, 225402, 14603, -33569, 139934, -84551, -294914, -80612, -151743, 150987, -20485, -12021, -125478, -29919, -37488, -235767, -126184, -204829, 41656, -276991, -176820, 12708, -213189, -49026, 304170, -133870, -56513, -52095, -254001, 77859, 21718, -29287, 187499, -92724, -290429, -252146, 12523, -277185, -335984, -107336, -135933, -57431, -22817, -224897, 154613, 154683, 100252, -37955, -929, -110658, -528955, -71601, 162558, 113243, 38230, -240056, -357835, 26784, -181289, 86296, -480539, 228729, 16648, -55131, 171931, 84411, -82278, -160842, -173017, -104487, -8539, 50156, 40563, 125915, -135478, 151216, -157415, -104280, -430251, -361988, -218267, -343646, -24831, -156803, -124770, 170628, -237259, 177207, -245680]
9074a86392H2823C1481O8369d2639C3216b51531c1669r4383c7181H0657C2233
9062b56692a6407A08705b25864d0432k1037C8561D374c04618J9801h7396A74372
9050d01096F8597m344b87519a39676K5632I3398a48558i128j80870R0526A94452
9038a78527H7325J4845b95414d9413n2918q8711B8402b35674A57851O1369b06164
9026b02581Q8869q8821a5941n5390A01985b41150k2778j5035D83386F5058b81592
9014h8727q0584A91044J139f4039j9920C1501a72060I0791b03050K0468h9534
9002B0127J64026j3125a81240N6631D3141a28838l1516F9801j9363d3053J6553
8991b6500j92675N6272D1715K04731a0554k27677j20331B3857a23947A38355d935
$$ y = [-186392, 82823, 31481, 99850, -42639, 33216, -251531, -31669, -126052, -37181, 80657, 32233, -256692, -16407, 108705, -225864, -40432, -61469, 38561, 4374, -304618, -284817, -87396, 174372, -401096, 68597, 64253, -287519, -139676, -114044, 93398, -148558, -9128, -189998, -99472, 194452, -178527, 87325, 102170, -295414, -49413, -102331, -191042, 28402, -235674, 157851, 219220, -206164, -202581, -113712, -202533, -15941, -71331, 101985, -241150, -263928, -278963, 483386, 65058, -281592, -88727, -169311, 191044, 192183, -64039, -83959, 31501, -172060, 90791, -203050, -182582, -89534, 20127, 184153, 171028, -181240, -124609, 43141, -128838, -160354, 69801, 50438, -43053, -26500, -219175, -162903, 41715, 246446, -10554, -238231, -358562, 23857, -123947, 138355, -4935]
8979A32892a50242n3729B7879b17181O8613D90551k00552a39044K6211b4082C3809
8967b95120G3242a43421j5631g5503c6427A63099k4030E1487a48579g1887A10601
8955e1036j7856A90639B5774b45635F5000Q724L01110A82608a22052B09881a48864
8943a3859C0071F524R9721m4638e0572o6199e4962r6178c6732C3246f079A00548
8930C4325L339e24619F1657c94083b3252A29252a20635r9001D49748L9106J156016
8919A644870E61225B78651f8728m8959K1522n7424O4119a8298j71693L7109O5108
8908h7774A60784b48669c249B12052b42542e1288A13004f215m074H7834a10690
8896b0083k87449g9785A05992e1789H5603a64384B26810b30090j12532c9633m5182
$$ y = [132892, -150242, -203971, 27879, -217181, -148568, 490551, 289999, -139044, -112833, -24082, 33809, -295120, 73242, -143421, -159052, -75503, -36427, 163099, 139069, 51487, -148579, -71887, 110601, -51036, -68892, 190639, 25774, -245635, 65000, 73724, 374834, 182608, -122052, 209881, -148864, -13859, 30071, 6524, 106245, 61607, -50572, -116771, -54962, -151140, -36732, 33246, -6079, 100548, 34325, 37664, -524619, 61657, -394083, -23252, 129252, -120635, -219636, 449748, 488854, 1644870, 561225, 278651, -68728, -117687, -96165, -153589, -89470, -18298, -189991, -152882, -87774, 160784, -248669, -3249, 212052, -242542, -51288, 113004, -6215, -10289, 87834, -110690, -20083, -307532, -79785, 105992, -51789, 85603, -164384, 226810, -230090, -342622, -39633, -84815]
8885h4815j31588J1171G2435L108d1170p5992I0810p367k5676a92116A14864a2461
8872B99353e7996l0737k4950d2247j39340J7176r9763J04378c5515l6124I4612
8860b86639I0534k3513M9865e9316A58685M7875B6643a1670k18213D7880b82741
$$ y = [-84815, -216403, -205232, 72435, 75543, -41170, -117162, 90810, 83443, 57767, -192116, 114864, -12461, 299353, -57996, -88733, -113683, -42247, -181587, -164411, -264174, -159796, -35515, -71639, 94612, -286639, 90534, 67021, 116886, -59316, 158685, 206560, 26643, -11670, -229883, 47880, -282741]
$$ [...]
##END NTUPLES=NMR SPECTRUM
##END=
