##TITLE=NES1014_956665_9233183_m24fQOtjPl
##JCAMPDX= 6.0         $$ Bruker NMR JCAMP-DX V2.0
##DATA TYPE= NMR SPECTRUM
##DATA CLASS= NTUPLES
##ORIGIN= BRUKER
##OWNER= Administrator
$$ 1.72 TOPSPIN		Version 2.1
$$ 2015-06-18 10:04:19.034 -0700  Administrator@X
$$ Compression mode = diff/dup
##.OBSERVE FREQUENCY= 400.02188249412
##.OBSERVE NUCLEUS= ^1H
##.ACQUISITION MODE= SIMULTANEOUS (DQD)
##.ACQUISITION SCHEME= undefined
##.AVERAGES= 8
##.DIGITISER RES= 22
##SPECTROMETER/DATA SYSTEM= spect
##.PULSE SEQUENCE= zg30
##.SOLVENT NAME= COFFEE_meoh
##.SHIFT REFERENCE= INTERNAL, COFFEE_meoh, 1, 14.98509
##AUDIT TRAIL= $$ (NUMBER, WHEN, WHO, WHERE, PROCESS, VERSION, WHAT)
$$ ##TITLE= Audit trail, TOPSPIN		Version 2.1
$$ ##JCAMPDX= 5.01
$$ ##ORIGIN= Bruker BioSpin GmbH
$$ ##OWNER= Administrator
$$ $$ E:\/data/COFFEE/nmr/NES1014_956665_9233183_m24fQOtjPl/10/pdata/1/auditp.txt
$$ ##AUDIT TRAIL=  $$ (NUMBER, WHEN, WHO, WHERE, PROCESS, VERSION, WHAT)
(   1,<2015-06-18 10:04:11.894 -0700>,<Administrator>,<X>,<go>,<TOPSPIN 2.1>,
      <created by zg
	started at 2015-06-18 10:03:06.081 -0700,
	POWCHK enabled, PULCHK disabled,
       configuration hash MD5:
       21 0F 79 D6 B3 7B B4 F6 88 20 88 DB 03 48 BD 9F
       data hash MD5: 64K
       AC 71 35 A9 31 27 E2 49 B4 75 11 B6 40 F6 65 81>)
(   2,<2015-06-18 10:04:15.019 -0700>,<Administrator>,<X>,<proc1d>,<TOPSPIN 2.1>,
      <Start of raw data processing
       efp LB = 0 FT_mod = 6 PKNL = 1 PHC0 = 0 PHC1 = 0 SI = 32K 
       data hash MD5: 32K
       A7 27 E8 AC D4 63 43 42 84 4A 26 5B DA 8B B4 0E>)
(   3,<2015-06-18 10:04:15.331 -0700>,<Administrator>,<X>,<proc1d>,<TOPSPIN 2.1>,
      <pk PHC0 = 91.59302 PHC1 = 0 
       data hash MD5: 32K
       B2 B4 B8 7C 35 84 B7 43 68 0A 42 00 DC 7F B3 6A>)
(   4,<2015-06-18 10:04:15.441 -0700>,<Administrator>,<X>,<proc1d>,<TOPSPIN 2.1>,
      <abs ABSG = 1 
       data hash MD5: 32K
       1B 4A CC 41 C3 DC 3E AD D7 2A EA 94 18 30 79 9D>)
(   5,<2015-06-18 10:04:15.503 -0700>,<Administrator>,<X>,<proc1d>,<TOPSPIN 2.1>,
      <abs ABSG = 2 
       data hash MD5: 32K
       5E 33 C3 B3 01 78 62 B5 D7 8F 9D 07 62 EC F0 0A>)
(   6,<2015-06-18 10:04:15.566 -0700>,<Administrator>,<X>,<proc1d>,<TOPSPIN 2.1>,
      <abs ABSG = 3 
       data hash MD5: 32K
       0C 37 47 EC 61 D2 A5 09 59 9A 3A 83 11 21 3A 73>)
(   7,<2015-06-18 10:04:15.628 -0700>,<Administrator>,<X>,<proc1d>,<TOPSPIN 2.1>,
      <abs ABSG = 4 
       data hash MD5: 32K
       29 65 CB C1 1E 64 A5 8F 92 38 69 DA A6 CC 2B CE>)
(   8,<2015-06-18 10:04:15.675 -0700>,<Administrator>,<X>,<proc1d>,<TOPSPIN 2.1>,
      <abs ABSG = 5 
       data hash MD5: 32K
       75 7C 41 4C 7E E8 A0 AA EC D0 C2 8D F5 CE A4 8C>)
$$ ##END=
$$ 
$$ $$ hash MD5
$$ $$ D8 CF 58 36 56 C5 94 98 82 27 12 38 BE 7B AD 75
##$RELAX= 
##$RELAX= 
##$RELAX= 
##$RELAX= 
##$RELAX= 
##$RELAX= 
##$RELAX= 
$$ Bruker specific parameters
$$ --------------------------
##$DU= <E:\>
##$EXPNO= 10
##$NAME= <NES1014_956665_9233183_m24fQOtjPl>
##$PROCNO= 1
$$ [...]
150 150 150 150 150 150 150 150
##$TP07= 0
##$TPNAME0= <>
##$TPNAME1= <>
##$TPNAME2= <>
##$TPNAME3= <>
##$TPNAME4= <>
##$TPNAME5= <>
##$TPNAME6= <>
##$TPNAME7= <>
##$TPOAL= (0..7)
0.5 0.5 0.5 0.5 0.5 0.5 0.5 0.5
##$TPOFFS= (0..7)
0 0 0 0 0 0 0 0
##$TUNHIN= 0
##$TUNHOUT= 0
##$TUNXOUT= 0
##$USERA1= <user>
##$USERA2= <user>
##$USERA3= <user>
##$USERA4= <user>
##$USERA5= <user>
##$V9= 5
##$VALIST= <valist>
##$VCLIST= <CCCCCCCCCCCCCCC>
##$VD= 0
##$VDLIST= <DDDDDDDDDDDDDDD>
##$VPLIST= <PPPPPPPPPPPPPPP>
##$VTLIST= <TTTTTTTTTTTTTTT>
##$WBST= 2048
##$WBSW= 25
##$XGAIN= (0..3)
0 0 0 0
##$XL= 0
##$YL= 0
##$YMAX_a= 625079
##$YMIN_a= -522358
##$ZGOPTNS= <>
##$ZL1= 120
##$ZL2= 120
##$ZL3= 120
##$ZL4= 120
##$ABSF1= 14.98509
##$ABSF2= -5.573092
##$ABSG= 5
##$ABSL= 3
##$ALPHA= 0
##$AQORDER= 0
##$ASSFAC= 0
##$ASSFACI= 0
##$ASSFACX= 0
##$ASSWID= 0
##$AUNMP= <proc_prof1d_extract_pilot.lims>
##$AXLEFT= 0
##$AXNAME= <>
##$AXNUC= <1H>
##$AXRIGHT= 0
##$AXTYPE= 0
##$AXUNIT= <>
##$AZFE= 0.1
##$AZFW= 0.1
##$BCFW= 0
##$BC_mod= 0
##$BYTORDP= 0
##$COROFFS= 0
##$CY= 15
##$DATMOD= 1
##$DC= 0
##$DFILT= <>
##$DTYPP= 0
##$F1P= 0
##$F2P= 0
##$FCOR= 0.5
##$FTSIZE= 32768
##$FT_mod= 6
##$GAMMA= 0
##$GB= 0
##$INTBC= 1
##$INTSCL= 1
##$ISEN= 128
##$LB= 0
##$LEV0= 0
##$LPBIN= 0
##$MAXI= 10000
##$MC2= 0
##$MEAN= 0
##$ME_mod= 0
##$MI= 0
##$NCOEF= 0
##$NC_proc= -8
##$NLEV= 6
##$NOISF1= 0
##$NOISF2= 0
##$NSP= 0
##$NTH_PI= 0
##$NZP= 0
##$OFFSET= 14.98509
##$PC= 1
##$PHC0= 91.59302
##$PHC1= 0
##$PH_mod= 1
##$PKNL= yes
##$PPARMOD= 0
##$PPDIAG= 0
##$PPIPTYP= 0
##$PPMPNUM= 2147483647
##$PPRESOL= 1
##$PSCAL= 4
##$PSIGN= 0
##$PYNMP= <proc.py>
##$REVERSE= no
##$SF= 400.02
##$SI= 32768
##$SIGF1= 0
##$SIGF2= 0
##$SINO= 400
##$SIOLD= 32768
##$SPECTYP= <>
##$SREGLST= <1H.CDCl3>
##$SSB= 0
##$STSI= 32768
##$STSR= 0
##$SW_p= 8223.68421052631
##$SYMM= 0
##$S_DEV= 0
##$TDeff= 65536
##$TDoff= 0
##$TI= <>
##$TILT= no
##$TM1= 0
##$TM2= 0
##$TOPLEV= 0
##$USERP1= <user>
##$USERP2= <user>
##$USERP3= <user>
##$USERP4= <user>
##$USERP5= <user>
##$WDW= 1
##$XDIM= 32768
##$YMAX_p= 444677375
##$YMIN_p= -702045
##$CURPLOT= <Network HP LaserJet P1505>
##$CURPRIN= <$Network HP LaserJet P1505>
##$DFORMAT= <normdp>
##$LAYOUT= <+/1D_H.xwp>
##$LFORMAT= <normlp>
##$PFORMAT= <normpl>
##$SURQMSG= 1
$$ End of Bruker specific parameters
$$ ---------------------------------
##NTUPLES= NMR SPECTRUM
##VAR_NAME=  FREQUENCY,     SPECTRUM/REAL,   SPECTRUM/IMAG
##SYMBOL=    X,             R,               I
##VAR_TYPE=  INDEPENDENT,   DEPENDENT,       DEPENDENT
##VAR_FORM=  AFFN,          ASDF,            ASDF
##VAR_DIM=   32768,         32768,           32768
##UNITS=     HZ,            ARBITRARY UNITS, ARBITRARY UNITS
##FACTOR=    0.250966925370066, 1,           1
##FIRST=     8223.43324360094, 38027,        10616
##LAST=      0,             -286979,         -157492
##MIN=       0,             -702045,         0
##MAX=       8223.43324360094, 444677375,    0
$$ Real data points
##PAGE= N=1
##DATA TABLE= (X++(R..R)), XYDATA
$$ [...]
19459a768p9873j70917J08518P559M4071j92258R587F2932J39024a15210r9449
19448b14659I6334C7222J87854b67311e9452D6761b13891c1400q8170o1016l24489
19437e05075A00706a05554k76106A00418e2879j255G8974L7245b22481A09014
19426a68327o2261c1215k35327A74888o3265a13638m4768I4125e6350a4768A32625
19414A1883L3658d668j60963r826B8801J77254D7283a56747r0347C8806b28064
19402h9956A29962b55889J27353A01607d9729k00369A9073b73358A0246L336e8273
19390C98073j45643a14455F5730K32646c13528H8194f0154B71233j1364A15057
19379b1071E18302d69704C883R3625b42481M5033P8914l7703M5155B76364C3043
$$ y = [-1768, -81641, -252558, -144040, -136481, -92410, -284668, -275081, 62932, 201956, -115210, -214659, 96334, 37222, 225076, -267311, -59452, 46761, -213891, -31400, -119570, -180586, -505075, 100706, -105554, -381660, 100418, -52879, -54134, 78974, 116219, -222481, 109014, -168327, -230588, -31215, -266542, 174888, 111623, -113638, -158406, 94125, -56350, -14768, 132625, 11883, 45541, -4668, -165631, -175457, 28801, 206055, 47283, -156747, -247094, 38806, -228064, -89956, 129962, -255889, -128536, 101607, -49729, -250098, 19073, -273358, 10246, 13582, -58273, 398073, 252430, -114455, 65730, 298376, -313528, 88194, -60154, 271233, 259869, 115057, -21071, 518302, -469704, 3883, 97508, -242481, -197448, -118534, -156237, -111082, 276364, 33043]
19367b43843Q7113M810E404c73005E4974J6891P7234j3550D9311J87912g1287
19355a75099F0766A0624b79249H9903B068b4892j21197c700C0111b54357b7745
19343e01458H4487a71676b2939j1595H2479e4822Q06j9469l05444d7726k00895
19332b48621p6619r5122e3777A5519b47901J6345a02984n211l09189a94797h045
19320a85169q8081O8440A2014b82041A98272E9497b05977G8707d56036c3197k28607
19309b61804H7487J95241a57555C05559a19415A27236a88036H6420J01080e4508
19298e2959A48221c11766m650p768n440D2010a16050j5927l79039a14501j33066
19287b47567i0313F8392P341f7869k9874c1042j57774l3668B4110c58642a22111
$$ y = [-243843, -156730, -151920, 5404, -373005, 54974, 71865, 149099, 135549, 49311, 237223, -71287, -175099, 60766, 10624, -279249, 89903, 2068, -24892, -146089, -3700, 30111, -254357, -27745, -501458, 84487, -171676, -22939, -34534, 82479, -54822, -54016, -73485, -378929, -47726, -248621, -325240, -420362, -53777, 15519, -247901, -231556, -102984, -108195, -417384, -194797, -8045, -185169, -273250, -204810, 12014, -282041, 198272, 59497, -205977, 78707, -456036, -33197, -261804, 87487, 282728, -157555, 305559, -119415, 127236, -188036, 86420, 187500, -54508, -52959, 148221, -311766, -316416, -324184, -329624, 42010, -116050, -131977, -511016, -114501, -247567, -90313, 68392, 75733, -67869, -97743, -31042, -188816, -222484, 24110, -358642, -122111]
19275e9880H6868b19927k7484A3204J94469J55449f2807H8197B9344a71640C49590
19263a91807f1494k62128F1193b85027A78773a85148m6968A74468b6534l8925
19253f5459A02893A6989a08975J1877H9675b26744M1086M3857L5623p321K1536
19242i1963j6759j04599R5539B06422H0766h4039I6746i8866n726j40346R4902
19231a50036C3534j5720f7482B5854a71791C557a71830k09020f1535H3782q833
19220G4949Q9707f0150I8783a69549j77464A99105A0397a58513k00354J75859
19210a83008N6250b415G3046b05518A04444b14821A75153K72028b11861b5310
19199i0448A08700A8319a75419j93481J57320E04072E2881a11425I8059c58518
$$ y = [-59880, 86868, -219927, -247411, 13204, 207673, 363122, -62807, 88197, 29344, -171640, 349590, -191807, -61494, -323622, 61193, -285027, 178773, -185148, -232116, 174468, -26534, -65459, 102893, 16989, -108975, -97098, 89675, -226744, -185658, -141801, -106178, -113499, -91963, -108722, -213321, -117782, 206422, 80766, -84039, 96746, -98866, -104592, -244938, -150036, 33534, 17814, -67482, 25854, -171791, 3557, -171830, -380850, -61535, 83782, 74949, 164656, -60150, 98783, -169549, -347013, 199105, 10397, -158513, -358867, -183008, -126758, -2415, 73046, -205518, 104444, -214821, 175153, 447181, -211861, -25310, -90448, 108700, 18319, -175419, -368900, -211580, 504072, 52881, -111425, 98059, -358518]
19188A21392E7365J35536a80868D2587e8103r836A62441a68789A33963b10856
19177e196k06651Q0946J402e0241r3909j6749e2519E7881P1291a03380j39408
19166b42788I1709d94874a11393A89074a34612A16698a67399J1629F1696L11546
19156C73242g9909J329B90448a07301l2677C7447f4508j32411H9077b775k86857
19145b89632p2923i6942l1870H4031f4726F1164K14388b13070j90703J88613A93274
19133C3620f5250k65006A43198A2041b341j86642b6642E168J97154g3940A07O5965
19121F6072a03389D6097O2203K659j0869A1470J09614m2483b99092p0602a49280
19109a67606k38977D6599a16615K2540q5553m0237r3330b7708j9184A66958a9334
$$ y = [121392, 57365, 192901, -180868, 42587, -58103, -67939, 162441, -168789, 133963, -210856, -5196, -211847, -130901, -129499, -50241, -144150, -160899, -52519, 57881, 129172, -103380, -242788, 91709, -494874, -111393, 189074, -134612, 116698, -167399, -155770, 61696, 373242, -79909, -78580, 290448, -107301, -139978, 37447, -64508, -196919, 89077, -2775, -289632, -362555, -96942, -128812, 84031, -64726, 61164, 275552, -213070, -403773, -215160, 193274, 33620, -65250, -330256, 143198, 12041, -2341, -188983, -26642, 5168, 202322, -73940, 107, 66072, -103389, 46097, 108300, 110959, 100090, 11470, 121084, 78601, -299092, -369694, -149280, -167606, -406583, 46599, -116615, -94075, -179628, -219865, -313195, -27708, -46892, 166958, -19334]
19097f4602k67311A92792I3205d1085I3829a20288k9249J4331G15e5898k57602
19086c13500F6161a74682b3377k2851j46574o7288P7483j44177J30908E5976a177
19074a44366F3634N8658c64135a19606C6438f9300k25997A69875d80712A99075
19063d47100i3562F0743J1032a8938p3260d4207m0553k8331F1214a37441q0881
19052b18322A56429J582D7775M74057b09597B9420M0160d7304J3831n8949j0510
19041a02932k0230c4760q6211H1610h9918B3076a36930q2303c5331j88278g5885
19029C25803c5406B26591E1068d8185A7484J94797h679D1986h4711C230b30027
19017A0401K20063c99995H3374b52260A0856b20939f6040j48214h9064b0030B92761
$$ y = [-64602, -331913, 192792, 93205, -41085, 93829, -120288, -149537, -135206, 715, -55898, -313500, 66161, -174682, -23377, -46228, -192802, -260090, -182607, -326784, -195876, 55976, -1177, -144366, 63634, 122292, -364135, -119606, 36438, -69300, -295297, 169875, -480712, 199075, -447100, -93562, 60743, 71775, -18938, -92198, -44207, -84760, -113091, 61214, -137441, -218322, 156429, 158011, 47775, 521832, -209597, 29420, 69580, -47304, -33473, -92422, -102932, -123162, -34760, -120971, 81610, -89918, 23076, -136930, -219233, -35331, -223609, -75885, 325803, -35406, 226591, 51068, -48185, 17484, 212281, -8679, 41986, -84711, 3230, -230027, 10401, 230464, -399995, 83374, -252260, 10856, -220939, -66040, -214254, -89064, -20030, 292761]
19005e5701j12909d7200G9807a67815E464g3162j62092O0578n695J8103e814H6111
18992b13003A5823R5061c10763E2541K02742b4275l7202C47935b6688j79007q1733
18981b87428F3654d535A11157n0971b73319a11917L5492B21008p5981L53894R4600
18970E93521k79667k379h4677G1804b05246A84679b04336F1581b0255d474C8326
18958a36780a7315k69564B18390a02685B59793a89059e7520K5676C7983b49626
18947a98864A21110b73728e2938B490J37241b58611a09941B48277a32447a8504
18936c17912h3441A9160f985j89039P92h0842K67a2280p6192c5713A3755Q6300
18924A00055K06a99686j91282a11961A37911a56351d6877C3467p267M2496R1483
$$ y = [-55701, -168610, -47200, 79807, -167815, 5464, -73162, -235254, -174676, -180371, -162268, -5814, 86111, -213003, 15823, 110884, -310763, 52541, 255283, -24275, -61477, 347935, -26688, -205695, -287428, 63654, -4535, 111157, 60186, -273319, -111917, -76425, 221008, 145027, 498921, 593521, 313854, 311475, -84677, 71804, -205246, 184679, -204336, 61581, -20255, -4474, 38326, -136780, -17315, -286879, 218390, -102685, 259793, -189059, -57520, -31844, 37983, -249626, -198864, 121110, -273728, -52938, 2490, 139731, -258611, -109941, 248277, -132447, -18504, -317912, -83441, 19160, -6985, -196024, -195232, -80842, -80575, -12280, -88472, -35713, 13755, 100055, 100261, -199686, -390968, -111961, 137911, -156351, -46877, 33467, 26200, 68696, 160179]
18913A60179G5764A5834L8644J31013N87117B10907j8662p9667A1479O3031L12229
18902C86739j55435p2774l2835b06031A55781l0160b07036B28459E0255d4609
18891d7885j51942B9439h0108C2622p461B393a15253A14373b3958n8842j38325
18880b21125j38776a55140G0066d5055m616l55510N0781J72752j64599J51265
18870a94982F2585K8304A1400m556K37079a15181j42966o8022Q4433G1746b56271
18858g6478R842R964l20053a5442j64580L0234j14886j31197J17846G1322A3065
18846b60178B24771a26018j4750H308K41362a77852l5031A43586b31377F8989
18835I4410a48822p8032A12139a70269H9335a98078B23540c0342k13221A23706
$$ y = [160179, 75764, 15834, 54478, 185491, 772608, 210907, 192245, 112578, 11479, 74510, 386739, 231304, 158530, 125695, -206031, 155781, 125621, -207036, 228459, 50255, -44609, -47885, -199827, 29439, -80108, 32622, 25161, 2393, -115253, 114373, -23958, -82800, -221125, -359901, -155140, 70066, -45055, -49671, -405181, -354400, -181648, -346247, -194982, 62585, 90889, 11400, 6844, 243923, -115181, -258147, -326169, -241736, 71746, -256271, -76478, -66636, -56672, -376725, -15442, -180022, -149788, -264674, -395871, -278025, 71322, 13065, -260178, 224771, -126018, -140768, 8308, 249670, -177852, -212883, 143586, -231377, 68989, 94410, -148822, -226854, 112139, -170269, 89335, -198078, 223540, -30342, -243563, 123706]
18824b95931B26082D3670a73729A3617a51272e012I0334J7532J4064o000h0284
18812a93485a0965A68924P9430G8862f646B89455m1978p3430G4879P6922b10956
18800d3787j06378L6500A75582a21010B10041c81768A67405L5570c2706l8645
18790g1351l8450A91681a0889p5581o2984M2070o7269A07891J8374a54346E4972
18778b3720D98004a71061k21400d6080A29577e365j7420j60842N2774B68383b97361
18766a41014A7894J96891a35417N9842k65445a52147j95339B0068b68827I7729
18755a35266K8832H2514d58864L8707g4865C079a74774b8193F8718a9415j18060
18744a37475F0890B4890h3381B34955b62630A03683B5531d40568f6017F5813J48322
$$ y = [-295931, 226082, 43670, -173729, 13617, -151272, -5012, 90334, 107866, 121930, 115930, -80284, -193485, -10965, 168924, 248354, 78862, -6646, 289455, 247477, 174047, 74879, 151801, -210956, -43787, -150165, -113665, 175582, -121010, 210041, -381768, 167405, 202975, -32706, -71351, -109801, 191681, -10889, -86470, -149454, -107384, -174653, 107891, 126265, -154346, 54972, -23720, 498004, -171061, -392461, -46080, 129577, -5365, -22785, -183627, -130853, 268383, -297361, -141014, 17894, 214785, -135417, -75575, -341020, -152147, -347486, 20068, -268827, 97729, -135266, -106434, 82514, -458864, -420157, -74865, 3079, -174774, -28193, 68718, -19415, -137475, 60890, 24890, -83381, 234955, -262630, 103683, 25531, -440568, -66017, 65813, 214135]
18733B14135c35195J50704p4800g7532K1178j37392d706k4359h695j65646A23455
18721B21872e3918a1240A968K31298b51174m2586A43680d071j84862m6455G7490
18709a70570A11839e5957b3643C28508I8009a4941j25313E4474b43144N2304I941
18697b83265O455g3925n3491k9233A7844g1497H5192a01761A05392P8349g6796
18685i7806k0529n6957j41248A28988a72509A30420L8348b03286B97722a5904
18674B6875h0272A41943a86706A21137g3674a3580B1407a60028C5280K1757i6524
18662F7555A3890a9337A45143n6875M9638B0152d1437p2388k1470C0086a09495
18650b38740M0753A88025A9386O7033b40031C7241J17508a46935j83069e279C39564
$$ y = [214135, -335195, -184491, -259291, -77532, -56354, -193746, -4706, -29065, -8695, -174341, 123455, 221872, -53918, -11240, 1968, 233266, -251174, -293760, 143680, -4071, -188933, -235388, 77490, -170570, 111839, -55957, -23643, 328508, 98009, -14941, -140254, 54474, -243144, -190840, 9941, -283265, -276810, -73925, -127416, -156649, 17844, -71497, 85192, -101761, 105392, 183741, -76796, -97806, -118335, -175292, -316540, 128988, -172509, 130420, 168768, -203286, 297722, -15904, 26875, -80272, 141943, -186706, 121137, -73674, -13580, 21407, -160028, 35280, 57037, -96524, 67555, 13890, -19337, 145143, 88268, 137906, 20152, -41437, -113825, -135295, 30086, -109495, -238740, -197987, 188025, 19386, 86419, -240031, 37241, 154749, -146935, -330004, -5279, 339564]
18638i6247k16274J07676A03789b67712J06074O0539A84893a25876r057j05352
18628b40285J11261D80806b12999B2630L16496e8197l4433A23930a24207k11304
18618c35511h4394k1589A59372D6908h1517C6026K34153n1867g6111A10492J13568
18607B24060a12187j80862a8273G9040a16079i463p8581q948n133J0732K6885
18596f4508J4576C32407c28534O3910A1235c6851j7571D8099b21190a777j55921
18585a57698j60939J20926D7729d8089n3070M2917j07736C0706d39303d0705H1489
18573I3963b45401a12186A01693k2306a54978E7279b66789j8186E3865c36507
18562c0086i964A40776b30542A64865b18719e4941j13089B8074K4095N1827J04357
$$ y = [-96247, -312521, -204845, 103789, -267712, -161638, -101099, 184893, -125876, -134933, -240285, -129024, 480806, -212999, 22630, 339126, -58197, -92630, 123930, -124207, -335511, -84394, -105983, 159372, 46908, -81517, 36026, 270179, 218312, -76111, 110492, 224060, -112187, -293049, -18273, 79040, -116079, -9463, -88044, -96992, -102125, -91393, -64508, -49932, 332407, -328534, -264624, 11235, -36851, -54422, 48099, -221190, -1777, -157698, -318637, -197711, 47729, -48089, -101159, -58242, -165978, 30706, -439303, -40705, 81489, 93963, -245401, -112186, 101693, 79387, -154978, 57279, -266789, -284975, 53865, -336507, -30086, -9964, 140776, -230542, 164865, -218719, -54941, -168030, 28074, 52169, 103996, 208353]
18551B08353h5944r6271c2121G0397g5308n8523H6934O894d93237B66779A01581
18539b33787a13337k7801i270C2119j3276o44a4970k10385o373F6671a90229A71148
18526c47972a04187p3533P1793H028b15775k21259a20466o5578B68488b59504
18515B21467a86153a1948B68907o5421d692A60428b35196B27946l9155e1743b3871
18503A1325K00005g8754c6550E2065a47877o0726e6038L824q4612k7249a4737
18491D3471b62183e2411m0893A07684a60709C1153P2334E0943a46029b1393j33462
18480a54855b7765j4464G4660h4368C7779K96026r8706b81509G0215c04283a15393
18468A63405b69496I1763b08313P4282A33627a97570B52336e6596m3837n1116
$$ y = [208353, -85944, -182215, -32121, 70397, -75308, -133831, 86934, 93828, -493237, 266779, 101581, -233787, -113337, -141138, -9270, 32119, 18843, 18199, -14970, -225355, -231728, 66671, -190229, 171148, -347972, -104187, -177720, -105927, 8028, -215775, -437034, -120466, -186044, 268488, -259504, 221467, -186153, -11948, 268907, 203486, -4692, 160428, -235196, 227946, 188791, -51743, -23871, 11325, 211330, -78754, -36550, 52065, -147877, -208603, -56038, -52214, -136826, -164075, -14737, 43471, -262183, -52411, -93304, 107684, -160709, 31153, 103487, 50943, -146029, -21393, -154855, -27765, -42229, 74660, -84368, 37779, 333805, 235099, -281509, 70215, -304283, -115393, 163405, -269496, 91763, -208313, -134031, 133627, -197570, 252336, -56596, -100433, -151549]
18458a51549f2184b8477j61254g3966A14277J45437K6869C751L196a63266c8510
18446B17599h4943j51368C5761a05995j165J2990c854j88157J6653E1502j5234
18435C6268P4222a99029c3690l2724C4521a24946L9254c6979J1394j0965l0305
18424f6855j3006p5182J6569l3580B3393J23481D7278i5465m6398O1478B08313
18412A12394b5567j82772a2611k52711A78786i8965m6918E431L6985O1005N8322
18401A61743a73095A0349L3537b1611B87486A22514C3888a60610A99740F7842
18390a10085p4247A64564a40676A5100a16666j11770R0132m8074P4936q7458C18323
18378a11742n6579Q0191F0716M1334a96522g6949B46644K3004r8044b5246r1507
$$ y = [-151549, -62184, -28477, -189731, -73966, 114277, 259714, 286583, 3751, 6947, -163266, -38510, 217599, -84943, -236311, 35761, -105995, -107160, -94170, -3854, -192011, -175358, 51502, 36268, 110490, -199029, -33690, -66414, 34521, -124946, -85692, -36979, -25585, -36550, -66855, -79861, -155043, -138474, -172054, 23393, 146874, 47278, -95465, -141863, -80385, 208313, 112394, -25567, -208339, -12611, -265322, 178786, -98965, -145883, 5431, 42416, 103421, 161743, -173095, 10349, 43886, -21611, 287486, 122514, 33888, -160610, 199740, 67842, -110085, -184332, 164564, -140676, 15100, -116666, -228436, -138304, -186378, -111442, -198900, 318323, -111742, -168321, -88130, 60716, 102050, -196522, -76949, 246644, 269648, 171604, -25246, -116753]
18367a16753C5047J26974a83967I9791L9202c22135a33609D8265j5505b49498
18356b79900E23910A06714f1461A35094n052g1424E7980a65148l2962R1981G7072
18344D8968R77a16764c3376j84476A20821B9679N3678b85051p1996D269c00024
18332a34003l7379N5194A30486b1000H9242b51777J14764A09759a82382k27258
18322d09640H6105a90592I3478k8595b48578c6987H3672E216J2715L2129b56638
18310d7402q2728A89319c3115B67922c337k43399p2578C7535a00142M9535J2792
18299c7815C7494Q7973h9170D7307b70634A79935B8793c0653k49518B34656F7262
18287a96719A16503k7744a03652K8644o5856E0745h7673J296q6269j89052D7187
$$ y = [-116753, 35047, 162021, -183967, 99791, 138993, -322135, -133609, 48265, 32760, -249498, -279900, 523910, 106714, -61461, 135094, 130042, -71424, 57980, -165148, -198110, -106129, 77072, 48968, 49945, -116764, -33376, -217852, 120821, 29679, 83357, -285051, -357047, 4269, -300024, -134003, -171382, -116188, 130486, -21000, 89242, -251777, -137013, 109759, -182382, -409640, 86105, -190592, 93478, 64883, -248578, -36987, 83672, 5216, 17931, 50060, -256638, -47402, -130130, 189319, -33115, 267922, -3337, -246736, -319314, 37535, -100142, -50607, -37815, 37494, 125467, -89170, 47307, -270634, 179935, 28793, -30653, -280171, 234656, 67262, -196719, 116503, 88759, -103652, -75008, -140864, 50745, -87673, -86377, -172646, -361698, 47187]
18275A31227L7391c55430j6815A3595d3617B1328J5196P0b66962c2268k56653
18264b88921J6297d1229j57414E0138h2901I6367c49A58807C2564a83170j64184
18253c47354e5510F5216a72993A11994k9752d7658l34349i9304a1997C710K67752
18242B71462c07536E2684i038j40287d5495C16918a36731M7382G7094a29187A20700
18230D61322a41183J0752I3994a20561H8769i5428H7528j555N0968l7479k1601
18219G7861b3119C44971a41303A8403b71299A4280K9133j7039a18698F8808l4027
18208C4781a25712H9786i2406j23946n3246a22557A35690b2529j67035A50130
18197b10053A49312C2170b82129B32d8127A38991D1803c97309g6609C8052m368
$$ y = [131227, 168618, -355430, -372245, 13595, -43617, 21328, 36524, 36594, -266962, -32268, -288921, -272624, -41229, -198643, 50138, -82901, 96367, -349, 158807, 32564, -183170, -347354, -55510, 65216, -172993, 111994, 82242, -47658, -382007, -99304, -11997, 3710, 271462, -307536, 52684, -9038, -149325, -45495, 316918, -136731, -89349, 77094, -129187, 120700, 461322, -141183, -130431, 93994, -120561, 88769, -95428, 87528, 85973, 136941, 99462, 77861, -23119, 344971, -141303, 18403, -271299, 14280, 43413, 26374, -118698, 68808, 34781, -125712, 89786, -92406, -216352, -269598, -122557, 135690, -22529, -189564, 150130, -210053, 149312, 32170, -282129, 232, -48127, 138991, 41803, -397309, -76609, 38052, 33684]
18186C3684R184J18227a25250j7261B37258A06763J5968D2980a4464C9077N3533
18175I2610K82693a13543C9488q098b81880h6526g724G2856A5807R9922f3534
18163g1342k35212J1668J31212b4520j07978e9267B04279a54224A21320B737b59896
18151a35336b7613j40682A38086c6932j46529K5784o8865A50159o9009K16603
18141B97753A11500K77614f1696A37514i2488K7174b6091A15171h4799n3434j22067
18130b60300C23667C7606f6534j70916J01899f2957j9517d163B61703a13528I2490
18118h4740A80709d9740K2617j06489b5161B61875a62527B08678i1671A9324e7781
18106a52729c5620l2124r3630b9250A50925a29029O965E09819b62326G6806Q2358
$$ y = [33684, 42868, 161095, -125250, -142511, 237258, 106763, 122731, 42980, -14464, 39077, 92610, 375303, -113543, 39488, 31390, -281880, -86526, -7724, 72856, 15807, 115729, -63534, -71342, -306554, -294886, -163674, -24520, -132498, -59267, 204279, -154224, 121320, 2737, -259896, -135336, -27613, -168295, 138086, -36932, -183461, -157677, -226542, 150159, 81150, 297753, 111500, 389114, -61696, 137514, -92488, -65314, -26091, 115171, -84799, -138233, -260300, 323667, 37606, -66534, -237450, -135551, -62957, -82474, -4163, 261703, -113528, 92490, -84740, 180709, -49740, -27123, -133612, -25161, 261875, -162527, 208678, -91671, 19324, -57781, -152729, -35620, -67744, -161374, -29250, 150925, -129029, -122064, 509819, -262326, 76806, 159164]
18095A59164L622A0598J07860i4593A19809E041O8972O9252g3162m3988M7051
18084g0099b8021B66819j28773b6756m9391I2321C0644a52129B96312A07296A7788
18072f5820E8058N5048C6931O9166J76665a32467k4145n5652K9786b7835j30249
18061a58084e917A88476k6903a18592A4781a03717A10057D7782i6842k03499a7688
18049b80032A32398i3606m14206a18231e1872D2730K6478H30a22419B67146a96427
18037a98480P7246n8322f6201a4989C6992d7946E5736a8735F740K48754D7263
18025B32404o5134b80228f5957j53168L7637A47335b7098B34741a46393f2302
18014A85545b55563A34795m3112a02141k7487M4518m0573A986M9506J23709b51534
$$ y = [159164, 162786, 10598, 118458, -94593, 119809, 5041, 74013, 143265, -73162, -117150, -70099, -28021, 266819, 138046, -26756, -76147, 92321, 30644, -152129, 296312, 107296, 17788, -65820, 58058, 113106, 36931, 106097, 282762, -132467, -156612, -212264, -182478, -27835, -158084, -5917, 188476, 161573, -118592, 14781, -103717, 110057, 47782, -96842, -300341, -17688, -280032, 132398, -93606, -507812, -118231, -51872, 42730, 69208, 830, -122419, 267146, -196427, -198480, -121234, -179556, -66201, -14989, 36992, -47946, 55736, -18735, 6740, 255494, 47263, 232404, 167270, -280228, -65957, -219125, -181488, 147335, -27098, 234741, -146393, -62302, 185545, -255563, 134795, 91683, -102141, -129628, -85110, -125683, 1986, 51492, 175201, -251534]
18002I0251N3165J00630b35335B7050J40466c09183F4273P9093a0415j57517G1947
17990c13227H4638J19132a21950a2847A03009a16056b1950C07584A09948D2223
17979C8625K73132A00101a01927A0731N900b16969B66856k2437c15506a49141
17968b3910B21674K0063a88602L9599O0871a6862I271L11344a42883A2754g5448
17956d0284j55074l7982A38220b23803Q6328A95769b06730J00675j92036e8435
17945B36723J11537a86468N52A20133J8770b79976C39386j26158a38217A48049
17934h9452D2886a30408G7815P6013a15150N6318j04733A49220a63132g5073a4891
17922i6346E5347A6407a63504J0291A9912R0059a46437k44208a51409j88682A83680
$$ y = [90251, 143416, 244046, -235335, 27050, 167516, -309183, 64273, 143366, -10415, -167932, 71947, -313227, 84638, 203770, -121950, -12847, 103009, -116056, -21950, 307584, 109948, 42223, 38625, 311757, 100101, -101927, 10731, 16631, -216969, 266856, 244419, -315506, -149141, -23910, 221674, 241737, -188602, -149003, -88132, -16862, 9271, 320615, -142883, 12754, -75448, -40284, -195358, -233340, 138220, -223803, -137475, 195769, -206730, -106055, -298091, -58435, 236723, 348260, -186468, -185916, 120133, 138903, -279976, 339386, 213228, -138217, 148049, -89452, 42886, -130408, 77815, 153828, -115150, -58832, -163565, 149220, -163132, -75073, -14891, -96346, 55347, 16407, -163504, -153213, 19912, 109971, -146437, -390645, -151409, -340091, 183680]
17910A30879a20092q5073j02548a51775a4319r7456r8695F884L1812K07389g4156
17898C52861j45634a09754B08321h7972K7147C14182g9387a0642F4739L1763K8271
17887A24773b24004H0458J38319E5437L8894g1584j04742P997g8119A70049c04455
17875D295b77761B1251J60377I793K47293A27878P8689a54318O5277B9734J20299
17864A50033a3694G1290e7227A67709b3870r0457A52695F7683J16761e6911k7660
17853h4571A6572P9929J23776j09711a4423G5762i0905C59829j29611o7075h3073
17841A42018K80015j83418n6404a9846m0845O569B91051b0667B69415a74532B79357
17829A583G91a7717A66663H3131h6278C1032K41627c51638A49314a1124E511a12506
$$ y = [130879, -120092, -205165, -307713, -151775, -14319, -111775, -210470, 6884, 38696, 246085, -74156, 352861, 207227, -109754, 208321, -87972, -60825, 314182, -79387, -10642, 64739, 96502, 124773, -224004, 80458, 218777, 55437, 94331, -71584, -176326, -168329, -78119, 170049, -304455, 4295, -277761, 21251, 181628, 9793, 257086, 127878, 206567, -154318, -89041, 29734, 150033, -13694, 71290, -57227, 167709, -23870, -114327, 152695, 67683, 184444, -56911, -84571, 16572, 96501, 220277, 110566, -14423, 75762, -90905, 359829, 230218, 163143, -83073, 142018, 422033, 238615, 182211, -19846, -60691, -54122, 291051, -20667, 269415, -174532, 279357, 1583, 791, -17717, 166663, 83131, -86278, 31032, 272659, -351638, 149314, -11124, 5511, -112506]
17816e4166B80169C9162J45465b5301l9527j62677B29339A3409K89293j42843
17806A59859a59151G3a28404B13024c31319H748J54316B7258c7156h894G6824
17794I4466c09738E3058a75088Q0599b1865m3953B11586a77550l4064j47774A68927
17782b60558A66112B5003f393A72754a44589o7919G6062a62388j20109O6069I6768
17770G7055d8557B4430f5068C01062a8671j24090F1233f6875A98904r2737O9133
17759A75300h3527I1846R3255d8354j3926B58217a4981j18822A74297k8790g3069
17747D22872A71289e2047j9728C53910D1536J08464J56922G5873f1657r6998B57126
17735I978M57501A99577O6947l5389J10158F6970J89709g8477A85646g342C04994
$$ y = [-54166, 280169, 39162, 184627, -25301, -64828, -227505, 229339, 13409, 302702, 159859, -159151, 73, -128404, 213024, -331319, 8748, 163064, 27258, -37156, -8894, 76824, 94466, -309738, 53058, -175088, -94489, -21865, -65818, 211586, -177550, -211614, -359388, 168927, -260558, 166112, 25003, -6393, 172754, -144589, -212508, 76062, -162388, -282497, -216428, 96768, 77055, -48557, 24430, -65068, 301062, -18671, -142761, 61233, -66875, 198904, 106167, 175300, -83527, 91846, 185101, -48354, -62280, 258217, -14981, -133803, 174297, 145507, -73069, 422872, 171289, -52047, -71775, 353910, 41536, 150000, 306922, 75873, -61657, -158655, 257126, 9978, 467479, 199577, 266524, 231135, 341293, 66970, 256679, -78477, 185646, -7342, 304994]
17723B11173d9563F1797a15731k7679B61239j25943n5604J16913k8879L82586
17713E50312B8400e7156E7428K7344d90j22038A87333a08595c0691C05539j44021
17702A61518a2433F9666J35799j1373k603b4274I2424N3504d8977A81445a2238
17690A91271J47688A37452b29720A72964J65352j6303e4691E5000b26581O3566
17680a63015C56672d8032C9001R5898m1922L76573j37736i8797k1940C7518n622
17669C1896L44435A3031P3868L38577a11284d9095F1595J13329k4810g3051I1623
17657I5854c466B72689l9382F5263A6673K58128j15424J75213k4269a8433A43698
17645b37032A60699J75831F0690J76793Q5685j48326E88J62934E2474J15208B358
$$ y = [211173, -49563, 61797, -115731, -143410, 261239, 135296, 79692, 196605, 167726, 550312, 28400, -57156, 57428, 84772, -490, -122528, 187333, -108595, -30691, 305539, 161518, -12433, 69666, 205465, 194092, 191489, -24274, 92424, 145928, -48977, 181445, -12238, 191271, 338959, 137452, -229720, 172964, 338316, 322013, -54691, 55000, -226581, -163015, 356672, -48032, 39001, 134899, 92977, 469550, 331814, -98797, -120737, 37518, 31896, 376331, 13031, 86899, 425476, -111284, -49095, 61595, 174924, 150114, -73051, 91623, 95854, -3466, 272689, 233307, 65263, 16673, 274801, 159377, 334590, 310321, -18433, 143698, -237032, 160699, 336530, 60690, 237483, 323168, 174842, 588, 163522, 52474, 167682, 2358]
17633a62017B37885j13477h4058A50779F7392R2577d46216c580j31404d9468I4793
17621B58871j5205A6495h770I3598a87546C01223A21337M9199i6963B10620Q0107
17610B90727B5949G144J76073g1215B53103L6125A19614i7946B61303b0285A17003
17598c110j6879k4091C75905j70818r3115J1121K3109K90211A71152o3274h7390
17586I9657f5636B99837j07391E2874K22515j6453A04024J82941A24337J02409
17576B26746g9338A0179K1787J96844J83639e0883B44798A8839L24074A36852
17565C01108a20115A00938a16221K0528h195A08311c81656J9602B96827o8461
17555B28366a97848B52257b8327j14678A63429K62787k06298g6642H8842J54381
$$ y = [-162017, 237885, 124408, -84058, 150779, 67392, 159969, -446216, -3580, -134984, -49468, 94793, 258871, 243666, 16495, -8770, 93598, -187546, 301223, 121337, 170536, -96963, 210620, 290727, 25949, 7144, 183217, -71215, 253103, 289228, 119614, -97946, 261303, -20285, 117003, -3110, -19989, -44080, 375905, 205087, 111972, 123093, 146202, 436413, 171152, 107878, -87390, 99657, -65636, 299837, 192446, 52874, 275389, 258936, 104024, 286965, 124337, 226746, -79338, 10179, 31966, 228810, 412449, -50883, 244798, 18839, 342913, 136852, 301108, -120115, 100938, -116221, -95693, -8195, 108311, -381656, -362054, 296827, 228366, -197848, 252257, -28327, -143005, 163429, 426216, 219918, -76642, 88842, 243223]
17545B43223J70404b3344A46018K96918j24561A29143K25321q4819G7072M5698
17535A22770J31743A08795r585K0546L84149B09661o2961K01927K82692L821K89295
17524I24435J7199K01552m65931j37261N033j27981J3612P0704k17264J55871
17514D39969q3544L04788m1715J84523M52956J03891n26458l38047K2927K16547
17504G35837C66838j41597A10347O1037J98141O2445p4174q5226K62803k16770
17494C18603n4353j15564K78183A71686K22173G9120K24266k3497Q5735K2734
17484C88358J06871I8069K90756d3182f199B25770n555a24353K1825B79584p3998
17473B05586C5605J75735J09514H3498K02415N3231P4296l1690j55375l8182K25230
$$ y = [243223, 413627, -23344, 146018, 442936, 318375, 129143, 354464, 269645, 77072, 122770, 254513, 108795, 99210, 119756, 503905, 209661, 146700, 348627, 631319, 635140, 924435, 941634, 1143186, 677255, 539994, 545027, 417046, 430658, 501362, 284098, 439969, 356425, 661213, 619498, 804021, 1256977, 1360868, 834410, 496363, 519290, 735837, 366838, 225241, 110347, 171384, 369525, 431970, 357796, 272570, 535373, 318603, 264250, 148686, 426869, 171686, 393859, 79120, 303386, 279889, 365624, 388358, 495229, 98069, 388825, -43182, -6199, 225770, 220215, -124353, -102528, 279584, 205586, 35605, 211340, 320854, 83498, 285913, 339144, 413440, 381750, 226375, 188193, 413423]
17462D13423e6284A92605q730M34878h7802B87513A5189J63268K8842J78549J87906
17451E73754r1083I1668K89379G1927M70774k0668k04771M10722C18774r052j25644
17440A84078J4386J44657N6895J02784A94758J31619R5434L05830A06643K29936
17430C36579j61334M77255m5692A42113J57696O7550N0121J42267r1443l0048
17420D38256I1072M57622B73867p1362G4789l4924L20867A27909K36368J05757
17410D70034M7902B21008J92173o1508O3850Q4951B02109L44134B38583r5995
17400A42588j8360K74790O2859A87886n0582J17685K10140m9020n795n7588n8205
17389B94521N3901c43125B61465A20017M7140J34774K8119F2396L89191j11918
$$ y = [413423, -56284, 192605, 183875, 618753, -87802, 287513, 15189, 178457, 207299, 385848, 573754, 482671, 91668, 381047, 71927, 542701, 522033, 317262, 727984, 318774, 309722, 184078, 198464, 343121, 400016, 502800, 194758, 326377, 421811, 727641, 106643, 336579, 175245, 652500, 606808, 142113, 299809, 367359, 417480, 559747, 468304, 438256, 91072, 548694, 273867, 202505, 74789, 39865, 360732, 127909, 364277, 470034, 517936, 221008, 413181, 351673, 415523, 500474, 202109, 546243, 238583, 142588, 124228, 399018, 461877, 187886, 137304, 254989, 465129, 416109, 410314, 352726, 294521, 348422, -343125, 261465, 120017, 167157, 301931, 330050, 62396, 451587, 339669]
17379C39669R0730o7146A22091P0712Q9989A1688N43740k59909l1571n5632J31337
17368C39653n0286j04048A5328a9606A13747J73129G6372K72359A26368L91322
17358E17690k01367K8278P7350I7547J85125J39511j16256Q5836j04759J18866
17348D05870A0110L54511d4232B52520K38598j90147J91677B35190J98271f036
17337A30844K27700J42901k00082m3447J14082q2404j39455Q0200a53639A75273
17326A78170K08310E0579N76945k72934F9159K7897L34945j28770K54885k51346
17316C06770k7331j2710R9036c9150D16708j48339f242B77647K16378i7995D95497
17304C44671I9749L5695k380L3764O34155C00683j43779o802L91993j00107K11983
$$ y = [339669, 430399, 363253, 122091, 192803, 282792, 11688, 555428, 295519, 263948, 208316, 339653, 289367, 185319, 15328, -19606, 113747, 286876, 76372, 348731, 126368, 517690, 316323, 344601, 421951, 97547, 282672, 422183, 305927, 391763, 287004, 405870, 10110, 364621, -44232, 252520, 491118, 300971, 492648, 235190, 433461, -6036, 130844, 358544, 501445, 301363, 257916, 371998, 289594, 150139, 230339, -153639, 175273, 178170, 386480, 50579, 627524, 354590, 69159, 97056, 432001, 303231, 558116, 306770, 279439, 266729, 365765, -39150, 416708, 268369, -6242, 277647, 494025, -97995, 495497, 344671, 99749, 135444, 133064, 166828, 800983, 300683, 156904, 150102, 542095, 441988, 653971]
17293F53971B39580J243n9324L08818J4785H4627K40582N4344A63553K71285j85181
17282B49657K06089n6688j60354k0050M68932B001N23319j58031O0239J60129
17272E87657j25352j33378p1698K7100A38561K58990L79812A50683L78553H5896
17261B35292J84008j99518J25251R1077K12438k19232j41828H8624L98708j80296
17251C07036K5600j27569K39126J42673m1519k41808J03703J80920l0582B16660
17240F59117B07480N43290k27086J19123j14139k5228A82366M08347r2012j63628
17230C35073j03645K87999B16313J0474M08885q5060B52779K07381j01838q9992
17220B68330B5835K93004M5212l3392A43271M54075k02820r3603M81442k54271
$$ y = [653971, 239580, 240823, 181499, 490317, 505102, 84627, 325209, 379553, 163553, 434838, 249657, 455746, 399058, 238704, 218654, 687586, 2001, 525320, 367289, 427528, 587657, 462305, 328927, 257229, 284329, 138561, 397551, 777363, 150683, 529236, 85896, 235292, 419300, 219782, 345033, 436110, 648548, 429316, 287488, 88624, 487332, 307036, 332636, 205067, 444193, 586866, 545347, 303539, 407242, 588162, 557580, 216660, 659117, 207480, 750770, 523684, 642807, 528668, 503440, 182366, 590713, 498701, 335073, 231428, 519427, 216313, 226787, 635672, 550612, 252779, 460160, 358322, 268330, 25835, 318839, 364051, 330659, 143271, 597346, 394526, 300923, 782365, 528094]
17210E28094M6072B13096J92362O7243j19688j51038L42838j89535K61211j53542
17200D62947q8450j48219R1459N17539k16042k49279j6427J19498a5852C33796
17189D06770P6885M26378k49267A99715M17538K5909J3130m2767Q2247C38029
17178E61298j33666J61267J46585A92744M11594J20797j44250k06827R1803k3979
17168D41882m2579j11285m18r6665L42153N05417l79686Q6748K02937j92521l69810
17157C86173K97324m4132O1451O0947j98409j97653L20809M5990l33984J78446
17147E76962N6198j62074J02905J58012P519j4638J22298k42752K3429j78964
17137D48895L55175j63127K4185k3765j08365k28664L44927B72505K65344J08791
$$ y = [528094, 574166, 213096, 405458, 472701, 353013, 201975, 544813, 355278, 616489, 462947, 374497, 226278, 317737, 835276, 619234, 369955, 353528, 473026, -15852, 333796, 406770, 483655, 910033, 660766, 199715, 617253, 643162, 656292, 613525, 695772, 338029, 561298, 427632, 588899, 735484, 192744, 604338, 725135, 580885, 374058, 465861, 441882, 399303, 288018, 287600, 190935, 533088, 1038505, 658819, 745567, 948504, 755983, 386173, 683497, 639365, 700816, 761763, 563354, 365701, 686510, 732500, 398516, 576962, 633160, 471086, 573991, 732003, 739522, 724884, 847182, 604430, 627859, 448895, 804070, 640943, 665128, 641363, 532998, 304334, 649261, 272505, 537849, 646640]
17127F46640n8011l2151k36598M81266l56727L75828C55727J21393L2724M66113
17117I75957D77584K87154q0346M39610l14367n1763j04799J99198J62354l99308
17107F15317K20714j62118K54102k70856Q1945L32138k30522j40361R4637j75393
17097F19603M35011k30016J07520Q2054l39171J91252J08883l31123J09312l9642
17087G13683Q7856l3721J86606k3829j1506k74386N7587P1117M0328m7834K33209
17076I99110j81034Q5516K51968k84748J90993j68826l7196J9561K3991j42912
17066G56423P8314j33861K29597N25055l31463M2079l33958N20612k47446J38056
17056A243408k32947K24531l80869r1033K49298J70068j48680J31146l45814j10443
$$ y = [646640, 588629, 556478, 319880, 801146, 444419, 820247, 355727, 477120, 509844, 975957, 477584, 764738, 684392, 1124002, 809635, 757872, 653073, 852271, 1014625, 615317, 836031, 673913, 928015, 657159, 739104, 1071242, 840720, 700359, 794996, 619603, 1054614, 824598, 932118, 1014172, 675001, 866253, 975136, 644013, 753325, 713683, 801539, 767818, 954424, 930595, 919089, 644703, 702290, 773407, 813735, 765901, 999110, 818076, 903592, 1155560, 870812, 1061805, 892979, 855783, 875344, 899335, 756423, 834737, 700876, 930473, 1455528, 1124065, 1166144, 832186, 1352798, 1105352, 1243408, 1010461, 1234992, 854123, 763090, 1012388, 1182456, 1033776, 1164922, 819108, 708665]
17046G08665M17139j40193J94547p1926l23569O2375J41440O9135K55102r6750
17036A215965p8116j12051O1097J82582l66163M39811q3334r8470J58284k54589
17026A065016K50237k6836L1131J08328j62482j96274L94885l311n2070j21814
17016A286810M8371j10767j9390L12438k21167J10871m20270j00568L33908j35869
17006A084367K50993J85169p8232L0512J20211l05347O55220o29066J84250K98494
16996A796571l98283M28915k36889r5458j21069L23195p9321J56253l54525M35482
16986A854871q1746l99780N4441N2152J56184J06917k623l9069k1830J99986k28340
16975A651163K28126L61668m46639L67271l24218J89072q2738N14904p16573M4380
$$ y = [708665, 1125804, 985611, 1180158, 1108232, 784663, 847038, 988478, 1057613, 1312715, 1215965, 1137849, 1025798, 1086895, 1269477, 903314, 1343125, 1259791, 1161321, 1319605, 1065016, 1315253, 1288417, 1319548, 1427876, 1265394, 1069120, 1464005, 1460694, 1408624, 1286810, 1335181, 1224414, 1205024, 1517462, 1296295, 1407166, 986896, 886328, 1220236, 1084367, 1335360, 1520529, 1442297, 1472809, 1593020, 1287673, 1942893, 1313827, 1498077, 1796571, 1398288, 1827203, 1590314, 1494856, 1373787, 1696982, 1617661, 1773914, 1419389, 1854871, 1773125, 1373345, 1427786, 1479938, 1636122, 1743039, 1740416, 1701347, 1679517, 1879503, 1651163, 1879289, 2240957, 1794318, 2161589, 1837371, 2026443, 1943705, 2458609, 1742036, 1786416]
16965A786416M304J95869L8188j93453R5903J38107R2587j18174M0693K03510
16955B283950l25780L0373J52766M9497K03572l35521j32117O38317m29490K35673
16945B371240n0562k16551M5021L72666k19885L73614K18736m81662n3380k19770
16935B139467L67042p869O377R5655k65459J36419L97529k77315J29156j9444
16925B701558k45001K18156K59827n7402K90200m79193K35563j71644M04611m4298
16915C112377j09774r4773J46793N2910J22832j89305J39250K08742l70586M30365
16905C448831r3952K61947m36880J41069K74759j61424N28428k59509n63K17988
16895C920694k61855J4204M28369k28420J68073J88836k48784J37509j8688M33825
$$ y = [1786416, 1790720, 1986589, 2024777, 1831324, 1927227, 2065334, 2157921, 2039747, 2080440, 2283950, 1958170, 1988543, 2141309, 2190806, 2394378, 2058857, 1926740, 2565057, 2135567, 2371240, 2320678, 2104127, 2149148, 2521814, 2301929, 2675543, 2894279, 2412617, 2359237, 2139467, 2506509, 2498640, 2505017, 2600672, 2335213, 2471632, 2869161, 2591846, 2721002, 2701558, 2456557, 2674713, 2934540, 2877138, 3167338, 2688145, 2923708, 2752064, 3156675, 3112377, 3002603, 2907830, 3054623, 3107533, 3230365, 3041060, 3180310, 3389052, 3018466, 3448831, 3354879, 3616826, 3179946, 3321015, 3595774, 3434350, 3962778, 3703269, 3702706, 3920694, 3658839, 3673043, 4101412, 3872992, 4041065, 4229901, 3981117, 4118626, 4099938, 4533763]
16885D533763l46847M52054j27605j53855k86158P56564k38967l8137J67039o8945
16875D648906L00617j72208L95282L31012l06054K53031k84940J65530o7790J31168
16865E394554M27063j46608K20183l6021R7797J48274K14320j34328J52393L35991
16855F673618l00534J59498N06718l90375L07955L2039J85341M8131N6925N7469
16845G336785L22962m4440j25231M06943K7135K12394J47700K83520n3502r934
16835H504332M54434j96461j12948O11192O0528L65434O1933K52742L83093j31358
16825A0252921L40998K94756r8620M74429K30682j2097J35073M81356J10569L70201
16815A2580268J23576J65016O57904k3872K33621M28076N31157K71933K29020
$$ y = [4533763, 4186916, 4638970, 4511365, 4357510, 4071352, 4827916, 4588949, 4550812, 4717851, 4648906, 4949523, 4777315, 5172597, 5503609, 5197555, 5450586, 5165646, 5331176, 5263386, 5394554, 5821617, 5675009, 5895192, 5859171, 5956968, 6105242, 6319562, 6185234, 6337627, 6673618, 6373084, 6532582, 7039300, 6648925, 6956880, 6988919, 7174260, 7222391, 7279316, 7336785, 7659747, 7615307, 7490076, 7897019, 7924154, 8136548, 8284248, 8567768, 8514266, 8504332, 8958766, 8762305, 8649357, 9260549, 9321077, 9686511, 9748444, 10001186, 10384279, 10252921, 10593919, 10888675, 10790055, 11264484, 11495166, 11483069, 11618142, 12099498, 12210067, 12580268, 12703844, 12868860, 13526764, 13502892, 13736513, 14164589, 14695746, 14967679, 15196699]
16806A5196699K8821L87205N54623K25003N59158M04743q258N90650K07138P80281
16796A8926063P8536Q50817M21800K84027P22030L94313R03692K82973M40235
16787B3304486N07587J276547N28172N43518Q14588O06369M13885J014234N66395
16778B9575781P63446Q37692J060917Q54212J091626J136269P41425R41654J486749
16769C8489771P30476J454897R43604J395910J283990J005094J358405J419558
16761D8081705J851605J038746J872783J423683J599307J709192J902659J334785
16753F0814465J858370J494622K258232J822931K058104J203208K174088J767324
16745G5451344K010790J888584J629830J707699J967034J479081J668249J261870
$$ y = [15196699, 15225520, 15612725, 16167348, 16392351, 16951509, 17356252, 17347994, 17938644, 18145782, 18926063, 19004599, 19855416, 20277216, 20561243, 21283273, 21677586, 22581278, 22864251, 23304486, 23812073, 25088620, 25616792, 26160310, 26974898, 27581267, 27995152, 29009386, 29575781, 30339227, 31176919, 32237836, 33092048, 34183674, 35319943, 36061368, 37003022, 38489771, 39220247, 40675144, 41618748, 43014658, 44298648, 45303742, 46662147, 48081705, 49933310, 50972056, 52844839, 54268522, 55867829, 57577021, 59479680, 60814465, 62672835, 64167457, 66425689, 68248620, 70306724, 71509932, 73684020, 75451344, 77462134, 79350718, 80980548, 82688247, 84655281, 86134362, 87802611, 89064481]
16737H9064481J593976J466801J485851Q18173Q23017K83267R76527L64943N36398
16728I7413434J4671l2728j74427j46457o64275n47084q83313j020697q07481
16719I3151643j228642j387217j742484j645929j256322j752402j532217j717974
16711H0888456k121223j749313j844713j996846j649243j765118k150378j435218
16703F6176404j970518j572521k025174j978235j707241j353667j513149j807217
16695E2248682j666652q17318j845199j644006r11305j483556j617849j018016
16687D1244781p63512j465033j188746j251490p45598r49553j012468q68245j195068
16678C1805068n41007j108440n99718j021925p81836n68904r00792n18051q60510
$$ y = [89064481, 90658457, 92125258, 93611109, 94429282, 95252299, 95535566, 96512093, 96877036, 97413434, 97428105, 97395377, 97220950, 97074493, 96410218, 95863134, 94979821, 93959124, 93151643, 91923001, 90535784, 88793300, 87147371, 85891049, 84138647, 82606430, 80888456, 78767233, 77017920, 75173207, 73176361, 71527118, 69762000, 67611622, 66176404, 64205886, 62633365, 60608191, 58629956, 56922715, 55569048, 54055899, 52248682, 50582030, 49764712, 47919513, 46275507, 45364202, 43880646, 42262797, 41244781, 40481269, 39016236, 37827490, 36576000, 35830402, 34880849, 33868381, 33000136, 31805068, 31264061, 30155621, 29555903, 28533978, 27752142, 27183238, 26282446, 25764395, 24903885]
16669B4903885n20484m11628p98119o70885l26341n78891n78987o34088l80798
16660B0003664n77135k07230o83373k01137n08150l54406p17795j86887n38177
16651A6029374J9614l87287o44850q715l27290l92409k02951k22025n33009p6330
16641A3254122n22272J55418n56180j23657m30561j42853l25328r7236k84332
16632A0927121j07175k20075j69432k12631k8978k54587k79405q1214j34334k71542
16622I167748n38313L89793r0029l76877K3692m01433M7073k56689k6496J11617
16612H050086k26747m93693K43785l81394j06755j4353l19585m1310j80747J75752
16602F705039J74896m30511J85726n20637J53156j08029j85189k887r3899j3098
$$ y = [24903885, 24383401, 23971773, 23173654, 22502769, 22176428, 21597537, 21018550, 20384462, 20003664, 19426529, 19219299, 18535926, 18334789, 17826639, 17472233, 16754438, 16567551, 16029374, 16048988, 15661701, 15016851, 15008136, 14680846, 14288437, 14085486, 13863461, 13330452, 13254122, 12731850, 12887268, 12331088, 12207431, 11776870, 11634017, 11308689, 11211453, 10927121, 10819946, 10599871, 10430439, 10217808, 10188830, 9934243, 9654838, 9573624, 9439290, 9167748, 8629435, 9019228, 8929199, 8552322, 8576014, 8174581, 8221654, 7964965, 7938469, 8050086, 7823339, 7329646, 7573431, 7192037, 7085282, 7070929, 6751344, 6710034, 6529287, 6705039, 6879935, 6449424, 6635150, 6114513, 6267669, 6159640, 5974451, 5971564, 5877665, 5864567]
16592E864567R2494n16520J70981k49406J85133Q2754k69254j11533k50571j1368
16582D987277L49590l48023j97593J42368l39667j13448R5296j4482n14207M05724
16572D452835J8524M4176m71929j90229K97508n0964Q9387j14462j3042J60347
16562D222151k93914J17821l34992J71464K0747k50110j32768K06773j59714J6083
16552C583541Q2468j01663k33023J11862j79073r8215K89618k32609J91183j80467
16542C233622l22214L74106m50486O8039R1176k41090M42678l8337j55855K8570
16532C030209m33036L9599K59520k4007k3037p2064j61414j82484k442j20606
16522B310238K77532Q5781J00052j19307k92037K59713r4645l26846K81981p0940
$$ y = [5864567, 5957061, 5440541, 5611522, 5362116, 5547249, 5630003, 5360749, 5249216, 4998645, 4987277, 5336867, 4988844, 4791251, 4933619, 4593952, 4480504, 4575800, 4561318, 4047111, 4452835, 4471359, 4515535, 4043606, 3853377, 4150885, 4099921, 4189308, 4074846, 4061804, 4222151, 3928237, 4046058, 3711066, 3882530, 3903277, 3653167, 3520399, 3727172, 3567458, 3583541, 3666009, 3564346, 3331323, 3443185, 3264112, 3165897, 3455515, 3222906, 3414089, 3233622, 2911408, 3285514, 2835028, 2903067, 2994243, 2753153, 3195831, 3157494, 3001639, 3030209, 2597173, 2636772, 2896292, 2872285, 2849248, 2777184, 2615770, 2433286, 2430844, 2310238, 2587770, 2673551, 2773603, 2654296, 2362259, 2621972, 2527327, 2200481, 2482462, 2411522]
16512B411522J13654n07867J22161P5221j45286J78193M080j0345m7236o5829
16502B128268j81118L1277R1093K23004n39119J27077K14091M7522k75832l8251
16492A828012J27020j79317K08840K06470n74097L90673k40625M16888m14880
16483A768984j40678J02864K08011m82932J93978j9651J34182j5336l3801n61755
16473A153866L55340j20521M5864N14011l05167J05839k01146J36860m214k99166
16463A381566L73004p6020k0231q3442N9984o7285m19125L09551O1128J26775
16453A645905j1087j21015k78137J64781q5183k60034N56623k85401J49946J38103
16443A614501k91537N612J58458r6473j64543L02908k34109k05186K11454l28
$$ y = [2411522, 2525176, 2017309, 2139470, 2214691, 2069405, 2247598, 2251678, 2241333, 2194097, 2128268, 1947150, 1978427, 2069520, 2292524, 1753405, 1880482, 2094573, 2142095, 1866263, 1828012, 1955032, 1775715, 1984555, 2191025, 1616928, 2007601, 1766976, 2183864, 1768984, 1628306, 1731170, 1939181, 1456249, 1650227, 1630576, 1764758, 1749422, 1715621, 1153866, 1509206, 1388685, 1434549, 1948560, 1643393, 1749232, 1548086, 1684946, 1680732, 1381566, 1754570, 1678550, 1658319, 1574877, 1634861, 1567576, 1148451, 1458002, 1519130, 1645905, 1634818, 1513803, 1235666, 1400447, 1315264, 1055230, 1611853, 1326452, 1476398, 1614501, 1322964, 1328576, 1487034, 1390561, 1226018, 1528926, 1294817, 1089631, 1301085, 1300757]
16433A300757j72236m03702M59209m7954J02072j03998k5875J56790r4499J2383
16423A182947k3652j48702K5742Q4617j32512M02511k94402m51703M97543r9929
16413A042460J03718k72174L82207j8083p30n07504N89912m84565M5767m0239
16403H40769P3243J44339l4609J4286O6707j57396J3000n2174M28736l19187O1804
16392A079518j32714j18867p5219K53312J86637k54121j74014O5523J36176J01615
16382A067846k86478O1216L07253k82005O8270j54893R7305J50663K5777m97572
16372E57382K17904K3743M0341j34787r7659L67974m13077J88835J14616k62443
16362F02829K88261p3579k73830J48039J78365P9298m64002L7160J10909J41090
$$ y = [1300757, 1128521, 724819, 1184028, 1136074, 1238146, 1134148, 1108273, 1265063, 1170564, 1182947, 1159295, 1010593, 1036335, 1120952, 988440, 1390951, 1096549, 644846, 1142389, 1042460, 1146178, 874004, 1256211, 1238128, 1237398, 729894, 1319806, 835241, 881008, 840769, 914012, 1058351, 1023742, 1038028, 1104735, 947339, 960339, 908165, 1336901, 1017714, 1079518, 946804, 827937, 752718, 1006030, 1192667, 938546, 764532, 830055, 966231, 1067846, 781368, 842584, 1149837, 867832, 936102, 781209, 878514, 1029177, 1054954, 557382, 775286, 799029, 839370, 704583, 606924, 974898, 561821, 750656, 865272, 602829, 891090, 817511, 543681, 691720, 870085, 949383, 485381, 522541, 633450, 774540]
16352G74540j68292J91747j16202J06045j09961P4687Q0858k82526m9524j6528
16342D84844J50705J6085K4098k71634J54163R0499A67369Q18583l51047J07879
16332G42784j16432J94538l72189M31039r7077J93948m72161J210J60359k04116
16322D61903J5976K17847L18084j99725o2540C17937K61331j55527M6104J97670
16312F67515k14496K23651B24465M96958j04063m3837a16767F11292m5578K19596
16302G85310j70520Q1382A96790L74129B61895O17007m15232L84821l34069J36372
16292F50794j79485J26270j7095A79997P03483B44632L90852j52889O6268j04550
16282D44313k03076M23457C02261K05391O1595j92178K06925j24158n6445j34430
$$ y = [774540, 606248, 797995, 681793, 787838, 677877, 752564, 833422, 550896, 501372, 484844, 635549, 651634, 675732, 404098, 558261, 648760, 167369, 985952, 634905, 742784, 626352, 820890, 448701, 879740, 782663, 976611, 504450, 505660, 666019, 461903, 477879, 695726, 1013810, 814085, 751545, 317937, 579268, 423741, 469845, 667515, 453019, 676670, 224465, 721423, 617360, 573523, -116767, 611292, 565714, 785310, 614790, 696172, 196790, 570919, 261895, 878902, 463670, 848491, 514422, 650794, 471309, 597579, 580484, 179997, 883480, 244632, 635484, 482595, 548863, 444313, 241237, 664694, 302261, 507652, 569247, 377069, 583994, 459836, 403391, 268961]
16272B68961M99492C31161L4123N8801B03277M54410k28045A58889L05890j4939
16262D49840J84506A09897J68584J45454J21882J32239l37462K2513j742K46524
16252F07889A93142N57033j71919j03654J79540B63422h2400D05426M6038J42057
16242E93521j02005K48040k01448k13468P5527j23020L9369j13671K70688K9293
16232E02826B41546K21797m2600l6387j32909K90255k01519M4251J42259k58343
16222B68350J1273J36145J95272B62023j15495N8955N5190J10461M6562L3650
16212D51346A35448o0302M10281j82125A36411J64495I306J74838J8922l1641
16202A71425J07659L12618k63176J0336f6355E00601A82755M1752J88532A8901
$$ y = [268961, 768453, 331161, 365284, 424085, 203277, 657687, 429642, 158889, 464779, 449840, 634346, 109897, 278481, 423935, 545817, 678056, 340594, 363107, 361365, 607889, 193142, 750175, 578256, 474602, 654142, 263422, -82400, 405426, 451464, 593521, 491516, 739556, 538108, 324640, 400167, 277147, 316516, 202845, 473533, 502826, 241546, 463343, 420743, 384356, 251447, 541702, 340183, 384434, 526693, 268350, 279623, 415768, 611040, 262023, 146528, 205483, 260673, 371134, 417696, 451346, 135448, 75146, 485427, 303302, 136411, 300906, 9306, 184144, 203066, 171425, 279084, 591702, 328526, 338862, -66355, 500601, 182755, 224507, 413039, 18901]
16191A82024P3079m6200J28534o7396K0219J06090j63291L95308B23830j11K15730
16180D39449k3275J05088k16863k7634m368j23541K01881j12053j0668k7383j2510
16169A88123K84621A93177E5436Q4256h2953C67089I7600M56257j30442Q416J98511
16158F30342C00584L3672A64008M4134J34871K28687B8762L05751A19949J64382
16148B84331o736J49646j48236A26026J75496K8693Q8192B6413M34832A05847
16137H7567I896L07856e4797C80082j19444D3343b0765B536J05187d3171A9247
16125B12864n5824K74098B02875g8826B92977K71666k08762A18230J2521j6083
16115A14668a6111A48972B2395K11336a95579b9764D01666d0034I1352R1893P7658
$$ y = [182024, 255103, 208903, 337437, 270041, 290260, 396350, 233059, 628367, 223830, 223719, 439449, 416174, 521262, 304399, 276765, 272397, 148856, 350737, 238684, 228016, 200633, 188123, 472744, 193177, 55436, 139692, -82953, 367089, 97600, 553857, 423415, 431831, 630342, 300584, 334256, 164008, 208142, 343013, 571700, 28762, 334513, 119949, 284331, 277595, 427241, 279005, 126026, 301522, 330215, 418407, 26413, 461245, 105847, 87567, 9896, 317752, -54797, 380082, 260638, 43343, -20765, 2536, 107723, -43171, 19247, 212864, 157040, 431138, 202875, -78826, 292977, 564643, 355881, 118230, 130751, 114668, -16111, 148972, 22395, 233731, -195579, -29764, 401666, -40034, 91352, 183245, 260903]
16104B60903K1912d07070f2664B80643E313f060B96292N2262G2090O9912J6100
16093A58102P1618J26271A36109O2500e5498k0337A04429a23944B16520K00349
16083D16869E1807J24382a09120B53737A21729j8186M4137a35198C44660O1303
16073D05963B5080i0549B45482A01219b2225k09847C35217A35156b625D1713N5047
16062I6760J97646I5007J15865i5237A81142l3162K27956O9704a38836m6806D44003
16050C64180h6881B39322O3222B5550P3389a76274A30314a22484D7206h0465L0219
16039e0246A69486n0353A1232E250J51611o5675r592P9820J50637A842J91804
16028A93646j4449f9466C57748b44995C84808A05884C4958d1188i281H9707K90377
$$ y = [260903, 282815, -407070, -62664, 280643, 5313, -6060, 296292, 348554, 72090, 142002, 158102, 229720, 355991, 136109, 198609, -55498, -75835, 104429, -123944, 216520, 416869, 51807, 176189, -109120, 253737, 121729, 103543, 147680, -135198, 344660, 405963, 25080, -90549, 245482, 101219, -22225, -232072, 335217, 135156, -2625, 41713, 96760, 294406, 95007, 210872, -95237, 181142, 147980, 375936, 445640, -138836, -185642, 444003, 364180, -86881, 239322, 302544, 25550, 98939, -176274, 130314, -122484, 47206, -80465, -50246, 169486, 119133, 11232, 5250, 156861, 91186, 81594, 161414, 312051, 1842, 193646, 179197, -69466, 357748, -244995, 384808, 105884, 34958, -41188, -9281, 89707, 380084]
16017C80084g3877h475A51193a63289B163J58795g4049A08752K00802i6559H463
16005A96074L4150A15100h5157B91653A27726c99573B71653L5585a16747D28440
15994e8378A58577n1072l6510J27092L27341p90K70585K44725N61195q9954N4433
15983A565622j34651D66095K38327B98295A14077K7660J111L12262A07046G82
15972C36465G440a71582A91446b17A43937d3033r252A36088R8244a68688C61953
15960A41876F6149K7316J47356j14090K5711d3305o4643r242B07543g619B2402
15948a50832C3747d7758n8085A91964b19442B07198A3990J9331J2478i3108a7497
15936a38702b5296j9615A19192N5243a06564C63853A18662i687B36618a33559
$$ y = [380084, -73877, -8475, 151193, -163289, 2163, 160958, -74049, 108752, 309554, -96559, 8463, 196074, 230224, 115100, -85157, 291653, 127726, -399573, 271653, 307238, -116747, 428440, -58378, 158577, 107505, 70995, 198087, 525428, 524638, 795223, 1039948, 1601143, 1511189, 1565622, 1430971, 466095, 704422, 298295, 114077, 141737, 142848, 455110, 107046, 782, 336465, 7440, -171582, 191446, -217, 143937, -43033, -52285, 136088, 234332, -168688, 361953, 141876, 66149, 93465, 240821, 126731, 152442, -43305, -107948, -117190, 207543, -7619, 22402, -150832, 33747, -47758, -105843, 191964, -219442, 207198, 13990, 33321, 45799, -93108, -17497, -138702, -25296, -44911, 119192, 174435, -106564, 363853, 118662, -9687, 236618, -133559]
15925E174b2408m472j30214a5648E7448J34644D8035g3772l40983B46010D706
15913A05013M2585B4425P8467e6055e606A54425M2489d26449C03766a73648B9173
15901A9520g6871E3140c2077A91240g9480n5583C42427E7912C876L1587h0231
15889C8658J28728K19915g580k80075A33912i8818A66856a4449p8179j91566i7167
15877A44461j5956a52683L1497C61188A56889j7362d0708A23799L3456a72883
15866a48114j61M4892C1627a4917D5228b55662e1890B16855b41743P2515k7321
15855a96549A05805A2927b32734C22819a552j09332H3279a73746C2834L7524d77297
15843B0250a86845C6794d40106b8762D6560a84853h0310k35238D0162O4864N0628
$$ y = [5174, -22408, -26880, -157094, -15648, 57448, 192092, 48035, -73772, -414755, 246010, 4706, 105013, 147598, 24425, 102892, -56055, -5606, 154425, 196914, -426449, 303766, -173648, 29173, 19520, -76871, 53140, -32077, 191240, -79480, -135063, 342427, 57912, 3876, 35463, -80231, 38658, 167386, 387301, -7580, -287655, 133912, -98818, 166856, -14449, -92628, -284194, -97167, 144461, 128505, -152683, -121186, 361188, 156889, 139527, -40708, 123799, 157255, -172883, -148114, -148275, -103383, 31627, -14917, 45228, -255662, -51890, 216855, -241743, -169228, -196549, 105805, 12927, -232734, 322819, -1552, -110884, 83279, -173746, 32834, 70358, -477297, 20250, -186845, 36794, -440106, -28762, 46560, -184853, -80310, -315548, 40162, 105026, 155654]
15832A55654b60160A53866K1861H6290a39263E8801a27903B59837A12719J17587
15822B30306b60388B5984b92883A50697b49654j36500A37962E1106a1570k09389
15812b20959E899a72947k9970H1205a97463h2586c6107j38796k469E5655a42482
15800a5750l762I2208a45346M4598P507A63747l1100M4342J13665a3349j09453
15789a22802j11513a06143C21756b9536j02219A10887a44452A74303o4396n4539
15779E5368j8865M2653b29666f1223A8155f3342C6770M4115a3634B54384c11583
15767a55263A04316P2055k5542F9973a41611c6883A25333m4318P0072M7723k9858
15756A68952b06914E53J59816B4212J35777B2660i5F7825b48418C4423J02643
$$ y = [155654, -260160, 153866, 175727, 86290, -139263, 58801, -127903, 259837, 112719, 230306, -260388, 25984, -292883, 150697, -249654, -386154, 137962, 51106, -11570, -220959, 5899, -172947, -202917, 81205, -197463, -82586, -36107, -174903, -177372, 55655, -142482, -15750, -19512, 92208, -145346, -100748, -93241, 163747, 132647, 176989, 290654, -13349, -122802, -234315, -106143, 321756, -29536, -131755, 110887, -144452, 174303, 109907, 55368, 36503, 79156, -229666, -61223, 18155, -63342, 36770, 80885, -13634, 254384, -311583, -155263, 104316, 176371, 150829, 69973, -141611, -36883, 125333, 81015, 151087, 198810, 168952, -206914, 553, 160369, 24212, 159989, 22660, -95, 67825, -248418, 34423, 137066]
15745A37066d0811A4599o017M81786h9854A80126N5221a32484C61742g1092A36580
15733h2684C2299A0112Q4096e0558C70060b08003l3728J0645O5311O5727k7094
15722a27142r785j03437A38504P0726D1044b71987H9006J87525K0426f0459A04317
15710c47361h1772A63849m0912J29735a02478B4288j0967a0472B41409n7909K07490
15699C90990a02073c2839m0051B10051A2649c7991B51960C7124a12094D64597
15688b53199D3441K80894i2644H8814a34089E0195b7151l07699R1564N904D3854
15676i8979l6263D9616J16852b3198F5143K51186j06435a42893J3361C078J9716
15665B2794b1710j04535B14242l4500i7122H9628J16599a40627i094B054c89310
$$ y = [137066, -40811, 14599, 8582, 490368, -89854, 180126, 235347, -132484, 361742, -71092, 136580, -82684, 32299, 10112, 94208, -50558, 370060, -208003, -241731, -231086, -165775, -100048, -127142, -136927, -240364, 138504, 209230, 41044, -271987, 89006, 276531, 296957, -60459, 104317, -347361, -81772, 163849, 122937, 252672, -102478, 24288, 13321, -10472, 241409, 183500, 390990, -102073, -32839, -72890, 210051, 12649, -37991, 251960, 37124, -112094, 464597, -253199, 43441, 324335, -92644, 88814, -134089, 50195, -27151, -334850, -243286, -237382, 43854, -98979, -135242, 49616, 166468, -23198, 65143, 316329, 209894, -142893, -129532, 3078, 22794, -21710, -126245, 214242, 179742, -97122, 89628, 206227, -140627, -9094, 2054, -389310]
15653a06563B7057a87610M2737A5915Q4437a37641j1992A42808c75789g7168G1114
15641i727A64791b35026A36565c16374G9202a60314O5708d7039k63312a09065
15630a11982l9358B73072b55520P1165B6794L32908A38526c5842G1800h4320a5340
15618A32304L5794B7948b83143I5225g0572a0107B38993q2277M8519l3673a04115
15606A00913c0626B9706a60163A86641c8672B12040b892r6914A44999n7719a03739
15594D6647J83634r8572a06639k1709I4598a92214M1242C12360i319A90461a40162
15582A23366o107K2793b00627B45351a17901D4043L0974b35540A47274a19199
15571a17430D6168J28675b15573A68315f06984a08919q081C04770F0040a33129
$$ y = [-106563, 27057, -187610, -144873, 15915, 100352, -137641, -149633, 142808, -375789, -77168, 71114, -9727, 164791, -235026, 136565, -316374, 79202, -160314, -94606, -47039, -310351, -109065, -111982, -151340, 273072, -255520, -184355, 26794, 359702, 138526, -35842, 71800, -84320, -15340, 132304, 168098, 27948, -283143, 95225, -70572, -10107, 238993, 156716, 205235, 171562, -104115, 100913, -30626, 29706, -160163, 186641, -38672, 212040, -2892, -99806, 144999, 87280, -103739, 46647, 230281, 131709, -106639, -128348, 94598, -192214, -150972, 312360, -9319, 190461, -140162, 123366, 117259, 140052, -200627, 245351, -117901, 44043, 75017, -235540, 147274, -119199, -117430, 46168, 174843, -215573, 168315, -606984, -108919, -117000, 304770, 60040, -133129]
15560f6162m4197e3882B31830H94a32576H186g0595C4845J50373g1830A94302
15548b83296F9767R2474P4250p5083f6528k27290h1553b8358a3971l77474B31318
15536E1274Q3099c3883A9210a32424r2299B2764J3070A4733J29103c9799A2795
15524D816b09976M1558C69288d0841A36537g5989A66845J25268r4739o6766A0858
15512B85765A09823a46335A05294J03525k172k6233K6125p6362O7986K4705F0792
15500a79931A27363J55271k627J10392j47962j011N050L8019A8021J10907J11444
15489B40372m2722b64715m2523A11094k0176e9685J5316A6231a23789B57505M4135
15478C01640F4268L99945j50716L11709m6393j62235p198o6685a36418B81696
$$ y = [-66162, -110359, -53882, 231830, 894, -132576, 8186, -70595, 34845, 185218, -71830, 194302, -283296, 69767, 162241, 236491, 161408, -66528, -293818, -81553, -28358, -13971, -391445, 231318, 51274, 134373, -33883, 19210, -132424, -224723, 22764, 35834, 14733, 143836, -39799, 12795, 4816, -209976, -168418, 369288, -40841, 136537, -75989, 166845, 292113, 197374, 130608, 10858, 285765, 109823, -146335, 105294, 208819, 206647, 180414, 206539, 130177, 198163, 222868, 60792, -179931, 127363, 282634, 280007, 390399, 242437, 241426, 246476, 284495, 18021, 128928, 240372, 197650, -264715, -307238, 111094, 90918, -59685, -44369, 16231, -123789, 257505, 301640, 64268, 464213, 313497, 625206, 578813, 416578, 409380, 342695, -136418, 281696]
15467F497L63485e9709b7684f761A61538Q2468B53b35061B72152a9285I3196a87038
15454d2356J2585A30270M9430D9405c5747B60835H0490h6741B49136L28750k25888
15443C51998L50346L28188P2611R8842E86603j78565J43425A12293J49991D2047
15432a96996h4876A05938E1304b2255j30857B16393c38126a6782k36532A78246
15421A57916b6165r3424A01887K43904j27575c16198d4723F1161b36663I2573
15410E9772Q7405O6185a22879E9113a40592M8157B5590K6209f8632j36790c6979
15398B20171a71264j65004J51413A98216E1344O6389D1887a15871B79792l157
15388B76635O3791A01704M2273n4005b8115m21280d915j70177G3166a01116L5182
$$ y = [6497, 369982, -59709, -27684, -6761, 161538, 244006, 253, -235061, 272152, -19285, 93196, -187038, -42356, -29771, 130270, 179700, 49405, -35747, 260835, 80490, -86741, 249136, 577886, 351998, 702344, 1030532, 1103143, 1201985, 586603, 408038, 551463, 112293, 262284, 42047, -196996, -84876, 105938, 51304, -22255, -153112, 216393, -338126, -16782, -253314, 178246, 157916, -26165, -119589, 101887, 345791, 218216, -316198, -44723, 61161, -236663, 92573, 59772, 147177, 213362, -122879, 59113, -140592, -92435, 25590, 51799, -68632, -205422, -36979, 220171, -171264, -336268, -184855, 198216, 51344, 117733, 41887, -115871, 279792, 276635, 340426, 101704, 143977, 89972, -28115, -449395, -4915, -175092, 73166, -101116, -65934]
15377f5934K4451G6186J12871J1524J60293A61504P3483r6904j5036c9411I1479
15365C28662j53799a2758C02299D1370R6953a21342A37390a55293k8486c2037
15354G0213J79841M7321A36697J99563o6795i2124A86302a41921D44024d8475
15343F8329M11357n1064j19618K24150M7364I3682J3678K81519c11341O8595A25810
15331A4439P5932K11865K65193h994C61109b8526H2975J9204a58150j23255A67377
15319d38B31971h605C48874a9145k0869A32284K58999j54996o8763A5869d4036
15307H1700p465J1175b47252B2635c07725D0206d1652F7169K3578N6304B7424
15295A31465a42738B42093J46146j92656b59481A65221k2115K94356b22012i2453
$$ y = [-65934, -41483, 76186, 189057, 200581, 360874, 161504, 234987, 138083, 123047, -39411, 91479, 328662, 174863, -12758, 302299, 41370, 138323, -121342, 137390, -155293, -183779, -32037, 70213, 250054, 297375, 136697, 336260, 269465, -92124, 186302, -141921, 444024, -48475, 68329, 479686, 428622, 309004, 533154, 580518, 93682, 107360, 388879, -311341, -242746, 125810, 14439, 90371, 302236, 567429, -8994, 361109, -28526, 82975, 102179, -158150, -281405, 167377, -438, 231971, -8605, 348874, -19145, -40014, 132284, 391283, 236287, 167524, 15869, -44036, 81700, 74235, 85410, -247252, 22635, -307725, 40206, -41652, 67169, 90747, 147051, 27424, 131465, -142738, 242093, 388239, 195583, -259481, 165221, 143106, 437462, -222012, -92453]
15284B11637H6855e8505r3400J4719F5848N8836g5316E7784J12198n9629J53171
15273B63524J11123B4400J24747J36411C59K5940R9833J84226j16647r2545J60995
15262B62161b12938h5283r1563b8561j45616B31442g1659j02135C91393c8910
15251C63054n5592A8333d8815F9278O4039J22430J13376j37241J60807q0189J672518
15240A985018l20113J28645J07081I41382C68461A30385K18267E0121K03232B6834
15229B44404a7049C14180j54199J13399A15792C7169N163L686K7860i1363C35630
15217H2617c0627j9439D73040G5640k5851j2840K39821F8535c9764G3244Q362
15206H1606b82414A1773J0449P7560L8384K39015N2452D3639b49510C37208j52385
$$ y = [211637, 86855, -58505, -151905, -137186, 65848, 124684, -75316, 57784, 169982, 110353, 263524, 374647, 24400, 149147, 285558, 359, 26299, 126132, 310358, 193711, 101166, 262161, -212938, -85283, -176846, -28561, -174177, 231442, -71659, -173794, 391393, -38910, 363054, 307462, 18333, -48815, 69278, 133317, 255747, 369123, 231882, 392689, 312500, 1985018, 1664905, 1793550, 1900631, 941382, 368461, 130385, 348652, 50121, 253353, 26834, 244404, -17049, 314180, 159981, 273380, 115792, 37169, 42332, 46018, 73878, -91363, 335630, 82617, -30627, -50066, 473040, 75640, 49789, 36949, 276770, 68535, -39764, 73244, 81606, -282414, 11773, 22222, 99782, 138166, 377181, 429633, 43639, -249510, 337208, 184823]
15195A84823o3362a32707D492c3090j16780I8814a01604L0487I590h432B06977
15183e2335l1886A86359l8898J6965O9634C6570a32273a9966p7965F8169K6786
15172I4955J18912k0316q5350B1993J32649d4772J0276A04726J90887n4118o0553
15161A80942j218d7844o080B25476a17904H3373L55140B03730r882J48462q9789
15150B52521E1936J6692A7991L4762L20272A00832J13032B4907J00614k0808J91711
15139B96424J2245m7299I717R5476J42665l8493L3701m4263K8708n6932a8891
15127B94398j30298q1646O8107j538J7777a39533F6804M20462j31741J98863a25573
15115B23717N0725a38479n9152A07158l3683L4457j986i6142j29622C3939J87752
$$ y = [184823, 121461, -132707, 4492, -33090, -149870, 98814, -101604, -71117, 9590, -8432, 206977, -52335, -84221, 186359, 147461, 164426, 234060, 36570, -132273, -19966, -97931, 68169, 94955, 213867, 193551, 108201, 21993, 154642, -44772, -34496, 104726, 295613, 241495, 180942, 179724, -47844, -53924, 225476, -117904, 83373, 438513, 203730, 193848, 342310, 252521, 51936, 68628, 17991, 52753, 373025, 100832, 213864, 24907, 125521, 104713, 296424, 308669, 261370, 9717, 105193, 247858, 209365, 243066, 198803, 227511, 170579, -18891, 294398, 164100, 82454, 150561, 149023, 166800, -139533, 66804, 487266, 355525, 554388, -125573, 223717, 274442, -138479, -197631, 107158, 73475, 107932, 105946, -96142, -225764, 33939, 221691]
15104B21691J06183j61232K76090A06948a14102D41898j55084r3504m2032P4892
15094B26170O4395D6628b327D8915a83314P9940J3298B46521n0400K9427J9130
15083B44678n8940G6516J53951A01829J13542J81947f5225A82510K13155G3062
15072B3747M31921I2117c7616j55676A76687a55601B20321n242M6951A1349P2781
15061H4130J16033K77745D2938K51089J37657j59293j9517A24673J06005J18408
15051C49086J3815A09847O48031l60316J66237k0057d4346H9894J54143J33813
15041C77850J01134F3452K58080D5294M15336K0001J17217B00117J55173K03346
15031E58636k21974J82035J53566J46977C69360K07016p1329j22808J5180o7605
$$ y = [221691, 327874, 166642, 442732, 106948, -114102, 441898, 286814, 193310, 151278, 226170, 290565, 46628, -2327, 48915, -183314, -103374, -90076, 246521, 196121, 225548, 244678, 185738, 76516, 230467, 101829, 215371, 397318, -65225, 182510, 395665, 73062, 23747, 455668, 92117, -37616, -193292, 176687, -155601, 220321, 215079, 262030, 11349, 84130, 200163, 477908, 42938, 294027, 431684, 272391, 252874, 124673, 230678, 349086, 362901, 109847, 757878, 397562, 563799, 543742, -44346, 89894, 244037, 377850, 478984, 63452, 321532, 45294, 460630, 480631, 597848, 200117, 355290, 558636, 336662, 518697, 672263, 819240, 369360, 576376, 505047, 382239, 397419, 329814]
15021C29814Q5196J27435B55133J20593J01960m2475j83174o4573L75111j64157
15011C98418L4179j21448L26568j42806A54982J46104j9171J96739j71965k706
15001C03983k2967M33277A31703M10259B35933K32646L414E0502J30875L00605
14991D81982j50446L31582A48742K07069J39106L4769j30001A06082M13418L75068
14981H94568j02739M5379k34705k01601K03172N7928j71676K26427l56073K89385
14971F50065M7616k02645k30602N7067n7255K3466K73363A45532L17264P6614
14961E39410A48571K28925K58743k59590I7659L36585j48978J49259q5749J58278
14951E07054k05339o6702K11140j12143J27498r728K18258k95366n2104R1077
$$ y = [329814, 415010, 542445, 255133, 375726, 477686, 435211, 252037, 187464, 562575, 398418, 432597, 311149, 637717, 494911, 154982, 301086, 281915, 478654, 306689, 303983, 281016, 714293, 131703, 541962, 235933, 468579, 471993, 50502, 181377, 481982, 331536, 663118, 148742, 355811, 494917, 529686, 399685, 106082, 519500, 894568, 791829, 837208, 602503, 400902, 604074, 662002, 490326, 716753, 360680, 650065, 697681, 495036, 264434, 321501, 264246, 287712, 561075, 145532, 462796, 539410, 148571, 377496, 636239, 376649, 97659, 434244, 285266, 434525, 348776, 507054, 301715, 235013, 446153, 334010, 461508, 451780, 670038, 374672, 322568, 413645]
14941D13645j89767l4172K16754J7867M3867j55210J63758L81427j32961J82026
14931I07234J93382J25725l0846L76470j5013K55564n213L7487l13344Q2380L13286
14920A927112l00369J52964M53484J86375k88728l57271j70430j61819j82821
14911A258497n07587k74874J96634C15115L84386j70739j33660K54149j93190
14902D56061H5760N3141L91570j51015K20655k83762N439D8143K17744K16893
14892D82780B19796K3083L96864j50010J2614P3702J22272J85154k42657L17453
14882I58271P8920m5851j67632L1585B75479P69630E20705L53089m03685N0579
14872E20688j5617J40969j07717J41539o0416M05882l11217q7204K26619j50324
$$ y = [413645, 223878, 189706, 406460, 424327, 468194, 312984, 476742, 858169, 725208, 907234, 1100616, 1226341, 1195495, 1571965, 1556952, 1812516, 1807303, 1844790, 1531446, 1613826, 1927112, 1626743, 1779707, 2233191, 2419566, 2130838, 1773567, 1603137, 1441318, 1258497, 750910, 476036, 672670, 315115, 699501, 528762, 395102, 649251, 456061, 85760, 138901, 530471, 379456, 600111, 316349, 321788, 48143, 265887, 482780, 219796, 242879, 639743, 489733, 502347, 576049, 698321, 883475, 640818, 958271, 1037191, 991340, 823708, 855293, 275479, 1045109, 520705, 873794, 470109, 520688, 505071, 646040, 538323, 679862, 619446, 1025328, 714111, 626907, 853526, 703202]
14862G03202J25578C39990J51898K24555j41695B73228J17979J76195j81933q2132
14852C03337Q5246O3479J49489L7543J51865p4594J78403J83380J29942K466j28818
14841A081738k63210K04926m51279L92241J0775D34443P3451B14887K69012L63854
14831H47753C95752K31880Q3424B72483J73437L20561j60096L9407k03912K39604
14821F81484Q2634j56226J17748Q6053k30091L66326j75253j34386O5109m3794
14811F59604L2692l8414J59671N00762l03415j00645j1572J6821l54729p3629
14801D87146l2881O3701j45596L94482l47917J89723j03324n4082J69087K66374
14791H86713k41104L146j09562R3907K40094r3538J14394l02689m0631P3655q618
$$ y = [703202, 828780, 339990, 491888, 716443, 574748, 273228, 391207, 567402, 385469, 303337, 388583, 452062, 601551, 639094, 790959, 716365, 894768, 1078148, 1208090, 1210556, 1081738, 818528, 1023454, 572175, 964416, 975191, 434443, 507894, 214887, 483899, 847753, 395752, 627632, 711056, 272483, 445920, 766481, 606385, 645792, 441880, 681484, 764118, 607892, 725640, 811693, 581602, 947928, 772675, 638289, 703398, 659604, 692296, 653882, 813553, 1314315, 1010900, 910255, 898683, 915504, 560775, 487146, 454265, 517966, 372370, 766852, 418935, 608658, 505334, 451252, 620339, 886713, 645609, 648755, 539193, 633100, 873194, 779656, 894050, 591361, 550730, 624385, 615767]
14780F15767K38128r5033C24965Q64914j30207k14708m7339M9717j83123K06929
14770H71148k1576l31263J34137K40763m38993k0292J83542p516L01294m01841
14760E09403N42629j72006l63894j05744M15123j3444j95005J62700l7286j11767
14750F30709O0624N7505l12715K00627L214k95412J03813K04962K40366k89026
14740F04667Q7317J77991D01000N24093k88499K03466q4907q585J26934K45191
14730A118693M4594J72925M27049J76323k71906m20744J31208n38230L34491k94053
14720H80350j53203K04573J59748k55605k55006j16615L69855j12965j46309J27798
14710G02621m7270L85907r3883K64947p5194K24884L38686M84493k63278K5999
$$ y = [615767, 853895, 758862, 324965, 1189879, 1059672, 844964, 797625, 847342, 664219, 871148, 849572, 518309, 652446, 893209, 454216, 433924, 617466, 609950, 911244, 509403, 1052032, 880026, 516132, 410388, 825511, 812067, 617062, 779762, 742476, 630709, 691333, 748838, 436123, 636750, 639964, 344552, 448365, 653327, 893693, 604667, 691984, 869975, 401000, 925093, 636594, 840060, 755153, 746568, 873502, 1118693, 1163287, 1336212, 1763261, 1939584, 1667678, 1246934, 1378142, 839912, 1174403, 880350, 727147, 931720, 1091468, 835863, 580857, 464242, 834097, 721132, 574823, 702621, 655351, 1041258, 947375, 1212322, 1137128, 1362012, 1700698, 2185191, 1921913, 1947912]
14700A947912k37493l74253J8029l70072l9988j17456L79101k53646M0257j86682
14690H05709K23239k86279J80219k50961K67713l00628L27411L0602j74852L03747
14680A125920k81057J53792j38331j2601K02177j82091o6001m5883K46560J23093
14670A125578m05374M76251k91610J02586l39875M87498k01130l1100o1899Q5263
14660I46188M60781k04666m9423m10506O00198l52672J70387n525J43319n9718
14650A238363j18999j63448L26151l17761J92959j77011K09676j80590K48768
14641A258108J07267l61556K45358j6802k6147l63311M07083J66156j28491k83076
14631A004589K40878j65110J06105k7475K8337E83670R58846m36900K26477L14322
$$ y = [1947912, 1710419, 1336166, 1354195, 984123, 944135, 826679, 1205780, 952134, 992391, 805709, 1028948, 742669, 922888, 671927, 939640, 639012, 966423, 997025, 822173, 1125920, 844863, 998655, 860324, 847723, 1049900, 867809, 801808, 755925, 1002485, 1125578, 720204, 1196455, 904845, 1007431, 667556, 1155054, 953924, 922824, 860925, 946188, 1406969, 1202303, 1152880, 742374, 1342572, 989900, 1160287, 1154762, 1298081, 1238363, 1119364, 955916, 1282067, 964306, 1157265, 980254, 1189930, 1009340, 1258108, 1365375, 1003819, 1249177, 1232375, 1206228, 842917, 1250000, 1416156, 1287665, 1004589, 1245467, 1080357, 1186462, 1158987, 1187324, 583670, 1542516, 1105616, 1332093, 1646415]
14621A646415j10171j59916k85470Q9258L84418k14498j51302j71514O23409m31176
14611A219453R3955j11950L25998k2503k73271J82103l6676P2208Q5193N1833
14601A586343k05646M66450l07463j51362J41927N242j64058l1534L63708k92360
14591A411247K5634L24033m76112J74453N48070n4585l21674M02596l55602K0801
14581A698861j06481L11416k85333M16940p9240J86503k22867j77762J54124M26623
14571B322784l62244k73381M12279q919M8071k9400j25595Q6624K76276J38378
14561B484873N8281J20157l43647M81711l78110N68119k71154M04344K34677K86445
14551C645696M94834J201944J986210M082859P379030J7878133N455733B0110014
$$ y = [1646415, 1536244, 1376328, 1090858, 1180116, 1564534, 1350036, 1198734, 1027220, 1650629, 1219453, 1313408, 1201458, 1527456, 1504953, 1231682, 1413785, 1377109, 1449317, 1534510, 1586343, 1380697, 1847147, 1539684, 1388322, 1530249, 1535491, 1371433, 1339899, 1703607, 1411247, 1436881, 1760914, 1284802, 1459255, 2007325, 1952740, 1631066, 2033662, 1678060, 1698861, 1592380, 1903796, 1618463, 2035403, 1956163, 2142666, 1919799, 1742037, 1896161, 2322784, 1960540, 1687159, 2099438, 2090519, 2138590, 2109190, 1983595, 2070219, 2346495, 2484873, 2543154, 2663311, 2319664, 2801375, 2423265, 2991384, 2720230, 3124574, 3359251, 3645696, 4140530, 5342474, 7328684, 11411543, 18790573, 36668706, 42124439, 20110014]
14542A0039609D895451j708231o56705N9405K44130J431548J191999k415275q91852
14533B150470j57390j94532N36391n09941K3756J83127r307K05909j38150K22879
14523B313212L5389j12906J17190j95127K8090J6034J05320j41355R9247J90283
14513B455377k34133M46886l00443J2189K78217R268M5733J4431r5217J73219
14503B805527k8738K46115l01491L14752P9222L1641q220l65666J49978K89611
14493C212731j71452J25583J93179l66392J41309L08179k18746m9103L59351j51937
14483C382702n3478L96809l28606L29862K17050k39105k18056O08342k68723J07616
14473C934413l8554p2824O5345K92157l28649L52805j38570J70510j89388K6308
$$ y = [10039609, 4895451, 3187220, 2530515, 2589920, 2834050, 4265598, 5457597, 3042322, 2150470, 1993080, 1798548, 2334939, 1824998, 1848754, 2031881, 2022574, 2228483, 2090333, 2313212, 2348601, 2235695, 2352885, 2157758, 2185848, 2201882, 2307202, 2165847, 2265094, 2455377, 2221244, 2668130, 2367687, 2379876, 2658093, 2667361, 2713094, 2727525, 2632308, 2805527, 2776789, 3022904, 2721413, 3036165, 3115387, 3147028, 3138808, 2773142, 2923120, 3212731, 3041279, 3166862, 3360041, 2993649, 3134958, 3443137, 3224391, 3175288, 3534639, 3382702, 3329224, 3726033, 3397427, 3727289, 3944339, 3705234, 3487178, 4095520, 3826797, 3934413, 3895859, 3823035, 3888380, 4180537, 3851888, 4204693, 4066123, 4236633, 4047245, 4073553]
14463D073553R9044J419P8991M44491k52053J15632m25658M63587R1671r6495
14453D594182M53264q5960l43814L38695J98739j12349l4221M81436K1127l13919
14443E197180L47751n6057r9993O49368n76430M29986j52448l2693K37276J60833
14433F104773K94557P1750j66676L19626k06452m5679N67423O9838o8790N22654
14423G463024J96333L5501K38545o532l08827K48305L90219P8257q4774j37817
14413H112234K71929J04506n4617N4397J92401M83000k0886q4893M71791K04519
14403I734381J9320p1276J58979j33945K80544K13834O7877L15112J09443J8573
14393A0712842K94043M73252l0836N66770R5681M7014J15578M96249L9270M79601
$$ y = [4073553, 4172597, 4174016, 4253007, 4697498, 4445445, 4561077, 4135419, 4599006, 4690677, 4594182, 5047446, 4961486, 4617672, 4956367, 5155106, 5042757, 5008536, 5489972, 5511099, 5197180, 5544931, 5488874, 5388881, 6038249, 5461819, 5891805, 5739357, 5706664, 5943940, 6104773, 6399330, 6471080, 6304404, 6624030, 6417578, 6371899, 6939322, 7009160, 6940370, 7463024, 7659357, 7694858, 7933403, 7926871, 7618044, 7866349, 8256568, 8334825, 8250051, 8112234, 8384163, 8488669, 8434052, 8488449, 8680850, 9163850, 9142964, 9058071, 9529862, 9734381, 9753701, 9682425, 9841404, 9707459, 9988003, 10201837, 10269714, 10584826, 10694269, 10712842, 11006885, 11480137, 11449301, 12016071, 12111752, 12158766, 12274344, 12770593, 12809863, 13289464]
14383A3289464L73157k73148L23199J03931L64791M10306K40996J56693K54791
14374A5244180N90833K03360P3681L02045K63896P02922M46821K93502K63063
14365A8384303n7531N52039M41920N09134j83603Q39526O01458N28454O29858
14356B2245558M51427p6962Q98920M39555P70585N49884N20484Q51950Q19350
14347B7470751N38185N90819M40064J071769R75982O08557P95685J036568J198412
14338C4726792M52604J265792Q55903J270274J108729J070349J396147J364675
14330D3511265J130577J399513J509728J364978J868263J284267K027748K104330
14322E6200669J755227J946451K345248J812695K210996K389158K477478K523660
$$ y = [13289464, 13662621, 13389473, 13712672, 13816603, 14181394, 14591700, 14832696, 14989389, 15244180, 15835013, 16038373, 16112054, 16414099, 16677995, 17380917, 17827738, 18121240, 18384303, 18326772, 18878811, 19320731, 19829865, 19646262, 20485788, 21087246, 21615700, 22245558, 22696985, 22620023, 23518943, 23958498, 24729083, 25278967, 25799451, 26651401, 27470751, 28008936, 28599755, 29039819, 30111588, 31087570, 31696127, 32491812, 33528380, 34726792, 35179396, 36445188, 37301091, 38571365, 39680094, 40750443, 42146590, 43511265, 44641842, 46041355, 47551083, 48916061, 50784324, 52068591, 54096339, 56200669, 57955896, 59902347, 62247595, 64060290, 66271286, 68660444, 71137922, 73661582]
14314G3661582L436864K794151L228634L232298L878449L619233L870268L870590
14306A01592069N062526M433752M997382M955996O053886O088804O478046O567362
14298A46229823O870226P633733Q009856Q624650Q880170R549344J0166140J0995241
14290B16959183J0862328J2298479J1874504J3363808J3592084J3792588J4116337
14283C06859311J4778294J4817359J5206552J4540818J4374741J4172916J3504191
14276D08254182J2191330J0689192Q252498L129061O28025M73246J004508N5333
14268D44677375n239899m016134m289866o275453r070231j0785827j2185631j3409461
14260C79404873j4058074j4022198j4601626j5494593j5001701j4570837j4371182
$$ y = [73661582, 77098446, 79892597, 83121231, 86353529, 90231978, 93851211, 97721479, 101592069, 106654595, 111088347, 116085729, 121041725, 127095611, 133184415, 139662461, 146229823, 153100049, 160733782, 168743638, 177368288, 186248458, 195797802, 205963942, 216959183, 227821511, 240119990, 251994494, 265358302, 278950386, 292742974, 306859311, 321637605, 336454964, 351661516, 366202334, 380577075, 394749991, 408254182, 420445512, 431134704, 439387202, 442516263, 443144288, 443617534, 444622042, 444677375, 439437476, 435421342, 431131476, 424856023, 415785792, 404999965, 392814334, 379404873, 365346799, 351324601, 336722975, 321228382, 306226681, 291655844, 277284662]
14253B77284662j4004857j3476763j2622450j1788798j1515900j0619106q824378
14246A94432410r458724r094740q469174p802310p930701o979353o867129o309597
14238A31520682n716216n361161n587791n006942m587345m612445l840102l594111
14230I3214569m063300l695361l406673l267006l032299k509091k579957k438758
14222F8222124k912168j870341j929645k407790j750254k230066j510488j864789
14214E1746583j817003r85717j675767j454306j487572j182994j348492r34225
14206D0860507j173157j101227j210037q86555j178283n28126j077350q43254
14198C2862518q14443r45585r50912p70271m37296o64025p33088q24676m78685
$$ y = [277284662, 263279805, 249803042, 237180592, 225391794, 213875894, 203256788, 194432410, 184973686, 175878946, 167409772, 159607462, 151676761, 144697408, 137830279, 131520682, 125804466, 120443305, 114855514, 109848572, 105261227, 100648782, 96808680, 93214569, 89151269, 85455908, 82049235, 78782229, 75749930, 73240839, 70660882, 68222124, 65309956, 63439615, 61509970, 59102180, 57351926, 55121860, 53611372, 51746583, 49929580, 48943863, 47268096, 45813790, 44326218, 43143224, 41794732, 40860507, 39687350, 38586123, 37376086, 36489531, 35311248, 34783122, 33705772, 32862518, 32048075, 31102490, 30151578, 29381307, 28944011, 28279986, 27546898, 26722222, 26243537]
14189B6243537o61788o93989p86526o35946q0268m76212o70450l73021r63171
14180B0902166K4128o18050p8275p22713o51554J74209r47447j67908k89692l33462
14170A7291402j95580m79597k58085l41990o06091j23829K23859o26032q4022
14161A4800035l43205o01541M4987j14313j54392k38320n50533J12805p10847
14152A2244676k38159L06374k86622k43659j32428P4619n33158m3280l90637k20903
14142A0536823l58399L71500l61589k41879j34073j7572l44362l57180N53191
14133I646460j04676n01609o2477l52637L42681p36792L02856j35238q6851k39817
14123H071900k43562J54592k04792o2754J39984k79834k10058l0690N1940k52482
$$ y = [26243537, 25581749, 24887760, 24101234, 23465288, 23385020, 22908808, 22238358, 21865337, 20902166, 20926294, 20308244, 20229969, 19507256, 18855702, 19029911, 18082464, 17914556, 17624864, 17291402, 17095822, 16616225, 16358140, 16016150, 15410059, 15286230, 15510089, 14884057, 14800035, 14456830, 13855289, 13900276, 13785963, 13631571, 13393251, 12842718, 12955523, 12244676, 12006517, 12312891, 12026269, 11782610, 11650182, 11724801, 11191643, 11148363, 10757726, 10536823, 10178424, 10549924, 10188335, 9946456, 9812383, 9794811, 9450449, 9093269, 9646460, 9541784, 9040175, 8977698, 8625061, 8967742, 8230950, 8533806, 8398568, 8311717, 8071900, 7828338, 7982930, 7778138, 7715384, 7855368, 7575534, 7365476, 7334786, 7386726, 7134244]
14113G134244n3352r6669K4396o92140M30624K727k81232K2762j7710n85385M88371
14102F376636n53860J6104L61417l03703k23507J5809L80486o7567k04437l08532
14092E488846j1369k19112J14762j51606J90543l58039r2305L84749l15327P1012
14082E102154m4688j610o6392l21380j69035L8981R0877j46509P5201j68068J02260
14071D491791j28659J36808j88053N6866k48407O4688l42003K88197J7200k64179
14061C884249J52349N28095m85214k9260q6905k01476J79717O2158j64764j87648
14051C651301J92252n02291j32976N89363j53804l58744L02965k80814j33067
14042C174185J44935j15550j44273k663k36056J14761K06752M9806r9674k46567
$$ y = [7134244, 7080892, 6984223, 7008619, 6316479, 6747103, 6749830, 6468598, 6491360, 6473650, 5888265, 6376636, 5822776, 5838880, 6200297, 5896594, 5673087, 5688896, 6069382, 6001815, 5797378, 5488846, 5477477, 5258365, 5373127, 5221521, 5412064, 5054025, 4961720, 5346469, 5031142, 5102154, 5057466, 5055856, 4989464, 4668084, 4499049, 4538030, 4628907, 4482398, 4557599, 4389531, 4491791, 4363132, 4499940, 4311887, 4368753, 4120346, 4185034, 3843031, 4131228, 4148428, 3884249, 4036598, 4564693, 4079479, 4050219, 3963314, 3761838, 3941555, 4003713, 3838949, 3651301, 3843553, 3341262, 3208286, 3797649, 3643845, 3285101, 3588066, 3307252, 3174185, 3319120, 3203570, 3059297, 3056634, 2820578, 2935339, 3142091, 3191897, 3092223, 2845656]
14032B845656J11831N36764k31907j40160k14682J84201p9183l99871L26737k97119
14022B642267M21156n87389L21888j38985j16162p8637L34463j52023Q5058j20325
14012B611311k84263L99685m15962k11717k3396J37142l6880Q6430k78752j6550
14002A967048q1214K97238k46085J16988o1978j30135L36700j93459k94008M6305
13992A757400j03205M03108K45714R78121K786459N953645J4844370J8889437
13984D5755049j8585674j1293392o568277k989855j275273m98942j081985m5592
13976C416059j99258j99284l18642j18567J76625R9400k00001k50182R1244l6007
13966B461387P9209R9697m24433J97976j0730k81186Q518j89199N84580p15652
$$ y = [2845656, 2957487, 3494251, 3262344, 3122184, 2907502, 3091703, 3012520, 2612649, 2939386, 2642267, 3063423, 2476034, 2797922, 2658937, 2542775, 2464138, 2798601, 2646578, 2731636, 2611311, 2327048, 2726733, 2310771, 2099054, 2075658, 2212800, 2175920, 2262350, 1983598, 1967048, 1885834, 2183072, 1936987, 2053975, 1991997, 1861862, 2198562, 2005103, 1711095, 1757400, 1654195, 2057303, 2303017, 3281138, 6067597, 12021242, 26865612, 45755049, 27169375, 15875983, 9307706, 6317851, 5042578, 4543636, 3461651, 3416059, 3216801, 3017517, 2698875, 2580308, 2756933, 2856333, 2656332, 2406150, 2497394, 2461387, 2540596, 2640293, 2215860, 2413836, 2403106, 2121920, 2130438, 1941239, 2525819, 1810167]
13956A810167J86731o7789R6539j59454P2486k38805L02432K64279m11754M18234
13946B273066m21153l15203J38006K99777k49956J69842k20996N1670k50474J01002
13936A575581M38229l3015l95837R1403O7457J07954k98531L77211k74753k17203
13926A438496Q7278J18088k03503Q4423k47606J50577j89222L02541j92336J5417
13916A364153J53450K8516l87855J58000n6890M36676k61318k51507N18437j85846
13906A515816k40381l6328J48459l2785J78341j92974J35239J1143j3412k1323
13896A451795k38563L66800j06884j07042n16599O65206o16056O32707K41453
13887A772817n38415M99740l95548l09837P8039j79198M74551j26510K49696l50907
$$ y = [1810167, 1996898, 1929109, 2025648, 1866194, 1938680, 1699875, 2002307, 2266586, 1854832, 2273066, 1851913, 1536710, 1674716, 1974493, 1724537, 1894379, 1673383, 1725053, 1474579, 1575581, 2013810, 1980795, 1584958, 1676361, 1743818, 1851772, 1553241, 1930452, 1655699, 1438496, 1525774, 1643862, 1440359, 1524782, 1277176, 1427753, 1238531, 1541072, 1348736, 1364153, 1517603, 1546119, 1158264, 1316264, 1259374, 1696050, 1434732, 1183225, 1701662, 1515816, 1275435, 1239107, 1387566, 1354781, 1533122, 1340148, 1475387, 1486530, 1473118, 1451795, 1213232, 1580032, 1473148, 1366106, 849507, 1514713, 898657, 1531364, 1772817, 1234402, 1734142, 1338594, 1028757, 1106796, 927598, 1402149, 1275639, 1525335, 1174428]
13877A174428L67940m86497K16740j51965j21224J51148k71313M44365k64743
13868A058879j40965K15302p557j26797L56903j55594E97622M76647K2118k1304
13858A075083K14211o0133j37286J40825k72897M1707j21883K73668j76121q0870
13848H96304J50428j27990K9264J2951j20387O7803r5525R2531k24083K38742
13838I20038J32789k14191q6023M97255k98987N5832j18527P8769o8574J42118
13828A040499k25793K37432K9854k62700m0889n2248J49105j68114K86347j54153
13818H39340o0351L5267o1228r5601j66095K57001J08666K55347n6250l95341
13808F60755J34823K80585l21203k4248M6039q2441K17852j71739J12139J86929
$$ y = [1174428, 1542368, 1055871, 1272611, 1120646, 999422, 1150570, 879257, 1323622, 1058879, 917914, 1133216, 1125659, 998862, 1355765, 1200171, 597622, 1074269, 1096387, 1075083, 1289294, 1229161, 1091875, 1232700, 959803, 1001510, 879627, 1153295, 977174, 896304, 1046732, 918742, 948006, 960957, 840570, 908373, 812848, 905379, 681296, 920038, 1052827, 838636, 752613, 1249868, 950881, 1006713, 888186, 966955, 898381, 1040499, 814706, 1052138, 1081992, 819292, 778403, 726155, 875260, 707146, 993493, 839340, 778989, 814256, 753028, 657427, 491332, 748333, 856999, 1112346, 1056096, 660755, 795578, 1076163, 754960, 730712, 776751, 694310, 912162, 740423, 852562, 1039491]
13798A039491k0036l66883J40062j92921o5485K47127j74255M32271m38694K39037
13788H39714j52970p2245O862K10612F5599M05927O9065K35248O5606n3357j16574
13777F71514R2920n3022k61536J25069r6275P9374L5521K30376j27167j11477
13767E85297M10224D81246J51892J80303l06271M1506J0639O9283J38710j38990
13757F28318K03701j27557m7802j13806J28827J03945n7292k05550L693K77690
13747G94167k99090j15293M6663K10885k1436o8468k7009K3537B25510M73799
13737F99309L2973j14917k01102k4547J33242K30392C26902K02052K51936k87096
13727D93794J22977k10808K5982J89874K23256j76277k08311j84920J55565m7424
$$ y = [1039491, 1019455, 652572, 792634, 599713, 534228, 781355, 607100, 1039371, 600677, 839714, 686744, 614499, 621361, 831973, 65599, 471526, 540591, 775839, 841445, 788088, 671514, 764434, 711412, 449876, 574945, 478670, 558044, 593565, 823941, 696774, 585297, 995521, 481246, 633138, 813441, 507170, 548676, 559315, 628598, 767308, 628318, 832019, 704462, 656660, 542854, 671681, 775626, 718334, 512784, 516477, 794167, 495077, 379784, 426447, 637332, 615896, 547428, 520419, 543956, 225510, 699309, 732282, 617365, 416263, 391716, 524958, 755350, 326902, 528954, 780890, 493794, 616771, 405963, 431945, 621819, 845075, 668798, 460487, 275567, 431132, 383708]
13717C83708N80893l33049J07168k70460K7391j1815j68028K51841Q3475k11237
13707D39887L3894j25193M70880l50387n1200O2197B08047N75243j32909k67705
13697C82676Q6998J432P319o7884J1393A81994M65385k12598M5752J02247m3512
13686E39268M52548D22670o5948J66516J89215B81706K47170j90928N2253m599
13676C85602K8430O9669K9300J82918j98269B12287M30354k2038m3505j54542
13666D22556J31306j99437L13981j28032N1220B13068K23863A97778P7671J37744
13656D13193l4376q9707J53875j20691j2846M9706q1062l0096J29768J05091k9060
13645D53795K8827J65679j63000J52375k64097p9703m0632K98999q2283j99678
$$ y = [383708, 964601, 631552, 738720, 468260, 495651, 483836, 315808, 567649, 651124, 439887, 473781, 348588, 819468, 469081, 417881, 480078, 208047, 783290, 650381, 382676, 469674, 471106, 478425, 410541, 421934, 181994, 647379, 434781, 480533, 582780, 539268, 991816, 422670, 356722, 523238, 712453, 281706, 528876, 337948, 390201, 385602, 414032, 483701, 513001, 695919, 497650, 212287, 642641, 620603, 577098, 422556, 553862, 354425, 668406, 540374, 591594, 213068, 436931, 197778, 275449, 413193, 378817, 289110, 442985, 322294, 309448, 359154, 278092, 247996, 377764, 482855, 453795, 482622, 648301, 485301, 637676, 373579, 293876, 253244, 552243, 469960, 270282]
13635B70282Q6932O2312J3895p4823p60K55382N0246j99658j91721K57210M495
13624E33792j05764q6631A7796L89870o7619Q0124J58368M3973B87843J40249
13614D28092j5394L4644j5264M5356J39303m5178B28417M07729k39825M112F8010
13602B93514o6773J04663L78369B26921n4795J74940J23337P0139B30732A13868
13591B66099J07632A59124R8905M4405j19983J73780j64165J92261j5427J66242
13581E35142A03979O9901K52583j59052p2809J04774P6715A07872L13203B04558
13570F65302k81154K9740n9531J17479J28787F3118M25453h0276H12746l62295
13560D50451A10229J58053J25183j47791l9558O6308A09477K21880J6656A30324
$$ y = [270282, 357214, 419526, 433421, 358598, 357838, 613220, 663466, 463808, 272087, 529297, 533792, 428028, 341397, 17796, 407666, 340047, 420171, 578539, 622512, 287843, 428092, 412698, 447342, 432078, 477434, 616737, 571559, 228417, 636146, 396321, 400433, 68010, 293514, 226741, 331404, 709773, 226921, 172126, 347066, 470403, 540542, 230732, 113868, 266099, 373731, 159124, 258029, 302434, 182451, 356231, 192066, 384327, 368900, 535142, 103979, 173880, 426463, 267411, 194602, 299376, 376091, 107872, 421075, 204558, 665302, 384148, 413888, 354357, 471836, 600623, 63118, 488571, -80276, 812746, 450451, 110229, 268282, 393465, 245674, 206116, 272424, 109477, 331357, 348013, 130324]
13549B09111L76477B60733K31119k3944a5182D18367J5208C4690L01331j54958
13539A81063N6434A0210a1144D45416J79584l0941m7263A92596K15907L512j39108
13528B72907J38464l3781I4875K36552K21890q9342A07905J75407H9189K13664
13518C02853I6648L60103j89532J24772a6691A51555K04551J18745C9548h2452
13507B22254q3194M29207A62951p1901K84793A05130L4454H609K48124P240K94530
13496E58503k46755j53434G4595c0597A99547J50661j70362d330A94465K13531
13486D07996j21607A14341J37239a75526C88523n5528A45474k7112J69349k9327
13476B58384a07245B12140K6918J52401a35661A27962C7296K38841K19739k07901
$$ y = [209111, 585588, 260733, 491852, 467908, -15182, 418367, 433575, 34690, 336021, 181063, 237497, 10210, -11144, 445416, 625000, 594059, 546796, 192596, 408503, 412015, 272907, 411371, 377590, 94875, 331427, 553317, 463975, 107905, 283312, 89189, 302853, 96648, 456751, 267219, 391991, -16691, 151555, 356106, 474851, 39548, -82452, 222254, 139060, 568267, 162951, 91050, 375843, 105130, 139584, 8609, 256733, 263973, 558503, 311748, 158314, 74595, -30597, 199547, 350208, 179846, -4330, 194465, 407996, 286389, 114341, 251580, -175526, 388523, 332995, 145474, 118362, 287711, 258384, -107245, 212140, 239058, 391459, -135661, 127962, 37296, 276137, 495876, 287975]
13466B87975B4242d8767C15410B2516K23142Q6176I5171L12942j92311j02195
13456A13607J22787j05496J3303F3990N830K52782J12904l0696j06387L25226
13446F23649l08124q1893r6423J09402A4556O9069J39271c7646n9800a5480B76275
13434C04706A08913J61738J47630A36543J37370D0495K99023N8273J56024G3552
13423I5397L76484p2816J3260A76676A0069L75686A55666p7654M52495A44337
13412B66642a9233A39171K05244c7307I8867K83672B8317g2971A93935J85309
13402C79244r0694F3128K16997k560K9227n585J7335n8369C7573K05605C7201
13390B43618m7462J72187a58491B18246H1662M6491N4910R0083a33864A89998
$$ y = [287975, 24242, -48767, 315410, 22516, 245658, 331834, 95171, 408113, 215802, 113607, 236394, 130898, 144201, 63990, 69820, 322602, 435506, 404810, 298423, 623649, 315525, 233632, 137209, 246611, 14556, 83625, 222896, -37646, -97446, -15480, 276275, 304706, 108913, 270651, 418281, 136543, 273913, 40495, 339518, 397791, 553815, 73552, 95397, 471881, 399065, 412325, 176676, 10069, 385755, 155666, 78012, 530507, 144337, 266642, -19233, 139171, 344415, -37307, 98867, 382539, 28317, -72971, 193935, 379244, 288550, 63128, 280125, 277565, 306792, 301207, 318542, 260173, 37573, 243178, 37201, 243618, 196156, 368343, -158491, 218246, 81662, 128153, 183063, 273146, -133864, 189998]
13379A27592L6057k431K91939j87419a52335A16938J99589c3608F1144j4425L05658
13368C52377j41898r4863R2878O9400q176N842c6405A03103b9663C184J46059
13357A49243O7039D8999K29678j16313K8045N7172i3915D1508L0563J51789K60262
13346D84122c2597C02817K00877J12763B00957J28601J14849j28178M7834M7411
13336D11474B05327J17941A00659K53735k6876J21616r0380A17255N05081A68078
13325A16003J93627e6369O729C56623A36233P4020J57617G2864K28267l8745J21486
13314C83872j84495J18521I8284J96481p048A15044M14216k02782G3062J0051
13304H3113L72338a5425B67686a9293A68868J20586A29024M88535C07309A42968
$$ y = [127592, 163649, 161218, 453157, 265738, -152335, 116938, 316527, -33608, 61144, 46719, 352377, 210479, 115616, 208494, 277894, 269718, 275560, -36405, 103103, -29663, 3184, 149243, 216282, 48999, 278677, 162364, 190409, 247581, -93915, 41508, 72071, 223860, 484122, -32597, 302817, 503694, 616457, 200957, 329558, 444407, 316229, 364063, 411474, 205327, 323268, 100659, 354394, 327518, 449134, 358754, 117255, 622336, 168078, 116003, 309630, -56369, -49640, 356623, 136233, 210253, 367870, 72864, 301131, 262386, 383872, 199377, 317898, 98284, 294765, 287717, 115044, 529260, 326478, 73062, 83113, 455451, -15425, 267686, -19293, 168868, 289454, 129024, 617559, 307309, 142968]
13293d3163B59360P5117O7881j20282G6092d2441H8038M773J45391A11087C1938
13281B61706I3730J62862K3874A03232K75011A32047C1145A0715R208a4417G8414
13269C486J31212h2014C04000E9451h4218B96740j43239G5234J63292a83027D5537
13257B05677a86552g2195A44616b87239a13839E1094A8250M7191f5002E0105J01438
13246A51543j2860o4924K33561A16963l5847Q2550K3620a34275A64963f5326P664
13235e7662k13712A09601b00601G1338J03366o185e7477K8633B2540J25459a84715
13223A18242m1561O5492a21472B69245A31582j7366E1654J91615A20766J33308
13213B54074J8531A04191F792a32437d0243A81861b49578F3342g0351A3401J82544
$$ y = [-43163, 259360, 334477, 402358, 282076, 76092, -42441, 88038, 92811, 238202, 111087, 31938, 261706, 93730, 256592, 280466, 103232, 378243, 132047, 31145, 10715, 19923, -14417, 78414, 3486, 134698, -82014, 304000, 59451, -84218, 296740, 153501, 75234, 238526, -183027, 45537, 205677, -186552, -72195, 144616, -287239, -113839, 51094, 18250, 65441, -65002, 50105, 151543, 138683, 73759, 307320, 116963, 81116, 163666, 187286, -134275, 164963, -65326, -57662, -271374, 109601, -200601, 71338, 174704, 168519, -57477, -28844, 22540, 147999, -184715, 118242, 76681, 142173, -121472, 269245, 131582, 114216, 51654, 243269, 120766, 254074, 272605, 104191, 6792, -132437, -40243, 181861, -249578, 63342, -70351, 13401, 195945]
13202A95945o6777J5105c3241C8016J45297D9364L80236h876B48686I5301K47180
13191C42481N3648g4983l12268B156J54126I849d8340H074J60087K11463F9630
13179d1367j37137g4997j23923C8022A0063J41449o3064h6505a310j1579A66624
13167A63342E8472L12867I5470a84257D4056d7352B97754a6744l51052a82189
13156B52494R3793p4042j19911m7424g198A21647l5531B9996M0863K40190A54162
13144B4555J69259k9315Q9243q9820p9122L7553n6526b07320C05634a43759B51006
13132D90624F4096h7841C226O4053a51835B53704n5281p3965J02167H5184K69509
13121C54693A51973a274C1100e7032H5439J17314e562j00830m197L5808j918n9004
$$ y = [195945, 129168, 144273, -33241, 38016, 183313, 49364, 429600, -8876, 248686, 95301, 342481, 396129, -74983, -387251, 2156, 156282, 9849, -48340, 8074, 168161, 379624, 69630, -41367, -178504, -74997, -198920, 38022, 10063, 151512, 88448, -86505, -1310, -12889, 166624, 163342, 58472, 371339, 95470, -184257, 44056, -47352, 297754, -16744, -367796, -182189, 252494, 346287, 272245, 152334, 104910, -7198, 121647, 86116, 29996, 70859, 311049, 154162, 24555, 193814, 164499, 253742, 163922, 84800, 122353, 65827, -207320, 305634, -143759, 251006, 490624, 64096, -87841, 3226, 67279, -151835, 253704, 198423, 124458, 226625, 85184, 354693, 151973, -1274, 31100, -57032, 85439, 202753, -5562, -106392, -110589, -74781, -76699, -135703]
13109a35703P661B01021G6929J23889A0882a0620k1055A00779K89926j94197l9458
13098A57050a79508A33652r339j7415J81871b11748I8618k8306e42961b61106
13087i3133C59169b851l13027A56642D2160R779J44527i1297B55108a45646F6272
13075B61762o6488q8432b2207B54776J8436b81079F2344c2319B58125a0256C31907
13063a14295A34295n5071i8285l8379B92119j18216q4364O4409J23251B8076P9817
13052A07893D0004N04909d3209l2870D36478G1143b303B25395a31408B25132j04738
13041A20394a17204r1835a02640B56828h339l6451A40872L89041d2864A24284
13030e7930k3910I0401D2316P969M4170L4480h5893A84308B926R0877m6900A3004
$$ y = [-135703, -128042, 201021, 76929, 200818, 10882, -10620, -31675, 100779, 390705, 196508, 157050, -179508, 133652, 124313, 106898, 288769, -211748, 98618, 70312, -542961, -261106, -93133, 359169, -2851, -315878, 156642, 42160, 51939, 196466, -91297, 255108, -145646, 66272, 261762, 195274, 106842, -22207, 254776, 273212, -281079, 62344, -32319, 258125, -10256, 331907, -114295, 134295, 79224, -98285, -136664, 292119, 173903, 89539, 153948, 277199, 28076, 107893, 40004, 544913, -43209, -76079, 436478, 71143, -2303, 225395, -131408, 225132, 120394, -117204, -209039, -102640, 256828, -8339, -44790, 140872, 529913, -42864, 124284, -57930, -81840, 90401, 42316, 50285, 94455, 128935, -85893, 184308, 2926, 93803, 46903, 13004]
13017C23398A53198N0414I9408K45547b58799D9436Q5671M3351G9422K78661j36530
13006B21553J8595a23382A20305b19891f2784K263p685C4204R9832D0901L2870
12995G3771N633b01228A47314B3574a54912c4080A25373K06476I7427O3067o6067
12984I4427h6456J897A1186J41344C3220K39262j17330B5039N37743f622q6974
12973i3596J4924A37732B6934J18385L4298L2108g643A49256P4219J81550a53094
12961a50741b0477q7709d3740C8968c90842J90250C88706a7340A26998l2074f4794
12949d4451j34559G5745P6514n5423a8729l4882l5945C01122J79525a76763A51340
12937b05123g1588F5146e1536F3693L28558a76614E0660i823q2867A39607C0443
$$ y = [323398, 153198, 203612, 99408, 344955, -258799, 49436, 135107, 178458, 79422, 358083, 221553, 240148, -123382, 120305, -219891, -62784, -60521, -68206, 34204, 134036, 40901, 73771, 79404, -201228, 147314, 23574, -154912, -34080, 125373, 331849, 97427, 160494, 94427, -86456, -84559, 11186, 152530, 33220, 272482, 155152, 25039, 562782, -6622, -93596, -78672, 137732, 26934, 145319, 179617, 211725, -7643, 149256, 223475, 405025, -153094, -150741, -20477, -108186, -43740, 38968, -390842, -200592, 388706, -17340, 126998, 94924, -64794, -44451, -179010, 75745, 152259, 96836, -18729, -53611, -89556, 301122, 480647, -176763, 151340, -205123, -71588, 65146, -51536, 63693, 392251, -176614, 50660, -9823, -92690, 139607, 30443]
12925B54556h8888o0407I1170D2552c365A06859j1548L2328k2631K27957F571
12913A7994K56704g2211p2964A8131i9182B61552B5585a13360B79278j158A24794
12901I5797P4509a8420n881E852J79779k3212b5873D5800i7059k98875c4560A94609
12888A78481d53846F5110h8872j05791p3508F6924g4694b2965A59003b17996E0505
12876b2747B47017n0937C4424g9682j44954G0383d4203F2162j6728R1903F3082
12864b99293a7859l7440n5223K9738A97144A321b34554D99706A73638B8182J6933
12853D5115a72029j19911I3006a73318D194f5581A1913b41950B22188b14249E2383
12841A5166J01229J8706c57773a6921r7150A01974H340h9033B52596h8292A52931
$$ y = [254556, -88888, -149295, 91170, 42552, -3365, 106859, 95311, 127639, 105008, 332965, 6571, 17994, 274698, -72211, -145175, 18131, -99182, 261552, 25585, -113360, 279278, 278120, 124794, 95797, 170306, -18420, -24301, 5852, 185631, 162419, -25873, 45800, -97059, -395934, -34560, 194609, 178481, -453846, 65110, -88872, -194663, -268171, 66924, -74694, -22965, 159003, -217996, 50505, -22747, 247017, 196080, 34424, -79682, -224636, 70383, -44203, 62162, 45434, 137337, 63082, -299293, -17859, -55299, -110522, -80784, 197144, 1321, -234554, 499706, 173638, 28182, 45115, -172029, -291940, 93006, -173318, 4194, -65581, 11913, -241950, 222188, -214249, 52383, 15166, 116395, 135101, -357773, -16921, -114071, 101974, 8340, -89033, 252596, -88292, 152931]
12829b15379N9187l2178Q2399e1868A87653D3425i2851C16011G1883c1662k25455
12818b57117j9464J07196c7282Q026B3906L51612A17356a5100A72099J634b60099
12806C54581a68032M9889p8297K9109A00833a42715G889a53276H42K26049n3840
12795A73051m2720D4253O725K642a47452K86j4598C15632A42220a7463b932o8335
12783g1267j23411b1617j3270j48954E6458a43619A02678m4763L33889c28191
12772a10160C5226b17765B19038c25341f1405B09166k7686n8283g87A25713N3724
12761A79437l8554a7029B78416D5044K77404a95142H8607c39054J40314K5489
12751a73251B1258a00191R233A59328H926P1568c1442a1414k43995B15050J293
$$ y = [-215379, -156192, -188370, -105971, -51868, 187653, 43425, -92851, 316011, 71883, -31662, -257117, -276581, -169385, -37282, -29256, 23906, 375518, 117356, -15100, 172099, 173733, -260099, 354581, -168032, -118143, -196440, -167331, 100833, -142715, 7889, -153276, 842, 226891, 173051, 130331, 44253, 50978, 53620, -147452, -147166, -161764, 315632, 142220, -17463, -2932, -71267, -194678, -21617, -34887, -183841, 56458, -143619, 102678, 57915, 391804, -328191, -110160, 35226, -217765, 219038, -325341, -61405, 209166, 181480, 123197, -787, 125713, 179437, 140883, -17029, 278416, 45044, 322448, -195142, 88607, -339054, -198740, -173251, 21258, -100191, -90958, 159328, 8926, 80494, -31442, -11414, -255409, 215050, 216343]
12740B16343J3285b60192A98616J90516b5919n0299A07925e6943E5868k7028a33226
12728A2094L07715r3850j04928E4071J57674e4725C3682O5888a05567F1994B1157
12716B32198A07181b35345R3855A27438L2138b90610C26226a35458C21773r7328
12706B24445A9813Q9252M35391B24136r006B8667L6805g3702j31074R3190N4011
12695e7575o1185A74941m2930a62489C4956K77962A29539J25873j21090J14539
12685B48861A8244c00713B126g4371j30531R9823k49241J41536D81977l5529G1412
12673B48761G196M5365a10397D1814k102J26354i1500r354j28489N0983C4730
12661i1545A37019J92262a65140M2734j1606B80702F8385h9871B90466J27478
$$ y = [216343, 229628, -260192, 198616, 389132, -25919, -76218, 107925, -56943, 55868, 28840, -133226, 12094, 319809, 225959, 121031, 54071, 211745, -54725, 33682, 99570, -105567, 61994, 21157, 232198, 107181, -235345, -141490, 127438, 159576, -290610, 326226, -135458, 321773, 224445, 19813, 109065, 544456, 224136, 215130, 28667, 65472, -73702, -204776, -111586, -57575, -118760, 174941, 132011, -162489, 34956, 312918, 129539, 255412, 134322, 248861, 18244, -300713, 2126, -74371, -204902, -105079, -354320, -212784, 481977, 446448, 71412, 248761, 7196, 52561, -110397, 41814, 39712, 166066, -91500, -100854, -229343, -178360, 34730, -91545, 137019, 329281, -165140, -122406, -134012, 280702, 68385, -89871, 290466, 417944]
12651D17944c2996A95170H3057C7111O5862N622J63868b68562i3352j79421B88479
12639e7361j46556A73478b6108B32221H9086R7414N3981J37735I0924J16806c2526
12627C887K64531H9699b97092A77690p3112m6139o77i1842B26454A11404O8265
12616A79669b99103A63471e7612K7585F0744M7109K1482a11474I1993h5697G9190
12604A62163e7628D67512A18530a11925K1242A71549a38276b0935j19732l7725
12594a78392D42640A61781Q373l5260n6966a00655E9134K5056a24014A51224a15848
12582h3614a4267j12384A5257M98391H5339J49050A05615m2590n695J72235H031
12570B33692c54A73859J15264Q8337a40866a1775j71526A89075E9756c7291g278
$$ y = [417944, -32996, 195170, 83057, 37111, 102973, 108595, 272463, -268562, -93352, -272773, 288479, -57361, -203917, 173478, -26108, 232221, 89086, 186500, 240481, 378216, 90924, 207730, -32526, 3887, 268418, 89699, -297092, 177690, 104578, 58439, 57762, -91842, 226454, 111404, 179669, -299103, 163471, -57612, -30027, 60744, 107853, 129335, -111474, 91993, -85697, 79190, 162163, -57628, 467512, 118530, -111925, -90683, 171549, -138276, -20935, -140667, -178392, 442640, 161781, 170154, 134894, 77928, -100655, 59134, 84190, -124014, 151224, -115848, -83614, -14267, -126651, 15257, 513648, 85339, 234389, 105615, 63025, 57330, 229565, 8031, 233692, -354, 173859, 289123, 377460, -140866, -11775, -183301, 189075, 59756, -37291, -7278]
12558f1577K7776q6400n9255B20018A7657d4217r5275M0260r1545O9421j10063
12547b31419A8091a02704B9108c75440A67415b34232c8913J805j1261H1146A0480
12535B07761k5502c12601B4210b27137B9253a45013q4242A53767P4148o0895a96805
12523C8750Q4362b79774C7493a58449k7195b9507A98693a12365b4903l9699k81490
12512c46092h3238E4494O2653c13866a48885e1983B7452J4429K47838c42633a09896
12500C8186c5117q6479k34571J30851f3477B2151K34464j24446a20195A82079
12489A67873J55889a7285k76697E386a26174A17097a9657A01080a27433B5381
12478E6745a03218j11730A651a78620B78370e1455A2845K3505O2600K22016c84594
$$ y = [-61577, -33801, -120201, -179456, 220018, 17657, -44217, -139492, -99232, -190777, -121356, -231419, 18091, -102704, 29108, -375440, 167415, -234232, -38913, -37108, -48369, 81146, 10480, 207761, 182259, -312601, 24210, -227137, 29253, -145013, -229255, 153767, 227915, 167020, -196805, 38750, 123112, -279774, 37493, -158449, -185644, -29507, 198693, -112365, -24903, -64602, -346092, -83238, 54494, 117147, -313866, -148885, -51983, 27452, 41881, 289719, -342633, -109896, 38186, -35117, -121596, -356167, -225316, -63477, 22151, 256615, 132169, -120195, 182079, 167873, 323762, -17285, -293982, 5386, -126174, 117097, -19657, 101080, -127433, 25381, 56745, -103218, -214948, 1651, -178620, 278370, -51455, 12845, 36350, 98950, 320966, -384594]
12466B07094F0638K0011a62780E7470J3672N3432c3921A01722J00261e558j25235
12455a30793G4418a16856a7697n9677F529j485J35688b92740D2276d8586G9559
12443A37852a26232E7750c05194A12139l1259c32687Q6178K5231n3359A35347
12432c32250O5971a21212B26107A03267Q5395a0245B599b13831R7922C8471a19472
12420a0553q663B09939b5662B29327B0481O7135a38609k8607e7610C7659c13058
12408B46469a84015E4589j1471a32312n8837C8907a5813B51494c69870a520k09025
12397b10545d4016C04033b51787i3086A54415J0081G5794L655a5862r8209a221
12385b3137B99870i9727B45690o1411b3713j8709G7970k2199K2624M1081a72764
$$ y = [207094, 60638, 80649, -162780, 57470, 71142, 124574, -33921, 101722, 201983, -5558, -130793, 74418, -116856, -17697, -77374, 6529, 5044, 140732, -292740, 42276, -48586, 79559, 137852, -126232, 57750, -305194, 112139, 80880, -332687, -246509, -221278, -274637, 135347, -332250, -266279, -121212, 226107, 103267, 188662, -10245, 2599, -213831, -115909, 38471, -119472, -10553, -19216, 209939, -25662, 229327, 20481, 87616, -138609, -167216, -57610, 37659, -313058, 246469, -184015, 54589, 43118, -132312, -191149, 38907, -15813, 251494, -369870, -1520, -210545, -44016, 304033, -251787, -93086, 154415, 164496, 75794, 79449, -15862, -114071, -1221, -23137, 299870, -99727, 245690, 184279, -23713, -42422, 77970, 55771, 78395, 119476, -172764]
12373A81459a86912j04781a23755m4702A35148P4793b1394A35981J07922k3425
12363B20478C5506M0531K79495g74p4349A49217d0031B05529a80295a9889l24600
12352c44489d3510C54701B5069J00300b2574D43476A80790a35125B52975m1587
12342B11388e830k09378A41901E2948a12205k10866P6943b4436I5970J20890D8101
12330C21468G371J60452O3709b7236A65170E5675e2801B23892J39041j54554J21839
12319C30218b928C10080A45011J72517a7088A44193F0953a11899C37376H5583
12308I736D282J20944C8003A3399J84634M2204g1254C44796h3904L6717j48899
12297a96086c186I5693A1347e4712D1080K09921a70064B04256e4936B30339a75130
$$ y = [181459, -186912, -291693, -123755, -168457, 135148, 209941, -21394, 135981, 243903, 220478, 35506, 76037, 355532, -774, -75123, 149217, -40031, 205529, -180295, -19889, -344489, -43510, 354701, 25069, 125369, -22574, 443476, 180790, -135125, 252975, 211388, -5830, -215208, 141901, 52948, -112205, -323071, -246128, -24436, 95970, 216860, 48101, 321468, 7371, 167823, 231532, -27236, 165170, 55675, -52801, 223892, 362933, 208379, 330218, -2928, 310080, 145011, 317528, -17088, 144193, 60953, -111899, 337376, 85583, 9736, 4282, 125226, 38003, 13399, 198033, 240237, -71254, 344796, -83904, -47187, -196086, -3186, 95693, 11347, -54712, 41080, 251001, -170064, 204256, -54936, 230339, -175130]
12285H6414K37584I9721k4021c8096A72462l4005K80668a9615m636K779A27323
12273A57846G2030O3606C9671K18452j29032E8517K79630r7714B1992N1225K70677
12262C43894J61936A60864K7426a16098B01994n9829o1338a65740c7988B0487
12251A91462J96759A14844K02438e8418D18924j60470p2626L36939H7874d8583
12240C75820G7809K98102A06526B3600L2555M18626B10721e3010H1603M5991m5729
12229H1865L62041K8781H6562k1713K05510m5037e5149A08804e7600A32622J64413
12218B97035r5092L53398a84965A76169R0030A24037i4040D831a864D74552a08297
12206E7925O8883c8847j83474j32318B74915m7534o2576m9296L59927b64272C03674
$$ y = [86414, 323998, 99721, 75700, -38096, 172462, 138457, 419125, -19615, -24251, -21472, 127323, 157846, 72030, 135636, 39671, 258123, 129091, 58517, 338147, 240433, 21992, 73217, 343894, 505830, 160864, 188290, -116098, 201994, 142165, 80827, -165740, -37988, 20487, 191462, 388221, 114844, 317282, -58418, 418924, 258454, 185828, 522767, 87874, -48583, 375820, 77809, 375911, 106526, 23600, 56155, 474781, 210721, -53010, 81603, 127594, 81865, 443906, 472687, 86562, 64849, 270359, 225322, -55149, 108804, -57600, 132622, 297035, 201943, 555341, -184965, 176169, 266199, 124037, -94040, 4831, -1864, 474552, -108297, 57925, 126808, -38847, -222321, -354639, 274915, 227381, 164805, 115509, 475436, -264272, 303674]
12194D9786J61916J67050m1110m4081A173J52069a11249A34486l5930D3236J62884
12183B06120J0807g1457a4659E1530J98250k9332K59160A1662L24190b900C05356
12171C60613j56280N4175P3720c0287I0760J53361O5833J02531C5004K46991Q760
12160B90755R279j974R1527d0487B38581b8284F3538a42242B09559l9140D3126
12148g1087p5409E0065a2217B25775P4478r7545f2693P531H3050l0500P1207C3670
12135a65496D8631c19508c0824B65296A14732h1355B50745f9472A85270e080C33777
12123B84601R6839i8942B31327J18182A7037f0151D2219J28597k8748B0827R1319
12112A12146L21804j98404f4290F8418K89129b84822D3805i6787C17072B6098
$$ y = [49786, 211702, 378752, 337642, 293561, 1173, 153242, -111249, 134486, 98556, 43236, 206120, 216927, -71457, -14659, 51530, 249780, 220448, 479608, 11662, 335852, -2900, 305356, 360613, 204333, 258508, 332228, -30287, 90760, 244121, 309954, 412485, 35004, 281995, 290755, 300034, 298060, 389587, -40487, 238581, -28284, 63538, -142242, 209559, 170419, 43126, -71087, -146496, 50065, -12217, 225775, 300253, 202708, -62693, -55162, 83050, 52550, 123757, 33670, -165496, 48631, -319508, -30824, 265296, 114732, -81355, 250745, -69472, 185270, -5080, 333777, 284601, 381440, -98942, 231327, 349509, 17037, -60151, 42219, 170816, 142068, 20827, 112146, 433950, 235546, -64290, 68418, 357547, -284822, 43805, -96787, 317072, 26098]
12101E2211J26882Q785m3584a0719o4231O00H14J98261I7914f5269E6598O1388
12089A17986a17142L797K3887I5621K22417A21274f8946C45734g0808B52096o1320
12078A90776D4281a54520A09811B1568N3731M69160A77712L41078k13558J81628
12068D86860k39729m833J94377j45175J27375b81833C49598c0949B84330a08368
12057c5044J5831H6442l0590J75730A08345R5562O8728E7101J33945A4250J61890
12046A76140C7333M5780a80398C80571a19786B71836d0283m3508m1794A48572
12035A38496i4575j01937d1574A01468a089k08407j8971A59435n70p7302b25614
12023B33453n5837h548C24409b15045d0482j56543j25245C22273p2236A3134h1976
$$ y = [52211, 179093, 187878, 144294, -10719, -74950, -74350, 814, 199075, 97914, -65269, 56598, 117986, -117142, -113345, -89458, 95621, 318038, 121274, -68946, 345734, -70808, 252096, 190776, 44281, -154520, 109811, 21568, 75299, 544459, 177712, 518790, 305232, 486860, 247131, 242298, 436675, 291500, 418875, -281833, 349598, -30949, 284330, -108368, -35044, -19213, 86442, 55852, 231582, 108345, 203907, 272635, 57101, 191046, 14250, 176140, 37333, 83113, -180398, 380571, -119786, 271836, -40283, -83791, -125585, 148572, 138496, -94575, -196512, -41574, 101468, -1089, -209496, -228467, 159435, 158865, 81563, -225614, 233453, 177616, -8548, 324409, -215045, -40482, -197025, -322270, 322273, 250037, 13134, -81976]
12011e8847j91619A83714F535a99692C11783c7787C49729A26428b05518A58468
12000b11659F9933B3510J45640O2779j05299K20339a64987A10283C9882J16375
11990A56257E9515c2737C15284a59412k9921f4993A56152g3216B02579a64823
11979B78809c19480e07k4907H8001b14337M8215l38747a13738j2038A93155g3717
11967d6799j29243e8741r9768B99329D2072a4195B11026j00633K33913j53999
11957A90307q0981a18478j1243M660j5388f9020K8514A10073E3680K05194H3505
11945A10541E3690J51370C7562b6284E1889c86615H391L29928A36975M687j8357
11934A23305e3953R855B30962b8737j40788m1252g2405K0776B63827I3027g0153
$$ y = [-58847, -250466, 183714, 6535, -199692, 311783, -37787, 349729, 126428, -205518, 158468, -211659, 69933, 23510, 169150, 231929, 126630, 346969, -164987, 110283, 39882, 156257, 59515, -32737, 315284, -159412, -189333, -64993, 156152, -73216, 202579, -164823, 278809, -319480, -507, -25414, 88001, -214337, -166122, -504869, -113738, -125776, 193155, -73717, -46799, -176042, -58741, -158509, 299329, 42072, -14195, 211026, 110393, 344306, 190307, 109326, -118478, -129721, -125061, -140449, -69020, -40506, 110073, 53680, 258874, 83505, 110541, 53690, 205060, 37562, -26284, 51889, -386615, 8391, 338319, 136975, 141662, 123305, -53953, -44098, 230962, -28737, -169525, -210777, -72405, -51629, 263827, 93027, -70153]
11922a15081j39255J14206f3817e915k1225r4571B95849l8598c5639H9065B1724
11910A81777J13025E9903a02704A38378a10698B25172i5688D3177K04307c44382
11899d6231k10441A38381l1982a6870A5075J25593g6729c4407l47286a12359j61922
11888b74281Q9420g4137A52017a18678A10608K76393A03802d1091j96361M1867
11878a95585g4077m6619B02285d619j90842C41341B6327K84856A39687b83397
11867a51330g459q639F214b99074a6120k05996N5882L4161d7633k58341B22666
11855a55530n747A1790b14889C6899j4777J50479b71875h6678A18849J1030A2158
11843a53351F316c11207a40993G4962K8247K84216a18224b9221k24463H9026g760
$$ y = [-115081, -254336, -140130, -63817, -5915, -27140, -121711, 295849, 257251, -35639, 89065, 21724, 181777, 294802, 59903, -102704, 138378, -110698, 225172, -95688, 43177, 247484, -344382, -46231, -256672, 138381, 106399, -16870, 15075, 140668, -76729, -34407, -381693, -112359, -274281, -184861, -74137, 152017, -118678, 110608, 387001, 103802, -41091, -237452, -195585, -74077, -120696, 202285, -4619, -195461, 341341, 26327, 311183, 139687, -283397, -151330, -7459, -16098, 6214, -299074, -16120, -222116, -166234, -132073, -47633, -305974, 222666, -155530, -161277, 11790, -214889, 36899, 22122, 172601, -271875, -86678, 118849, 129879, 12158, -153351, 6316, -311207, -140993, 74962, 103209, 387425, -118224, -29221, -253684, 89026, -7760]
11831A52354A9066J2017L35317c6329j18474q5915g5839A75885b04093P8535k95130
11820d20688H1905c65413J18427B02166a42981l08392b17182H8285L7766e1077
11809a38242I8879k1674g4791K1761j56443f9440q5427d6558E6723d64812B7487
11797a01610j23142A27649L6145e1089M341r5915B0758i5251K3059B25595a01635
11785G0471c5750j31454C8613g7369H4483a26615I2914a23298k86695P8740C4238
11773e296q4250j37401b5308n8895C37177a29880H3956h1546j77911E9744J10576
11762A70320f5854D9762P3568A6497L8922a4332m5079l51953A82386a82402b4773
11750b4605k56282a31275A41936c03771a32077A96940E8351a12389J849g011G9208
$$ y = [152354, 19066, 31083, 366400, -36329, -154803, -240718, -75839, 175885, -204093, -125558, -420688, 81905, -365413, -246986, 202166, -142981, -451373, -217182, 88285, 126051, -51077, -138242, 98879, 77205, -74791, -53030, -209473, -69440, -154867, -46558, 56723, -464812, 27487, -101610, -224752, 127649, 163794, -51089, -46748, -142663, 20758, -95251, -72192, 225595, -101635, 70471, -35750, -167204, 38613, -77369, 84483, -126615, 92914, -123298, -409993, -331253, 34238, -5296, -89546, -226947, -25308, -84203, 337177, -129880, 83956, -81546, -259457, 59744, 170320, -65854, 49762, 123330, 16497, 55419, -14332, -59411, -411364, 182386, -182402, -24773, -24605, -280887, -131275, 141936, -303771, -132077, 196940, 58351, -112389, -110540, -7011, 79208]
11738a39700C3140M1957k6665P0664B6544A669f1300a5961A24590B466b28256
11726A32702a72077F1108M7751c843D8743a24570a4456j44722a1170j13012H6773
11714C43497f0229n0285J2108A18104I345a7164j39035A62911a33521A87931l0386
11703A57545A1981P432b96424B60942N0877a26744K8650A7866i3897B99884C1994
11691B09928c26687A48290k7202a02835A81198b62219E9287i5910o3431B74166
11680B51162I1259J31423a4590A25487E2971i0741B04498M0510j13397d2107d929
11668B40211G3332P1729L9579O5369B5383b35601i447j03648B54243A2857K79178
11657B92035A07140J47961A04157R0574N1888b36250B69490h5663F0568R6578
$$ y = [-139700, 33140, 75097, 48432, 119096, 26544, 1669, -61300, -15961, 124590, 2466, -228256, 132702, -172077, 61108, 108859, -3843, 48743, -124570, -14456, -159178, -11170, -124182, 86773, 343497, -60229, -110514, -98406, 118104, 9345, -17164, -156199, 162911, -133521, 187931, 157545, 11981, 19413, -296424, 260942, 311819, -126744, -98094, 17866, -93897, 299884, 31994, 209928, -326687, 148290, 121088, -102835, 181198, -262219, 59287, -95910, -159341, 274166, 251162, 91259, 222682, -14590, 125487, 52971, -90741, 204498, 245008, 131611, -42107, -4929, 240211, 73332, 145061, 184640, 250009, 25383, -235601, -9447, -113095, 254243, 12857, 292035, 107140, 255101, 104157, 194731, 246619, -236250, 269490, -85663, 60568, 157146]
11647A57146A5443a32401E1884c49851A68141q0094a2448n4106m43G7011l301
11636G3710c09800B34634o0731f5842k55670h3710n0928j76234D7479a48461C928
11624B0575P6353a05014B7768J55301D8813c3115I364J81433J29548H8846J52196
11613B41042f2996l297A31980i458E4967a10514n8583B80628A15203B6170a61152
11601g6338A52895f5818k70258P1217A72288E2891N9199A3452J732e3340j71400
11590b24740D30249a45309A6415M07621C6458M52924b24314A79526i9196m8639
11580a47835m3841B31125I9391J32314g8516P045o5184f4967c0098k39759I1760
11568B40774j00782L21812A97341d6649j36955N7462H1816l7122L02987A16323
$$ y = [157146, 15443, -132401, 51884, -349851, 168141, 88047, -12448, -66554, -66997, 77011, 73710, -309800, 234634, 173903, -65842, -321512, -83710, -134638, -310872, 47479, -148461, 3928, 20575, 96928, -105014, 27768, 183069, 48813, -33115, 9364, 190797, 320345, 88846, 241042, -62996, -66293, 131980, -9458, 54967, -110514, -169097, 280628, 115203, 26170, -161152, -76338, 152895, -65818, -336076, -264859, 172288, 52891, 112090, 13452, 15184, -53340, -224740, 430249, -145309, 16415, 424036, 36458, 489382, -224314, 179526, -99196, -147835, -191676, 231125, 99391, 231705, -78516, -71471, -136655, -64967, -30098, -269857, 91760, 240774, 139992, 461804, 197341, -46649, -183604, -126142, 81816, 44694, 347681, 116323]
11557a24685A37067D727a196n7596A79471l6019n9380a5219k63615A99580b940
11545H2878C8912a31004A03112J5040m6187a248n2960D0160m562N6472f9058A4881
11532a63569f4749G7363j2276K55074A24909o032m0514J27060q5078d904G5252
11520a33585f1255B77355A01695l2216f5115I3332k0907O8709f0667j11937J1911
11509a60693o542n3496A66006F7692K46152K1681j48770o6634M0543J32712j43444
11498A49932m6345h9008k87226C31907b79135O8461A37166k8883k1372J41511
11488B28422o1906k5325Q4771a51248C784P8493j0360C4443K10572l8831b7574
11476A1956L31777j25425I4653b61074A74045q6939b93894P8393A04394a00159
$$ y = [-124685, 137067, 4727, -1196, -58792, 179471, 143452, 84072, -15219, -278834, 199580, -2940, 82878, 38912, -131004, 103112, 118152, 71965, -1248, -54208, 40160, 35598, 92070, -69058, 14881, -163569, -64749, 77363, 65087, 320161, 124909, 118877, 78363, 205423, 120345, -4904, 75252, -133585, -61255, 277355, 101695, 69479, -65115, 93332, 72425, 141134, -60667, -172604, -160693, -167235, -220731, 166006, 67692, 313844, 335525, 186755, 120121, 160664, 293376, 149932, 103587, -89008, -376234, 331907, -279135, -210674, 137166, 108283, 86911, 228422, 166516, 141191, 225962, -151248, 3784, 82277, 71917, 34443, 245015, 206184, -27574, 11956, 343733, 218308, 94653, -261074, 174045, 87106, -293894, -215501, 104394, -100159]
11465A68023J07950J39788A04004J63850j02598A5737M00142A16329P028D5448
11454b83112G8719Q0134J12430j23194i2196B36650A02313J34167a35523n046
11444a40569D0714J8280k8437K18767J318Q6316n851E7012A9269b18831A92097
11432C0465N9929M3605K45355A52665Q0084c1034A7638f8791k9855d1561A10925
11420A35838R3555b40543A61265i2575b6167j4554j59063E8294J58034a91869
11409a35820p8578A60980h8134j13203b6271F1902I346K46827A2693e7082B45894
11397F4556a8499m1426q255n9830n5259C1979O4469a21412C4526d1310j15557
11386a56867C0844f9895D9697L3306b47824A09618d16638A04769a12390I3397
$$ y = [168023, 275973, 415761, 104004, 267854, 165256, 15737, 415879, 116329, 123357, 45448, -283112, 78719, 158853, 271283, 148089, -92196, 236650, 102313, 236480, -135523, -140569, 40714, 58994, 30557, 249324, 250642, 336958, 331107, 57012, 19269, -218831, 192097, 30465, 90394, 133999, 379354, 152665, 232749, -31034, 17638, -68791, -98646, -41561, 110925, 135838, 229393, -240543, 161265, -92575, -26167, -40721, -199784, 58294, 216328, -191869, -135820, -214398, 160980, -88134, -201337, -26271, 61902, 9346, 256173, 12693, -57082, 245894, 64556, -18499, -59925, -68180, -128010, -183269, 31979, 96448, -121412, 34526, -41310, -156867, 30844, -69895, 49697, 83003, -247824, 109618, -416638, 104769, -112390, 93397]
11375A40448d3664D8685a87470A22869a31736p1977f8194A88203a15444d9486
11364A25198N14m981J33091a18285j69471A37611M4660b4304A04001B3611f3270
11352b99394P8004F5926C2214b02069F1842C896M8315j9664a43072J8813A77649
11340e5457j85826D5822J13876P1409A02073B1517O8859a18009M8230j73045g8118
11328d2221j35133A62393D1238g2745j13863l04068a05255A03201n0890f9832
11317a16260c1744a0880A26341O4399a53660d0668l13974A68844D4582b02157
11306a28390A54183g6334p3110e1633E166M79064C8015j1421a83229A55318a82350
11294c31953b6594A60548I487a55484O6883q1048b2299C1509b81704B1602h089
$$ y = [140448, -43664, 48685, -187470, 122869, -131736, -203713, -68194, 188203, -115444, -49486, 125198, 125712, 120731, 253822, -118285, -287756, 137611, 182271, -24304, 104001, 23611, -63270, -299394, -221390, 65926, 32214, -202069, 61842, 3896, 52211, 32547, -143072, -124259, 177649, -55457, -241283, 45822, 159698, 231107, 102073, 21517, 90376, -118009, -69779, -242824, -78118, -42221, -177354, 162393, 41238, -72745, -186608, -490676, -105255, 103201, 52311, -69832, -116260, -31744, -10880, 126341, 190740, -153660, -40668, -354642, 168844, 44582, -202157, -128390, 154183, -76334, -149444, -51633, 5166, 484230, 38015, 26594, -183229, 155318, -182350, -331953, -26594, 160548, 9487, -155484, -88601, -169649, -22299, 31509, -281704, 21602, -8089]
11282a14252B6015d19311f7547B6963a2475B60738a12520b2050G399b6991q1051
11271a08042j59584B8523R2697H255J15331d31128A18221A543c22819n6485a05551
11259G2895A2724O134c37871a45298D6532h4101j12316K1647K000O4769A42019
11247I8453M5795b08525K8079d0335C3829h8821l1814A60408J76271H8022a19669
11235b45006J01192F6798e351A94326b7394E127d6451A62006e0707D01872h408
11223B00427C4167a28950e7939A13632h2290j27749R5850p1526E1905J06735K0208
11212A78848C4621j89b13321A37611e0990m0323n5657O1707n491j04348F6474
11200c9780j55710k15982I2963J19605a20794b0327A02433K7325O4860a9512j54603
$$ y = [-114252, 26015, -419311, -67547, 26963, -12475, 260738, -112520, -22050, 7399, -26991, -108042, -267626, 28523, 121220, 8255, 123586, -431128, 118221, 1543, -322819, -379304, -105551, 72895, 12724, 18858, -337871, -145298, 46532, -84101, -196417, -174770, -172770, -108001, 142019, 98453, 144248, -208525, -180446, -40335, 33829, -88821, -120635, 160408, 336679, 88022, -119669, -245006, -143814, 66798, -5351, 194326, -27394, 5127, -46451, 162006, -50707, 401872, -8408, 200427, 34167, -128950, -57939, 113632, -82290, -210039, -114189, -185715, 51905, 158640, 178848, 34621, 34432, -213321, 137611, -50990, -91313, -146970, -85263, -90754, -195102, 66474, -39780, -195490, -411472, 92963, 212568, -120794, -20327, 102433, 129758, 194618, -19512, -174115]
11189a74115k9047n2231B03828c00674C6625L1304b4218k31200P0931e2803A22277
11177g7998E7204b15670f7793F8721L674B2547J18121a81587A96726a47588C7846
11165A49044J03875F5020P7620Q670a45714j61482A2557d326j18815A3258J776
11154A5034J14382b94396d4618A44313J7552C5295b9011C73355h3829L1490k09647
11143b61986a03596B04770a62577B5329d2783K0867k31282A96338d9233j14889
11133a64122A71593P1976d6116B33980c8700j7238I0232g7336k9467A14009O2169
11122A76178H5706L14556D5837P3461A1656K57619F4245b15153e2798n0732D6286
11110a01520D3235a37577A98112J30541j03319r9463a20037o366H7103b35632
$$ y = [-174115, -203162, -255393, 203828, -300674, 36625, 67929, -24218, -255418, -184487, -52803, 122277, -77998, 57204, -215670, -67793, 68721, 72395, 22547, 140668, -181587, 196726, -147588, 37846, 149044, 252919, 65020, 142640, 151310, -145714, -307196, 12557, -4326, -123141, 13258, 15034, 129416, -294396, -44618, 144313, 161865, 35295, -29011, 373355, -83829, -52339, -261986, -103596, 204770, -162577, 25329, -42783, -21916, -253198, 196338, -49233, -164122, 171593, 243569, -46116, 233980, -38700, -55938, 90232, -77336, -106803, 114009, 176178, 85706, 400262, 45837, 119298, 11656, 269275, 64245, -215153, -52798, -103530, 46286, -101520, 43235, -137577, 198112, 328653, 225334, 125871, -120037, -126403, 87103, -235632]
11099A13373c6425A89421P9983J8226A0505J76876E7500Q0811k4778K31983A47695
11087D20053A1145K44467N4673J19478A43016h4854A35835N0069M679b26707A78806
11075H2788J8488L59378A96605N2478k3122R6106A14435Q9514m9052M0893O4517
11064B60307K8358p3015J30134o9859J36260L8114K31109l34649q958K19471K5414
11053E82686j62165J56756A95654N75884k00326j4853K34094C02374N28077p6011
11043G54440J67562K26042l88156N774L16831l84212k31260J81005l0647K68742
11033H86121j64299K12053r3447l44645J34616j20758L42382j47408k35479K12488
11023F81624R1971j7393J43134O0497L2636m18978P3338O0020j5504B37976K14430
$$ y = [113373, -36425, 189421, 269404, 287630, 10505, 187381, 57500, 138311, 113533, 345516, 147695, 420053, 11145, 255612, 310285, 429763, 143016, -84854, 135835, 185904, 190583, -226707, 178806, 82788, 101276, 460654, 196605, 249083, 225961, 322067, 114435, 203949, 154897, 195790, 260307, 288665, 215650, 345784, 275925, 412185, 450299, 681408, 346759, 337801, 557272, 582686, 420521, 577277, 195654, 771538, 571212, 556359, 790453, 302374, 830451, 754440, 922002, 1148044, 759888, 765662, 1082493, 698281, 467021, 648026, 617379, 886121, 721822, 933875, 840428, 495783, 630399, 509641, 852023, 704615, 469136, 681624, 773595, 756202, 899336, 959833, 992469, 573491, 646829, 706849, 691345, 237976, 452406]
11012D52406M0451J27854j01440l6528K33475n6070A58610M30604J43022J98865
11002I31101k23447j47242K31806j75720P706N8094k15426M34531j53492k55294
10992D92617K32697k64850j6881L39900C87376K33631K11070l5776J18057O3350
10982I77708k96911r7134N7876k05547N16723j1988K68583j35858J80868K60375
10972A514695j60071k28566R48132l20510Q69187k11048j75144M06022J9205K19556
10962B881458m70946j11651j63858j45268r8746p325k67198p0449L81561l10259
10952A617319r648k4515j43166K07098j87118j53859p7819l62325K18154A70904
10941G25472k384B52373R3368n7523p6503J89062k9983a41925C53684A29421J8237
$$ y = [452406, 492857, 620711, 519271, 482743, 716218, 660148, 158610, 589214, 732236, 931101, 707654, 560412, 792218, 616498, 624204, 682298, 466872, 901403, 747911, 492617, 725314, 460464, 443583, 783483, 387376, 621007, 832077, 796301, 914358, 977708, 680797, 583663, 641539, 435992, 952715, 940727, 1209310, 1073452, 1254320, 1514695, 1354624, 1126058, 2074190, 1753680, 2622867, 2411819, 2236675, 2642697, 2661902, 2881458, 2410512, 2298861, 2135003, 1989735, 1890989, 1883664, 1616466, 1546017, 1927578, 1617319, 1607671, 1583156, 1439990, 1647088, 1459970, 1306111, 1228292, 865967, 1084121, 170904, 725472, 723088, 252373, 345741, 288218, 211715, 400777, 370794, -141925, 353684, 129421, 147658]
10930A47658H581a68225M9517M0554F8064j0540c1507r9368c7664C54826a68811
10918B88008b27874c9918K827A8697d5336J8191q6790A72281q1373i0595b4696
10906B8563b14446A66052k9949c5024n8175I8951J23555G8561b1895m3809D9910
10894C08318b80660A36571a19966B8321O59a76613D6887b17113J08252q7821D2912
10882e1378E0595d6925j92880J5472L2547B92423C4242b02648I468f8698k32829
10871c01527R6732A50320d6760m4099I7525a82536A44708F0546J76752D7970a88259
10859a22634L3317m8295b6297A11142c1271r6585p3304F999a3442B91226a9252
10847B71607i5447b0172A40416b16452f034G0012b16153A94656o4063J6569c46270
$$ y = [147658, 8581, -168225, -118708, -78154, 68064, 57524, -31507, -130875, -37664, 354826, -168811, 288008, -227874, -39918, -37091, 18697, -45336, -27145, -113935, 172281, 90908, -90595, -24696, 28563, -214446, 166052, 136103, -35024, -93199, 98951, 222506, 78561, -21895, -65704, 49910, 308318, -280660, 136571, -119966, 28321, 28980, -176613, 46887, -217113, -108861, -196682, 42912, -51378, 50595, -46925, -239805, -224333, -191786, 292423, 34242, -202648, 9468, -68698, -301527, -204795, 150320, -46760, -90859, 97525, -182536, 144708, 60546, 237298, 47970, -188259, -122634, -89317, -137612, -26297, 111142, -31271, -127856, -201160, 6999, -13442, 291226, -19252, 271607, -95447, -20172, 140416, -216452, -6034, 70012, -216153, 194656, 130593, 147162, -346270]
10835g4675j11272A41006E4305R9272a12560E3721O4077a01669A44318A7708a56416
10823B03556I751c9291j51398M1474L4870A53228J5405g6021C30233L1557A67202
10811a47443P3504E8966e4266r9384B9607Q4117a40116D2568K23919c84297A16151
10799A10554J31710C7843J75518F5961b44346J13670D48711c45958J26457K7658
10789a91843Q5266p8232f3718j48681m2330d8025C8806f0638j35618j0560A28086
10777a43374A41059i7458l8368j06260A11460c5185j09644A41726B6216b70478
10766b09976O6698B0257J3065b11095C0195P4718j1421k1292h4697j65340E9645
10754F9884a91448Q8859J8624a9962A47937A7367L422K18572d074m0651J5043
$$ y = [-74675, -185947, 141006, 54305, 153577, -112560, 53721, 117798, -101669, 144318, 17708, -156416, 203556, 9751, -39291, -190689, -149215, -114345, 153228, 168633, -76021, 330233, 361790, 167202, -147443, -73939, 58966, -54266, -153650, 29607, 113724, -140116, 42568, 266487, -384297, 116151, 110554, 242264, 37843, 213361, 65961, -244346, -130676, 448711, -345958, -219501, -191843, -106577, -184809, -63718, -212399, -254729, -48025, 38806, -60638, -196256, -206816, 128086, -143374, 141059, -97458, -135826, -242086, 111460, -35185, -144829, 141726, 26216, -270478, -209976, -143278, 20257, 33322, -211095, 30195, 104913, 93492, 72200, -84697, -250037, 59645, 69884, -191448, -102589, -83965, -19962, 147937, 17367, 20789, 239361, -4074, -44725, -29682]
10743b9682k08105Q1391B03049b07680A03997a16595D3054J33096n6918b23737
10732D64534k29509c1638j86432h071j01252Q410n2006j51837A3448a09695k0038
10721a29733k23389c9291l8985k27666A08302a48296A35243n1005c6485j49291
10711a85776A01580b7860j20580j51062n6813I0141a56783A9457d01415d5497
10700b71352J22125g3147l03022A17753J31424G7353h8879j97594C34641h9074
10689g3278j31010B09337C8487f5161j9455B21749d26981B16254g0747j57816
10679b28563B71389D0419i5565E2754a19337m35977A10049C5465g3256B5871b83637
10667A16167a05495A04847E2399a26789E973K78154b2391I6358Q9786n7598a44195
$$ y = [-29682, -237787, -156396, 203049, -207680, 103997, -116595, 43054, 176150, 119232, -223737, 464534, 235025, -31638, -218070, -8071, -109323, -100913, -152919, -304756, 13448, -109695, -129733, -353122, -39291, -78276, -305942, 108302, -148296, 135243, 84238, -36485, -185776, 101580, -27860, -148440, -299502, -356315, 90141, -156783, 19457, -401415, -45497, -271352, -149227, -73147, -376169, 117753, 249177, 77353, -88879, -286473, 334641, -89074, -73278, -204288, 209337, 38487, -65161, -84616, 221749, -426981, 216254, -70747, -228563, 271389, 40419, -95565, 52754, -119337, -555314, 110049, 35465, -73256, 25871, -283637, 116167, -105495, 104847, 52399, -126789, 5973, 284127, -22391, 96358, 186144, 128546, -144195]
10655b46572C07862b34340A80191J65550g8743C1932M911a23957j23858J06660
10645a41155m7295I2540b18603G1957C2650a13417E3888c22912e8929C1908Q0462
10634A12370l8497P2489o7348K8177J23399c53775H1351B8173M6878a56391l5127
10623a91518p4278I4585B3992h4311B98247a59568A4096a48903A73111a88553
10612a00720b6328B54951A10638a98697O5979j82296a50388F3923a48928o7032
10602b15960c2574A63732c84562B22938D0681K5231h303B09478a41022E9688O509
10591F6197b33092j65965N5157a07597C7360Q9358c26540B7529b43003J16367
10581a26636d5041o2173o7288d0359C38055G6133c0368B29595G0304b00993D8580
$$ y = [-246572, 307862, -234340, 180191, 345741, -78743, 31932, 36843, -123957, -247815, -141155, -188450, 92540, -218603, 71957, 32650, -113417, 53888, -322912, -58929, 31908, 112370, 73873, 146362, 79014, 107191, 230590, -353775, 81351, 28173, 75051, -156391, -191518, -265796, 94585, 23992, -84311, 298247, -159568, 14096, -148903, 173111, -188553, -100720, -26328, 254951, 110638, -198697, -132718, -315014, -150388, 63923, -148928, -215960, -32574, 163732, -384562, 222938, 40681, 65912, -8303, 209478, -141022, 59688, 66197, -233092, -399057, -343900, -107597, 37360, 126718, -326540, 27529, -243003, -126636, -45041, -107214, -174502, -40359, 338055, 76133, -30368, 229595, 70304, -200993, 48580]
10569b41272E7061A1859a79974j49680R2629e2667C02393a30541j56220E1086
10558i368l4285E4535b57602d7708p5593j90607F0442g3142A2202J6874Q5158
10547A14234d7012r724A0525K59111a07516B9750K5951o833a88841c7615j07303
10536a44918o8222R5513J8474A91738b26833C26443b00168k64167H5477d065F4144
10524h2557H9103k6046a80923B55645j4665p5348D884c42709B07093O8105I0134
10512a56969r7624A08587P9702a043j38143l1675H54a14852J4205I7230N9529
10501A56759b13569A41584g4278b6030B96887b39506G0638B4370J40038C5618
10490B81569l2128h1840A61003c8159k12443D5289d9826B56074c376A84366A4227
$$ y = [-241272, 57061, 11859, -179974, -329654, -237025, -52667, 302393, -130541, -286761, 51086, -9368, -43653, 54535, -257602, -47708, -123301, -313908, 60442, -73142, 12202, 29076, 114234, -47012, -56736, 10525, 269636, -107516, 29750, 55701, 48868, -188841, -37615, -144918, -213140, -117627, -99153, 191738, -226833, 326443, -200168, -464335, 85477, -4065, 64144, -82557, 89103, 63057, -180923, 255645, 240980, 165632, 4884, -342709, 207093, 275198, 90134, -156969, -254593, 108587, 188289, -1043, -139186, -170861, 854, -114852, -100647, 97230, 156759, -213569, 141584, -74278, -26030, 296887, -239506, 70638, 24370, 164408, 35618, 281569, 249441, -81840, 161003, -38159, -250602, 45289, -49826, 256074, -3376, 184366, 14227]
10478c3185A72616E6821a08571A30633K35121L4071n7973G3061R0148Q9827B4881
10466A9177K09834k1919f4824B3904J64630a63114e0107l1958K0505B29374b16639
10454d69875M0320a4521j69494f5500j2426k07536a16222k2187b8203m2176B36245
10442A24992C715b61024B5361a32446c4612B7875d9443m4332G851a50592B13537
10430a56294C6558i128H6479b60076c3761E4010b68267Q1919h7858j55252P072
10419b36038L6507N3361A90143b61266j55623b4921j12702A01911j4133b23120
10408b86638b7784B06201a39221a4346A823J31193Q7626n0630p2485a94978B27297
10396e3695k4586k7870C1840J36616h8379L1210a1933B13818k1520J63626A23563
$$ y = [-33185, 172616, 56821, -108571, 130633, 365754, 399825, 341852, 73061, 163209, 253036, 24881, 19177, 229011, 207092, -64824, 23904, 188534, -163114, -50107, -82065, -61560, 229374, -216639, -469875, -429555, -14521, -184015, -65500, -77926, -285462, -116222, -138409, -28203, -70379, 236245, 124992, 3715, -261024, 25361, -132446, -34612, 27875, -49443, -93775, 7851, -150592, 213537, -156294, 36558, -9128, 86479, -260076, -33761, 54010, -268267, -186348, -87858, -243110, -236038, -199531, -146170, 190143, -261266, -416889, -24921, -137623, 101911, 87778, -223120, -286638, -27784, 206201, -139221, -14346, 1823, 133016, 220642, 170012, 97527, -194978, 227297, -53695, -78281, -106151, 31840, 168456, -88379, -57169, -11933, 213818, 192298, 355924, 123563]
10384f8284D10686c0039l9515A75902F7633b16373D34816A41317F4122h7857L951
10373h3906D4941J86280C7141K80060G6165a15326A21197O4039K92359B664L22464
10362C25128q0629A20059K94806L72122k67642k2285A51356r664J20091j15023
10352A46760F2247M4947J95605j34534J91517M8277J30010q3246p2266k9634j49917
10341B03006L5910L00534I410L10828j37594J35212j45854G7754P3440Q204P3499
10330B32897K1438a15653r1739D41557b80586A01302K48246A04416C6915R9020
10320A35935J42607q1713M7695m4752M5343E9183h4630q0885C64885m2131a44943
10308a4384A08060b93045D4386K23152e3216I6759M5602a72201c9353l5732k619
$$ y = [-68284, 410686, -30039, -69554, 175902, 67633, -216373, 434816, 141317, 64122, -87857, -83906, 44941, 231221, 37141, 317201, 76165, -115326, 121197, 185236, 477595, 2664, 325128, 244499, 120059, 414865, 786987, 519345, 497060, 151356, 141692, 261783, 146760, 62247, 107194, 302799, 168265, 359782, 408059, 538069, 454823, 382557, 352923, 203006, 238916, 539450, 9410, 320238, 182644, 317856, 172002, 77754, 151194, 159398, 232897, 254335, -115653, -207392, 441557, -280586, 101302, 349548, 104416, 36915, 135935, 278542, 196829, 244524, 199772, 245115, 59183, -84630, -165515, 364885, 322754, -144943, -14384, 108060, -293045, 44386, 267538, -53216, 96759, 142361, -172201, -39353, -75085, -77704]
10297g7704A4414M0878b19302P9734H637N3363k718a09640j98776F6988h5991
10285b08897D94989A00315b10981b4070G0950a31341n6640e5811G2428L7284b4856
10273b27554B67837b37094B35280p764h1130o5118d3598o5737A33012l8410K5352
10262A19954c2702H9093Q4323d0124F6184a64911B69921E8139P957J82707f2894
10250C5403Q47740A89123K488P8309J0443L2692a4105A67695A9310A874J7223
10239A9097J74858b51402A91604c0902I7053B7670d82751a72968A13727A8631
10228h7505D2858a16709A59189d7416k1537A45471C2499N4289K3862b30412M7667
10217a82745R936P8380j7233F6005l0575a35661k9144j21987f9823C84124A33482
$$ y = [-77704, 14414, 55292, -219302, -139568, 8637, 62000, 59282, -109640, -308416, 66988, -85991, -208897, 494989, 100315, -210981, -24070, 70950, -131341, -187981, -55811, 72428, 109712, -24856, -227554, 267837, -237094, 235280, 227516, -81130, -146248, -43598, -109335, 133012, 94602, 119954, -32702, 89093, 173416, -40124, 66184, -164911, 269921, 58139, 66096, 248803, -62894, 35403, 883143, 189123, 191611, 269920, 280363, 313055, -14105, 167695, 19310, 1874, 19097, 193955, -251402, 191604, -30902, 97053, 27670, -482751, -172968, 113727, 18631, -87505, 42858, -116709, 159189, -47416, -68953, 145471, 32499, 86788, 110650, -230412, -182745, -172809, -94429, -111662, 66005, 35430, -135661, -164805, -286792, -69823, 384124, 133482]
10205g0762B67114A04259b56468p1384j34778A06883a09556A30131c50155J53833
10195a96322c018l9259j54974j67161e9260f142A04547H799f6933H4255d47752
10183h4630A44370m5236c3632J48j54302R966R214O3440j29935O2227o9989C1439
10170a21520B4309J09056O0657J51062a16151B62682a29805A14914c28810a53288
10159a60563B68553G8125L5932h7608A25212P8141g3388j1443K8744j15835l0226
10148b02148P2513L1077B07046a73197N7556B13983g665j8769l71075h3175k68664
10137c51839e9744C8249C471i295A6557c54141A45253i075l4122l8011A32820
10125a73914k91017b06352P9747A78316a17750o4410A36259b10031b3913k07471
$$ y = [-70762, 267114, 104259, -256468, -327852, -462630, 106883, -109556, 130131, -350155, -196322, -3018, -42277, -197251, -364412, -59260, -6142, 104547, 8799, -66933, 84255, -447752, -84630, 144370, 99134, -33632, -33484, -187786, -177820, -168606, -105166, -235101, -172874, -242863, 31439, -121520, 24309, 133365, 194022, 345084, -116151, 262682, -129805, 114914, -328810, -153288, -160563, 268553, 78125, 114057, -87608, 125212, 203353, -73388, -84831, -56087, -171922, -202148, -129635, -98558, 207046, -173197, -115641, 213983, -7665, -26434, -397509, -83175, -351839, -59744, 38249, 3471, -9295, 16557, -354141, 145253, -9075, -43197, -81208, 132820, -173914, -464931, -206352, -126605, 178316, -117750, -182160, 136259, -210031, -23913, -231384]
10115b31384J10174J6883b381j84476B8746D344b52352E663L1861a21856B25184
10103H629f7247A30361E2019a69600A30491e4883K456k06730d9855j60107A00451
10091A11199K8050A5064a96353f1270J8913G1572e4503B45321o5258d8596D52
10079b4569k80497e5207n19223c6505A20361g540j33200B5685a13384B16937b43461
10067a38059a4859l0443B7085J79190k1605C4930a55563m3823P8416o9617O6007
10056a24580A98559B1630a74413N4026D42353a87988R576c2561o7802B68184h1314
10044D3212a83054a4476j6973j52622B82652a73284c1913l63732F6557b02670
10033C8818c06341D9193a62172N8765j00979c2163q8175J8255B2371a38418n3054
$$ y = [-231384, -121210, -104327, -2381, -186857, 28746, 4344, -252352, 5663, 37524, -121856, 225184, 8629, -67247, 130361, 52019, -169600, 130491, -54883, -52427, -259157, -49855, -209962, 100451, 111199, 139249, 15064, -196353, -61270, -42357, 71572, -54503, 245321, 180063, -48596, 452, -24569, -305066, -55207, -574430, -36505, 120361, -7540, -140740, 25685, -113384, 216937, -243461, -138059, -14859, -45302, 27085, 206275, 184670, 34930, -155563, -199386, -120970, -190587, -124580, 198559, 21630, -174413, -120387, 442353, -187988, -178412, -32561, -100363, 268184, -81314, 43212, -183054, -14476, -31449, -184071, 282652, -173284, -31913, -395645, 66557, -202670, 38818, -306341, 49193, -162172, -103407, -204386, -32163, -120338, -102083, 22371, -138418, -191472]
10022a91472K0070H76K22394b74197Q7363B06423d08143A0979a94152K6769A33143
10010B21601n8918C3530a21873a6918j74779l6465D4411c79710a29167j16623
10000b45790M122B17222P4968f4162k73269B83261a63221c604A17476b92329l41635
9989f33964F1039i9066r8204G5347J53410c19031A51477a67818k4080k99961a31868
9977a68256p4606D6062A8802b2703D00052c93160G7127a08273k09060a15380B8488
9965F6245d5391B8897b91432f4706B86396g2028k83217B83135c61357i3761B18326
9953d08736A92288A4279c85342g2046j36380C9163c70189B4730A1762c51958J73082
9942a78876j14906K3096g713C1695L0803e53647J73204a41365d1167a5089q9940
$$ y = [-191472, -171402, 876, 223270, -274197, -186834, 206423, -408143, 10979, -194152, -167383, 133143, 221601, 162683, 33530, -121873, -16918, -191697, -228162, 44411, -379710, -129167, -245790, -241668, 217222, 292190, -64162, -337431, 283261, -163221, -3604, 117476, -292329, -633964, 61039, -99066, -197270, 75347, 228757, -319031, 151477, -167818, -191898, -491859, -131868, -168256, -242862, 46062, 18802, -22703, 400052, -393160, 77127, -108273, -317333, -115380, 28488, 66245, -45391, 28897, -291432, -64706, 286396, -72028, -355245, 283135, -361357, -93761, 218326, -408736, 192288, 14279, -385342, -72046, -208426, 39163, -370189, 24730, 11762, -351958, -178876, -293782, -270686, -7713, 31695, 62498, -553647, -380443, -141365, -41167, -15089, -105029]
9931a05029L7615n8600a3790m9907F712a64970j19106A3979b38107k47618H9881
9919F858e8718A2982f2184F6740a47251A05057J07205b34716A99228b36244J16061
9908a20183A22306J11454k3726b02171A11921J8792a41077A8613d10384E3254
9897c8535m4537k80088a58608o0119e9573F9225a99465c1957A31494M0833b34784
9885B8000J33753a1944o0855A69693d9988A47738b00112H585a75522j55655a56122
9873d0565j0565j3408c326B19598b0619m75163d8809O822j04807M9545j15529
9862b12778P04B30431a03777M9075A35873K536d4685G1325i7680j19423k74095
9851d91198a23584m22107J78347H2927a58350j41555A51678J8700f2982k50036
$$ y = [-105029, -67414, -126014, -13790, -63697, 6712, -164970, -284076, 13979, -238107, -485725, 89881, 6858, -58718, 12982, -62184, 66740, -147251, 105057, 212262, -234716, 199228, -236244, -120183, 122306, 233760, 210034, -202171, 111921, 130713, -141077, 18613, -410384, 53254, -38535, -83072, -363160, -158608, -218727, -59573, 69225, -199465, -31957, 131494, 172327, -234784, 28000, 161753, -11944, -72799, 169693, -49988, 147738, -200112, 8585, -175522, -331177, -156122, -40565, -51130, -64538, -3326, 219598, -20619, -495782, -48809, -41987, -146794, -97249, -212778, -212074, 230431, -103777, -54702, 135873, 138409, -44685, 71325, -97680, -217103, -491198, -123584, -545691, -367344, 82927, -158350, -299905, 151678, 170378, -62982, -313018]
9841c13018A1777f6646k81770P1659a08705B43996b9514k37821c9486j64554O7122
9830a36918k97096A05889A3333a46428k99690a38692j93820J60674A33573f0414
9819E1549P2122b94765B18217i3961A30465c69296a0010k33791R8567j11588c445
9807a98787N3426G1158J33960b53662i6698D4105b51258a12906K9388B1974N1493
9796G3467d2391l4930F864b44394P7705A13535c84961D5639d4809i06k7602n0302
9784g8810A38062G279f7765B4249a49699l6583j06761E8855a23825B19763a32076
9772A82091A700J673P9532a49370A14201h3285r223j95637A26177a21595m3996
9761a65591F5638d08339D6900J73021e7961q2310m6066h1636I327L4890b63203
$$ y = [-313018, 11777, -66646, -348416, -276757, -108705, 243996, -29514, -267335, -39486, -204040, -136918, -434014, 105889, 13333, -146428, -446118, -138692, -332512, -171838, 133573, -60414, 51549, 123671, -294765, 218217, -93961, 130465, -369296, -10010, -243801, -145234, -256822, -3445, -198787, -145361, 71158, 205118, -253662, -96698, 44105, -251258, -112906, -83518, 21974, 73467, -42391, -77321, 6864, -244394, -166689, 113535, -384961, 45639, -44809, -906, -28508, -78810, 138062, 7279, -67765, 24249, -149699, -186282, -293043, 58855, -123825, 219763, -132076, 182091, 1700, 3373, 82905, -149370, 114201, -83285, -92508, -288145, 126177, -121595, -165591, 65638, -408339, 46900, 219921, -57961, -140271, -186337, -81636, 9327, 44217, -263203]
9749i8444A56996I201K11581d4414j73633g9976a0263q8559B7182N7691f6048
9737g3171k68262B63391i2242j72083A12334D6923R5988a46212a9379p595B3199
9725a46590L9932c7612A32916d1471j43761j49249a08460j53469m324D5709a22329
9713e8981H3447c65422a19801r0917b9024B81795b22061K2662g3423k09693A00343
9701D3523b03593j72154a7518b43C3503b8632j46956j01683R1320H8492b46216
9689a40235G429a65918p956N4107C8482d8731A64121F7874b08600I8029a21166
9677d59141G1797a19906l3003A30718E1995b36128j83065D0959b79065a3027i2
9665F2221a40565B68174a44305B07612h4945B7060a69356P1766k42726g7621b0002
$$ y = [-98444, 156996, 9201, 220782, -44414, -218047, -79976, -10263, -98822, 27182, 84873, -66048, -73171, -341433, 263391, -92242, -264325, 112334, 46923, 142911, -146212, -19379, -26974, 23199, -146590, -106658, -37612, 132916, -41471, -185232, -334481, -108460, -261929, -266253, 45709, -122329, -58981, 83447, -365422, -119801, -210718, -29024, 281795, -222061, -199399, -73423, -283116, 100343, 43523, -203593, -375747, -17518, -243, 33503, -28632, -175588, -277271, -185951, 88492, -246216, -140235, 7429, -165918, -173874, -119767, 38482, -48731, 164121, 67874, -208600, 98029, -121166, -459141, 71797, -119906, -152909, 130718, 51995, -236128, -419193, 40959, -279065, -13027, -92, 62221, -140565, 268174, -144305, 207612, -84945, 27060, -169356, -97590, -340316, -77621, -20002]
9653i4517C12706c71567P8922i5655j19765P9461j52933R4380j6387a8083l40760
9642c58843a34627I4749K14894a20915A2044a50851j23052G333g8618D2667b15146
9630g6728A06811b69083i135j71555A53484E6546a84911I6247C6651R153i500
9618b0509E2846b7911G9914k4228A1720P4879a4701k92368e6222b6141A7784b0199
9605a18660B70510e648q8400k80936A29109f31686E55873b62114p6890J24214
9595b14790J00973B21682o458a8772k14001F6475b74015B23600I6118L261b45920
9583b22907J05269M7232A74817d34150K00121j95282i3051b1128k3485C4008d290
9571A6526a70235C07355e1386j11284L9702f557p1539F6316f5828F9563f0387
$$ y = [-94517, 312706, -371567, -292645, -95655, -215420, -135959, -288892, -194512, -210899, -18083, -358843, -134627, 94749, 309643, -120915, 12044, -150851, -273903, 7333, -78618, 42667, -215146, -76728, 106811, -269083, -9135, -180690, 153484, 56546, -184911, 96247, 36651, 45804, -9500, -20509, 52846, -27911, 79914, 55686, 11720, 86599, -14701, -307069, -56222, -26141, 17784, -20199, -118660, 270510, -5648, -94048, -374984, 129109, -631686, 555873, -262114, -339004, -214790, -113817, 221682, 215224, -18772, -232773, 66475, -274015, 223600, 96118, 99379, -245920, -222907, -117638, -70406, 174817, -434150, -234029, -429311, -93051, -21128, -44613, 34008, -4290, 16526, -170235, 307355, -51386, -162670, -122968, -6557, -78096, 66316, -65828, 69563, -60387]
9559b30087I170a76248j97295q5082b01534j42214J07792n0501A67832a14663
9548H7983J41813a10368M0882F283i0682k55057K2321A64805a97424g1870B2339
9536d6893G2443M4981B5406J72909k2501K6499a23932p5054A02027a41585J097
9525a40488f2339o9567a7332l07178e6279j61098D7315c94273e843p5894k72695
9514c54432a44414e9229A1782d72298a62906j97053k392C53079A27172a3446k18651
9503b32097N2849H1713a68865A28473a8743A7597b30089g6727A87293a61201d1080
9491G1472A7598a24459c6775A07714a06281B29792a3083B07505h7836j8897d4560
9479a74904L5730L2745j0491m5309B90504a85720q1009L7416F2054b46962g7500
$$ y = [-230087, 9170, -176248, -373543, -458625, -201534, -343748, -235956, -286457, 167832, -114663, 87983, 229796, -110368, -69486, 6283, -90682, -345739, -323418, 164805, -197424, -71870, 22339, -46893, 72443, 117424, 25406, 198315, 175814, 202313, -123932, -198986, 102027, -141585, -140488, -62339, -131906, -17332, -324510, -56279, -217377, 47315, -394273, -5843, -81737, -354432, -144414, -59229, 11782, -472298, -162906, -359959, -362351, 353079, 127172, -13446, -232097, -179248, 81713, -168865, 128473, -18743, 17597, -230089, -76727, 187293, -161201, -41080, 71472, 17598, -124459, -36775, 107714, -106281, 229792, -13083, 207505, -87836, -106733, -44560, -174904, -139174, -106429, -116920, -162229, 290504, -185720, -266729, -229313, 62054, -246962, -77500]
9467c31687a8465B50269b71892l4099a45443n2362j94382g4978l46836d0919A05661
9455F4924g9496m6834B91062c20483B5309a52922k12323a2440o6252C25335c87053
9443b07811n234D2774N4143e9582k50505d0190p1111j7112E2738Q8885a83270
9431a45743N1140A03565g7137A94048I3586K9226j3869B6662N5450a87677B19266
9419C8903f9912A45473e9387R523i165H4006h3400j53313H9100a38569p3312e5067
9406A11000d9336m2864k04336P546Q8162F159i463j19580k8072L5863j70473j66447
9394d58172I3221b31210B04129a25988j92002Q4305n2914B0779L6493N8518k9931
9383H5859d45049a56891r6835F5507O3537a31716A12684k6241C7220J26887a38749
$$ y = [-331687, -18465, 250269, -271892, -305991, -145443, -197805, -392187, -74978, -421814, -40919, 105661, 64924, -79496, -126330, 291062, -320483, 25309, -152922, -365245, -12440, -78692, 325335, -387053, -207811, -213045, 42774, 96917, -59582, -310087, -40190, -111301, -128413, 52738, 141623, -183270, -145743, -94603, 103565, -77137, 194048, 93586, 122812, 108943, 26662, 82112, -187677, 219266, 38903, -69912, 145473, -59387, -49864, -9165, 84006, -83400, -236713, 89100, -138569, -211881, -55067, 111000, -49336, -92200, -296536, -288990, -200828, 6159, -9463, -129043, -157115, -121252, -291725, -458172, 93221, -231210, 204129, -125988, -317990, -233685, -286599, 20779, 57272, 115790, 85859, -445049, -156891, -253726, 65507, 129044, -131716, 112684, 86443, 37220, 164107, -138749]
9371G9332a14837B5131h8722k1435j62979A62192G7858a05221l4345o1736A7410
9359A19849a761j45132J3171h914k36055I448a18675a2953j34938A97483o1261
9348A36222a32108d3878k17432F001a69739k4542R23C5127K10851I7928m4157
9337E3771K4074K7444g1079H3232a43951e6116q0637j2541l2758A97465C8707
9325a40975L9653G4026a70901j88535b1300m09130a72634h5703o8368A69376a80576
9313g0253q9297A20190b8735k9701I450C852J1619a42750j07202A0319a87965
9301b59178g9894A15817C1034a51687A58718f1734F1397K2408g3861j8967L4517
9290e8311j69180R2811L618A93446K4983a74129l9865B97950A09094b25759j92719
$$ y = [79332, -114837, 25131, -88722, -110157, -273136, 162192, 77858, -105221, -139566, -201302, 17410, 119849, -1761, -146893, -133722, -8914, -244969, 9448, -118675, -12953, -147891, 197483, 136222, -132108, -43878, -261310, 6001, -169739, -194281, -193358, 35127, 245978, 97928, 53771, 77845, 105289, -71079, 83232, -143951, -56116, -136753, -149294, -182052, 197465, 38707, -140975, -101322, 74026, -170901, -359436, -21300, -430430, -172634, -85703, -154071, 169376, -180576, -70253, -159550, 120190, -28735, -58436, 9450, 3852, 15471, -142750, -249952, 10319, -187965, -259178, -79894, 115817, 31034, -151687, 158718, -61734, 61397, 83805, -73861, -92828, -58311, -227491, -134680, -131062, 193446, 218429, -174129, -213994, 297950, 109094, -225759, -418478]
9279d18478K04812i9770j44712b8732k38875m1614a33824B1035J0720a51413j2165
9268a63578N5189H2813b56831B4896f9362a9957A18033N981a87405m0267c1908
9256c53226f6058j82745R1054P6483J6104j48833B26304c02804h5186B33233a53209
9244A05885f8769l8344m0693A63242b52415B65572c1534D7360J23670l9780J07558
9233B38808a76799A51540a6983e822l33222a61989j520A10759n2353J51476G0682
9221e29850b3988C41047D5157b54253g7801B18029G9170a23927A57201i4960m6771
9210a41731k26961d6987a1130j85315M6197O9931o0868b182H3050l5733a5865
9198a71194L7948N8154r807J521A12683a16054j13589e6190J289k1734m8634N6686
$$ y = [-418478, -213666, -99770, -244482, -28732, -267607, -309221, -133824, 21035, 31755, -151413, -163578, -108389, 82813, -256831, 24896, -69362, -19957, 118033, 124014, -187405, -227672, -31908, -353226, -66058, -248803, -157749, -81266, -65162, -213995, 226304, -302804, -85186, 233233, -153209, 105885, -68769, -107113, -147806, 163242, -252415, 265572, -31534, 47360, 171030, 131250, 238808, -176799, 151540, -16983, -5822, -339044, -161989, -163509, 110759, 58406, 209882, 70682, -529850, -23988, 341047, 45157, -254253, -77801, 218029, 79170, -123927, 157201, -94960, -141731, -368692, -46987, -11130, -196445, -150248, -80317, -141185, -2182, 83050, 47317, -15865, -171194, -133246, -75092, -84899, -83378, 112683, -116054, -229643, -56190, -54901, -76635, -125269, -68583]
9186f8583j50797f9266B9854c28103a60324F1288c33470e0447m1411B69021A07312
9174f1968C01066d3264C072g2128j06495r9290R4456C3001K6032J65319f1112
9162A41232B5329d98l09695A64586f1281J5537A80697q3906m7008g1903k12338
9151b84241a1910F2006g6535k5412F0665a87427k3348D0546J11975a86503c8828
9139d2945B9624M2780b38062J12842n0374K3139k91170B12525c60401i6397k22614
9128c19011J14966h9561l3672G3588a32674I5840L6711k6663d6079j31989L5002
9117a43066F2464a18475r7641M9810A00843b84868j09863i0012r1539j98200a6461
9105B4329b82076e4316A14537b35165g4160o5993H0103J04046g9221j01707m8290
$$ y = [-68583, -219380, -69266, 29854, -328103, -160324, 61288, -333470, -50447, -91858, 269021, 107312, -61968, 301066, -43264, 3072, -72128, -178623, -277913, -183457, 33001, 59033, 224352, -61112, 141232, 25329, -498, -310193, 164586, -61281, -45744, 180697, 96791, 49783, -71903, -284241, -11910, 62006, -76535, -101947, 60665, -187427, -210775, 40546, 152521, -186503, -38828, -42945, 29624, 72404, -238062, -125220, -175594, -152455, -443625, 212525, -360401, -96397, -319011, -204045, -89561, -123233, 73588, -132674, 95840, 132551, 105888, -46079, -178068, -143066, 62464, -118475, -216116, -166306, 100843, -284868, -394731, -90012, -181551, -379751, -16461, 24329, -282076, -54316, 114537, -235165, -74160, -140153, 80103, 184149, -79221, -180928, -229218]
9094b29218g9036j86268j31543A85221a59867f1446H1253a13097j03699a2001
9083A22984g0513A16606b02886A08797M6688F7556a85471e5648k32238j340n9744
9072c48970e7929j70734a4677k04162D9791L13752A2224a35303B63081a27507
9061A42150N4034F912c8750A53858j2116b0296B08724a04220A14188c40949c4574
9049a42656B72531b54133I4080b76163c1406B17026D2797a51940j4093d3084k15880
9038b58964R4790e1870A6272K77495F9764i447n6494k17073A49522a04D77990
9026a08531j42819h962k73620A71068n9406J1955A5106e35297b57321k5025J22841
9015a59505A9340c60932K6760O174R4491O711p0611B96170A19520b96273j9519
$$ y = [-229218, -79036, -265304, -396847, 185221, -159867, -61446, 81253, -113097, -216796, -12001, 122984, -70513, 116606, -202886, 108797, 155485, 67556, -185471, -55648, -287886, -289226, -348970, -57929, -228663, -14677, -218839, 49791, 363543, 12224, -135303, 263081, -127507, 142150, 196184, 6912, -38750, 153858, 141742, -20296, 208724, -104220, 114188, -340949, -34574, -142656, 272531, -254133, 94080, -276163, -31406, 217026, 42797, -151940, -166033, -43084, -258964, -164174, -51870, 16272, 293767, 69764, -9447, -65941, -283014, 149522, -104, 477990, -108531, -251350, -8962, -282582, 171068, 111662, 123617, 15106, -535297, -257321, -282346, -159505, 19340, -360932, -334172, -327998, -233507, -226796, -297407, 296170, 119520, -296273, -315792]
9004c15792f110A55282i8656d2664j93349F5604a95623P453J6032e5320A53139
8992a84175O550E7154b57286a6274k30018J02512I9352D5441R8813b02955b3069
8980e9677l6625j03786R3221j28289H2418b06716f5745m395A21606g9257j96695
8969b75952O8764l1711I8995b98635a253m330C5638a2329D4871J29468a1269q4911
8957i6180L3055i744A8732a11271d822j95989A1696b59313g837G4779a47200E1974
8944a29065A72606a90685K0923j16594e4496B72607c1936C38966i7134k8308l12899
8933d38341g5905j12513j50575d0241m9199A59549a98954A64652L8114G2658i1071
8921c8936I9781L88285j4269P05386n74869B48777D5270J26161a19066A55605
$$ y = [-315792, -6110, 155282, -98656, -42664, -236013, 65604, -195623, -188170, -172138, -55320, 153139, -184175, -177625, 57154, -257286, -16274, -246292, -143780, 99352, 45441, 144254, -202955, -23069, -59677, -96302, -200088, -106867, -235156, 82418, -206716, -65745, -70140, 121606, -79257, -275952, -207188, -238899, 98995, -298635, -1253, -5583, 35638, -12329, 44871, 174339, -11269, -96180, -63125, -9744, 18732, -111271, -4822, -200811, 11696, -259313, -7837, 74779, -147200, 51974, -129065, 172606, -190685, -169762, -286356, -54496, 272607, -31936, 338966, -97134, -125442, -438341, -75905, -188418, -338993, -40241, -89440, 159549, -198954, 164652, 202766, 72658, -91071, -38936, 99781, 488066, 473797, 1179183, 604314, 248777, 45270, 171431, -119066, 155605]
8910g4412K7716p3529e5723j4897k41664B62523a43062M3065k0415E9624e9645
8898a25501C523J56641a93773n3222C17457e1295G4714b14737B8676K0208a73201
8886B90332k5233c3143D08458a50286b4769k42638l4149i1522a036j36133e7025
8874b15343r5553A39722f4264j87105f4836B52866a55757H0401a10403o0701A38082
8862f082A3491c57465A19934h9681K8790A87590D7049a69153A64720a51259B0536
8850b01k7121A09295J93069D0821J49093f3591k77485a10698j09371A20316b33935
$$ y = [-74412, -46696, -120225, -55723, -70620, -312284, 262523, -143062, -99997, -120412, 59624, -59645, -125501, 3523, 160164, -193773, -246995, 317457, -51295, 74714, -214737, 28676, 48884, -173201, 290332, 265099, -33143, 408458, -150286, -24769, -267407, -301556, -91522, -1036, -137169, -57025, -215343, -310896, 139722, -64264, -251369, -64836, 252866, -155757, 80401, -110403, -171104, 138082, -6082, 13491, -357465, 119934, -89681, -60891, 187590, 47049, -169153, 164720, -151259, 20536, -201, -27322, 109295, 302364, 40821, 189914, -63591, -341076, -110698, -220069, 120316, -233935]
$$ [...]
##END NTUPLES=NMR SPECTRUM
##END=
