##TITLE=NES1014_956665_9233183_m24fQOtjPl
##JCAMPDX= 6.0         $$ Bruker NMR JCAMP-DX V2.0
##DATA TYPE= NMR SPECTRUM
##DATA CLASS= NTUPLES
##ORIGIN= BRUKER
##OWNER= Administrator
$$ 1.72 TOPSPIN		Version 2.1
$$ 2015-06-18 10:17:22.816 -0700  Administrator@X
$$ Compression mode = diff/dup
##.OBSERVE FREQUENCY= 400.02188249412
##.OBSERVE NUCLEUS= ^1H
##.ACQUISITION MODE= SIMULTANEOUS (DQD)
##.ACQUISITION SCHEME= undefined
##.AVERAGES= 64
##.DIGITISER RES= 22
##SPECTROMETER/DATA SYSTEM= spect
##.PULSE SEQUENCE= noesygpps1d.comp
##.SOLVENT NAME= COFFEE_meoh
##.SHIFT REFERENCE= INTERNAL, COFFEE_meoh, 1, 14.96311
##AUDIT TRAIL= $$ (NUMBER, WHEN, WHO, WHERE, PROCESS, VERSION, WHAT)
$$ ##TITLE= Audit trail, TOPSPIN		Version 2.1
$$ ##JCAMPDX= 5.01
$$ ##ORIGIN= Bruker BioSpin GmbH
$$ ##OWNER= Administrator
$$ $$ E:\/data/COFFEE/nmr/NES1014_956665_9233183_m24fQOtjPl/12/pdata/1/auditp.txt
$$ ##AUDIT TRAIL=  $$ (NUMBER, WHEN, WHO, WHERE, PROCESS, VERSION, WHAT)
(   1,<2015-06-18 10:17:17.409 -0700>,<Administrator>,<X>,<go>,<TOPSPIN 2.1>,
      <created by zg
	started at 2015-06-18 10:05:47.753 -0700,
	POWCHK enabled, PULCHK disabled,
       configuration hash MD5:
       21 0F 79 D6 B3 7B B4 F6 88 20 88 DB 03 48 BD 9F
       data hash MD5: 64K
       78 CC 86 69 7F CE FA DF 31 05 C0 79 29 F1 AD CD>)
(   2,<2015-06-18 10:17:20.784 -0700>,<Administrator>,<X>,<proc1d>,<TOPSPIN 2.1>,
      <Start of raw data processing
       efp LB = 0.3 FT_mod = 6 PKNL = 1 PHC0 = 0 PHC1 = 0 SI = 128K 
       data hash MD5: 128K
       F1 5B 29 40 63 C1 3F B9 4D 99 F3 F5 85 4F 32 70>)
(   3,<2015-06-18 10:17:21.659 -0700>,<Administrator>,<X>,<proc1d>,<TOPSPIN 2.1>,
      <pk PHC0 = -89.64844 PHC1 = 0 
       data hash MD5: 128K
       69 26 C7 5F 09 D9 81 E0 8E 8F 48 50 07 2F 1B DA>)
(   4,<2015-06-18 10:17:22.050 -0700>,<Administrator>,<X>,<proc1d>,<TOPSPIN 2.1>,
      <abs ABSG = 1 
       data hash MD5: 128K
       A0 59 6C 66 72 71 59 03 08 1D 10 E7 83 58 18 64>)
(   5,<2015-06-18 10:17:22.128 -0700>,<Administrator>,<X>,<proc1d>,<TOPSPIN 2.1>,
      <abs ABSG = 2 
       data hash MD5: 128K
       93 74 27 91 0A 37 AB 27 20 94 7B EB 22 53 EA E7>)
(   6,<2015-06-18 10:17:22.206 -0700>,<Administrator>,<X>,<proc1d>,<TOPSPIN 2.1>,
      <abs ABSG = 3 
       data hash MD5: 128K
       55 F5 3A 5A 56 E7 6A 2A A9 84 43 44 EB 4D 22 DC>)
(   7,<2015-06-18 10:17:22.300 -0700>,<Administrator>,<X>,<proc1d>,<TOPSPIN 2.1>,
      <abs ABSG = 4 
       data hash MD5: 128K
       91 4B 91 EE 3C 49 82 D7 E5 47 57 7D BA C7 AD 39>)
(   8,<2015-06-18 10:17:22.409 -0700>,<Administrator>,<X>,<proc1d>,<TOPSPIN 2.1>,
      <abs ABSG = 5 
       data hash MD5: 128K
       E1 CE 0F FE 64 15 5F E5 EF 33 81 64 5A E8 5D 8B>)
$$ ##END=
$$ 
$$ $$ hash MD5
$$ $$ 12 1C 5F C3 55 8D D7 FB E4 BB 5A 19 FE 7F 8B 66
##$RELAX= 
##$RELAX= 
##$RELAX= 
##$RELAX= 
##$RELAX= 
##$RELAX= 
##$RELAX= 
##$RELAX= 
$$ Bruker specific parameters
$$ --------------------------
##$DU= <E:\>
##$EXPNO= 12
$$ [...]
##$TP07= 0
##$TPNAME0= <>
##$TPNAME1= <>
##$TPNAME2= <>
##$TPNAME3= <>
##$TPNAME4= <>
##$TPNAME5= <>
##$TPNAME6= <>
##$TPNAME7= <>
##$TPOAL= (0..7)
0.5 0.5 0.5 0.5 0.5 0.5 0.5 0.5
##$TPOFFS= (0..7)
0 0 0 0 0 0 0 0
##$TUNHIN= 0
##$TUNHOUT= 0
##$TUNXOUT= 0
##$USERA1= <user>
##$USERA2= <user>
##$USERA3= <user>
##$USERA4= <user>
##$USERA5= <user>
##$V9= 5
##$VALIST= <valist>
##$VCLIST= <CCCCCCCCCCCCCCC>
##$VD= 0
##$VDLIST= <DDDDDDDDDDDDDDD>
##$VPLIST= <PPPPPPPPPPPPPPP>
##$VTLIST= <TTTTTTTTTTTTTTT>
##$WBST= 2048
##$WBSW= 25
##$XGAIN= (0..3)
0 0 0 0
##$XL= 0
##$YL= 0
##$YMAX_a= 7947264
##$YMIN_a= -16867713
##$ZGOPTNS= <>
##$ZL1= 120
##$ZL2= 120
##$ZL3= 120
##$ZL4= 120
##$ABSF1= 14.96311
##$ABSF2= -5.595072
##$ABSG= 5
##$ABSL= 3
##$ALPHA= 0
##$AQORDER= 0
##$ASSFAC= 0
##$ASSFACI= 0
##$ASSFACX= 0
##$ASSWID= 0
##$AUNMP= <proc_prof1d_extract.lims>
##$AXLEFT= 0
##$AXNAME= <>
##$AXNUC= <1H>
##$AXRIGHT= 0
##$AXTYPE= 0
##$AXUNIT= <>
##$AZFE= 0.1
##$AZFW= 0.1
##$BCFW= 0
##$BC_mod= 0
##$BYTORDP= 0
##$COROFFS= 0
##$CY= 15
##$DATMOD= 1
##$DC= 0
##$DFILT= <>
##$DTYPP= 0
##$F1P= 0
##$F2P= 0
##$FCOR= 0.5
##$FTSIZE= 131072
##$FT_mod= 6
##$GAMMA= 0
##$GB= 0
##$INTBC= 1
##$INTSCL= 1
##$ISEN= 128
##$LB= 0.3
##$LEV0= 0
##$LPBIN= 0
##$MAXI= 10000
##$MC2= 0
##$MEAN= 0
##$ME_mod= 0
##$MI= 0
##$NCOEF= 0
##$NC_proc= -2
##$NLEV= 6
##$NOISF1= 0
##$NOISF2= 0
##$NSP= 0
##$NTH_PI= 0
##$NZP= 0
##$OFFSET= 14.96311
##$PC= 1
##$PHC0= -89.64844
##$PHC1= 0
##$PH_mod= 1
##$PKNL= yes
##$PPARMOD= 0
##$PPDIAG= 0
##$PPIPTYP= 0
##$PPMPNUM= 2147483647
##$PPRESOL= 1
##$PSCAL= 4
##$PSIGN= 0
##$PYNMP= <proc.py>
##$REVERSE= no
##$SF= 400.020008794622
##$SI= 131072
##$SIGF1= 0
##$SIGF2= 0
##$SINO= 400
##$SIOLD= 131072
##$SPECTYP= <>
##$SREGLST= <1H.CDCl3>
##$SSB= 0
##$STSI= 131072
##$STSR= 0
##$SW_p= 8223.68421052631
##$SYMM= 0
##$S_DEV= 0
##$TDeff= 65536
##$TDoff= 0
##$TI= <>
##$TILT= no
##$TM1= 0
##$TM2= 0
##$TOPLEV= 0
##$USERP1= <user>
##$USERP2= <user>
##$USERP3= <user>
##$USERP4= <user>
##$USERP5= <user>
##$WDW= 1
##$XDIM= 131072
##$YMAX_p= 417533374
##$YMIN_p= -11410
##$CURPLOT= <Network HP LaserJet P1505>
##$CURPRIN= <$Network HP LaserJet P1505>
##$DFORMAT= <normdp>
##$LAYOUT= <+/1D_H.xwp>
##$LFORMAT= <normlp>
##$PFORMAT= <normpl>
##$SURQMSG= 1
$$ End of Bruker specific parameters
$$ ---------------------------------
##NTUPLES= NMR SPECTRUM
##VAR_NAME=  FREQUENCY,     SPECTRUM/REAL,   SPECTRUM/IMAG
##SYMBOL=    X,             R,               I
##VAR_TYPE=  INDEPENDENT,   DEPENDENT,       DEPENDENT
##VAR_FORM=  AFFN,          ASDF,            ASDF
##VAR_DIM=   131072,        131072,          131072
##UNITS=     HZ,            ARBITRARY UNITS, ARBITRARY UNITS
##FACTOR=    0.0627417313425164, 1,          1
##FIRST=     8223.62146879497, -634,         -55803
##LAST=      0,             422,             -56365
##MIN=       0,             -11410,          0
##MAX=       8223.62146879497, 417533374,    0
$$ Real data points
##PAGE= N=1
##DATA TABLE= (X++(R..R)), XYDATA
$$ [...]
67336 169973 169319 169542 170590 171366 171339 171273 171853 172559 172527 171807 171076 170751 170982 171877 173071 173614 173050 172163 172038
67317 172038 172794 173873 175075 176503 177905 178967 180029 181622 183424 184586 185099 185902 187413 188844 189435
67302 189435 189689 190743 192844 195072 196441 196836 196860 197080 197536 197810 197474 196570 195702 195566 196302 197373 198151
67285 198151 198570 199045 199783 200510 201021 201643 202752 204022 204706 204611 204316 204357 204724 205391 206716 208881 211293 213087
67267 213087 214064 214682 215278 215745 215969 216113 216347 216646 217048 217842 219223 220876 222179 222921 223597 224787 226311
67250 226311 227355 227541 227538 228323 230113 232403 234794 237180 239166 240103 240035 240079 241317 243531 245484 246366 246603
67233 246603 247220 248661 250467 252050 253517 255394 257558 259025 259270 259262 260364 262417 263907 264180 264443 266038
67217 266038 268587 270605 271409 271580 271873 272533 273566 274971 276605 278301 280155 282293 284377 285825 286558
67202 286558 287166 288238 289821 291557 293059 294113 294796 295461 296502 298048 299927 301834 303515 305044 306974
67187 306974 309869 313441 316512 318180 318779 319376 320627 322511 324800 327222 329366 331058 332795 335213 338077
67172 338077 340422 341847 343149 345331 348375 351342 353514 355070 356706 358845 361376 364023 366725 369519
67158 369519 372262 374811 377425 380483 383717 386264 387794 389111 391121 393621 395739 397303 399076 401651
67144 401651 404748 407714 410233 412396 414509 416931 419804 422806 425522 428058 430994 434674 438841 443010
67130 443010 446888 450382 453546 456635 459955 463570 467282 470879 474219 477211 480016 483168 487104 491595
67116 491595 495970 499872 503464 506975 510486 514142 518116 522276 526257 529903 533271 536322 539163 542615
67102 542615 547725 554306 560573 564785 566999 568778 571469 575256 579713 584572 589687 594667 599065 603039
67088 603039 607466 613055 619380 625227 630026 634487 639464 644646 649023 652424 655814 660020 664861 669791
67074 669791 674794 680260 686384 693017 699861 706536 712699 718374 723960 729828 736087 742759 749752 756565
67060 756565 762536 767667 772788 778645 785167 791916 798849 806179 813814 821405 828824 836179 843515 850849
67046 850849 858322 865932 873226 879715 885601 891731 898743 906524 914521 922335 929917 937430 945105 953122
67032 953122 961486 969967 978257 986247 994171 1002386 1011016 1019965 1029313 1039397 1050205 1061006 1071057
67019 1071057 1080553 1090330 1100673 1111063 1121229 1131686 1142876 1154368 1165495 1176309 1187312 1198548
67007 1198548 1209625 1220444 1231268 1242078 1252484 1262421 1272467 1283238 1294769 1306679 1318706
66996 1318706 1330829 1342986 1354904 1366334 1377456 1388922 1401296 1414430 1427565 1440131 1452159
66985 1452159 1463901 1475439 1486942 1498853 1511360 1523915 1535760 1546902 1558116 1570044 1582676
66974 1582676 1595686 1608803 1621705 1634000 1645656 1657254 1669556 1682789 1696417 1709627 1722078
66963 1722078 1734204 1746736 1759848 1772986 1785658 1798141 1811058 1824434 1837625 1850153 1862131
66952 1862131 1873734 1884754 1894983 1904763 1914746 1925243 1936100 1947098 1958119 1968905 1979005 1988176
66940 1988176 1996692 2005092 2013727 2022684 2032028 2041761 2051434 2060164 2067383 2073509 2079564 2086115 2092825 2099113
66926 2099113 2104921 2110627 2116452 2122192 2127473 2132019 2135725 2138692 2141225 2143664 2146175 2148712 2151146 2153351
66912 2153351 2155241 2156823 2158177 2159356 2160343 2161062 2161384 2161149 2160414 2159637 2159286 2159075 2157878 2154726 2149833 2144444
66896 2144444 2139687 2135747 2132052 2128043 2123626 2118928 2113787 2107757 2100832 2093963 2088290 2083794 2079126 2073059
66882 2073059 2065728 2058116 2050751 2043333 2035351 2026475 2016522 2005646 1994589 1984203 1974596 1965112 1955179
66869 1955179 1944726 1933770 1922210 1910261 1898543 1887362 1876289 1864848 1853273 1842092 1831196
66858 1831196 1819938 1808082 1796066 1784200 1772108 1759321 1746069 1733111 1720872 1709126 1697422
66847 1697422 1685506 1673287 1660732 1647973 1635324 1622989 1610844 1598630 1586242 1573733 1561135
66836 1561135 1548461 1535784 1523214 1510868 1498973 1487791 1477227 1466705 1455670 1444073 1432164
66825 1432164 1420069 1407968 1396383 1385682 1375424 1364786 1353552 1342010 1329973 1316863 1303024
66814 1303024 1289905 1278348 1267538 1256336 1244900 1234050 1223676 1212977 1201984 1191594 1181983
66803 1181983 1172134 1161348 1150351 1140393 1131782 1123799 1115585 1106728 1097307 1087712 1078275 1068910 1059337
66790 1059337 1049647 1040250 1031177 1021978 1012553 1003582 995704 988638 981440 973416 964509 955115 945866 937313
66776 937313 929486 921943 914451 907231 900216 892575 883676 874252 865862 859111 853030 846430 839209 831977
66762 831977 824891 817550 809932 802749 796566 790923 784809 777963 771294 765785 761262 756608 751074 744995
66748 744995 739106 733577 728025 722232 716463 711066 706014 700955 695583 689890 684078 678260 672247 665734
66734 665734 658712 651631 645079 639378 634533 630447 626987 623870 620690 617175 613388 609593 605926 602210
66720 602210 598144 593717 589377 585644 582480 579125 574767 569397 563867 559008 554768 550401 545500 540605
66706 540605 536641 533935 532023 530302 528483 526435 524007 521230 518392 515614 512579 508925 504725 500320
66692 500320 495909 491609 487701 484416 481545 478638 475470 471982 467951 463275 458518 454585 451699 449205
66678 449205 446536 443819 441326 438845 436032 433016 430263 428048 426347 424973 423510 421374 418344 414871
66664 414871 411528 408317 404824 400937 397038 393592 390865 388938 387618 386338 384537 382220 379919 378061
66650 378061 376567 375043 373135 370685 367833 365080 362956 361427 359747 357140 353651 350214 347760 346313
66636 346313 345027 343132 340642 338002 335290 332210 328835 325857 323901 322957 322767 323347 324637 325913 326132
66621 326132 324918 322841 320691 318808 317102 315365 313430 311304 309274 307738 306798 306175 305494 304564 303376
66606 303376 302058 300804 299637 298250 296280 293775 291182 288911 287103 285778 284896 284234 283499 282678 282052
66591 282052 281740 281451 280796 279673 278290 276973 275996 275353 274650 273469 271920 270531 269507 268410 266716 264397
66575 264397 261747 259033 256684 255484 256025 257938 260033 261241 261256 260392 259150 257926 256797 255487 253739
66560 253739 251701 249758 248050 246435 244880 243557 242459 241289 239858 238325 236918 235668 234545 233603
66546 233603 232785 231901 230990 230410 230242 229861 228591 226643 224933 223941 223228 222201 220911 219836 219184 218773 218425
66529 218425 218172 218054 217876 217208 215576 212833 209475 206436 204330 202936 201607 200151 198996 198459 198135 197302
66513 197302 195854 194610 194542 195733 197160 197560 196491 194589 192880 191962 191755 191795 191625 191006 189940 188544
66497 188544 186914 185178 183675 182902 183162 184296 185805 187099 187666 187270 186201 185122 184397 183704 182589 181231
66481 181231 180259 179876 179588 178944 178129 177548 177119 176340 175008 173555 172620 172395 172430 172069 171061 169708 168480
66464 168480 167612 167206 167465 168418 169491 169781 169007 167904 167443 167856 168571 168895 168529 167629 166684 166239 166475 167030
66446 167030 167387 167363 167107 166771 166359 165797 164918 163512 161634 159759 158340 157259 156056 154696 153773 153849 154826
66429 154826 156106 157162 157828 158208 158484 158756 159006 159233 159545 159927 160006 159339 158006 156581 155432 154379 153245
66412 153245 152410 152334 152682 152450 151069 149037 147311 146260 145433 144206 142459 140627 139233 138412 137889 137427
66396 137427 137188 137506 138346 139167 139396 138892 137868 136610 135449 134808 134962 135708 136493 136879 136753 136210 135475 134917
66378 134917 134802 134899 134620 133787 132987 132896 133369 133553 132920 131861 131143 130948 130699 129773 128275 126967 126470 126672
66360 126672 126975 126964 126603 125871 124641 123066 121750 121254 121661 122790 124479 126290 127283 126779 125250 123898
66344 123898 123270 122841 122011 120955 120198 119892 119866 120006 120128 119811 118820 117526 116502 115864 115371 115035 115111 115570
66326 115570 116039 116395 117031 118286 119903 121208 121693 121261 120088 118474 116815 115499 114672 114079 113264 112056
66310 112056 110825 110103 109937 109867 109645 109692 110581 112183 113615 114035 113339 112136 111235 111081 111468 111790 111656 111175
66292 111175 110584 109830 108837 107973 107758 108131 108479 108591 109094 110580 112631 114140 114536 114241 113947 113803 113528 112989
66274 112989 112324 111608 110719 109654 108723 108237 108091 107904 107504 107142 107136 107428 107556 107021 105745 104218 103141 102745
66256 102745 102542 101988 101242 100968 101350 101794 101749 101367 101053 100794 100404 100121 100361 100957 101236 100947 100629 100871 101550
66237 101550 102052 102006 101544 100963 100295 99258 97639 95731 94261 93718 93852 94092 94260 94526 94748 94461 93684 93279
66219 93279 94068 95810 97359 97784 97161 96331 96091 96519 96978 96813 96110 95619 95820 96290 96216 95417 94456 93755 93026
66200 93026 91858 90647 90421 91602 93316 94352 94616 95174 96792 98964 100611 101320 101394 101039 100137 98774
66184 98774 97409 96382 95667 95226 95238 95778 96583 97288 97697 97743 97520 97394 97718 98299 98558 98348 98220 98664 99511
66165 99511 100350 101082 101710 101987 101769 101441 101496 101949 102606 103614 105146 106705 107431 107106 106239 105138 103569 101526
66147 101526 99646 98432 97513 96171 94349 92679 91662 91263 91236 91480 91933 92421 92772 93002 93236 93489 93616
66130 93616 93537 93435 93533 93645 93154 91693 89762 88354 87923 87974 87781 87218 86703 86538 86610 86685 86756 86991 87437 87839
66110 87839 87812 87264 86644 86658 87578 88941 89968 90233 89870 89273 88774 88531 88481 88366 87964 87375 87012 87202 87828
66091 87828 88439 88653 88393 87783 86963 86090 85400 85104 85208 85558 86058 86676 87170 87063 86099 84635 83393 82833
66073 82833 82880 83160 83289 83038 82512 82180 82453 83168 83703 83654 83187 82702 82443 82452 82553 82269 81137 79421 78177
66054 78177 78257 79437 80792 81746 82396 83032 83742 84431 84884 84816 84122 83053 81931 80876 80016 79666 79839 79852
66036 79852 79032 77735 77053 77435 78187 78417 77918 77010 76168 76016 77063 79036 80938 82122 82846 83557 84287
66019 84287 85117 86465 88224 89284 88815 87688 87621 89068 90833 91782 92084 92574 93607 94881 95920 96433
66003 96433 96487 96366 96101 95356 94163 93457 94147 95790 96992 97121 96764 96446 95869 94804 93797 93322 92914 91803
65985 91803 89958 87922 86042 84467 83585 83804 84984 86446 87458 87532 86627 85323 84415 83994 83371 82204
65969 82204 81119 80752 80771 80500 80024 79879 79993 79777 79131 78516 78138 77783 77505 77720 78480 79223 79438 79190 78929
65950 78929 79106 79914 80943 81232 80149 78167 76336 75177 74636 74862 76152 78120 79765 80657 81345 82376
65934 82376 83515 84230 84376 84091 83523 82983 82925 83446 84148 84704 85146 85430 85201 84313 83182 82383 82188 82649 83683
65915 83683 84815 85324 84954 84143 83339 82534 81697 81197 81355 81952 82508 82788 82757 82382 81772 81186 80693 80174 79836
65896 79836 80173 81151 81976 82178 82345 83219 84460 85042 84595 83669 82796 81950 80972 79947 79011 78166 77446 77007
65878 77007 76948 77138 77264 77075 76732 76823 77712 78856 79267 78748 78061 77663 77042 75841 74891 75235 76567 77523 77337
65859 77337 76363 75158 73951 73056 72891 73317 73640 73561 73573 74180 75168 75955 76323 76512 76897 77645 78443 78501 77241
65840 77241 75120 73431 73117 74031 75391 76541 77149 77088 76519 75868 75488 75392 75428 75532 75684 75812 75903 76173 76967
65821 76967 78429 80214 81550 81867 81460 81318 82065 83308 84318 85004 85823 86894 87794 88235 88515 89168 90414
65804 90414 91896 92736 92112 90208 88379 87798 88127 88134 87480 87042 87362 87759 87390 86458 85793 85686 85723 85473 84857
65785 84857 84066 83459 83359 83663 83902 83966 84396 85590 87001 87643 87272 86626 86504 86921 87211 86790 85772 84918
65767 84918 84888 85503 85970 85863 85608 85830 86539 87253 87653 87763 87642 87266 86686 86008 85188 84049 82557 80933
65749 80933 79475 78285 77193 75979 74761 74068 74290 75098 75695 75661 75208 74605 73837 73030 72709 73199 74028 74334
65731 74334 73733 72542 71344 70584 70408 70592 70695 70507 70147 69631 68686 67280 65986 65422 65560 65989 66567 67270
65713 67270 67687 67413 66920 67298 68865 70604 71344 71065 70695 70933 71698 72543 73156 73401 73233 72776 72383 72469 73208
65694 73208 74360 75389 75769 75326 74351 73407 72969 73146 73721 74430 75175 75931 76608 77097 77353 77272 76653 75554
65676 75554 74539 74147 74148 73862 73277 73260 74350 75848 76620 76403 75857 75591 75678 75922 76000 75430 74008 72323 71348
65657 71348 71376 71717 71502 70481 69027 67772 67257 67520 67955 67977 67853 68408 69815 71240 71919 72089 72472 73294
65639 73294 74210 74965 75625 76283 76866 77206 77097 76453 75596 75148 75393 75933 76261 76410 76689 77006 76951 76455 75878
65620 75878 75469 75200 75135 75413 75739 75448 74386 73277 72840 72916 72938 72919 73304 73976 74120 73292 72014 71022 70383
65601 70383 69769 69226 69078 69236 69226 68922 68711 68757 68635 68015 67262 66920 66898 66722 66459 66808 68166 70051 71612
65582 71612 72416 72565 72372 72151 72079 72082 71979 71902 72253 73085 73833 74013 73877 73899 73793 72672 70276 67513 65578
65563 65578 64893 65108 65677 66131 66112 65638 65112 64780 64385 63770 63504 64249 65599 66306 65823 64964 64712 65017 65325
65544 65325 65765 66961 68815 70200 70096 68614 66792 65701 65804 66739 67576 67619 67114 66931 67492 68369 69043
65527 69043 69588 70287 70962 71201 71080 71145 71698 72442 72963 73296 73862 75008 76674 78418 79707 80288 80341 80309 80560
65508 80560 81184 81990 82668 83094 83535 84402 85777 87377 89035 90884 92815 94053 93791 92242 90701 90438
65492 90438 91628 93349 94441 94450 93989 94174 95496 97340 98815 99831 100917 102117 102752 102427 101673 101229 101199
65475 101199 101345 101714 102333 102598 101755 100007 98491 97927 97792 97028 95171 92571 89915 87867 86785 86367
65459 86367 85813 84689 83479 82913 82961 82930 82406 81552 80502 79062 77216 75411 74010 72826 71547 70299
65443 70299 69377 68683 67880 67016 66557 66825 67722 68997 70412 71640 72408 72792 73094 73318 73111 72349 71467 71005
65425 71005 71096 71576 72341 73307 74159 74468 74055 73155 72242 71725 71646 71623 71245 70645 70436 70952 71803 72368 72498 72462
65405 72462 72452 72530 72925 73942 75566 77462 79342 81017 82098 82142 81303 80479 80497 81340 82436 83518 84803
65388 84803 86359 87741 88459 88576 88636 89118 90208 91962 94302 96754 98591 99586 100430 102098 104899 108470
65372 108470 112582 117420 123056 129218 135820 143232 151672 160720 169901 179314 189053 198122 204655 207374
65358 207374 206450 202917 197825 192110 186721 182264 178582 174956 170680 165425 159315 152864 146688 141065
65344 141065 135868 130979 126517 122492 118518 114212 109753 105746 102507 99799 97213 94593 92060 89851
65330 89851 88194 87149 86477 85830 85123 84508 83939 83045 81631 80081 78909 78068 77082 75910 75212 75484 76223
65313 76223 76358 75412 73874 72428 71241 70198 69458 69365 69843 70287 70225 69934 70168 71249 72615 73394 73360 73079
65295 73079 73102 73275 73113 72649 72453 72761 73006 72449 71013 69236 67625 66350 65464 65087 65278 65910 66747 67598
65277 67598 68409 69253 70140 70831 71017 70827 70911 71813 73350 74871 76010 76880 77634 78173 78434 78671 79263 80355
65259 80355 81785 83269 84550 85478 86006 86137 85883 85342 84701 84048 83197 81826 79863 77645 75742 74564
65243 74564 74000 73388 72076 70213 68773 68475 68883 68953 68378 67852 67973 68423 68504 68037 67375 66826 66551 66803 67698
65224 67698 68687 68803 67680 66028 64791 64075 63289 62178 61240 60964 61122 61164 61073 61381 62367 63624 64549 64925
65206 64925 64915 64741 64587 64590 64702 64694 64501 64376 64520 64746 64766 64681 64866 65418 65993 66219 66032 65596 65098 64684 64444
65185 64444 64366 64391 64474 64612 64851 65330 66156 67146 67894 68173 68150 68121 68222 68428 68509 67964 66492 64728 63955 64621
65165 64621 65626 65617 64610 63712 63674 64506 66103 68242 70023 70413 69619 69054 69615 70733 71425 71473 71204 70821
65147 70821 70537 70740 71426 71895 71534 70518 69384 68443 68054 68815 70745 72712 73528 73406 73586 74632 75818
65130 75818 76206 75716 75033 74900 75572 76619 77243 77092 76650 76542 76716 76743 76703 77136 78172 79289 80004 80284 80277
65111 80277 80169 80439 81707 84073 86964 89864 92842 96163 99709 103067 106044 108948 112467 117264 123474
65096 123474 130524 137661 144631 151636 158706 165463 171548 176924 181702 185966 189833 193327 196119 197714
65082 197714 198022 197399 196051 193754 190269 185684 180186 173888 167117 160450 154161 147896 141224 134252 127404
65067 127404 120888 114712 109026 104080 99989 96772 94392 92436 90075 86863 83469 81070 79984 79363
65053 79363 78309 76843 75619 75068 75035 74981 74327 72855 71023 69692 69372 69837 70567 71291 71961 72506 72948 73505
65035 73505 74202 74523 73926 72686 71736 71532 71512 70927 69852 69049 69057 69789 70875 71973 72731 72821 72239 71344 70488
65016 70488 69701 68842 67948 67281 67083 67321 67679 67809 67631 67363 67214 67197 67350 67969 69273 70926 72286 73208
64998 73208 74180 75454 76468 76513 75751 75069 75009 75221 75061 74305 73151 71858 70642 69768 69422 69504 69742 70007
64980 70007 70380 70842 71092 70809 70013 69023 68095 67305 66771 66719 67157 67752 68253 68873 69859 70866 71215 70787 70161
64961 70161 69718 69109 67956 66637 65924 66062 66623 67100 67292 67229 67184 67615 68647 69630 69670 68669 67408 66568
64943 66568 66179 66130 66625 67635 68400 68102 66945 66010 65944 66288 66232 65666 65119 64920 64867 64707 64572 64748 65230 65742
64923 65742 66095 66294 66334 66163 65932 66049 66763 67776 68420 68210 67153 65613 64038 62851 62404 62835 63902
64906 63902 65050 65762 65873 65507 64782 63767 62759 62249 62367 62562 62161 61187 60280 59910 60078 60669 61636 62715
64888 62715 63492 63915 64304 64697 64714 64365 64400 65386 66840 67827 68075 67980 67821 67657 67781 68572 69818 70728 70695 69680
64868 69680 67969 66069 64733 64412 64609 64353 63416 62494 62136 62180 62432 63101 64116 64671 64148 63105 62699 63320
64850 63320 64402 65413 66363 67327 68072 68467 68800 69332 69744 69428 68311 67061 66383 66327 66424 66349 66189 66137 66257
64831 66257 66558 66981 67200 66825 65995 65380 65288 65216 64706 64243 64645 65846 67002 67688 68199 68625 68515 67770 67126
64812 67126 67281 68003 68511 68359 67695 67005 66872 67529 68345 68280 67162 66039 65906 66654 67665 68764 69889 70421
64794 70421 69843 68757 68299 68630 68930 68866 69082 69976 70924 71283 71443 72190 73398 74082 73660 72613 71827 71650
64776 71650 71739 71639 71342 71283 71801 72625 73006 72450 71282 70366 70233 70592 70748 70434 70065 70094 70404 70588 70692 71197
64756 71197 72170 72860 72456 70969 69103 67491 66371 65761 65528 65388 65226 65328 65980 66940 67747 68453 69551
64739 69551 71067 72275 72576 72317 72412 73292 74491 75241 75295 75124 75302 75734 75686 74739 73460 72805 73031 73676 74446
64720 74446 75496 76672 77191 76493 75026 73736 73095 73028 73458 74300 75076 75180 74668 74352 74942 76369 78007
64703 78007 79224 79618 79113 78117 77347 77251 77678 78250 78800 79251 79350 78941 78371 78177 78334 78277 77764 77297 77364 77635
64683 77635 77398 76651 76223 76696 77591 77842 76885 75094 73350 72387 72500 73598 75361 77344 79017 79987 80334
64666 80334 80618 81266 81960 81953 81047 79979 79687 80408 81682 82929 83750 83921 83494 82916 82693 82871 83027 82768 82095
64647 82095 81293 80718 80699 81352 82396 83288 83693 83740 83747 83830 83903 83985 84341 85242 86605 87983 88953 89419 89433 88847 87466
64626 87466 85606 84130 83671 84015 84514 84932 85498 86218 86546 85922 84361 82385 80569 79272 78657 78752 79449
64609 79449 80469 81393 81889 82040 82344 83187 84337 85179 85434 85443 85672 86128 86340 85839 84631 83291 82571 82758
64591 82758 83433 83962 84140 84207 84363 84627 85073 85750 86294 86083 85067 84068 83868 84227 84255 83554 82542 81598 80483
64572 80483 78857 77046 75851 75730 76446 77495 78523 79309 79669 79653 79656 80070 80884 81822 82768 83781 84731 85340
64554 85340 85646 86022 86569 86845 86541 86023 85777 85540 84595 82867 81164 80183 79783 79513 79458 80147 81747 83685
64536 83685 85143 85748 85744 85546 85233 84585 83605 82704 82165 81658 80717 79558 78961 79300 80178 81092 81950 82722 83137
64517 83137 83111 83061 83336 83634 83450 82874 82413 82154 81668 80782 79909 79482 79440 79484 79542 79737 80084 80396 80461 80234 79924
64496 79924 79928 80533 81627 82774 83569 83841 83583 82912 82115 81520 81196 80887 80334 79561 78836 78448 78553 79088 79751
64477 79751 80208 80396 80594 81101 81874 82546 82762 82472 81889 81197 80304 78984 77278 75711 74967 75314 76368 77423
64459 77423 78078 78629 79881 82355 85607 88425 89829 89791 88894 87582 85994 84363 83175 82843 83406 84547
64443 84547 85749 86560 86913 87098 87197 86793 85599 84207 83640 84139 84966 85461 85660 85695 85284 84306 83273 82644
64425 82644 82109 81215 80330 80215 80851 81504 81896 82481 83412 84101 84156 84050 84329 84726 84703 84467 84731 85591 86270 86125
64405 86125 85438 85063 85534 86635 87610 87699 86685 85143 84084 84224 85446 86929 87835 88020 88119 88838 90154
64388 90154 91307 91585 90918 89760 88649 87993 87862 87790 87143 85973 85178 85409 86090 86109 85296 84646 85058 86435
64370 86435 88123 89679 90977 92015 92939 93911 94744 95011 94783 94797 95539 96514 96922 96772 96725 97013 97192 97038
64352 97038 97086 97999 99777 101903 103952 105803 107502 109250 111395 114093 117088 120073 123201 126913 131313
64337 131313 136113 141235 147049 153745 160869 167826 174588 181365 187738 192698 195579 196405 195180 191600
64323 191600 185935 179633 174222 169792 165243 159944 154497 149796 146081 143220 141230 139968 138690 136521
64309 136521 133402 130217 127986 127024 126748 126149 124648 122713 121386 121064 121017 120373 119247 118464 118416 118765 119205
64292 119205 119916 121107 122610 124192 125957 128178 130924 134067 137458 140817 143665 145720 147349 149344
64278 149344 152190 155705 159438 163173 166871 170356 173340 175776 177876 179656 180729 180762 179985 178890 177470
64263 177470 175116 171440 166978 162881 160005 158409 157582 156941 156140 155062 153684 152041 150350 149043 148505
64248 148505 148761 149556 150683 152087 153708 155485 157503 159837 162238 164294 165983 167725 169741 171732 173430
64233 173430 175154 177504 180671 184277 187738 190610 192804 194696 196832 199367 201985 204468 206936 209348
64219 209348 211211 212257 213032 214365 216512 219256 222517 226239 229994 233434 237058 241743 247369 252551
64205 252551 255951 257390 257448 256476 254297 250570 245198 238635 231911 226044 221267 217066 213041 209372 206297
64190 206297 203585 200823 198025 195632 194042 193341 193397 194054 195188 196593 197837 198468 198564 198916 200340 202854
64174 202854 205865 209069 212782 217423 223119 229897 237822 246754 256269 265993 275798 285649 295589 305883
64160 305883 316822 328301 339947 351616 363310 374512 384159 391483 396419 398995 398848 395696 389894
64147 389894 382166 373123 363293 353266 343406 333762 324593 316560 309884 303666 296702 288921 281481 275351
64133 275351 270249 265147 259530 253866 248937 244965 241621 238765 236798 236009 235903 235686 235273 235175 235387 235091
64117 235091 233804 232201 231347 231543 232403 233690 235541 237967 240643 243241 245696 248162 250787 253514 256203
64102 256203 259136 263228 269219 276724 284736 293082 302557 313399 324595 335279 345922 357362 369385
64089 369385 381229 392893 404757 416192 425718 432647 437680 441767 445143 447582 448794 448409 446206
64076 446206 442538 437958 432437 425594 417801 410246 403720 398010 392780 388279 384758 381861 379166 376913
64062 376913 375627 375309 375520 376067 377207 379227 382175 385979 390681 396585 404197 413818 425147 437570
64048 437570 450884 465415 481257 497912 514997 533017 552918 575003 598689 623348 648935
64037 648935 675576 702785 729387 754268 776973 797404 815089 829051 838399 842845 842602 838163
64025 838163 830305 820020 808090 794976 781208 767540 754498 742201 730964 721553 714299 708547
64013 708547 703745 700619 700284 702447 705612 709131 713922 720903 729737 739677 750797 763773 779018 796561
63999 796561 816305 837952 861132 886007 913313 943488 976308 1011678 1050150 1092186 1137547
63988 1137547 1185944 1237741 1293409 1352890 1416173 1483993 1557143 1635554 1718913 1807831 1903536
63977 1903536 2006781 2118117 2239159 2372553 2520696 2685547 2869899 3077912 3314045
63968 3314045 3582397 3887691 4236233 4635437 5092904 5616509 6214784 6896257 7668065
63959 7668065 8534906 9498403 10556473 11703215 12929896 14226174 15580169 16977296
63951 16977296 18398928 19821720 21217697 22555171 23800681 24921703 25889469 26681193
63943 26681193 27280952 27678752 27868390 27845762 27608900 27159475 26504704 25658860 24643902
63934 24643902 23488521 22225319 20887134 19504228 18103134 16706772 15335041 14005513
63926 14005513 12733946 11534237 10417645 9391720 8459698 7620812 6871347 6205809 5617721
63917 5617721 5100016 4645344 4246452 3896510 3589314 3319420 3082122 2873070 2687734
63908 2687734 2521462 2370421 2232521 2107112 1993572 1890354 1795528 1708027 1627884 1555136
63898 1555136 1488767 1426943 1368088 1311493 1257000 1204510 1153935 1105348 1058865 1014355 971411
63887 971411 929690 889287 850731 814524 780566 748070 716176 684691 654227 625667 599648
63876 599648 576406 555780 537204 519956 503621 488260 474058 460992 449011 438279 428952 420783
63864 420783 413238 406073 399563 394119 389890 386805 384835 384019 384226 385084 386301 388098 391116 395634 400942
63849 400942 405816 409756 413410 417504 421655 424647 425694 424893 422478 418322 412479 405638 398450 390625
63835 390625 381272 370146 358069 345972 333983 321790 309594 298194 288148 279237 270953 263224
63823 263224 256415 250670 245579 240547 235331 230101 225122 220471 216087 211926 208024 204451 201213 198212
63809 198212 195283 192314 189305 186328 183393 180399 177253 174069 171279 169447 168826 168992 168981 167975 165999
63794 165999 163888 162462 161726 160996 159760 158156 156473 154527 151965 149064 146725 145448 144723 143724 142287
63779 142287 140837 139628 138552 137607 136985 136632 136196 135615 135416 136086 137408 138632 139179 138976 138251 137260 136152
63762 136152 134928 133578 132330 131675 132001 133246 134930 136472 137457 137846 138025 138531 139582 140974 142438 143880
63746 143880 145244 146430 147589 149213 151690 154934 158758 163375 169190 176168 183807 191730 199992 208828
63732 208828 218394 228785 239941 251472 262852 273825 284319 293908 301810 307658 311892 314967 316429
63719 316429 315261 311125 304798 297300 288968 279621 269337 258696 248324 238473 229092 220124 211653
63706 211653 203905 197208 191838 187737 184365 180964 177113 173067 169558 167198 165992 165410 164973 164751 165230
63691 165230 166683 168771 170858 172668 174547 177101 180723 185473 191270 198042 205654 213813 222222 230924
63677 230924 240359 250805 261724 271914 280445 287217 292434 295865 297042 296006 293299 289161 283310
63664 283310 275759 267336 258917 250446 241283 231445 221934 213696 206686 200272 194221 188906 184687 181501
63650 181501 179071 177165 175570 174117 172962 172612 173443 175273 177609 180141 182779 185465 188364 192107 197264
63635 197264 203529 209902 215851 221789 228258 235225 242586 250768 260232 270775 281925 293787 306860
63622 306860 321214 336464 352395 368950 385640 401598 416203 429059 439469 446692 450792 452551
63610 452551 452473 450650 447735 445118 443735 443375 443437 443646 443636 442712 440625 437932 434945 430997 425413 418585
63594 418585 411253 403331 394312 384429 374386 364221 353500 342542 332432 323643 315539 307516 299900
63581 299900 293431 288468 284993 282880 281807 281314 281266 282085 284299 288023 292876 298265 303878 310137 318013
63566 318013 328056 339803 352485 365983 380584 396124 412108 428491 445458 462504 478630
63555 478630 493553 507745 521047 532225 540464 546442 551343 555535 558972 562303 566627 572298 578678
63542 578678 584946 590610 595379 599117 601941 603876 604402 602699 598329 591410 582157 570541 556396 539646
63528 539646 520514 499750 478487 457567 437056 416642 396434 377107 359406 343756 330293
63517 330293 318924 309306 300973 293515 286602 280006 273826 268526 264478 261569 259437 257987 257390 257687
63503 257687 258678 260150 261919 263719 265410 267359 270279 274548 279857 285670 291856 298759 306713 315670
63489 315670 325312 335405 345901 356661 367244 377248 386767 396096 404878 411988 416546 418697 418957
63476 418957 417124 412504 405139 396075 386252 375723 364288 352386 340797 329795 319180 309042
63464 309042 299919 292088 285162 278676 272716 267698 263755 260679 258371 256951 256372 256270 256352 256808 258160
63449 258160 260847 265046 270696 277454 284745 292132 299731 308098 317721 328757 341224 355200 370688
63436 370688 387452 405181 423768 443305 463804 485035 506696 528715 551220 574058 596387
63425 596387 616946 634821 649766 661627 669750 673340 672401 668003 661596 654271 646659 639109 631673
63412 631673 624091 616060 607502 598451 588749 577960 565553 551127 534562 516133 496565 476952
63400 476952 458456 441805 426925 413207 400278 388406 378009 369002 360984 353917 348168 343846
63388 343846 340546 337943 336357 336517 338927 343470 349416 355774 362093 369060 377958 389308 402383 416240
63374 416240 430838 446755 464184 482755 502168 522429 543308 563935 583171 600192 614643
63363 614643 626348 635013 640229 641776 639948 635504 629326 622196 614817 607750 601202 595085 589335 583909
63349 583909 578442 572283 565081 556925 547594 536121 521669 504640 486440 468296 450843 434649
63337 434649 420237 407364 394922 382056 368996 356524 345040 334683 325954 319417 314733 310688
63325 310688 306476 302551 299786 298145 296713 294967 293462 293057 293867 295316 296917 298595 300340 301982 303362
63310 303362 304393 304855 304437 303113 301296 299447 297715 296013 294228 292259 290102 288048 286585 285870 285502
63295 285502 285063 284755 285210 286645 288414 289505 289518 289143 289536 291037 292684 293283 292863 292602 293299 294519 295467
63278 295467 296089 296837 297886 299187 300946 303303 305752 307603 308959 310587 312781 315066 317166 319561 322695
63263 322695 326206 329398 332136 334761 337352 339594 341385 343221 345820 349400 353356 356642 358605 359539
63249 359539 360435 362216 365319 369819 375521 381869 388151 394087 400067 406676 414204 422710 432249 442776
63235 442776 454154 466575 480718 497009 514852 533091 551279 570026 589974 610879 631985
63224 631985 652912 673740 694362 714298 733250 751518 769690 788126 806927 826217 846193
63213 846193 866885 888029 909229 930106 950263 969110 985755 999052 1007933 1011878 1011073 1006017
63201 1006017 997019 984195 967865 948670 927199 903768 878714 852813 827247 803185 781426
63190 781426 762291 745746 731733 720525 712712 708748 708523 711398 716613 723682 732623 743865 757755
63177 757755 773997 791648 809794 828224 847403 867912 889913 912994 936446 959810 983139
63166 983139 1006590 1029779 1051893 1072479 1091669 1109456 1125128 1137772 1147001 1152730 1154560 1151899
63154 1151899 1144570 1132768 1116471 1095511 1070389 1042629 1014039 985811 958364 931801 906319
63143 906319 882338 860311 840403 822437 806269 791987 779437 767813 756248 744806 734301
63132 734301 725069 716505 708051 700088 693326 687700 682465 677275 672587 668873 665871 662961 660134 658209
63118 658209 657964 659206 660933 662377 663609 665080 666953 669213 672097 675865 680259 684741 689278 694319
63104 694319 699936 705644 711330 717698 725276 733470 741153 747905 754151 760426 767123 774720 783421 792492
63090 792492 800693 807622 814095 820961 828065 834709 840642 846135 851419 856606 861961 867672 873314 878052
63076 878052 881497 884047 886304 888451 890341 891878 893092 894087 895183 896939 899723 903349 907413 912020
63062 912020 917910 925776 935643 947063 959810 974274 991122 1010646 1032504 1056177 1081672 1109656
63050 1109656 1140799 1175147 1212304 1252132 1294925 1340810 1389246 1439308 1490399 1542571 1596129
63039 1596129 1650978 1706327 1761084 1814601 1866969 1918552 1969411 2019443 2068856 2118034 2166778
63028 2166778 2214045 2258523 2299137 2334832 2364310 2386352 2400150 2405018 2400091 2384794 2359527 2325460
63016 2325460 2283656 2234767 2179648 2119903 2057623 1994766 1932887 1873321 1817398 1766354 1720977
63005 1720977 1681400 1647540 1619801 1599106 1586078 1580492 1581773 1589673 1603977 1623801 1647887 1675661
62993 1675661 1707475 1743592 1783316 1825368 1868739 1912971 1957886 2003380 2049307 2095254 2140451
62982 2140451 2184070 2225547 2264455 2300072 2331162 2356174 2373658 2382663 2382824 2373998 2355775 2327499
62970 2327499 2288945 2240963 2185313 2123840 2057854 1988317 1916460 1843920 1772135 1701796 1633205
62959 1633205 1567174 1505135 1448199 1396397 1349104 1305883 1266574 1230801 1197979 1167807 1140214
62948 1140214 1114731 1090422 1066797 1044509 1024702 1007661 992416 977801 963703 951048 940537
62937 940537 931692 923410 915239 907613 900762 893987 886482 878492 871101 864947 859624 854406 849135 844241
62923 844241 840149 836827 833815 830670 827364 824086 820597 816174 810451 804009 797766 792009 786460 780978
62909 780978 775626 770260 764762 759621 755570 752490 749283 745053 739973 734822 730077 725623 720925 715382
62895 715382 708843 701890 695227 688825 682155 675201 668538 662330 656035 649429 643182 638001 633807 630254
62881 630254 627446 625499 623817 621525 618447 615137 612154 609699 607740 606058 604427 603128 603013 604547
62867 604547 607026 609251 610760 611893 612862 613500 613897 614613 616007 617818 619674 621651 624001 626508 628445
62852 628445 629277 629310 629561 630832 632922 634877 635995 636424 636776 637528 638877 640809 642957 644680 645579 645830
62836 645830 645805 645571 644978 644012 642736 641079 638950 636444 633704 630693 627296 623479 619210 614494 609669
62821 609669 605384 601974 599143 596541 594295 592592 591026 588892 586009 582882 580113 578025 576713 576065
62807 576065 575792 575749 576168 577323 579123 581363 584182 587942 592739 598386 604739 611681 618911 626113 633297
62792 633297 640720 648621 657341 667474 679472 693244 708562 725730 745464 768259 794257 823571
62780 823571 856242 891983 930443 971702 1016135 1063953 1115262 1170360 1229395 1291855 1356981
62769 1356981 1424537 1494479 1565872 1636808 1705453 1770479 1830365 1883112 1927018 1961200 1985024
62758 1985024 1997547 1997924 1985993 1962214 1927399 1882742 1829733 1769745 1704017 1634131 1562032 1489389
62746 1489389 1417385 1347221 1280091 1216272 1155002 1095886 1039893 988268 941017 897316 857053
62735 857053 820871 788647 759047 731068 705239 682635 663142 645405 628334 612033 597156
62724 597156 583898 571936 561110 551728 544183 538517 534444 531640 529904 529151 529372 530529 532460 534978
62710 534978 538202 542655 548929 557282 567631 579835 593886 609962 628345 649171 672262 697593
62698 697593 726021 759040 797411 840403 886868 936743 990928 1049958 1113558 1181357 1253137
62687 1253137 1328114 1404583 1480540 1554148 1623464 1686460 1741629 1788031 1824351 1848555 1859017
62676 1859017 1855577 1839007 1809947 1769093 1718080 1659268 1594601 1525287 1452641 1378570 1304923
62665 1304923 1232833 1162969 1096050 1032759 973358 917772 866030 818349 774740 734806 698063
62654 698063 664367 633810 606206 580913 557331 535405 515472 497663 481675 467080 453644
62643 453644 441351 430297 420599 412159 404528 397256 390392 384321 379023 373776 367827 361140 354360 348212
62629 348212 343056 338868 335435 332630 330474 328808 327022 324576 321815 319815 319188 319468 319954 320639 321815
62614 321815 323179 324063 324464 325249 327206 330341 334192 338430 342973 347886 353394 359758 366974 374790 383137
62599 383137 392343 402736 414314 427038 441257 457478 475731 495583 516921 540439 567078 597084
62587 597084 629858 664603 700794 737985 775578 813081 850319 886932 921667 952542 977865
62576 977865 996939 1009784 1016523 1017158 1011648 999942 982135 958926 931833 902624 872450 841704
62564 841704 810711 780213 750978 723141 696298 670202 645125 621425 599099 578024 558315
62553 558315 540050 522762 505774 489156 473849 460527 448657 437059 425164 413407 402594
62542 402594 393267 385504 378971 373202 368099 364017 361099 358829 356689 355008 354603 355636 357409 359234
62528 359234 360979 362843 365192 368634 373545 379427 385401 391504 398731 407574 417377 427638 439116 452946
62514 452946 469250 487482 507721 530681 556654 585325 616663 651161 688960 729362 771458
62503 771458 814689 858479 901702 942948 981174 1015769 1046001 1070589 1087912 1096762 1097031 1089703
62491 1089703 1076041 1056802 1032239 1002728 969191 932977 895535 858136 821673 786595 753135
62480 753135 721634 692589 666373 643044 622413 604227 588269 574368 562399 552353 544392 538738
62468 538738 535313 533538 532602 531981 531619 531706 532501 534301 537307 541506 546887 553689 562058 571520 581287 591206
62452 591206 601886 613621 625606 636637 646175 654255 660670 664886 666716 666487 664280 659389 650854
62439 650854 638538 623538 607421 591056 574343 557097 539965 524085 510037 497696 487093
62428 487093 478737 472765 468438 465008 462702 462321 464151 467863 473255 480478 489487 499756 510699 522078
62414 522078 533966 546446 559315 571932 583482 593531 602072 608893 613308 614845 613850 610924 606076
62401 606076 599030 590126 580249 569899 559023 547850 537263 528055 520180 513003 506075 499549 494092
62388 494092 490485 489099 489731 492097 496352 502786 511135 520727 531494 544433 560779 580912 604241
62375 604241 630047 658290 689638 724662 762992 803407 844823 886975 929902 973093 1015539
62364 1015539 1056352 1094820 1130052 1161213 1188191 1211462 1231137 1246534 1256809 1261570 1260766 1254489
62352 1254489 1243157 1227601 1208709 1187233 1164040 1140118 1116030 1091578 1066290 1040174 1013841
62341 1013841 988073 963368 939846 917521 896729 878116 861951 847584 833988 820769 808283
62330 808283 796815 786209 776338 767265 758705 749905 740478 730887 721663 712524 702742 692104 680954
62317 680954 669448 657310 644300 630464 615873 600535 584675 568801 553308 538224 523424
62306 523424 509009 495347 482887 471953 462628 454688 447713 441363 435631 430883 427654 426301 426790
62293 426790 428728 431631 435166 439223 443839 449022 454666 460699 467271 474652 482852 491591 500741 510576
62279 510576 521310 532616 544025 555628 567948 581072 594377 607321 620153 633674 648645
62268 648645 665646 685206 707640 732804 760268 789756 821330 855215 891571 930349 971123
62257 971123 1012981 1054586 1094370 1130731 1162156 1187373 1205509 1216264 1219878 1216815 1207385 1191779
62245 1191779 1170466 1144302 1114150 1080650 1044542 1006922 968784 930551 892470 855375 820606
62234 820606 789094 760870 735441 712320 691169 671872 654667 639917 627561 616968 607408 598541
62222 598541 590479 583586 578119 573829 569983 566132 562729 560597 559881 559997 560567 561798 563828 566346 569171
62207 569171 572760 577782 584468 592548 601522 610812 620068 629631 640464 653427 668758 686217 705291
62194 705291 725275 745737 767125 790380 815621 841678 867159 891403 914071 934518 952188
62183 952188 967163 979628 989220 995582 999359 1001959 1004484 1007528 1011853 1018463 1027952 1040374 1055875
62170 1055875 1074869 1097361 1122545 1149291 1176735 1204168 1230648 1255012 1276318 1294264 1309168
62159 1309168 1321425 1330949 1337398 1341012 1342731 1343055 1341180 1335905 1327234 1316503 1304980 1292996 1280486
62146 1280486 1267734 1255264 1243455 1232505 1222457 1213009 1203590 1193767 1183372 1172239 1160296 1148029
62134 1148029 1136373 1125822 1116043 1106665 1098086 1091104 1086031 1082627 1080655 1080008 1080372 1081304 1082781 1085319
62120 1085319 1089440 1095290 1102826 1112006 1122606 1134155 1146376 1159490 1173845 1189346 1205591 1222481
62108 1222481 1240310 1259211 1278868 1299016 1319967 1342397 1366775 1393239 1421827 1452466 1484819
62097 1484819 1518572 1554003 1591970 1633221 1677868 1725601 1776095 1829072 1884131 1940734 1998205
62086 1998205 2055711 2112459 2168157 2223201 2278317 2334069 2390606 2447551 2503794 2557551 2606882
62075 2606882 2650430 2687929 2720304 2749292 2776634 2803449 2830326 2857689 2885675 2913797 2941375
62064 2941375 2968401 2995405 3022295 3047989 3071566 3093181 3113438 3132533 3150684 3168866 3188089
62053 3188089 3208079 3227473 3245355 3261998 3278196 3294667 3312203 3331640 3353253 3376615 3401252
62042 3401252 3427060 3454004 3481886 3510592 3540085 3569905 3599127 3627065 3653638 3678864 3702382
62031 3702382 3723709 3742504 3758305 3770491 3778941 3784335 3787288 3787453 3784003 3776834 3766852 3755123 3742173
62018 3742173 3728080 3712852 3696635 3679868 3663276 3647495 3632766 3619192 3607252 3597717 3591024 3587067
62006 3587067 3585684 3587106 3591779 3599885 3611168 3625128 3641329 3659553 3679565 3700546 3720776 3738123
61994 3738123 3751046 3759134 3762872 3763157 3761049 3757566 3753331 3748423 3742669 3736027 3728669 3720883 3713053 3705562
61980 3705562 3698434 3691032 3682270 3671152 3657170 3640375 3621252 3600384 3577928 3553424 3526365 3496921
61968 3496921 3465820 3433528 3399945 3365087 3329625 3294362 3259405 3224277 3188778 3153379 3118767
61957 3118767 3085415 3053666 3023855 2996125 2970311 2946221 2923907 2903506 2884967 2868221 2853561
61946 2853561 2841669 2833110 2827853 2825350 2825107 2827109 2831608 2838661 2848153 2860368 2876035 2895478 2917931
61933 2917931 2942226 2968149 2996657 3028774 3064755 3104496 3148217 3196388 3249353 3307515 3371840
61922 3371840 3443932 3525832 3620022 3729458 3857248 4006354 4179771 4380836 4613089 4879953
61912 4879953 5184839 5531400 5923364 6364132 6856701 7403587 8005871 8661452 9363462
61903 9363462 10099196 10848935 11584660 12270063 12863331 13322655 13612966 13711972 13613966 13330429
61893 13330429 12887157 12318799 11662541 10953045 10219754 9486279 8770750 8086398 7442179
61884 7442179 6843337 6291872 5787390 5328510 4913861 4541559 4208059 3908528 3638896
61875 3638896 3396995 3181287 2989203 2817600 2664358 2528363 2407919 2300222 2202809 2114755
61865 2114755 2035958 1965885 1903606 1848580 1800612 1759103 1722921 1691160 1663640 1640541 1621817
61854 1621817 1607093 1595891 1587773 1582369 1579371 1578396 1578696 1579145 1578841 1577819 1576900 1576561 1576181 1574723 1572093
61839 1572093 1569330 1567435 1566521 1566326 1567065 1569225 1572784 1577128 1581662 1586149 1590506 1594670 1598634 1602204 1604778
61824 1604778 1605803 1605528 1604917 1604760 1605277 1606766 1610151 1616463 1625916 1637886 1651828 1667959 1686967 1709203
61810 1709203 1734426 1762421 1793704 1829331 1869963 1915431 1965388 2020107 2080400 2147021 2220530
61799 2220530 2301602 2391042 2489545 2597849 2717171 2849196 2995684 3158514 3340115 3543460
61789 3543460 3771553 4027411 4314762 4638436 5003870 5416514 5881945 6406253 6995923
61780 6995923 7657419 8397024 9220878 10134699 11142946 12247383 13444875 14724638 16065459
61771 16065459 17433412 18780417 20044691 21154771 22037829 22630762 22890780 22802395 22379111
61762 22379111 21659808 20701187 19568256 18325160 17028524 15724608 14449478 13229988
61754 13229988 12084264 11022473 10048790 9163568 8364264 7645673 7001089 6424114 5909209
61745 5909209 5450652 5041892 4676433 4348911 4055034 3791021 3553570 3339962 3147665
61736 3147665 2974065 2816927 2674824 2546616 2430741 2325470 2229754 2143310 2065823 1996387
61726 1996387 1933716 1876604 1824148 1775743 1730977 1689484 1650962 1615345 1582753 1553174 1526456
61715 1526456 1502740 1482510 1465884 1452128 1440315 1430250 1422249 1416111 1410917 1405930 1401189 1396907
61703 1396907 1392659 1387542 1381053 1373566 1365970 1358947 1352541 1346222 1339275 1331149 1321509 1310157 1297148
61690 1297148 1282972 1268388 1253840 1239060 1223388 1206497 1188776 1171026 1153938 1137882 1122995
61679 1122995 1109192 1096075 1083131 1070229 1057874 1046890 1037913 1031216 1026776 1024249 1022992 1022408 1022318
61666 1022318 1022916 1024412 1026864 1030244 1034435 1039200 1044371 1050047 1056396 1063239 1069996 1076045 1081060 1085159
61652 1085159 1088818 1092388 1095431 1096889 1096266 1094323 1092076 1089469 1085769 1080992 1075971 1071022 1065665 1059906
61638 1059906 1054720 1050715 1047242 1043596 1040263 1038152 1037308 1037403 1038933 1042661 1048040 1053371 1057671 1061443 1065403
61623 1065403 1069324 1072480 1074544 1075682 1076323 1077204 1079119 1082205 1085794 1089284 1092817 1096861 1101440 1106074
61609 1106074 1110180 1113301 1115211 1116174 1116926 1118063 1119428 1120162 1119269 1116171 1111039 1104676 1097843 1090607 1082576
61594 1082576 1073698 1064444 1055191 1046068 1037583 1030688 1025647 1021282 1016051 1009653 1003067 997279 992707 989754
61580 989754 989055 990901 994961 1000889 1008832 1019155 1032075 1047767 1066310 1087187 1109264 1131740 1154951
61567 1154951 1179793 1206539 1234583 1263135 1291628 1319574 1346640 1373109 1399803 1427290 1455378
61556 1455378 1483504 1511260 1538410 1564755 1590327 1615416 1640033 1663483 1684799 1703502 1719596
61545 1719596 1732888 1742756 1748651 1750527 1748583 1742835 1733207 1719908 1703528 1684761 1664175 1642296
61533 1642296 1619765 1597279 1575411 1554619 1535424 1518333 1503419 1490175 1478153 1467753 1460033
61522 1460033 1455707 1454677 1456751 1462407 1472519 1487559 1507438 1532032 1561617 1596905 1638978 1689051
61510 1689051 1748047 1816453 1894833 1984224 2085722 2199917 2327279 2469048 2627209 2803409
61500 2803409 2998156 3210987 3440896 3686362 3945136 4213830 4487128 4757105 5013622
61491 5013622 5245792 5443377 5597694 5702589 5755445 5757234 5711521 5623639 5500637 5350920
61481 5350920 5182945 5003969 4819971 4636151 4456847 4285168 4123237 3972901 3835942
61472 3835942 3713601 3606135 3512889 3432826 3365139 3309563 3266078 3234233 3212915 3200763 3196678
61461 3196678 3200003 3210582 3228713 3254544 3287216 3324856 3365656 3408705 3453513 3499107 3544100
61450 3544100 3587523 3629205 3669465 3708828 3748077 3788159 3829815 3873327 3918651 3965683 4014402
61439 4014402 4064799 4116661 4169490 4222715 4275794 4327810 4377063 4421625 4460401 4493146 4519185
61428 4519185 4536760 4544180 4541311 4529282 4508970 4480439 4443940 4400776 4352805 4301428 4247421 4191692
61416 4191692 4135778 4081439 4029885 3981713 3937669 3899119 3867433 3843055 3825556 3814500 3809684
61405 3809684 3810430 3815246 3822520 3831149 3840216 3848513 3854840 3858493 3859044 3855950 3848898 3838452 3826047 3813457
61391 3813457 3802662 3796086 3796437 3806095 3826757 3859701 3906322 3968512 4048580 4148574 4269571 4411794
61379 4411794 4575477 4761284 4969678 5200164 5451145 5719968 6002643 6293726 6586573
61370 6586573 6873267 7144122 7388067 7594567 7755543 7865872 7923192 7928123 7884205 7796507
61360 7796507 7669898 7508605 7316724 7098371 6857620 6599098 6328485 6051699 5773556
61351 5773556 5497759 5227842 4967288 4718712 4483767 4263964 4060817 3875010 3706168
61342 3706168 3553747 3417595 3297440 3192458 3101754 3024887 2961592 2911357 2873547 2847645
61332 2847645 2833073 2829010 2834535 2848751 2870652 2899151 2933373 2972680 3016356 3063523 3113406 3165372
61320 3165372 3218587 3271852 3323981 3374264 3422584 3469065 3513403 3554378 3590411 3620941 3646963
61309 3646963 3669741 3689291 3704717 3715827 3723702 3729668 3734220 3736850 3736335 3731204 3720627 3704962 3684930
61296 3684930 3660385 3630496 3595028 3554592 3509649 3460233 3406889 3351017 3293970 3236642 3180227
61285 3180227 3126385 3076125 3029361 2986233 2948016 2915864 2889345 2867245 2849351 2836415 2828551
61274 2828551 2824699 2823663 2824684 2826695 2827809 2826107 2820646 2811383 2798333 2781159 2759641 2734440 2707250
61261 2707250 2680013 2654012 2630068 2609660 2595372 2589808 2594301 2609066 2634333 2670862 2719501 2780764
61249 2780764 2854909 2941962 3041461 3152345 3273150 3402131 3537115 3675337 3813314 3946616
61239 3946616 4069767 4176578 4260746 4316373 4338637 4324908 4275660 4194108 4084793 3952672
61229 3952672 3803446 3644023 3481616 3321984 3168573 3023245 2887340 2761750 2646451
61220 2646451 2540650 2443507 2354405 2272697 2197816 2129836 2069416 2016850 1971596 1933002 1900953
61209 1900953 1875341 1855376 1840117 1829373 1823309 1821329 1822149 1824890 1829259 1834531 1839238 1842294 1843849
61196 1843849 1844653 1845063 1845021 1844516 1843548 1841892 1839317 1835866 1831614 1826295 1819432 1810739 1800265 1788232 1774847
61181 1774847 1760104 1743745 1725529 1705483 1683678 1659938 1634230 1607254 1580105 1553365 1527040
61170 1527040 1501384 1477043 1454116 1431779 1409221 1386484 1363997 1341846 1319938 1298382 1277166
61159 1277166 1255757 1233512 1210173 1185524 1158916 1129759 1098423 1066181 1034285 1003404 973736
61148 973736 945239 917814 891650 867428 845942 827488 811752 798235 786655 777118 770044 765763
61136 765763 764000 763918 764811 766547 769282 773047 777844 783815 791033 799320 808556 819008 831122 845118
61122 845118 860942 878444 897472 917956 939920 963153 986853 1010022 1032256 1053647 1073767
61111 1073767 1091384 1105557 1116439 1124545 1129719 1131450 1129843 1125612 1119252 1110870 1100684 1089135 1076446
61098 1076446 1062615 1047950 1033209 1018987 1005237 991548 977732 964014 950753 938118 926032
61087 926032 914337 902814 890998 878278 864546 850631 837686 826130 815565 805621 796356 787748
61075 787748 779431 771215 763388 756204 749495 743012 736764 730751 724742 718565 712256 705783 699107 692663
61061 692663 687207 682883 679086 675568 673033 672080 672187 672374 672459 673022 674456 676667 679418 682470 685623 689156
61045 689156 693920 700450 708247 716408 724659 733237 742036 750526 758383 765725 772843 780076 787756 795827
61031 795827 803738 811110 818309 825990 834372 843357 853032 863586 874949 886960 899671 913121 927165
61018 927165 941823 957414 973985 991119 1008798 1027885 1049138 1072165 1096005 1120365 1145761
61007 1145761 1172894 1202546 1235620 1272549 1313001 1356799 1404662 1457362 1514604 1575486 1639545
60996 1639545 1706599 1776288 1849013 1926981 2013210 2109673 2217370 2337852 2473514 2626588
60986 2626588 2799188 2994659 3218355 3477511 3781370 4141138 4568708 5075539 5673611
60977 5673611 6377249 7204186 8177733 9330977 10707622 12354237 14308079 16585584 19163066
60968 19163066 21939539 24703146 27153362 29004115 30115564 30558425 30564684 30413245 30334662
60959 30334662 30466455 30828996 31300856 31626763 31500331 30698696 29182507 27093834 24668353
60950 24668353 22135834 19665383 17358227 15262614 13392399 11743439 10304523 9061108
60942 9061108 7995424 7087663 6318035 5667263 5116210 4646765 4243345 3893176 3585836
60933 3585836 3313364 3070274 2852472 2656358 2479292 2320043 2177739 2050754 1937215
60924 1937215 1835951 1745898 1664929 1590130 1519148 1450771 1384713 1321533 1262327 1207655 1156970
60913 1156970 1109677 1066254 1027477 992923 961268 931936 905524 882556 862600 844760 828382
60902 828382 813114 798788 785416 773039 761584 751141 742227 735357 730521 727462 726217 726877 728934
60889 728934 731483 734082 737011 740656 745012 749713 754198 757900 760689 763164 766167 770045 774613 779684
60875 779684 785272 791208 796948 801829 805401 807554 808495 808534 807710 805762 802544 798272 793129 786863 779093
60860 779093 769924 760092 750569 742121 735002 728899 723308 718117 713672 710304 708191 707763 709681 714083
60846 714083 720242 727364 735433 744991 756321 769219 783265 797988 812962 828017 843137 858019
60834 858019 872110 885344 898425 912012 925961 939763 953346 966963 980515 993418 1004998
60823 1004998 1014703 1022237 1027875 1032425 1036558 1040381 1043883 1047341 1050834 1053724 1055195 1055142 1054049 1052157
60809 1052157 1049177 1044707 1038545 1030668 1021119 1009811 996401 980775 963812 947025 931087 915288
60797 915288 898981 882946 868651 856700 846855 839122 833832 830785 829311 829247 831029 834643 839192 843779
60783 843779 848322 853293 858970 865046 870728 875204 878329 880763 883147 885374 886944 887862 888727 890163 892519
60768 892519 895856 899715 903213 905920 908413 911436 914913 918502 922728 928573 936067 944284 952778 962090
60754 962090 972662 984225 996553 1009938 1024382 1038966 1052620 1065100 1076788 1087908 1098275
60743 1098275 1107525 1115349 1121733 1127120 1131979 1136141 1139052 1140749 1141992 1143192 1143767 1142939 1140637 1137191
60729 1137191 1132517 1126121 1117702 1107342 1095249 1081630 1066744 1050843 1034120 1016775 998900 980323
60717 980323 960886 940990 921419 902461 883642 864632 846011 828786 813486 800106 788636
60706 788636 779076 771077 764057 757835 752893 750015 749776 752268 757037 763330 770587 778692 787674 797291
60692 797291 807130 816947 826630 835868 844126 850979 856197 859327 859501 855957 848815 839154 828195 816457
60678 816457 803801 790174 776070 762186 748863 736099 724024 713086 703723 696054 689991 685441
60666 685441 682242 679992 678136 676331 674633 673277 672312 671517 670613 669384 667603 665063 661896 658739 656407
60651 656407 655436 655994 657975 660917 664046 666830 669396 672017 674407 676133 677708 680486 685206 691243 697621
60636 697621 704231 711650 720328 730458 742185 755355 769317 783553 798283 814025 830788 848111
60624 848111 865527 882466 898109 912077 925144 938595 952904 967458 981382 994005 1004694
60613 1004694 1013059 1019432 1024532 1028542 1030999 1031681 1031031 1029570 1027349 1024165 1019909 1014561 1008218 1001280
60599 1001280 994334 987732 981486 975439 969215 962172 953932 944925 935908 926989 917684 907986 898712 890655
60585 890655 883917 878250 873517 869557 866125 863303 861553 861013 861046 860827 860154 859423 859036 859058 859245 859123 858201
60568 858201 856311 853694 850700 847491 844042 840189 835681 830421 824736 819190 814081 809316 804811 800790
60554 800790 797679 795913 795877 797788 801558 806909 813553 821181 829469 838391 848447 860329 874570 891764
60540 891764 912879 938896 970265 1007046 1049342 1097094 1149571 1205417 1262798 1318795 1369000
60529 1369000 1408744 1435089 1447271 1445580 1430828 1404995 1371283 1333000 1292837 1253312 1216874
60518 1216874 1185036 1158058 1136046 1119765 1109852 1105746 1106063 1109721 1116167 1124880 1135243 1146807 1159333
60505 1159333 1172694 1187125 1203499 1223142 1247487 1277970 1315967 1362721 1419653 1488836 1572734
60494 1572734 1673390 1792384 1931696 2093719 2279794 2489307 2720948 2974541 3250941
60485 3250941 3550324 3871044 4209560 4559759 4910992 5246526 5544476 5781445 5937161
60476 5937161 5997960 5958082 5819601 5592252 5293024 4944030 4568391 4186180 3812616 3458338
60466 3458338 3130169 2831594 2563366 2324464 2113052 1927018 1764136 1622036 1498290
60457 1498290 1390698 1297425 1216693 1146469 1084805 1030536 983330 942935 908535 878774 852158
60446 852158 827559 804682 783975 765688 749123 733287 718101 704311 692237 681363 671216
60435 671216 661800 652921 643983 634987 627001 621002 616782 613500 610739 608416 606189 603772 601519 599973
60421 599973 598994 597995 596922 596452 597269 599592 603344 608299 614040 620096 626110 631771 636790 641231 645577
60406 645577 650157 654745 659055 663346 668187 673843 680241 687237 694529 701590 708136 714437 720740 726673
60392 726673 731754 736192 740579 744923 748652 751551 754134 756962 760043 762931 765051 765891 765321 763823 762077
60377 762077 760222 757830 754566 750582 746204 741686 737358 733655 730753 728330 725873 723097 719999 716640
60363 716640 713036 709221 705410 702098 699950 699397 700256 701754 703030 703749 704342 705631 708090 711478 715242
60348 715242 719147 723410 728368 734236 740958 747979 754339 759438 763572 767279 770335 772059 772539 772785 773549
60333 773549 774700 775952 777375 778838 779712 779705 779443 779749 780846 782700 785457 788956 792354 794951 796986 799033
60317 799033 801014 802441 803194 803339 802601 800867 798920 797862 797889 798284 798473 798326 797621 796066 793953 792086
60301 792086 790870 789986 789021 787924 786784 785703 784989 784985 785566 786126 786147 785527 784421 783100 781872 780853 779928
60284 779928 779312 779903 782570 787187 792835 798857 805319 812556 820782 830074 840258 850848 861467 872285
60270 872285 883753 896196 910047 925989 944191 963713 983536 1004002 1026398 1051227 1077868
60259 1077868 1106074 1136778 1171003 1208786 1249662 1293643 1341254 1393062 1449611 1511509 1579156
60248 1579156 1652617 1731994 1817675 1909994 2008902 2114095 2225218 2341849 2463469 2589424
60238 2589424 2718405 2847892 2974540 3095371 3208300 3311474 3402652 3479665 3541238 3587071
60228 3587071 3617322 3632293 3632562 3619222 3593890 3558463 3514917 3465570 3413580 3362693 3316030 3275291
60216 3275291 3241495 3216134 3201009 3197234 3205199 3225500 3259068 3306234 3366377 3438792 3523369 3620106
60204 3620106 3728407 3846971 3973773 4105824 4239499 4371486 4499051 4619095 4727544
60195 4727544 4820289 4894590 4949284 4983873 4997861 4990885 4963179 4915924 4851299 4772113 4681286
60184 4681286 4581742 4476671 4369545 4263717 4162140 4067419 3981799 3907094 3844947 3797123
60174 3797123 3765079 3749201 3748973 3764019 3794438 3839893 3898914 3969393 4049133 4135325 4223842 4309831
60162 4309831 4389100 4458719 4516486 4560461 4589260 4602517 4600771 4584997 4556423 4516978 4469847
60151 4469847 4419264 4369433 4323611 4284323 4254205 4236158 4232620 4245030 4274204 4321040 4386774
60140 4386774 4472811 4580441 4710646 4864164 5041831 5244752 5473913 5729631 6011616 6319304
60130 6319304 6651650 7006544 7380736 7770283 8170592 8575953 8979472 9373697 9751187
60121 9751187 10104662 10427217 10712629 10955362 11150469 11294108 11384132 11419599 11399565 11323082
60111 11323082 11190733 11005701 10773160 10499274 10191303 9858072 9509513 9155629 8805964
60102 8805964 8469333 8153175 7862998 7602830 7376111 7185782 7033595 6919887 6844142 6805431
60092 6805431 6802187 6831868 6891153 6976376 7083520 7207696 7342709 7481271 7615732 7738838
60082 7738838 7844259 7927002 7983635 8011991 8010664 7979173 7918744 7832398 7723547 7594577 7447097
60071 7447097 7283248 7106105 6918905 6724598 6526306 6327525 6131559 5941083 5758431
60062 5758431 5585905 5425721 5280086 5151362 5041526 4951278 4880248 4828404 4796760 4786392
60052 4786392 4797357 4829062 4881154 4953310 5044292 5151709 5272553 5403446 5540410 5678959
60042 5678959 5814536 5942626 6058564 6157780 6236617 6292836 6325208 6332690 6314179 6269128 6198322
60031 6198322 6103951 5988986 5856732 5710975 5556064 5396341 5235634 5077657 4926670 4786954
60021 4786954 4661451 4551368 4457246 4379916 4320178 4278171 4253711 4247112 4259227 4290713 4341650
60010 4341650 4411931 4501708 4611174 4739907 4886609 5049473 5226421 5414477 5608891 5803372
60000 5803372 5991493 6167674 6326899 6464343 6576024 6659507 6713411 6736600 6728478 6689731
59990 6689731 6621995 6527065 6407371 6267145 6112256 5948747 5782126 5617783 5460855 5315344
59980 5315344 5184190 5070320 4976665 4904747 4854183 4823960 4813375 4821418 4846320 4886422 4940770
59969 4940770 5008290 5087193 5175909 5273729 5379535 5490352 5602045 5711093 5815007 5911550
59959 5911550 5998557 6074417 6137999 6188266 6224635 6247649 6258779 6259826 6253049 6241609 6229210 6219483
59947 6219483 6216243 6224058 6247767 6291486 6358661 6452960 6578349 6738200 6934830 7169923 7444799
59936 7444799 7760009 8114970 8507881 8935492 9392632 9871854 10363161 10853684 11327860
59927 11327860 11768525 12158161 12479602 12716993 12857983 12896081 12831301 12669074 12419054 12094387
59917 12094387 11710683 11284488 10832132 10369163 9909737 9465801 9046696 8659209 8307706
59908 8307706 7994621 7721589 7490324 7302036 7156273 7051236 6985480 6958706 6970618 7019725
59898 7019725 7103777 7220764 7368564 7543582 7740309 7952323 8173117 8395517 8610549 8807311
59888 8807311 8974162 9100126 9175712 9193540 9149380 9043181 8879145 8664557 8408193 8119344
59878 8119344 7807627 7483001 7155306 6833200 6523254 6230009 5956824 5706288 5479716
59869 5479716 5276636 5095201 4932961 4787168 4654917 4533798 4422399 4319825 4224983 4136936
59859 4136936 4055724 3982116 3916596 3859303 3810838 3772191 3743609 3724164 3712506 3707177 3705877 3705266
59847 3705266 3702023 3693615 3677868 3652634 3616482 3569176 3511144 3443171 3367160 3286453 3204638 3124232
59835 3124232 3046892 2974278 2908107 2849775 2800480 2761306 2732669 2714096 2705103 2705951 2717117 2738465
59823 2738465 2769432 2809603 2858615 2915893 2980797 3052386 3128378 3204981 3278543 3346986 3409131
59812 3409131 3463374 3508126 3543176 3569516 3587815 3597817 3599255 3592792 3580189 3564189 3548072 3534741
59800 3534741 3526316 3524966 3533670 3555498 3592517 3646176 3718514 3812079 3928851 4070185 4237934
59789 4237934 4434849 4663706 4926544 5224741 5558965 5928292 6328754 6751591 7181490
59780 7181490 7596083 7967975 8268981 8475050 8570857 8553154 8431293 8224170 7955244 7648147
59770 7648147 7323731 6998383 6683826 6388309 6117646 5875177 5661838 5477365 5321283
59761 5321283 5192430 5088423 5006761 4946207 4906342 4886183 4884173 4899190 4930646 4977926 5040757
59750 5040757 5119938 5216703 5331422 5463744 5613934 5783287 5973500 6186496 6424573 6689728
59740 6689728 6982995 7305388 7659219 8047461 8472023 8933658 9433124 9970813 10544990
59731 10544990 11151387 11784303 12436552 13098240 13757288 14402010 15022523 15610085 16157471
59722 16157471 16661728 17126204 17559516 17973260 18380750 18796014 19232085 19699875 20208254
59713 20208254 20763548 21367629 22016687 22702102 23411627 24129145 24834408 25504481 26115960
59704 26115960 26646602 27076990 27393023 27587968 27662829 27625808 27491674 27280281 27014066 26716259
59694 26716259 26410518 26120173 25866066 25665106 25531243 25477083 25513699 25649537 25890665 26242039
59684 26242039 26707867 27290854 27991507 28807595 29732925 30755708 31857241 33010790 34180404
59675 34180404 35320759 36379064 37298556 38022924 38502003 38698603 38594155 38190876 37510593
59666 37510593 36591633 35484155 34244054 32926989 31584188 30259709 28987944 27791499
59658 27791499 26680376 25652261 24693278 23779986 22883939 21978282 21043822 20072463 19067525
59649 19067525 18041451 17011863 15997305 15013977 14074035 13185472 12353081 11579544 10865797
59640 10865797 10210927 9612521 9067534 8572774 8124830 7720228 7355914 7029198 6737019
59631 6737019 6475757 6242052 6033609 5849042 5687234 5546942 5426572 5324036 5237006 5163329
59621 5163329 5100908 5047263 4999747 4956219 4914822 4872939 4826958 4773509 4710637 4637816 4555524
59610 4555524 4465135 4368589 4267642 4163659 4058235 3953432 3851106 3752478 3658666 3571103
59600 3571103 3491067 3419235 3355963 3301474 3255441 3216990 3185610 3161618 3145323 3136205 3133340 3136121
59588 3136121 3144008 3155969 3170847 3188154 3207986 3230260 3254385 3279618 3305552 3332371 3360759
59577 3360759 3391393 3424602 3460894 3501717 3549004 3603784 3665848 3735112 3812701 3900352 3999307
59566 3999307 4110204 4233567 4369973 4520173 4685439 4867388 5067150 5285117 5521731
59557 5521731 5777862 6053907 6348986 6661450 6989587 7331150 7682626 8039661 8398183
59548 8398183 8754704 9105730 9447373 9775713 10087676 10381962 10659227 10921033 11168586
59539 11168586 11402715 11624593 11835325 12034649 12221152 12394350 12555749 12707282 12849263
59530 12849263 12980007 13096050 13191526 13257871 13285382 13265432 13191433 13058850 12865433 12611410
59520 12611410 12299172 11933325 11521489 11074190 10603008 10118778 9631399 9149915 8681415
59511 8681415 8230097 7798147 7387312 6999248 6635231 6296475 5984297 5699202 5440277
59502 5440277 5206174 4996111 4809177 4643472 4497068 4369353 4260367 4169257 4094519 4035392
59492 4035392 3991836 3963396 3949296 3949702 3965825 3998651 4048386 4115025 4198624 4299108 4416806
59481 4416806 4553142 4709886 4887696 5086217 5305381 5545372 5805031 6081172 6369614
59472 6369614 6665806 6963990 7256593 7535031 7790660 8014751 8198372 8333200 8412718 8432932
59462 8432932 8392606 8293223 8138694 7935092 7690553 7414628 7116702 6804813 6486108 6167638
59452 6167638 5855611 5553957 5264631 4989404 4730566 4489791 4267361 4062969 3876564
59443 3876564 3707958 3556166 3419736 3297561 3189120 3094040 3011508 2940019 2877827 2823952
59433 2823952 2778576 2742119 2714130 2693528 2679602 2672081 2670453 2673968 2682259 2695205 2712061 2731539
59421 2731539 2752948 2776666 2803315 2833144 2866470 2904144 2947172 2996136 3051110 3111627 3176459
59410 3176459 3243890 3312852 3384097 3460507 3546396 3646193 3763303 3900131 4059194 4243665
59400 4243665 4456127 4696843 4963716 5253958 5565697 5898776 6255289 6639652 7057314
59391 7057314 7512589 8007243 8540183 9107203 9700599 10309640 10922005 11525026 12106350
59382 12106350 12654757 13161262 13619661 14026328 14379998 14681704 14934238 15141073 15305363
59373 15305363 15429178 15512774 15554364 15550843 15498825 15395127 15237178 15024049 14757436 14441757
59363 14441757 14084013 13694275 13285659 12872424 12467372 12080763 11720442 11391325 11094382
59354 11094382 10826879 10583714 10358000 10140975 9923092 9696233 9454759 9194858 8914182
59345 8914182 8612729 8293411 7961258 7622252 7282523 6947391 6620410 6303864 6000456
59336 6000456 5713899 5447444 5202410 4978534 4775261 4592275 4429261 4285661 4160538
59327 4160538 4052475 3959919 3881809 3817614 3766634 3727668 3699448 3681125 3672266 3672774 3682891 3702893
59315 3702893 3732651 3771798 3820264 3878308 3946035 4023194 4109192 4202840 4302304 4405844 4512376
59304 4512376 4620655 4728216 4832052 4930178 5021523 5104363 5176148 5235322 5282442 5319137 5346903
59293 5346903 5367411 5383078 5396658 5410848 5428732 5453891 5489272 5536327 5595738 5668474 5755428
59282 5755428 5856227 5968894 6090449 6217382 6345704 6470927 6588069 6691808 6777254 6841043
59272 6841043 6881607 6898480 6891977 6863904 6818013 6759000 6690900 6616361 6536890 6453412 6367012
59261 6367012 6279870 6195733 6119273 6054748 6004901 5970679 5951718 5947221 5956529 5979034 6013862 6059912
59249 6059912 6115987 6180606 6252054 6329252 6412711 6504440 6607141 6723855 6858044 7013241
59239 7013241 7192437 7398117 7632634 7897809 8193859 8518733 8867936 9234233 9607505
59230 9607505 9975379 10323968 10637974 10901207 11098686 11218907 11254125 11199468 11053377 10819226
59220 10819226 10505514 10124157 9688988 9215257 8718620 8213283 7710975 7221215 6751409
59211 6751409 6306450 5889138 5501349 5144264 4817666 4520192 4250635 4008096 3790783
59202 3790783 3595773 3420447 3263251 3122759 2997030 2884423 2784038 2694765 2614700 2542088
59192 2542088 2476059 2415880 2360261 2308023 2258778 2212440 2168770 2127962 2090942 2058412 2030123
59181 2030123 2005617 1985118 1969137 1957731 1950600 1947426 1947752 1951116 1957794 1968838 1985044 2006354
59169 2006354 2032424 2062962 2097213 2134073 2173268 2215651 2261951 2312110 2366319 2425626 2490741
59158 2490741 2561127 2636087 2715955 2801381 2892291 2988437 3090233 3197879 3310127 3424863
59148 3424863 3540508 3655992 3769768 3879732 3983731 4079305 4163391 4233372 4288458 4329408
59138 4329408 4357152 4372410 4376357 4370840 4357987 4340231 4320591 4302293 4288163 4280718 4282574 4296302
59126 4296302 4324198 4368666 4432407 4517725 4625902 4757735 4914209 5096055 5302952 5533656
59116 5533656 5786449 6058769 6346623 6644720 6946444 7242905 7522465 7772337 7980947
59107 7980947 8138919 8239126 8277690 8255488 8178137 8054258 7893824 7707386 7505386 7297194
59097 7297194 7090308 6889791 6697767 6513678 6335739 6162416 5992501 5824304 5655525
59088 5655525 5484041 5308586 5128856 4945325 4758912 4570640 4381720 4193927 4009338
59079 4009338 3829446 3654931 3486563 3325772 3173925 3031481 2898205 2773723 2657510
59070 2657510 2548928 2447916 2355283 2271770 2197049 2130015 2069729 2015725 1967722 1925315 1887635
59059 1887635 1853151 1820321 1788591 1758199 1728940 1700004 1671309 1644059 1619484 1597894 1579342
59048 1579342 1564078 1551667 1540754 1530700 1522632 1517874 1516138 1516306 1518263 1522711 1529712 1538621 1549147
59035 1549147 1561324 1574619 1588094 1601353 1614452 1627041 1638378 1647991 1655552 1660375 1661806 1660008
59023 1660008 1655717 1649557 1642197 1634786 1628416 1623413 1619768 1617865 1618089 1620249 1624243 1630857 1641031 1654613
59009 1654613 1670592 1688069 1706101 1723141 1737761 1749739 1759503 1766852 1771260 1773082 1773338 1772380 1769802
58996 1769802 1765660 1760843 1756333 1752900 1751288 1751752 1753485 1755460 1757758 1761206 1765924 1771273 1777153 1784296
58982 1784296 1793120 1803238 1814259 1826330 1839751 1854708 1871428 1889975 1909965 1931186 1954434
58971 1954434 1981071 2011846 2046809 2086140 2130218 2178871 2231293 2286635 2344076 2402564 2461287
58960 2461287 2520254 2579690 2639068 2697532 2755101 2812626 2870829 2930296 2992254 3058390 3129891
58949 3129891 3207505 3292432 3386302 3490229 3604600 3729622 3865280 4011037 4166612 4333151
58939 4333151 4512907 4708008 4920370 5152517 5407352 5687284 5994654 6332898 6705999
58930 6705999 7116716 7566559 8057681 8593545 9177264 9810259 10492814 11224751 12004624
58921 12004624 12828549 13689811 14578489 15480517 16377273 17246326 18062474 18798569 19426969
58912 19426969 19921990 20262456 20433727 20429285 20251607 19911608 19427026 18820656 18118323 17346265
58902 17346265 16528912 15688141 14843178 14009947 13200561 12424134 11687824 10996620 10352814
58893 10352814 9756955 9209389 8710251 8258353 7850931 7484099 7152629 6849688 6568139
58884 6568139 6302393 6048675 5804339 5568311 5341876 5127569 4926970 4740266 4567448
58875 4567448 4408511 4262549 4128113 4004746 3893050 3793036 3703407 3622700 3550201 3485623
58865 3485623 3428768 3379634 3338099 3303480 3275166 3253420 3238646 3230146 3226720 3228331 3235997 3250182
58853 3250182 3270487 3296839 3329661 3368899 3414155 3465830 3524933 3591713 3665801 3747789 3839370
58842 3839370 3941731 4055068 4179795 4316931 4467087 4630486 4808347 5002972 5216060
58833 5216060 5448135 5700051 5974032 6272923 6599457 6956514 7347042 7773474 8238229
58824 8238229 8744766 9296889 9896697 10544175 11238583 11978551 12760232 13576315 14416568
58815 14416568 15267477 16110662 16923007 17679068 18352818 18917955 19349582 19627891 19740645
58806 19740645 19683170 19458395 19077740 18560132 17928442 17206755 16419937 15592714 14747011
58797 14747011 13900443 13067509 12260591 11488870 10757706 10070224 9428785 8834449 8286346
58788 8286346 7782706 7321831 6901732 6519987 6174666 5864489 5587792 5342562 5127891
58779 5127891 4943973 4790030 4663320 4560124 4475440 4400473 4322329 4228327 4110916 3969001
58769 3969001 3806769 3632378 3455663 3284540 3123214 2973827 2838386 2718239 2613180
58760 2613180 2522428 2445620 2381894 2329241 2285882 2251301 2224925 2204831 2188874 2176130 2166200
58749 2166200 2158049 2150543 2143179 2135299 2125548 2112987 2097581 2078589 2053796 2021671 1983324 1941075
58737 1941075 1896075 1848672 1800116 1752318 1706388 1662586 1621108 1581858 1544104 1507448 1472570
58726 1472570 1440150 1409857 1381354 1355322 1332309 1311435 1291568 1273121 1257359 1244424 1233163
58715 1233163 1222530 1212132 1201800 1191558 1181592 1171661 1161137 1150251 1140350 1132188 1124910 1117630
58703 1117630 1111005 1106150 1102939 1100450 1098126 1095254 1090176 1081449 1069347 1055190 1039778 1023474 1007012
58690 1007012 991079 975738 961341 949333 941023 936128 933484 932553 933367 935898 940602 948807 961424
58677 961424 977865 997200 1019490 1044886 1072349 1100758 1130745 1164304 1203203 1248862 1303068
58666 1303068 1367403 1442174 1526385 1617421 1709071 1790563 1849547 1877066 1870356 1832794 1772583
58655 1772583 1700212 1624672 1551183 1482457 1420907 1368625 1326219 1293061 1268340 1251156 1240602
58644 1240602 1236841 1241186 1254045 1273718 1298285 1327578 1362244 1402215 1447634 1500108 1561308 1631178
58632 1631178 1709197 1796565 1895486 2007106 2131919 2271552 2428339 2603469 2797049 3009389
58622 3009389 3240611 3489230 3752208 4025610 4303652 4577609 4836866 5070429 5266555
58613 5266555 5412809 5499378 5522596 5484409 5389650 5245618 5062925 4853672 4628253 4394999
58603 4394999 4161887 3936149 3722298 3522407 3338154 3170814 3019569 2881928 2756056
58594 2756056 2641264 2536481 2440072 2351192 2269771 2195274 2126903 2064818 2009533 1960225 1915078
58583 1915078 1873115 1834197 1797517 1761684 1726271 1691911 1659090 1628171 1600135 1575901 1555327
58572 1555327 1538349 1526444 1521212 1521890 1525953 1531698 1538396 1544366 1547039 1544989 1538271 1526990 1511305
58559 1511305 1492743 1473758 1456014 1440545 1429168 1423880 1424971 1431267 1441849 1455572 1469129 1477707
58547 1477707 1477939 1469017 1451420 1426483 1397021 1366367 1336407 1307738 1281218 1257552 1235744 1213963
58535 1213963 1191882 1170420 1149472 1127821 1105196 1082502 1060070 1037438 1014748 992618 970911
58524 970911 949451 929532 912667 898158 884038 870201 858362 849022 840804 832831 825518 818880
58512 818880 812258 806001 801297 798066 795004 791842 789569 788352 787332 786638 787527 790311 794139 798960 805608
58497 805608 813761 821928 829734 838216 847719 857471 867239 877344 887003 894880 901284 907560 913347 916898
58483 916898 918284 919694 922267 925124 927859 931419 936027 940722 945419 950975 956682 960253 960890 959905 957677
58468 957677 952609 943867 932586 919400 903287 884011 863449 843305 823455 803506 784068 765649
58456 765649 748138 732104 718736 707987 698662 690665 684961 681038 676950 672461 669680 669918 672336
58443 672336 676275 682215 689563 696162 701113 705711 710615 714479 716365 717089 717136 715759 713232 711622 712139
58428 712139 713876 716181 719941 725501 731682 738031 745823 755836 767318 780023 794774 811041 826439
58415 826439 839742 852007 863799 873897 881770 888569 894386 897216 896066 892599 888326 882625 874910
58402 874910 866228 857293 847358 836500 826667 819075 812838 807299 803253 800727 798202 795367 793999 794782
58388 794782 795920 796248 796972 798813 800167 799684 798123 796274 793718 791008 790250 792008 794406 796611 800193
58373 800193 805666 810979 815109 819814 825944 831416 834960 838586 844023 849849 854518 859162 864917 870504
58359 870504 874983 880062 887084 894470 900590 906392 912760 918088 921093 923247 925914 927822 927915 927909 929338
58344 929338 930822 931015 931564 934395 938638 942891 947997 954940 962533 969751 977670 986678 994636 1000457 1006555
58329 1006555 1015007 1024152 1031824 1039052 1047666 1057138 1066696 1077777 1091359 1105562 1118732 1132104 1146698
58316 1146698 1160588 1172073 1182511 1193120 1202231 1208723 1214934 1223011 1231538 1238864 1246436 1255638 1264792
58303 1264792 1272655 1281402 1292692 1304301 1314260 1324780 1338381 1353631 1368452 1384110 1402081 1420588
58291 1420588 1438170 1457173 1479814 1504431 1529438 1557074 1589231 1623625 1658330 1695974 1739014
58280 1739014 1784941 1830595 1877002 1925477 1973552 2019686 2067344 2119100 2171078 2218451 2261797
58269 2261797 2302717 2338311 2366238 2390657 2416900 2444603 2472022 2502147 2537942 2576354 2613862
58258 2613862 2653250 2698006 2745048 2790429 2837388 2891010 2949639 3009393 3072417 3142432 3216778
58247 3216778 3291253 3368348 3452330 3540903 3630315 3723876 3826446 3935455 4046580 4163328
58237 4163328 4291472 4429051 4571608 4722012 4884973 5057457 5235252 5423448 5629332
58228 5629332 5850630 6082233 6328441 6596431 6883931 7186227 7509028 7861095 8240840
58219 8240840 8644433 9080190 9560066 10084242 10650108 11268960 11956965 12717851 13553045
58210 13553045 14481072 15527889 16707387 18033463 19543580 21289500 23316651 25680011
58202 25680011 28472980 31815895 35827100 40631487 46380539 53229119 61309426 70772010
58194 70772010 81849133 94860501 110212256 128463964 150351055 176607693 207689195
58187 207689195 243569677 283437946 325010921 363896473 394113400 410192840 409630541
58180 409630541 393820855 366902333 333692193 298198529 263163397 230205438 200120626
58173 200120626 173200259 149490149 128905185 111241611 96209734 83503975 72835698
58166 72835698 63921950 56492373 50320186 45226610 41056707 37672921 34970951 32880058
58158 32880058 31344496 30319867 29790162 29775990 30320746 31470742 33262118 35705687 38743911
58149 38743911 42161503 45494553 48062782 49204647 48593607 46380145 43046963 39135557
58141 39135557 35070196 31130140 27476403 24175677 21236500 18652010 16412333 14491314
58133 14491314 12848487 11448684 10265482 9267557 8419171 7695334 7082067 6561391 6109744
58124 6109744 5711360 5360002 5046821 4758635 4488669 4237559 4003245 3780546 3570565
58115 3570565 3379560 3207941 3050130 2905145 2777197 2665735 2564820 2472660 2392087 2320975
58105 2320975 2251542 2180116 2109107 2038952 1966881 1894404 1827408 1767647 1711792 1659452 1614124
58094 1614124 1575331 1537708 1499095 1462150 1426952 1389540 1349360 1311244 1278339 1249294 1223460
58083 1223460 1202344 1184559 1165614 1144284 1123636 1104713 1084900 1063408 1042566 1022652 1001137
58072 1001137 978196 957402 939754 922361 904145 887559 873514 859780 845662 833256 822906
58061 822906 812336 801470 793282 788667 785007 780793 777066 773399 767265 758609 750546 744387 738329 732004
58047 732004 727772 726394 725869 725720 728025 733036 738071 741997 746571 752270 757165 761210 767209 775945 784492
58032 784492 790902 796498 801884 804814 803956 801127 797886 793356 787185 781276 776734 772222 766991 762483
58018 762483 759358 755941 751241 746762 743897 742236 741670 743325 747246 751916 757100 764335 773589 782422
58004 782422 789497 795767 801044 802588 798645 790500 779676 765943 749460 732007 714558 696287 677409
57991 677409 660435 647206 637240 630300 627901 630747 637043 644796 653516 662461 669651 674068 676675 678124
57977 678124 677664 675340 672808 670795 668069 663989 659710 655763 650952 644920 639408 635639 632731 629942
57963 629942 628247 628506 630370 634153 641436 652535 665620 679549 695341 713639 732995 751882 770069
57950 770069 786754 799784 808220 813502 816734 816994 813551 807297 798508 785585 767732 746797 724853
57937 724853 702026 678191 654610 632242 610617 590100 573072 560835 551274 541657 532104 524390
57925 524390 518932 514936 512147 510568 509573 508908 509436 511592 514351 516932 520042 524224 528616 532645 537264
57910 537264 543032 548682 553179 557591 563222 569354 574531 578638 582013 583876 583474 581622 579304 575703
57896 575703 569347 560331 549941 538909 527445 516189 505739 495891 486428 477931 470885 464856 459418
57883 459418 454943 451759 449642 448859 450411 454443 459767 465718 472953 481573 490161 497737 504998 512535
57869 512535 519506 525358 531089 537340 542850 546341 548456 550350 551788 552180 551971 551384 549210 544533 538423
57854 538423 532284 525790 518133 510032 502706 495961 489008 482138 475949 469966 463748 458284 454538 451569
57840 451569 447879 443738 440379 437694 434481 430301 425478 419969 413785 407757 402313 396337 388852 381000
57826 381000 374557 369226 363279 356281 349301 342816 336249 329452 322961 316829 310651 304704 299830 296279
57812 296279 293713 292061 291366 291177 291146 291793 293668 296275 298855 301674 305478 310306 315898 322628 330925
57797 330925 340395 350630 362163 375503 389972 404708 419980 436083 451586 464118 472508 477037
57785 477037 478276 477043 474902 473283 472392 472015 472734 475123 478370 481024 482531 482860 481348 477330 471333
57770 471333 464354 456549 447931 439616 432876 427542 422788 418883 416627 415709 415231 415358 416707 418488 419031
57755 419031 418022 416647 415700 415083 414999 416059 418167 420609 423269 426547 430274 433949 437761 442105 446398
57740 446398 449819 452988 457457 463713 471012 478949 487655 496603 504873 512732 521557 532026 543638 556101
57726 556101 569894 585330 602225 620636 640874 662805 686164 711460 739497 770195 803026
57715 803026 838386 877320 920101 966393 1016599 1071682 1131878 1197148 1268934 1349984 1442228
57704 1442228 1546154 1662369 1792392 1937682 2099145 2277808 2474741 2689983 2922532
57695 2922532 3171315 3434759 3708901 3986759 4259506 4517164 4748339 4941007 5084666
57686 5084666 5171821 5198471 5165115 5077655 4946009 4781160 4593876 4395221 4196038 4005074
57676 4005074 3828543 3671599 3539099 3435028 3362770 3326242 3329305 3373414 3456451 3572727
57666 3572727 3710906 3850412 3962284 4017550 3998019 3902073 3743131 3543241 3325253 3106951
57656 3106951 2899589 2709801 2541505 2396381 2274512 2175701 2099835 2046086 2012869 1998904
57646 1998904 2003405 2025210 2062974 2116545 2187038 2275197 2380803 2503962 2645608 2806200 2984987
57635 2984987 3180986 3393238 3619137 3853315 4088596 4316857 4528267 4711106 4853939
57626 4853939 4948034 4987789 4970501 4897293 4773781 4608554 4410886 4189963 3955086 3714996
57616 3714996 3476632 3244859 3023008 2813130 2616128 2432430 2262685 2107627 1967460
57607 1967460 1841629 1728941 1627774 1536471 1453801 1378894 1310884 1248973 1192768 1142035 1096231
57596 1096231 1054810 1017789 985243 956384 929975 905599 883611 863862 845522 828278 812586
57585 812586 798433 784947 771631 759016 747663 737465 728384 720871 714901 709543 704276 699986 697885
57572 697885 698022 699632 702442 706892 713356 721797 731932 743291 755363 768136 782277 798568 817387
57559 817387 838789 862708 889042 918099 951111 989662 1034465 1085261 1142126 1206148 1278598
57548 1278598 1360139 1451135 1552191 1664075 1787699 1924296 2074838 2238950 2414937 2600965
57538 2600965 2795223 2994393 3192645 3382473 3555841 3704199 3818660 3891571 3918362 3898080
57528 3898080 3832975 3728101 3590696 3429080 3251701 3066534 2880246 2697432 2521112 2353970
57518 2353970 2198379 2055281 1924223 1804969 1698162 1603943 1520909 1447169 1381738 1324381
57508 1324381 1274871 1233045 1198813 1171361 1148916 1130114 1115161 1105023 1099907 1099150 1102187 1109021
57496 1109021 1120005 1135679 1156505 1182499 1213483 1249983 1293358 1344838 1405044 1474705 1555010
57485 1555010 1646696 1749577 1863523 1989260 2127598 2278576 2441858 2616941 2801639 2990559
57475 2990559 3175848 3349265 3502920 3628701 3718470 3765601 3766418 3720683 3631437 3504455 3347270
57464 3347270 3168236 2975853 2777879 2580222 2386720 2200165 2023229 1858239 1706556
57455 1706556 1568575 1443959 1331630 1230117 1138349 1055851 981952 915370 854969 800444
57445 800444 751862 708910 670901 637028 606284 577683 550934 526436 504290 483851 464537
57434 464537 446456 429836 414487 400321 387705 376718 366582 356483 346513 337243 328801 320849
57422 320849 313044 305034 296560 288053 280645 275010 270609 266610 262963 260006 257552 255088 252514 250018
57408 250018 247584 245217 243328 242259 241646 240839 239727 238686 237922 237303 236616 235659 234326 232871 231706 230778
57392 230778 229623 228246 227243 226719 225856 224044 221734 219523 217092 213835 210012 206514 203796 201651 199719
57377 199719 197649 195151 192368 189825 187641 185363 182940 181060 179964 178744 176639 174250 172568 171428
57363 171428 169937 167928 165959 164239 162505 160701 158905 156896 154640 152844 152128 152029 151760 151646 152722
57348 152722 155104 157883 160613 163820 167883 172330 176532 180326 183676 186336 188220 189712 191439 193880
57334 193880 197112 200608 203450 205147 206151 207324 209160 211766 215151 219080 223104 227259 232251 238383
57320 238383 244761 250290 255028 259822 265021 270387 275979 282207 289107 296402 304198 312886 322388 332247
57306 332247 342452 353611 366227 380328 395706 412028 428868 446139 464409 484296 505725
57295 505725 528262 551968 577355 604680 633713 663982 694740 724958 753914 781546 807755
57284 807755 831628 851851 867579 878344 883420 881916 873409 858111 836726 810531 781180 749954
57272 749954 717551 684933 653656 624749 597851 572133 547552 524610 503525 484448 467843
57261 467843 453853 441796 431075 421931 414530 408093 401991 396917 393728 391697 389283 386170 383266
57248 383266 381012 379125 377718 377292 377654 378062 378371 378818 378878 377721 375798 374522 374241 373867 372812 371983 372349
57231 372349 373526 374367 374211 373246 372276 372339 373925 376486 379208 382104 385669 389694 393306 396061 398221 400176
57215 400176 402484 406140 411694 418265 424510 430387 436859 444100 451303 458208 465420 473106 480748 488449
57201 488449 497234 507596 518790 529898 540699 551250 561605 572233 583827 596429 609468 622703
57189 622703 636268 649921 663313 677062 692416 709665 727911 746546 765896 786223 807212
57178 807212 828738 851162 874604 898833 924163 951570 981613 1013863 1047420 1081322 1114552
57167 1114552 1146529 1177523 1207921 1237432 1265829 1293895 1322434 1350908 1378508 1406127 1435569
57156 1435569 1467018 1498958 1530607 1562759 1596214 1631050 1667578 1706319 1746740 1787551 1828426
57145 1828426 1869943 1911752 1952524 1991911 2030861 2069788 2108133 2145945 2184083 2222476 2260029
57134 2260029 2296666 2333736 2372015 2411137 2451437 2494422 2540738 2589263 2638706 2688428 2737274
57123 2737274 2783399 2825859 2864783 2899739 2929750 2955327 2978688 3001771 3025931 3053693 3088604
57112 3088604 3133038 3188243 3256556 3341201 3443946 3565793 3710152 3882605 4087696 4329523
57102 4329523 4616152 4960504 5377182 5882859 6500618 7259629 8188876 9313624 10656246
57093 10656246 12233503 14050909 16104650 18389654 20899875 23621369 26535225 29629310
57085 29629310 32893012 36288903 39733473 43107750 46272178 49061577 51288915 52795141
57077 52795141 53516162 53497726 52845271 51668152 50063419 48119949 45912375 43495294 40917626
57068 40917626 38240708 35532213 32843937 30204324 27631904 25148098 22777151 20541893
57060 20541893 18462823 16556775 14833336 13293663 11932549 10739298 9697551 8788100
57052 8788100 7993383 7298503 6689443 6153285 5680063 5262068 4891437 4560402 4263469
57043 4263469 3997127 3757315 3538807 3336704 3146737 2964381 2785609 2608676 2433944
57034 2433944 2262319 2095045 1934473 1783299 1643024 1514211 1397652 1293890 1201904 1119596
57024 1119596 1045418 978508 917792 862274 811959 767323 728045 693182 662238 635146 611635
57013 611635 591514 575128 562584 552954 545209 539620 537442 539684 546887 559614 578411 603812 637053
57000 637053 680319 735820 805346 891221 996794 1125241 1277811 1451517 1634797 1804185
56990 1804185 1929336 1987075 1973220 1901594 1793353 1667877 1539853 1418856 1308972 1209994
56980 1209994 1120121 1037488 960223 886983 817874 753886 695557 643127 597417 559103 527262
56969 527262 499901 475880 455291 438256 424597 414433 407878 404403 403705 406917 415635 429998 448998
56956 448998 472150 498888 526077 547967 559553 559302 548641 530202 507004 481956 457075 433468
56944 433468 412135 394104 379642 368194 359370 353375 350391 350387 353813 361764 375209 394484 419570
56931 419570 450197 485389 523064 559713 590108 608198 609974 596031 570805 539288 504880 469782
56919 469782 435859 404462 376090 350674 327938 307523 289330 273729 260956 250388 240981 232317
56907 232317 224690 218344 213234 209295 206316 203721 201156 199036 197879 197418 197206 197729 199979 204112 209573
56892 209573 216382 225246 236371 249189 263470 279861 299046 320917 344436 367414 386471 398345
56880 398345 401820 398011 388788 375569 359666 342878 327234 314322 304865 298583 294660 292795 293674
56867 293674 298132 306394 318722 336214 360085 390583 427489 471125 521473 576194 630294 677573
56855 677573 711913 728432 725600 706684 677838 644365 609386 575324 544611 518517 496909 479915
56843 479915 468767 464557 467369 477245 494979 521439 557120 602871 660100 729511 810082 898949
56831 898949 990513 1074866 1138947 1171780 1169657 1136679 1081369 1013082 939995 868054 800691 739515
56819 739515 685305 638548 599703 569385 548033 535363 530632 533620 544925 565390 595887 637522
56807 637522 690750 753420 819816 881725 930176 957114 957759 933032 889355 835161 777240 719768
56795 719768 665224 615108 570235 531136 498295 471841 451470 436860 427847 424191 425828 433478
56783 433478 448294 470583 499306 532659 568104 601562 627701 641964 642270 628987 604329 572046
56771 572046 536461 500707 466012 432766 401522 372756 346615 323522 304237 288801 276110
56760 276110 265030 255263 246695 238793 231279 224654 219365 215037 211059 207293 203623 199596 195150 191037
56746 191037 187741 184609 180817 176637 172998 170249 168051 166040 163915 161335 158452 156101 154717 153473
56732 153473 151230 148084 145300 143929 144018 144931 145852 146187 145947 145655 145660 145875 146342 147396 148936 150200 150736
56715 150736 151038 151737 152756 153785 154939 156359 157739 158875 160082 161481 162496 162757 162866 163549 164615
56700 164615 165509 166326 167430 168601 169478 170416 172033 174175 176132 177549 178425 178668 178470 178622 179509 180160 179351
56683 179351 177403 175842 175402 175425 175154 174586 173885 172871 171454 169917 168544 167405 166557 166002 165454 164602 163515
56666 163515 162370 161021 159454 158401 158694 160034 161140 161230 160720 160280 159859 158930 157275 155212 153221 151549
56650 151549 150188 149217 149091 150234 152272 154123 155107 155548 156004 156460 156734 157096 157840 158598 158744 158239 157529
56633 157529 156874 156315 156032 156188 156682 157556 159242 161767 164070 164874 164098 162773 161738 161039 160454 159906 159332
56616 159332 158729 158327 158328 158603 159000 159763 161195 163084 164878 166205 166902 166905 166558 166657 167632 169005 170103 170866
56598 170866 171455 171602 171053 170247 169854 169929 170197 170734 171617 172296 172197 171730 171838 172705 173660 174206 174427 174608 175195
56579 175195 176980 180478 185160 189940 194274 198263 201964 205382 208831 212578 216320 219753 223390 227976
56565 227976 233423 239248 245782 253837 263212 272614 281207 289319 297366 304902 311100 315608 318734 321185
56551 321185 323606 325959 327425 327333 325954 323947 321408 318053 313928 309211 303707 297332 290690 284320 277827
56536 277827 270749 263851 258307 253856 249024 243129 236851 230828 224990 219474 214951 211641 208917 206193
56522 206193 203394 200406 197010 193580 190939 189236 187786 186137 184504 183023 181497 180080 179270 178956 178289
56507 178289 176786 174824 172908 171275 170326 170548 171770 173291 174844 176590 178117 178588 178172 178265 179838 182446
56491 182446 185269 188151 191134 193865 196099 198135 200221 202091 203523 204817 206339 208064 209801 211381
56477 211381 212527 213170 214033 216141 219594 223479 227040 230178 232733 234377 235513 237336 240517 244488 248385
56462 248385 251955 255304 258553 262148 266702 272118 277506 282261 286560 290523 293696 295730 296857 297387
56448 297387 297357 296937 296439 295631 293822 290906 287616 284449 281172 277602 274033 270470 266326 261333 256101
56433 256101 251377 247371 244078 241479 239166 236565 233810 231611 230038 228319 226180 224369 223423 222802 221723
56418 221723 220069 218026 215699 213521 212173 211594 210899 209713 208698 208240 207618 206220 204722 204288 205241 207203
56402 207203 209904 213065 215970 217893 218738 218874 218710 218671 219068 219760 220399 221166 222630 224759 226809 228309
56386 228309 229411 230262 231021 232556 235897 240640 244989 247806 249545 250842 251458 251232 250880 251065 251631 252437
56370 252437 253916 256091 258024 259030 259611 260465 261518 262609 264187 266428 268487 269496 269721 270081 271161
56355 271161 273190 276099 279037 280790 281388 282423 285105 288835 292319 295125 297490 299640 302212 306350
56341 306350 312436 319369 325893 331910 337879 343897 350135 357194 365122 372924 379880 386475 393304 400009
56327 400009 406196 412357 418852 424837 429303 432448 435079 437411 439329 440979 442130 441732 439222 435634
56313 435634 432533 430483 429266 428766 428686 428300 427475 427205 428262 430123 432089 434559 438153 442485 446877 451554
56297 451554 457060 463165 469358 475793 482938 491004 500460 512213 526382 541772 557363 573455 590624
56284 590624 608745 627943 649282 673460 699927 728324 759536 794294 832068 872610 917235
56273 917235 967254 1022491 1082867 1150059 1225949 1310706 1404169 1507876 1623730 1751724 1891124
56262 1891124 2043004 2209418 2390596 2584889 2790949 3007932 3233866 3465610 3700084
56253 3700084 3933910 4162279 4379828 4582162 4765013 4922785 5050178 5145164 5208648 5241648
56243 5241648 5244708 5219873 5171149 5102772 5018376 4921701 4816346 4704639 4587887 4467513 4344667
56232 4344667 4219065 4089673 3956369 3819772 3679878 3536278 3389335 3239909 3088490
56223 3088490 2935976 2784647 2636698 2492255 2350387 2211619 2077918 1950757 1830720
56214 1830720 1718493 1614518 1518076 1428290 1345577 1270642 1202691 1140372 1083794 1033778 989661
56203 989661 949767 913599 881657 853536 828158 805559 786485 770458 756093 743096 732151
56192 732151 723133 715159 708101 702284 697113 691841 687266 684783 684122 683876 683821 684820 686891 689353 692464
56177 692464 696859 701765 705723 708669 711258 712775 711934 709294 706617 704303 701711 699461 698817 699195 698949
56162 698949 698494 700002 704037 709100 714579 721547 730434 740455 751640 765158 781323 799454 819883
56149 819883 843992 872119 903534 938534 978562 1024453 1076705 1137154 1208085 1290110 1383388
56138 1383388 1490333 1613931 1753131 1902432 2055748 2207901 2352804 2484206 2599539
56129 2599539 2700751 2790902 2872184 2946977 3017354 3082457 3138635 3182740 3213445 3229887 3232091
56118 3232091 3222870 3206171 3182783 3149725 3103487 3041166 2959231 2855267 2731735 2595006 2450420
56107 2450420 2301182 2151783 2008390 1875004 1752454 1641633 1544201 1459573 1384888 1318822
56097 1318822 1262117 1213776 1170467 1130635 1095776 1066679 1041859 1020478 1003298 989767 977684
56086 977684 966695 958705 953973 950320 947050 945929 947398 949505 951511 954782 959243 962968 966233 971816
56072 971816 980123 988152 994536 1001335 1009526 1017112 1023331 1030440 1039573 1048933 1057673 1067388 1078135 1087320
56058 1087320 1094328 1102041 1112059 1122655 1133002 1144871 1158502 1171581 1184177 1199833 1219741 1240806
56046 1240806 1261552 1284748 1311833 1339988 1367480 1396773 1429403 1462658 1494319 1526014 1559221
56035 1559221 1592920 1627953 1668456 1715852 1766256 1816564 1867914 1920460 1970542 2016428 2061311
56024 2061311 2107344 2152192 2194730 2238238 2284535 2330922 2376469 2425022 2478182 2531831 2583771
56013 2583771 2638217 2698340 2761059 2823904 2890331 2963129 3039288 3116577 3198608 3287990 3381159
56002 3381159 3475399 3574286 3680758 3791734 3905158 4025183 4154644 4289871 4428813 4576532
55992 4576532 4736550 4904928 5079284 5265131 5466562 5679658 5902380 6141752 6403617
55983 6403617 6684803 6983412 7306802 7660940 8042415 8450212 8894720 9385678 9922652
55974 9922652 10507311 11152984 11871585 12664357 13537323 14512487 15612131 16847750 18238737
55965 18238737 19827128 21661339 23785627 26264744 29202945 32722825 36945529 42007382
55957 42007382 48068222 55280742 63782025 73747488 85437282 99190486 115447302 134826661
55949 134826661 158105871 186006893 218938457 256769151 298357007 340734617 378708852
55942 378708852 405958078 417533374 412081157 392099817 362271535 327389356 291166421
55935 291166421 256022085 223307532 193625671 167157894 143899689 123733460 106428620
55928 106428620 91687093 79208437 68700357 59864193 52418378 46132494 40817817
55921 40817817 36301372 32433649 29106892 26240311 23755104 21580446 19670010 17991350
55913 17991350 16506895 15181044 13995273 12938839 11992155 11133720 10354771 9652251 9014559
55904 9014559 8427678 7888178 7396982 6946745 6527653 6139382 5785311 5460608 5157410
55895 5157410 4876241 4621139 4388356 4170428 3966820 3780503 3608446 3445252 3292122
55886 3292122 3152779 3024303 2900897 2783131 2674904 2574705 2478172 2385958 2301063 2221539
55876 2221539 2143575 2068717 2000586 1937467 1875482 1816091 1763144 1715131 1667503 1620185 1576039
55865 1576039 1534292 1492315 1451737 1416191 1384837 1354235 1324882 1300178 1280911 1266319 1258412
55854 1258412 1259406 1266730 1275958 1286687 1300026 1312313 1316985 1311257 1296147 1271999 1239393 1202655
55842 1202655 1166979 1133097 1099275 1066708 1038065 1012514 987255 962561 940528 920408 900031
55831 900031 880400 864118 850634 837703 826139 818303 813149 807527 801372 797071 794636 791993 789126
55818 789126 787565 786560 784004 780314 777366 774462 769308 762087 754517 745877 734106 720051 706642
55805 706642 694537 682482 671131 662527 656360 650490 644580 639653 634846 628299 620513 613251 605904
55792 605904 596570 585826 575639 565432 553124 539361 526746 515420 503336 490559 479400 470543
55780 470543 462754 456229 452396 450294 446671 439893 430754 419689 406438 392223 379008 366659 353800
55767 353800 341014 330024 320323 310000 299482 290912 284183 277166 269635 263282 257876 251192 242942
55754 242942 235176 228426 221014 212697 205579 200715 197119 194883 196080 201430 208673 215172 219871 222274
55740 222274 222076 220466 219470 219460 219257 218649 218432 218084 216046 212542 209580 207952 206603 205007 203614 201909
55724 201909 198711 194569 191343 189320 187257 185227 184608 185193 185216 184542 184974 187054 189408 191669 195117 199783
55708 199783 203769 206271 208731 212220 216154 220180 224789 229344 231968 232219 231607 230829 228891 225607 222474
55693 222474 220234 217895 215020 212755 211801 211544 211927 213955 217572 221294 224772 229579 236609 244783 253114
55678 253114 261930 271289 280244 288518 296831 304873 311068 315115 318592 322230 324827 325729 326172 327054 327523
55663 327523 326945 326318 326463 326608 325944 324905 323766 321570 317534 312157 306084 299304 292139 285423 279024
55648 279024 271799 263641 255797 248579 240632 231232 221372 211798 201942 191768 182650 175285 168527 161501
55634 161501 155200 150708 147366 143957 140415 137243 134410 131743 129354 127008 124263 121589 119905 118681
55620 118681 116264 112536 109314 107496 105888 103674 101916 101492 101445 100642 99374 98176 96746 95103 94124
55605 94124 93815 92740 90403 88536 88778 90660 92993 95549 98080 99434 99179 98717 99320 100359 100723 100577
55589 100577 100365 99525 97724 96090 95792 96445 97143 97869 98671 98791 97969 97366 97811 98353 97937 97318 97846 99468
55571 99468 101366 103583 106613 110318 114644 120511 128619 138143 147761 157112 166153 174097 180121 184255
55557 184255 186500 186166 183187 178935 174591 169874 164532 159740 156533 154114 151320 148667 147286 146840 146256
55542 146256 145747 146362 148145 150283 152490 154745 156245 156240 155511 155581 156800 158382 159825 161037 161621 161276 160418
55525 160418 159279 157017 152980 148092 143656 139401 134191 128070 122057 116368 110436 104466 99428 95565
55511 95565 92220 89091 86433 84057 81345 78291 75544 73376 71496 69812 68536 67553 66433 64996 63333
55496 63333 61558 60005 59192 58992 58443 57060 55617 54847 54129 52493 50223 48338 47031 45799 44673 44129
55480 44129 44080 44024 43980 44302 44841 45172 45339 45525 45388 44650 43928 43957 44325 44005 42896 41857 41407 41278 41117 40788
55460 40788 40125 39157 38368 38118 37999 37386 36266 35014 33848 33071 33260 34445 35713 36381 36951 38048 39115
55443 39115 39173 38398 37884 38226 39186 40408 41553 42141 42095 42021 42202 41895 40534 38995 38647 39573 40764 41654
55425 41654 42468 43473 44848 46874 49316 51032 51218 50601 50457 50939 51363 51599 51960 52146 51621 50849 50909 51961
55407 51961 53202 54308 55897 58473 61779 65132 67756 68948 68685 67885 67410 67095 66341 65124 63630 61520
55391 61520 58562 55500 53293 51816 50377 49041 48406 48345 48045 47096 45643 43830 42022 41103 41505 42277
55375 42277 42164 41237 40433 39957 39342 38623 38159 37603 36378 35003 34601 35198 35792 36009 36363 36903 36921 36207 35372
55356 35372 34720 33900 32871 32182 32020 31894 31495 31097 30978 31160 31715 32601 33329 33549 33769 34660 35834 36277
55338 36277 35812 35163 34725 34293 33919 33957 34271 34336 34121 33975 33768 33108 32293 32054 32413 32753 32887 33057 33007 32175
55318 32175 30785 29742 29412 29453 29673 30033 29985 28976 27619 27205 28023 29218 30222 31207 32188 32894 33559 34631
55300 34631 35681 35821 35287 35352 36498 37853 38588 38681 38131 36735 34950 33834 33752 34139 34719 35807 37197
55283 37197 37984 37895 37693 37895 38092 37849 37263 36424 35334 34566 34789 35442 35146 33713 32459 32190 32291 32278 32725
55264 32725 33828 34462 33660 32007 30604 29584 28592 27837 27685 27848 27893 27987 28379 28716 28609 28429 28822 29846
55246 29846 31115 32365 33405 34003 34284 34773 35628 36250 36025 34965 33398 31621 30194 29880 30779 32048
55230 32048 32859 33166 33277 33254 33039 32628 31884 30706 29560 29176 29582 30156 30741 31813 33325 34404 34610 34532
55212 34532 34596 34256 33088 31860 31688 32630 33806 34468 34359 33508 32302 31511 31709 32858 34604 36637 38563
55195 38563 39915 40558 40706 40502 40055 39869 40446 41386 41681 41084 40334 39853 39173 38046 37163 37156 37647 37886 37764
55176 37764 37674 37829 38168 38517 38595 38290 38027 38241 38520 38043 36893 36025 35797 35621 35260 35311 36019 36711 36941 37138
55156 37138 37538 37537 36820 36162 36378 37220 37953 38248 37965 36948 35646 34990 35024 34582 33050 31461 31054 31671 32445
55137 32445 33134 33847 34374 34808 36004 38330 40692 41880 42196 42660 43284 43380 43031 42944 43147 43039 42562 42227
55119 42227 42102 41834 41583 41966 43050 44209 44988 45396 45464 45171 44702 44221 43565 42773 42578 43682 45733 47725
55101 47725 49219 50502 51771 52875 53806 54807 55988 57232 58336 58981 58923 58556 58737 59559 59991 59393 58695
55084 58695 59147 60543 61789 62759 64240 66184 67364 67060 66048 65491 65679 66228 66856 67410 67614 67245 66438
55067 66438 65599 65108 65089 65317 65386 65162 64948 65006 65144 65033 64743 64632 64793 64894 64449 63148 61114 59010 57579
55048 57579 56932 56613 56450 56778 57619 58308 58388 58320 58744 59493 59968 60158 60646 61729 63028 63918 64132 64079 64658
55029 64658 66388 68612 70079 70396 70265 70195 69891 69269 69046 69597 70139 69889 69270 69022 68783 67616 65583 63714
55011 63714 62633 62127 61893 61873 61865 61560 61031 60675 60722 61143 61808 62421 62617 62482 62520 62837 62977 62936 63488 64908
54991 64908 66239 66612 66418 66270 65714 64265 62987 63536 65978 68979 71936 75466 79724 83703 86635 89038
54975 89038 91940 95811 100578 106014 111848 118025 125018 133475 143621 155426 169090 184788 202150
54962 202150 220665 240337 261273 282847 303952 323660 340845 353550 359854 359358 353002 341694
54950 341694 326125 307667 288210 268884 249851 231404 214334 199111 185587 173615 163181
54939 163181 153961 145619 138538 133330 129636 126415 123452 121520 120970 121377 122751 125851 130816 136681 142813
54924 142813 149846 158600 169061 181126 195357 212074 230358 248911 267389 285949 303766 318896
54912 318896 329567 334961 334846 329173 318278 303073 284841 264954 244776 225522 207944 192160
54900 192160 177897 164944 153338 143061 133808 125341 117936 112004 107268 102959 98973 96096 94723
54887 94723 94077 93279 92460 92119 92059 91754 91207 90508 89097 86511 83474 81111 79365 77328 74916 72983 71842
54870 71842 70915 69900 69085 68333 66967 64990 63364 62711 62664 62823 63364 64344 65281 65830 66142 66254 65898 65181
54852 65181 64626 64285 63660 62757 62277 62402 62387 61817 61368 61714 62529 63155 63556 63983 64371 64639 64992 65354 65147
54833 65147 64189 63231 63030 63426 64003 65115 67517 71232 75335 78759 80958 82167 83326 85511 89079 93601
54817 93601 98692 104513 111339 119206 128192 138518 150167 162967 177251 193779 212690 233095 253935
54804 253935 274627 294566 312728 328126 339944 346887 347279 340621 328601 313933 298518 282948
54792 282948 267172 251034 234654 218802 204606 192580 182396 173781 166855 161235 155745 149822
54780 149822 144536 141359 140371 140433 140734 141365 142719 145127 148961 154458 161479 169858 179754 191316 204355
54765 204355 218793 234934 252746 271289 289466 306926 323475 337987 348800 355052 356871 354423
54753 354423 347664 337226 324691 311682 299078 287343 277011 268394 261043 253970 246481 238717 231257
54740 231257 224218 216927 208655 199546 190456 181854 173327 164319 154946 145807 137338 129646 122791 116949
54726 116949 112398 109369 107654 106342 104380 101563 98621 96235 94400 92883 91713 90925 90326 89870 89770
54711 89770 89910 89618 88462 86838 85376 84153 82993 82105 81870 82230 82857 83781 85319 87425 89439 90569
54695 90569 90461 89452 88341 87754 87618 87466 87200 87191 87611 88180 88697 89302 90091 91039 92447 94681 97155 98379
54677 98379 97735 96600 96973 99342 102539 105396 107820 110332 113205 116274 119331 122600 126701 131928 137593
54662 137593 142571 146567 150362 154715 159653 164999 170783 176763 182233 186875 191250 195951 200746 204948
54648 204948 208105 210024 210836 211534 213623 217606 222520 227593 233536 241329 250541 259913 269007 278077 286701
54633 286701 293720 298328 300097 298209 291932 282006 270407 258432 245869 232274 218174 204611 192208
54620 192208 181121 171424 163152 156234 150629 146309 143062 140537 138470 136671 134990 133604 133091 133799
54606 133799 135327 137066 139014 141530 144501 147286 149377 150655 151156 151138 151163 151555 151846 151259 149591 147117
54590 147117 143915 139979 135856 132361 129578 126736 123225 119263 115547 112617 110518 108651 106100 102562
54576 102562 98789 95743 93572 91941 90853 90348 89716 88094 85801 84078 83399 82988 82193 81388 81093 81074
54560 81074 80876 80621 80705 81104 81426 81394 80968 80314 79928 80458 82095 84324 86404 87846 88447 88301 87928 88028
54542 88028 88886 90324 92278 94991 98515 102431 106296 110005 113573 116993 120542 124825 130111 135879 141348
54527 141348 146286 151011 155693 159971 163220 165011 165198 163684 160378 155567 150225 145494 141669 137966
54513 137966 133535 128402 123217 118451 114270 110839 108163 105787 103175 100359 97786 95674 93959 92728
54499 92728 92120 91861 91405 90590 89715 89038 88671 88860 89744 90875 91582 91952 92824 94627 96757 98310 98972 98952
54481 98952 98504 97876 97391 97229 97231 97100 96695 96022 95139 94191 93439 93183 93602 94499 95208 95059 94168 93373 93087 92644
54461 92644 91281 89401 88165 88069 88603 89160 89520 89455 88699 87506 86563 86070 85442 84198 82634 81313 80337
54444 80337 79437 78527 77852 77749 78335 79313 80095 80286 79990 79485 78837 78115 77640 77542 77331 76534 75554 75262 75812
54425 75812 76578 77183 77877 78847 79892 80908 82032 83157 83954 84531 85425 86728 87870 88587 89466 91188 93669
54408 93669 96221 98212 99376 99904 100432 101540 103123 104671 106145 108066 110686 113689 116821 120207 123949
54393 123949 128053 132849 138728 145258 151335 156502 161379 166475 171347 175352 178422 180627 181773 182051
54379 182051 182279 182683 182074 179155 174228 168735 163507 158387 153340 148860 145139 141627 137767 133659 129801
54364 129801 126557 124001 121945 120011 117925 115813 114017 112614 111395 110293 109562 109465 109943 110663 111279 111648
54348 111648 111883 112216 112761 113494 114440 115760 117576 119868 122615 125882 129593 133402 136982 140425 144184
54333 144184 148531 153121 157232 160549 163570 166906 170230 172355 172569 171394 169695 167538 164475 160534
54319 160534 156197 151621 146683 141732 137460 133906 130252 125867 120989 116226 111886 107982 104456 101216
54305 101216 98267 95747 93527 91009 87949 85196 83781 83349 82443 80379 77856 75618 73610 71788 70600
54290 70600 70084 69434 68125 66664 65641 64867 64106 63824 64345 65027 65215 65369 66253 67483 67969 67517 66997 67058
54272 67058 67595 68404 69486 70593 71201 71121 70624 69949 69177 68596 68665 69481 70638 71705 72563 73285 73965 74717
54254 74717 75676 77020 78996 81664 84458 86345 86634 85442 83291 80691 78254 76613 75826 75298 74639 74098
54238 74098 73796 73183 71851 70327 69306 68567 67457 66175 65717 66565 68090 69266 69543 69121 68786 69247 70239
54221 70239 70598 69746 68656 68660 69664 70379 70051 69047 67870 66646 65725 65765 66834 68147 69081 69812 70546 70757
54203 70757 69766 67774 65765 64523 64098 64142 64434 64993 65891 67050 68238 69230 69909 70234 70267 70285 70619 71234
54185 71234 71692 71708 71482 71285 70956 70185 69126 68370 68331 68930 69803 70610 71172 71503 71670 71584 71072 70222 69396 68809
54165 68809 68358 67945 67652 67489 67320 67187 67340 67849 68604 69688 71087 72019 71464 69717 68453 68656 69403 69452
54147 69452 69133 69589 70815 71716 71779 71520 71456 71635 72133 72941 73455 73010 71938 71198 71008 70799 70511 70854 72084
54128 72084 73503 74510 75277 76020 76447 76339 75974 75549 74782 73549 72367 71848 72003 72367 72492 72172 71545 70993
54110 70993 70525 69485 67561 65916 66220 68340 70104 69903 68552 67878 68306 68817 68735 68459 68523 68790 68764 68176
54092 68176 67181 66297 66146 66927 68103 68827 68732 68215 68011 68517 69417 69908 69459 68379 67473 67209 67455 67928 68471
54073 68471 68919 69162 69459 70159 70998 71214 70659 70304 71196 73212 75203 76118 75761 74741 74044 74401 75695 77080
54055 77080 77866 78162 78531 79295 80360 81468 82369 82957 83404 83921 84318 84207 83819 84093 85563 87637 89523
54038 89523 91473 94394 98406 102567 106145 109438 113037 116876 120560 124272 128719 134228 140375 146660
54024 146660 153064 159670 166072 171703 176657 181664 187120 192584 197443 201699 205782 209890 213865 217503
54010 217503 220587 222787 223952 224440 224761 224990 224834 224150 222933 220930 217828 213929 210085 206790 203709
53995 203709 200302 196567 192931 189716 186965 184627 182725 181315 180311 179261 177549 175085 172669 171271
53981 171271 170957 170960 170769 170673 171106 171906 172573 172987 173560 174735 176434 177960 178568 178233 177716 177615 177592 176951 175723
53962 175723 174569 173671 172411 170344 167924 165926 164558 163442 162174 160658 159127 158032 157708 158018 158504
53947 158504 158854 159007 158930 158789 159267 161194 164722 169360 174894 181722 190079 199472 209134 218622 227767 236507
53931 236507 245018 253484 261426 267707 271575 273340 273747 273175 271832 270285 269250 269055 269658 270937 272675
53916 272675 274600 276822 279900 284084 288750 293014 296622 299848 302827 305563 308409 311983 316544 321871
53902 321871 327656 333615 339296 344292 348727 353098 357373 360612 361736 360597 358020 354911 351593 348057
53888 348057 344543 341415 338472 334867 329986 324123 317894 311336 304078 296191 288152 280058 271637 263195
53874 263195 255731 249719 244387 238687 232450 226180 220202 214608 209557 205032 200528 195623 190640 186202
53860 186202 182260 178137 173443 168383 163251 158184 153481 149560 146404 143506 140596 138058 136342 135199
53846 135199 133794 131539 128603 125667 123370 121987 121462 121574 121986 122241 121903 120834 119311 117805 116593
53831 116593 115585 114508 113287 112222 111702 111782 112197 112796 113679 114813 115824 116417 116740 117054 117331 117504 117824
53814 117824 118512 119314 119959 120786 122287 124153 125498 126079 126558 127482 128668 129750 130726 131706 132690 133815 135363
53797 135363 137346 139561 142103 145307 149158 153416 158295 164207 170766 177003 182768 188884 195524 201584
53783 201584 206306 210473 215083 219737 223391 226025 228388 230541 231784 231877 231363 230743 230127 229600 229155 228267
53767 228267 226226 222885 218680 214041 209288 204782 200615 196393 191883 187544 183793 180161 175992 171665
53753 171665 168234 166038 164557 163461 162800 162198 160949 159080 157430 156371 155311 153747 152024 150653 149592
53738 149592 148642 147963 147727 147679 147479 147151 146849 146474 145848 145076 144483 144325 144603 144973 144922 144329 143785 143916 144499
53719 144499 144785 144701 144988 146001 147009 147084 146243 145352 145295 146593 149409 153409 157795 161875 165599 169365 173369
53702 173369 177359 180932 184023 187119 190970 195849 201098 205628 208893 211221 213240 215324 217591 219980
53688 219980 222106 223315 223137 221606 219134 216265 213622 211821 211246 211946 213698 216007 218134 219489 220084
53673 220084 220425 220924 221593 222279 222910 223438 223788 224033 224541 225862 228354 231724 234898 236732 237071 236873 237090
53656 237090 237780 238620 239704 241242 242833 243879 244500 245292 246275 246957 247481 248765 251234 254192 256830 259099
53640 259099 261138 262507 262652 261766 260646 259880 259504 259143 258181 256121 253230 250478 248480 246712 244196 240762
53624 240762 237252 234602 233089 232384 231969 231528 231234 231630 233049 235166 237252 238743 239521 239806 240013 240564
53608 240564 241674 243309 245357 247691 250072 252347 254815 257988 261816 265560 268770 271955 275844 280300
53594 280300 284562 288354 292070 295891 299459 302706 306328 310928 316064 320783 324904 329163 334057 339126
53580 339126 343648 347549 351212 354700 357745 360398 363158 366261 369309 371804 373775 375681 377907 380554
53566 380554 383479 386303 388551 390016 390945 391781 392835 394195 395713 397016 397885 398614 399579 400442 400438 399762 399888
53549 399888 401939 405336 408713 411644 414564 417485 419901 421932 424448 427786 431211 434018 436469 439313
53535 439313 442907 447153 451790 456412 460602 464365 468134 472090 475862 479084 481921 484836 488164 492068
53521 492068 496537 501279 505983 510921 516863 524121 532013 539568 546529 553408 560791 568892 577665 587128
53507 587128 597525 609110 621704 634637 647473 660641 674893 690238 705967 721802 738432
53496 738432 756686 776626 797670 819247 841088 863264 886132 910000 934724 959890 985420
53485 985420 1011580 1038435 1065738 1093345 1121147 1148619 1175121 1200808 1226480 1252272 1277339
53474 1277339 1301262 1324981 1349629 1375073 1400320 1424929 1449229 1473410 1497166 1520139 1542164
53463 1542164 1563097 1582916 1601861 1620090 1637289 1653066 1667620 1681509 1694774 1706665 1716258
53452 1716258 1723134 1727560 1730314 1732253 1733686 1734047 1732373 1728162 1721767 1714009 1705358 1695370 1682962 1667505
53438 1667505 1649539 1630161 1609886 1588656 1566685 1544442 1521698 1497604 1472143 1446598 1421961
53427 1421961 1397676 1372672 1346925 1321102 1295311 1269313 1243629 1219357 1196938 1176059 1156728
53416 1156728 1139477 1124413 1110904 1098412 1086906 1076317 1066359 1057198 1049597 1044022 1040110 1037335
53404 1037335 1035733 1035668 1037385 1041113 1047210 1055798 1066492 1078782 1092491 1107665 1124310 1142456 1162231
53391 1162231 1183618 1206391 1230484 1256229 1283980 1313712 1345172 1378265 1413045 1449537 1487792
53380 1487792 1527977 1570125 1613866 1658707 1704577 1751854 1800828 1851331 1903031 1955863 2009900
53369 2009900 2064810 2119747 2173979 2227496 2280777 2333979 2386640 2438167 2488324 2537074 2584206
53358 2584206 2629256 2671624 2710543 2745182 2775049 2800268 2821255 2838243 2851191 2859931 2864032 2862751
53346 2862751 2855647 2843330 2827234 2808473 2787126 2762728 2735147 2704709 2671622 2635685 2596646
53335 2596646 2554619 2509976 2462961 2413715 2362722 2310989 2259633 2209417 2160707 2113537 2067380
53324 2067380 2021150 1973958 1925964 1878177 1831532 1786507 1743441 1702559 1663550 1625751 1588999
53313 1588999 1553842 1520641 1489031 1458628 1429770 1403044 1378426 1355362 1333462 1312723 1293263
53302 1293263 1275277 1259027 1244536 1231428 1219378 1208502 1199045 1191052 1184707 1180518 1178655 1178418 1179018
53289 1179018 1180607 1183859 1188700 1194273 1200230 1207298 1216329 1227351 1239891 1253756 1269101 1286041 1304561
53276 1304561 1324748 1346819 1370857 1396558 1423299 1450513 1478038 1505997 1534382 1562981 1591727
53265 1591727 1620703 1649504 1677020 1702266 1725241 1746593 1766660 1785299 1802376 1817811 1831168
53254 1831168 1841827 1849720 1855498 1859809 1862685 1863672 1862256 1858113 1851275 1842159 1831251 1818709 1804389
53241 1804389 1788188 1770153 1750447 1729503 1708111 1686968 1666143 1645225 1623891 1602022 1579369
53230 1579369 1555628 1530824 1505320 1479404 1453225 1427139 1401694 1377138 1353194 1329484 1306027
53219 1306027 1283276 1261732 1241503 1222130 1203011 1184110 1166023 1149187 1133366 1118200 1103921
53208 1103921 1091032 1079455 1068459 1057358 1045899 1034107 1022214 1010624 999510 988402 976529
53197 976529 963510 949487 934786 919861 905282 891266 877357 863072 848722 835076 822334
53186 822334 810035 797858 785896 774108 762122 749662 736743 723407 709718 695941 682262
53175 682262 668454 654294 640137 626441 612984 599310 585756 573135 561388 549608 537559
53164 537559 526178 516226 507347 498873 490745 483106 475754 468594 462050 456447 451511 447009 443346 440919
53150 440919 439268 437446 435046 432423 430114 428344 426866 425074 422533 419534 416696 414004 410784 406740
53136 406740 402207 397226 391234 384184 377038 370442 363648 355625 346659 337956 330085 322764 315886 309760
53122 309760 304357 299148 293825 288613 283816 279503 275588 271812 267806 263595 259842 257045 254731 251989
53108 251989 248650 245289 242257 239385 236567 233891 231171 228024 224510 221061 217701 214045 210214 207045
53094 207045 204999 203489 201706 199615 197603 195545 192873 189499 186117 183472 181633 180162 178723 177336
53080 177336 176083 174784 173124 171041 168842 166903 165392 164322 163704 163491 163495 163456 163109 162191 160561 158452
53064 158452 156367 154607 153122 151976 151584 152187 153325 154195 154393 154045 153393 152636 152045 151782 151597 151031 150010
53047 150010 148966 148344 148173 148119 147791 147057 146174 145574 145404 145439 145528 145780 146118 146045 145324 144588 144684 145484 145942 145377
53027 145377 144157 143019 142264 141851 141817 142234 142986 143955 145324 147399 150100 152819 154875 156147 157190 158664
53011 158664 160659 162754 164734 166975 169992 173914 178616 183991 189725 195162 199949 204660 210156 216363
52997 216363 222266 227131 231092 234269 236014 235582 233248 230221 227509 225204 222787 219824 216275 212358
52983 212358 208278 204151 200191 196797 194266 192368 190433 187928 184931 181978 179602 177965 176775 175464
52969 175464 173610 171311 169119 167604 166992 167071 167343 167359 167131 167133 167736 168770 169843 170882 171977 172858 173041
52952 173041 172564 172083 172113 172584 173295 174317 175645 176891 177691 178141 178481 178609 178362 178066 178334 179339 180698
52935 180698 182018 183144 183859 183886 183363 182960 183198 183875 184495 185039 185945 187334 188696 189461 189684 189955 190760 192102
52917 192102 193667 195149 196412 197513 198677 200131 201852 203570 205054 206309 207372 208046 208090 207694 207544
52902 207544 208245 209758 211566 213307 215064 216956 218711 219885 220472 221022 221980 223152 224081 224860 226203 228641
52886 228641 231939 235566 239446 243938 249067 254122 258206 261070 263332 265919 269298 273156 276793 279810
52872 279810 282361 284684 286495 287111 286291 284737 283536 283054 282542 280936 277951 274320 270996 268320 265966
52857 265966 263488 260755 257944 255292 252875 250522 247970 245223 242704 240874 239714 238749 237555 236066
52843 236066 234430 232885 231825 231593 231909 231821 230630 228810 227587 227508 227734 227009 225115 223042 221720 220930
52827 220930 219704 217595 215139 213063 211433 209894 208374 207129 206183 205247 204222 203409 203073 203129 203370 203666
52811 203666 203708 202901 200861 197929 194945 192631 191272 190750 190587 190069 188707 186630 184464 182818 181943 181665
52795 181665 181474 180817 179552 178103 177040 176554 176414 176266 175861 175151 174403 174066 174323 174846 175164 175167 175002 174580
52777 174580 173477 171402 168559 165505 162779 160662 159141 158034 157185 156533 156009 155516 155078 154849 154785 154422
52761 154422 153223 151119 148567 146047 143712 141573 139817 138708 138163 137644 136642 135202 133774 132569 131459
52746 131459 130579 130543 131602 132955 133559 133521 133981 135547 137579 139268 140702 142425 144535 146816 149363 152425
52730 152425 155795 158902 161423 163395 164888 165972 166855 167564 167558 166182 163480 160154 156658 152812 148442
52715 148442 144016 140316 137638 135442 132811 129238 125046 121057 117865 115476 113575 111868 110111 108127
52701 108127 105953 103758 101508 99003 96337 93908 91771 89534 87214 85667 85551 86261 86561 86064 85405
52686 85405 85069 84762 84031 82970 82129 82060 82933 84239 84906 84203 82614 81401 81225 81516 81268 80088 78413
52669 78413 76999 76328 76316 76518 76663 76836 77050 77010 76575 76115 75984 75989 75887 76000 76718 77640 78023 77981 78412 79647
52649 79647 80937 81446 81081 80169 79007 78003 77667 78033 78544 78847 79318 80499 82270 83889 84649 84386 83503
52632 83503 82577 81812 80975 80075 79672 80022 80272 79302 77261 75394 74428 74091 74276 75510 77818 80150 81610
52615 81610 82420 83087 83377 82923 82155 81715 81389 80551 79332 78456 78064 77594 76870 76544 77272 78973 81011 82737
52597 82737 83795 84278 84651 85283 86056 86662 87165 87872 88809 89656 90228 90662 91072 91328 91251 90852 90330 89911 89676
52578 89676 89477 89183 89037 89536 90823 92461 93997 95408 96740 97658 97798 97409 97190 97609 98646 100071 101578
52561 101578 102777 103489 104099 105225 107013 109044 110965 112890 115048 117284 119069 119944 119913 119481 119281 119628
52545 119628 120503 121934 124148 127120 130179 132427 133559 134077 134704 135784 137290 139162 141433 143991 146335
52530 146335 147764 147991 147483 147012 146865 146762 146526 146489 147030 147989 148829 149274 149579 150214 151401 152915 154271 155194
52512 155194 155848 156458 156782 156305 154987 153478 152435 151979 151996 152623 154026 155856 157292 157713 157198 156386 155854
52495 155854 155638 155369 154901 154573 154616 154586 153838 152503 151458 151243 151486 151513 151052 150192 149128 148176 147654 147562 147693
52476 147693 148141 149201 150676 151860 152401 152649 152941 153175 153335 153779 154621 155497 156280 157364 158806 159977 160620
52459 160620 161523 163420 165896 168154 170148 172103 173602 174289 174936 176571 178830 180400 180955 181387 182166 182847
52443 182847 183410 184797 187546 190873 193685 195705 197083 197790 198072 198869 200988 204195 207692 211085 214326
52428 214326 217105 218988 220062 220885 221805 222693 223285 223439 223093 222284 221220 220096 218779 216825 213875 209969
52412 209969 205478 200805 196263 192173 188905 186551 184592 182264 179395 176582 174354 172513 170597 168634
52398 168634 166976 165632 164261 162680 160925 158995 157046 155654 155286 155490 155183 153856 152039 150617 150137
52383 150137 150740 152122 153486 154087 153989 153887 154136 154482 154765 155244 156088 157116 158217 159508 160906 162168 163473
52366 163473 165333 167646 169538 170563 171392 172840 174791 176708 178655 181089 183923 186515 188449 189763
52352 189763 190529 190841 191230 192530 195108 198546 202195 205792 209443 213193 216744 219603 221588 223190 225245
52337 225245 228107 231301 234106 236330 238386 240781 243727 247089 250475 253484 256013 258285 260506 262645
52323 262645 264608 266509 268646 271297 274509 277931 280929 283203 285306 288146 291886 295723 298941 301739
52309 301739 304782 308327 312221 316469 321324 326927 333150 339778 346645 353717 361190 369305 377916 386467
52295 386467 394635 402779 411523 421136 431532 442631 454304 466200 477973 489627 501386 513386
52283 513386 525711 538518 551790 565231 578755 592840 607924 623684 639461 655337 672080
52272 672080 689901 707871 724918 740989 756869 773187 789902 806516 822323 836530 848582
52261 848582 858563 867225 875536 884100 892794 900873 907599 912970 917736 922514 927046 930585 932942 934763
52247 934763 936656 938401 939322 939295 939022 939278 940115 940905 941110 940938 941186 942407 944282 946139 948093 951248 956379
52230 956379 962848 969443 976077 983846 993395 1004116 1015270 1026944 1039262 1051436 1062592 1073184
52218 1073184 1084587 1097353 1110657 1123452 1135415 1146667 1157384 1167970 1178934 1190142 1200562
52207 1200562 1209070 1215299 1219623 1222654 1224913 1226593 1227460 1227191 1225886 1223906 1221247 1217534 1212687 1207140
52193 1207140 1201236 1194851 1187792 1180161 1172181 1164059 1156106 1148606 1141420 1134164 1126870 1119977 1113611 1107458
52179 1107458 1101493 1096157 1091506 1086770 1081173 1074752 1068061 1061618 1055902 1051232 1047197 1042848 1037973 1033560
52165 1033560 1030396 1027823 1024656 1020814 1017134 1013905 1010585 1006925 1003463 1000697 998405 996022 993288 990424
52151 990424 987967 986385 985516 984464 982421 979489 976291 972944 968940 963988 958508 953188 948355 943795
52137 943795 938893 933044 926199 918931 911764 904704 897630 890759 884260 877840 871292 865120 859908 855246
52123 855246 850094 844208 838477 833754 830027 826832 823831 820778 817522 814309 811604 809346 806862 803724
52109 803724 800344 797479 795483 794201 793299 792569 792169 792603 794198 796654 799494 802850 807271 812850 819142
52094 819142 825945 833448 841505 849718 858502 869181 882365 896924 911308 925357 940056 955964
52082 955964 972810 990402 1008887 1027968 1046750 1064807 1082806 1101577 1120929 1139905 1158044
52071 1158044 1175896 1194191 1212832 1230939 1247718 1262966 1276766 1288984 1299385 1308115 1315753 1322800
52059 1322800 1329232 1334612 1338497 1340699 1341316 1340570 1338600 1335455 1331357 1326753 1321872 1316348 1309622 1301685
52045 1301685 1293087 1284249 1275196 1266045 1257262 1249148 1241388 1233460 1225301 1217315 1209900 1203230 1197354 1192188
52031 1192188 1187423 1182695 1177977 1173721 1170620 1169152 1169254 1170373 1171935 1173719 1175758 1178029 1180499 1183354
52017 1183354 1186775 1190444 1193722 1196516 1199542 1203445 1207945 1212151 1215519 1218124 1220218 1221874 1223000 1223363
52003 1223363 1222597 1220458 1217072 1212769 1207673 1201614 1194319 1185512 1174918 1162471 1148534 1133599 1117681
51990 1117681 1100179 1080477 1058536 1034845 1009908 983990 957343 930441 903749 877231 850406
51979 850406 823117 796061 770186 745551 721208 696375 671422 647426 625015 603983 583875
51968 583875 564602 546450 529827 515026 502030 490409 479524 468914 458468 448263 438393 428988
51956 428988 420285 412585 406061 400596 395844 391482 387414 383629 379954 376135 372171 368364 364964 361956
51942 361956 359228 356624 353711 349853 344896 339581 334915 331192 327995 324993 322334 320152 318141 315819
51928 315819 313035 310027 307185 304828 303030 301455 299506 296854 293776 290885 288624 287118 286391 286417 286913
51913 286913 287298 287050 286199 285377 285270 285933 286660 286591 285446 283692 282096 281180 280977 281068 280811 279722 277778 275379
51895 275379 272984 270891 269215 267860 266439 264515 262091 259668 257671 255974 254238 252446 250813 249288
51881 249288 247618 245885 244529 243682 242882 241695 240248 238866 237522 236086 234920 234646 235272 235998 236065 235541
51865 235541 235119 235382 236394 237833 239299 240544 241497 242117 242322 242190 242136 242644 243822 245354 246877 248182
51849 248182 249124 249649 249929 250251 250720 251366 252444 254167 256120 257490 258109 258770 260231 262340 264474 266306
51833 266306 267719 268485 268784 269673 272203 276070 279859 282649 284796 287082 289777 292764 295916 298968 301438
51818 301438 303066 304007 304328 303703 301968 299645 297460 295528 293384 290749 287896 285301 283236 281694 280500
51803 280500 279440 278476 277840 277820 278483 279697 281280 282942 284189 284638 284528 284734 286127 288917 292641 296615
51787 296615 300333 303539 306182 308306 309924 310911 311118 310643 309911 309370 309156 309140 309164 309076 308646 307792 306882 306422
51769 306422 306355 306043 305225 304537 304688 305413 305779 305440 304988 305037 305479 305859 306135 306796 308303 310556 312851 314407
51751 314407 315124 315725 316953 318757 320569 322239 324225 326800 329540 331858 333782 335960 339008 342912 346907
51736 346907 350014 351923 353333 355242 358012 361434 365461 370271 375666 381044 386134 391221 396512 401954
51722 401954 407892 415183 424128 433789 442846 450652 456932 460990 462025 460065 455912 450263 443541 436466
51708 436466 430027 424614 419646 414319 408497 402782 397951 394381 391730 389138 385940 382226 378563 375237
51694 375237 371978 368355 364172 359518 354697 350104 345941 342098 338494 335397 333183 331910 331430 331723 332796
51679 332796 334272 335516 336111 335881 334527 331712 327510 322414 316857 311171 305968 301936 299122 296843 294582
51664 294582 292493 290853 289527 288323 287422 286964 286528 285534 284003 282511 281590 281564 282728 285147 288294 291384
51648 291384 294196 297172 300711 304782 309309 314486 320402 326659 332670 338139 343067 347425 351114 354106
51634 354106 356414 357900 358254 357161 354485 350397 345360 339756 333489 326266 318475 311361 305838 301308
51620 301308 296266 290034 283309 276957 270981 265097 259660 255272 251736 248241 244624 241729 240198 239400
51606 239400 237996 235319 231830 228448 225863 224445 224265 224934 225624 225602 224741 223439 222075 220776 219660 218990
51590 218990 218912 219190 219456 219643 219959 220469 220956 221184 221115 220863 220724 221231 222775 225037 227189 228809 230232 231783
51572 231783 233230 234386 235785 238151 241491 245360 249721 254799 260233 265315 270180 275890 282995 290798
51558 290798 298529 306506 315441 325028 334043 341740 348467 354851 360882 365962 369487 371208 371199 369673 366819
51543 366819 362817 358038 353100 348612 344862 341768 339133 336971 335708 335933 337749 340470 343218 345802
51529 345802 348640 351920 355369 358995 363495 369520 376871 384781 392797 401068 409926 419380 428936 437774
51515 437774 445327 451689 457180 461463 463678 463640 462266 460406 457793 453793 448794 444139 440813 438792 437514
51500 437514 436397 434956 433071 431286 430451 430939 432458 434455 436446 438048 439119 439759 439785 438472 435314
51485 435314 430884 426352 422190 417945 413229 408226 403165 397967 392690 387771 383584 380199 377697 376112
51471 376112 374856 372912 370058 367310 365586 364420 362707 360362 358419 357572 357424 357370 357510 358250 359494 360780
51455 360780 362031 363645 365795 368128 370333 372628 375305 378036 380120 381477 382959 385537 389522 394679
51441 394679 400679 407095 413381 419296 425220 431614 438323 444777 450711 456217 461245 465598 469370 472840
51427 472840 475816 477605 477750 476380 473777 470188 466296 463183 461332 460053 458426 456513 455149 454692 454580
51412 454580 454150 453396 452730 452400 452320 452252 451815 450404 447409 442657 436594 429943 423235 416655 410149 403453
51396 403453 396136 387954 379286 370939 363284 355837 347933 339621 331606 324479 318360 313164 308763 304870
51382 304870 301103 297348 293846 290920 288837 287906 288401 290296 293271 297033 301392 306063 310701 315196 319742
51367 319742 324470 329153 333246 336067 337094 336338 334339 331485 327461 321701 314299 306053 297677 289461
51353 289461 281629 274365 267342 259834 251581 243137 235084 227457 220207 213734 208453 204174 200455 197303
51339 197303 195022 193427 191770 189496 186798 184309 182424 180948 179358 177426 175592 174534 174341 174365 173991
51324 173991 173265 172557 171957 171328 170723 170351 170213 170164 170275 170811 171744 172624 173111 173427 174081 175227 176495 177512
51306 177512 178372 179416 180744 182278 184273 187249 191140 194993 197990 200489 203533 207576 212278 217458
51292 217458 223418 230257 237526 244790 251972 258949 265441 271558 277840 284332 290183 294538 297378 298966
51278 298966 299000 296897 292678 287057 280790 274256 267443 260009 251658 242693 233860 225491 217343 209639 203461
51263 203461 199430 196563 193308 189286 185177 181257 177174 173003 169370 166368 163384 160339 158213 157796
51249 157796 158542 159174 158963 158014 156726 155453 154433 153663 153003 152585 152857 154077 156027 158339 160743 162826
51233 162826 164050 164375 164550 165406 167070 169176 171553 174277 177220 179968 182209 183895 185024 185541 185456 184947
51217 184947 184302 183813 183558 183153 181889 179437 176381 173870 172664 172602 172896 172754 171849 170460 169177 168288 167410
51200 167410 165973 164115 162810 162797 163595 163903 162995 161405 160171 159707 159644 159468 158976 158162 157116 156147 155689
51183 155689 155864 156283 156449 156241 155860 155428 154771 153539 151461 148563 145300 142419 140625 140271 141203 142686
51167 142686 143633 143364 142298 141585 141838 142497 142584 141776 140460 139066 137772 136646 135684 134810 134160 134249 135451
51150 135451 137384 139214 140561 141760 143235 144965 146632 147941 148704 148911 148865 149048 149638 150297 150473 149842
51134 149842 148471 146691 144853 143112 141450 139927 138744 137953 137323 136686 136163 135824 135396 134738 134421 135298
51118 135298 137402 139686 140935 140670 139205 137302 135861 135496 136165 137421 139135 141671 145250 149467 153645
51103 153645 157470 161099 164861 168987 173475 178045 182294 185935 188831 190918 192316 193379 194298 194719 194206
51088 194206 193095 192385 192563 192912 192268 190226 187398 184757 182894 181655 180274 178040 175100 172435 170944
51073 170944 170706 171211 172002 172864 173615 173994 173750 172798 171398 170089 169161 168188 166513 164238 162237 161075 160413
51056 160413 159762 159232 159054 158831 157952 156499 155207 154599 154694 155369 156475 157616 158379 158923 159895 161612 163634
51039 163634 165258 166154 166470 166638 167195 168591 170961 174147 177778 181202 183619 184773 185511 187168 190290
51024 190290 194254 198199 201848 205272 208354 210902 212999 214913 216863 219119 222002 225418 228596 230767
51010 230767 232073 233378 235142 236860 237721 237516 236764 236199 236369 237545 239761 242854 246559 250589 254724
50995 254724 258929 263409 268441 274169 280666 288102 296538 305519 314263 322520 331074 341089 353055 366631
50981 366631 381399 397406 415031 434744 457087 482474 510749 541279 573817 609055 647941
50970 647941 690527 735877 783204 832716 885201 940966 999422 1059547 1120422 1181166 1240666
50959 1240666 1297747 1351661 1402088 1448445 1489534 1524329 1553059 1577002 1597029 1612797 1623653
50948 1623653 1629987 1633266 1634920 1635669 1635860 1635952 1636475 1637712 1639544 1641442 1642567 1642013 1639032 1632936 1622947
50933 1622947 1608349 1588770 1564108 1534190 1498759 1457843 1411935 1361792 1308254 1252284 1194936
50922 1194936 1137108 1079405 1022404 967040 914672 866583 823207 783795 747123 712690 681078
50911 681078 653032 628555 607115 588322 571957 557624 544999 534309 525965 519778 515047 511396
50899 511396 508888 507327 506135 505080 504436 504243 504107 504019 504622 506138 507766 508754 509448 510585 512135 513768
50883 513768 516025 519881 525180 530587 535342 540183 546172 553420 561482 570337 580314 591427 603433 616397
50869 616397 630644 646338 663647 683262 706143 732632 762306 795004 831513 872850 919250
50858 919250 970502 1027236 1091111 1163350 1243536 1330455 1423905 1525121 1635298 1754181 1880217
50847 1880217 2011593 2146693 2283849 2421157 2556533 2687599 2811442 2924810 3024853
50838 3024853 3109827 3179242 3233474 3273254 3299414 3313119 3316276 3311555 3301841 3289765 3277801 3268540
50826 3268540 3264308 3266330 3274355 3287127 3303010 3319954 3335061 3344654 3345088 3333580 3308277 3267826
50814 3267826 3211320 3138771 3051262 2950371 2837596 2714647 2584085 2449121 2312711 2177086
50804 2177086 2044188 1916077 1794719 1681646 1577996 1484464 1400939 1326477 1260094 1201566
50794 1201566 1151259 1109277 1074961 1047105 1024505 1006434 992726 983278 977456 974259 973131 974180
50782 974180 977312 981545 985655 989198 992335 994806 995692 994250 990498 984817 977385 968215 957467 945526
50768 945526 932884 920015 907201 894404 881435 868322 855415 843231 832286 822944 815208 808777
50756 808777 803602 800277 799599 801774 806354 812975 821825 833373 847977 865791 886802 910903 938207
50743 938207 969321 1004997 1045488 1090589 1140359 1195433 1256476 1323731 1397252 1477168 1563334
50732 1563334 1654946 1750696 1849152 1948787 2047922 2144878 2237933 2324941 2403293 2470623 2525385
50721 2525385 2566552 2593167 2604742 2601974 2586611 2560694 2526395 2486414 2443827 2401268 2360644
50710 2360644 2323692 2292125 2266825 2247366 2232825 2222704 2216425 2212099 2206497 2196402 2179603 2154560
50698 2154560 2119827 2074382 2018326 1952921 1879987 1801452 1719262 1635333 1551540 1469826 1392167
50687 1392167 1320069 1254126 1194241 1140194 1091863 1049146 1012112 981195 956737 938302 924800
50676 924800 915449 910279 909598 913399 921519 933921 950472 970620 993625 1018844 1045603 1073021 1100292
50663 1100292 1126884 1152247 1175640 1196653 1215549 1232605 1247409 1259369 1268705 1276268 1282508 1287326
50651 1287326 1290954 1294182 1297440 1300457 1303241 1306849 1312626 1321112 1332210 1346100 1363444 1384769 1410180
50638 1410180 1439545 1472529 1508457 1546560 1586415 1627783 1669971 1711643 1751350 1788068 1821289
50627 1821289 1850980 1877595 1901861 1924391 1945636 1966262 1987280 2009628 2033780 2059983 2088615
50616 2088615 2119954 2153594 2188361 2222833 2255700 2285504 2310461 2329003 2340552 2345440 2344015 2336137
50604 2336137 2321710 2301414 2276433 2247435 2214091 2175602 2131496 2081805 2026817 1966931 1902749
50593 1902749 1835119 1765072 1693789 1622525 1552341 1483800 1416998 1351960 1289083 1229230 1173391
50582 1173391 1122202 1075734 1033769 996240 963313 934981 910685 889526 870886 854758 841437
50571 841437 831019 823375 818574 817043 819110 824529 832736 843507 857014 873154 891154 910188 930235
50558 930235 952032 976271 1003144 1032519 1064139 1097577 1132377 1168451 1206044 1245099 1284868
50547 1284868 1324383 1363088 1400718 1436799 1470721 1502291 1531902 1560103 1587333 1614122 1641174
50536 1641174 1668987 1697688 1727479 1758999 1792865 1829062 1867232 1907592 1951122 1998802 2051093
50525 2051093 2108242 2170508 2237534 2307865 2379660 2451831 2524037 2595639 2665127 2730497 2789693
50514 2789693 2840686 2881929 2913078 2934720 2946950 2948657 2938709 2917494 2886651 2847505 2800553 2746595
50502 2746595 2687713 2626719 2565954 2507047 2451700 2402196 2360678 2327903 2302987 2284577 2272128
50491 2272128 2265665 2264566 2267294 2272545 2279948 2289088 2298394 2305657 2309256 2308015 2300008 2282466 2253207
50478 2253207 2211677 2158586 2095259 2023586 1945913 1864446 1780962 1697213 1615056 1535805 1459891
50467 1459891 1387559 1319597 1256986 1200138 1148894 1103068 1062547 1027022 996068 969496 947346
50456 947346 929572 915960 906275 900276 897659 898181 901757 908264 917443 929195 943766 961324 981477
50443 981477 1003494 1026949 1051805 1077933 1104919 1132474 1160830 1190595 1222278 1255907 1290933
50432 1290933 1326492 1361840 1396528 1430236 1462643 1493606 1523241 1551620 1578559 1603873 1627577
50421 1627577 1649564 1669449 1687240 1704041 1721423 1740037 1759400 1779240 1800423 1824015 1849776
50410 1849776 1876139 1901674 1926152 1950120 1973779 1996481 2017140 2034914 2049446 2060521 2067632
50399 2067632 2069895 2066376 2056380 2039508 2015630 1984925 1947770 1904403 1854769 1798917 1737557 1672078
50387 1672078 1604044 1534910 1466203 1399632 1336681 1278214 1224730 1176859 1135297 1100251 1071384
50376 1071384 1048492 1031902 1021904 1018025 1019239 1024719 1033929 1045994 1059447 1072871 1085505 1096953
50364 1096953 1106392 1112327 1113159 1108041 1097303 1082141 1063803 1043015 1020118 995602 970263 944887
50352 944887 920050 896191 873498 851692 830366 809795 791010 774769 760736 748069 736500
50341 736500 726352 717702 710187 703713 698733 695558 693920 693541 694746 697999 703027 708999 715590 723320
50327 723320 732588 742843 753250 764044 776641 792154 810115 828964 847646 866399 886052 906950
50315 906950 928738 950921 973347 996129 1019234 1042193 1064240 1084793 1103800 1121534 1138093
50304 1138093 1153239 1166730 1178649 1189337 1199129 1208129 1216059 1222268 1226072 1227204 1225817 1222145 1216416
50291 1216416 1209152 1201102 1192567 1182967 1171327 1157053 1140036 1120272 1097769 1072775 1045846 1017756
50279 1017756 989493 962060 935876 910493 885350 860741 837606 816363 796490 777400 759225
50268 759225 742462 727279 713537 701187 690144 679983 670244 661024 652845 645846 639475 633141 626909
50255 626909 621383 617071 614052 612141 611130 610959 611794 613952 617552 622147 626833 630878 634348 638077 642947
50240 642947 649158 656172 663347 670483 677683 684847 691605 697774 703549 709045 713862 717379 719365 720004
50226 720004 719442 717669 714871 711491 707797 703695 699116 694224 689112 683649 677983 672790 668607 665091
50212 665091 661396 657186 652860 648891 645428 642547 640415 639074 638513 639047 641270 645426 651154 657948 665545
50197 665545 673661 681711 689113 695709 701729 707443 712992 718285 722880 726162 727790 727824 726433 723760 720108
50182 720108 715831 710834 704555 696671 687495 677441 666594 655147 643830 633301 623376 613452 603591
50169 603591 594647 587318 581483 576472 571582 566342 560692 555018 549720 544711 539550 534076 528608 523567
50155 523567 519159 515362 511878 508135 503814 499411 495839 493282 490781 487204 482428 477344 472914 469325
50141 469325 465937 461962 457310 452798 449322 446792 444168 440649 436587 433087 430955 430249 430608 431651 433083
50126 433083 434664 436253 437902 439940 442924 447305 452982 459241 465304 470916 476349 481847 487234 492169
50112 492169 496732 501525 507011 512834 518082 522284 525882 529486 532995 535748 537379 538095 538183 537727 536929
50097 536929 536272 536113 536296 536411 536252 535898 535570 535579 536243 537599 539293 541015 542953 545615 549243 553666 558724
50080 558724 564580 571478 579466 588565 599028 610988 623822 636290 647669 658552 670170 683023
50068 683023 696594 710330 724275 738449 752133 764356 774909 784429 793527 802267 810458 817982
50056 817982 824740 830646 835846 840620 844920 848285 850463 851906 853421 855434 857872 860635 863879 867724
50042 867724 871946 876123 880004 883556 886713 889307 891323 893026 894617 895892 896500 896485 896254 895994 895433 894214
50026 894214 892122 888892 884269 878533 872499 866537 859931 851708 841897 831440 821061 810878 801049
50013 801049 792069 784187 777091 770499 764659 759944 756268 753341 751256 750423 750958 752415 754252 756353 759019
49998 759019 762486 766560 770762 774796 778765 782845 786927 790681 793835 796233 797745 798378 798324 797714 796421
49983 796421 794361 791859 789437 787315 785468 784097 783646 784338 786148 789310 794560 802698 814159 829092
49969 829092 847564 869612 895277 924670 957746 993926 1032138 1071199 1109899 1146744 1180088
49958 1180088 1208822 1232787 1252493 1268728 1282541 1295292 1308405 1322947 1339259 1356657 1373555
49947 1373555 1388166 1399061 1404801 1403306 1392298 1370641 1338828 1298114 1249766 1195404 1137412 1078329
49935 1078329 1019976 963460 909759 859808 814099 772628 735323 702331 673793 649378 628087
49924 628087 608650 590352 573458 558648 546050 535080 525081 515774 507061 498856 491185 484009 476877
49911 476877 469238 461276 453946 447900 442811 438018 433372 429078 425103 421187 417289 413665 410708 408857
49897 408857 408350 408813 409379 409527 409565 410077 411214 412702 414189 415380 416282 417586 420280 424511 429319 433893
49881 433893 438517 443750 449323 454611 459750 465342 471315 477084 482759 489270 497113 505768 514639 523897
49867 523897 534038 545187 557295 570700 586049 603779 623874 646021 669880 695401 723008
49856 723008 753453 787382 825076 866543 911899 961725 1016885 1077591 1142537 1209452 1276680
49845 1276680 1343679 1409674 1472678 1530797 1584072 1634070 1681784 1726912 1769315 1810192 1851299
49834 1851299 1893470 1936183 1977962 2016765 2050288 2076258 2092469 2096773 2087674 2065198 2030859 1986638
49822 1986638 1934270 1875424 1811919 1745358 1676888 1607506 1538304 1470230 1403832 1339414 1277172
49811 1277172 1217213 1159755 1105307 1054208 1006046 960113 916541 876329 840058 807208 777084
49800 777084 749762 725632 704502 685760 669069 654294 640982 628407 616034 603523 590480
49789 590480 576676 562471 548592 535502 523219 511591 500466 489727 479477 470091 461763 454139
49777 454139 446717 439520 433015 427500 422853 418801 415110 411620 408417 405894 404246 403038 401688 400355
49763 400355 399830 400482 401830 403290 404883 406887 409211 411519 413747 416070 418484 420851 423381 426651 430977
49748 430977 435946 440844 445502 450612 457174 465628 475457 485643 495600 505795 517426 531441 547943
49735 547943 566559 587193 610194 635881 664322 695721 730736 770034 813602 860701 910410
49724 910410 961994 1014734 1067629 1119306 1168063 1212116 1250150 1281854 1307951 1329814 1349163
49713 1349163 1367844 1387318 1408091 1429803 1451856 1473589 1493623 1509400 1517809 1516333 1503577 1479050
49701 1479050 1442923 1396137 1340618 1279160 1214940 1150801 1088744 1029976 975333 925460 880592
49690 880592 840435 804476 772293 743523 717734 694585 674080 656509 642136 630896 622190 614928
49678 614928 608069 601298 594968 589252 583745 578241 573479 570475 569130 568098 566204 563493 560707 558235
49664 558235 556010 554036 552421 551002 549438 547812 546707 546563 547222 548238 549326 550291 550866 550949 550805 550650
49648 550650 550157 548832 546843 545001 543805 542961 542014 540931 539729 537992 535370 532336 529902 528575 528101
49633 528101 528201 528986 530476 532213 533707 534969 536310 537800 539229 540560 542162 544532 547748 551170 553789
49618 553789 555088 555587 556308 557720 559519 561404 563624 566540 570037 573755 577713 582318 587821 594056 600678
49603 600678 607480 614545 622270 631174 641452 652741 664459 676348 688587 701467 715168 729689
49591 729689 744804 760153 775639 791753 809277 828622 849591 871751 894832 918806 943877
49580 943877 970470 998984 1029408 1061399 1094836 1130123 1167692 1207406 1248679 1291046 1334318
49569 1334318 1378269 1422630 1467551 1513662 1561369 1610354 1660102 1710682 1762493 1815247 1867770
49558 1867770 1919047 1969036 2018048 2065555 2110069 2150155 2185251 2215418 2240606 2260341 2274022
49547 2274022 2281363 2282503 2277702 2267113 2251028 2230307 2206235 2179844 2151580 2121780 2091192 2060817
49535 2060817 2031508 2003958 1978825 1956525 1937178 1921115 1909125 1901737 1898473 1898410 1901428 1908292 1919537
49522 1919537 1934926 1954115 1977223 2004471 2035652 2070231 2107482 2146359 2185680 2224774 2263666
49511 2263666 2302383 2340417 2377073 2411878 2444328 2473591 2498815 2519460 2534983 2544461 2546891 2541677
49499 2541677 2528614 2507717 2479390 2444452 2403597 2356958 2304502 2246698 2184567 2119317 2052245
49488 2052245 1984664 1917488 1850986 1785286 1720907 1658532 1598466 1540713 1485412 1432794 1382841
49477 1382841 1335369 1290313 1247604 1206973 1168276 1131795 1097742 1065646 1034829 1005389 978037
49466 978037 952895 929125 905979 883758 863396 845394 829422 814739 800774 787441 775058
49455 775058 763883 753738 744302 735660 728241 722103 716600 710928 704766 698344 692124 686530 681717 677410
49441 677410 673148 668837 664912 661852 659727 658386 657845 658290 659825 662461 666291 671532 678330 686623 696154
49426 696154 706491 716984 726762 734950 741067 745362 748706 752080 756132 761194 767452 774880 783106 791628
49412 791628 800267 809289 819026 829532 840609 852085 863905 875959 887885 899223 909895 920431
49400 920431 931459 942963 954236 964585 973755 981683 988306 993889 999092 1004247 1008867 1012283 1014564
49387 1014564 1016316 1017761 1018582 1018669 1018469 1018550 1019236 1020731 1023177 1026419 1030046 1033753 1037474 1041202 1045058 1049545
49371 1049545 1055315 1062614 1071284 1081256 1092602 1105074 1118146 1131713 1146305 1162371 1179785 1198231
49359 1198231 1217670 1238155 1259629 1282252 1306548 1332836 1360798 1389967 1420405 1452562 1486714
49348 1486714 1522938 1561479 1602736 1646965 1694263 1744653 1797934 1853684 1911866 1973250 2038801
49337 2038801 2108667 2182202 2258874 2338604 2421163 2505866 2592209 2680372 2770616 2862392 2954466
49326 2954466 3045940 3136690 3226697 3315248 3401052 3482939 3560058 3631472 3696042 3752979 3802147
49315 3802147 3843455 3876228 3899653 3913815 3919696 3918154 3909490 3894292 3874093 3850638 3824794 3796686
49303 3796686 3766714 3735955 3705683 3676964 3650691 3627522 3607739 3591532 3579415 3571959 3569126 3570304
49291 3570304 3575128 3583789 3596425 3612841 3633129 3658012 3687957 3722284 3759766 3800000 3843473 3890322
49279 3890322 3939634 3990194 4041290 4092338 4142114 4188814 4230736 4266594 4295353 4316212 4328743
49268 4328743 4332688 4327642 4313158 4289141 4255871 4213733 4163302 4105609 4041858 3972784 3898725 3820541
49256 3820541 3740004 3658978 3578480 3498806 3420203 3343062 3267723 3194576 3124225 3057165 2993454
49245 2993454 2933034 2876171 2823084 2773325 2726145 2681521 2640288 2603082 2569622 2539109 2510867
49234 2510867 2484439 2459571 2436478 2415774 2397779 2382106 2368107 2355415 2343842 2333135 2323239
49223 2323239 2314522 2307330 2301466 2296417 2291807 2287303 2282379 2276731 2270746 2265003 2259364 2253090 2245891 2238277
49209 2238277 2230763 2223269 2215485 2207362 2198948 2190284 2181812 2174503 2169000 2164845 2161014 2157076 2153377 2150264
49195 2150264 2147747 2146004 2145624 2147049 2150128 2154463 2159865 2166199 2173109 2180278 2187760 2195646 2203488 2210442
49181 2210442 2216040 2220555 2224590 2228451 2231887 2234259 2235104 2234797 2234441 2234705 2234948 2233999 2231755 2229413 2228039
49166 2228039 2227578 2227536 2227966 2229313 2231825 2235678 2241281 2248810 2257747 2267550 2278628 2291959 2307801 2325427
49152 2325427 2344205 2364318 2386207 2409843 2434852 2461004 2488355 2517174 2547872 2580674 2615084
49141 2615084 2649857 2683657 2715742 2746049 2774975 2803107 2830876 2858234 2884831 2910498 2935387
49130 2935387 2959702 2983549 3007011 3030035 3052242 3073243 3093162 3112488 3131424 3149849 3167988
49119 3167988 3186528 3205840 3225497 3244866 3263844 3282839 3302350 3322725 3343863 3364979 3385134
49108 3385134 3404322 3423583 3443719 3464407 3484912 3505179 3525686 3546639 3567914 3589435 3610986
49097 3610986 3631922 3651753 3670882 3690157 3709772 3729300 3748759 3768923 3790420 3813065 3836283
49086 3836283 3859692 3883078 3906259 3929304 3952640 3976744 4001919 4028404 4056270 4084991 4113505
49075 4113505 4141063 4167935 4195019 4222891 4251374 4279820 4307532 4333896 4358412 4380822 4401249
49064 4401249 4420113 4437765 4454085 4468529 4480555 4489849 4496105 4498907 4498080 4493940 4486901 4476944 4463836
49051 4463836 4447690 4428847 4407259 4382539 4354753 4324703 4293227 4260615 4227003 4192926 4159048
49040 4159048 4125608 4092587 4060315 4029406 4000081 3972065 3945352 3920689 3898946 3880186 3863756
49029 3863756 3849298 3837263 3828303 3822428 3819018 3817519 3817813 3819963 3823918 3829534 3836654 3844998 3854146 3863743
49015 3863743 3873685 3884084 3895164 3907173 3920127 3933585 3946850 3959526 3971649 3983257 3994077
49004 3994077 4003819 4012520 4020438 4027825 4034941 4041929 4048449 4053820 4057859 4061266 4064747 4068085 4070576 4072087
48990 4072087 4073064 4073665 4073662 4073259 4073192 4073754 4074264 4073925 4072698 4070949 4068640 4065317 4060633 4054360 4046068 4035271
48974 4035271 4021926 4006395 3988895 3969221 3947112 3922603 3895906 3867136 3836293 3803417 3768644
48963 3768644 3732181 3694337 3655590 3616436 3577162 3537846 3498648 3459961 3422158 3385269 3349151
48952 3349151 3313979 3280304 3248647 3219329 3192802 3169716 3150333 3134098 3120122 3107891 3097226
48941 3097226 3087980 3080414 3075640 3074866 3077963 3083414 3089965 3097764 3107463 3118780 3130640 3142456 3154570
48928 3154570 3167385 3180812 3194781 3209780 3226324 3244103 3262130 3279817 3297548 3316056 3335519
48917 3335519 3355566 3375949 3396816 3418347 3440568 3463740 3488532 3515473 3544419 3574895 3606835
48906 3606835 3640641 3676602 3714657 3754772 3797211 3842312 3890214 3940819 3993775 4048463 4104382
48895 4104382 4161652 4220834 4282116 4344960 4408717 4473190 4538300 4603528 4668256 4732523 4796892
48884 4796892 4861368 4924889 4986190 5044899 5101416 5155773 5207108 5254470 5297757 5337538 5374098
48873 5374098 5407041 5435731 5459632 5478218 5491167 5498939 5502720 5503333 5500482 5493395 5481802 5465787
48861 5465787 5445066 5419235 5388675 5354493 5317439 5277455 5234393 5188552 5140254 5089502 5036431
48850 5036431 4981690 4925983 4869523 4812208 4754073 4695286 4636005 4576493 4517146 4458181 4399597
48839 4399597 4341672 4285122 4230514 4177810 4126792 4077568 4030273 3984672 3940563 3898363 3858739
48828 3858739 3821786 3787068 3754447 3724356 3697198 3672859 3650880 3630851 3612613 3596341 3582435
48817 3582435 3571108 3562150 3555349 3551016 3549696 3551374 3555368 3561107 3568703 3578607 3590958 3605429 3621598
48804 3621598 3639349 3658966 3680780 3704681 3730097 3756560 3784072 3812629 3841737 3870928 3900632
48793 3900632 3931901 3965068 3999222 4033248 4066938 4100707 4134676 4168548 4202255 4236182 4270657
48782 4270657 4305465 4339948 4373454 4405738 4437103 4468150 4499320 4530692 4562191 4593741 4625049
48771 4625049 4655532 4684907 4713750 4743023 4772954 4802774 4831710 4859842 4887624 4914845 4940601
48760 4940601 4964196 4985578 5004746 5021186 5034216 5043557 5049135 5050496 5046884 5037885 5023660 5004529
48748 5004529 4980700 4952507 4920487 4884932 4845552 4801799 4753436 4700804 4644863 4587086 4528888
48737 4528888 4470817 4412515 4353790 4295417 4238546 4183702 4131003 4081125 4035284 3994109 3957149
48726 3957149 3923764 3894009 3868444 3847507 3831384 3820008 3812810 3808885 3807864 3810360 3817019 3827322
48714 3827322 3839783 3853253 3867545 3882865 3899111 3915898 3932890 3949983 3967370 3985407 4004118
48703 4004118 4022881 4041007 4058591 4076211 4093685 4109745 4123383 4135094 4146256 4157580 4168677
48692 4168677 4178964 4188366 4197125 4205584 4214393 4224535 4236764 4251186 4267580 4286012 4306932 4330856
48680 4330856 4358165 4389186 4424253 4463582 4507157 4554874 4606896 4663858 4726508 4795063 4869042
48669 4869042 4947862 5031365 5119536 5211880 5307373 5404890 5503316 5601339 5697604 5791061 5880791
48658 5880791 5965380 6042968 6112029 6171691 6221220 6259715 6286549 6301517 6304123 6293245 6268111
48647 6268111 6229340 6178599 6117491 6047295 5969457 5885607 5797095 5704957 5610317 5514315 5417665
$$ [...]
##END NTUPLES=NMR SPECTRUM
##END=
