##TITLE=NES1015_877608_9233139_i2hfbBXd1r
##JCAMPDX= 6.0         $$ Bruker NMR JCAMP-DX V2.0
##DATA TYPE= NMR SPECTRUM
##DATA CLASS= NTUPLES
##ORIGIN= BRUKER
##OWNER= Administrator
$$ 1.72 TOPSPIN		Version 2.1
$$ 2015-06-19 07:42:45.441 -0700  Administrator@X
$$ Compression mode = diff/dup
##.OBSERVE FREQUENCY= 400.02188249412
##.OBSERVE NUCLEUS= ^1H
##.ACQUISITION MODE= SIMULTANEOUS (DQD)
##.ACQUISITION SCHEME= undefined
##.AVERAGES= 8
##.DIGITISER RES= 22
##SPECTROMETER/DATA SYSTEM= spect
##.PULSE SEQUENCE= zg30
##.SOLVENT NAME= COFFEE_meoh
##.SHIFT REFERENCE= INTERNAL, COFFEE_meoh, 1, 14.98509
##AUDIT TRAIL= $$ (NUMBER, WHEN, WHO, WHERE, PROCESS, VERSION, WHAT)
$$ ##TITLE= Audit trail, TOPSPIN		Version 2.1
$$ ##JCAMPDX= 5.01
$$ ##ORIGIN= Bruker BioSpin GmbH
$$ ##OWNER= Administrator
$$ $$ E:\/data/COFFEE/nmr/NES1015_877608_9233139_i2hfbBXd1r/10/pdata/1/auditp.txt
$$ ##AUDIT TRAIL=  $$ (NUMBER, WHEN, WHO, WHERE, PROCESS, VERSION, WHAT)
(   1,<2015-06-17 18:36:24.956 -0700>,<Administrator>,<X>,<go>,<TOPSPIN 2.1>,
      <created by zg
	started at 2015-06-17 18:35:18.472 -0700,
	POWCHK enabled, PULCHK disabled,
       configuration hash MD5:
       21 0F 79 D6 B3 7B B4 F6 88 20 88 DB 03 48 BD 9F
       data hash MD5: 64K
       75 43 AE 68 C6 7F 35 C1 76 83 AE 13 A3 ED A8 5D>)
(   2,<2015-06-17 18:36:28.237 -0700>,<Administrator>,<X>,<proc1d>,<TOPSPIN 2.1>,
      <Start of raw data processing
       efp LB = 0 FT_mod = 6 PKNL = 1 PHC0 = 0 PHC1 = 0 SI = 32K 
       data hash MD5: 32K
       C3 29 19 96 92 D5 F0 A2 EB 38 F2 BD B2 71 51 FB>)
(   3,<2015-06-17 18:36:28.519 -0700>,<Administrator>,<X>,<proc1d>,<TOPSPIN 2.1>,
      <pk PHC0 = 93.72437 PHC1 = 0 
       data hash MD5: 32K
       CC F4 2C 68 C0 16 0D 8E 10 60 A5 8A BB 42 99 67>)
(   4,<2015-06-17 18:36:28.628 -0700>,<Administrator>,<X>,<proc1d>,<TOPSPIN 2.1>,
      <abs ABSG = 1 
       data hash MD5: 32K
       54 1D F4 D6 B2 86 F3 3B 6E 31 B7 3D C5 A3 69 5B>)
(   5,<2015-06-17 18:36:28.691 -0700>,<Administrator>,<X>,<proc1d>,<TOPSPIN 2.1>,
      <abs ABSG = 2 
       data hash MD5: 32K
       B8 86 3F F9 CE DD 7E B6 C6 E2 AF 46 CE C0 C4 75>)
(   6,<2015-06-17 18:36:28.753 -0700>,<Administrator>,<X>,<proc1d>,<TOPSPIN 2.1>,
      <abs ABSG = 3 
       data hash MD5: 32K
       0E 03 22 A0 D9 AA F1 44 0F 17 23 5F D2 F1 6B 98>)
(   7,<2015-06-17 18:36:28.816 -0700>,<Administrator>,<X>,<proc1d>,<TOPSPIN 2.1>,
      <abs ABSG = 4 
       data hash MD5: 32K
       45 09 F0 1F C8 E0 43 92 57 43 F9 70 BD 84 E8 59>)
(   8,<2015-06-17 18:36:28.894 -0700>,<Administrator>,<X>,<proc1d>,<TOPSPIN 2.1>,
      <abs ABSG = 5 
       data hash MD5: 32K
       8F 02 15 A3 58 D0 76 BC BC CB 20 54 C1 32 EB BE>)
(   9,<2015-06-17 18:36:32.722 -0700>,<Administrator>,<X>,<audit>,<TOPSPIN 2.1>,
      <user comment:
       ICON-NMR User ID: COFFEE
       data hash MD5: 32K
       8F 02 15 A3 58 D0 76 BC BC CB 20 54 C1 32 EB BE>)
$$ ##END=
$$ 
$$ $$ hash MD5
$$ $$ 5F 52 1D 39 D2 9E EB 55 8A 8A 17 94 7E 7E 9F 37
$$ [...]
150 150 150 150 150 150 150 150
##$TP07= 0
##$TPNAME0= <>
##$TPNAME1= <>
##$TPNAME2= <>
##$TPNAME3= <>
##$TPNAME4= <>
##$TPNAME5= <>
##$TPNAME6= <>
##$TPNAME7= <>
##$TPOAL= (0..7)
0.5 0.5 0.5 0.5 0.5 0.5 0.5 0.5
##$TPOFFS= (0..7)
0 0 0 0 0 0 0 0
##$TUNHIN= 0
##$TUNHOUT= 0
##$TUNXOUT= 0
##$USERA1= <user>
##$USERA2= <user>
##$USERA3= <user>
##$USERA4= <user>
##$USERA5= <user>
##$V9= 5
##$VALIST= <valist>
##$VCLIST= <CCCCCCCCCCCCCCC>
##$VD= 0
##$VDLIST= <DDDDDDDDDDDDDDD>
##$VPLIST= <PPPPPPPPPPPPPPP>
##$VTLIST= <TTTTTTTTTTTTTTT>
##$WBST= 2048
##$WBSW= 25
##$XGAIN= (0..3)
0 0 0 0
##$XL= 0
##$YL= 0
##$YMAX_a= 640314
##$YMIN_a= -533172
##$ZGOPTNS= <>
##$ZL1= 120
##$ZL2= 120
##$ZL3= 120
##$ZL4= 120
##$ABSF1= 14.98509
##$ABSF2= -5.573092
##$ABSG= 5
##$ABSL= 3
##$ALPHA= 0
##$AQORDER= 0
##$ASSFAC= 0
##$ASSFACI= 0
##$ASSFACX= 0
##$ASSWID= 0
##$AUNMP= <proc_prof1d_extract_pilot.lims>
##$AXLEFT= 0
##$AXNAME= <>
##$AXNUC= <1H>
##$AXRIGHT= 0
##$AXTYPE= 0
##$AXUNIT= <>
##$AZFE= 0.1
##$AZFW= 0.1
##$BCFW= 0
##$BC_mod= 0
##$BYTORDP= 0
##$COROFFS= 0
##$CY= 15
##$DATMOD= 1
##$DC= 0
##$DFILT= <>
##$DTYPP= 0
##$F1P= 0
##$F2P= 0
##$FCOR= 0.5
##$FTSIZE= 32768
##$FT_mod= 6
##$GAMMA= 0
##$GB= 0
##$INTBC= 1
##$INTSCL= 1
##$ISEN= 128
##$LB= 0
##$LEV0= 0
##$LPBIN= 0
##$MAXI= 10000
##$MC2= 0
##$MEAN= 0
##$ME_mod= 0
##$MI= 0
##$NCOEF= 0
##$NC_proc= -8
##$NLEV= 6
##$NOISF1= 0
##$NOISF2= 0
##$NSP= 0
##$NTH_PI= 0
##$NZP= 0
##$OFFSET= 14.98509
##$PC= 1
##$PHC0= 93.72437
##$PHC1= 0
##$PH_mod= 1
##$PKNL= yes
##$PPARMOD= 0
##$PPDIAG= 0
##$PPIPTYP= 0
##$PPMPNUM= 2147483647
##$PPRESOL= 1
##$PSCAL= 4
##$PSIGN= 0
##$PYNMP= <proc.py>
##$REVERSE= no
##$SF= 400.02
##$SI= 32768
##$SIGF1= 0
##$SIGF2= 0
##$SINO= 400
##$SIOLD= 32768
##$SPECTYP= <>
##$SREGLST= <1H.CDCl3>
##$SSB= 0
##$STSI= 32768
##$STSR= 0
##$SW_p= 8223.68421052631
##$SYMM= 0
##$S_DEV= 0
##$TDeff= 65536
##$TDoff= 0
##$TI= <>
##$TILT= no
##$TM1= 0
##$TM2= 0
##$TOPLEV= 0
##$USERP1= <user>
##$USERP2= <user>
##$USERP3= <user>
##$USERP4= <user>
##$USERP5= <user>
##$WDW= 1
##$XDIM= 32768
##$YMAX_p= 441167461
##$YMIN_p= -681881
##$CURPLOT= <Network HP LaserJet P1505>
##$CURPRIN= <$Network HP LaserJet P1505>
##$DFORMAT= <normdp>
##$LAYOUT= <+/1D_H.xwp>
##$LFORMAT= <normlp>
##$PFORMAT= <normpl>
##$SURQMSG= 1
$$ End of Bruker specific parameters
$$ ---------------------------------
##NTUPLES= NMR SPECTRUM
##VAR_NAME=  FREQUENCY,     SPECTRUM/REAL,   SPECTRUM/IMAG
##SYMBOL=    X,             R,               I
##VAR_TYPE=  INDEPENDENT,   DEPENDENT,       DEPENDENT
##VAR_FORM=  AFFN,          ASDF,            ASDF
##VAR_DIM=   32768,         32768,           32768
##UNITS=     HZ,            ARBITRARY UNITS, ARBITRARY UNITS
##FACTOR=    0.250966925370066, 1,           1
##FIRST=     8223.43324360094, -69849,       -15503
##LAST=      0,             -204166,         -92437
##MIN=       0,             -681881,         0
##MAX=       8223.43324360094, 441167461,    0
$$ Real data points
##PAGE= N=1
##DATA TABLE= (X++(R..R)), XYDATA
$$ [...]
19448D4801e44212K19761C2718g2950H4957b42994O4422P7860l68203D3661K03057
$$ 44801 -544212 -324451 32718 -72950 84957 -242994 -178572 -100712 -468915 43661 246718
19437B46718A0688d6555q8684E3300h0899L1037A12863a13790j70419J30407A24472
$$ 246718 10688 -46555 -135239 53300 -80899 -49862 112863 -113790 -284209 -153802 124472
19425h9822o8169A82162C8980a76745E2765c6075n4421O90D9577g9033l2745I207
$$ -89822 -157991 182162 38980 -176745 52765 -36075 -90496 -89806 49577 -79033 -111778 9207
19412a29574A1527c3519j44199e6830j86985e5730n4219j54992k3979a05435c7195
$$ -129574 11527 -33519 -177718 -56830 -243815 -55730 -109949 -264941 -288920 -105435 -37195
19400C9407i4064j88529a01857j44199B37016a46749k72926F2138f526r4413L5157
$$ 39407 -94064 -282593 -101857 -246056 237016 -146749 -419675 62138 -6526 -100939 -65782
19389f5782q3522j3417B63833D0143g9510k9872k5064A09640n3086a82039F7856
$$ -65782 -149304 -162721 263833 40143 -79510 -109382 -134446 109640 56554 -182039 67856
19377B21063c11502j03394A26587a0277j60367A7561P1079C7489f7062n3543D3173
$$ 221063 -311502 -414896 126587 -10277 -170644 17561 88640 37489 -67062 -120605 43173
19365b52757e876j9922D8917b3886j64887j9200C09683a02779a6002j67455a5616
$$ -252757 -5876 -25798 48917 -23886 -188773 -207973 309683 -102779 -16002 -183457 -15616
19353a63062N1740L9916D4848d879o9545G8880a07412B84054a48813j17460b048
$$ -163062 -111322 -71406 44848 -4879 -74424 78880 -107412 284054 -148813 -266273 -2048
19341a73101e627j20558o4782m2637I7817d8418r7805A73176D6947a92094H3130
$$ -173101 -5627 -126185 -190967 -233604 97817 -48418 -146223 173176 46947 -192094 83130
19329A7280b36196h6995m21249C64812A5347M0593d09307a21770I7874K63499
$$ 17280 -236196 -86995 -508244 364812 15347 55940 -409307 -121770 97874 361373
19319C61373a82141A35884d68844g7978k86936A83696b33620A7592a8610j71205
$$ 361373 -182141 135884 -468844 -77978 -364914 183696 -233620 17592 -18610 -189815
19309a89815H5281b8041E5824a54455m381K5693o1363k5350M4400j72404a5524
$$ -189815 85281 -28041 55824 -154455 -158836 -133143 -194506 -219856 -175456 -347860 -15524
19297D6059a35519F3742b986o8188A97829B7529L25800A39381f1881A901a16458
$$ 46059 -135519 63742 -2986 -71174 197829 27529 353329 139381 -61881 1901 -116458
19285I81e0277q7303j01305E6232B2570a717k10455B53538f4220j84487G8998
$$ 981 -50277 -137580 -238885 56232 22570 -1717 -212172 253538 -64220 -248707 78998
19273c3475H54R879M09922a12249A47635k4402d615G296a9114E4750b20755M48
$$ -33475 854 10733 420655 -112249 147635 123233 -4615 7296 -19114 54750 -220755 -220307
19261b20307J4735C79545c4787k29979Q3979j37875a05453A68168b13536F2035
$$ -220307 -205572 379545 -34787 -264766 -180787 -318662 -105453 168168 -213536 62035
19250b39741A8796b92508A56957a90168j9526L3573A54239c2240j2245B6219R1202
$$ -239741 18796 -292508 156957 -190168 -209694 -176121 154239 -32240 -44485 26219 117421
19239A17421c4605j06963O7407A07059b02464J6414e4314q7086j508k8894A55679
$$ 117421 -34605 -141568 -74161 107059 -202464 -186050 -54314 -141400 -142908 -171802 155679
19227a83267m8460r9409a28593D8984N8782a16254A73668b11385A48225a60857
$$ -183267 -231727 -331136 -128593 48984 107766 -116254 173668 -211385 148225 -160857
19216D2703J02408d75089A44078a37857e7934N664E9256O0573b48241M3461j6602
$$ 42703 145111 -475089 144078 -137857 -57934 -52270 59256 119829 -248241 -204780 -221382
19205b21382E5199b19543I9646a64424O3719d0985r0708E6278k636J2338b41188
$$ -221382 55199 -219543 99646 -164424 -100705 -40985 -131693 56278 53642 65980 -241188
19193A11711L538N5043b39664l2944e6409E7508K85563a66072M7850q3859m050
$$ 111711 115249 170292 -239664 -272608 -56409 57508 343071 -166072 -118222 -202081 -206131
19182b06131P1320l2626o6112M4200Q9966r1636D7477b24978g8507C0303a37905
$$ -206131 -134811 -167437 -233549 -189349 -99383 -191019 47477 -224978 -78507 30303 -137905
19170b86983D9875d64585b05520A30513d32708e6140B8989a6097A88327A4696
$$ -286983 49875 -464585 -205520 130513 -432708 -56140 28989 -16097 188327 14696
19159i7475P599A24403N7533a64168B53471p4963c3429F6901O9932N7563A3172
$$ -97475 -89876 124403 181936 -164168 253471 178508 -33429 66901 136833 194396 13172
19147c45531f0538l56786c4252A53097a91024j95075N1501J61570M7569A6078
$$ -345531 -60538 -417324 -34252 153097 -191024 -386099 -334598 -173028 -125459 16078
19136f7038B46624d01528C7859j0995b25272j5278f2231k91552a56486p4124m955
$$ -67038 246624 -401528 37859 26864 -225272 -240550 -62231 -353783 -156486 -230610 -235565
19125b35565q7608A04939c69806b2035k7818k87281J23361O6942F5764a97743
$$ -235565 -323173 104939 -369806 -22035 -49853 -337134 -213773 -146831 65764 -197743
19114a05033B7590J23104F2836c60911a03142j05312d8463j33649J9542d2305
$$ -105033 27590 150694 62836 -360911 -103142 -208454 -48463 -182112 -162570 -42305
19103a07076j05700j05893A96618n8470a25168c762j19860m6656k8717A9215J20363
$$ -107076 -212776 -318669 196618 138148 -125168 -3762 -123622 -170278 -198995 19215 139578
19092A39578h3394f051j04607A39339k3288g0041m4644n4309p5877A9055J37703
$$ 139578 -83394 -6051 -110658 139339 116051 -70041 -114685 -168994 -244871 19055 156758
19081A56758a14927l48112H3099c42056J06760A31153M59063a64806c5976A27082
$$ 156758 -114927 -463039 83099 -342056 -235296 131153 590216 -164806 -35976 127082
19070a26932B7728J24700b52018D73J323a02534A1427L05466F7323f1474j945
$$ -126932 27728 152428 -252018 473 1796 -102534 11427 316893 67323 -61474 -63419
19059f3419k39594a8605p8993B5716L47994b04283H3590C8320o426b59875D0624
$$ -63419 -303013 -18605 -97598 25716 373710 -204283 83590 38320 31894 -259875 40624
19047A33915a11547j48049A0122h9405E1768J89429Q1166G3399b57931B954b13395
$$ 133915 -111547 -259596 10122 -89405 51768 241197 322363 73399 -257931 2954 -213395
19035D1301a41277m8195E419b70079i6551K2352C30433j64763m3599n5977j0654
$$ 41301 -141277 -189472 5419 -270079 -96551 -74199 330433 165670 122071 66094 55440
19024E5440J21793d9315k68108P8411c3023n9297A6786L454c35505d0307n7225
$$ 55440 177233 -49315 -317423 -239012 -33023 -92320 16786 20240 -335505 -40307 -97532
19013i7532B62156A12697a2833l67190D6426R9507B0256b37133J1379b0524j48587
$$ -97532 262156 112697 -12833 -380023 46426 145933 20256 -237133 -225754 -20524 -169111
19002a69111L823p1495J09046m0304A7694a22481B14867D1019P2045a21138m2159
$$ -169111 -165288 -236783 -127737 -168041 17694 -122481 214867 41019 113064 -121138 -163297
18991a63297j48422A71582a88535A61499C4844K72467a04385d9215j7786H5630
$$ -163297 -311719 171582 -188535 161499 34844 307311 -104385 -49215 -67001 85630
18980c63494b9646m03603H5339k0017J07598G9242M9941a63735A35156F498M68274
$$ -363494 -29646 -433249 85339 65322 172920 79242 129183 -163735 135156 6498 474772
18969D74772O5945k25778I0106K53835e3492p0686A3633N1062a9732j53588j0574
$$ 474772 540717 314939 90106 343941 -53492 -124178 13633 64695 -19732 -173320 -183894
18958a83894D692b59292M8255a01192A73260b48092m1487a03033D1598a9512B02160
$$ -183894 4692 -259292 -211037 -101192 173260 -248092 -289579 -103033 41598 -19512 202160
18946G2484K37370a2556E2399J22717d69822J60363g7387B39649a60330G0601
$$ 72484 309854 -12556 52399 175116 -469822 -309459 -77387 239649 -160330 70601
18935B27630C7023b18569A81374J9504h8618A30538a47486b266l0102A90958J1274
$$ 227630 37023 -218569 181374 200878 -88618 130538 -147486 -2266 -32368 190958 202232
18924B02232a93790O2571n1235A17241m9336a06011A42202n4773d2246o1284K0202
$$ 202232 -193790 -131219 -182454 117241 67905 -106011 142202 87429 -42246 -103530 -83328
18913h3328H4710i7167j09975A84562c38274J39569D90875L472m0395B8023K63793
$$ -83328 84710 -97167 -207142 184562 -338274 -198705 490875 494347 453952 28023 291816
18902B91816a87085J1316D4638i6516B30809a51159B21654b8701D4058a24968
$$ 291816 -187085 -175769 44638 -96516 230809 -151159 221654 -28701 44058 -124968
18891B9527i8841j60268A29893a48738A14934A6142b69282J04671G7084h7886
$$ 29527 -98841 -259109 129893 -148738 114934 16142 -269282 -164611 77084 -87886
18880b9919j98037d623j81940B53741A2841b54464b5703I7278J5680f0952A49732
$$ -29919 -227956 -4623 -186563 253741 12841 -254464 -25703 97278 112958 -60952 149732
18868a65126m5532J02957b4264q418P919j54546A56794g9292j91383J20637A5393
$$ -165126 -210658 -107701 -24264 -32682 -24763 -179309 156794 -79292 -270675 -150038 15393
18856e3127A38687a476j18430A96477r282b3497l1059l87112a7660q1653d2086
$$ -53127 138687 -1476 -119906 196477 187195 -23497 -54556 -441668 -17660 -99313 -42086
18844a2483A7045b79970d0291j16185M1643A28512C0873K54907c68336a0171o0849
$$ -12483 17045 -279970 -40291 -156476 -114833 128512 30873 285780 -368336 -10171 -71020
18833g1020A94704F4083M9429b166r4526A49932a49688B34927D3834c27154J26573
$$ -71020 194704 64083 113512 -2166 -96692 149932 -149688 234927 43834 -327154 -200581
18822b00581e53n4689C43570b0853j90722D5957a67903k2055k899j41977A20945
$$ -200581 -553 -55242 343570 -20853 -211575 45957 -167903 -189958 -192857 -334834 120945
18810A95076p3409L56579k35076h9710d1233A27490J69553b127j71828m5131q188
$$ 195076 121667 478246 243170 -89710 -41233 127490 297043 -2127 -173955 -219086 -227274
18799b27274J12172j81789i7708B55010a66266k91300K27924B10808o7338d26720
$$ -227274 -115102 -296891 -97708 255010 -166266 -457566 -229642 210808 143470 -426720
18788A00180D6751i1878B7700L7372c02730J16271j29153a25834B31770n4395
$$ 100180 46751 -91878 27700 65072 -302730 -186459 -315612 -125834 231770 177375
18778A77375Q29b4277j63521A45212B9219b31158i1932F6509c8853o3594d0568
$$ 177375 178204 -24277 -187798 145212 29219 -231158 -91932 66509 -38853 -102447 -40568
18766a93149g1324E01807c85480F9406J1577j9916b7990j2251E3449j9420L55009
$$ -193149 -71324 501807 -385480 69406 80983 61067 -27990 -40241 53449 34029 389038
18755C89038a41333A65797c85045Q2080J44717A65557d707G216h9383I6995p971
$$ 389038 -141333 165797 -385045 -302965 -158248 165557 -4707 7216 -89383 96995 89024
18744H9024a03495c7346o9737j49667a17701G2069h6098I4507l8285c09750D2669
$$ 89024 -103495 -37346 -107083 -256750 -117701 72069 -86098 94507 56222 -309750 42669
18732b30959a4014q5861j386k1583K2291l04174C4943A3780L0219d4157k46527
$$ -230959 -14014 -99875 -101261 -122844 -100553 -404727 34943 13780 43999 -44157 -290684
18721b90684E7645h6754A36086R9841b39556Q9205d2496B1247K04464q6342a3723
$$ -290684 57645 -86754 136086 235927 -239556 -150351 -42496 21247 225711 139369 -13723
18709C09484A09147B5575b8129p6151H5277a11592G1297i8901B59635F4737j9210
$$ 309484 109147 25575 -28129 -104280 85277 -111592 71297 -98901 259635 64737 45527
18698D5527h6783j43510e4737c318j90293A00392m1233b81212O2524m2451f5327
$$ 45527 -86783 -230293 -54737 -3318 -193611 100392 59159 -281212 -218688 -261139 -65327
18686A35693Q360c7121A69677R067a83347A00420R9853H5860a44472j8161B95718
$$ 135693 144053 -37121 169677 178744 -183347 100420 200273 85860 -144472 -162633 295718
18674a74271M1309j55608a08874q6274a8814j92268i1004l28350g0238A60923
$$ -174271 -132962 -288570 -108874 -195148 -18814 -211082 -91004 -419354 -70238 160923
18663b01671r4127J23144a8612A07936C98a20017B29926a99476P6931j88540B04582
$$ -201671 -295798 -172654 -18612 107936 398 -120017 229926 -199476 -122545 -311085 204582
18651A46841b6315A29895b50384a16452G7951J13987k3067E49f6251j60568B31641
$$ 146841 -26315 129895 -250384 -116452 77951 191938 168871 549 -66251 -226819 231641
18639H2860k445a35667N8670a3495p8183j65892R1601P2659j18719E268J68919
$$ 82860 80415 -135667 -76997 -13495 -91678 -257570 -165969 -93310 -212029 5268 174187
18628A74187C8618h8063A14066j6979a95977M0339n7753L2576P4757A35202L00387
$$ 174187 38618 -88063 114066 97087 -195977 -155638 -213391 -180815 -106058 135202 435589
18617D35589b37274B26142l7754p005a10789j56008h2096k00805h6416j6126l4695
$$ 435589 -237274 226142 188388 181383 -110789 -266797 -82096 -282901 -86416 -102542 -137237
18606a37237d0363m0121D00313A5080b63901K6857A13416f9790k13070c9349B11181
$$ -137237 -40363 -80484 400313 15080 -263901 -237044 113416 -69790 -282860 -39349 211181
18594H3587b85556a27011j0076I3606M7977F7258d5579k5623A06241a18366c8956
$$ 83587 -285556 -127011 -137087 93606 141583 67258 -45579 -71202 106241 -118366 -38956
18582C5656K94789j62061q1533a3303m8332J2275A74466G78d28293L3039a61744
$$ 35656 330445 168384 86851 -13303 -61635 -49360 174466 778 -428293 -395254 -161744
18570b8094A11031c3025m2198A70597J09844j20320a8731j70779d5990I787a00633
$$ -28094 111031 -33025 -75223 170597 280441 160121 -18731 -189510 -45990 9787 -100633
18558a07779B91131B7897J32642j3730e48473c7981a31A72813b58182J18847A1586
$$ -107779 291131 27897 160539 146809 -548473 -37981 -131 172813 -258182 -139335 11586
18546a96791N7509j14509B27823k9535D3359e9400B80291b03760R7572G8507d48581
$$ -196791 -139282 -253791 227823 198288 43359 -59400 280291 -203760 -106188 78507 -448581
18534b88388j15718E5442i3857k2896A35909a50309c0677k44095A49604c5862
$$ -288388 -404106 55442 -93857 -116753 135909 -150309 -30677 -274772 149604 -35862
18523a89538l3270a02047j73142O9370r6052P5645e2609L161C6929a28259A3465
$$ -189538 -222808 -102047 -275189 -205819 -301871 -226226 -52609 -49448 36929 -128259 13465
18511H7692b92853a8024A57026a332B1429P9369l2931a24266Q253M8326n695m6012
$$ 87692 -292853 -18024 157026 -1332 21429 100798 67867 -124266 -116013 -67687 -73382 -119394
18499a19394b8637A51633F757J21103a74536C03389a13549M688n5253c548k03423
$$ -119394 -28637 151633 6757 127860 -174536 303389 -113549 -108861 -164114 -3548 -206971
18488b06971O0119M3192Q70b6949k24761d5347G9661b25967A05365c29134F1085
$$ -206971 -146852 -103660 -102790 -26949 -251710 -45347 79661 -225967 105365 -329134 61085
18476g0240j04143j14723m716a30161j97220c0427C56172A44793R275k4933c0129
$$ -70240 -174383 -289106 -293822 -130161 -327381 -30427 356172 144793 154068 129135 -30129
18464A23174a86027j01388A41359b45836K0946A20030f5878p7435E2109a0428
$$ 123174 -186027 -287415 141359 -245836 -224890 120030 -65878 -143313 52109 -10428
18453c29747B24126F2132a44874A8016d5924C1323h3077B8780a95949D8556R0944
$$ -329747 224126 62132 -144874 18016 -45924 31323 -83077 28780 -195949 48556 139500
18442A39500a90394h0911F2081h9529L5406E802Q1201b32518c4155F4440B6923
$$ 139500 -190394 -80911 62081 -89529 -54123 5802 87003 -232518 -34155 64440 26923
18430a16892m1736F7271J20512G5842f3846A26503J02211c39298J02149e2158
$$ -116892 -158628 67271 187783 75842 -63846 126503 228714 -339298 -237149 -52158
18419B06519a30823K5110A30220B2327J37000p1815O7642h5828B12644A4978K23707
$$ 206519 -130823 -105713 130220 22327 159327 87512 155154 -85828 212644 14978 238685
18408B38685b07371H6822K11248D8700b58653C40282I2359a9212A87042q0865
$$ 238685 -207371 86822 298070 48700 -258653 340282 92359 -19212 187042 106177
18398A06177J58078J93916H5067b70845D3489a16532q149D0425P9477a29266m5397
$$ 106177 264255 458171 85067 -270845 43489 -116532 -124681 40425 119902 -129266 -174663
18387a74663b4110A58981a97139D9371a6437B93538F904a54437n315c8253C7153
$$ -174663 -24110 158981 -197139 49371 -16437 293538 6904 -154437 -159752 -38253 37153
18375G8022a68577m5683A1640a21717j66258a05969j34269I927c75080F6907h996
$$ 78022 -168577 -214260 11640 -121717 -287975 -105969 -240238 9927 -375080 66907 -8996
18363G5826K4246f7920B06432D5540e2253K1721m1117C10510j36537m7171C9757
$$ 75826 100072 -67920 206432 45540 -52253 -30532 -71649 310510 173973 126802 39757
18351B10430b85388D9947a43371l01c921B33584b00491f0029k927l22206J37636
$$ 210430 -285388 49947 -143371 -143672 -3921 233584 -200491 -60029 -62956 -385162 -247526
18340b47526A97272e1041C2708g8601r1449j6708O3544A3323i771j20210B10625
$$ -247526 197272 -51041 32708 -78601 -170050 -186758 -123214 13323 -9771 -129981 210625
18328d2965G9157a44146a5159k76505B42427I8141a5155A22815b14940i0957a1331
$$ -42965 79157 -144146 -15159 -291664 242427 98141 -15155 122815 -214940 -90957 -11331
18316B5287M5126b02704A24963b27632h7844K5958A64760q0281N1379c0490n9160
$$ 25287 70413 -202704 124963 -227632 -87844 -61886 164760 84479 135858 -30490 -89650
18305h9650A72110E3543O8393a40951A99196H0501e667A52506b0567A71018i7451
$$ -89650 172110 53543 121936 -140951 199196 80501 -5667 152506 -20567 171018 -97451
18293c7338j41486e2019a6863O982I6706a64506O471B72626a035F9582J83252
$$ -37338 -178824 -52019 -16863 -9881 96706 -164506 -158035 272626 -1035 69582 252834
18282B52834A07343j0766a34839I2741f1548E1991K78437o5851E8627a26703C02461
$$ 252834 107343 96577 -134839 92741 -61548 51991 330428 264577 58627 -126703 302461
18270B71370b13217J02314k18249J08938j30911B45285a63742c534m1844j68401
$$ 271370 -213217 -110903 -329152 -220214 -351125 245285 -163742 -3534 -45378 -213779
18260b13779g4883j57498B62456a31866a7695G6229i982A40684B8334b50586I4939
$$ -213779 -74883 -232381 262456 -131866 -17695 76229 -9982 140684 28334 -250586 94939
18248A13612n6008L0998c83406d8267C9511a18530J8728C11624B8146K99239A56342
$$ 113612 57604 88602 -383406 -48267 39511 -118530 -99802 311624 28146 327385 156342
18236a4474j44566L448k26341a2805A20888K9760a84760A42304B6551a3521F4878
$$ -14474 -159040 -155592 -381933 -12805 120888 150648 -184760 142304 26551 -13521 64878
18224b27801B54844d8388G4326f3488o7881e8483B19599C9221A1077b13220A45156
$$ -227801 254844 -48388 74326 -63488 -131369 -58483 219599 39221 11077 -213220 145156
18212b19801P6863a0369o731A16384d32269A21691i9441D7145J23303a85770j4099
$$ -219801 -142938 -10369 -17100 116384 -432269 121691 -99441 47145 170448 -185770 -199869
18201a99869k74595A0167b66834a9257l52951B0715K69497i5410l8113J4962k15477
$$ -199869 -474464 10167 -266834 -19257 -372208 20715 290212 -95410 -133523 -118561 -334038
18190c34038J60362A19470a04470E3926b3948k46677A58929c4142o7191J6359
$$ -334038 -173676 119470 -104470 53926 -23948 -270625 158929 -34142 -101333 -84974
18180h4974k10194a45816C873J73584c87546A27014a1646A0298J02483a3914R06
$$ -84974 -295168 -145816 3873 177457 -387546 127014 -11646 10298 112781 -13914 -13008
18169a3008C73702a25092C388c83973I6401B7992e2349A41534b85636J37605j86958
$$ -13008 373702 -125092 3388 -383973 96401 27992 -52349 141534 -285636 -148031 -334989
18158c34989A97660D3401b68422B79975p7749A7674d7244o8798h833A1594b64838
$$ -334989 197660 43401 -268422 279975 202226 17674 -47244 -116042 -8833 11594 -264838
18146B4740J29871i8696A2683i5475J4792C9062a78326e370j66438B0407b25040
$$ 24740 154611 -98696 12683 -95475 -80683 39062 -178326 -5370 -171808 20407 -225040
18134a41497o393j78671f965J007j76767J7891I7479a48549l8435d6236H7911
$$ -141497 -147890 -326561 -6965 -5958 -182725 -164834 97479 -148549 -186984 -46236 87911
18122a64221n8634C69207o7593A27117n8859i9898J471I0678J86192a38355o0294
$$ -164221 -222855 369207 301614 127117 68258 -99898 -98427 90678 276870 -138355 -198649
18111a98649j5335B7626K2291A4802J66315a40643c6235q969O516C7480a04773
$$ -198649 -213984 27626 49917 14802 181117 -140643 -36235 -45204 -38688 37480 -104773
18099A4247J31177F7111b39314C9461R7271b4382p7432B38911c2921m5413n829
$$ 14247 145424 67111 -239314 39461 136732 -24382 -101814 238911 -32921 -78334 -84163
18088h4163A02178b4052l758A01952a90833A49251P1079a85168H8304J64903N9378
$$ -84163 102178 -24052 -27810 101952 -190833 149251 220330 -185168 88304 253207 312585
18077C12585A10798R1656i9980M4620A1492J23446a16885D6423g2219B59159k7962
$$ 312585 110798 202454 -99980 -55360 11492 134938 -116885 46423 -72219 259159 231197
18066B31197G2184K97821G345b0185A98696i7929a5995j16809E29246i5895n8413
$$ 231197 72184 370005 7345 -20185 198696 -97929 -15995 -132804 529246 -95895 -154308
18055a54308K5355B42638e6595B05133b0752A25281n3610P4269a09412B0624L456
$$ -154308 -128953 242638 -56595 205133 -20752 125281 71671 145940 -109412 20624 24080
18044B4080k65K51064j24612k4734J07402b09582C2516b802j54933L0739l9111
$$ 24080 23815 274879 150267 125533 232935 -209582 32516 -2802 -157735 -126996 -166107
18033a66107d2910j00324A14908O9261D6246i3360j31991D6273K2261h6058B98905
$$ -166107 -42910 -143234 114908 184169 46246 -93360 -225351 46273 68534 -86058 298905
18021a12958B1603a43864C9715K5391L8184L5441J1716a33470M5776k95E5064
$$ -112958 21603 -143864 39715 65106 103290 138731 150447 -133470 -87694 -87989 55064
18009b04369C32915d4631j15664D9690L60865i4258E5514a97128D59730D3915
$$ -204369 332915 -44631 -160295 49690 410555 -94258 55514 -197128 459730 43915
17998a89704C4196i2362m2363B792J52226h7524C791J1676c33797C1636d6332
$$ -189704 34196 -92362 -134725 2792 155018 -87524 3791 15467 -333797 31636 -46332
17986c8620j15113F9391F553P208P2130C6297L62038D8231g7343A18270J22984
$$ -38620 -153733 69391 6553 13761 85891 36297 398335 48231 -77343 118270 241254
17975B41254o0121C2194J47267D3372a49956i494j02743k7000N7200A67125b10669
$$ 241254 181133 32194 179461 43372 -149956 -9494 -112237 -139237 -82037 167125 -210669
17963A41527c9680m623E7541e4574A32640h5839j31152B5186K49898J0973A5047
$$ 141527 -39680 -44303 57541 -54574 132640 -85839 -216991 25186 275084 286057 15047
17951a41161A75772E395a19298a6257A29383J6069C5817c91772a4978j1339j43283
$$ -141161 175772 5395 -119298 -16257 129383 145452 35817 -391772 -14978 -26317 -169600
17940a69600B20085j07267g7425k0198C21254j55060J54327A55330g4625j0983
$$ -169600 220085 112818 -77425 -97623 321254 166194 320521 155330 -74625 -85608
17930h5608F5556O3165K7014B6147P8708f1534K5847F8439O2249J66208a2199
$$ -85608 65556 128721 155735 26147 104855 -61534 -35687 68439 130688 296896 -12199
17918g7881A49703a20928A46407k0648d8298a3611B16074l8366a03206n5016D11430
$$ -77881 149703 -120928 146407 125759 -48298 -13611 216074 177708 -103206 -158222 411430
17906f9446A68315J9018P3105j1645h651m723B68424h6194K304C11955B485J06183
$$ -69446 168315 187333 260438 248793 -8651 -13374 268424 -86194 -83890 311955 2485 108668
17894A08668K14252b76855I0199a09467D92517j37141C6274J23161E1305K6200
$$ 108668 322920 -276855 90199 -109467 492517 355376 36274 159435 51305 77505
17884G7505l7848N7103d36618A45020H809J53336R8354p5965H7479c33085a15378
$$ 77505 39657 96760 -436618 145020 8809 162145 260499 184534 87479 -333085 -115378
17872a36292m5949H93a63700D43765E5426a05854A47357C2133R5701a8406A19553
$$ -136292 -182241 893 -163700 443765 55426 -105854 147357 32133 127834 -18406 119553
17860a49486F9345L43848c1514I8414k6135b01288A67671b37252A01983A8994
$$ -149486 69345 413193 -31514 98414 72279 -201288 167671 -237252 101983 18994
17849c07184a514j96248c3335A3028K91279j45277i3306H0159Q3509K6896a57889
$$ -307184 -1514 -197762 -33335 13028 304307 159030 -93306 80159 163668 190564 -157889
17837F8080R2583a4031i45C06956f6056C53818j0240A44660l9553Q9238H4370
$$ 68080 160663 -14031 -945 306956 -66056 353818 343578 144660 105107 194345 84370
17825h1975A69622q3057k5887J35662q5172J79253a06581A35157E371K89930C0382
$$ -81975 169622 86565 60678 196340 111168 290421 -106581 135157 5371 295301 30382
17813c55543A54568d1923j61194Q2048G0489a42577G9g5720A50366E8035b1251
$$ -355543 154568 -41923 -203117 -121069 70489 -142577 79 -75720 150366 58035 -21251
17801A36894c0891F9417J44340r9139O5031b24587H7430N460J40884B7269J77812
$$ 136894 -30891 69417 213757 114618 179649 -224587 87430 92890 233774 27269 205081
17790B05081O259q6458K7363b09670C25460A12712l8353J76229J66978J5846o1110
$$ 205081 211340 124882 152245 -209670 325460 112712 74359 250588 417566 433412 372302
17779C72302j62633c5533B53696f3595n7993G0051L30362A18012J27560B5050
$$ 372302 209669 -35533 253696 -63595 -121588 70051 400413 118012 245572 25050
17768C66680b05689A75703q6143j6506O2937A6479P5337a23073Q573B55352j07034
$$ 366680 -205689 175703 89560 73054 135991 16479 91816 -123073 -114500 255352 148318
17757A48318l0115C8483K97843E2584L4783K69516a66044j41587h6255C8738L92766
$$ 148318 118203 38483 336326 52584 87367 356883 -166044 -307631 -86255 38738 431504
17746D31504H6966l8835b8235A97743Q8152H2835C5125a22002o1325L3087A7927
$$ 431504 86966 48131 -28235 197743 285895 82835 35125 -122002 -183327 -150240 17927
17734B5408b5973I6604h2600M059j0919k82249e6698E865A621K17943k8004a19277
$$ 25408 -25973 96604 -82600 -78541 -89460 -371709 -56698 5865 1621 219564 191560 -119277
17721b9092A74783B3677M3619K08009g0511B62247p7784a45836E5627K43574H3004
$$ -29092 174783 23677 67296 275305 -70511 262247 184463 -145836 55627 299201 83004
17709A42850c2030B05952a63050A73469o9504P3911k6014M3257D4952K1097l0785
$$ 142850 -32030 205952 -163050 173469 103965 177876 151862 195119 44952 66049 35264
17698C5264L00361j15801o0812J48613R7332A94199q238J84443N3773a00271b1945
$$ 35264 335625 219824 159012 307625 404957 194199 185961 370404 424177 -100271 -21945
17686B25193h6604A33595D9544a6942I1526C1175L7739b0567G1326Q7696a79655
$$ 225193 -86604 133595 49544 -16942 91526 31175 68914 -20567 71326 159022 -179655
17674D85446A33934Q5136L7478d901k47209B43400a38207I5085J85677N0043k2276
$$ 485446 133934 219070 256548 -4901 -252110 243400 -138207 95085 280762 330805 308529
17663C08529k0934a0041j14956D14262B9190K8779M77114C0981i4003E1156d7665
$$ 308529 287595 -10041 -124997 414262 29190 57969 535083 30981 -94003 51156 -47665
17651i8508q30j6752E09178A16448J8321J19323m3217b0283C92328p7047g0232
$$ -98508 -99338 -116090 509178 116448 134769 254092 210875 -20283 392328 315281 -70232
17639A68127a05920I3382L31439o5239i5917B20430M2111C370J00305L63823B11257
$$ 168127 -105920 93382 424821 359582 -95917 220430 262541 3370 103675 467498 211257
17627B70914j21004j2534J7203m7873i2987c6230l284A65989E0129M14433a89214
$$ 270914 149910 137376 154579 106706 -92987 -36230 -39514 165989 50129 464562 -189214
17615C19680j35695o1756N93973A26884B9832J96259j5825J76834j02137P6329
$$ 319680 183985 122229 716202 126884 29832 226091 210266 387100 284963 361292
17605C61292R42K63410A87692P6382r7213m7873Q9391F6556M9455A2336J6207
$$ 361292 362234 625644 187692 264074 166861 118988 208379 66556 116011 12336 28543
17594B8543M23734q2019j54936b0633C43200o2671A08686J65140P0014A15440
$$ 28543 452277 370258 215322 -20633 343200 280529 108686 273826 343840 115440
17583B18518C6129a34109A31804J41438a28928A59201k8391K09017j10932Q1364
$$ 218518 36129 -134109 131804 273242 -128928 159201 130810 339827 228895 310259
17573C10259a05812B6636J85880n6737m4768J87429j3236a36445A29162j3403
$$ 310259 -105812 26636 212516 155779 111011 298440 285204 -136445 129162 115759
17563A15759k7146J63327M7866A03027J423k8315g3267B3960R6602a72818B22045
$$ 115759 88613 251940 299806 103027 104450 76135 -73267 23960 120562 -172818 222045
17551H2551h5671J4308C79073B00J31611K51854A29458J18271J7483E9547e7629
$$ 82551 -85671 -71363 379073 200 131811 383665 129458 247729 265212 59547 -57629
17539B28422H9948R4224J05183I1467K01357L08899B10992J34874J06753m8851
$$ 228422 89948 184172 289355 91467 292824 601723 210992 345866 452619 403768
17529D03768k4473l7592J01731J89897j96375K76316L63669O5664j82274l37878
$$ 403768 379295 341703 443434 633331 436956 713272 1076941 1142605 960331 622453
17519F22453Q3129k63213N4698k35981j29269N00473G5525N54981j73992K01379
$$ 622453 705582 442369 497067 261086 131817 632290 75525 630506 456514 657893
17509F57893J01228O6023O54341F32156K48392m16931M049K0300j72111L72886
$$ 657893 759121 825144 1479485 632156 880548 463617 467666 487966 315855 688741
17499F88741j02994k51001G1693J84180n071K57672l665j39180J05128D0546K51888
$$ 688741 585747 334746 71693 255873 250802 508474 504809 365629 470757 40546 292434
17488B92434N4989j68276J83280j48877J06251o3443H942J75086b5049F84454
$$ 292434 347423 179147 362427 213550 319801 256358 8942 184028 -25049 684454
17477A78223K83466j68195P3383P6518J18041c0800C55819R7878n192J38339j96923
$$ 178223 461689 293494 366877 443395 561436 -30800 355819 453697 448505 586844 389921
17466C89921K72766B22616K48315q2889A31725R0645D6056A8369R3040K13581
$$ 389921 662687 222616 470931 388042 131725 222370 46056 18369 111409 324990
17456C24990J67269B9039M24477o9977P8857j2631p3567o4053j12608J79281p2324
$$ 324990 492259 29039 453516 383539 462396 449765 376198 312145 199537 378818 306494
17445C06494A00961K69315q1450j06306K27743j33486M8832j34476J79231L7830
$$ 306494 100961 370276 288826 182520 410263 276777 325609 191133 370364 408194
17435D08194A82394L58749A56973o2625K41123J41101o413K16172B18345R3938
$$ 408194 182394 541143 156973 94348 335471 476572 470159 686331 218345 312283
17425C12283o0695M8308J5498J49190k5635j29232M138A24893E7217R6760J14307
$$ 312283 251588 299896 315394 464584 438949 309717 313855 124893 57217 153977 268284
17414B68284c5175D0321J23540O1103K21319R6812A83190L93489B8124J00435
$$ 268284 -35175 40321 163861 224964 446283 543095 183190 576679 28124 128559
17404A28559J63144P7340o4859M9100J246k7061m985p7412J89995j36193J90316
$$ 128559 291703 369043 304184 353284 354530 327469 322484 245072 435067 298874 489190
17393D89190k05438A11022C6586J50277N1304L74821E5788L41806C4301K45755
$$ 489190 283752 111022 36586 186863 238167 612988 55788 397594 34301 280056
17383B80056L4007a45854A52321M1578e565D55788A38755J34168j04969J42515
$$ 280056 314063 -145854 152321 193899 -5565 455788 138755 272923 167954 310469
17373C10469N6674j50809L9028H4155N562M14041i4169E79750A38482B6737L00011
$$ 310469 367143 216334 255362 84155 89717 503758 -94169 579750 138482 26737 326748
17362C26748B6371M03279F8969J96011A09263L24616H5255M40171F06L67647A80101
$$ 326748 26371 429650 68969 264980 109263 433879 85255 525426 606 368253 180101
17350E43793B60550j07773R1449Q5243c07106E12790B51872A23881J93990A54387
$$ 543793 260550 152777 244226 329469 -307106 512790 251872 123881 317871 154387
17339a340D43729j2032b6698B50408j22522K24924A09393K76581A77622J70963
$$ -1340 443729 431697 -26698 250408 127886 352810 109393 385974 177622 348585
17329C48585K30907k69645J74128A08576K82166p4701j36440J80327M8944K7593
$$ 348585 579492 309847 483975 108576 390742 316041 179601 359928 408872 436465
17319D36465L84134B29148J09551j04373K07791j52383J62898j78351p9816N2706
$$ 436465 820599 229148 338699 234326 442117 289734 452632 274281 194465 247171
17309B47171M0506J75852O0047p9977m8689j69591P1131J58821j52546J67831
$$ 247171 287677 463529 523576 443599 394910 225319 296450 455271 302725 470556
17299D70556l6595j52469Q8535o8058m2126J60993K43501B14696J48409N0065
$$ 470556 433961 281492 370027 301969 259843 420836 664337 214696 363105 413170
17289D13170O4838j03204Q5759A90839N9140A18172M42805j66906M0621k2703
$$ 413170 478008 374804 460563 190839 249979 118172 560977 394071 434692 411989
17279D11989j82647J29389e0981E05977j01606j9158j69553J61901o841M341M6171
$$ 411989 229342 358731 -50981 505977 404371 385213 215660 377561 370720 375061 421232
17268D21232A35399L04550a03230E20646k49311L1118K25417p0868M9118B43573
$$ 421232 135399 439949 -103230 520646 271335 302453 527870 457002 506120 243573
17257D13843N0799l4094j74116J05959M2657o4697J10262j69562d9228D36472
$$ 413843 464642 430548 256432 362391 405048 340351 450613 281051 -49228 436472
17246B58474K47293A03890J02927K09995N9753j17832K97880k60655j80164J86397
$$ 258474 505767 103890 206817 416812 476565 358733 656613 395958 215794 402191
17236D02191N5342j74672K52986k4252M5830Q7287B44817K96653j52496j58706
$$ 402191 457533 282861 535847 511595 557425 644712 244817 541470 388974 230268
17226B30268L72650B92419M11822k51059J44307k58346K99140q2768m7794M2864
$$ 230268 602918 292419 704241 453182 597489 339143 638283 555515 507721 550585
17216E50585j30619q1857J5925J39575B35711L07419J39298J91733l57738P3885
$$ 550585 419966 338109 354034 493609 235711 543130 682428 874161 516423 590308
17206E90308r5643J58768Q2011n8739A74143M11438k65695J19665p844L9641j37130
$$ 590308 494665 653433 735444 676705 174143 585581 319886 439551 431707 471348 334218
17195C34218N83020l15198j10023L52457D14186p8821L01209k4775N41B96594
$$ 334218 917238 602040 492017 844474 414186 335365 636574 611799 612340 296594
17184H53346k4568k88110l8505A86687L88252j12719R6578J86439C23936L70570
$$ 853346 828778 540668 502163 186687 574939 462220 558798 745237 323936 694506
17174F94506j56655J13518r2605j30664L22620C30173K9810Q0596J40876j83212
$$ 694506 537851 651369 558764 428100 750720 330173 359983 440579 581455 398243
17164C98243J51310J71734k43971L74066P556o8268l57897L40072l03538J25168
$$ 398243 549553 721287 477316 851382 858938 790670 432773 772845 469307 594475
17154E94475j14230m303k29797K71114J70539j90228M17070k45006l9284l4123
$$ 594475 480245 475942 246145 517259 687798 497570 914640 669634 630350 596227
17144E96227P5253j50536L03919j94072k34584L17801j44736N6507J15024j2956
$$ 596227 671480 520944 824863 630791 396207 714008 569272 625779 740803 727847
17134G27847k01207p9335J06561J05312q7939J35932B44454M57061j41143J87794
$$ 727847 526640 447305 553866 659178 571239 707171 244454 701515 560372 748166
17124G48166P5844l42240K18061j13172N4363j2151P3490n1572K54650l3217l92430
$$ 748166 824010 481770 699831 586659 641022 628871 702361 650789 905439 872222 479792
17113D79792J73143Q7846j71316J32667k0539J26593L80451l47214K08879m7585
$$ 479792 652935 740781 569465 702132 681593 808186 1188637 841423 1050302 1002717
17103A002717l70881L14292j99275j00293J04873O0896k19997L0127J91501m2414
$$ 1002717 631836 946128 746853 646560 751433 812329 592332 622459 813960 771546
17093G71546j2569J56832M3079j38709K7716k93311L08392j98220O3329R9742
$$ 771546 758977 915809 958888 820179 847895 554584 862976 664756 728085 827827
17083H27827O1695R0999j59767J67533J47847q6309k88325O8542P4370J66549
$$ 827827 889522 980521 820754 988287 1136134 1049825 761500 830042 904412 1070961
17073A070961j24577j16846J10201k66439K18664Q9861l24774O05849l36388q1670
$$ 1070961 946384 829538 939739 673300 891964 981825 657051 1262900 926512 844842
17063H44842J44416L51208j92444j07332l9936k87296J67199J88096j06715j14131
$$ 844842 989258 1340466 1148022 1040690 1000754 713458 880657 1068753 962038 847907
17053H47907J28310J2687l16185L64783K17905k09498j7557l12902K98497j94671
$$ 847907 976217 988904 672719 1037502 1255407 1045909 1028352 715450 1013947 819276
17043H19276K59811j15474L44300j59062o9816j17235L97161j69820J49212J61193
$$ 819276 1079087 963613 1307913 1148851 1079035 961800 1358961 1189141 1338353 1499546
17033A499546l50321J14762K98246l77444j78424p0395K54697m8661J9078M8010
$$ 1499546 1149225 1263987 1562233 1184789 1006365 935970 1190667 1142006 1161084 1209094
17023A209094k37060L02759k0591k22803N12711l32796k98843P34901k40897J63775
$$ 1209094 972034 1274793 1254202 1031399 1544110 1211314 912471 1647372 1406475 1570250
17013A570250j62849j16334J0702R4723k27449o8843L82649J60563k34012j6307
$$ 1570250 1407401 1291067 1301769 1396492 1169043 1100200 1482849 1643412 1409400 1393093
17003A393093l15212M44912j91705J16846M0648j06373K88831k34085J86493K27040
$$ 1393093 1077881 1522793 1331088 1447934 1488582 1382209 1671040 1436955 1623448 1850488
16993A850488j35663j09843m0473J87542j77698n7848K37612J3553j53793j2672
$$ 1850488 1714825 1604982 1564509 1752051 1574353 1516505 1754117 1767670 1613877 1601205
16983A601205K3236p6552K59801J15929j34356k3023o1687K84569j70908k93462
$$ 1601205 1624441 1547889 1807690 1923619 1789263 1766240 1704553 1989122 1818214 1524752
16973A524752l2066N85469k53978K01063j69310K26602J9638j24262J89430K2719
$$ 1524752 1492686 2078155 1824177 2025240 1855930 2082532 2102170 1977908 2167338 2190057
16963B190057l58629K61239J8563M4282p7314J03690p5704j139K88889q4917r6052
$$ 2190057 1831428 2092667 2111230 2155512 2078198 2181888 2106184 2105045 2393934 2309017 2212965
16952B212965P4024j67762N72623j35445k49143R2941M6963k22226J10729J75708
$$ 2212965 2286989 2119227 2691850 2556405 2307262 2400203 2447166 2224940 2335669 2511377
16942B511377K04783k65710K53624l74320J61053J53786M00517k92944O462J62148
$$ 2511377 2716160 2450450 2704074 2329754 2490807 2644593 3045110 2752166 2758628 2920776
16932B920776k1482L081j50297J72913K24632j51204r5762r526O1789K45225k37476
$$ 2920776 2899294 2902375 2752078 2924991 3149623 2998419 2902657 2893131 2954920 3200145 2962669
16921B962669J67167K84824M7037k81010P4177K53697k45997j4766O6948M80831
$$ 2962669 3129836 3414660 3461697 3180687 3254864 3508561 3262564 3247798 3314746 3795577
16911C795577l4941p5437k8056j89284M76554m913k51896J40838J29511l725J38013
$$ 3795577 3760636 3685199 3657143 3467859 3944413 3939500 3687604 3828442 3957953 3954228 4092241
16900D092241j98747k8524L13087J07947j23608R6519P1356J20268j33735R1900
$$ 4092241 3893494 3864970 4178057 4286004 4162396 4258915 4330271 4450539 4316804 4408704
16890D408704J67209n9604r7157K10928J35387J85686N4044m4609J828J33035
$$ 4408704 4575913 4516309 4419152 4630080 4765467 4951153 5005197 4960588 4962416 5095451
16880E095451J20212Q2240K67569j67780O0262K03448n3635j56115M37038J63282
$$ 5095451 5215663 5297903 5565472 5397692 5457954 5661402 5607767 5451652 5888690 6051972
16870F051972L1166l71773O35286k84185L12469j85295M92482r6506K55531m07764
$$ 6051972 6083138 5711365 6346651 6062466 6374935 6189640 6682122 6585616 6841147 6433383
16860F433383N06140K5518j01151M42864l4492J19558P6224j68459O64344k56605
$$ 6433383 6939523 6965041 6863890 7306754 7272262 7391820 7468044 7299585 7963929 7707324
16850G707324N34046n7638N4411L37378P7287M7457J21633K88387n276J49369
$$ 7707324 8241370 8183732 8238143 8575521 8652808 8700265 8821898 9110285 9105009 9254378
16840I254378L63312L03262J94873j20845r0547L99222L41836M91349j42728J09322
$$ 9254378 9617690 9920952 10115825 9994980 9904433 10303655 10645491 11136840 10994112 11103434
16830A1103434M35610p9104O96391J06508l2732N08486j11957O72018J28813K10453
$$ 11103434 11539044 11459940 12156331 12262839 12230107 12738593 12626636 13298654 13427467 13637920
16820A3637920N67461k35911L57219P55992J86490L83485P1572M82189L86633
$$ 13637920 14205381 13969470 14326689 15082681 15269171 15652656 15724228 16206417 16593050
16811A6593050O18978j41758P36992M39818L34703M87913J60656K76511O78725
$$ 16593050 17212028 17070270 17807262 18247080 18581783 19069696 19230352 19506863 20185588
16802B0185588N99593M92099M16732L12034P44095M75152O47734P80567M73421
$$ 20185588 20785181 21277280 21694012 22006046 22750141 23225293 23873027 24653594 25127015
16793B5127015O28896P79397L48562R57813O15238P46651N03679J239040P60185
$$ 25127015 25755911 26535308 26883870 27841683 28456921 29203572 29707251 30946291 31706476
16784C1706476Q31173P76866J007578P92766R60585J141857J183694O79972J467445
$$ 31706476 32537649 33314515 34322093 35114859 36075444 37217301 38400995 39080967 40548412
16775D0548412R50468J061399J197441J140516R96370J573180J483196J206740
$$ 40548412 41498880 42560279 43757720 44898236 45894606 47467786 48950982 50157722
16767E0157722R48802J752255J308898J686094J357251J335397J566706J667545
$$ 50157722 51106524 52858779 54167677 55853771 57211022 58546419 60113125 61780670
16759F1780670J608538J199402J641133J694127J777541J391279J450113J500605
$$ 61780670 63389208 64588610 66229743 67923870 69701411 71092690 72542803 74043408
16751G4043408J470644J130607J502271J341303J299458J316643J015933J295040
$$ 74043408 75514052 76644659 78146930 79488233 80787691 82104334 83120267 84415307
16743H4415307Q10917R39225Q32091P33415O00565K64490N57975M80787q2725
$$ 84415307 85226224 86165449 86997540 87730955 88331520 88596010 89153985 89634772 89552047
16734H9552047m26760K16844m46192l91560k52221p56514n25745r50910j117810
$$ 89552047 89125287 89342131 88895939 88504379 88252158 87495644 86969899 86018989 84901179
16725H4901179q03689j036479j202777j474011q74781j510426j248548j822116
$$ 84901179 84097490 83061011 81858234 80384223 79509442 77999016 76750468 74928352
16717G4928352r90372j855336j505079j459132j278346j658699j188769j456452
$$ 74928352 73937980 72082644 70577565 69118433 67840087 66181388 64992619 63536167
16709F3536167j761456j680127j601011j071755j428033j373059j614937j055463
$$ 63536167 61774711 60094584 58493573 57421818 55993785 54620726 53005789 51950326
16701E1950326j228627j213358j497949r21847j473845j260845j076970j074491
$$ 51950326 50721699 49508341 48010392 47088545 45614700 44353855 43276885 42202394
16693D2202394j044934p83668j198648j009563r65800r64508n92065j014226n88948
$$ 42202394 41157460 40373792 39175144 38165581 37199781 36235273 35643208 34628982 34040034
16684C4040034j286553m09185j007491q35833o82488o90089o01561n20730p34065
$$ 34040034 32753481 32344296 31336805 30500972 29818484 29128395 28526834 28006104 27272039
16675B7272039q77715l16149m75634q47840l18882m56117m95495r18305l73821
$$ 27272039 26394324 26078175 25602541 24754701 24435819 23979702 23484207 22565902 22192081
16666B2192081l91535k85078l74689p66955m15774q1414p73081m68651j5071l67425
$$ 22192081 21800546 21515468 21140779 20373824 19958050 19876636 19103555 18634904 18619833 18252408
16656A8252408o15537j73439p18367J15866n42174k6015k78949k95904m17908
$$ 18252408 17636871 17463432 16745065 16860931 16318757 16292742 16013793 15717889 15299981
16647A5299981m51167J12030m84072k30713j97291j87358j47729k50033m23461
$$ 15299981 14848814 14960844 14476772 14246059 14048768 13861410 13713681 13463648 13040187
16638A3040187m83889K35086l76702n2519m31198J16264k79269k50323m31543
$$ 13040187 12556298 12791384 12414682 12362163 11930965 12047229 11767960 11517637 11086094
16629A1086094J24444k1289o59282N8088J27356k66148k59462K57492k18952m94781
$$ 11086094 11210538 11189249 10529967 10588055 10715411 10449263 10189801 10447293 10228341 9733560
16619I733560k93591K02393l88224n8993O8128o681n57643r5994n1789l6498j84132
$$ 9733560 9439969 9642362 9254138 9195145 9263273 9256592 8698949 8602955 8551166 8514668 8330536
16608H330536j99227K78086j20573m52924J34607j63172m29343J80650p682j62718
$$ 8330536 8131309 8409395 8288822 7835898 7970505 7807333 7377990 7558640 7550958 7388240
16598G388240j2240k43408J7235J45030j36244m7073p83564K98157l63153M92452
$$ 7388240 7376000 7132592 7149827 7294857 7158613 7111540 6327976 6626133 6262980 6755432
16588F755432k77954j64150j84021J34797j25757j77398M27579m41316J30931
$$ 6755432 6477478 6313328 6129307 6264104 6138347 5960949 6388528 5947212 6078143
16579F078143k70718o2824J25443j22050j84955K67678m16985j13971L08476m85826
$$ 6078143 5807425 5744601 5870044 5747994 5563039 5830717 5413732 5299761 5608237 5122411
16569E122411J6645J12439r6453k13839j38113J25058J4690k44699L40098Q2350
$$ 5122411 5139056 5251495 5155042 4941203 4803090 4928148 4942838 4698139 5038237 5120587
16559E120587j42829l30582L7079r0136L44472o60697M32423m54256N3853J83642
$$ 5120587 4977758 4647176 4684255 4594119 4938591 4277894 4710317 4256061 4309914 4493556
16549D493556j07224L05706l84844J01483m89292K78079k1627J11931o15212O47955
$$ 4493556 4386332 4692038 4307194 4408677 3919385 4197464 4175837 4287768 3672556 4320511
16539D320511k0235k43809L2706k30489P2879j57261J35961k23029L07539p0369
$$ 4320511 4300276 4056467 4089173 3858684 3931563 3774302 3910263 3687234 3994773 3924404
16529C924404n0500J87083m81286J91238l51215L33884L6042l3805m079l96321
$$ 3924404 3873904 4060987 3579701 3770939 3419724 3753608 3789650 3755845 3751766 3355445
16519C355445J88581J37389j82926J13443k9274l39974M60760n45586j10906K72443
$$ 3355445 3544026 3681415 3498489 3611932 3582658 3242684 3703444 3157858 3046952 3319395
16509C319395K288l96323K37580K18528j99567K0301l76050N58314K5424l19198
$$ 3319395 3321683 2925360 3162940 3381468 3181901 3202202 2826152 3384466 3409890 3090692
16499C090692j51151J19528j48971K69746j5865k10309k79155M89509k05040J9899
$$ 3090692 2939541 3059069 2910098 3179844 3163979 2953670 2674515 3164024 2958984 2978883
16489B978883l26506N4568l5794J49785p833j98297Q3017J56149q6455N8247r1240
$$ 2978883 2652377 2706945 2671151 2820936 2813103 2614806 2697823 2853972 2767517 2825764 2734524
16478B734524J79599n51021L43933m308k10319K78284l37002k8125N11702k32120
$$ 2734524 2914123 2363102 2707035 2702727 2492408 2770692 2433690 2405565 2917267 2685147
16468B685147J05624k05326J1448J03287j43238j14475J59215k6672l5771o3755
$$ 2685147 2790771 2585445 2596893 2700180 2556942 2442467 2601682 2575010 2539239 2475484
16458B475484l78457K43294n3226j61972J47293J63503N7655n0035k74342L53114
$$ 2475484 2097027 2340321 2287095 2125123 2272416 2435919 2493574 2443539 2169197 2522311
16448B522311p3713k58609R7234K5879l97818M16746j43119l30421L03445J68639
$$ 2522311 2448598 2189989 2287223 2313102 1915284 2332030 2188911 1858490 2161935 2330574
16438B330574r5229j51261j64033N464L17293j0428l40856M00326K00557o17259
$$ 2330574 2235345 2084084 1920051 1925515 2242808 2232380 1891524 2291850 2492407 1875148
16428A875148L08002m3657J60910k69103j81265M67791k89017m955j51979O7987
$$ 1875148 2183150 2139493 2300403 2031300 1850035 2317826 2028809 2023854 1871875 1939862
16418A939862J45129o4992j07232L6270r8062O6661K71274n06446K94922j64112
$$ 1939862 2084991 2019999 1912767 1949037 1850975 1917636 2188910 1682464 1977386 1813274
16408A813274K51347l98816M80923o15277K87390j9784K46144k20047j44133K53028
$$ 1813274 2064621 1665805 2146728 1531451 1818841 1799057 2045201 1825154 1681021 1934049
16398A934049p024j66286K29745J13540l75056R2107n9499r162J75267j14250
$$ 1934049 1927025 1760739 1990484 2104024 1728968 1821075 1761576 1752414 1927681 1813431
16388A813431k47260L52237k11676j55488K37653K76014k19671J10648m55519
$$ 1813431 1566171 1918408 1706732 1551244 1788897 2064911 1845240 1955888 1500369
16379A500369j95671O65739o11201Q0055K31822J00425l16548L95375j51112N8712
$$ 1500369 1304698 1970437 1359236 1439291 1671113 1771538 1454990 1850365 1699253 1757965
16369A757965j31363K78643o24396K05462q9179Q5309J90494Q7120n38055J03004
$$ 1757965 1626602 1905245 1280849 1486311 1397132 1482441 1672935 1760055 1222000 1325004
16359A325004M8888P5581J74033l96039N22031l55441N1425L10122p7534j33270
$$ 1325004 1373892 1449473 1623506 1227467 1749498 1394057 1445482 1755604 1678070 1544800
16349A544800j16644K05275j45636J66817K62876o91448N07004n78031N503J71167
$$ 1544800 1428156 1633431 1487795 1654612 1917488 1226040 1733044 1155013 1160516 1331683
16339A331683n2716M99839o69081M90490j33357j61387j48738L54127j20342N1385
$$ 1331683 1278967 1778806 1109725 1600215 1466858 1305471 1156733 1510860 1390518 1441903
16329A441903L53391n61189L61993k24564j63096J92565r4822J14501q5967k92902
$$ 1441903 1795294 1234105 1596098 1371534 1208438 1401003 1306181 1420682 1334715 1041813
16319A041813M95578j22327k01659J55665K261l07692L43860n86866L27664O4759
$$ 1041813 1537391 1415064 1213405 1369070 1371331 1063639 1407499 820633 1148297 1213056
16309A213056O5511j9058N3360j94733J21933P9608K22377l61161K67266j90937
$$ 1213056 1278567 1259509 1312869 1118136 1240069 1319677 1542054 1180893 1448159 1257222
16299A257222O4625K5745l7213k41022K26981M68J21571l55331N2978N7941O5879
$$ 1257222 1321847 1347592 1310379 1069357 1296338 1296806 1418377 1063046 1116024 1173965 1239844
16288A239844P803k6761j37399j42580J6989j06697N75330N7777m67272J71238
$$ 1239844 1247647 1220886 1083487 940907 957896 851199 1426529 1484306 1017034 1188272
16278A188272p9457J14315m2572k42973K65761l02812J51332O46357n70720j21109
$$ 1188272 1108815 1223130 1180558 937585 1203346 900534 1051866 1698223 1127503 1006394
16268A006394K5271R729M9872q2706q9861O5847L91280o86569J45852L22934k75115
$$ 1006394 1031665 1041394 1091266 1008560 918699 984546 1375826 689257 835109 1158043 882928
16257H82928J0520J34249p322J17443k20819n5858K27617l02650K14761m2579
$$ 882928 893448 1027697 1020375 1137818 916999 861141 1088758 786108 1000869 958290
16247I58290J9937j27587m1402J22136K36937k92254J08851D22420L59723Q008
$$ 958290 978227 850640 809238 931374 1168311 876057 984908 422420 782143 790151
16237G90151J98796k41285K49443j79107J61451J40076r1129m6042j34586r3195
$$ 790151 988947 747662 997105 817998 979449 1119525 1028396 982354 847768 754573
16227G54573K67050j90012J04301Q6021l58644K81908J38869r1607l76015M7589
$$ 754573 1021623 831611 935912 1021933 663289 945197 1084066 992459 616444 664033
16217F64033L4608K21368j84188K4030K20017j72991K21038K3623m08371q0568
$$ 664033 698641 920009 735821 759851 979868 806877 1027915 1051538 643167 562599
16207E62599J23744L40103k24655j04984L44148l02738K36379l39325J19099j83358
$$ 562599 686343 1026446 801791 696807 1040955 738217 974596 635271 754370 571012
16197E71012L78911k84820l3413p594J6654N7254J129L5822N8735R0322j81711
$$ 571012 949923 665103 631690 624096 640750 698004 699133 734955 793690 884012 702301
16186G02301o6542J47483l91425M5208m7735K27062O8722k52653J81016k8190
$$ 702301 635759 783242 391817 437025 389290 616352 685074 432421 613437 585247
16176E85247J21789j81263K30560l12530L60891l59113K26770L6470l06673J80897
$$ 585247 707036 525773 756333 443803 804694 445581 672351 708821 402148 583045
16166E83045K30881B32465P01233l03498k73817K88017r8337J69058J00847q6118
$$ 583045 813926 232465 933698 630200 356383 644400 546063 715121 815968 729850
16156G29850l41884k8965j09635J5097J2084J60667L07605j17439j81437K7486
$$ 729850 387966 359001 249366 264463 276547 437214 744819 627380 445943 473429
16146D73429J58381J0194p484o6035m5652J27832K04303J37030m27754r6962j92018
$$ 473429 631810 642004 634520 568485 522833 650665 854968 991998 564244 467282 275264
16135B75264A09002K80774K86173k61336J42342j9335m2928j57609K49469l3740
$$ 275264 109002 389776 675949 414613 556955 537620 494692 337083 586552 552812
16125E52812p2730j024j52915M43703R631p3120l48706L18045A73845M99990k3328
$$ 552812 480082 479058 326143 769846 779477 706357 357651 675696 173845 673835 650507
16114F50507P0034A61234L62374k07326K1350Q2240k1443p6996M2567A48147L26742
$$ 650507 720541 161234 523608 316282 337632 419872 398429 321433 364000 148147 474889
16103D74889J23441n3785j91222K5678r6279M8901J15637j49344Q1247K33948
$$ 474889 598330 544545 353323 379001 282722 331623 447260 297916 379163 613111
16093F13111C04701l101J32687q5561r4547R5997n2774J27182k4163j71293J58918
$$ 613111 304701 301600 434287 348726 254179 350176 297402 424584 400421 229128 388046
16082C88046A34599M14786D802R6677M06513J3903j19713N1185A63259N3448r3361
$$ 388046 134599 549385 4802 101479 507992 521895 402182 453367 163259 216707 123346
16071A23346N65290B11376I9113K12758J36927B11801J20278L6868M9941j78047
$$ 123346 688636 211376 99113 311871 448798 211801 332079 368947 418888 240841
16061B40841K64121J41711k84952A70096a07206C44905j34723C5652L73801L8085
$$ 240841 504962 646673 361721 170096 -107206 344905 210182 35652 409453 447538
16051D47538A28319K98192J21268A99323c3882C09409j0270K198l6561J50623
$$ 447538 128319 426511 547779 199323 -33882 309409 299139 301337 264776 415399
16041D15399r9163k5782J58329A79132q010p7262J48763J95745A25623K96085
$$ 415399 316236 290454 448783 179132 171122 93860 242623 438368 125623 421708
16031D21708N7664A19235N2020k7395P6448M7345D3724f3944C64117n3930K5485
$$ 421708 479372 119235 171255 143860 220308 267653 43724 -63944 364117 310187 335672
16020C35672A64252n7542K78373C6376J77637K62610H2922b85824f7454A35351
$$ 335672 164252 106710 385083 36376 214013 476623 82922 -285824 -67454 135351
16009B37985i7636B50394J8349A20167J22097M0031M3194C5162K49130C4796K8597
$$ 237985 -97636 250394 268743 120167 242264 282295 325489 35162 284292 34796 63393
15998F3393O1786h6050j43151H8644e7587A80886A2290J39966j0940K88811J4566
$$ 63393 125179 -86050 -229201 88644 -57587 180886 12290 152256 141316 430127 444693
15987D44693L74359K05030j28718L38461l96043C22732J74465k44039K7498L751
$$ 444693 819052 1024082 895364 1233825 837782 322732 497197 253158 280656 284407
15977B84407p3966e9814D7487J12470K9972J2955f008k5763G4302a83769B60059
$$ 284407 210441 -59814 47487 159957 189929 202884 -6008 -31771 74302 -183769 260059
15965F5634b46989I6882J04548K12937A65954m5876K59472a56042C16678A42852
$$ 65634 -246989 96882 201430 414367 165954 120078 379550 -156042 316678 142852
15954A87663K98388A46487o9724f4433A93989O783K70321G5924a94368B78623
$$ 187663 486051 146487 76763 -64433 193989 200772 471093 75924 -194368 278623
15943B32713g7358b9329A39514J23694A14254L93570k21365j02033a2854A44856
$$ 232713 -77358 -29329 139514 263208 114254 507824 286459 184426 -12854 144856
15932g9027A16923J9693J71079f5753E0700a17349b1849A66325L43224a4437A057
$$ -79027 116923 136616 307695 -65753 50700 -117349 -21849 166325 509549 -14437 1057
15920B57839J13686d0447J6825r6470F8624a55217C06100j06870r5844J24432
$$ 257839 371525 -40447 -23622 -120092 68624 -155217 306100 199230 103386 227818
15910B27818g8075F1903b1025o1404B50765c94916c6520A41625K17523g2555C24066
$$ 227818 -78075 61903 -21025 -82429 250765 -394916 -36520 141625 359148 -72555 324066
15898a73428A73840Q2912I9609c6762I1324M4708J07851d7470A5322K15904C422
$$ -173428 173840 256752 99609 -36762 91324 136032 243883 -47470 15322 231226 3422
15886A01021a98470H8253O5712a70716A10374L99235k38309j20507m7195a14940
$$ 101021 -198470 88253 153965 -170716 110374 509609 271300 150793 103598 -114940
15875D5941a64671H8048l9535P8739O5144K3809a05074j65107B26591A09099K0093
$$ 45941 -164671 88048 48513 127252 192396 216205 -105074 -270181 226591 109099 129192
15864A29192L14303a72173j38597J00831B18150I2740a10087p9070F6395i2562
$$ 129192 443495 -172173 -310770 -209939 218150 92740 -110087 -189157 66395 -92562
15853A433e7171A33017n3642b29348P1859A82807M273a2279A81351L8512A04629
$$ 1433 -57171 133017 79375 -229348 -157489 182807 187080 -12279 181351 219863 104629
15841A84846G6981b15586B28157a5061q7896J2323n7571A14373b65462A25150
$$ 184846 76981 -215586 228157 -15061 -102957 -90634 -148205 114373 -265462 125150
15830e7512n7936B05300m4638G5414N6321J12924I7605f4727A7314h1666L9194
$$ -57512 -115448 205300 160662 75414 131735 244659 97605 -64727 17314 -81666 -42472
15819d2472H3946k2851K877K952J10885f1454m0718B02046p5618b36109A0032
$$ -42472 83946 61095 63972 66924 177809 -61454 -102172 202046 126428 -236109 10032
15807B3065b04177c6645F2440a13399B4031a5077A1932J95461a42398A10652Q0356
$$ 23065 -204177 -36645 62440 -113399 24031 -15077 11932 207393 -142398 110652 191008
15796A91008k0457f8278B03847a8010I6599M6180K06628H9527J14180I6176b19252
$$ 191008 170551 -68278 203847 -18010 96599 142779 349407 89527 203707 96176 -219252
15784b90751B65573J85495A40447m5675C3513a4073o306B28107a0435E625f7852
$$ -290751 265573 451068 140447 94772 33513 -14073 -20379 228107 -10435 5625 -67852
15772A15993b10646g9258C9783J75908a15480K9320A2495h7022g299A05263m5244
$$ 115993 -210646 -79258 39783 215691 -115480 -86160 12495 -87022 -7299 105263 60019
15761F0019J65374I4527J11534L5533a54135B6120I669O1965a35745A02939b9089
$$ 60019 225393 94527 206061 241594 -154135 26120 9669 71634 -135745 102939 -29089
15749G1811b06392A68666J65623h1828A37223b20359A55157J0686l1438a10016
$$ 71811 -206392 168666 334289 -81828 137223 -220359 155157 165843 134405 -110016
15738A67357a60282A89579A981K5876d4972G592Q6484J54851a86810R0085J197
$$ 167357 -160282 189579 1981 27857 -44972 7592 94076 248927 -186810 -96725 -95528
15727i5528H9934m3418a44766L5403C59633b33462C31249A2139a20883k68777
$$ -95528 89934 46516 -144766 -109363 359633 -233462 331249 12139 -120883 -389660
15717c89660A64392h5246k49633O1005A97967p8390a51656A12131n0349c41189
$$ -389660 164392 -85246 -334879 -273874 197967 119577 -151656 112131 61782 -341189
15706a53017A02672a4614A56492e9213A17279a4092j76086j20831e9936C3472
$$ -153017 102672 -14614 156492 -59213 117279 -14092 -190178 -311009 -59936 33472
15695B43264f8310C70158H8761P7513R6279j14359l4664J04640a66731I4951c37867
$$ 243264 -68310 370158 88761 166274 262553 148194 113530 218170 -166731 94951 -337867
15683f7019j08564O0956r1928F7778A8775a192j48515j11548C28019a12081H277
$$ -67019 -175583 -114627 -206555 67778 18775 -1192 -149707 -261255 328019 -112081 8277
15671A5601Q4173M8418f5034m3840h781H3466a38193b5996i787j18125M6192j21252
$$ 15601 99774 148192 -65034 -108874 -8781 83466 -138193 -25996 -9787 -127912 -81720 -202972
15659b02972A36157a17054E5361d3798m0758A67919a38568C8308b05689B81060
$$ -202972 136157 -117054 55361 -43798 -84556 167919 -138568 38308 -205689 281060
15648a04700r1333B52511D1845b25822j51387H4854g719l46434i488A29226G05
$$ -104700 -196033 252511 41845 -225822 -377209 84854 -7719 -354153 -9488 129226 705
15636B87526C5872K04589G0241c13965G1511a58813d8010B45135d7510j78285
$$ 287526 35872 240461 70241 -313965 71511 -158813 -48010 245135 -47510 -225795
15626b25795p6513e4571j05436E7162m276b78766E7591b34915A00350B7862e1512
$$ -225795 -302308 -54571 -160007 57162 52886 -278766 57591 -234915 100350 27862 -51512
15614b31712i3102j46838A44752h2656D5625J93115H4365J61450a11472p6927
$$ -231712 -93102 -239940 144752 -82656 45625 238740 84365 245815 -111472 -188399
15604a88399N547j61576g7133l6724L8504a5195A377a76915A21415i2871m16302
$$ -188399 -182852 -344428 -77133 -113857 -75353 -15195 1377 -176915 121415 -92871 -509173
15593e09173D2741b2281k47597A17497L1704l8587g0288H763O1153J52998c1558
$$ -509173 42741 -22281 -269878 117497 149201 110614 -70288 8763 69916 222914 -31558
15581B69115e0660d137q0858C45157A57795g9119j09363Q6044B52032H7389M14096
$$ 269115 -50660 -4137 -84995 345157 157795 -79119 -188482 -102438 252032 87389 501485
15570E01485A05875O9438J96853a00404A14819C6883a63533E335N2163h028A91110
$$ 501485 105875 175313 372166 -100404 114819 36883 -163533 5335 57498 -8028 191110
15558B17085a6834j78733I1909Q2277a07231F1139J67222F5461L22307A58139
$$ 217085 -16834 -195567 91909 174186 -107231 61139 228361 65461 387768 158139
15547A30427c1103j75019A72391R2688N3397A27334B2833L7865B7566c2970D5415
$$ 130427 -31103 -206122 172391 265079 318476 127334 22833 60698 27566 -32970 45415
15535C64658q4904l5803N1516a59187B48987a03824B02125b22284a02438A47473
$$ 364658 279754 243951 295467 -159187 248987 -103824 202125 -222284 -102438 147473
15524A43773K48916H2465m755O6778D5415K07221h7122j944A89450L6270L2264
$$ 143773 392689 82465 77710 144488 45415 252636 -87122 -89066 189450 225720 257984
15513B57984e2290G6526l128f681j36623B10980r6047J3889J91118q3745e5508
$$ 257984 -52290 76526 73398 -6681 -143304 210980 114933 128822 319940 236195 -55508
15501D67293a80789d3842A51776j8289m1594K68787E2658J40805F7527A7369J66055
$$ 467293 -180789 -43842 151776 133487 91893 360680 52658 193463 67527 17369 183424
15490A83424E0682R6960d48444a75908j16576R4479A14581J45312N9786A20498
$$ 183424 50682 147642 -448444 -175908 -292484 -198005 114581 259893 319679 120498
15479B54267K87648m5895K04728k38908A98016n4773f0913I2289b66829e1806
$$ 254267 541915 496020 700748 461840 198016 143243 -60913 92289 -266829 -51806
15468A41811A9875c67870h826A38366k0551d3853k60274I935L2M63590e1059C19506
$$ 141811 19875 -367870 -8826 138366 117815 -43853 -304127 9935 9967 473557 -51059 319506
15455i0556C2764J10497p1252K711J05279K19436j27150q7403l4394K48912P34215
$$ -90556 32764 143261 72009 74720 179999 399435 272285 184882 150488 399400 1133615
15444A133615J84143D48011L44780C62034p5025c1712C21006h7138k113C2776
$$ 1133615 1317758 448011 792791 362034 287009 -31712 321006 -87138 -89251 32776
15433a08141A22592c8988G8999g0183C69728b72640D7857K4245J9790a05582C6013
$$ -108141 122592 -38988 78999 -70183 369728 -272640 47857 72102 91892 -105582 36013
15421A33591g8049q977H253a5169k33963p887B2084h5104A18632e6619A78357
$$ 133591 -78049 -87026 8253 -15169 -249132 -257019 22084 -85104 118632 -56619 178357
15409C2463a10950H8011g0966a8072j64414A60395M7252c2568l65898A23975d8356
$$ 32463 -110950 88011 -70966 -18072 -182486 160395 207647 -32568 -398466 123975 -48356
15397B2673r241c7039k6624I9901D7248h314E2968c43642A59521a12836A47650
$$ 22673 13432 -37039 -63663 99901 47248 -8314 52968 -343642 159521 -112836 147650
15385g8482J2465E30676a50564A36596a65951d7628j35309B01353n0695K0088
$$ -78482 -66017 530676 -150564 136596 -165951 -47628 -182937 201353 150658 170746
15375A70746N2710k7735a1471j48662B1756e1072H2561J05672A2176L33382B1086
$$ 170746 223456 195721 -11471 -160133 21756 -51072 82561 188233 12176 345558 21086
15363b39820f7272A9948c5783A95317r5099O9724m8106C088K73966J41504o9864
$$ -239820 -67272 19948 -35783 195317 100218 169942 121836 3088 277054 418558 348694
15352C48694A14670a65667E8449B3842J50553R913K66422j43428r7739J93244
$$ 348694 114670 -165667 58449 23842 174395 184308 450730 307302 209563 402807
15342D02807M3972A94821J48875J0058r8748R138F8081k3686K8433d31144a31209
$$ 402807 446779 194821 343696 353754 255006 264144 68081 44395 72828 -431144 -131209
15330D4497g3090A25046D1441J79294B8262J73076r570a12473B19116Q4193L12531
$$ 44497 -73090 125046 41441 220735 28262 201338 191768 -112473 219116 303309 615840
15319F15840j37775A66317J68590I8511c9009F2506k5700L00294j45424b8250
$$ 615840 478065 166317 334907 98511 -39009 62506 36806 337100 191676 -28250
15308B95159a38565F2601e8542E3217a61048B88417a5101k10005D86692a54513
$$ 295159 -138565 62601 -58542 53217 -161048 288417 -15101 -225106 486692 -154513
15297C18234k2514o6454G1044J7526P8165n7960b24339e6897B44303a8661M653
$$ 318234 295720 229266 71044 88570 166735 108775 -224339 -56897 244303 -18661 -14008
15286a4008j3206i085p6603E08985A89908k1254E6331a3279C0936J13383J74807
$$ -14008 -27214 -9085 -85688 508985 189908 168654 56331 -13279 30936 144319 319126
15275C19126b30778B24958n1532a51994O5559H7926J378J16849B2499M0729Q8362
$$ 319126 -230778 224958 173426 -151994 -86435 87926 89304 206153 22499 63228 151590
15264A51590b39449J18672A28790j6437a60622B76880J8680A35519b50340e5455
$$ 151590 -239449 -120777 128790 112353 -160622 276880 295560 135519 -250340 -55455
15253b24218I7004b51336C0451J8716R6604i6659B13781J25521N5129J38380J072905
$$ -224218 97004 -251336 30451 49167 145771 -96659 213781 339302 394431 532811 1605716
15242A605716L55439n71596Q65440q14173C73410A66682N1300c1278C44694C9443
$$ 1605716 1961155 1389559 2254999 1440826 373410 166682 217982 -31278 344694 39443
15231b41947B15302k6719P3409d1908n3052j39683J14835C7030Q7091A3989K50681
$$ -241947 215302 188583 261992 -41908 -94960 -234643 -119808 37030 124121 13989 264670
15220B64670e629A10035C6205B642L8560L4947R7812a72505B36991a24564e3152
$$ 264670 -5629 110035 36205 2642 41202 76149 173961 -172505 236991 -124564 -53152
15208g4890B82974F8453f7253A34063o4522O3064c54417A49724E3478a73359A69958
$$ -74890 282974 68453 -67253 134063 69541 132605 -354417 149724 53478 -173359 169958
15196F8000h696A99664a81119F1419P2581J40172A00160J38699d2981C5629J09002
$$ 68000 -8696 199664 -181119 61419 134000 274172 100160 238859 -42981 35629 144631
15185A44631k2140L0126o6232a58213B02629c1541j30084K9587I3838J95643p5461
$$ 144631 122491 152617 86385 -158213 202629 -31541 -161625 -132038 93838 289481 214020
15174B14020b64141D14805a5769H2916L77699a81094C05373h9646C93532A79774
$$ 214020 -264141 414805 -15769 82916 460615 -181094 305373 -89646 393532 179774
15163C44589j17021Q909a56398A95158J06515b63387D9700O4376K32986b8154
$$ 344589 227568 236477 -156398 195158 301673 -263387 49700 114076 347062 -28154
15152A93095c58119a1313A42725R5606k8815A6232i2316A02301L988K87485j77187
$$ 193095 -358119 -11313 142725 238331 209516 16232 -92316 102301 106289 393774 216587
15141B16587j4468K54752k21065h3990D09531I6003l905J55495b33505D80785
$$ 216587 202119 456871 235806 -83990 409531 96003 92098 247593 -233505 480785
15130A9063J1446J28659e5595J2884p0727A96628m7899g414B42208K217a29112
$$ 19063 30509 159168 -55595 -42711 -113438 196628 148729 -7414 242208 244425 -129112
15118D6562L18185j3440G1622N5744L64221A35676N32440j93252J28552k99097
$$ 46562 364747 351307 71622 127366 491587 135676 668116 474864 603416 304319
15108C04319M9390a3439C8618J01526a66693I3956b03122A05214L71108A81997
$$ 304319 353709 -13439 38618 140144 -166693 93956 -203122 105214 476322 181997
15097G0224K16927j07411b46169A20863L20448A18434R8372O0794j03565n914
$$ 70224 287151 179740 -246169 120863 441311 118434 216806 277600 174035 168121
15087A68121p860o6561a05371A63181J77021i9664N980I2834k4780J53016i3167
$$ 168121 160261 93700 -105371 163181 340202 -99664 -93684 92834 68054 221070 -93167
15075B35150M40550A02608a337b12I942a01960E50161b33391C50667j64506J47544
$$ 235150 675700 102608 -1337 -212 9942 -101960 550161 -233391 350667 186161 333705
15064C33705H8185N46040k07551j63142A24026b22779A39468L51429A52710K47648
$$ 333705 88185 634225 426674 263532 124026 -222779 139468 490897 152710 400358
15054D00358j68897J32256j24187K5985p9419E8651M31434B20819l8942L50551
$$ 400358 231461 363717 239530 265515 186096 58651 490085 220819 181877 532428
15044E32428k22156L5458j21829J85877D0714O24492A25344K91854K59126j34350
$$ 532428 310272 345730 223901 409778 40714 665206 125344 417198 676324 541974
15034E41974j13394H4439K62468L9615l8404j14168L12174P27295n26822o5319
$$ 541974 428580 84439 346907 386522 348118 233950 546124 1273419 746597 681278
15024F81278k53281J01800j75012J72255o6901j37886K36491M6537m1918J05263
$$ 681278 427997 529797 354785 527040 460139 322253 558744 605281 563363 668626
15014F68626B88460A27682l0848L46756j90890l5171c6207B24639J95656L03595
$$ 668626 288460 127682 96834 443590 252700 217529 -36207 224639 420295 723890
15004G23890C02404d6439i742B63448M55137k5600l06104K50500J96189D08511
$$ 723890 302404 -46439 -9742 263448 718585 692985 386881 637381 833570 408511
14993C03727J38187k02291J40845k7579L7968J2009K42733j65995k17136J79628
$$ 303727 441914 239623 380468 352889 390857 402866 645599 479604 262468 442096
14983D42096q5998L38290O8906p2641K54691M5885k53042l38372K06207j40815
$$ 442096 356098 694388 763294 690653 945344 991229 738187 399815 606022 465207
14973D65207o5601J28875J89111B22760L16856L4564r7613j15867M4508j50502
$$ 465207 399606 528481 717592 222760 539616 574180 476567 360700 405208 254706
14963B54706L3527K1036O3140j15128o3518F1497d6691B80955L3678L4637K9759
$$ 254706 288233 309269 372409 257281 193763 61497 -46691 280955 314633 349270 379029
14952C79029E2449P06670C63577n9141M23441k62021J77988Q9411K6073L18120
$$ 379029 52449 759119 363577 304436 727877 465856 643844 733255 759328 1077448
14942A077448D17743M3121q6464m8508J87549P5761L03113l5625J37845k10591
$$ 1077448 417743 460864 374400 325892 513441 589202 892315 856690 994535 783944
14932G83944J10438K55253l57329N23079K27638J36080k46404K94357k72982N8881
$$ 783944 894382 1149635 792306 1315385 1543023 1679103 1432699 1727056 1454074 1512955
14922A512955l1592K9788L36886K46208k951K15810n57301m55852k76879J11115
$$ 1512955 1481363 1511151 1848037 2094245 2091294 2307104 1749803 1293951 1017072 1128187
14912A128187k93776r3518k78186J99841B67575P9519m2695O8337N1953L89886
$$ 1128187 834411 740893 462707 662548 267575 347094 304399 372736 424689 814575
14902H14575l05725k00876L890N1812K02632r4081j91405L45820B63768R1066
$$ 814575 508850 307974 311864 363676 566308 472227 280822 626642 263768 354834
14892C54834L24183j25372K60116J35651k04391J19109L6968J18203C14200M30470
$$ 354834 679017 553645 813761 949412 745021 864130 901098 1019301 314200 744670
14882G44670K18472p3503r9820O1130L9618j58015C08240K30663M3022B61493
$$ 744670 963142 889639 789819 850949 890567 732552 308240 538903 581925 261493
14871C95998K20376r7755J56445J20816O6958k05147K5349j0580n8357k02398
$$ 395998 616374 518619 675064 795880 862838 657691 683040 672460 614103 411705
14861D11705N813n7909r4200J77134J55970J600k21697Q7075o8386M07863j38530
$$ 411705 417518 359609 265409 442543 598513 600113 378416 465491 397105 804968 666438
14850F66438K78599l00932j454J04540m4319Q4098J37614M31719j67335K3770
$$ 666438 945037 644105 642651 747191 702872 786970 924584 1356303 1188968 1212738
14840A212738J17471L03957l56871k78033k80985k12166J69608J01584C01294
$$ 1212738 1330209 1634166 1277295 999262 718277 506111 675719 777303 301294
14830E93851j34175Q5167j78656j39521J81632J76303j30763l1761R7343L54687
$$ 593851 459676 544843 366187 226666 408298 584601 453838 422077 519420 874107
14820H74107C81046J14196L31322j93418B92800J90765J60740j52178k41873M16644
$$ 874107 381046 495242 826564 633146 292800 483565 644305 492127 250254 666898
14810F66898o9175J65240j89995K27435J5934K46032k84721L26248D92299J87442
$$ 666898 597723 762963 572968 800403 816337 1062369 777648 1103896 492299 679741
14800F79741j29806J72748l01523M09758C46718J69233J3519M0221L56891j53392
$$ 679741 549935 722683 421160 830918 346718 515951 529470 569691 926582 773190
14790G73190m2595j22625J5826j01285K16114k8039n1713o8370L37935m16143
$$ 773190 730595 607970 623796 522511 738625 710586 658873 590503 928438 512295
14780E12295R6326K0352J80386C79581J18601N65214m32945Q8626Q1984j25734
$$ 512295 608621 628973 809359 379581 498182 1063396 630451 719077 801061 675327
14770F75327J49106j90616j5740k53496M54816j33774o055k1424Q1610j59157
$$ 675327 824433 633817 618077 364581 819397 685623 679568 658144 739754 580597
14760E80597J57568l02423J91679J37255k51744R7649J03582k94115K25829B67225
$$ 580597 738165 435742 627421 764676 512932 610581 714163 420048 645877 267225
14749F21939K04485j52619J94452j71078R5237J72451l31707l6593j47883K14617
$$ 621939 826424 673805 868257 697179 792416 964867 633160 596567 448684 663301
14739F63301j36332Q9982k1584M95708k28721J91192p7577p987k55598J51717
$$ 663301 526969 616951 595367 1091075 862354 1053546 975969 967982 712384 864101
14729H64101L85595L26227l5688j18424R4912k11406M63722L9435p96002j34571
$$ 864101 1249696 1575923 1540235 1421811 1516723 1305317 1769039 1808474 1012472 877901
14719H77901K05726m42168L52961j47660K8207o2588J25740j28250o8702M3165
$$ 877901 1083627 641459 994420 846760 874967 812379 938119 809869 741167 784332
14709G84332o0186L52950o9632J8060J33430J2042N851J36356M96713K92267l78988
$$ 784332 724146 1077096 1007464 1025524 1158954 1170996 1176847 1313203 1809916 2102183 1723195
14698A723195k40753J41177m29899j11460J32850n5602k54566k22759R9382J58933
$$ 1723195 1482442 1623619 1193720 1082260 1215110 1159508 904942 682183 781565 940498
14688I40498J36466j46641J2419k61023J14584J85727l7900J679l736N7418r9147
$$ 940498 1076964 930323 942742 681719 796303 982030 944130 945809 942073 999491 900344
14677I00344L46695m54018J7880j66724J82179j48268M08208k46985J61392j11173
$$ 900344 1247039 793021 810901 644177 826356 678088 1086296 839311 1000703 889530
14667H89530J05193k79770M67251l22894L77099K2611k07641O8810k00881M06071
$$ 889530 994723 714953 1182204 859310 1236409 1259020 1051379 1120189 919308 1325379
14657A325379k89702K32714m47681J30861M77807k92641J90758k29999J05655
$$ 1325379 1035677 1268391 820710 951571 1429378 1136737 1327495 1097496 1203151
14648A203151J56942r7580r089j9148J6278k3167k86015L84985o775l16300k25080
$$ 1203151 1360093 1262513 1253424 1234276 1250554 1227387 941372 1326357 1319582 1003282 778202
14637G78202J68677J7046j03463K22026J55567q8631L80218j56897m36788K61610
$$ 778202 946879 963925 860462 1082488 1238055 1149424 1529642 1372745 935957 1197567
14627A197567n8613k7485K67396q3197l5316L0634j40936Q5207n9680N41356k63802
$$ 1197567 1138954 1111469 1378865 1295668 1260352 1290986 1150050 1235257 1175577 1716933 1453131
14616A453131J41728j12298k26027K07433j0433l8362M2020j06303L10653k18922
$$ 1453131 1594859 1482561 1256534 1463967 1453534 1415172 1457192 1350889 1661542 1442620
14606A442620K74971n2861k37151L48801k30062q9616L9625J71488k17954j12991
$$ 1442620 1717591 1664730 1427579 1776380 1546318 1456702 1496327 1667815 1449861 1336870
14596A336870R6052J72053J43719l74746O53701k64644n7938M7572k47646J48729
$$ 1336870 1432922 1604975 1748694 1373948 2027649 1763005 1705067 1752639 1504993 1653722
14586A653722M5260K09734j3687j94412L70542k24715k16984K41671r2276J00289
$$ 1653722 1698982 1908716 1895029 1700617 2071159 1846444 1629460 1871131 1778855 1879144
14576A879144L03012r9859L11067m62641J62998r7892J37693q2045L97501L3595
$$ 1879144 2182156 2082297 2393364 1930723 2093721 1995829 2133522 2051477 2448978 2482573
14566B482573n06545k6114M87389J20075r0640K49843r3397J47065Q3276K81865
$$ 2482573 1976028 1949914 2437303 2557378 2466738 2716581 2623184 2770249 2853525 3135390
14556C135390q5505K96426L42432M17939K3246O45876J478979K078364M092604
$$ 3135390 3049885 3346311 3688743 4106682 4129928 4775804 6254783 8333147 12425751
14547A2425751P555619J5471476K734646A8840084H028584l625346q50796K05570
$$ 12425751 19981370 35452846 38187492 18840084 8028584 4403238 3552442 3758012
14539C758012J042095P88582k211548p62256q73157J54221J75964r1401o228K72468
$$ 3758012 4800107 5588689 3377141 2614885 1741728 1895949 2071913 1980512 1974284 2246752
14529B246752Q5879J34650j04890j38047L6407K82865j73323Q4770K97263q01812
$$ 2246752 2332631 2467281 2362391 2224344 2260751 2543616 2370293 2455063 2752326 1950514
14519A950514K41403L8378L55251Q2411J9952q7286l6306J8231K81888k83832
$$ 1950514 2191917 2230295 2585546 2667957 2687909 2600623 2564317 2582548 2864436 2580604
14509B580604K27682k1089k2365J51572l27896M74130j20520K10627O3622j40910
$$ 2580604 2808286 2787197 2764832 2916404 2588508 3062638 2942118 3152745 3216367 3075457
14499C075457k01852Q07522l59188k1972N853L33165j32341q1796P7140o101N7684
$$ 3075457 2873605 3681127 3321939 3299967 3305820 3638985 3506644 3424848 3501988 3495887 3553571
14488C553571k98767K95624n87625O53285M6294j09641J08995K00431k66948M23591
$$ 3553571 3254804 3550428 2962803 3616088 3662382 3552741 3661736 3862167 3595219 4018810
14478D018810j71646J9525Q1574j67451J41722K83886l8107R6792o1971L76708
$$ 4018810 3847164 3866689 3948263 3780812 3922534 4206420 4168313 4265105 4203134 4579842
14468D579842l8932k5092J65239K6505K4124o8981L61263k34021N3641j85618
$$ 4579842 4540910 4515818 4681057 4707562 4731686 4662705 5023968 4789947 4843588 4657970
14458D657970K11821K45700Q5409j36739K97366O4676m19704K71658k07705M79808
$$ 4657970 4869791 5115491 5200900 5064161 5361527 5426203 5006499 5278157 5070452 5550260
14448E550260M02295J62655o69945L35518L12695m96436L85087J38755l16702
$$ 5550260 5952555 6115210 5445265 5780783 6093478 5597042 5982129 6120884 5804182
14439E804182L20161J26978J98287n6036J65726R0683P2607J68777n2432J76768
$$ 5804182 6124343 6251321 6449608 6393572 6559298 6649981 6722588 6891365 6838933 7015701
14429G015701m9192L87508O9093M48708l23137M13337o1224O2320L6558J79752
$$ 7015701 6966509 7354017 7423110 7871818 7548681 7962018 7900794 7963114 7999672 8179424
14419H179424J33713J65856k61833L95148l718J38683M8345L09765K65947j83307
$$ 8179424 8313137 8478993 8217160 8612308 8608590 8747273 8795618 9105383 9371330 9188023
14409I188023O9788L74801K43363N3119o4432k09209O31200o1552J84310M4235
$$ 9188023 9257811 9632612 9875975 9929094 9864662 9655453 10286653 10225101 10409411 10453646
14399A0453646K44738q2280O81523l88424L87571J14995P33695n0518j03150P78417
$$ 10453646 10698384 10616104 11297627 10909203 11296774 11411769 12145464 12094946 11991796 12770213
14389A2770213l06425M83286l87714R52755K43721K94938J01594N41704l03228
$$ 12770213 12463788 12947074 12559360 13512115 13755836 14050774 14152368 14694072 14390844
14380A4390844M44313L60766L9031J47091M10446j6788O89007K30734M52468M26899
$$ 14390844 14835157 15195923 15234954 15382045 15792491 15775703 16464710 16695444 17147912 17574811
14370A7574811M54568O00993K18147j4804M97602N83382N261P83542j26045N74834
$$ 17574811 18029379 18630372 18848519 18833715 19331317 19914699 19919960 20703502 20577457 21152291
14360B1152291M09855L75837P39855J18572J019678O49313K74278N67039O95134
$$ 21152291 21562146 21937983 22677838 22796410 23816088 24465401 24739679 25306718 26001852
14351B6001852M62862P55264R27310L22270O68132P28253Q63515Q70212O14735
$$ 26001852 26464714 27219978 28147288 28469558 29137690 29865943 30729458 31599670 32214405
14342C2214405R66605J105158Q12770J151172N50069J417072J217934P24442J546523
$$ 32214405 33181010 34286168 35098938 36250110 36800179 38217251 39435185 40159627 41706150
14333D1706150J054548J390501J537476J270444J249917J878475J383778K032500
$$ 41706150 42760698 44151199 45688675 46959119 48209036 50087511 51471289 53503789
14325E3503789J418131J832559J715338K087989K076629K147287K189972K196440
$$ 53503789 54921920 56754479 58469817 60557806 62634435 64781722 66971694 69168134
14317F9168134K732330K490929K923471K862991L274239L261522L531239L268305
$$ 69168134 71900464 74391393 77314864 80177855 83452094 86713616 90244855 93513160
14309I3513160M212060L910433M367222M435542M700051M970260N573683N807974
$$ 93513160 97725220 101635653 106002875 110438417 115138468 120108728 125682411 131490385
14301A31490385O061231O399724O883420O942057P456229Q043958Q255157R004644
$$ 131490385 137551616 143951340 150834760 157776817 165233046 173277004 181532161 190536805
14293A90536805Q656536R752436J0182060J0422945J1225095J1521162J2201435
$$ 190536805 199193341 208945777 219127837 229550782 240775877 252297039 264498474
14286B64498474J2197003J2889440J3425738J3822753J3461985J3943118J4019925
$$ 264498474 276695477 289584917 303010655 316833408 330295393 344238511 358258436
14279C58258436J3341684J3244443J2599783J1492712J0574998Q975326N923736
$$ 358258436 371600120 384844563 397444346 408937058 419512056 428487382 434411118
14272D34411118K763329J885257J607764M99993j193591j937142n110130p576193
$$ 434411118 437174447 439059704 440667468 441167461 439973870 438036728 432926598 425350405
14264D25350405r889204j1385959j2531663j3633474j3752986j4522439j4688911
$$ 425350405 415461201 404075242 391543579 377910105 364157119 349634680 334945769
14257C34945769j4895520j4337385j4311945j4122805j3450759j2946999j2478405
$$ 334945769 320050249 305712864 291400919 277278114 263827355 250880356 238401951
14250B38401951j2019696j0051465r521802j0182291r896309q874962q139516
$$ 238401951 226382255 216330790 206808988 196626697 186730388 177855426 169715910
14243A69715910q064349p728808p297382p002578o173356n515922n685888n035263
$$ 169715910 161651561 153922753 146625371 139622793 133449437 127933515 122247627 117212364
14235A17212364n086030m829148m561110m074314l927395l288368l900343l729826
$$ 117212364 112126334 107297186 102736076 98661762 94734367 91445999 87545656 83815830
14227H3815830k975081k877823l327554k553163k741951k088929k331089k488864
$$ 83815830 80840749 77962926 74635372 72082209 69340258 67251329 64920240 62431376
14219F2431376j774495k145201k081229j724131j733685j232726j721294j527183
$$ 62431376 60656881 58511680 56430451 54706320 52972635 51739909 50018615 48491432
14211D8491432j700904j132465j605275j236830r16278r82041j550120j207174
$$ 48491432 46790528 45658063 44052788 42815958 41899680 40917639 39367519 38160345
14203C8160345o63010j173407r19022r77270p83746j250535p78561n82453o51814
$$ 38160345 37497335 36323928 35404906 34427636 33643890 32393355 31614794 31032341 30380527
14194C0380527r36207n89225q58734p49133o07008n03776n85029o89016n37930
$$ 30380527 29444320 28855095 27996361 27247228 26640220 26136444 25551415 24862399 24324469
14185B4324469n36128m80976m54924m35323q18088l92208l70387l45828l70464
$$ 24324469 23788341 23307365 22852441 22417118 21599030 21206822 20836435 20490607 20120143
14176B0120143m25912p13292k4045m83439r01766M2035j25489o26068k91363j3179
$$ 20120143 19694231 18980939 18956894 18473455 17571689 17613724 17488235 16862167 16570804 16557625
14166A6557625m80289k85991l90202o5722j99287l69328q6476k97552l18874k77281
$$ 16557625 16077336 15791345 15401143 15335421 15136134 14766806 14680330 14382778 14063904 13786623
14156A3786623l55028k37864k85277q7220m4698m55478m30336n2028K62651n70347
$$ 13786623 13431595 13193731 12908454 12821234 12776536 12321058 11890722 11838694 12101345 11530998
14146A1530998j13339j99309j43507p4003j2406l40973l93490J89494k08100l85041
$$ 11530998 11417659 11218350 11074843 11000840 10988434 10647461 10253971 10443465 10235365 9850324
14136I850324m33428J64763J19461k51859m15687j60356P2194j59493k28467Q387
$$ 9850324 9416896 9581659 9701120 9449261 9033574 8873218 8945412 8785919 8557452 8565839
14126H565839K2918k50126O7890k77866l26169j38559J4103k43901K88890q9509
$$ 8565839 8588757 8338631 8406521 8128655 7802486 7663927 7678030 7434129 7723019 7633510
14116G633510j60812k86626k48251K03758l44389P8703k15534L53614m12637J32418
$$ 7633510 7472698 7186072 6937821 7141579 6797190 6875893 6660359 7013973 6601336 6733754
14106F733754j7072l44662r0528p9328j79173K48520k37568j92297j22326K41784
$$ 6733754 6716682 6372020 6281492 6202164 6022991 6271511 6033943 5841646 5719320 5961104
14096E961104j73222j26629J09743k39454k6996k82927K99558k91473j19713N6649
$$ 5961104 5787882 5661253 5770996 5531542 5504546 5221619 5521177 5229704 5109991 5166640
14086E166640l84883R9065K07132j68646J00480O428j96269m34220L85458l3367
$$ 5166640 4781757 4880822 5087954 4919308 5019788 5026216 4829947 4395727 4781185 4747818
14076D747818o1869k56956K31341j49604P8627p2330j8046k42796P0168O9836
$$ 4747818 4685949 4428993 4660334 4510730 4589357 4517027 4498981 4256185 4326353 4396189
14066D396189k67068K25342l53169J14909j69657j80554K12672k6872K93929n49632
$$ 4396189 4129121 4354463 4001294 4116203 3946546 3765992 3978664 3951792 4245721 3696089
14056C696089L66418n39909M33758n29631K37585j74473K38664p3031j52079k2418
$$ 3696089 4062507 3522598 3956356 3426725 3664310 3489837 3728501 3655470 3503391 3480973
14046C480973k6729j2407K825n5149j32770p4424J85442J27781j61119j77651
$$ 3480973 3454244 3441837 3444662 3389513 3256743 3182319 3367761 3495542 3334423 3156772
14036C156772k34366n4062L33713n727r9642O7398K23873J5449n35887K40868
$$ 3156772 2922406 2868344 3202057 3196330 3096688 3164086 3387959 3403408 2867521 3108389
14026C108389k49159q5188j39233K33198J1578j34138R9884l85160J23104k29256
$$ 3108389 2859230 2774042 2634809 2868007 2879585 2745447 2845331 2460171 2583275 2354019
14016B354019J44118m7960j15l7068L43369p3340n63378L76651o4277J14297k57604
$$ 2354019 2498137 2450177 2450062 2412994 2756363 2683023 2119645 2496296 2432019 2546316 2288712
14005B288712j73740l2435N16197j74096l1531m18871O48509l52219j17801K3889
$$ 2288712 2114972 2082537 2598734 2424638 2393107 1974236 2622745 2270526 2152725 2176614
13995B176614K43828m1680n2123K30923j865O67324J005863L124628N508524J2938917
$$ 2176614 2420442 2378762 2326639 2557562 2555697 3223021 4228884 7353512 12862036 25800953
13985B5800953J5150221j2889316j2964627o393133k704653r44871r67409r3861
$$ 25800953 40951174 28061858 15097231 8704098 5999445 5054574 4087165 3993304
13977C993304m05089l03174m04154O5329m2477l87m09306l00544L43557N16k45708
$$ 3993304 3588215 3285041 2880887 2946216 2903739 2903352 2494046 2193502 2537059 2537575 2291867
13966B291867R6122K6418o467N0498j75721Q2303l64903J61900m8709R234l04197
$$ 2291867 2387989 2414407 2407940 2458438 2282717 2365020 2000117 2162017 2113308 2122542 1818345
13955A818345J41284K65209n049l11834N288K47581m56578M37252l19014L6303
$$ 1818345 1959629 2224838 2219789 1907955 1913243 2160824 1704246 2141498 1822484 1858787
13945A858787P979P4632j41410l7492j12765K40968k20998K25212j12603K3696
$$ 1858787 1866766 1941398 1799988 1762496 1649731 1890699 1669701 1894913 1782310 1806006
13935A806006l02422K42161k77330J35305M8008p1915l0771J55063m6991P2825
$$ 1806006 1503584 1745745 1468415 1603720 1651728 1579813 1549042 1704105 1657114 1729939
13925A729939j20218R2632k55219j07996O5760N00851n48924K11087m005J5590
$$ 1729939 1609721 1702353 1447134 1339138 1404898 1905749 1356825 1567912 1563907 1579497
13915A579497k94902M0866J1289K70545k56246J92733j72749K66674o418k11976
$$ 1579497 1284595 1325461 1336750 1607295 1351049 1543782 1371033 1637707 1631289 1419313
13905A419313p6046K52418j33556Q1861j67134K86863j70037j33627j69204R700
$$ 1419313 1343267 1595685 1462129 1543990 1376856 1663719 1493682 1360055 1190851 1200551
13895A200551K70336j14995K22684m5375o1896p8101M5130j6431k55432J44678
$$ 1200551 1470887 1355892 1578576 1533201 1471305 1393204 1438334 1421903 1166471 1311149
13885A311149n2969n5014j25726K95000j13118K28518k3717j16438k42929J04159
$$ 1311149 1258180 1203166 1077440 1372440 1259322 1487840 1464123 1347685 1104756 1208915
13875A208915M0624j30448m0236r2385R0028J128k05606M76900k18337l5134K56944
$$ 1208915 1249539 1119091 1078855 986470 1076498 1077626 872020 1348920 1130583 1095449 1352393
13864A352393j33854l0919k80047L44288j20331j5588r0515j44441K42048k22071
$$ 1352393 1218539 1187620 907573 1251861 1131530 1115942 1025427 880986 1123034 900963
13854I00963J06014j26497J59444j64395L474J81953K92846m23690K01384k18808
$$ 900963 1006977 880480 1039924 875529 879003 1060956 1353802 930112 1131496 912688
13844I12688L2950O8806L581J52312q1391j80814j69955Q8329j679J57101l65762
$$ 912688 945638 1014444 1018025 1170337 1088946 908132 738177 826506 824827 981928 616166
13833F16166K13838K98200l15709K95848q7763k81256q5739L51916O5780r9243
$$ 616166 830004 1128204 812495 1108343 1020580 739324 653585 1005501 1071281 972038
13823I72038q5067L39918m48902m7182R5244K73212k01782j21203R4469l58161
$$ 972038 886971 1226889 777987 730805 826049 1099261 897479 776276 870745 512584
13813E12584N86133l10428J21731j41261K03021k21748J49206k89302M35898r4075
$$ 512584 1098717 788289 910020 768759 971780 750032 899238 609936 1045834 951759
13803I51759J54272l32262L32003m82983R8319M7705K1338l4195o8685J03818
$$ 951759 1106031 773769 1105772 622789 721108 768813 790151 755956 687271 791089
13793G91089N1073k36185J72062O2676J22968k77817Q7806j98325M54413k50283
$$ 791089 842162 605977 778039 840715 963683 685866 773672 575347 1029760 779477
13783G79477j45198P7019l7968q5508K04172j02148K90122K59861m16912j74958
$$ 779477 634279 711298 673330 587822 791994 689846 979968 1239829 822917 647959
13773F47959j14144K93881k00957K27372C93806K56240j42678J3379J8130M50764
$$ 647959 533815 827696 626739 854111 393806 650046 507368 520747 538877 989641
13763I89641l29364j44773J72465O5290k86235K33988m2340j40536K4751J36446
$$ 989641 660277 515504 687969 753259 467024 701012 658672 518136 542887 679333
13753F79333j76078K51021k6606k05389L26892k23441l14K0719R8981J00080k30163
$$ 679333 503255 754276 727670 522281 849173 625732 625418 646137 745118 845198 615035
13742F15035P1671q4139m1554o762O4341K81766o8202k27332j10918K84197l54055
$$ 615035 686706 602567 561013 554251 618592 900358 832156 604824 493906 778103 424048
13731D24048K70356k41662J11653O5188B31132K95948J6396o5174j0913L22904
$$ 424048 694404 452742 564395 629583 231132 527080 543476 478302 467389 790293
13721G90293C43703M58146l74377J84997K680J11709Q6055C65694K99167j38710
$$ 790293 343703 801849 427472 612469 615149 726858 812913 365694 664861 526151
13711E26151K75639l53846J34331j88866M06437j1128C43131K42097j99723M00626
$$ 526151 801790 447944 582275 393409 799846 788718 343131 585228 385505 786131
13701G86131k72493L57006C85341N19324C05383O8221A81427J47152K24051m9717
$$ 786131 513638 870644 385341 904665 305383 373604 181427 328579 552630 502913
13691E02913l174K50688l73727K25979J64297B38295L44606k61712K49243r4224
$$ 502913 499739 750427 376700 602679 766976 238295 582901 321189 570432 476208
13681D76208K32300k70864j6211N28372C16995K69703k90633J31454M51877C75980
$$ 476208 708508 437644 421433 949805 316995 586698 296065 427519 879396 375980
13670G37774k12560K44892k66282K06183l42742M47176r3609k78584J35448L063
$$ 737774 525214 770106 503824 710007 367265 814441 720832 442248 577696 580759
13660E80759P7859l11258j10249J66877P614J01468K47443A15527L43686L0454
$$ 580759 658618 347360 237111 403988 411602 513070 760513 115527 459213 489667
13650D89667j50288K40926j96413A1770M33594J06015B46703M83082K0999C63695
$$ 489667 339379 580305 383892 11770 445364 551379 246703 729785 750784 363695
13639C20436r2349K55299E3858L92267p518G6128K24547L2466K4082J15360j50057
$$ 320436 228087 483386 53858 446125 438607 76128 300675 333141 357223 472583 322526
13628C22526J5663L73482B97196J42084R6965j98030J25465K35199A64412L06867
$$ 322526 338189 711671 297196 439280 536245 338215 463680 698879 164412 471279
13618D71279m0349n5061j32732L19826k65813N1853K65443j98453n9050q7132
$$ 471279 430930 375869 243137 562963 297150 349003 614446 415993 356943 269811
13608B69811j00271J49814J99219a67400C02450J70615J8527j78226A05544J19340
$$ 269811 169540 319354 518573 -167400 302450 473065 491592 313366 105544 224884
13598B24884M97232B28306J04483J36450p9744j85974L67070A70805M12816k90053
$$ 224884 722116 228306 332789 469239 389495 203521 570591 170805 583621 293568
13588B93568J04079k9367L15184j59157A46848K81152j45056J10003A66761e44
$$ 293568 397647 368280 683464 524307 146848 428000 282944 392947 166761 -544
13577A54627M1268k2519P7199k3787J77697J30289k12074o7299l6916K0240J80965
$$ 154627 195895 173376 250575 226788 404485 534774 322700 255401 218485 238725 419690
13566D19690p2325J85579J71q4139j05958r3225R2105P9970j85365K67585O2247
$$ 419690 347365 532944 533115 448976 343018 249793 341898 421868 236503 504088 566335
13555E66335G8263K01945r0609D6129K68580K41264n5857k27983J31475I4519
$$ 566335 78263 280208 189599 46129 314709 555973 500116 272133 403608 94519
13544A45233K98480B17186R787A06496P7527G3909g3626D32549B7736P0950Q0069
$$ 145233 443713 217186 226973 106496 184023 73909 -73626 432549 27736 98686 178755
13533A78755J59896e1367B26058R0639H6091K83746j12740O5704K1018e1087Q237
$$ 178755 338651 -51367 226058 316697 86091 369837 257097 322801 343819 -51087 -42850
13522d2850E09576B01627J04267J40667j80628j2735A08790k49J92710c02596
$$ -42850 509576 201627 305894 446561 265933 253198 108790 108541 301251 -302596
13511C85254o9120n9732J32985k4503j25287J11488j02528D3185K34505j20097
$$ 385254 316134 256402 389387 364884 239597 351085 248557 43185 277690 157593
13501A57593J79813l0203J70180H9263L12307j50356c0350A87071J92958j16310
$$ 157593 337406 307203 477383 89263 401570 251214 -30350 187071 380029 263719
13491B63719K5641K18046k11191K8469M054M9337j78161K33449O34A53457j5622
$$ 263719 289360 507406 296215 324684 328738 378075 199914 433363 433997 153457 137835
13480A37835J56841A12879a809l322B90637J51831A46146K41400l931A60826J868
$$ 137835 294676 112879 -1809 -5131 290637 442468 146146 387546 383615 160826 162694
13469A62694J09069l7950E7141e9504B23190L421K4704j02281G1432P4438K12073
$$ 162694 271763 233813 57141 -59504 223190 226611 251315 149034 71432 145870 357943
13458C57943j68474K05936j3005j04025K11217j08485a03876B10210J60346G3453
$$ 357943 189469 395405 382400 278375 489592 381107 -103876 210210 370556 73453
13447A28548J21002A08304e1556B53351o7355R7005J45753F1848L82192o9270
$$ 128548 249550 108304 -51556 253351 185996 283001 428754 61848 444040 374770
13437C74770r7904r1069M6700L049K81599L6434G6802K92980M5339L4635E7908
$$ 374770 276866 185797 232497 235546 517145 553579 76802 369782 415121 449756 57908
13425a90211C52410L2496G4529L4934d7579B98439m6352j14149O4821J33351j7176
$$ -190211 352410 384906 74529 109463 -47579 298439 252087 137938 202759 336110 318934
13414C18934j33298E0626J39313M521n5509K26304H331a09442c6556q3458G010
$$ 318934 185636 50626 189939 194460 138951 365255 8331 -109442 -36556 -120014 7010
13402G2158a60908C39159A53655L13478r8874A06333D0162N4264L93030H4982
$$ 72158 -160908 339159 153655 467133 368259 106333 40162 94426 487456 84982
13391B33830c6150A94075j2522n5120Q4630J27663A12686K37216A9467K30283
$$ 233830 -36150 194075 181553 126433 211063 338726 112686 349902 19467 249750
13381B49750J00862j0798I2648c02820A0956L80192b3430G6184b632B09727K73394
$$ 249750 350612 339814 92648 -302820 10956 391148 -23430 76184 -2632 209727 483121
13370D83121j87534j8817I0874K60965A57678J0565J50703j38105M98144l03447
$$ 483121 295587 276770 90874 351839 157678 168243 318946 180841 678985 375538
13360C75538B782L17712A39943J87995A34903k5712P9367K58875O1688j93931
$$ 375538 2782 320494 139943 327938 134903 109191 188558 447433 509121 315190
13350C15190a41515c4111A8567J51078h3482J6788G8229J40423b08523A81217
$$ 315190 -141515 -34111 18567 169645 -83482 -66694 78229 218652 -208523 181217
13339B26096K21393B04592C9038J38455J37032p9138J17103M3926D594J30740
$$ 226096 447489 204592 39038 177493 314525 235387 352490 396416 4594 135334
13329A35334F1361J58359L7859b01826A77735G788M39446A14244C5647c2900C32888
$$ 135334 61361 219720 257579 -201826 177735 7788 447234 114244 35647 -32900 332888
13317g2647B54106K36650A79931m3914O3730M1290l1658d1836H1666J51988G6452
$$ -72647 254106 490756 179931 136017 199747 241037 209379 -41836 81666 233654 76452
13305B91513a23402B32509m2046J4344k789r4969M37413A50499f3155B40144B4072
$$ 291513 -123402 232509 190463 204807 202018 107049 544462 150499 -63155 240144 24072
13293A73538M2711J09596k631J09238k11119F4941M2828a56485H5867a54595M5207
$$ 173538 216249 325845 323214 432452 221333 64941 107769 -156485 85867 -154595 -109388
13282a09388B38821J91086B00287a3366A08643A7629J29534a86077A96265n1067
$$ -109388 238821 429907 200287 -13366 108643 17629 147163 -186077 196265 145198
13272A45198j7092J003d9120n0275A29516N9314c11130F5974c7151C54295F9827
$$ 145198 128106 129109 -49120 -99395 129516 188830 -311130 65974 -37151 354295 69827
13260F1188M29258H3752M41617B59180I6309K8135e7322B90165g1988F823L13408
$$ 61188 490446 83752 525369 259180 96309 124444 -57322 290165 -71988 6823 320231
13249C20231A21208J13319p9218c4387k05741j6072H4213q435B3005a67514G204
$$ 320231 121208 234527 155309 -34387 -240128 -256200 84213 75778 23005 -167514 7204
13237b05683c1942B66147A7323K3851K02591C3241J97167E6931R1585a28298A90365
$$ -205683 -31942 266147 17323 41174 243765 33241 230408 56931 148516 -128298 190365
13225A78624L43556A61769C1798a8516C67457j75856j8495D460O2544h4072j3949
$$ 178624 522180 161769 31798 -18516 367457 191601 173106 4460 67004 -84072 -98021
13214i8021A99310m9664b02201C6300J57064O733d071j63114H1811J05146k6091
$$ -98021 199310 149646 -202201 36300 193364 200097 -4071 -167185 81811 186957 160866
13203A60866J3177f2265B3706J55625B9701Q9780c9779C11140a5494A79884D586
$$ 160866 174043 -62265 23706 179331 29701 119481 -39779 311140 -15494 179884 4586
13191e2529A61421a34691m8916D396M9609P2803h6591B77316j31008a13782A6350
$$ -52529 161421 -134691 -183607 4396 54005 126808 -86591 277316 146308 -113782 16350
13179A8211E617J83136m3327j9603K2967b44704C8721q721L46308A64370l4038
$$ 18211 5617 188753 145426 125823 148790 -244704 38721 30000 376308 164370 130332
13168A30332l0435b81533L5992a1187B77097a91551B82508b32627I4259b27435
$$ 130332 99897 -281533 -245541 -11187 277097 -191551 282508 -232627 94259 -227435
13157d7660k45644f165B55745J2042G1354K98303A25108b06513E30456B23P9533
$$ -47660 -293304 -6165 255745 267787 71354 369657 125108 -206513 530456 223 79756
13146G9756C8342K76614q2086q5041A5979K90779A41454d1602A45330M5540b6267
$$ 79756 38342 314956 232870 147829 15979 306758 141454 -41602 145330 190870 -26267
13134G4455C6933K43972j09268F4381J22631d478A30315K3526L73887A97100q8789
$$ 74455 36933 280905 171637 64381 187012 -4478 130315 153841 527728 197100 108311
13123A08311N8415p7003J03158a2994k92473G1321a61968J4134n8295C30029A06521
$$ 108311 166726 89723 192881 -12994 -305467 71321 -161968 -147834 -206129 330029 106521
13111I9320k2396A0203J504M8794b07447A62550m729J78274o0460A11368H807
$$ 99320 76924 10203 11707 60501 -207447 162550 157821 336095 275635 111368 8807
13099I1619N2782l0937i3921A23462a05270A3613b45554D346a13070C26716r9113
$$ 91619 144401 113464 -93921 123462 -105270 13613 -245554 4346 -113070 326716 227603
13088B27603m8479J28730F6342p573B2333K26798a637B93919A42090m9891h762
$$ 227603 179124 307854 66342 58769 22333 249131 -1637 293919 142090 92199 -8762
13076A76595a43184R989A04089d4287A88911a3048B71863b66178a2964j91889
$$ 176595 -143184 -133195 104089 -44287 188911 -13048 271863 -266178 -12964 -204853
13066b04853G2535J22926B6174c00813J06954A50561o6432J42774P8300E2365
$$ -204853 72535 195461 26174 -300813 -193859 150561 84129 226903 305203 52365
13055A32527C4265L16785a95597J8690C46536A29920h1957B37214j0358G4735
$$ 132527 34265 351050 -195597 -176907 346536 129920 -81957 237214 226856 74735
13044E73982D7086L02548M9075I0071d246H6236C9964J07617F3277J03104E853
$$ 573982 47086 349634 398709 90071 -4246 86236 39964 147581 63277 166381 5853
13032A56873c31142A56744o4970c5978D1479a03746A92865m3861g6008C14536
$$ 156873 -331142 156744 91774 -35978 41479 -103746 192865 149004 -76008 314536
13021A08621f5135A02723K87579F8915N2141a05641A90909A7123K07998q6566
$$ 108621 -65135 102723 390302 68915 121056 -105641 190909 17123 225121 138555
13011A38555m1163C5773J58954H2538b74866C17515c7287D7733d9203A42109r465
$$ 138555 97392 35773 194727 82538 -274866 317515 -37287 47733 -49203 142109 132644
13000A32644j8786c52430A56438p922C5687J44743B3069J07706m6947a09072A63083
$$ 132644 113858 -352430 156438 148516 35687 180430 23069 130775 83828 -109072 163083
12988A29300c02849A2797d8965A81008p5386K53887A14461B1616J58494l8903
$$ 129300 -302849 12797 -48965 181008 105622 359509 114461 21616 180110 141207
12978A41207d54j86967O5298k23276C91149e0105D4934J59644F299d1500D7633
$$ 141207 -454 -187421 -122123 -345399 391149 -50105 44934 204578 6299 -41500 47633
12966a36370A09771L0929K6642J45436j54877q806a67175C02685B7947c18774
$$ -136370 109771 140700 167342 312778 157901 149095 -167175 302685 27947 -318774
12955b07911K1166D18567c7861r3531e5458m2727j10698j8154C07910J28326B03935
$$ -207911 -186745 418567 -37861 -131392 -55458 -98185 -208883 -227037 307910 436236 203935
12943a96300A11562J62451F7404c0404B14953a73487j5876B40114f6407B21924
$$ -196300 111562 274013 67404 -30404 214953 -173487 -189363 240114 -66407 221924
12932A36782h7792C24251a53805M6190B56626f9801k39151j03120c1855j9971
$$ 136782 -87792 324251 -153805 -107615 256626 -69801 -308952 -412072 -31855 -51826
12922e1826A54545N6410I920f5709B60578p6466M913C0563J7552Q2453a23257
$$ -51826 154545 210955 9920 -65709 260578 184112 189025 30563 48115 130568 -123257
12910I2591P8312C6770g5887B786b41368R7736E8456P0534G543a0198A94005q9675
$$ 92591 170903 36770 -75887 2786 -241368 -143632 58456 128990 7543 -10198 194005 104330
12898A04330e4349j0535E4527a86601n7155b1721j96682A14914i4825l3467a010
$$ 104330 -54349 -64884 54527 -186601 -243756 -21721 -218403 114914 -94825 -128292 -1010
12886a49337B94283c84012g1876l6621A46736h1275C8826e9039J4736k9055j66809
$$ -149337 294283 -384012 -71876 -108497 146736 -81275 38826 -59039 -44303 -73358 -240167
12875b40167J16330A5297K47043F1285P4018m1126a2100G8792c5272o330r8689
$$ -240167 -123837 15297 262340 61285 135303 94177 -12100 78792 -35272 -41602 -140291
12864a40291F3533i5755c1143j90976a5412A85498a03869K2181A58343n7991P7290
$$ -140291 63533 -95755 -31143 -222119 -15412 185498 -103869 -81688 158343 100352 177642
12853A77642p2099g5682j03055Q5957I2419m5219P6415R6727j509H9535f8059
$$ 177642 105543 -75682 -178737 -92780 92419 47200 123615 220342 218833 89535 -68059
12841g702j2260d297j4618c841j00199G4994a35448F9880K21887D3654a55082
$$ -7702 -19962 -4297 -18915 -3841 -104040 74994 -135448 69880 291767 43654 -155082
12829I850J68454n0759B0952a3441A98476a0682A22868d5282H661b37057J18524
$$ 9850 178304 127545 20952 -13441 198476 -10682 122868 -45282 8661 -237057 -118533
12818a18533F1665b86231c127B5604J37885k5448g5012l1085G0241b1804F3673
$$ -118533 61665 -286231 -3127 25604 163489 138041 -75012 -106097 70241 -21804 63673
12806a51617f5416k212E3797a55452A05127M7581b69510H9180M9189o8008J78494
$$ -151617 -65416 -67628 53797 -155452 105127 152708 -269510 89180 138369 70361 248855
12795B48855p0414a63031A2172l268c02067f5269C9387b24592b3957j12276a6494
$$ 248855 178441 -163031 12172 8904 -302067 -65269 39387 -224592 -23957 -136233 -16494
12783b11941B47185b72411J0805J13999e6467n9629I0899A1461L14192a37411
$$ -211941 247185 -272411 -261606 -147607 -56467 -116096 90899 11461 325653 -137411
12772f2481A7052J4501J65579B9196N3145J55126a83239A75260k7450a68280d601
$$ -62481 17052 31553 197132 29196 82341 237467 -183239 175260 147810 -168280 -4601
12760H7345c18037P1369C01120D3076J87466a64234B5916a21166C4150M9709b74120
$$ 87345 -318037 -246668 301120 43076 230542 -164234 25916 -121166 34150 83859 -274120
12748H3284c09863J08168b9061I4950J00434M9645G6514c47815C07805g9361C3670
$$ 83284 -309863 -201695 -29061 94950 195384 245029 76514 -347815 307805 -79361 33670
12736d52632B78680A34912J05551b5639r5739A29976c0197j52472F0502K776i8514
$$ -452632 278680 134912 240463 -25639 -121378 129976 -30197 -182669 60502 63278 -98514
12724A48335e9968k2915B45628a47535A83179Q247H8168a60658F5817r383a41717
$$ 148335 -59968 -82883 245628 -147535 183179 191426 88168 -160658 65817 56434 -141717
12712A94199c8475n7788B70608b08401A51841J44447j00960L7751K1793j12338
$$ 194199 -38475 -96263 270608 -208401 151841 296288 195328 233079 254872 142534
12702A42534g3465A11283D9566a32029A16342d9640l4982B6992a37511I0032i6426
$$ 142534 -73465 111283 49566 -132029 116342 -49640 -84622 26992 -137511 90032 -96426
12690B32558L3101n3969I4253k4293g1338B50694n8720B621J2079a2370E9808
$$ 232558 265659 211690 94253 69960 -71338 250694 191974 2621 14700 -12370 59808
12678g6613k41956a25142A36013m5498D2827d4739B7074a6603B68024H4268P4147
$$ -76613 -318569 -125142 136013 90515 42827 -44739 27074 -16603 268024 84268 158415
12667A58415a74509A34218b33934F9369O9871a04824M2497D9365b460j37367C82899
$$ 158415 -174509 134218 -233934 69369 139240 -104824 -62327 49365 -2460 -139827 382899
12655a6318k66804H5738i4925G8523k2917d7119M297F3235Q6350c2170C6530J14802
$$ -16318 -283122 85738 -94925 78523 55606 -47119 -42822 63235 149585 -32170 36530 151332
12643A51332p49B0018a65744A25152A843L2105b71574B2879a07490B46333G7388
$$ 151332 150583 20018 -165744 125152 1843 33948 -271574 22879 -107490 246333 77388
12631A03973K30784o0108d198A90273q3681k5936H40R654a34815d9593k11201
$$ 103973 334757 274649 -4198 190273 106592 80656 840 10494 -134815 -49593 -260794
12620b60794C7492h1459D3241a04424d3326G020J35263l6195a56666H5818J67304
$$ -260794 37492 -81459 43241 -104424 -43326 7020 142283 106088 -156666 85818 253122
12609B53122I3742d6803n6083K8322o7254b0330D2934L40611A0796M5832L9830
$$ 253122 93742 -46803 -102886 -74564 -141818 -20330 42934 383545 10796 56628 96458
12598I6458a3861G7365J82086B2219a46551A81319B9250J58495b73788J14586
$$ 96458 -13861 77365 259451 22219 -146551 181319 29250 187745 -273788 -159202
12588a59202R905D1356J44099o9972L41432c4765B34357a46142A70334a78104
$$ -159202 -149297 41356 185455 115483 456915 -34765 234357 -146142 170334 -178104
12577a19205F5409b54167A84442a4097H6397c0230k55900F8958a0697m787d32
$$ -119205 65409 -254167 184442 -14097 86397 -30230 -286130 68958 -10697 -15484 -432
12565a69695K481B95502A06493h0164B80685b61318C64337c4520J6802E8148O1166
$$ -169695 -167214 295502 106493 -80164 280685 -261318 364337 -34520 -17718 58148 119314
12554A19314a74810A33519J53834i1048r2927N2121f3148q1896p546L318B31172
$$ 119314 -174810 133519 287353 -91048 -183975 -131854 -63148 -145044 -152590 -149272 231172
12542d5549j73423B52292a42215B35383o5625J00557F0484B9123b42489a03208
$$ -45549 -218972 252292 -142215 235383 169758 270315 60484 29123 -242489 -103208
12531A24519D7850Q7350e130A8696O944a75686D04765G7720d4694C34151b7868
$$ 124519 47850 135200 -5130 18696 25640 -175686 404765 77720 -44694 334151 -27868
12519d314E3651K65318j44785G9276k4461M3181g4933B3002J1304a9107A87360
$$ -4314 53651 318969 174184 79276 54815 97996 -74933 23002 34306 -19107 187360
12507D9402a09951j38484k5110Q2644O5569H8148j3517C0811i1907E5260N2377
$$ 49402 -109951 -248435 -273545 -190901 -125332 88148 74631 30811 -91907 55260 107637
12496A07637j5098K50723j60285k8445M0497H8681l2685O9971P3577a48119A43492
$$ 107637 92539 343262 182977 154532 195029 88681 55996 125967 199544 -148119 143492
12484c71559a07036C74076D5376C414J0255f0901j23105A58214a71531h5153D4440
$$ -371559 -107036 374076 45376 3414 13669 -60901 -184006 158214 -171531 -85153 44440
12472B1499J3055J07283N1880J3077i3806o4565B11370a68700F7420Q680e3498
$$ 21499 34554 141837 193717 206794 -93806 -158371 211370 -168700 67420 76100 -53498
12460B62519a99200m1543g1936j38040H0526a6675A28653k7324f3092A95385J5083
$$ 262519 -199200 -240743 -71936 -209976 80526 -16675 128653 101329 -63092 195385 210468
12449B10468b34972d4291D457h0969A97520r074c5952Q101G6526B4033J72280
$$ 210468 -234972 -44291 4457 -80969 197520 188446 -35952 -27851 76526 24033 196313
12438A96313D5478b26777Q22c5372k12958a4134H5951c1244j76203R9170D4958
$$ 196313 45478 -226777 -225955 -35372 -248330 -14134 85951 -31244 -207447 -108277 44958
12426a42863B6025f8140C5559o45J48769a43314e3653j84418H3954a15074j17711
$$ -142863 26025 -68140 35559 34914 183683 -143314 -53653 -238071 83954 -115074 -232785
12415b32785A90648J63090e0863i244l65707B81060a55547A82595b5105j14909
$$ -232785 190648 353738 -50863 -9244 -374951 281060 -155547 182595 -25105 -140014
12405a40014j18974k3861D6019b20175A46826D574a36242A56491L3051c2650j18287
$$ -140014 -258988 -282849 46019 -220175 146826 4574 -136242 156491 189542 -32650 -150937
12394a50937A53629G5097b07204B12932m6228b26716N3968r3295D18844A05887
$$ -150937 153629 75097 -207204 212932 166704 -226716 -172748 -266043 418844 105887
12383C6674a77894A62928m998J32210l1004m6714c0588I2686l2278b13927E0165
$$ 36674 -177894 162928 157930 290140 259136 212422 -30588 92686 60408 -213927 50165
12371a1521G7656J28512a90122A39377l5674k4243h3863B60405A17469K29756
$$ -11521 77656 206168 -190122 139377 103703 79460 -83863 260405 117469 347225
12361C47225j71971D5552L821K6378J92850j32334l3477j7163B1487d717C26718
$$ 347225 175254 45552 49373 75751 268601 136267 102790 85627 21487 -4717 326718
12349A81104o7483K29014g3459H176J06674k2983K13394f4157I5453b81359a33822
$$ 181104 113621 342635 -73459 8176 114850 91867 305261 -64157 95453 -281359 -133822
12337A29777b726j43465B24695r7900N1071J14831j36738L13561j03691h7420
$$ 129777 -2726 -146191 224695 126795 177866 292697 155959 469520 365829 -87420
12326A49162K8997J46708L9246j31193A09434O2912P5821j12338Q4113a23796
$$ 149162 178159 324867 364113 232920 109434 172346 248167 135829 219942 -123796
12315B12426J5457K22226a43896e2995A95041b1327m4595L0581B37742k2119l8272
$$ 212426 227883 450109 -143896 -52995 195041 -21327 -65922 -35341 237742 215623 177351
12304A77351b54582D35727H3878k6725p559A4963b96346M1605g958k4616m5776
$$ 177351 -254582 435727 83878 57153 49594 14963 -296346 -254741 -7958 -32574 -78350
12293g8350A16420c09877B20228e1690A68451M7089c9704A76929m5176m5057N0245
$$ -78350 116420 -309877 220228 -51690 168451 215540 -39704 176929 131753 86696 136941
12282A36941c0079j23132c2119A34893a91450A70880h0652A41905M8521k8390
$$ 136941 -30079 -153211 -32119 134893 -191450 170880 -80652 141905 190426 162036
12272A62036Q396O7175J12399A54695l0842d25889Q0777A4730O7101K23271q2961
$$ 162036 170432 237607 350006 154695 123853 -425889 -345112 14730 81831 305102 222141
12261B22141j05174b75047B7976d0110R460H0105R1453l3738a01126j38382A14442
$$ 222141 116967 -275047 27976 -40110 -30650 80105 171558 137820 -101126 -239508 114442
12249A5257L3493J08655P86d5259a0690A5796K17300c64530B8188N8671B7291
$$ 15257 48750 157405 158191 -45259 -10690 15796 233096 -364530 28188 86859 27291
12237D04159A58768g122o3243A7815M2409J03857M2141l8278R9732K06681g9218
$$ 404159 158768 -7122 -70365 17815 60224 164081 206222 167944 267676 474357 -79218
12225C6076q109K12219a35740N0765c3746A44206J53288k7208a36231B49560F9629
$$ 36076 27967 240186 -135740 -84975 -33746 144206 297494 270286 -136231 249560 69629
12213C36304i2661A62227J00101a48666B24976A04211L4826c06371a8829A96742
$$ 336304 -92661 162227 262328 -148666 224976 104211 139037 -306371 -18829 196742
12202B08976l3881J67296A70804c84176a82131a3323k8057A69533p8664a07187
$$ 208976 175095 342391 170804 -384176 -182131 -13323 -41380 169533 90869 -107187
12191c6484B53651p4868K2828o8832K5871J72400E9328M62599A30619K2702K4748
$$ -36484 253651 178783 201611 132779 158650 331050 59328 521927 130619 153321 178069
12180A78069J9122J74298A52687K51051j28572m3640I046J12451C0207J35902
$$ 178069 197191 371489 152687 403738 275166 231526 9046 121497 30207 166109
12170A66109J22413K3895H7936h6431A11067R0426m8045R2047h3307B45091J49059
$$ 166109 288522 312417 87936 -86431 111067 201493 153448 245495 -83307 245091 394150
12159C94150e5883A39814a09789C8549O987J12664c1413A01965B1800b24302A16005
$$ 394150 -55883 139814 -109789 38549 45536 158200 -31413 101965 21800 -224302 116005
12147a2384F8321J5728J36016N3903B3658N549K97466I7603J1527J9693o984k6717
$$ -12384 68321 84049 220065 273968 23658 29207 326673 97603 109130 128823 121839 95122
12135I5122N9578J65737C6396M46797c699D08254j20962N4446K33168B11643r3888
$$ 95122 154700 320437 36396 483193 -3699 408254 287292 341738 574906 211643 117755
12124A17755J88147j09923m8983b39230E3375K54323A25998Q3292D5025N4081
$$ 117755 305902 195979 146996 -239230 53375 307698 125998 209290 45025 99106
12114I9106N4739K9027G8564k6907L03894F9231K14122j03870L2626a8104p747
$$ 99106 153845 182872 78564 51657 355551 69231 283353 179483 212109 -18104 -25851
12103b5851A3803M30437I2790k3282a26111A35236d0020D6554e1512A13811d1287
$$ -25851 13803 444240 92790 69508 -126111 135236 -40020 46554 -51512 113811 -41287
12091b29931D2662R037L20962f0400E1328a2925m6318D31777j00522c0249k9847
$$ -229931 42662 51699 372661 -60400 51328 -12925 -59243 431777 331255 -30249 -60096
12080f0096B38921b4087A41287J02980K47713e138C9410a12072o7517A56244R0282
$$ -60096 238921 -24087 141287 244267 491980 -5138 39410 -112072 -179589 156244 246526
12069B46526C545L18401a0489I6087O6965a09846D91090b05042A59460N741b88668
$$ 246526 3545 321946 -10489 96087 163052 -109846 491090 -205042 159460 165201 -288668
12057a04016p7690A60937a45745A95367a89520g9558F694K833R9821a2124k40395
$$ -104016 -181706 160937 -145745 195367 -189520 -79558 6694 9527 109348 -12124 -252519
12046b52519C26900A638N11799D8642K3520A0949K8042b11010I4645J96216I5774
$$ -252519 326900 1638 513437 48642 72162 10949 38991 -211010 94645 290861 95774
12034b0740k20383G2197a37890L2744h326C60147a87365f4957k68685A63174c15915
$$ -20740 -241123 72197 -137890 -105146 -8326 360147 -187365 -64957 -333642 163174 -315915
12022a45630A39235J45014A37527J48327a2927j02437k83395A1950a66192h1583
$$ -145630 139235 284249 137527 285854 -12927 -115364 -398759 11950 -166192 -81583
12011a15018j09973l298A09834a94830G7265l0858a85360A73935A8390N142J21221
$$ -115018 -224991 -228289 109834 -194830 77265 46407 -185360 173935 18390 23532 144753
12000A44753J48433a46532f7584j26848B31625c64216J40102j85732A28043o1363
$$ 144753 293186 -146532 -67584 -194432 231625 -364216 -224114 -409846 128043 66680
11990F6680N2485a32854d6525A82089p2756b33936A047N0245J31723m1015F290
$$ 66680 119165 -132854 -46525 182089 109333 -233936 1047 51292 183015 142000 6290
11978a93210k19436A75419o1925J41273g8576A4273d6145N711F0241c02192A12712
$$ -193210 -412646 175419 113494 254767 -78576 14273 -46145 -40434 60241 -302192 112712
11966g053A05577L18381a09254A36199d565m07938f9330B3137Q4414a46845a9357
$$ -7053 105577 423958 -109254 136199 -4565 -412503 -69330 23137 107551 -146845 -19357
11954g1975c0573B20993r5340b03940a1790C0756c9407j67056g8314l9267M8473
$$ -71975 -30573 220993 125653 -203940 -11790 30756 -39407 -206463 -78314 -117581 -69108
11943f9108k74422c4033A41542E752c73808A55769n4332m2569A5396N466g9648
$$ -69108 -343530 -34033 141542 5752 -373808 155769 101437 58868 15396 20862 -79648
11931a25455m370e625l180A08415b57627a16734C4838J32428d3663D9637J51496
$$ -125455 -129825 -5625 -8805 108415 -257627 -116734 34838 167266 -43663 49637 201133
11920B01133I4776a31704H9759j7042N0240a06941l7835A26571a32837k09280
$$ 201133 94776 -131704 89759 72717 122957 -106941 -144776 126571 -132837 -342117
11910c42117I1878c11343C83168f770j88896E4378a03265Q50j37784a4009j2898
$$ -342117 91878 -311343 383168 -6770 -195666 54378 -103265 -102415 -240199 -14009 -26907
11899b6907A59501h8867I221f628m32812I7394m4738a29768j02114A55974b10320
$$ -26907 159501 -88867 9221 -6628 -439440 97394 52656 -129768 -231882 155974 -210320
11887A49242c4441C0366a01895A42450M5014n9692a89914J9283j86496B77389
$$ 149242 -34441 30366 -101895 142450 187464 127772 -189914 -170631 -357127 277389
11876a14329m8575C3985J8127a03695E6445a9134H6810o633J13691C2116K71434
$$ -114329 -162904 33985 52112 -103695 56445 -19134 86810 80177 193868 32116 303550
11865C03550a72659L3452O4647B73502j23546e6100B07367J0096K7003C745e748
$$ 303550 -172659 -139207 -74560 273502 149956 -56100 207367 217463 244466 3745 -5748
11853A46566D1094a42140A88972c68478J03322d0768F1480a37868k09618B66048
$$ 146566 41094 -142140 188972 -368478 -265156 -40768 61480 -137868 -347486 266048
11842a37667I2310f5644A38518c727n5830I8262g8819F3685L5685i5962a8511
$$ -137667 92310 -65644 138518 -3727 -59557 98262 -78819 63685 99370 -95962 -18511
11830F9954E227i0336k26685i4639c9422E1863E481e9897E0999d169C8109A7290
$$ 69954 5227 -90336 -317021 -94639 -39422 51863 5481 -59897 50999 -4169 38109 17290
11817b3474B06505d2342q7583j29556b6714j17518D9252b90330J38082B1027b28505
$$ -23474 206505 -42342 -129925 -259481 -26714 -144232 49252 -290330 -152248 21027 -228505
11805b18736A57281b12305i5862Q554k90566g7957A28484b9095k13051A4197h2906
$$ -218736 157281 -212305 -95862 -87308 -377874 -77957 128484 -29095 -242146 14197 -82906
11793f4440G3242a14222K9746j86936A78794P049c37319c9061a9495j33819a1159
$$ -64440 73242 -114222 -84476 -271412 178794 185843 -337319 -39061 -19495 -153314 -11159
11781E7280h846B64685G5379j554a13858k44883a7814k67202a01510J8184B7244
$$ 57280 -8846 264685 75379 73825 -113858 -358741 -17814 -285016 -101510 -83326 27244
11769b65772A18595h3713j60559a13742A4461N3438g3487I5596K1245d12613g4668
$$ -265772 118595 -83713 -244272 -113742 14461 67899 -73487 95596 116841 -412613 -74668
11757G4569h7631j70932C24681a44291N9985j9321A49730d5409j8692I8004B2593
$$ 74569 -87631 -258563 324681 -144291 -84306 -103627 149730 -45409 -64101 98004 22593
11745G0289k906b1797k87894a14322B81179j07515a62692j15282c1303D8235a36694
$$ 70289 67383 -21797 -309691 -114322 281179 173664 -162692 -277974 -31303 48235 -136694
11733a39379A59621b63304A56397i0147A74963J76107A34203a36352G4329g1719
$$ -139379 159621 -263304 156397 -90147 174963 351070 134203 -136352 74329 -71719
11722D29290A20712g76A34129a32902q7138f0361A81153p6679n1943K22620c09172
$$ 429290 120712 -776 134129 -132902 -220040 -60361 181153 104474 52531 275151 -309172
11710d4865m420A2909a32580a9309I3401f1198D4224p155a27069A27244P4182
$$ -44865 -49285 12909 -132580 -19309 93401 -61198 44224 37069 -127069 127244 201426
11699B01426B2509d10707G2606N430a5999k59221B2256d204C26329j48399c11740
$$ 201426 22509 -410707 72606 78036 -15999 -275220 22256 -4204 326329 177930 -311740
11687I5759a49198A02873J6324J869K2292L4615Q33E5514J3794j9740J2655R4395
$$ 95759 -149198 102873 119197 121066 143358 177973 178806 55514 69308 49568 62223 156618
11675A56618a19388n7939K9164H6523J60950h742m02450J88316D603O7461e171
$$ 156618 -119388 -177327 -148163 86523 247473 -8742 -411192 -222876 4603 72064 -5171
11663b44655B32668e1870j04044E7149b62115F6132e3959A70898B9383J00409
$$ -244655 232668 -51870 -155914 57149 -262115 66132 -53959 170898 29383 129792
11653A29792a63851M7648K3577B6794N660d44038A11496J88625e5415k18815A7608
$$ 129792 -163851 -116203 -92626 26794 32454 -444038 111496 300121 -55415 -274230 17608
11641c36389C89908f28908B05542c7901l0329o3967A98172b0432o6144h529C44848
$$ -336389 389908 -628908 205542 -37901 -68230 -132197 198172 -20432 -86576 -8529 344848
11629A12517A6353a97778A60213k1743L9644B9245a17989A89516c7557C03441
$$ 112517 16353 -197778 160213 138470 178114 29245 -117989 189516 -37557 303441
11618A02346A1846a66740B41890B1129a37976j04097B45145b24942R3780I2346
$$ 102346 11846 -166740 241890 21129 -137976 -242073 245145 -224942 -131162 92346
11607B30685b26298C16293d26148J44608A05798C4323h2172D0766f1961A41622
$$ 230685 -226298 316293 -426148 -281540 105798 34323 -82172 40766 -61961 141622
11596E8529h4252b9379r9694N392C39523h487l65j15761h196j93056i6113D05326
$$ 58529 -84252 -29379 -129073 -123681 339523 -8487 -8852 -124613 -8196 -201252 -96113 405326
11583A12134c35513A29973R062c36558J43647F7547K7211N2202i9302I7040J11903
$$ 112134 -335513 129973 139035 -336558 -192911 67547 94758 146960 -99302 97040 208943
11572B08943c7866k60492A04047A1520d065o8680I3939J00545b37949B78460d24313
$$ 208943 -37866 -298358 104047 11520 -4065 -72745 93939 194484 -237949 278460 -424313
11560b230A32017m6901J89462J1688c7654d171A84746a86510f0099F5955b41202
$$ -2230 132017 85116 274578 286266 -37654 -4171 184746 -186510 -60099 65955 -241202
11548a57014d0240B6794J05205a31627f555D8959i1345a0004F4661M08156h7072
$$ -157014 -40240 26794 131999 -131627 -6555 48959 -91345 -10004 64661 472817 -87072
11536b4599j07431b9855F2287j5118A4555C061a20911A14561b4398A01631a07110
$$ -24599 -132030 -29855 62287 47169 14555 3061 -120911 114561 -24398 101631 -107110
11524a79841B6907M8719K58593A60159k0975L9600N2931J6119C2101P5719m9525
$$ -179841 26907 75626 334219 160159 139184 178784 231715 247834 32101 107820 58295
11513E8295J8912I926f8290B32595e2934o112A27612J1311K7595a62728B08754
$$ 58295 77207 9926 -68290 232595 -52934 -59046 127612 138923 166518 -162728 208754
11501I8638J66858a72414B01491A2603R0548J59106j22441P8232N9633b00914
$$ 98638 265496 -172414 201491 12603 103151 262257 139816 218048 277681 -200914
11490a70620A11991K46037E4494J69469C3137c5682A99011E8471J32471N2990
$$ -170620 111991 358028 54494 223963 33137 -35682 199011 58471 190942 243932
11480B43932F1539a42344B7822J29570a59594f3950o934B30902j08789d1180A48655
$$ 243932 61539 -142344 27822 157392 -159594 -63950 -70884 230902 122113 -41180 148655
11468A68697M5703c4228d761H5291b8799B80842a45442K0522C56002j40852E4827
$$ 168697 214400 -34228 -4761 85291 -28799 280842 -145442 -124920 356002 215150 54827
11456D8907d0245B76043i5189o8529P9389B79692a97644P8098A66988e3532B68535
$$ 48907 -40245 276043 -95189 -163718 -84329 279692 -197644 -119546 166988 -53532 268535
11444B23404a65069M2116D7961J95300g6012A64555h0030p8040G2905J6122O4242
$$ 223404 -165069 -122953 47961 243261 -76012 164555 -80030 -158070 72905 89027 153269
11433A53269Q4786c19910B56492m9735i3969C9224d34982A1689a5887D72847k24986
$$ 153269 238055 -319910 256492 206757 -93969 39224 -434982 11689 -15887 472847 247861
11422B47861c9117A3295K46703j00573i9732B34653D28a17456A62903e1433j29091
$$ 247861 -39117 13295 259998 159425 -99732 234653 428 -117456 162903 -51433 -180524
11411a80524m7603c0645F8366L7407C3625c3583k8761E4137a91702A20529b42312
$$ -180524 -228127 -30645 68366 105773 33625 -33583 -62344 54137 -191702 120529 -242312
11399A37366B5512a9557k39929a10483k6401j3738j1989K8815j7547J3302a5824
$$ 137366 25512 -19557 -259486 -110483 -136884 -150622 -162611 -133796 -151343 -138041 -15824
11387a32295B72895F4264K37589a9572j14037j01890A52248b7716j59583E2048
$$ -132295 272895 64264 301853 -19572 -133609 -235499 152248 -27716 -187299 52048
11376b09185q614K773H268c9640p539r3185K8583O884a6802j2408g861C9339b00539
$$ -209185 -217799 -215026 8268 -39640 -47179 -140364 -111781 -104897 -16802 -29210 -7861 39339 -200539
11362A75107m3374J0819a06481j76072g3247p5512c6169n6156L3705D65738I1088
$$ 175107 131733 142552 -106481 -282553 -73247 -148759 -36169 -92325 -58620 465738 91088
11350A47114a43601B0975e9671A20619e2871N940C11856A477J20849a83095j49783
$$ 147114 -143601 20975 -59671 120619 -52871 -46931 311856 1477 122326 -183095 -332878
11339c32878I5954f8701A69582a16580A82983c783l94788A69795c6580j19610
$$ -332878 95954 -68701 169582 -116580 182983 -3783 -398571 169795 -36580 -156190
11329a56190J8287E0444b84382c9275j85201b9214o3624m6783D9323J9807a13739
$$ -156190 -137903 50444 -284382 -39275 -224476 -29214 -92838 -139621 49323 69130 -113739
11317B57272l6306b14900A4928b14879R6941M1549b2591l35218a42092P0595j03781
$$ 257272 220966 -214900 14928 -214879 -117938 -76389 -22591 -357809 -142092 -71497 -175278
11306a75278A39821a35970M106a3718B29568b23154J05979j45705A05869Q2870
$$ -175278 139821 -135970 -131864 -13718 229568 -223154 -117175 -262880 105869 188739
11296A88739M35944A68822a48616j46821J39224b2628D8662d01955A26365J86866
$$ 188739 624683 168822 -148616 -295437 -156213 -22628 48662 -401955 126365 313231
11286C13231a20683j01430r6500A826a33406k23848J48258F6613J34120a32404
$$ 313231 -120683 -222113 -318613 1826 -133406 -357254 -208996 66613 200733 -132404
11275I7246J798b59801b5963B5034a98698B56621B8187D029a50901O9450A06117
$$ 97246 99044 -259801 -25963 25034 -198698 256621 28187 4029 -150901 -81451 106117
11263d6873k16916F2877J43194f1846E1730a16137G2755L1825c59017B5364a20390
$$ -46873 -263789 62877 206071 -61846 51730 -116137 72755 104580 -359017 25364 -120390
11251b35071I9938f8602B94257a65136A77280e3604k03977O1681P6145N2988A50350
$$ -235071 99938 -68602 294257 -165136 177280 -53604 -257581 -195900 -119755 -66767 150350
11239B27447o5690o5101i1369C0327J04561F0545e0292l7635C7300b70563k5880
$$ 227447 161757 96656 -91369 30327 134888 60545 -50292 -87927 37300 -270563 -296443
11228b96443a28164M0753A74554j0208A1513a00490H367a32844F6072b2825m882
$$ -296443 -128164 -87411 174554 164346 11513 -100490 8367 -132844 66072 -22825 -27707
11217b7707E3250e94943b4987B488L2601Q3654d2494b0676n248A00545c01802
$$ -27707 53250 -594943 -24987 2488 35089 118743 -42494 -20676 -25924 100545 -301802
11205B96679b47873k06940F7357a91942K4798G8889J29135a10737j58633i8102
$$ 296679 -247873 -454813 67357 -191942 -167144 78889 208024 -110737 -269370 -98102
11194F2712K0304a55663G1735b02681A68485d5339k21400C84723A0193d03830
$$ 62712 83016 -155663 71735 -202681 168485 -45339 -266739 384723 10193 -403830
11183d7716k94893B28593a37044C204J32143k887k8922b35340A2930e9369k40725
$$ -47716 -342609 228593 -137044 3204 135347 132460 103538 -235340 12930 -59369 -300094
11172c00094A71729F3977c66328a17032A96520l2750a42576b8578l55257a25847
$$ -300094 171729 63977 -366328 -117032 196520 163770 -142576 -28578 -383835 -125847
11161b46819j29109c4503A91535a77997a9643j82608j75793O9557a44887k66683
$$ -246819 -375928 -34503 191535 -177997 -19643 -202251 -378044 -308487 -144887 -411570
11151d11570F2284b9548F4789a4644k10155H7673N3791J13909f3389j7577m47921
$$ -411570 62284 -29548 64789 -14644 -224799 87673 141464 255373 -63389 -80966 -528887
11140e28887A23884e1398p2785M0412B6657c4654b120E4129A0971J84951p5257
$$ -528887 123884 -51398 -124183 -83771 26657 -34654 -2120 54129 10971 195922 120665
11129A20665K900b01488B48095a20j34227K6338A58930C9064J21846J7099b4765
$$ 120665 123565 -201488 248095 -120 -134347 -108009 158930 39064 160910 178009 -24765
11117E9107B500Q2683l7861h7497F4682J99752b28373E2931b80906a14775l4662
$$ 59107 2500 85183 47322 -87497 64682 264434 -228373 52931 -280906 -114775 -149437
11106a49437A35113Q6397c7358H0007a7286A09704J17453h8113j35993D27796
$$ -149437 135113 221510 -37358 80007 -17286 109704 227157 -88113 -224106 427796
11095G9751j5906a1538A34738b596D12907E6313K72874F1031J23398a01915H8866
$$ 79751 63845 -11538 134738 -2596 412907 56313 329187 61031 184429 -101915 88866
11083D30374j60201a98971D37662B16064C9852P9391K5745a07597G1556K37983
$$ 430374 270173 -198971 437662 216064 39852 119243 144988 -107597 71556 309539
11073C09539E4076j8124L3136C836J94477K06692I1612E603K35309i3189A40504
$$ 309539 54076 35952 69088 3836 198313 405005 91612 5603 240912 -93189 140504
11061a77883A84349j2139k3006J90326J49075A59690J06817N38667A65754M09414
$$ -177883 184349 172210 149204 339530 488605 159690 266507 805174 165754 575168
11051E75168J06064j74769j41699p3342K77745k80040J10096l5718D1630M04755
$$ 575168 681232 506463 364764 291422 569167 289127 399223 363505 41630 446385
11041D46385J21949l7106L5172l7073K226K3560P0353j20182j33131K13302A69723
$$ 446385 568334 531228 566400 529327 531553 555113 625466 505284 372153 585455 169723
11029D80880M5551j94662O0945Q2995j23882K35581P6698Q3574n3502k84755J63315
$$ 480880 526431 331769 392714 475709 351827 587408 664106 747680 694178 409423 572738
11018E72738l6872A03176L93920m5246P8551A8047O05060p6939j36626j83763
$$ 572738 535866 103176 497096 451850 530401 18047 623107 546168 409542 225779
11008B25779J78109k5724L78188k60214n6375E492N48643J18304k09208J611k29025
$$ 225779 403888 378164 756352 496138 439763 5492 554135 672439 463231 464842 235817
10997B35817K27504N7900M6352j64166J04064L1242B07719P7472J24109O4023
$$ 235817 463321 521221 567573 403407 507471 538713 207719 285191 409300 473323
10987D73323J1951R2357k30894M6982K86671J17278k76210K32868R6388j28584
$$ 473323 485274 577631 346737 393719 680390 797668 521458 754326 850714 722130
10977G22130J56727l28419j9804K02581n6891K48388O7296j5530K54095O12596
$$ 722130 878857 550438 530634 733215 676324 924712 992008 976478 1230573 1843169
10967A843169j65787l3549j596K51391J00171j48548K29725j26874j60639o22073
$$ 1843169 1677382 1643833 1642237 1893628 1993799 1845251 2074976 1948102 1787463 1165390
10957A165390j58929K11403j92571J69230l07303M1538j95884M41323r3489m1678
$$ 1165390 1006461 1217864 1025293 1194523 887220 928758 732874 1174197 1080708 1039030
10947A039030j04848P0363j83992j26983B45378p031J27338K88741B55524n5149
$$ 1039030 934182 1004545 820553 693570 245378 238347 365685 654426 255524 200375
10937B00375E2705k3731J48191C1320J2161K93150E8345K32333l6379e490B17885
$$ 200375 52705 28974 177165 31320 43481 336631 58345 290678 254299 -5490 217885
10925B69141a71868A33992a1515l8509B63981a04913a2588I5058a74516A57933
$$ 269141 -171868 133992 -11515 -50024 263981 -104913 -12588 95058 -174516 157933
10914A85075E1951a99146l69577G4978f8163L2261B45642a9255D56679I526Q7478
$$ 185075 51951 -199146 -568723 74978 -68163 -35902 245642 -19255 456679 9526 97004
10903I7004c1696j15169C05348b31277q9934f987B83374L3376l081J7943b03727
$$ 97004 -31696 -146865 305348 -231277 -321211 -6987 283374 316750 313669 331612 -203727
10891b67017E2949J37709j2808b01818C1918Q7555a42738N7573J0644k80018a37138
$$ -267017 52949 190658 177850 -201818 31918 119473 -142738 -85165 -74521 -354539 -137138
10879G1002a61792J5656E2968q716R4215i6669j28779P550b3028k35941Q0658
$$ 71002 -161792 -146136 52968 44252 138467 -96669 -225448 -217898 -23028 -258969 -178311
10868a78311A65958k0485a27409J6355A04993c52418b6156A46779j8647L986b07113
$$ -178311 165958 145473 -127409 -111054 104993 -352418 -26156 146779 128132 132118 -207113
10856i8658B6980d25710B08850l9739G4762f1118J3661D1747A1772L9592Q924
$$ -98658 26980 -425710 208850 169111 74762 -61118 -47457 41747 11772 51364 60288
10845F0288J65303c25107A01305c77679B92204e4705d324j61802A84598a31598
$$ 60288 225591 -325107 101305 -377679 292204 -54705 -4324 -166126 184598 -131598
10834b20669A91662b24824P7672A59190c28584J40210B29167j6321g2670B00618
$$ -220669 191662 -224824 -147152 159190 -328584 -188374 229167 212846 -72670 200618
10823c88999A19544a21419j18335d5475D59690A15606a22648A21429f4182j8253
$$ -388999 119544 -121419 -239754 -45475 459690 115606 -122648 121429 -64182 -82435
10813h2435A17918J75196j972b62768a0749H8684k9758a80639B49209a59011g5235
$$ -82435 117918 293114 291142 -262768 -10749 88684 58926 -180639 249209 -159011 -75235
10801A31896b83804J22644D3682d14106a73500C6830B300a91205G6083J2719J34348
$$ 131896 -283804 -161160 43682 -414106 -173500 36830 2300 -191205 76083 88802 223150
10790B23150b20816F4154f11o6716A64026a03969l2958j49952I0844a17261n4947
$$ 223150 -220816 64154 -611 -67327 164026 -103969 -136927 -286879 90844 -117261 -172208
10779a72208J3556e4701A28344A1510g263B81393G7188j3323J77438a45068A6481
$$ -172208 -158652 -54701 128344 11510 -7263 281393 77188 63865 241303 -145068 16481
10767a15778H062a27236j87599B07785b92607p1003B5564a63686I7262c60652
$$ -115778 8062 -127236 -314835 207785 -292607 -363610 25564 -163686 97262 -360652
10756b79684P2749i6673F513a62660J3388N8831L4359k22027A62279G4044c87231
$$ -279684 -206935 -96673 6513 -162660 -149272 -90441 -56082 -278109 162279 74044 -387231
10744F8887J6326l2735a0458k27228A63817Q3633c44319F6201a23976f453j01641
$$ 68887 85213 52478 -10458 -237686 163817 247450 -344319 66201 -123976 -6453 -108094
10733a08094b2538k09164f8390K9751B22478C5555J85578F4322k3034a75772O3480
$$ -108094 -22538 -231702 -68390 -38639 222478 35555 221133 64322 41288 -175772 -112292
10722a12292j71927J23930G3362j6023a20326C1604M04388e3158H1972a52656
$$ -112292 -284219 -160289 73362 57339 -120326 31604 435992 -53158 81972 -152656
10711b07630M8449E05a87255p4401Q3218B26185f839I905a12744j22235Q9007
$$ -207630 -159181 505 -187255 -261656 -178438 226185 -6839 9905 -112744 -234979 -145972
10700a45972j23773b7331k54541c1035l73931a29317k67566b0552l0094l4092
$$ -145972 -269745 -27331 -281872 -31035 -404966 -129317 -396883 -20552 -50646 -84738
10690h4738K9414B28875H9705m1048K22587d8641k15049J2361A06270d34802A27621
$$ -84738 -55324 228875 89705 48657 271244 -48641 -263690 -251329 106270 -434802 127621
10678a4233m1949J2090k18122E7a76233A04938l4244J32324A5718b9317A28862
$$ -14233 -56182 -44092 -262214 57 -176233 104938 70694 203018 15718 -29317 128862
10666B4042b56266c5668A63555b38996A24356A7208a77469o1762I7714d7351B60798
$$ 24042 -256266 -35668 163555 -238996 124356 17208 -177469 -239231 97714 -47351 260798
10654f3242A01553A8763h4358A36342a4732j08225n8491M4898A41139Q2358A02299
$$ -63242 101553 18763 -84358 136342 -14732 -122957 -181448 -136550 141139 223497 102299
10642f647A08382b9434j74278g5534j19341C7370b75567O6247G8277J43363F6085
$$ -6647 108382 -29434 -203712 -75534 -194875 37370 -275567 -209320 78277 221640 66085
10630a7465k81084L5724g8738k4551k2289c3148j28743P7008j12455d051p1618
$$ -17465 -298549 -262825 -78738 -103289 -125578 -33148 -161891 -84883 -197338 -4051 -75669
10619g5669k1018E2278L9655e87046c8396H7853N3450n0730B8795b94107A2033
$$ -75669 -96687 52278 91933 -587046 -38396 87853 141303 90573 28795 -294107 12033
10607e6244l3568q1919J3381A24784e0085r5191b7742D6826a41100J2810r209
$$ -56244 -89812 -171731 -158350 124784 -50085 -145276 -27742 46826 -141100 -128290 -137499
10596a37499m7586I0607b95924o1989a21961A56878g0610A23461b78204i7644
$$ -137499 -185085 90607 -295924 -357913 -121961 156878 -70610 123461 -278204 -97644
10585a11308B9107a16907k2346f5192j3893D9023b8720E1947a04429m651A16627
$$ -111308 29107 -116907 -139253 -65192 -79085 49023 -28720 51947 -104429 -109080 116627
10573B5541a84655d5682F9743c32100a46468A43657a7796A46625F3036a47576
$$ 25541 -184655 -45682 69743 -332100 -146468 143657 -17796 146625 63036 -147576
10562B0036L3951a56940C07389A34114b09291E380b22809f5713A31927b14849
$$ 20036 53987 -156940 307389 134114 -209291 5380 -222809 -65713 131927 -214849
10551e0814A31700L3239b48372H2988b78453I938K82089F3610J01255p1597a61924
$$ -50814 131700 164939 -248372 82988 -278453 9938 292027 63610 164865 93268 -161924
10539a25503A36874c26160R9557e4788j43700P5136j42681h6706H2661i0183C1677
$$ -125503 136874 -326160 -226603 -54788 -198488 -123352 -266033 -86706 82661 -90183 31677
10527c73778a60893C108a69593M9119b6722M675A10443k0453J15866C3125d7413
$$ -373778 -160893 3108 -169593 -120474 -26722 -22047 110443 89990 205856 33125 -47413
10515a17828B60608i306m5199B74733a23152D490i2480q6080l00434g5014a7642
$$ -117828 260608 -9306 -54505 274733 -123152 4490 -92480 -178560 -478994 -75014 -17642
10503A92630a9294j50212H6313d7982q8852F9310J16646d5494A02036h2881i289
$$ 192630 -19294 -169506 86313 -47982 -136834 69310 185956 -45494 102036 -82881 -9289
10491a38730l2734j82434A25549R131Q4850g5328j64858D3105a8112A02172P7460
$$ -138730 -171464 -353898 125549 134680 219530 -75328 -240186 43105 -18112 102172 179632
10480A79632b9025j58138C20956c59582B49358a03641D7613r337K17084N7150
$$ 179632 -29025 -187163 320956 -359582 249358 -103641 47613 38276 255360 312510
10470C12510M3546A43709L11223A21494b0063B9818M02923G8704l1582J01043
$$ 312510 356056 143709 454932 121494 -20063 29818 432741 78704 47122 148165
10460A48165d0530A8155a46862N6019n4198F1526P1344b63513B51460m4355a12353
$$ 148165 -40530 18155 -146862 -90843 -145041 61526 132870 -263513 251460 207105 -112353
10448h4737j9998K5871a4546q3644j58232a0246k24138c5168n2196G9981d3698
$$ -84737 -104735 -78864 -14546 -98190 -256422 -10246 -234384 -35168 -87364 79981 -43698
10436c5117l1688A46886D4383e4188e603G0256d3717A12593K9362c69251i3249
$$ -35117 -66805 146886 44383 -54188 -5603 70256 -43717 112593 141955 -369251 -93249
10424b11703l8822h0757j48710J9767q8408a07076k13771H3957a37568L819B11663
$$ -211703 -250525 -80757 -229467 -209700 -298108 -107076 -320847 83957 -137568 -133749 211663
10412b26227i9618j04630o9298n1770q392M2896k6279a5500k85186N4453A24032
$$ -226227 -99618 -204248 -273546 -325316 -333708 -290812 -317091 -15500 -300686 -246233 124032
10400D8290b93905j68071E7908c21067E9663i7224b8901I062a23004D2918a952
$$ 48290 -293905 -461976 57908 -321067 59663 -97224 -28901 9062 -123004 42918 -1952
10388D6597J68951C1941K51316H4297A2731J75790a70520f06q4814L9226m6462
$$ 46597 215548 31941 283257 84297 12731 188521 -170520 -606 -85420 -46194 -92656
10377i2656D1814a34424C30356A18074J11421j07718D4839N6889a38661D0920
$$ -92656 41814 -134424 330356 118074 229495 121777 44839 101728 -138661 40920
10366B08129G4191O8597a1103A97945J87293j81261K02183a648E88131A46607
$$ 208129 74191 142788 -11103 197945 385238 203977 406160 -1648 588131 146607
10355A71911M11253A9183O6593a00689A39164J6126p1096l2972e4530C13311K28912
$$ 171911 583164 19183 85776 -100689 139164 155290 84194 51222 -54530 313311 542223
10344E42223j82696A70342q43p5130k6346J89515n392K92630A99959Q3524A33579
$$ 542223 359527 170342 169499 94369 68023 257538 252146 544776 199959 283483 133579
10332A49364K17994j12924a80039h1016B58001r1635H0711b8637n2829I6286m6211
$$ 149364 367358 254434 -180039 -81016 258001 166366 80711 -28637 -81466 96286 50075
10321E0075P4278b62684A88128j8427K53724C6883c721B41081G6778c3101I3503
$$ 50075 124353 -262684 188128 169701 423425 36883 -3721 241081 76778 -33101 93503
10309A74732o2643a41055F3448J24156P6049a66513K0261C1766a61677C1086d50570
$$ 174732 112089 -141055 63448 187604 263653 -166513 -146252 31766 -161677 31086 -450570
10297b35562C31817G8982a15308K9190n2101E1501O7912g240B43106c5216J7103
$$ -235562 331817 78982 -115308 -86118 -138219 51501 119413 -7240 243106 -35216 -18113
10286a8113I4633P4051K5386b94808a7212A51857q661a79019K8060D8240b94791
$$ -18113 94633 168684 194070 -294808 -17212 151857 143196 -179019 -150959 48240 -294791
10274b51997a02745M8916j04236k43698J78035j42931a2425G9058g5703j57530
$$ -251997 -102745 -53829 -158065 -401763 -223728 -366659 -12425 79058 -75703 -233233
10264b33233e1741H1434l4212a05279B79471h6263B55309b57591m5260A48843
$$ -233233 -51741 81434 47222 -105279 279471 -86263 255309 -257591 -302851 148843
10253c7273j53711A71650p2001B8189J02098f8782G3673j6766a13958H3340E876
$$ -37273 -190984 171650 99649 28189 130287 -68782 73673 56907 -113958 83340 5876
10241A19854c3270C14708B4650b1724A75866P0025b87594J17740e3796B18091
$$ 119854 -33270 314708 24650 -21724 175866 245891 -287594 -169854 -53796 218091
10230i8005a5195m8508A08627c2312r9689j19199a5839j87021Q8165e3339A10314
$$ -98005 -15195 -63703 108627 -32312 -132001 -251200 -15839 -202860 -114695 -53339 110314
10218b26204N7953M9273F3589J05516M7875i3516A46640a51096c6762J1822C1789
$$ -226204 -168251 -118978 63589 169105 216980 -93516 146640 -151096 -36762 -24940 31789
10206a80720h7013o5481A29802a51571A40027a58197o5124d0473E9586g6662B52726
$$ -180720 -87013 -152494 129802 -151571 140027 -158197 -223321 -40473 59586 -76662 252726
10194e3489k20598i3198j21784D4827g7495H1054a3833A19974a40819a0428A37942
$$ -53489 -274087 -93198 -214982 44827 -77495 81054 -13833 119974 -140819 -10428 137942
10182a87596D1792a5484j02025I0665a70142j27496C1241J21496b48829A21946
$$ -187596 41792 -15484 -117509 90665 -170142 -297638 31241 152737 -248829 121946
10171G8588A0661a90564K4880k3087n6059O0722G1136e1866K189m3608K3607J2913
$$ 78588 10661 -190564 -165684 -188771 -244830 -184108 71136 -51866 -49677 -93285 -69678 -56765
10159e6765H8346b41820Q4569k1966j16469n4630a25439i503j27904q5769J3407
$$ -56765 88346 -241820 -157251 -179217 -295686 -350316 -125439 -9503 -137407 -223176 -209769
10148b09769C5737K58368j43212G56R2188F437e1001q0491j37986C4888b13978
$$ -209769 35737 294105 150893 756 92944 6437 -51001 -131492 -269478 34888 -213978
10136b23882P7064j08527e9682f577k32411K1178f0566K4444j38248f1714B04744
$$ -223882 -146818 -255345 -59682 -6577 -238988 -217810 -60566 -36122 -174370 -61714 204744
10124a6742B55190I6690M7104e9925o4100D3859a10823e4705O919p3878j45501
$$ -16742 255190 96690 143794 -59925 -124025 43859 -110823 -54705 -47786 -121664 -267165
10113b67165O3450o8751A91176g6856l1405D3080I185e2332A4686b32104l5318
$$ -267165 -203715 -272466 191176 -76856 -108261 43080 9185 -52332 14686 -232104 -267422
10102b67422M4687q7273a0328k630A0478a92431K5337A28440B609J92908c4394
$$ -267422 -222735 -310008 -10328 -12958 10478 -192431 -167094 128440 2609 195517 -34394
10090a03690q5596f4925C9549h9226j35277j29623a04755I8607K37769a29619
$$ -103690 -189286 -64925 39549 -89226 -224503 -354126 -104755 98607 336376 -129619
10079i860k53356d5937l16604h1572j19887N9121A15648e121p1653c685j57456
$$ -9860 -263216 -45937 -362541 -81572 -201459 -142338 115648 -5121 -76774 -3685 -161141
10068a61141m7857d9401j90131j20970A01679Q5747c47446J08710J04800K0618
$$ -161141 -208998 -49401 -239532 -360502 101679 187426 -347446 -238736 -133936 -113318
10058a13318R35j2177N1882E6289g6229A14270A8737b65378Q1972O9887E215c31397
$$ -113318 -112383 -124560 -72678 56289 -76229 114270 18737 -265378 -183406 -113519 5215 -331397
10045d9285A5531M0475A3785J50628a66592a0627j08922A39612a32386m6835A78355
$$ -49285 15531 56006 13785 164413 -166592 -10627 -119549 139612 -132386 -179221 178355
10033a0392j9618k1623A4683b08098i02A52820L6240b32478A69407E9139J4606
$$ -10392 -30010 -51633 14683 -208098 -902 152820 189060 -232478 169407 59139 73745
10022G3745J11290a04763L849l12345M7676a76875I6371a29413A10744m0596K41063
$$ 73745 185035 -104763 -100914 -413259 -365583 -176875 96371 -129413 110744 70148 311211
10011C11211F0322J31081f7583n8100k2805M0608D8099a52382q158m5717h7663
$$ 311211 60322 191403 -67583 -125683 -148488 -107880 48099 -152382 -160540 -206257 -87663
9999f6570j27128P3499B5457a70481C3388c2613B71134a61970J8182l5826L3889
$$ -66570 -193698 -120199 25457 -170481 33388 -32613 271134 -161970 -143788 -179614 -145725
9988a45725A79759c3749j86087a08876n5991g0852p6663A77573a0257k19128L76
$$ -145725 179759 -33749 -219836 -108876 -164867 -70852 -147515 177573 -10257 -229385 -229009
9977b29009A88566a51540A9120J57355G3005K801a59470N6618j96762f9012H0078
$$ -229009 188566 -151540 19120 176475 73005 75806 -159470 -102852 -299614 -69012 80078
9965b79737c3856j15537l5078F0297b43813A26974G922a69098q1640n5675J47451
$$ -279737 -33856 -149393 -184471 60297 -243813 126974 7922 -169098 -250738 -306413 -158962
9954a58962e1814F5945a86536A84041a88322i3571j55672g4994j21764j63285
$$ -158962 -51814 65945 -186536 184041 -188322 -93571 -249243 -74994 -196758 -360043
9944c60043b7067k2990F9157h5520E098c02304Q8420j7114f0910l41357g2776
$$ -360043 -27067 -50057 69157 -85520 5098 -302304 -213884 -230998 -60910 -402267 -72776
9932e0973k50992a23719d9172K635A38996b62734C30925a09712K1309l5875B58564
$$ -50973 -301965 -123719 -49172 -46537 138996 -262734 330925 -109712 -88403 -124278 258564
9920a08099j14571g022A70820B5076d1093r2532J4239j34474D3571c2050k40737
$$ -108099 -222670 -7022 170820 25076 -41093 -133625 -119386 -253860 43571 -32050 -272787
9909b72787J05390A36734d0632r1949K4563M1619j54828g51j85785g5966k4249
$$ -272787 -167397 136734 -40632 -132581 -108018 -66399 -221227 -751 -186536 -75966 -100215
9898a00215F3934a35854g651m53030c3183B06327J77152D1286N0045A2029a46945
$$ -100215 63934 -135854 -7651 -460681 -33183 206327 383479 41286 91331 12029 -146945
9886B38398a77812r8068a10880N0227j8430B20589b12965q6223a47858i085k36480
$$ 238398 -177812 -275880 -110880 -60653 -79083 220589 -212965 -299188 -147858 -9085 -245565
9875b45565k21941A24224M8040n2438f8913A030b12935B02922a28164B35508p7767
$$ -245565 -467506 124224 172264 119826 -68913 1030 -212935 202922 -128164 235508 157741
9864A57741b33796q1824c3568l1094j27910J5601c2767k44421A71256E6645K33
$$ 157741 -233796 -315620 -33568 -64662 -192572 -176971 -32767 -277188 171256 56645 56878
9853E6878a69098j32891A40416C0178a92156M6984b683k3443B10590p3131M004
$$ 56878 -169098 -301989 140416 30178 -192156 -145172 -2683 -26126 210590 137459 141463
9842A41463c06179A66528a72153b768m1654D9906d31117a31195D2949b06662D503
$$ 141463 -306179 166528 -172153 -2768 -44422 49906 -431117 -131195 42949 -206662 4503
9830c8830c529B07482c38814a65525a6261n1161n5714n1229K3139B9685a04298
$$ -38830 -3529 207482 -338814 -165525 -16261 -67422 -123136 -174365 -151226 29685 -104298
9818C5389a44335F5622J1015a43112C4757K50064b0294k08459m6983p1129f542
$$ 35389 -144335 65622 76637 -143112 34757 284821 -20294 -228753 -275736 -346865 -6542
9806a758A44133a14579B43389g1382j50146L0033C5911M06356A85305a73457I4573
$$ -1758 144133 -114579 243389 -71382 -221528 -191495 35911 442267 185305 -173457 94573
9794B79890j36354a22778M3125A86707o5433b34891p6588a51433E0379L6552d0296
$$ 279890 143536 -122778 -79653 186707 121274 -234891 -311479 -151433 50379 86931 -40296
9782A06703a52548G7340b4628C0591R62a01434B00237i5062I7702l2651g4859
$$ 106703 -152548 77340 -24628 30591 31553 -101434 200237 -95062 97702 65051 -74859
9770A53808c52188i9956j14438e183k39649J2346c4498A07852i8760b535l30490
$$ 153808 -352188 -99956 -214394 -5183 -244832 -232486 -34498 107852 -98760 -2535 -333025
9759c33025P1372C3220J02967d73128O7987g4652k81244B12992g0159K1774l01064
$$ -333025 -261653 33220 136187 -473128 -405141 -74652 -355896 212992 -70159 -48385 -349449
9748c49449a61986C46140b35764B90708h2299J0688l0255b9664F5488a85041k10499
$$ -349449 -161986 346140 -235764 290708 -82299 -71611 -101866 -29664 65488 -185041 -395540
9737c95540B7248o613a82301A60506p3529c9684A09546j2573d3559j1974p3013
$$ -395540 27248 20635 -182301 160506 86977 -39684 109546 96973 -43559 -55533 -128546
9726a28546I4094m2172F535f4428A11806C9322K48567a75599B071c250q3492H2091
$$ -128546 94094 51922 6535 -64428 111806 39322 287889 -175599 2071 -3250 -86742 82091
9713a09789A07207e4067m0509G1995J01996a74400A8286b47372a01381j47721
$$ -109789 107207 -54067 -94576 71995 173991 -174400 18286 -247372 -101381 -249102
9703b49102A6184c1137D512b6680k57230C6092a12572q6152A37650g1171k64197
$$ -249102 16184 -31137 4512 -26680 -283910 36092 -112572 -198724 137650 -71171 -335368
9692c35368b2943l8449B46851e53360A63947J20940a46667G7269a22225A49653
$$ -335368 -22943 -61392 246851 -553360 163947 284887 -146667 77269 -122225 149653
9681F1805A3464a34554j36496G5310b04810A70882p3588a8784j12509e0943B05678
$$ 61805 13464 -134554 -271050 75310 -204810 170882 97294 -18784 -131293 -50943 205678
9669a86116N4558j20772j09003D7621g8821H1621N514a34525r864j86678A69034
$$ -186116 -131558 -252330 -361333 47621 -78821 81621 87135 -134525 -144389 -331067 169034
9657A72653K90734b76979K2996F2568K00117M4471a97075A64873D7810b0445l1732
$$ 172653 463387 -276979 -253983 62568 262685 307156 -197075 164873 47810 -20445 -52177
9646e2177m8825o1314e2005r0804b7768m8850F7371B1889b35891B38580a4420
$$ -52177 -101002 -162316 -52005 -142809 -27768 -76618 67371 21889 -235891 238580 -14420
9634H709b59373j9885j3741J09606m8845I6546C4355d18380E401P705J49271f6074
$$ 8709 -259373 -279258 -292999 -183393 -232238 96546 34355 -418380 5401 13106 162377 -66074
9621A10460l1872c36987E6067J51441E2072b6467A61375C2342b07085m3041J02350
$$ 110460 78588 -336987 56067 207508 52072 -26467 161375 32342 -207085 -250126 -147776
9610a47776k64973A22022c62336A46559b81863C42644j7776g0933j04071P7385
$$ -147776 -412749 122022 -362336 146559 -281863 342644 324868 -70933 -175004 -97619
9600i7619A30847f3455B29848a36304j32874A40172b6014n3631L2330k82879a1477
$$ -97619 130847 -63455 229848 -136304 -269178 140172 -26014 -79645 -47315 -330194 -11477
9588C5459b37542p8292J12800A06380a13577A54671e61176C43515a43776c2297
$$ 35459 -237542 -315834 -203034 106380 -113577 154671 -561176 343515 -143776 -32297
9577d1206o863j40877k9565a2669l11489A2423a95818A85395c102H8431B9471
$$ -41206 -48069 -188946 -218511 -12669 -324158 12423 -195818 185395 -3102 88431 29471
9565g9047a1554q0768b5834k42790C8045b05424A43080c12352B5388b43310k5012
$$ -79047 -11554 -92322 -25834 -268624 38045 -205424 143080 -312352 25388 -243310 -268322
9554b68322h8193J6287c0949k6621D6172B0425a7471l87452E1126A4227d626A44381
$$ -268322 -88193 -71906 -30949 -57570 46172 20425 -17471 -404923 51126 14227 -4626 144381
9541a05337B52213a74860A71195E3905K296e0810q6509N3114n206j57083c2804
$$ -105337 252213 -174860 171195 53905 56201 -50810 -137319 -84205 -89411 -246494 -32804
9529e9345p0731C5004a96309J843R6260i923l66598J78654Q9776l23714a47113
$$ -59345 -130076 35004 -196309 -194466 -98206 -9923 -376521 -197867 -108091 -431805 -147113
9517a89687L1960n3880g8496j52722j5852Q5944N8638j80502Q2708f9737J7035
$$ -189687 -157727 -211607 -78496 -231218 -247070 -161126 -102488 -282990 -200282 -69737 -52702
9506e2702r0316I7880J30365a8889k38338G0586b64751M2441g4375k47795D9226
$$ -52702 -143018 97880 228245 -18889 -257227 70586 -264751 -222310 -74375 -322170 49226
9494b506B03536f1940j83682A99291f749j72183B7939e9264B8768P3516e3573
$$ -2506 203536 -61940 -245622 199291 -6749 -178932 27939 -59264 28768 102284 -53573
9482G9750M0134A6627j836a51101c8874A41917a84712M4780j44161a25706j27324
$$ 79750 119884 16627 14791 -151101 -38874 141917 -184712 -139932 -284093 -125706 -253030
9471b53030A86901a69820K7368L3742A72964c43497a30771o4667d4243e702l01846
$$ -253030 186901 -169820 -142452 -108710 172964 -343497 -130771 -195438 -44243 -5702 -307548
9460c07548a34113A45727E8274k4093a62665A16504A2443M8541b0197r4522j22425
$$ -307548 -134113 145727 58274 34181 -162665 116504 12443 60984 -20197 -114719 -237144
9449b37144A89688e2006b1050k5919E6434A2648g3458A47718m5279b17889f2847
$$ -237144 189688 -52006 -21050 -46969 56434 12648 -73458 147718 102439 -217889 -62847
9437f8246l62206i2798b022E8289d1688B9022a59222I8564B9919K4583a35736
$$ -68246 -430452 -92798 -2022 58289 -41688 29022 -159222 98564 29919 54502 -135736
9425A55759e097n104p9018G8052a33212F5754a75109D75b1905A22467a55422A55652
$$ 155759 -5097 -10201 -89219 78052 -133212 65754 -175109 475 -21905 122467 -155422 155652
9412i4805l1936B36354d1467l73113h2601B61357b54868P3099O1975b0798k74454
$$ -94805 -126741 236354 -41467 -414580 -82601 261357 -254868 -181769 -119794 -20798 -295252
9401b95252j18370g9938H2021b26554J7250g9047o7233m9214k8878C594b96346
$$ -295252 -413622 -79938 82021 -226554 -209304 -79047 -146280 -195494 -224372 3594 -296346
9389B6231a29282j82637f7863A69176H753b65204i6883o9439A18872J94688A53720
$$ 26231 -129282 -311919 -67863 169176 8753 -265204 -96883 -166322 118872 313560 153720
9377A93340d5255A82144b31158A79999a13889p6201P9893A2110N5080j0374j6432
$$ 193340 -45255 182144 -231158 179999 -113889 -190090 -110197 12110 67190 56816 40384
9366D0384b53904R0747f6603j43018M0284K4336d6934j79977G3883b43811j831
$$ 40384 -253904 -163157 -66603 -209621 -169337 -145001 -46934 -226911 73883 -243811 -245642
9355b45642k8281a8414D11986A3515B825c9652j35411A48437a62802K6670b7909
$$ -245642 -273923 -18414 411986 13515 2825 -39652 -175063 148437 -162802 -136132 -27909
9343G246J3549f1604F6600g5631k14417H1739a4185o9089o1323b9292l5592k37083
$$ 7246 20795 -61604 66600 -75631 -290048 81739 -14185 -83274 -144597 -29292 -64884 -301967
9331c01967L0762A35974c5670j74565O6012k65529A04128P2981i3672m0782b2340
$$ -301967 -271205 135974 -35670 -210235 -144223 -409752 104128 177109 -93672 -134454 -22340
9319b345C92277a21997o1458O7350F0593M4880a59059o814c1409E4077f6273b8160
$$ -2345 392277 -121997 -183455 -116105 60593 105473 -159059 -165873 -31409 54077 -66273 -28160
9306b27768g6607m7462j10309f3728G3205a12845p930k6114A629b12526N932j66005
$$ -227768 -76607 -124069 -234378 -63728 73205 -112845 -120775 -146889 1629 -212526 -206594 -372599
9294c72599r713B91973a43025E18873a37624j34708A92331b42940B02550a15941
$$ -372599 -382312 291973 -143025 518873 -137624 -272332 192331 -242940 202550 -115941
9283b3480A09931c2664C9199a83563k76998h3914m37506D1959J04465L3241a18341
$$ -23480 109931 -32664 39199 -183563 -460561 -83914 -521420 41959 146424 179665 -118341
9271C25643b54018N8684A48642b22150Q8387Q135E8023E677b24258C1731P1546
$$ 325643 -254018 -195334 148642 -222150 -133763 -125628 58023 5677 -224258 31731 103277
9260A03277c10605M6433C01096g294A48902H692e9135a6172p3492o1551N634A02222
$$ 103277 -310605 -264172 301096 -7294 148902 8692 -59135 -16172 -89664 -151215 -145581 102222
9247i4756J8818J951D1208a39893n1822M5115C849a14697d2726c169N49k19671
$$ -94756 -75938 -73987 41208 -139893 -191715 -146600 3849 -114697 -42726 -3169 -2620 -222291
9235b22291A45943a08373q8275A90875e5007A3367b05859D42761B0551c85111
$$ -222291 145943 -108373 -196648 190875 -55007 13367 -205859 442761 20551 -385111
9224B26129A9550b07917a03865j10288Q5545k06265B17438b61561B86395b8225
$$ 226129 19550 -207917 -103865 -214153 -128608 -334873 217438 -261561 286395 -28225
9213a92051A74065g7273l1689l0583E9307e8197B34730e2632A60676o4144h6503
$$ -192051 174065 -77273 -108962 -139545 59307 -58197 234730 -52632 160676 96532 -86503
9201a32673j20A14275d5240j03990B98521b97415a37459B1097p323P6272R9710
$$ -132673 -132793 114275 -45240 -149230 298521 -297415 -137459 21097 13774 90046 189756
9190A89756d23824c0418j44725l70436g6871B31276l1802a22189B1185R4607k1673
$$ 189756 -423824 -30418 -175143 -545579 -76871 231276 199474 -122189 21185 115792 94119
9179I4119i6596C04901j49017a28245a7491B20355j03158g2058A66311a56501
$$ 94119 -96596 304901 155884 -128245 -17491 220355 117197 -72058 166311 -156501
9168c1595C995a22158l3920K24O5893j17116M1292h0705D20180g2264F853a19697
$$ -31595 3995 -122158 -156078 -155854 -89961 -207077 -165785 -80705 420180 -72264 6853 -119697
9155C6097f4375j69606g7115n7847M5802r0117A9312J17081n148J4509a1507k84953
$$ 36097 -64375 -233981 -77115 -134962 -89160 -179277 19312 136393 131245 145754 -11507 -296460
9143b96460A50226D8874M6702b33228e1720k96174B21502c24972a17532H1371
$$ -296460 150226 48874 95576 -233228 -51720 -347894 221502 -324972 -117532 81371
9132c03690A43704e1866A16366g3629a6168F4181K11970J382a52007A34952n9828
$$ -303690 143704 -51866 116366 -73629 -16168 64181 276151 277533 -152007 134952 75124
9121G5124c1013k10547P1376f4704m8057j43606a7367I2560a81068K209j59971
$$ 75124 -31013 -241560 -170184 -64704 -112761 -256367 -17367 92560 -181068 -178859 -338830
9110c38830F0665a07139M2080m90155J25813i029j76275h4599k70895J38043a04849
$$ -338830 60665 -107139 -65059 -555214 -429401 -9029 -185304 -84599 -355494 -217451 -104849
9098D593a64465q8427k6874L2016a3528k45547A06690R6009b61484g3796l90163
$$ 4593 -164465 -252892 -279766 -247750 -13528 -259075 106690 202699 -261484 -73796 -463959
9087d63959b2610D3035H004a30347A38015G43a32309B17447n3324c38121c0687
$$ -463959 -22610 43035 8004 -130347 138015 743 -132309 217447 164123 -338121 -30687
9075h7548q4148N1017H0387b37313a08396p8714l4984A06484a6423B04738b90933
$$ -87548 -171696 -120679 80387 -237313 -108396 -187110 -222094 106484 -16423 204738 -290933
9063c51069g5724D39293a96800O4267j40877F2401d8605C4200J91347C0757K3070
$$ -351069 -75724 439293 -196800 -132533 -273410 62401 -48605 34200 225547 30757 53827
9052E3827A7066h1480B2397J03557D6426c12600B7569J5110J57232g3928G740
$$ 53827 17066 -81480 22397 125954 46426 -312600 27569 42679 199911 -73928 7740
9040A62687a73946C67741g0661j30624M7698J397E8738h7687j97088a16443j16815
$$ 162687 -173946 367741 -70661 -201285 -153587 -152190 58738 -87687 -284775 -116443 -233258
9029b33258c4461j35862r3944d4245B1744K066G882c01891G053d74135a19151
$$ -233258 -34461 -170323 -264267 -44245 21744 23810 7882 -301891 7053 -474135 -119151
9017c60062a25147A64538E6g225C9137c4796B21858b21721B70645b13778O9108
$$ -360062 -125147 164538 56 -7225 39137 -34796 221858 -221721 270645 -213778 -144670
9006a44670j27871b6341k5274I7408N1950b01479I1163e14802K08964O1415J21947
$$ -144670 -272541 -26341 -51615 97408 149358 -201479 91163 -514802 -305838 -244423 -122476
8995a22476D1085a59059j07869a33256j24371b1864l41839B3965R7950B9243J2893
$$ -122476 41085 -159059 -266928 -133256 -257627 -21864 -363703 23965 121915 29243 42136
8984D2136L2514B2549a42192G7148J27482a52309O7785B23876k9631b29495l074
$$ 42136 74650 22549 -142192 77148 204630 -152309 -84524 223876 194245 -229495 -232569
8973b32569o9006k118j44879i2416j2534A10127P0001e211C03240A9946O64a68009
$$ -232569 -301575 -303693 -448572 -92416 -104950 110127 180128 -5211 303240 19946 20610 -168009
8960A20314a97487R6539d5859l4380j88456i5915J8338j40803Q0691r8072C24832
$$ 120314 -197487 -100948 -45859 -80239 -268695 -95915 -77577 -218380 -137689 -235761 324832
8948e3725I2887B0378i0415l6628l97108o3871a53102K7241A72166c37950a946
$$ -53725 92887 20378 -90415 -127043 -524151 -588022 -153102 -125861 172166 -337950 -1946
8936e5764B36155g4646j04078e0567N081A36905A1771P6015a5250p8701f192l39342
$$ -55764 236155 -74646 -178724 -50567 -45486 136905 11771 87786 -15250 -93951 -6192 -345534
8924c45534A08112a76413C2243J89293e554A55851L26634Q14314E55735B65912
$$ -345534 108112 -176413 32243 221536 -5554 155851 482485 1296799 555735 265912
8913b30833b2381l47687J14276a26761A23513D2364a28611L43I274a05541B33594
$$ -230833 -22381 -370068 -255792 -126761 123513 42364 -128611 -128268 9274 -105541 233594
8901a49369J3264A9749c7161j15173E3559a68229r4443g2526L2572k89197d513
$$ -149369 -136105 19749 -37161 -152334 53559 -168229 -262672 -72526 -39954 -329151 -4513
8889f5296A00317a89152A6251J03770N8074b1364A15728J11996O7276g7669j98069
$$ -65296 100317 -189152 16251 120021 178095 -21364 115728 227724 295000 -77669 -275738
8878b75738K1311O9415L5280j4936B76585A10770R4038F6607A9528K44922j15243
$$ -275738 -254427 -185012 -149732 -164668 276585 110770 204808 66607 19528 264450 149207
8867A49207k2612a246p2595k04004d6877n6694B2487b62566l6837M5538Q2333
$$ 149207 126595 -1246 -73841 -277845 -46877 -103571 22487 -262566 -299403 -253865 -171532
8856a71532d4033J7113f875E8260a3203b567n7236D8174k1247J1410e9265l50300
$$ -171532 -44033 -26920 -6875 58260 -13203 -2567 -59803 48174 26927 38337 -59265 -409565
$$ [...]
##END NTUPLES=NMR SPECTRUM
##END=
