##TITLE=NES1018_872015066_9266120_aT6socKug7
##JCAMPDX= 6.0         $$ Bruker NMR JCAMP-DX V2.0
##DATA TYPE= NMR SPECTRUM
##DATA CLASS= NTUPLES
##ORIGIN= BRUKER
##OWNER= Administrator
$$ 1.72 TOPSPIN		Version 2.1
$$ 2015-07-09 23:38:30.363 -0700  Administrator@X
$$ Compression mode = diff/dup
##.OBSERVE FREQUENCY= 400.02188249412
##.OBSERVE NUCLEUS= ^1H
##.ACQUISITION MODE= SIMULTANEOUS (DQD)
##.ACQUISITION SCHEME= undefined
##.AVERAGES= 64
##.DIGITISER RES= 22
##SPECTROMETER/DATA SYSTEM= spect
##.PULSE SEQUENCE= noesygpps1d.comp
##.SOLVENT NAME= COFFEE_meoh
##.SHIFT REFERENCE= INTERNAL, COFFEE_meoh, 1, 14.96301
##AUDIT TRAIL= $$ (NUMBER, WHEN, WHO, WHERE, PROCESS, VERSION, WHAT)
$$ ##TITLE= Audit trail, TOPSPIN		Version 2.1
$$ ##JCAMPDX= 5.01
$$ ##ORIGIN= Bruker BioSpin GmbH
$$ ##OWNER= Administrator
$$ $$ E:\/data/COFFEE/nmr/NES1018_872015066_9266120_aT6socKug7/12/pdata/1/auditp.txt
$$ ##AUDIT TRAIL=  $$ (NUMBER, WHEN, WHO, WHERE, PROCESS, VERSION, WHAT)
(   1,<2015-07-09 23:38:25.285 -0700>,<Administrator>,<X>,<go>,<TOPSPIN 2.1>,
      <created by zg
	started at 2015-07-09 23:26:55.535 -0700,
	POWCHK enabled, PULCHK disabled,
       configuration hash MD5:
       21 0F 79 D6 B3 7B B4 F6 88 20 88 DB 03 48 BD 9F
       data hash MD5: 64K
       F0 58 04 73 49 85 4A FB AF 8A 21 BB 66 D4 C5 99>)
(   2,<2015-07-09 23:38:28.535 -0700>,<Administrator>,<X>,<proc1d>,<TOPSPIN 2.1>,
      <Start of raw data processing
       efp LB = 0.3 FT_mod = 6 PKNL = 1 PHC0 = 0 PHC1 = 0 SI = 128K 
       data hash MD5: 128K
       FC 80 91 95 4D 08 FB 48 37 29 1B F7 F0 D2 B7 8B>)
(   3,<2015-07-09 23:38:29.425 -0700>,<Administrator>,<X>,<proc1d>,<TOPSPIN 2.1>,
      <pk PHC0 = -88.62671 PHC1 = 0 
       data hash MD5: 128K
       49 25 60 7A 37 BB 11 12 F9 42 4B FB 3B 20 C5 45>)
(   4,<2015-07-09 23:38:29.847 -0700>,<Administrator>,<X>,<proc1d>,<TOPSPIN 2.1>,
      <abs ABSG = 1 
       data hash MD5: 128K
       9C DC 33 11 A2 3F 5B A9 0C 00 D0 03 DF 39 70 CD>)
(   5,<2015-07-09 23:38:29.941 -0700>,<Administrator>,<X>,<proc1d>,<TOPSPIN 2.1>,
      <abs ABSG = 2 
       data hash MD5: 128K
       6F 6A 24 4A D1 FA 84 EA 11 D2 0F 48 7F 18 03 C2>)
(   6,<2015-07-09 23:38:30.035 -0700>,<Administrator>,<X>,<proc1d>,<TOPSPIN 2.1>,
      <abs ABSG = 3 
       data hash MD5: 128K
       40 DB D2 49 29 56 53 D7 85 F3 77 B1 12 66 C0 60>)
(   7,<2015-07-09 23:38:30.128 -0700>,<Administrator>,<X>,<proc1d>,<TOPSPIN 2.1>,
      <abs ABSG = 4 
       data hash MD5: 128K
       51 4E 1C 52 CD 3D A4 C2 14 CD 97 0E 45 16 15 6F>)
(   8,<2015-07-09 23:38:30.206 -0700>,<Administrator>,<X>,<proc1d>,<TOPSPIN 2.1>,
      <abs ABSG = 5 
       data hash MD5: 128K
       8B 4E 6D FE 5D 3D 67 21 11 6B 37 44 5F 80 CF 84>)
$$ ##END=
$$ 
$$ $$ hash MD5
$$ $$ 34 FB EA 20 9A 50 16 FD D5 88 0C D6 22 6A C6 DF
##$RELAX= 
##$RELAX= 
##$RELAX= 
##$RELAX= 
##$RELAX= 
##$RELAX= 
##$RELAX= 
##$RELAX= 
$$ Bruker specific parameters
$$ --------------------------
##$DU= <E:\>
##$EXPNO= 12
$$ [...]
##$TP07= 0
##$TPNAME0= <>
##$TPNAME1= <>
##$TPNAME2= <>
##$TPNAME3= <>
##$TPNAME4= <>
##$TPNAME5= <>
##$TPNAME6= <>
##$TPNAME7= <>
##$TPOAL= (0..7)
0.5 0.5 0.5 0.5 0.5 0.5 0.5 0.5
##$TPOFFS= (0..7)
0 0 0 0 0 0 0 0
##$TUNHIN= 0
##$TUNHOUT= 0
##$TUNXOUT= 0
##$USERA1= <user>
##$USERA2= <user>
##$USERA3= <user>
##$USERA4= <user>
##$USERA5= <user>
##$V9= 5
##$VALIST= <valist>
##$VCLIST= <CCCCCCCCCCCCCCC>
##$VD= 0
##$VDLIST= <DDDDDDDDDDDDDDD>
##$VPLIST= <PPPPPPPPPPPPPPP>
##$VTLIST= <TTTTTTTTTTTTTTT>
##$WBST= 2048
##$WBSW= 25
##$XGAIN= (0..3)
0 0 0 0
##$XL= 0
##$YL= 0
##$YMAX_a= 5740527
##$YMIN_a= -11140830
##$ZGOPTNS= <>
##$ZL1= 120
##$ZL2= 120
##$ZL3= 120
##$ZL4= 120
##$ABSF1= 14.96301
##$ABSF2= -5.595172
##$ABSG= 5
##$ABSL= 3
##$ALPHA= 0
##$AQORDER= 0
##$ASSFAC= 0
##$ASSFACI= 0
##$ASSFACX= 0
##$ASSWID= 0
##$AUNMP= <proc_prof1d_extract.lims>
##$AXLEFT= 0
##$AXNAME= <>
##$AXNUC= <1H>
##$AXRIGHT= 0
##$AXTYPE= 0
##$AXUNIT= <>
##$AZFE= 0.1
##$AZFW= 0.1
##$BCFW= 0
##$BC_mod= 0
##$BYTORDP= 0
##$COROFFS= 0
##$CY= 15
##$DATMOD= 1
##$DC= 0
##$DFILT= <>
##$DTYPP= 0
##$F1P= 0
##$F2P= 0
##$FCOR= 0.5
##$FTSIZE= 131072
##$FT_mod= 6
##$GAMMA= 0
##$GB= 0
##$INTBC= 1
##$INTSCL= 1
##$ISEN= 128
##$LB= 0.3
##$LEV0= 0
##$LPBIN= 0
##$MAXI= 10000
##$MC2= 0
##$MEAN= 0
##$ME_mod= 0
##$MI= 0
##$NCOEF= 0
##$NC_proc= -2
##$NLEV= 6
##$NOISF1= 0
##$NOISF2= 0
##$NSP= 0
##$NTH_PI= 0
##$NZP= 0
##$OFFSET= 14.96301
##$PC= 1
##$PHC0= -88.62671
##$PHC1= 0
##$PH_mod= 1
##$PKNL= yes
##$PPARMOD= 0
##$PPDIAG= 0
##$PPIPTYP= 0
##$PPMPNUM= 2147483647
##$PPRESOL= 1
##$PSCAL= 4
##$PSIGN= 0
##$PYNMP= <proc.py>
##$REVERSE= no
##$SF= 400.020008832856
##$SI= 131072
##$SIGF1= 0
##$SIGF2= 0
##$SINO= 400
##$SIOLD= 131072
##$SPECTYP= <>
##$SREGLST= <1H.CDCl3>
##$SSB= 0
##$STSI= 131072
##$STSR= 0
##$SW_p= 8223.68421052631
##$SYMM= 0
##$S_DEV= 0
##$TDeff= 65536
##$TDoff= 0
##$TI= <>
##$TILT= no
##$TM1= 0
##$TM2= 0
##$TOPLEV= 0
##$USERP1= <user>
##$USERP2= <user>
##$USERP3= <user>
##$USERP4= <user>
##$USERP5= <user>
##$WDW= 1
##$XDIM= 131072
##$YMAX_p= 332932595
##$YMIN_p= -11018
##$CURPLOT= <Network HP LaserJet P1505>
##$CURPRIN= <$Network HP LaserJet P1505>
##$DFORMAT= <normdp>
##$LAYOUT= <+/1D_H.xwp>
##$LFORMAT= <normlp>
##$PFORMAT= <normpl>
##$SURQMSG= 1
$$ End of Bruker specific parameters
$$ ---------------------------------
##NTUPLES= NMR SPECTRUM
##VAR_NAME=  FREQUENCY,     SPECTRUM/REAL,   SPECTRUM/IMAG
##SYMBOL=    X,             R,               I
##VAR_TYPE=  INDEPENDENT,   DEPENDENT,       DEPENDENT
##VAR_FORM=  AFFN,          ASDF,            ASDF
##VAR_DIM=   131072,        131072,          131072
##UNITS=     HZ,            ARBITRARY UNITS, ARBITRARY UNITS
##FACTOR=    0.0627417313425164, 1,          1
##FIRST=     8223.62146879497, 1908,         -36364
##LAST=      0,             3746,            -35687
##MIN=       0,             -11018,          0
##MAX=       8223.62146879497, 332932595,    0
$$ Real data points
##PAGE= N=1
##DATA TABLE= (X++(R..R)), XYDATA
$$ [...]
61097F99388k707l442m317n086n339n024m396l711l144k850k860k988k945k568
61083F48011j938j339r68o68p5Q33J624K010K237K584K831K749K752L445M671
61068F68759N753O548P477Q512Q966Q571P963P796P969Q102Q148Q164Q081Q033
61054G78842Q367Q898Q773P673O519O464P526Q855R945J0907J1870J2810J3964
61041I01413J5693J7898K0028K1813K3667K6269K9805L3708L7137L9916M2838
61030A210185M6667N0966N4600N7402O0414O4157O7679P0154P2621P7132Q4560
61019A916537R4206J05241J17397J30338J43506J57068J72535J92069K17450K49836
61009C496183K90448L41606M06974M90173N93003P15925Q60302J028861J223757
$$ y = [699388, 696681, 693239, 688922, 683836, 678497, 673473, 669077, 665366, 662222, 659372, 656512, 653524, 650579, 648011, 646073, 644734, 643766, 643098, 643023, 643856, 645480, 647490, 649727, 652311, 655142, 657891, 660643, 664088, 668759, 674512, 681060, 688537, 697049, 706015, 714586, 722549, 730345, 738314, 746416, 754564, 762728, 770809, 778842, 787209, 796107, 804880, 812553, 819072, 825536, 833062, 841917, 851862, 862769, 874639, 887449, 901413, 917106, 935004, 955032, 976845, 1000512, 1026781, 1056586, 1090294, 1127431, 1167347, 1210185, 1256852, 1307818, 1362418, 1419820, 1480234, 1544391, 1612070, 1682224, 1754845, 1831977, 1916537, 2010743, 2115984, 2233381, 2363719, 2507225, 2664293, 2836828, 3028897, 3246347, 3496183, 3786631, 4128237, 4535211, 5025384, 5618387, 6334312, 7194614, 8223475, 9447232]
61000I447232J446223J696910J966506K213817K353745K286143J961223J429826
60992B4801625Q28433L08159l1695j61075j02358P9848K75769L47974J88588k17340
60982B6317928p78184j347633j800357k076523k177944k139261k003364j810152
60974A2184510j592429j373682j167993r82584q20752o83300n68921m74895l98232
60965D121722l36443k87355k48512k17243j91505j70394j53457j39652j27439
60956B249722j15821j04849r5011q6514p9269p3150o7999o3627n9983n7041n4430
60945A392028n1435m7540m2894l8083l3687k9956k6746k3712k0805j8504j7268
60934A041398j6788j6216j5123j3830j2729j1829j1112j0747j0668j0450r926
$$ y = [9447232, 10893455, 12590365, 14556871, 16770688, 19124433, 21410576, 23371799, 24801625, 25630058, 25938217, 25906522, 25745447, 25643089, 25722937, 25998706, 26346680, 26535268, 26317928, 25539744, 24192111, 22391754, 20315231, 18137287, 15998026, 13994662, 12184510, 10592081, 9218399, 8050406, 7067822, 6247070, 5563770, 4994849, 4519954, 4121722, 3785279, 3497924, 3249412, 3032169, 2840664, 2670270, 2516813, 2377161, 2249722, 2133901, 2029052, 1934041, 1847527, 1768258, 1695108, 1627109, 1563482, 1503499, 1446458, 1392028, 1340593, 1293053, 1250159, 1212076, 1178389, 1148433, 1121687, 1097975, 1077170, 1058666, 1041398, 1024610, 1008394, 993271, 979441, 966712, 954883, 943771, 933024, 922356, 911906, 901980]
60923I01980r505r513r659r618r730j0526j1756j2525j2289j1334j0280r521r146
60910G66578r033q991r014r289r765r950r533q990r028r506r499q548p224o265
60896F41943n673n074m538m478m840m959m315l141k070j405q90j13J029K272L275
60881F07023L844L910L459K542J407M49p5k30k89m03m56k58K00P25J120J343J500
60864F25811J789K391L235L894L838K902J403k20j693k707k808j868n59P1m25
60849F35054j651l124m910p189r586j1339j2117j2300j2352j2209j1443r908q007
60836E18919o320n133m339l746l282k941k611k142j552j116j100j444j694j364
60822D80135m49M80P64L21l12n31k12L43Q11J084J258J504J964K626L267L572
$$ y = [901980, 892475, 882962, 873303, 863685, 853955, 843429, 831673, 819148, 806859, 795525, 785245, 775724, 766578, 757545, 748554, 739540, 730251, 720486, 710536, 701003, 692013, 682985, 673479, 663980, 655432, 648208, 641943, 636270, 631196, 626658, 622180, 617340, 612381, 608066, 604925, 602855, 601450, 600560, 600447, 601476, 603748, 607023, 610867, 614777, 618236, 620778, 622185, 622634, 622559, 622329, 622040, 621637, 621181, 620923, 621123, 621848, 622968, 624311, 625811, 627600, 629991, 633226, 637120, 640958, 643860, 645263, 645043, 643350, 640643, 637835, 635967, 635408, 635479, 635054, 633403, 630279, 625369, 618180, 608594, 597255, 585138, 572838, 560486, 548277, 536834, 526926, 518919, 512599, 507466, 503127, 499381, 496099, 493158, 490547, 488405, 486853, 485737, 484637, 483193, 481499, 480135, 479686, 480166, 480930, 481251, 480939, 480408, 480196, 480539, 481350, 482434, 483692, 485196, 487160, 489786, 493053, 496625]
60806D96625L326K580J703J205J269J554J647J614J784K044J861J093L36R7O0
60791E18798m24j431k422k930k892k549k303k498k956l039k473j843j808k187
60777D87043k367k312k449k771k771k300j833j769k057k505k903k860k137j190
60763D54819p16p02n18J6M93Q12J335J921J893J291J154J936K596K030O76k01
60747D68835j83K10N68P90N70k76j151j229n81pJ53K44L56P4p51j624k142k398
60729D61458k536k411k090k157l060m424n356n403m934m620m688m772m513m116
60715D06378m096m506m801m637m347m339m385l974l095k193j548j119q40o14k06
60700C61678M66J037J152J006R73R72Q02Q44J693L074L943L778L115K661K458
$$ y = [496625, 499951, 502531, 504234, 505439, 506708, 508262, 509909, 511523, 513307, 515351, 517212, 518305, 518641, 518738, 518798, 518374, 516943, 514521, 511591, 508699, 506150, 503847, 501349, 498393, 495354, 492881, 491038, 489230, 487043, 484676, 482364, 479915, 477144, 474373, 472073, 470240, 468471, 466414, 463909, 461006, 458146, 456009, 454819, 454103, 453401, 452883, 452899, 453392, 454204, 455539, 457460, 459353, 460644, 461798, 463734, 466330, 468360, 469036, 468835, 468652, 468862, 469430, 470220, 470790, 470514, 469363, 468134, 467553, 467546, 467699, 467943, 468299, 468373, 467622, 465998, 463856, 461458, 458922, 456511, 454421, 452264, 449204, 444780, 439424, 434021, 429087, 424467, 419779, 415007, 410494, 406378, 402282, 397776, 392975, 388338, 383991, 379652, 375267, 371293, 368198, 366005, 364457, 363338, 362498, 361884, 361678, 362144, 363181, 364333, 365339, 366312, 367284, 368086, 368930, 370623, 373697, 377640, 381418, 384533, 387194, 389652]
60685C89652K226J923J655J468J489J901K585L163L533L898M164L816K741J644
60671D25858J273J564J906J968J883J913K238K878L489L566L131K929L516M423
60657D62535M641L797K398J081Q2n65q63j127j994l687n488o315n941n247n126
60642D38181n391n171m259l435l254l205k571j682j498k098k473k000j288j238
60628C98618j825k380k534k379j980j365q45q46j380k028k390k293j737j001o32
60613C73003r25j393j250m18L54M89K72K70N02O00N26O47J070J416J367J063P81
60596C78374N27L01L97R84J564J484R01N84P10N41k95j021p40L01J200J647J896
60579C89355J867J284N74O01J393K056K137K156K475K590K079J443J411J927K470
$$ y = [389652, 391878, 393801, 395456, 396924, 398413, 400314, 402899, 406062, 409595, 413493, 417657, 421473, 424214, 425858, 427131, 428695, 430601, 432569, 434452, 436365, 438603, 441481, 444970, 448536, 451667, 454596, 458112, 462535, 467176, 470973, 473371, 474452, 474534, 473969, 473106, 471979, 469985, 466298, 460810, 454495, 448554, 443307, 438181, 432790, 427619, 423360, 419925, 416671, 413466, 410895, 409213, 407715, 405617, 403144, 401144, 399856, 398618, 396793, 394413, 391879, 389500, 387520, 386155, 385310, 384464, 383084, 381056, 378666, 376373, 374636, 373635, 373003, 372078, 370685, 369435, 369017, 369371, 369860, 370132, 370402, 370904, 371504, 372030, 372677, 373747, 375163, 376530, 377593, 378374, 378901, 379202, 379599, 380583, 382147, 383631, 384532, 385116, 385826, 386367, 386072, 385051, 384311, 384612, 385812, 387459, 389355, 391222, 392506, 393080, 393681, 395074, 397130, 399267, 401423, 403898, 406488, 408567, 410010, 411421, 413348, 415818]
60564D15818K794K808K232J082Q6n0M91J104J704K586L639M478N169O072P128
60549D57141Q012Q928J0474J2717J5091J7340J9843K2910K6426L0396L5104M0377
60537G04759M5289M9013N1497N2819N2331M8948M2145L2264K0046O366p641k0568
60525A077268l1119l8474m2452m3536m2580m0313l7045l2954k8462k4131k0195
60514F96007j6429j2540q570m831j480J707N066Q577J1935J5186J9042K4183L0325
60501G68178L6312M1266M5269M8730N1310N1822M9132M2999L4074K3448J2290
60490A204830J763p031j3234j6369j6274j2933o543K206J2126K2055L1386M0037
60478A242019M7850N4085N7365N6141M9459L7552K1658L238j6449l5958n3376
$$ y = [415818, 418612, 421420, 423652, 424734, 424820, 424770, 425261, 426365, 428069, 430655, 434294, 438772, 443941, 450013, 457141, 465153, 474081, 484555, 497272, 512363, 529703, 549546, 572456, 598882, 629278, 664382, 704759, 750048, 799061, 850558, 903377, 955708, 1004656, 1046801, 1079065, 1099111, 1105477, 1097836, 1077268, 1046149, 1007675, 965223, 921687, 879107, 838794, 801749, 768795, 740333, 716202, 696007, 679578, 667038, 658468, 653637, 652157, 653864, 658930, 667507, 679442, 694628, 713670, 737853, 768178, 804490, 845756, 891025, 939755, 991065, 1042887, 1092019, 1135018, 1169092, 1192540, 1204830, 1206593, 1199562, 1186328, 1169959, 1153685, 1140752, 1134209, 1136415, 1148541, 1170596, 1201982, 1242019, 1289869, 1343954, 1401319, 1457460, 1506919, 1544471, 1566129, 1569367, 1552918, 1516960, 1463584]
60467A463584o6995p6170q1149q2242p9811p4952o9331o3905n8265n1715m4617
60456G14432l8218l3340k9685k6339k2698j8871j5475j3013j1346r809q007o190
60444D81441m781l777k922k245j964k010k032j815j346n83M22J184J163N49K16
60429D61500O26J204J108K29r25j966k792l188k876k001j109n08J8P96J835K963
60413D54914M041M930N396N399N300N566O357P495Q740R836J0434J0302R721R448
60399E57879J0078J1510J3053J4047J4281J3931J3159J1879R967P671N669M522
60387F87646M133L823L050J985J320J513K221K524J871P80L68J009J712J184o11
60372G14528k367k952k563k173k246k443k372k099j810j430q68l75l42p55j132
$$ y = [1463584, 1396589, 1320419, 1239270, 1157028, 1077217, 1002265, 932934, 869029, 810764, 759049, 714432, 676214, 642874, 613189, 586850, 564152, 545281, 529806, 516793, 505447, 495638, 487631, 481441, 476660, 472883, 469961, 467716, 465752, 463742, 461710, 459895, 458549, 457966, 458388, 459572, 460735, 461284, 461500, 462126, 463330, 464438, 464667, 463742, 461776, 458984, 455796, 452920, 450919, 449810, 449302, 449320, 450116, 451951, 454914, 458955, 463885, 469281, 474680, 479980, 485546, 491903, 499398, 508138, 517974, 528408, 538710, 548431, 557879, 567957, 579467, 592520, 606567, 620848, 634779, 647938, 659817, 669784, 677455, 683124, 687646, 691779, 695602, 698652, 700637, 701957, 703470, 705691, 708215, 710086, 710866, 711234, 712243, 713955, 715139, 714528, 712161, 709209, 706646, 704473, 702227, 699784, 697412, 695313, 693503, 692073, 691205, 690830, 690488, 689733, 688601]
60357F88601j129r52j021j341j488j217p71n17m82n37p90j525k706l874m523m531
60341F61197m246m188m562m899m477l280k283k309k953l164k776k602l034l452
60327F12972l364l254l742m552n014n038m930m650m116l837m312m987m751l532
60313E52893k491k413k752k599j834q97j7Q21J618K474L644N110O459P458Q357
60298E75831R183R259P977N747L564J842J87j790m031o236p990q699p989o319
60284E70536m716l750l121k291j102L06J707K742L073K903K968L730M871N862
60270E83718O697P657Q604R115R205R417J0079J0954J1744J2596J3824J5336J6687
60257G25633J7477J7544J6870J5567J3911J2237J0781R771R489J0008J0887J1478
$$ y = [688601, 687472, 686520, 685499, 684158, 682670, 681453, 680682, 680165, 679683, 679146, 678356, 676831, 674125, 670251, 665728, 661197, 656951, 652763, 648201, 643302, 638825, 635545, 633262, 630953, 628000, 624836, 622060, 619458, 616424, 612972, 609608, 606354, 602612, 598060, 593046, 588008, 583078, 578428, 574312, 570475, 566163, 561176, 556425, 552893, 550402, 547989, 545237, 542638, 540804, 539907, 539890, 540711, 542329, 544803, 548447, 553557, 560016, 567474, 575831, 585014, 594273, 602250, 607997, 611561, 613403, 613590, 611800, 607769, 601533, 593543, 584844, 576855, 570536, 565820, 562070, 558949, 556658, 555556, 555862, 557569, 560311, 563384, 566287, 569255, 572985, 577856, 583718, 590415, 598072, 606676, 615791, 624996, 634413, 644492, 655446, 667190, 679786, 693610, 708946, 725633, 743110, 760654, 777524, 793091, 807002, 819239, 830020, 839791, 849280, 859288, 870175, 881653]
60245H81653J1620J1905J3087J5285J7856K0079K1922K4130K7397L1439L5144
60234A111517L7821M0003M2667M5947M9206N2310N5968O0525O5121O8626P0884
60223A700595P2382P3071P2363P0144O6990O3272N8799N3528M7917M2152L5725
60212B356938K8290K0531J3539P551J955l564q519j2364j5154j7137j8098j7530
60200B336438j5397j2293q836n114q77L999R445J5507K2403L0150L8247M5903
60188B459575N2484N7739O1651O4224O5268O4369O1208N6035M9571M2228L3715
60177C068067K3739J2860K029q602j9717l1493m2903n2719o0668o7089p1821p4146
60165B677537p3694p0820o6043n9678n2136m4053l5798k7217j8171r169j030N921
$$ y = [881653, 893273, 905178, 918265, 933550, 951406, 971485, 993407, 1017537, 1044934, 1076373, 1111517, 1149338, 1189341, 1232008, 1277955, 1327161, 1379471, 1435439, 1495964, 1561085, 1629711, 1700595, 1772977, 1846048, 1918411, 1988555, 2055545, 2118817, 2177616, 2231144, 2279061, 2321213, 2356938, 2385228, 2405759, 2419298, 2426849, 2428804, 2425240, 2416721, 2404357, 2389203, 2372066, 2353968, 2336438, 2321041, 2308748, 2299912, 2294798, 2293921, 2297920, 2307365, 2322872, 2345275, 2375425, 2413672, 2459575, 2512059, 2569798, 2631449, 2695673, 2760941, 2825310, 2886518, 2942553, 2992124, 3034352, 3068067, 3091806, 3104666, 3106695, 3098093, 3078376, 3046883, 3003980, 2951261, 2890593, 2823504, 2751683, 2677537, 2603843, 2533023, 2466980, 2407302, 2355166, 2311113, 2275315, 2248098, 2229927, 2220758, 2219728, 2225649]
60153B225649J2011J7527K2203K5529K7240K7196K5082K0728J4791Q596K995k360
60141B427187q187j4302j9632k3383k5633k6789k6974k6148k4285k1183j6510
60130B194161j0371l442L751J1346J9664K8623L8164M8736O0670P3239Q5177R6162
60118B645880J07092J18729J30670J41942J51931J60326J66644J70421J71604
60109C965239J70218J65772J57541J45492J30463J13318R4328P3549N1429K8694
60099E096043N812j6994l9261o0183p9131r6026j10921j23403j32700j38400j40797
60088D164039j40518j37954j33089j25780j16114j04671r2354p9743o6621n2427
60078C114768l7274k2173q123M663J6359K6827L5631M2419M6865M8473M7025M3087
$$ y = [2225649, 2237660, 2255187, 2277390, 2302919, 2330159, 2357355, 2382437, 2403165, 2417956, 2426552, 2429547, 2427187, 2419000, 2404698, 2385066, 2361683, 2336050, 2309261, 2282287, 2256139, 2231854, 2210671, 2194161, 2183790, 2180348, 2184099, 2195445, 2215109, 2243732, 2281896, 2330632, 2391302, 2464541, 2549718, 2645880, 2752972, 2871701, 3002371, 3144313, 3296244, 3456570, 3623214, 3793635, 3965239, 4135457, 4301229, 4458770, 4604262, 4734725, 4848043, 4942371, 5015920, 5067349, 5096043, 5101855, 5084861, 5045600, 4985417, 4906286, 4810260, 4699339, 4575936, 4443236, 4304836, 4164039, 4023521, 3885567, 3752478, 3626698, 3510584, 3405913, 3313559, 3233816, 3167195, 3114768, 3077494, 3055321, 3047198, 3051861, 3068220, 3095047, 3130678, 3173097, 3219962, 3268435, 3315460, 3358547]
60066C358547L7566L0787K2500J2715J982r123k0219l0792m0334m8964n7252o5118
60054C192295p1561p5853p8411p9910q0207p8807p5898p2029o7033o0224n1698
60043B400664m2586l3758k4967j5604n629M575J4790K4893L4565M3493N1682N9125
60031B511243O5301O9376P0843O9771O6578O1733N5584M8155L9205K8702J7157
60020C103648N271o584j8258k9435l9724m9025n7313o4042o8315o9809o9170o7228
60008B570016o4201n9879n4224m7394l9497l0738k1663j2810m188M562J3481K2281
59996B275746L0926L9800M9063N8248O6741P4476Q1852Q9107R5777J00661J02283
59985C064680R9788R3581Q4920P4691O2897M9425L4858K0102N527q965k3188l6576
$$ y = [3358547, 3396113, 3426900, 3449400, 3462115, 3464097, 3454974, 3434755, 3403963, 3363629, 3314665, 3257413, 3192295, 3120734, 3044881, 2966470, 2886560, 2806353, 2727546, 2651648, 2579619, 2512586, 2452362, 2400664, 2358078, 2324320, 2299353, 2283749, 2278120, 2282695, 2297485, 2322378, 2356943, 2400436, 2452118, 2511243, 2576544, 2645920, 2716763, 2786534, 2853112, 2914845, 2970429, 3018584, 3057789, 3086491, 3103648, 3108919, 3102335, 3084077, 3054642, 3014918, 2965893, 2908580, 2844538, 2776223, 2706414, 2637244, 2570016, 2505815, 2445936, 2391712, 2344318, 2304821, 2274083, 2252420, 2239610, 2235422, 2239984, 2253465, 2275746, 2306672, 2346472, 2395535, 2453783, 2520524, 2595000, 2676852, 2765959, 2861736, 2962397, 3064680, 3164468, 3258049, 3342969, 3417660, 3480557, 3529982, 3564840, 3584942, 3590469, 3581504, 3558316, 3521740]
59973C521740m8769n9734o9147p6201q0275q1480q0246p6702p0772o2726n3345
59962B762343m3492l3601k3559j3068k238Q277J7913K6845L5653M4360N2251N8702
59950B890386O3646O6985O8214O7100O4296O0613N6040N0127M3135L5985K9074
59939C495601K2013J4747Q188L241k40k949m870n087k802J978Q687J6857K6474
59926C581838L7850N1190O6177Q2091R8355J14739J30857J45822J58712J69098
59916D636729J76695J80680J79852J73458J61455J43901J20704R2145N9401K4334
59906E949354j0957m4372p4145r9359j19898j35570j45638j49576j48041j42579
59896D879219j34360j23731j10874r6346q0731o4255m7113k9839j2973L518K0125
$$ y = [3521740, 3472971, 3413237, 3344090, 3267889, 3187614, 3106134, 3025888, 2949186, 2878414, 2815688, 2762343, 2718851, 2685250, 2661691, 2648623, 2646385, 2654662, 2672575, 2699420, 2735073, 2779433, 2831684, 2890386, 2954032, 3021017, 3089231, 3156331, 3220627, 3281240, 3337280, 3387407, 3430542, 3466527, 3495601, 3517614, 3532361, 3540549, 3543790, 3543550, 3540601, 3535731, 3530644, 3527842, 3529820, 3538507, 3555364, 3581838, 3619688, 3670878, 3737055, 3819146, 3917501, 4032240, 4163097, 4308919, 4467631, 4636729, 4813424, 4994104, 5173956, 5347414, 5508869, 5652770, 5773474, 5865619, 5925020, 5949354, 5938397, 5894025, 5819880, 5720521, 5600623, 5465053, 5319415, 5169839, 5021798, 4879219, 4744859, 4621128, 4510254, 4413908, 4333177, 4268922, 4221809, 4191970, 4178997, 4182515, 4202640]
59885D202640L7174N4556P1882Q8554J03639J16064J25039J30011J30168J24364
59875E184091J11842R3013O9333M2553J4260j4061m0913o5007q5593j02551j16192
59864E090775j26846j34535j39090j40595j39526j36199j30318j21516j10320
59855C911830r8106q5858p3361n9924m5555l1010j6904l309R808K2146L3161M2243
59843C605161M8863N3032N5699N8228O1083O3277O3233N9853N2551M0944K5261
59832D187185O993j1615k8812m3686n5489o3425o7594o9395p0378p0871p0363
59821C642550o9021o8026o8181o8799o8425o6403o3310o0039n6874n3509m9651
59810B950312m5433m1424l8291l6316l5204l4489l4001l3704l3092l1286k7960
$$ y = [4202640, 4239814, 4294370, 4366252, 4454806, 4558445, 4674509, 4799548, 4929559, 5059727, 5184091, 5295933, 5388946, 5458279, 5500832, 5515092, 5501031, 5460118, 5395111, 5309518, 5206967, 5090775, 4963929, 4829394, 4690304, 4549709, 4410183, 4273984, 4143666, 4022150, 3911830, 3813724, 3727866, 3654505, 3594581, 3549026, 3518016, 3501112, 3497803, 3507611, 3529757, 3562918, 3605161, 3654024, 3707056, 3762755, 3820983, 3882066, 3945343, 4008576, 4068429, 4120980, 4161924, 4187185, 4194178, 4182563, 4153751, 4110065, 4054576, 3991151, 3923557, 3854162, 3783784, 3712913, 3642550, 3573529, 3505503, 3437322, 3368523, 3300098, 3233695, 3170385, 3110346, 3053472, 2999963, 2950312, 2904879, 2863455, 2825164, 2788848, 2753644, 2719155, 2685154, 2651450, 2618358, 2587072, 2559112]
59799B559112k3813j9685j5426j0101l188M981J3962K3814L4766M6842O0101P4902
59787B746267R1340J08690J25884J42441J58315J72578J82524J84452J75326J53820
59777D241637J20418P7211K7961k2069o7291j03607j29483j45353j52229j51156
59767C696039j43679j32051j18346j03558q7928p2031n7161m4536l4300k5453
59757B876996j6770p943K65P060J2738J8375K4422L0198L5075L9551M4637N0571
59745C115175N6907O3633P1369Q0445R0378J00501J10565J20720J31430J43563
59735D084686J57843J73913J90421K06437K22287K38610K54952K69742K81454
59726F080345K89392K93366K92997K87456K76105K59493K39717K19386K00246
$$ y = [2559112, 2535299, 2515614, 2500188, 2490087, 2486899, 2491880, 2505842, 2529656, 2564422, 2611264, 2671365, 2746267, 2837607, 2946297, 3072181, 3214622, 3372937, 3545515, 3728039, 3912491, 4087817, 4241637, 4362055, 4439266, 4467227, 4445158, 4377867, 4274260, 4144777, 3999424, 3847195, 3696039, 3552360, 3420309, 3301963, 3198405, 3110477, 3038446, 2981285, 2936749, 2902449, 2876996, 2860226, 2852283, 2852548, 2859608, 2872346, 2890721, 2915143, 2945341, 2980416, 3019967, 3064604, 3115175, 3172082, 3235715, 3307084, 3387529, 3477907, 3578408, 3688973, 3809693, 3941123, 4084686, 4242529, 4416442, 4606863, 4813300, 5035587, 5274197, 5529149, 5798891, 6080345, 6369737, 6663103, 6956100, 7243556, 7519661, 7779154, 8018871, 8238257, 8438503]
59717H438503J83165J69197J59799J55654J55944J59217J64379J70441J75877
59708I932176J79031J78856J74839J66616J54313J38904J21415J02007Q0589N8158
59698A1286904L6713J7788J869j0709j9082k2418k0522j3515j455J5439L6572
59687A1307584O1336Q9433J20552J54021J88973K24555K59642K92635L21861L46019
59677A3366611L63937L74084L74518L63333L39037L00739K48370J82986J06964
59668A6020579K3949o1627j45243k22892k91132l47064l88746m15748m29059m30529
59658A3312488m22771m09497l95299l84575l80504l84717l97101m15314m34920
59649I687790m50925m59762m60138m52384m37587m17282l93380l67718l41496
$$ y = [8438503, 8621668, 8790865, 8950664, 9106318, 9262262, 9421479, 9585858, 9756299, 9932176, 10111207, 10290063, 10464902, 10631518, 10785831, 10924735, 11046150, 11148157, 11228746, 11286904, 11323617, 11341405, 11343274, 11332565, 11313483, 11291065, 11270543, 11257028, 11255573, 11271012, 11307584, 11368920, 11458353, 11578905, 11732926, 11921899, 12146454, 12406096, 12698731, 13020592, 13366611, 13730548, 14104632, 14479150, 14842483, 15181520, 15482259, 15730629, 15913615, 16020579, 16044528, 15982901, 15837658, 15614766, 15323634, 14976570, 14587824, 14172076, 13743017, 13312488, 12889717, 12480220, 12084921, 11700346, 11319842, 10935125, 10538024, 10122710, 9687790, 9236865, 8777103, 8316965, 7864581, 7426994, 7009712, 6616332, 6248614, 5907118]
59640E907118l15288k89592k65143k42483k21454k01535j82675j65338j49643
59631C873967j34941j20669j07160r5084q4339p4172o4261n5079m7227m0993l6565
59620C013477l3923l2336l0696k8753k7450k7631k8882l0101l0822l1445l2468
59609B678970l3962l5728l7432l8678l9202l9019l8191l6696l4693l2656l0907
59598B281806k9284k7544k5812k4268k2659k0658j8458j6504j4684j2423r591
59587B059921o821m701l056j246J111L884O697R276J1680J4255J7245K0432K3332
59574B152009K5703K7709K9639L1778L4529L8290M3001M8043N2821N7274O1721
59563B602517O6359P1117P5884Q0644Q5385R0074R4750R9508J04309J08853J12710
$$ y = [5907118, 5591830, 5302238, 5037095, 4794612, 4573158, 4371623, 4188948, 4023610, 3873967, 3739026, 3618357, 3511197, 3416113, 3331774, 3257602, 3193341, 3138262, 3091035, 3050042, 3013477, 2979554, 2947218, 2916522, 2887769, 2860319, 2832688, 2803806, 2773705, 2742883, 2711438, 2678970, 2645008, 2609280, 2571848, 2533170, 2493968, 2454949, 2416758, 2380062, 2345369, 2312713, 2281806, 2252522, 2224978, 2199166, 2174898, 2152239, 2131581, 2113123, 2096619, 2081935, 2069512, 2059921, 2053100, 2048399, 2045343, 2044097, 2045208, 2049092, 2055789, 2065065, 2076745, 2091000, 2108245, 2128677, 2152009, 2177712, 2205421, 2235060, 2266838, 2301367, 2339657, 2382658, 2430701, 2483522, 2540796, 2602517, 2668876, 2739993, 2815877, 2896521, 2981906, 3071980, 3166730, 3266238, 3370547, 3479400, 3592110]
59552C592110J15589J17416J18169J17714J15784J11936J05412R5176Q0603O2293
59542D632202M2178K2513M662j1279k5899l9593n2200o3256p2509q0040q5809
59531D270970q9283q9813q7426q2940p7173p0268o1866n1621l9311k4832q487
59520C587950Q851K6286M3688O1689Q0630R9694J17085J31097J40968J46670J48005
59509D592613J44038J33646J16476R3227O5141L3605J77l3500o6024r6194j22581
59498D860624j43637j58481j67253j70492j68614j62269j52671j40975j27637
59489C468595j12869r7389q2055o6973n1628l5873k0251n310Q815K2054L4195
59478C061311M5183N5168O4038P1240P6176P8595P8465P5770P0427O2180N0623
$$ y = [3592110, 3707699, 3825115, 3943284, 4060998, 4176782, 4288718, 4394130, 4489306, 4569909, 4632202, 4674380, 4696893, 4701555, 4690276, 4664377, 4624784, 4572584, 4509328, 4436819, 4356779, 4270970, 4181687, 4091874, 4004448, 3921508, 3844335, 3774067, 3712201, 3660580, 3621269, 3596437, 3587950, 3596801, 3623087, 3666775, 3728464, 3809094, 3908788, 4025873, 4156970, 4297938, 4444608, 4592613, 4736651, 4870297, 4986773, 5080000, 5145141, 5178746, 5178923, 5145423, 5079399, 4983205, 4860624, 4716987, 4558506, 4391253, 4220761, 4052147, 3889878, 3737207, 3596232, 3468595, 3355726, 3258337, 3176282, 3109309, 3057681, 3021808, 3001557, 2996247, 3005062, 3027116, 3061311, 3106494, 3161662, 3225700, 3296940, 3373116, 3451711, 3530176, 3605946, 3676373, 3738553, 3789176]
59467C789176L5796J8684O19j7827l6801n5841p3341q7845r9387j08919j16674
59456C247640j21760j23478j22363j19682j16199j11818j06311j00021r3599q7342
59446B145067q1077p4748o8681o3196n8201n3400m8643m3835l8819l3696k8962
59435A551809k4910k1106j7008j2843r287o369l464l41K544N049P751J0956J3806
59422A496587J5017J4044J1250P361L369N00m44K44J687L556O224R851J3758J6827
59408A599831J8246J7835J5976J3434J1176J0147J1038J3993J8397K3205K7708
59397A780986L1966L6427M1327M6608N2250N8312O4713P1199P7619Q4059R0655
59386B436121R7327J03717J09383J14186J18500J22999J28234J34451J41754J50335
$$ y = [3789176, 3824972, 3843656, 3844275, 3826448, 3789647, 3733806, 3660465, 3572620, 3473233, 3364314, 3247640, 3125880, 3002402, 2880039, 2760357, 2644158, 2532340, 2426029, 2326008, 2232409, 2145067, 2063990, 1989242, 1920561, 1857365, 1799164, 1745764, 1697121, 1653286, 1614467, 1580771, 1551809, 1526899, 1505793, 1488785, 1475942, 1466655, 1460286, 1456822, 1456481, 1459025, 1464074, 1471825, 1482781, 1496587, 1511604, 1525648, 1536898, 1544259, 1547628, 1548128, 1547684, 1547928, 1549615, 1553171, 1559395, 1569246, 1583004, 1599831, 1618077, 1635912, 1651888, 1665322, 1676498, 1686645, 1697683, 1711676, 1730073, 1753278, 1780986, 1812952, 1849379, 1890706, 1937314, 1989564, 2047876, 2112589, 2183788, 2261407, 2345466, 2436121, 2533448, 2637165, 2746548, 2860734, 2979234, 3102233, 3230467, 3364918, 3506672, 3657007]
59376C657007J60576J73054J88225K05808K24599K43220K60912K77201K90997
59367E681599L00616L04815L03249K95975K83323K66515K47475K27480K06454
59358H117501J84034J60586J36628J11877Q5618N7470K6985o888m4761q5553j27287
59347H616210j68973k10389k49985k84467l11073l29358l40116l43641l39905
59338F038303l29760l14786k96219k74969k52615k31319k12410j95624j80123
59329C750478j65787j53078j41985j31749j21770j12294j03864r6370q9088q1657
59319B552836p4527o8242o2726n7631n2995m8968m5101m0637l5588l0938k7473
59308B008010k4830k2048j8676j4945j1061o781j749L970R789J5009J9229K2321
$$ y = [3657007, 3817583, 3990637, 4178862, 4384670, 4609269, 4852489, 5113401, 5390602, 5681599, 5982215, 6287030, 6590279, 6886254, 7169577, 7436092, 7683567, 7911047, 8117501, 8301535, 8462121, 8598749, 8710626, 8796244, 8853714, 8880699, 8873811, 8829050, 8743497, 8616210, 8447237, 8236848, 7986863, 7702396, 7391323, 7061965, 6721849, 6378208, 6038303, 5708543, 5393757, 5097538, 4822569, 4569954, 4338635, 4126225, 3930601, 3750478, 3584691, 3431613, 3289628, 3157879, 3036109, 2923815, 2819951, 2723581, 2634493, 2552836, 2478309, 2410067, 2347341, 2289710, 2236715, 2187747, 2142646, 2102009, 2066421, 2035483, 2008010, 1983180, 1961132, 1942456, 1927511, 1916450, 1909669, 1907920, 1911890, 1921679, 1936688, 1955917, 1978238]
59296A978238K4014K3800K1551J8153J5198J3982J4911J7744K1930K6711L1379
59285B207611L5668L9672M3229M5746M6688M5965M3676L9793L4319K7383J9018
59274B628768R177j802j3011k3516l2882m1002m7814n3478n8381o2466o4884o4907
59262B173802o3048o0739n8830n6936n4320n0936m7318m3859m0535l7209l3813
59251A626259l0219k6185k1699j7236j3443j0430p545m101j95L439O380R016J1978
59238A526019J5486J9334K3237K6965L0436L3891L7818M2457M7610N3104N9138
59227A915495O5951P3459Q1538R0384J00199J10845J22183J34434J47704J61354
59217C003546J74433J86459J97109K05315K09395K08181K01395J88831J69981
$$ y = [1978238, 2002252, 2026052, 2047603, 2065756, 2080954, 2094936, 2109847, 2127591, 2149521, 2176232, 2207611, 2243279, 2282951, 2326180, 2371926, 2418614, 2464579, 2508255, 2548048, 2582367, 2609750, 2628768, 2637945, 2636143, 2623132, 2599616, 2566734, 2525732, 2477918, 2424440, 2366059, 2303593, 2238709, 2173802, 2110754, 2050015, 1991185, 1934249, 1879929, 1828993, 1781675, 1737816, 1697281, 1660072, 1626259, 1596040, 1569855, 1548156, 1530920, 1517477, 1507047, 1499502, 1495401, 1495206, 1498645, 1505025, 1514041, 1526019, 1541505, 1560839, 1584076, 1611041, 1641477, 1675368, 1713186, 1755643, 1803253, 1856357, 1915495, 1981446, 2054905, 2136443, 2226827, 2327026, 2437871, 2560054, 2694488, 2842192, 3003546, 3177979, 3364438, 3561547, 3766862, 3976257, 4184438, 4385833, 4574664, 4744645]
59208D744645J44679J13579P7755L8379k965m4251q3673j19818j51088j75695
59198D541547j92798k03028k07333k05945j99191j88645j76414j63419j49361
59189B855413j34304j19278j05176r1978p9382o7538n6590m6176l5909k6023j7071
59178B075988r264k505L141P428J0204J1332J0596P933L621k098r263j7634k6119
59165B063360l3411l9175m3992m8106n0881n1749n1087m9680m7711m4929m1570
59154A561069l8463l6100l4061l1550k8241k4446k0740j7624j5329j3672j2153
59143A288690j0344q114n454k327J064L980N627N968N859O156O822P143O717N980
59129A317767N642N792N784N094M063L581M079N133O070O670P113P580Q273R556
$$ y = [4744645, 4889324, 5002903, 5080658, 5119037, 5116072, 5071821, 4988148, 4868330, 4717242, 4541547, 4348749, 4145721, 3938388, 3732443, 3533252, 3344607, 3168193, 3004774, 2855413, 2721109, 2601831, 2496655, 2404677, 2325295, 2257757, 2201167, 2154991, 2119082, 2093059, 2075988, 2066724, 2064219, 2067360, 2074788, 2084992, 2096324, 2106920, 2114853, 2118474, 2116376, 2107113, 2089479, 2063360, 2029949, 1990774, 1946782, 1898676, 1847795, 1796046, 1744959, 1695279, 1647568, 1602639, 1561069, 1522606, 1486506, 1452445, 1420895, 1392654, 1368208, 1347468, 1329844, 1314515, 1300843, 1288690, 1278346, 1270232, 1264778, 1262451, 1263515, 1267495, 1273122, 1279090, 1284949, 1291105, 1297927, 1305070, 1311787, 1317767, 1323409, 1329201, 1334985, 1340079, 1344142, 1347723, 1351802, 1356935, 1363005, 1369675, 1376788, 1384368, 1392641, 1402197]
59115A402197J1562J3694J4968J5069J4673J4619J5071J5681J6142J6307J6107
59104A566090J5716J5602J5982J6491J6746J7057J8041J9714K1580K3664K6726
59093A773409L1038L5528L8645L9977M0498M1292M2378M2886M2021L9592L5652
59082B202916L0051K2675J3970M801m452j4164k4472l4301m2094m7454n1435n5026
59070B001015n7976n9373n8893n7040n4533n1908m9391m6799m3754m0383l7477
59059A443488l5506l3848l1569k8785k6449k4918k3512k1640j9609j7928j6450
59048A163274j4687j2661j0866r649r002q785q763q601q255q343r498j1266j2109
59035A030789j0962q501o445n579m958l248n32J745K555K470K825M069N423N999
$$ y = [1402197, 1413759, 1427453, 1442421, 1457490, 1472163, 1486782, 1501853, 1517534, 1533676, 1549983, 1566090, 1581806, 1597408, 1613390, 1629881, 1646627, 1663684, 1681725, 1701439, 1723019, 1746683, 1773409, 1804447, 1839975, 1878620, 1918597, 1959095, 2000387, 2042765, 2085651, 2127672, 2167264, 2202916, 2232967, 2255642, 2269612, 2274413, 2269961, 2255797, 2231325, 2197024, 2154930, 2107476, 2056041, 2001015, 1943039, 1883666, 1824773, 1767733, 1713200, 1661292, 1611901, 1565102, 1521348, 1480965, 1443488, 1407982, 1374134, 1342565, 1313780, 1287331, 1262413, 1238901, 1217261, 1197652, 1179724, 1163274, 1148587, 1135926, 1125060, 1115411, 1106409, 1097624, 1088861, 1080260, 1072005, 1063662, 1054164, 1042898, 1030789, 1019827, 1011326, 1004881, 999302, 994344, 991096, 990564, 992309, 994864, 997334, 1000159, 1004228, 1009651, 1015650]
59021A015650N763N372N474O370P912R536J0620J1183J2060J4051J6899J9466
59009A140356K0981K1921K3448K6077K9207L2019L4575L7647M1536M5489M8493
58998A501749N0217N0830N0180M7749M3276L6952K9024J9792J0056R36p006j4013
58986A819742k0277k5362k8809l0807l1798l1874l1136l0253k9940k9983k9475
58975A500028k8023k6112k4216k2191j9701j6760j3543j0133o650l347l06K605
58963A331651N252P066P800Q083Q831J0103J1006J0751R495Q127P500P889Q937
58950A442491J0044J0909J1768J2994J4596J6380J8477K1251K4506K7373K9469
58939A640258L1794L5748M1347M7136N2033N6475O1242O5812O8690O9109O7485
$$ y = [1015650, 1021413, 1026785, 1032259, 1038629, 1046541, 1056077, 1066697, 1077880, 1089940, 1103991, 1120890, 1140356, 1161337, 1183258, 1206706, 1232783, 1261990, 1294009, 1328584, 1366231, 1407767, 1453256, 1501749, 1551966, 1602796, 1652976, 1700725, 1744001, 1780953, 1809977, 1829769, 1839825, 1840761, 1833755, 1819742, 1799465, 1774103, 1745294, 1714487, 1682689, 1650815, 1619679, 1589426, 1559486, 1529503, 1500028, 1472005, 1445893, 1421677, 1399486, 1379785, 1363025, 1349482, 1339349, 1332699, 1329352, 1329046, 1331651, 1336903, 1343969, 1351769, 1359852, 1368683, 1378786, 1389792, 1400543, 1410038, 1418165, 1425665, 1433554, 1442491, 1452535, 1463444, 1475212, 1488206, 1502802, 1519182, 1537659, 1558910, 1583416, 1610789, 1640258, 1672052, 1707800, 1749147, 1796283, 1848316, 1904791, 1966033, 2031845, 2100535, 2169644, 2237129]
58928B237129O4274N9278N2468M4867L8070L3202L0718L0787L3376L8029M4078
58917B706276N1024N8521O6150P3579Q0920Q8710R7490J07500J18616J30341J42073
58906C721200J53615J65307J77399J89502K00856K10969K19575K26179K30076
58897E494678K30905K28871K24498K18428K11253K03087J93250J80794J65333
58888G351097J46998J25714J01056P2933M1984R184k4450n7680q9222j18393j45245
58877G413976j69664j90726k07322k19180k26994k31750k34160k34475k32485
58868E467220k27920k21143k13243k05127j96736j87503j77409j67081j56985
58859C714073j47043j37117j27420j18255j09690j01646r4098q6918p9747p2346
$$ y = [2237129, 2301403, 2360681, 2413149, 2458016, 2496086, 2529288, 2560006, 2590793, 2624169, 2662198, 2706276, 2757300, 2815821, 2881971, 2955550, 3036470, 3125180, 3222670, 3330170, 3448786, 3579127, 3721200, 3874815, 4040122, 4217521, 4407023, 4607879, 4818848, 5038423, 5264602, 5494678, 5725583, 5954454, 6178952, 6397380, 6608633, 6811720, 7004970, 7185764, 7351097, 7498095, 7623809, 7724865, 7797798, 7839782, 7848966, 7824516, 7766836, 7677614, 7559221, 7413976, 7244312, 7053586, 6846264, 6627084, 6400090, 6168340, 5934180, 5699705, 5467220, 5239300, 5018157, 4804914, 4599787, 4403051, 4215548, 4038139, 3871058, 3714073, 3567030, 3429913, 3302493, 3184238, 3074548, 2972902, 2878804, 2791886, 2712139, 2639793]
58849B639793o5021n8439n2888m7912m2796l7360l2003k7048k2357j7725j3368
58838B222876r595o217k688J110M709P857J1048J4938J9502K4130K8426L2540
58826B348636L6729M0907M4725M7959N0664N3013N5043N6688N8136N9975O2765
58815B915240O6477P0742P5603Q1660Q9304R8200J07799J18011J29075J41021
58805C893132J53622J66587J79465J91634K02840K13440K23520K31883K36719
58796E692842K37330K34506K28853K19433K04669J84105J58595J28930R5229N8026
58786G442518J9314j8334n3543q6473j17316j45064j68338j87021k02340k15299
58776F268104k25754k33179k37748k40088k40290k37730k31837k22722k11200
$$ y = [2639793, 2574772, 2516333, 2463445, 2415533, 2372737, 2335377, 2303374, 2276326, 2253969, 2236244, 2222876, 2213281, 2207064, 2204376, 2205486, 2210195, 2218052, 2229100, 2244038, 2263540, 2287670, 2316096, 2348636, 2385365, 2426272, 2470997, 2518956, 2569620, 2622633, 2677676, 2734364, 2792500, 2852475, 2915240, 2981717, 3052459, 3128062, 3209722, 3299026, 3397226, 3505025, 3623036, 3752111, 3893132, 4046754, 4213341, 4392806, 4584440, 4787280, 5000720, 5224240, 5456123, 5692842, 5930172, 6164678, 6393531, 6612964, 6817633, 7001738, 7160333, 7289263, 7384492, 7442518, 7461832, 7443498, 7389955, 7303482, 7186166, 7041102, 6872764, 6685743, 6483403, 6268104, 6042350, 5809171, 5571423, 5331335, 5091045, 4853315, 4621478, 4398756, 4187556]
58767D187556j98482j85762j73698j62264j51239j40625j30421j20396j10542
58758B814127j01427r3507q6307p8975p1570o4961n9392n4025m8173m2169l6527
58747B077094l1050k5472k0420j6748j4188j1504q008m221q89J967M819P837J0674
58734A969891J2714J3282J1821Q043J985o037j5244k4235l1527l6520l9774m2189
58722A822210m4087m5252m5613m5555m5547m5624m5308m3967m1346l7698l3410
58711A348803k8627k3463j8339j3652r083l855J945O864R365R202O926K500m494
58698A284092j3285k1728k8228l3002l6826l9317l9446l7289l4088l0588k6418
58687I43877k1326j6060j1573q001n006k523n53J319L437N312N994N204L632K188
$$ y = [4187556, 3989074, 3803312, 3629614, 3467350, 3316111, 3175486, 3045065, 2924669, 2814127, 2712700, 2619193, 2532886, 2453911, 2382341, 2317380, 2257988, 2203963, 2155790, 2113621, 2077094, 2046044, 2020572, 2000152, 1983404, 1969216, 1957712, 1949704, 1945483, 1944594, 1946561, 1951380, 1959217, 1969891, 1982605, 1995887, 2007708, 2015751, 2017736, 2011699, 1996455, 1972220, 1940693, 1904173, 1864399, 1822210, 1778123, 1732871, 1687258, 1641703, 1596156, 1550532, 1505224, 1461257, 1419911, 1382213, 1348803, 1320176, 1296713, 1278374, 1264722, 1255639, 1251784, 1253729, 1260593, 1269958, 1279160, 1286086, 1288586, 1284092, 1270807, 1249079, 1220851, 1187849, 1151023, 1111706, 1072260, 1034971, 1000883, 970295, 943877, 922551, 906491, 894918, 886917, 881911, 879388, 878835, 880154, 883591, 888903, 894897, 900101, 903733, 905921]
58673I05921J403J436K139L110M081N274O850Q045P419M187j052o998j2655j7579
58659I11581k1596k4594k6284k6085k3703j9974j6584j4524j3280j1816r899p916
58647F95326n917l674j458P7Q87J708K994M236M677M306L850L959M722N719O339
58632G27751O193N486M899M999N793O930Q146R397J0699J2020J3348J4738J6314
58619H46713J8121J9940K1411K2545K3885K5831K7906K9323L0320L2275L6095
58608A134365M0983M5435M9046N2660N6848O1081O4552O7129O9083P0304P0268
58597A781754O8619O5328O0355N3424M4279L3079K0491P411n447j7722k9106l8959
58585B043506m6522n1553n4521n5961n5902n4161n1040m7329m3661m0110l6560
$$ y = [905921, 907324, 908760, 910899, 914009, 918090, 923364, 930214, 938259, 945678, 949865, 948813, 941815, 929160, 911581, 889985, 865391, 839107, 813022, 789319, 769345, 752761, 738237, 724957, 713141, 703242, 695326, 689409, 685735, 684277, 684354, 685241, 686949, 689943, 694179, 698856, 703162, 707012, 710971, 715693, 721412, 727751, 733944, 739430, 744329, 749328, 755121, 762051, 770197, 779594, 790293, 802313, 815661, 830399, 846713, 864834, 884774, 906185, 928730, 952615, 978446, 1006352, 1035675, 1065995, 1098270, 1134365, 1175348, 1220783, 1269829, 1322489, 1379337, 1440418, 1504970, 1572099, 1641182, 1711486, 1781754, 1850373, 1915701, 1976056, 2029480, 2073759, 2106838, 2127329, 2134740, 2129293, 2111571, 2082465, 2043506, 1996984, 1945431, 1890910, 1834949, 1779047, 1724886, 1673846, 1626517, 1582856, 1542746, 1506186]
58574A506186l3156l0165k7529k4844k1841j8835j6411j4766j3563j2589j2282
58563A280205j3275j5550j8471k1625k4980k8059k9696k9269k7728k6572k6048
58552A018932k5192k3721k2837k3640k5501k6664k6158k4430k2388k0495j8796
58541G59110j7209j5642j4185j3212j2930j2850j2205j0930r750r131q719q074
58529F14273p423p105o774n880m656l884l639l114j861n08K33O24J432K771M069
58514E78558M969N638O261O830P460Q384R519J0493J1210J1890J2505J2656J2182
58501F98555J1333J0111Q096N270K481N26p81k008l043l442l544m296n875p334
58487G06049p788p403o899o686o737o892o952o827o817p314q054q178p355o369
$$ y = [1506186, 1473030, 1442865, 1415336, 1390492, 1368651, 1349816, 1333405, 1318639, 1305076, 1292487, 1280205, 1266930, 1251380, 1232909, 1211284, 1186304, 1158245, 1128549, 1099280, 1071552, 1044980, 1018932, 993740, 970019, 947182, 923542, 898041, 871377, 845219, 820789, 798401, 777906, 759110, 741901, 726259, 712074, 698862, 685932, 673082, 660877, 649947, 640197, 631066, 622347, 614273, 606850, 599745, 592971, 587091, 582435, 578551, 574912, 571798, 569937, 569429, 569662, 570286, 571718, 574489, 578558, 583527, 589165, 595426, 602256, 609716, 618100, 627619, 638112, 649322, 661212, 673717, 686373, 698555, 709888, 719999, 728095, 733365, 735846, 736372, 735591, 733583, 730540, 727098, 723554, 719258, 713383, 706049, 698261, 690858, 683959, 677273, 670536, 663644, 656692, 649865, 643048, 635734, 627680, 619502, 612147, 605778]
58473F05778o172o700p148p073o692o246n726n129m515l748k612j322m93m67q72
58458E40863j065p71j65N56J409K409L307L671L329K605J978J563J129O04K23
58443E61645R3j06o88j499k091k252k042j510o69K43Q14Q51N93M73P55J344J870
58426E57824K017J865J816K123K632L117L613M175M493M194L475L050L347L987
58412F01728M235L791L025K493K411K517K410K018J719J966K732L441L525L015
58398F41026K473K340K483K489K232J947J787J620J343J072Q74O94O57J150K264
58383F66451L554M650N691O702P135O692O207O664P686Q043P543P190P350P129
58369G58687O082N265N710O864P478P306O985O825O724O771P063P214O882O385
$$ y = [605778, 599606, 592906, 585758, 578685, 571993, 565747, 560021, 554892, 550377, 546629, 544017, 542695, 542202, 541735, 540863, 539798, 539027, 538862, 539418, 540827, 543236, 546543, 550214, 553543, 556148, 558126, 559689, 560818, 561422, 561645, 561738, 561632, 560944, 559445, 557354, 555102, 553060, 551550, 550881, 551124, 551938, 552789, 553382, 553855, 554610, 555954, 557824, 559841, 561706, 563522, 565645, 568277, 571394, 575007, 579182, 583675, 587869, 591344, 594394, 597741, 601728, 605963, 609754, 612779, 615272, 617683, 620200, 622610, 624628, 626347, 628313, 631045, 634486, 638011, 641026, 643499, 645839, 648322, 650811, 653043, 654990, 656777, 658397, 659740, 660812, 661686, 662380, 663037, 664187, 666451, 670005, 674655, 680346, 687048, 694183, 700875, 707082, 713746, 721432, 729475, 737018, 744208, 751558, 758687, 764769, 770034, 775744, 782608, 790086, 797392, 804377, 811202, 817926, 824697, 831760, 838974, 845856, 852241]
58355H52241O136N853N179M572M681N267N633N815O365P195P700P809P947Q116
58341I40509Q050Q078Q796R941J0645J0778J0963J1285J1190J0813J1186J2750
58329A064984J4673J6034J6829J7460J8116J8984K0271K1628K2350K2363K2309
58318A276001K2395K2118K1263K0183J8839J6657J3777J1292R754Q567P451P255
58306A455552Q387R614R637R104R734J1921J4424J6168J7253J8234J9336K0539
58294A619903K1812K3075K4295K5610K7079K8471K9570L0470L1372L2360L3522
58283A927539L4979L6626L8244L9946M1988M4066M5442M5991M6349M6746M6501
58272B394417M5153M3366M2094M1552M1443M1625M2009M2450M3196M4875M7621
$$ y = [852241, 858377, 864230, 869409, 873981, 878662, 883929, 889562, 895377, 901742, 908937, 916637, 924446, 932393, 940509, 948559, 956637, 965433, 975374, 986019, 996797, 1007760, 1019045, 1030235, 1041048, 1052234, 1064984, 1079657, 1095691, 1112520, 1129980, 1148096, 1167080, 1187351, 1208979, 1231329, 1253692, 1276001, 1298396, 1320514, 1341777, 1361960, 1380799, 1397456, 1411233, 1422525, 1432279, 1440846, 1448297, 1455552, 1463939, 1473553, 1483190, 1492294, 1502028, 1513949, 1528373, 1544541, 1561794, 1580028, 1599364, 1619903, 1641715, 1664790, 1689085, 1714695, 1741774, 1770245, 1799815, 1830285, 1861657, 1894017, 1927539, 1962518, 1999144, 2037388, 2077334, 2119322, 2163388, 2208830, 2254821, 2301170, 2347916, 2394417, 2439570, 2482936, 2525030, 2566582, 2608025, 2649650, 2691659, 2734109, 2777305, 2822180, 2869801]
58261B869801N0834N4159N7926O2206O6305O9764P3048P6664Q0442Q4313Q8834
58250C634296R4191R9567J04386J09295J15000J20984J26413J31543J37199J43476
58240D816350J49995J56961J64911J73888J83680J94342K05818K17680K30020
58231F493645K43827K59668K76806K94493L13199L33635L55527L78543M03708
58222I353051M32695M66205N03922N45434N90553O39613O94128P56165Q26564
58213A4808330R05188R93435J094620J211082J343246J492911J665285J866259
58205B5380356K100144K372128K690824L066829L511865M042367M682489N462412
58197E3309414O416700P584683R005435J0706112J2695828J4969413J7506644
$$ y = [2869801, 2920635, 2974794, 3032720, 3094926, 3161231, 3230995, 3304043, 3380707, 3461149, 3545462, 3634296, 3728487, 3828054, 3932440, 4041735, 4156735, 4277719, 4404132, 4535675, 4672874, 4816350, 4966345, 5123306, 5288217, 5462105, 5645785, 5840127, 6045945, 6263625, 6493645, 6737472, 6997140, 7273946, 7568439, 7881638, 8215273, 8570800, 8949343, 9353051, 9785746, 10251951, 10755873, 11301307, 11891860, 12531473, 13225601, 13981766, 14808330, 15713518, 16706953, 17801573, 19012655, 20355901, 21848812, 23514097, 25380356, 27480500, 29852628, 32543452, 35610281, 39122146, 43164513, 47847002, 53309414, 59726114, 67310797, 76316232, 87022344, 99718172, 114687585, 132194229]
58190A32194229K0256461K3107355K5829272K7972896K8802094K7432470K3247765
58183C08842542J6362287P727766j269177r416328j6030927k0903078k4054962
58176B61258123k5595369k5717101k4713482k2934659k0715508j8328202j5967864
58169A07285938j3757185j1761878j0009826q504063p229121o158362n263011
58162D4602492m516471l893652l371562k932049k561901k249994j986107j762020
58154B1328736j571554j409232j270113j150353j046426r54331q70943p95298
58146A2260486p27228o65481o08679n56928n10682m68748m29343l92530l59825
58137G541042l31876l08145k88457k72960k60790k50251k40313k30629k20498
$$ y = [132194229, 152450690, 175558045, 201387317, 229360213, 258162307, 285594777, 308842542, 325204829, 332932595, 331663418, 322247090, 306216163, 285313085, 261258123, 235662754, 209945653, 185232171, 162297512, 141582004, 123253802, 107285938, 93528753, 81766875, 71757049, 63252986, 56023865, 49865503, 44602492, 40086021, 36192369, 32820807, 29888758, 27326857, 25076863, 23090756, 21328736, 19757182, 18347950, 17077837, 15927484, 14881058, 13926727, 13055784, 12260486, 11533258, 10867777, 10259098, 9702170, 9191488, 8722740, 8293397, 7900867, 7541042, 7209166, 6901021, 6612564, 6339604, 6078814, 5828563, 5588250, 5357621, 5137123]
58128E137123k09322j97754j86898j76552j65745j54772j45032j36854j29111
58119C635083j21189j13829j07664j02315r7274r2587q8154q3586p9097p5519
58109B673869p2932p0278o6862o3313o0504n8327n6118n3644n1026m8297m5620
58098B026948m3553m2419m1714m0617l8938l7160l5693l4505l3363l2182l1033
58087A615771k9997k9094k8375k7982k7982k8144k8108k7856k7719k7774k7615
58076A305125k6967k6153k5524k4924k4121k3428k3130k2697k1383j9547j8486
58065A048765j8794j9530j9318j7729j5373j3157j1732j1271j1385j1484j1419
58054H87573j1557j2091j2625j2592j1905j0935j0072r513r322r407r483r199
$$ y = [5137123, 4927801, 4730047, 4543149, 4366597, 4200852, 4046080, 3901048, 3764194, 3635083, 3513894, 3400065, 3292401, 3190086, 3092812, 3000225, 2912071, 2828485, 2749388, 2673869, 2600937, 2530659, 2463797, 2400484, 2339980, 2281653, 2225535, 2171891, 2120865, 2072568, 2026948, 1983395, 1940976, 1899262, 1858645, 1819707, 1782547, 1746854, 1712349, 1678986, 1646804, 1615771, 1585774, 1556680, 1528305, 1500323, 1472341, 1444197, 1416089, 1388233, 1360514, 1332740, 1305125, 1278158, 1252005, 1226481, 1201557, 1177436, 1154008, 1130878, 1108181, 1086798, 1067251, 1048765, 1029971, 1010441, 991123, 973394, 958021, 944864, 933132, 921861, 910476, 898992, 887573, 876016, 863925, 851300, 838708, 826803, 815868, 805796, 796283, 786961, 777554, 768071, 758872]
58042G58872q456p607p161p144o857n621l805k663k906l817m111l429k527k276
58028F90492k920m115n156n267m248k819j903j585j211m47L70R46J478K187K918
58013F68720L545M313N466O789P915Q911J0242J2248J4754J7204J9080K0390K1722
58000H21299K3668K6124K8432L0229L1946L4188L6924L9428M0968M1396M1093
57989A195695M0476L9537L7897L5292L1925K8276K4750K1699J9518J8380J7885
57978A511330J7254J5861J3250Q878K337o161j5900k6278l6788m6344n3340n6860
57966A327239n7487n6473n4476n1425m7284m2359l7077l1935k7534k4059k0769
57955H76361j6628j1678p200m301k788j742p38M2N59J046J422J239M57j97jR78
$$ y = [758872, 750416, 742809, 735648, 728504, 721647, 716026, 712221, 709558, 706652, 702835, 698724, 695295, 692768, 690492, 687572, 683457, 678301, 673034, 668786, 665967, 664064, 662479, 661268, 660821, 661191, 662137, 663615, 665802, 668720, 672265, 676578, 682044, 688833, 696748, 705659, 715901, 728149, 742903, 760107, 779187, 799577, 821299, 844967, 871091, 899523, 929752, 961698, 995886, 1032810, 1072238, 1113206, 1154602, 1195695, 1236171, 1275708, 1313605, 1348897, 1380822, 1409098, 1433848, 1455547, 1475065, 1493445, 1511330, 1528584, 1544445, 1557695, 1566573, 1568910, 1562749, 1546849, 1520571, 1483783, 1437439, 1384099, 1327239, 1269752, 1213279, 1158803, 1107378, 1060094, 1017735, 980658, 948723, 921189, 897130, 876361, 859733, 848055, 840855, 836554, 833766, 832024, 831286, 831328, 831887, 832933, 834355, 835594, 836051, 835854, 835853, 836831]
57939H36831K126L127M178N595P605J0428J4091J8085K1516K3737K4609K4143
57927I96071K2207J8648J3519P000o43q925j7150k4639l0856l5373l8012l9049
57915H62798l8948l7817l5494l2169k8503k4964k1530j8285j5704j3979j2538
57904E82867j0840r231q381q248q313q581r462j0684j1238j0710r866r558r592
57891D58163r228q293p220o262n250m044k762j520k66J047K367L634M786N727
57877D30879O474P266Q271R171R408Q902Q247P893P430O094L941K012J135R12
57863E18035K24j468l693n644o871p319p213p034p276p929q453q364p669o628
57849D32698n395m044k724j557n40L73J245K192L135L600L226K468K164K292J875
$$ y = [836831, 838957, 842084, 846262, 851857, 859462, 869890, 883981, 902066, 923582, 947319, 971928, 996071, 1018278, 1036926, 1050445, 1057445, 1056802, 1047877, 1030727, 1006088, 975232, 939859, 901847, 862798, 823850, 786033, 750539, 718370, 689867, 664903, 643373, 625088, 609384, 595405, 582867, 572027, 562796, 554415, 546167, 537854, 529273, 519811, 509127, 497889, 487179, 477313, 467755, 458163, 448935, 440642, 433422, 427160, 421910, 417866, 415104, 413584, 413318, 414365, 416732, 420366, 425152, 430879, 437353, 444619, 452890, 462061, 471469, 480371, 488618, 496511, 503941, 510035, 513976, 515988, 517123, 518035, 518259, 516791, 513098, 507454, 500583, 493264, 486051, 479017, 471741, 463812, 455359, 446995, 439326, 432698, 427303, 423259, 420535, 418978, 418438, 418811, 420056, 422248, 425383, 428983, 432209, 434677, 436841, 439133, 441008]
57834D41008M59j060j624j370j095j014q28n98n68m15M69K038L700N175O477P317
57818D58071P538P964R629J2086J3597J3293J2110J1283J1062J1391J2685J5142
57806E95851J8156K1217K4708K8907L2920L5551L6672L6737L5310L1247K4278
57795I21554J5422N810m058j3683k2108k8523l2920l5783l7483l8154l7912l6965
57783F55197l5595l3995l2055k9487k6359k3325k0994j9328j7992j6965j6253
57772C82849j5248j3200j0395q087o953o280n110l622k746k737k823k266j258
57759C02124n42m68o98p28m36j06L8K21J011K694M768O205O477O256O764Q336
57743C41916R931J0337R498Q228O900N185L071J298L63k17j130k185k661k406
$$ y = [441008, 441467, 440407, 438783, 437413, 436318, 435304, 434476, 433878, 433310, 432895, 433364, 435402, 439102, 444277, 450754, 458071, 465609, 473573, 483202, 495288, 508885, 522178, 534288, 545571, 556633, 568024, 580709, 595851, 614007, 635224, 659932, 688839, 721759, 757310, 793982, 830719, 866029, 897276, 921554, 936976, 942786, 938728, 925045, 902937, 874414, 841494, 805711, 768228, 730074, 692162, 655197, 619602, 585607, 553552, 524065, 497706, 474381, 453387, 434059, 416067, 399102, 382849, 367601, 354401, 344006, 335919, 328966, 322686, 317576, 313954, 311208, 308471, 305648, 303382, 302124, 301582, 301114, 300416, 299688, 299252, 299146, 299184, 299405, 300416, 303110, 307878, 314083, 320560, 326816, 333580, 341916, 351847, 362184, 371682, 379910, 386810, 391995, 395066, 396364, 396727, 396510, 395380, 393195, 390534, 388128]
57729C88128j927j488q76r8L77K76LJ35P76J631K428L001L182K963K712L012M152
57712D08387N817P362Q416R206J0174J1290J2011J2069J2044J2774J4290J5750
57700E39590J6518J6951J7915J9800K2196K4549K6834K9599L3313L7791M2351
57689H27407M6517N0477N4724N9468O4507O9574P4453P8915Q2778Q6167Q9362
57678A584349R2274R4210R4471R3182R1429R0415R0502R1141R1664R1604Q9542
57667B594783Q1756O3030L0272j4123o2583j06281j39199j59416j67865j66686
57657A953688j58418j45720j30993j15849j01006q6799p3656o2056n2113m3643
57647I83435l6563l0862k6168k1777j7367j3235r529n818j838J803M424O473R131
$$ y = [388128, 386201, 384713, 383837, 383739, 384116, 384392, 384395, 384530, 385306, 386937, 389365, 392366, 395548, 398511, 401223, 404235, 408387, 414204, 421566, 429982, 439188, 449362, 460652, 472663, 484732, 496776, 509550, 523840, 539590, 556108, 573059, 590974, 610774, 632970, 657519, 684353, 713952, 747265, 785056, 827407, 873924, 924401, 979125, 1038593, 1103100, 1172674, 1247127, 1326042, 1408820, 1494987, 1584349, 1676623, 1770833, 1865304, 1958486, 2049915, 2140330, 2230832, 2321973, 2413637, 2505241, 2594783, 2676539, 2739569, 2769841, 2755718, 2693135, 2586854, 2447655, 2288239, 2120374, 1953688, 1795270, 1649550, 1518557, 1402708, 1301702, 1214903, 1141247, 1079191, 1027078, 983435, 946872, 916010, 889842, 868065, 850698, 837463, 827934, 822116, 820278, 822081, 826505, 832978, 842109]
57634H42109J2778J6603J9848K2709K5770K9159L2674L6227L9770M3109M6126
57623A166882M9008N1901N4525N6288N6670N5404N2428M7814M1562L3472K3529
57612A689483J2363J015r928k0487l0613l9786m7530n3851n8800o2109o3565o3405
57600A252787o1983n9389n5848n2096m8808m5868m2762l9510l6583l4064l1496
57589G44380k8703k6186k4412k3128k1688j9816j7837j6188j4869j3424j1492
57578E26637r397p974p593p666p361o555n701m930m005l063k718l123l438k727
57564D50386j047O75J609J599J079P64J171K132K914L128L309M182N532O397O386
57549D90216O247O917Q417R980J0957J1348J1590J2121J3101J4398J5876J7721
$$ y = [842109, 854887, 871490, 891338, 914047, 939817, 968976, 1001650, 1037877, 1077647, 1120756, 1166882, 1215890, 1267791, 1322316, 1378604, 1435274, 1490678, 1543106, 1590920, 1632482, 1665954, 1689483, 1701846, 1702861, 1692933, 1672446, 1641833, 1602047, 1554517, 1500666, 1441866, 1379757, 1316192, 1252787, 1190804, 1131415, 1075567, 1023471, 974663, 928795, 886033, 846523, 809940, 775876, 744380, 715677, 689491, 665079, 641951, 620263, 600447, 582610, 566422, 551553, 538129, 526637, 517240, 509266, 501673, 494007, 486646, 480091, 474390, 469460, 465455, 462392, 459674, 456551, 453113, 450386, 449339, 450014, 451623, 453222, 454301, 455065, 456236, 458368, 461282, 464410, 467719, 471901, 477433, 483830, 490216, 496463, 503380, 511797, 521777, 532734, 544082, 555672, 567793, 580894, 595292, 611168, 628889]
57537F28889K0191K3062K5652K7721K9937L3025L6682L9881M2138M3895M5598
57526I96671M7028M7720M7546M6408M3856L9435L3236K5726J7239Q040j355j0368
57514A341182j8755k6418l2990l7986m1398m3594m4755m4809m3937m2613m1025
57503I22902l8935l6294l3508l0924k8380k5642k2848k0296j8058j6023j4035
57492F37959j1790q977n896l494k298j604k52J953M106N478O315P354Q959J0969
57478F48782J3071J5096J7083J9240K1690K4265K6679K8917L1261L3887L6618
57467I16589L9093M1014M2216M2601M2099M0587L7847L3683K8060K1043J2746
57456A297578L474o198j5674k4599l2636l9232m3964m7025m8978n0012m9843m8380
$$ y = [628889, 649080, 672142, 697794, 725515, 755452, 788477, 825159, 865040, 907178, 951073, 996671, 1043699, 1091419, 1138965, 1185373, 1229229, 1268664, 1301900, 1327626, 1344865, 1352905, 1351550, 1341182, 1322427, 1296009, 1263019, 1225033, 1183635, 1140041, 1095286, 1050477, 1006540, 963927, 922902, 883967, 847673, 814165, 783241, 754861, 729219, 706371, 686075, 668017, 651994, 637959, 626169, 617192, 611296, 607802, 605504, 603900, 603648, 605601, 609707, 615185, 621500, 628854, 637813, 648782, 661853, 676949, 694032, 713272, 734962, 759227, 785906, 814823, 846084, 879971, 916589, 955682, 996696, 1038912, 1081513, 1123612, 1164199, 1202046, 1235729, 1263789, 1284832, 1297578, 1301052, 1294854, 1279180, 1254581, 1221945, 1182713, 1138749, 1091724, 1042746, 992734, 942891, 894511]
57444H94511m6028m3287m0441l7790l5665l3944l1934k9263k6495k4457k3082
57433E22125k1487j9174j6633j4655j3432j2541j1553j0381r215q291p749p537
57421C69477p455p275o833o124n361m870m768m746m377l640k951k629k496k155
57407C03797j514r26q15j252j834j993j471n79Q7J80j41m44l92Q9P89J334J516
57390B96431J578J961K703L273L242K823K530K502K518K497K508K400J903J189
57376C30058Q72J262J962K429K523K317J750Q77R3k70l71n17n64j93M41Q33R04
57359C44406J139J833K627K976K751K239J809J651J665J581J403J562K324L106
57345C73072K993J997J157J203J719K009K153K584L090L005K311J874K455L900
$$ y = [894511, 848483, 805196, 764755, 726965, 691300, 657356, 625422, 596159, 569664, 545207, 522125, 500638, 481464, 464831, 450176, 436744, 424203, 412650, 402269, 393054, 384763, 377014, 369477, 362022, 354747, 347914, 341790, 336429, 331559, 326791, 322045, 317668, 314028, 311077, 308448, 305952, 303797, 302283, 301357, 300542, 299290, 297456, 295463, 293992, 293413, 293500, 293680, 293539, 293095, 292703, 292792, 293581, 294915, 296431, 298009, 299970, 302673, 305946, 309188, 312011, 314541, 317043, 319561, 322058, 324566, 326966, 328869, 330058, 330930, 332192, 334154, 336583, 339106, 341423, 343173, 344050, 344143, 343873, 343502, 342985, 342421, 342228, 342669, 343502, 344406, 345545, 347378, 350005, 352981, 355732, 357971, 359780, 361431, 363096, 364677, 366080, 367642, 369966, 373072, 376065, 378062, 379219, 380422, 382141, 384150, 386303, 388887, 391977, 394982, 397293, 399167, 401622, 405522]
57331D05522N376O051N584M381L499L876N380O828P183O607O144O455P198P656
57317D87740P772Q167R094R854R657Q833Q563R338J0410J1011J1436J2308J3353
57304F17536J3730J3390J3171J3504J3821J3499J2731J1994J1203R946Q297O798
57292G59620N609M112J598j802n017p010p692p859q139q379q104p318o514o031
57278F97074n789n510m879l627j859k66M59N28Q89K086L648M737N027M757M368
57263G01643M318M874N792O460O565O409O367O396O365O454O852P303P416P262
57249G90476P302P739Q289Q603Q573Q305Q016Q029Q559R433J0145J0276R818R158
57235I12721Q754Q820R183R508R686R862J0092J0220J0138R990R906R815R703
$$ y = [405522, 410898, 416949, 422533, 426914, 430413, 434289, 439669, 446497, 453680, 460287, 466431, 472886, 480084, 487740, 495512, 503679, 512773, 522627, 532284, 541117, 549680, 559018, 569428, 580439, 591875, 604183, 617536, 631266, 644656, 657827, 671331, 685152, 698651, 711382, 723376, 734579, 744525, 752822, 759620, 765229, 769341, 770939, 769137, 764120, 757110, 749418, 741559, 733420, 725041, 716937, 709619, 703105, 697074, 691285, 685775, 680896, 677269, 675410, 675144, 675603, 676131, 677020, 679106, 682754, 687491, 692518, 697275, 701643, 705961, 710835, 716627, 723087, 729652, 736061, 742428, 748824, 755189, 761643, 768495, 775798, 783214, 790476, 797778, 805517, 813806, 822409, 830982, 839287, 847303, 855332, 863891, 873324, 883469, 893745, 903563, 912721, 921475, 930295, 939478, 948986, 958672, 968534, 978626, 988846, 998984, 1008974, 1018880, 1028695, 1038398]
57222A038398R817J0325J0971J1372J1524J1741J2106J2371J2359J2249J2323
57211A165556J2661J3088J3293J3060J2527J2185J2443J3192J3920J4217J4096
57200A310238J3934J4129J4734J5312J5327J4760J4122J3781J3594J3437J3619
57189A466987J4350J5180J5595J5945J7023J8690J9742J9425J8372J7714J7784
57178A656807J8213J8779J9464J9973J9880J9340J8996J9078J9086J8594J7909
57167A866119J7577J7573J7418J6979J6687J6879J7356J7697J7773J7702J7560
57156B057320J7394J7378J7642J7994J8226J8583J9525K0883K1749K1531K0763
57145B268988K0471K0947K1588K1846K1786K1665K1429K0859J9970J8979J8007
$$ y = [1038398, 1048215, 1058540, 1069511, 1080883, 1092407, 1104148, 1116254, 1128625, 1140984, 1153233, 1165556, 1178217, 1191305, 1204598, 1217658, 1230185, 1242370, 1254813, 1268005, 1281925, 1296142, 1310238, 1324172, 1338301, 1353035, 1368347, 1383674, 1398434, 1412556, 1426337, 1439931, 1453368, 1466987, 1481337, 1496517, 1512112, 1528057, 1545080, 1563770, 1583512, 1602937, 1621309, 1639023, 1656807, 1675020, 1693799, 1713263, 1733236, 1753116, 1772456, 1791452, 1810530, 1829616, 1848210, 1866119, 1883696, 1901269, 1918687, 1935666, 1952353, 1969232, 1986588, 2004285, 2022058, 2039760, 2057320, 2074714, 2092092, 2109734, 2127728, 2145954, 2164537, 2184062, 2204945, 2226694, 2248225, 2268988, 2289459, 2310406, 2331994, 2353840, 2375626, 2397291, 2418720, 2439579, 2459549, 2478528, 2496535]
57134B496535J7024J5982J4877J3729J2693J2176J2633J4151J6314J8606K0997
57123B665717K3972K7867L2357L6793M0979M5245M9776N4302N8681O3434O9320
57112C168443P6673Q5445R5771J08094J22849J40404J61240J85821K14429K47558
57102D606727K86625L33886L91648M61763N45896O45832P63248Q99231J053890
57093I988746J225911J412165J607517J804534J993099K161124K297427K395233
57085B4885756K453367K474361K461158K413386K323092K172547J939379J609472
57077D2732518J188659P02765J86015l31434q27445j284517j686504k019465k274522
57068C6386070k449064k545554k569793k530103k437217k303680k142187j963920
$$ y = [2496535, 2513559, 2529541, 2544418, 2558147, 2570840, 2583016, 2595649, 2609800, 2626114, 2644720, 2665717, 2689689, 2717556, 2749913, 2786706, 2827685, 2872930, 2922706, 2977008, 3035689, 3099123, 3168443, 3245116, 3330561, 3426332, 3534426, 3657275, 3797679, 3958919, 4144740, 4359169, 4606727, 4893352, 5227238, 5618886, 6080649, 6626545, 7272377, 8035625, 8934856, 9988746, 11214657, 12626822, 14234339, 16038873, 18031972, 20193096, 22490523, 24885756, 27339123, 29813484, 32274642, 34688028, 37011120, 39183667, 41123046, 42732518, 43921177, 44623942, 44809957, 44478523, 43651078, 42366561, 40680057, 38660592, 36386070, 33937006, 31391452, 28821659, 26291556, 23854339, 21550659, 19408472, 17444552]
57060A7444552j778123j592669j414201j247429j094827r57544q36441p31804
57052G791514o42315n65125m97367m37477l84970l39330k99495k64344k33267
57043D127824k06054j82352j61424j42502j25374j10390r7830q7217p7466o7739
57033B869476n8071m9000m0609l2103k2417j1206J003J3763K7586M3287N9960
57022B801669P3640P8454O9666M6222J1263k9035o7436r7984j17925j27847j29934
57011B510753j26218j18411j08480r8317q8854q0199p2577o6379o1358n6659n2068
57000A581233m8380m6067m4301m2000l9264l6996l5405l3693l1151k7766k3831
56989A172379j9573j5345j1645q628n965l249m66J892K974K094n12l654o281q379
$$ y = [17444552, 15666429, 14073760, 12659559, 11412130, 10317303, 9359759, 8523318, 7791514, 7149199, 6584074, 6086707, 5649230, 5264260, 4924930, 4625435, 4361091, 4127824, 3921770, 3739418, 3577994, 3435492, 3310118, 3199728, 3101898, 3014681, 2937215, 2869476, 2811405, 2762405, 2721796, 2689693, 2667276, 2656070, 2657073, 2670836, 2698422, 2741709, 2801669, 2875309, 2953763, 3023429, 3069651, 3080914, 3051879, 2984443, 2886459, 2768534, 2640687, 2510753, 2384535, 2266124, 2157644, 2059327, 1970473, 1890274, 1817697, 1751318, 1689960, 1633301, 1581233, 1532853, 1486786, 1442485, 1400485, 1361221, 1324225, 1288820, 1255127, 1223976, 1196210, 1172379, 1152806, 1137461, 1125816, 1117188, 1111223, 1107974, 1107508, 1109400, 1112374, 1114468, 1113956, 1110302, 1104021, 1095642]
56975A095642j0349j1927j2473j2151j1862j1945j1731j0530q399n734k973q21
56963I84747O4R7O93K681N389P755R508J0601J0244P550K793k793q235j3128j7004
56948A000962j9317k0083j9925j9368j8509j7237j5344j2583r218o235m359k948
56936H35836o33K924O670R624J1940J4162J6015J6334J3914Q353M69p879j4850
56923I12879j9738k2962k4997k5854k5597k4686k3490k1968k0117j8265j6572
56912F68633j4801j2961j1743j1666j2132j1918j0576q803p485o801o312n533
56900E47902m334l022k161k058k361k394j813q33K38J389K755M297N769O910P569
56885E57853P657P074N724L565O94k602n883q632j0427j1093j0769r730q211o378
$$ y = [1095642, 1085293, 1073366, 1060893, 1048742, 1036880, 1024935, 1013204, 1002674, 994275, 988541, 985568, 984747, 984811, 984908, 985601, 988282, 993671, 1001426, 1010934, 1021535, 1031779, 1039329, 1042122, 1039329, 1031094, 1017966, 1000962, 981645, 961562, 941637, 922269, 903760, 886523, 871179, 858596, 849378, 843143, 838784, 835836, 835203, 838127, 844797, 854421, 866361, 880523, 896538, 912872, 926786, 935139, 935608, 927729, 912879, 893141, 870179, 845182, 819328, 793731, 769045, 745555, 723587, 703470, 685205, 668633, 653832, 640871, 629128, 617462, 605330, 593412, 582836, 574033, 566548, 559747, 553435, 547902, 543568, 540546, 538385, 536327, 533966, 531572, 529759, 528926, 529164, 530553, 533308, 537605, 543374, 550284, 557853, 565510, 572584, 578308, 581873, 582567, 579965, 574082, 565450, 555023, 543930, 533161, 523431, 515220, 508842]
56871E08842m417k433k90K241N136Q037J0706J3397J6601K0411K4262K7326K9013
56858F58832K8951K6613K1290J2890K732o835j3956j8434k1211k2891k3162k1635
56846F23184j8681j5068j1063o368r87M415R270J3984J9546K6255L3229L9325
56834G17041M4076M7315M8103M4755L6178K2908O803r810k4617l5700m2205m4631
56822H10216m4150m1758l8180l4031k9513k4221j7852j0990m650R17O332J2099
56810E84219J8055K3835K9152L3321L5070L3193K7220J7461M918q599k0928l0528
56798G46389l6893m0004l9929l7269l3353k9365k5494k1331j6822j2368q224m254
56786D41083k58L842Q050J2243J6003J8707J9752J8654J5173R569K613m769j1738
$$ y = [508842, 504425, 501992, 501702, 503943, 509079, 517116, 527822, 541219, 557820, 578231, 602493, 629819, 658832, 687783, 714396, 735686, 748576, 751308, 744473, 730517, 712083, 690872, 667981, 644819, 623184, 604503, 589435, 578372, 572004, 571017, 575432, 584702, 598686, 618232, 644487, 677716, 717041, 761117, 808432, 856535, 901290, 937468, 960376, 967179, 957369, 932752, 897052, 854847, 810216, 766066, 724308, 686128, 652097, 622584, 598363, 580511, 569521, 564871, 565788, 572120, 584219, 602274, 626109, 655261, 688582, 723652, 756845, 784065, 801526, 806444, 797845, 776917, 746389, 709496, 669492, 629563, 592294, 558941, 529576, 504082, 482751, 465929, 453561, 445337, 441083, 440825, 444667, 452717, 464960, 480963, 499670, 519422, 538076, 553249, 562818, 565431, 560662, 548924]
56773E48924j7483k1419k3609k4643k4843k4009k2203k0194j8625j7150j5131
56762C19615j2761j0855r635q556p313o286n850n780n619n184m458l447k326j476
56748B30069j158j284j558j597j032J53J339J741J261N26k6n56j166j433j006
56733B24273l65l73j137j803j608q08l32o23j159j149n17N6P2k02j92J87N20N40
56715B15380M21M51O93R97J131J000Q64J239K287L447M013L935L724L659L631
56700B46872L652L904M151L756K598J450J027J060Q13J96j65J41Q14J264J217
56685B72750Q75O86R59J534J861J612J055P00O51N63K15j61j93J58N40N19o4j026
56667B83234k007k725l076l100k964k907l037l191l119k807k425k058j714j553
$$ y = [548924, 531441, 510022, 486413, 461770, 436927, 412918, 390715, 370521, 351896, 334746, 319615, 306854, 295999, 286364, 277808, 270495, 264209, 258359, 252579, 246960, 241776, 237318, 233871, 231545, 230069, 228911, 227627, 226069, 224472, 223440, 223593, 224932, 226673, 227934, 228460, 228434, 227878, 226712, 225279, 224273, 223908, 223535, 222398, 220595, 218987, 218179, 217847, 217224, 216065, 214916, 214399, 214455, 214527, 214325, 214133, 214320, 214840, 215380, 215801, 216252, 216945, 217942, 219073, 220073, 220937, 222176, 224463, 227910, 231923, 235858, 239582, 243241, 246872, 250524, 254428, 258579, 262335, 264933, 266383, 267410, 268470, 269283, 269479, 269314, 269455, 270269, 271533, 272750, 273625, 274311, 275270, 276804, 278665, 280277, 281332, 282032, 282683, 283246, 283461, 283300, 283107, 283265, 283805, 284324, 284260, 283234, 281227, 278502, 275426, 272326, 269362, 266455, 263418, 260227, 257108, 254301, 251876, 249818, 248104, 246551]
56653B46551j818k400k848k879k670k500k355k069j576q72L7R18J328J112P01
56638B28660N85O81N27k3o04p92m86N0L66J60l85p28o80o98j207j873k076j908
56620B19569k058k653k863k004n66K70n3j010j703j686j075k11O39J361J933K360
56604B10250K659K839K869K712K396K010J606J139O32K69K10L74N42N94N59M71
56588B32131L43K52L08N11P96J122J409J392Q61L5n08m11P5M49N44O66J141J868
56570B42984K416K510K319K134J997J800J611J496J094p7j653k448j892r19p79
56555B52593j351j507r35o09j270k376l013l069l027l122l243l328l363l331l440
56540B15609m024m807m869l826k557k019j840j011L19Q67J05r16j055n26k84o00
$$ y = [246551, 244733, 242333, 239485, 236606, 233936, 231436, 229081, 227012, 225436, 224564, 224601, 225519, 226847, 227959, 228660, 229245, 229926, 230453, 230430, 229826, 229034, 228548, 228598, 228964, 229124, 228739, 228011, 227331, 226633, 225426, 223553, 221477, 219569, 217511, 214858, 211995, 209991, 209425, 209695, 209642, 208632, 206929, 205243, 204168, 203957, 204596, 205957, 207890, 210250, 212909, 215748, 218617, 221329, 223725, 225735, 227341, 228480, 229112, 229381, 229591, 229965, 230507, 231101, 231660, 232131, 232474, 232726, 233034, 233545, 234341, 235463, 236872, 238264, 239125, 239160, 238652, 238241, 238316, 238765, 239309, 239975, 241116, 242984, 245400, 247910, 250229, 252363, 254360, 256160, 257771, 259267, 260361, 260284, 258631, 256183, 254291, 253372, 252593, 251242, 249735, 248800, 248191, 246921, 244545, 241532, 238463, 235436, 232314, 229071, 225743, 222380, 219049, 215609, 211585, 206778, 201909, 198083, 195526, 193507, 191667, 190656, 190975, 191842, 191947, 191031, 189976, 189450, 189166, 188566]
56524A88566q82o70j45K47K77j7n23j195j991k646k679j946j110j043j715k183
56508A70345j870j312j209j334j012k46L16N11Q58J531J756P61j017k201j931
56493A63946p00L63P60R28J342J797J788J335R83J037J277J449J566J615J437
56478A80923J167J282J837K192J874J300J075J018N79j16m73m63n87q22n43L07
56462A90550R16P93M64M61M02k02q65p11J40O65L70j42j40L30P47Q45P09M23m3
56443A95712o10j056j238j271j377j510j334o84K1J32m16r63r49n41k43k04j98
56426A83271q0R9K84M38M38K39K0n5q7j85j94N9M36Q26J515K731L892M034L021
56407B00702J801J191J008P07L76M95J042J413J214O40j5p49j558k039j703o46
$$ y = [188566, 187684, 187014, 186869, 187116, 187393, 187376, 186853, 185658, 183667, 181021, 178342, 176396, 175286, 174243, 172528, 170345, 168475, 167163, 165954, 164620, 163608, 163362, 163678, 164189, 165047, 166578, 168334, 169095, 168078, 165877, 163946, 163246, 163609, 164369, 165297, 166639, 168436, 170224, 171559, 172542, 173579, 174856, 176305, 177871, 179486, 180923, 182090, 183372, 185209, 187401, 189275, 190575, 191650, 192668, 193247, 193131, 192658, 192195, 191608, 190786, 190243, 190550, 191466, 192259, 192723, 193184, 193586, 193384, 192519, 191808, 191948, 192613, 192983, 192841, 192701, 193031, 193778, 194623, 195332, 195755, 195712, 195102, 194046, 192808, 191537, 190160, 188650, 187316, 186632, 186653, 186785, 186369, 185406, 184457, 183916, 183673, 183469, 183271, 183191, 183290, 183574, 184012, 184450, 184689, 184709, 184654, 184567, 184382, 184188, 184247, 184683, 185509, 187024, 189755, 193647, 197681, 200702, 202503, 203694, 204702, 205409, 205785, 206280, 207322, 208735, 209949, 210589, 210574, 209825, 208267, 206228, 204525, 203879]
56391B03879L40N16p5p43r49p39m53j73K08N69N09r5p32o85J68J164J526J091
56373B05326L08l15n30k40N08J292J481R46L60M39J045J474J461J343J384J496
56357B17778J670J978K049J298Ko51j00P58Q63N13O92J512K270K704L101L296
56341B39733K725J630J159J853K867L136K637K064J813J869K202K792L483M187
56327B74150M949N602N710N184M599M546M940N203M919M090L093K503K582K782
56313C34852K259J130N49J134J952J759P93M02J089J825J534M86j57K80J420K463
56297C53770K938K909K719K679L028L903N168O338O955P153P514Q315R101R254
56283D31744Q780Q381Q890J0633J3105J5241J6339J6856J7950K0168K3038K5991
$$ y = [203879, 204219, 204735, 204660, 203917, 202968, 202229, 201776, 201603, 201811, 202380, 202889, 202794, 202062, 201377, 201545, 202709, 204235, 205326, 205634, 205319, 204789, 204549, 205057, 206349, 207830, 208776, 209136, 209575, 210620, 212094, 213555, 214898, 216282, 217778, 219448, 221426, 223475, 224773, 224775, 224124, 224024, 224782, 225645, 226158, 226850, 228362, 230632, 233336, 236437, 239733, 242458, 244088, 245247, 247100, 249967, 253103, 255740, 257804, 259617, 261486, 263688, 266480, 269963, 274150, 279099, 284701, 290411, 295595, 300194, 304740, 309680, 314883, 319802, 323892, 326985, 329488, 332070, 334852, 337111, 338241, 338790, 339924, 341876, 343635, 344428, 344830, 345919, 347744, 349278, 349764, 349607, 349887, 351307, 353770, 356708, 359617, 362336, 365015, 368043, 371946, 377114, 383452, 390407, 397560, 405074, 413389, 422490, 431744, 440524, 448905, 457795, 468428, 481533, 496774, 513113, 529969, 547919, 568087, 591125, 617116]
56271F17116K9046L2262L5272L8001M1314M6112N2020N7738O2567O6884P1127
56260A149459P5057P8195Q0398Q1747Q2268Q1959Q0725P8197P3871O7545N9430
56249A988851M9933L9646K9434J9924J0951J911p236j5810k3356l0178l6679m2685
56237A984706m7814n2096n5884n9379o2599o5541o8016o9479o9485o8254o6438
56226A299721o4332o1660n8258n4620n1475m8914m6207m2578l8118l3766l0390
56215G69403k7947k5661k2966k0151j7979j6744j5809j4232j1851r532q231p910
56203E70390p712p100o351n831n308m400l338k697k462k016j090k19O2K9L98J367
56187E23722K496L450M432N655O798P291P093O787O893P445Q337R677J1373J2730
$$ y = [617116, 646162, 678424, 713696, 751697, 793011, 839123, 891143, 948881, 1011448, 1078332, 1149459, 1224516, 1302711, 1383109, 1464856, 1547124, 1629083, 1709808, 1788005, 1861876, 1929421, 1988851, 2038784, 2078430, 2107864, 2127788, 2138739, 2140650, 2133414, 2117604, 2094248, 2064070, 2027391, 1984706, 1936892, 1884796, 1828912, 1769533, 1706934, 1641393, 1573377, 1503898, 1434413, 1366159, 1299721, 1235389, 1173729, 1115471, 1060851, 1009376, 960462, 914255, 871677, 833559, 799793, 769403, 741456, 715795, 692829, 672678, 654699, 637955, 622146, 607914, 596063, 586531, 578300, 570390, 562678, 555578, 549227, 543396, 538088, 533688, 530350, 527653, 525191, 523175, 522085, 521866, 521928, 521957, 522355, 523722, 526218, 529668, 534100, 539755, 546553, 553844, 560937, 567724, 574617, 582062, 590399, 600076, 611449, 624179]
56173F24179J3047J2578J2358J2949J3884J4520J4840J5146J5446J5635J5992
56162G80574J6956J8611K0744K3335K6566L0498L5067M0484M7345N6287O7583
56151A164050Q0944R5701J11315J27615J44130J59064J69548J73313J69845J59868
56141B555393J44526J25707J06527R0291P8621P0759O4302N6337M4610K8895J1407
56130C377375m823j8158k8722l7179m4372n2247o3736q0634j01758j23588j42445
56119B679713j55934j63017j63623j58390j48421j35059j19699j03624q7867p3258
56109A370821o0402m9426l9917l1443k4065j8085j3420r624o481m151k724j984
56097A109099j657j618j869k526l684n067o026o231o108o116n865m599k406k81
$$ y = [624179, 637226, 649804, 662162, 675111, 688995, 703515, 718355, 733501, 748947, 764582, 780574, 797530, 816141, 836885, 860220, 886786, 917284, 952351, 992835, 1040180, 1096467, 1164050, 1244994, 1340695, 1452010, 1579625, 1723755, 1882819, 2052367, 2225680, 2395525, 2555393, 2699919, 2825626, 2932153, 3022444, 3101065, 3171824, 3236126, 3292463, 3337073, 3365968, 3377375, 3372552, 3354394, 3325672, 3288493, 3244121, 3191874, 3128138, 3047504, 2945746, 2822158, 2679713, 2523779, 2360762, 2197139, 2038749, 1890328, 1755269, 1635570, 1531946, 1444079, 1370821, 1310419, 1260993, 1221076, 1189633, 1165568, 1147483, 1134063, 1124439, 1117958, 1113807, 1111083, 1109099, 1107442, 1105824, 1103955, 1101429, 1097745, 1092678, 1086652, 1080421, 1074313, 1068197, 1062332, 1057733, 1055327, 1055046]
56083A055046J053J722K152K565L145M041N084N986O923Q343J0087J1354J1757
56070A129258J1800J2058J2474J2799J3189J4006J5288J6734J7921J8423J8125
56059A292075J7528J7422J8059J8999J9854K0710K1721K2722K3484K3972K4231
56048A520777K4405K4910K6117K7738K8979K9532K9908L0694L1884L3174L4482
56037A842600L5904L7438L8880L9861M0045L9617L9460M0398M2232M4056M5361
56026B285852M6410M7632M9259N1436N4097N6789N9247O1880O5064O8188P0350
56015B916204P1904P4189P7679Q1430Q4617Q7581R1031R5126R9746J04893J10350
56004C894750J15686J20885J26459J32592J38924J45342J52343J60386J69428
$$ y = [1055046, 1056099, 1057821, 1059973, 1062538, 1065683, 1069724, 1074808, 1080794, 1087717, 1096060, 1106147, 1117501, 1129258, 1141058, 1153116, 1165590, 1178389, 1191578, 1205584, 1220872, 1237606, 1255527, 1273950, 1292075, 1309603, 1327025, 1345084, 1364083, 1383937, 1404647, 1426368, 1449090, 1472574, 1496546, 1520777, 1545182, 1570092, 1596209, 1623947, 1652926, 1682458, 1712366, 1743060, 1774944, 1808118, 1842600, 1878504, 1915942, 1954822, 1994683, 2034728, 2074345, 2113805, 2154203, 2196435, 2240491, 2285852, 2332262, 2379894, 2429153, 2480589, 2534686, 2591475, 2650722, 2712602, 2777666, 2845854, 2916204, 2988108, 3062297, 3139976, 3221406, 3306023, 3393604, 3484635, 3579761, 3679507, 3784400, 3894750, 4010436, 4131321, 4257780, 4390372, 4529296, 4674638, 4826981, 4987367, 5156795]
55995E156795J79253J89711K00637K12093K24661K38807K54211K70356K87451
55986G213975L05943L25670L46481L69149L94532M22504M53004M87301N26611
55977A0845170N70402O17985O70942P31605Q00150Q75850R60487J057520J168617
55968A8298728J294576J439281J608946J807698K038339K307916K628320L011221
55960C4435025L467714M014418M675715N480019O459469P652907R099808J0826064
55952H6111139J2838479J5130193J7679041K0432007K3278904K5990502K8099815
55945B29560080K8817652K7179174K2495129J4859023N296399m611531j3365816
55938C10230110k0019055k4270643k6296046k6518097k5433921k3510940k1137458
$$ y = [5156795, 5336048, 5525759, 5726396, 5938489, 6163150, 6401957, 6656168, 6926524, 7213975, 7519918, 7845588, 8192069, 8561218, 8955750, 9378254, 9831258, 10318559, 10845170, 11415572, 12033557, 12704499, 13436104, 14236254, 15112104, 16072591, 17130111, 18298728, 19593304, 21032585, 22641531, 24449229, 26487568, 28795484, 31423804, 34435025, 37902739, 41917157, 46592872, 52072891, 58532360, 66185267, 75285075, 86111139, 98949618, 114079811, 131758852, 152190859, 175469763, 201460265, 229560080, 258377732, 285556906, 308052035, 322911058, 328207457, 323595926, 310230110, 290211055, 265940412, 239644366, 213126269, 187692348, 164181408, 143043950]
55931A43043950j8610849j6141439j3859138j1826758j0061846q556440p287394
55924E6700086o223234n332503m588578l967975l448420l010932k641330k327840
55916B5159274k059319j826981j625502j450884j298856j166080j050694r50436
55908A3730522q62043p83364p14179o53974o00674n52475n09157m70634m35747
55899H148275m03501l74010l47349l22787k99965k79517k61672k45415k29790
55890E384269k14917k01173j88289j75912j64115j52950j42315j32442j23591
55881C888565j15237j06772r8999r3613r1187r0873r1999r4315r6663r7235r5589
55870B816083r2787q9340q4769p9521p5260p2503o9837o6272o2630n9724n6995
$$ y = [143043950, 124433101, 108291662, 94432524, 82605766, 72543920, 63987480, 56700086, 50476852, 45144349, 40555771, 36587796, 33139376, 30128444, 27487114, 25159274, 23099955, 21272974, 19647472, 18196588, 16897732, 15731652, 14680958, 13730522, 12868479, 12085115, 11370936, 10716962, 10116288, 9563813, 9054656, 8584022, 8148275, 7744774, 7370764, 7023415, 6700628, 6400663, 6121146, 5859474, 5614059, 5384269, 5169352, 4968179, 4779890, 4603978, 4439863, 4286913, 4144598, 4012156, 3888565, 3773328, 3666556, 3567557, 3473944, 3382757, 3291884, 3199885, 3105570, 3008907, 2911672, 2816083, 2723296, 2633956, 2549187, 2469666, 2394406, 2321903, 2252066, 2185794, 2123164, 2063440, 2006445]
55859B006445n4090n1962n1084n0124m7796m4739m2016l9140l5211l0981k8015
55848A531287k6485k5347k4145k3209k2462k1426k0153j8993j7755j6118j4554
55837A300640j3839j3913j4150j4376j4800j5267j5516j5774j6289j6659j6488
55826A133569j6225j6451j6807j6652j6367j6895j8183j9191j9376j9180j8998
55815I39244j8693j8113j7363j6358j4857j3038j1385r972q427o673n182m338
55803G94845m018l823l438k863k539l024m194n137n225m969n289o375p773r180
55789G26998j0444j1182j1190j0940j0828j0201q059m626j280R73K139K353J484
55776F55197j93j928l523n585q408j1227j3159j4273j5211j6233j7114j7618j7551
$$ y = [2006445, 1952355, 1900393, 1849309, 1799185, 1751389, 1706650, 1664634, 1625494, 1590283, 1559302, 1531287, 1504802, 1479455, 1455310, 1432101, 1409639, 1388213, 1368060, 1349067, 1331312, 1315194, 1300640, 1286801, 1272888, 1258738, 1244362, 1229562, 1214295, 1198779, 1183005, 1166716, 1150057, 1133569, 1117344, 1100893, 1084086, 1067434, 1051067, 1034172, 1015989, 996798, 977422, 958242, 939244, 920551, 902438, 885075, 868717, 853860, 840822, 829437, 819465, 811038, 804365, 799183, 794845, 790827, 787004, 783566, 780703, 778164, 775140, 770946, 765809, 760584, 755615, 750326, 743951, 736178, 726998, 716554, 705372, 694182, 683242, 672414, 662213, 654154, 649528, 648248, 649221, 651360, 653713, 655197, 655004, 653076, 649553, 643968, 635560, 624333, 611174, 596901, 581690, 565457, 548343, 530725, 513174]
55763E13174j6641j4904j2968j1623j1067j0885j0626j0126r337q220o916n829
55751C84032n298n221n053m332l274k666k961l708m053l768l387l304l253k915
55737C30839k609k898l666m117l784l072k604k411k172j916k006k392k542k272
55723B92378k121k510k996k836k057j328j011q30m73P4P71J611K433L085L710
55708B87900M446M962M927M802N350O364O758O117N222M777M528M124L866L980
55694C58123L957L392K743K448K020Q81m63j175j403j850k455k718k987m075n674
55679C50764o437n915n163n114n436n489n373n386n280m779m194l825l294k138
55665B82941o27P09J967L606N500P004P884Q503R095R426R375R243R210Q892P782
$$ y = [513174, 496533, 481629, 468661, 457038, 445971, 435086, 424460, 414334, 404997, 396777, 389861, 384032, 378734, 373513, 368460, 364128, 360854, 358188, 355227, 351519, 347466, 343698, 340311, 337007, 333754, 330839, 328230, 325332, 321666, 317549, 313765, 310693, 308089, 305678, 303506, 301590, 299584, 297192, 294650, 292378, 290257, 287747, 284751, 281915, 279858, 278530, 277519, 276689, 276216, 276290, 277061, 278672, 281105, 284190, 287900, 292346, 297308, 302235, 307037, 312387, 318751, 325509, 331626, 336848, 341625, 346153, 350277, 354143, 358123, 362080, 365472, 368215, 370663, 372683, 373564, 373101, 371926, 370523, 368673, 366218, 363500, 360513, 356438, 350764, 344327, 338412, 333249, 328135, 322699, 317210, 311837, 306451, 301171, 296392, 292198, 288373, 285079, 282941, 282314, 283023, 284990, 288596, 294096, 301100, 308984, 317487, 326582, 336008, 345383, 354626, 363836, 372728, 380510]
55650C80510N924L808J732l75k558m551o025o834o862n953m244k423j228o74j20
55635C50127Q01J645J678O05j321l629n789p411q603r913j1587j3066j3560j3023
55621B66954j2177j1676j1507j1207j0388r078p721o811o374n948n159m160l315
55608A61433k753k518k770l402l708l032j694p76r01j655k261k420k305k053j619
55593A27566r85l75j70n50j228j704j827j854j869j571q20q6J29k2l3K31N99J138
55575A16569K057L083L589L369K873K645K873L451M089M319L875L029K261J638
55561A59720R40K68jJ74L79L31J07j81n59r66j323j835k746l814m490m587m311
55544A37106l763l017k584k959l633l428k126r07p31j083r53l36R7L02R10J992
$$ y = [380510, 386434, 390242, 391974, 391599, 389041, 384490, 378465, 371631, 364769, 358816, 354572, 352149, 350921, 350247, 350127, 350928, 352573, 354251, 354856, 353535, 349906, 344117, 336706, 328103, 318190, 306603, 293537, 279977, 266954, 254777, 243101, 231594, 220387, 209999, 200921, 193200, 186389, 180015, 174067, 168908, 164748, 161433, 158680, 156162, 153392, 149990, 146282, 143250, 141556, 140780, 139879, 138224, 135963, 133543, 131238, 129185, 127566, 126581, 126206, 126036, 125486, 124258, 122554, 120727, 118873, 117004, 115433, 114613, 114527, 114656, 114634, 114601, 114832, 115431, 116569, 118626, 121709, 125298, 128667, 131540, 134185, 137058, 140509, 144598, 148917, 152792, 155821, 158082, 159720, 160660, 160928, 160927, 161101, 161480, 161811, 161918, 161737, 161178, 160212, 158889, 157054, 154308, 150494, 146004, 141417, 137106, 133343, 130326, 127742, 124783, 121150, 117722, 115596, 114689, 113958, 112875, 111922, 111586, 111683, 111985, 112895, 114887]
55528A14887K695K316J249N79R46K077L224L937M330M764N454O448P683Q828R348
55513A78765R162Q952R312R697Q872O438L238J75k553m921o590p521q341r502
55499A95183j0572j0958j0764j0353r553q153o828o499o909o769n513m039l348
55486I4925l201k767k064j966k804l675l483k290j202j009j386j564j346j123
55472F5045j154j241j124p98m26j86j83k67m6N48Q78K96q03j251o13K44K89m70
55454E8738j323j850k055j956j554j036n97j80L34Q22J063R89O20N3l78k59L17
55437E1748O89M18j95o34p74o90l29J89L86M7l41k77K2R3Q0M65J166J555J297
55418E4915O15j45p66j024q41m85k87k24j49j46k52j59K69N35J84l81m84l50p56
$$ y = [114887, 117582, 119898, 121147, 121726, 122672, 124749, 127973, 131910, 136240, 141004, 146458, 152906, 160589, 169417, 178765, 187927, 196879, 206191, 215888, 224760, 231198, 234436, 234611, 232058, 227137, 220547, 213026, 204685, 195183, 184611, 173653, 162889, 152536, 142983, 134830, 128002, 121503, 114594, 107825, 102312, 98273, 94925, 91724, 88957, 86893, 84927, 82123, 78448, 74965, 72675, 71473, 70464, 69078, 67514, 66168, 65045, 63891, 62650, 61526, 60728, 60302, 60116, 59933, 59666, 59620, 60168, 61046, 61342, 60539, 59288, 58675, 58919, 59208, 58738, 57415, 55565, 53510, 51554, 50000, 48964, 48367, 48187, 48521, 49343, 50406, 51395, 52015, 52068, 51690, 51431, 51748, 52437, 52855, 52660, 52026, 51252, 50562, 50233, 50422, 50808, 50855, 50514, 50237, 50259, 50352, 50432, 50897, 52063, 53618, 54915, 55530, 55385, 54619, 53595, 52754, 52269, 51982, 51758, 51609, 51463, 51211, 51052, 51321, 51856, 52040, 51659, 51175, 50825, 50069]
55399E0069j624j949j301m65k43l89k76O2J38j32l99m84n31o52o88m54LL77L81
55380D1443L9l86p67j185j491j267n01P3j43o76o34L6O16P97R21J129J109Q54
55362C9967P59P87L44o74j546j747j530j078KJ647K626J839p5j354j159k42K70
55345C8836N3m88q23p14k87J42M21O58Q30O52P2m81o22n19m46k43K89P78O85J82
55325C8975j2L52P26N48q3o41p40m23n2L6r3o1K56M62J52n52j225j602j492p21
55305C3810M12R85M73m13n59M2M41K52O9K73L74n1n37m54kJ41j89n06l92O7M77
55284C4713M81L8m62m97N3Q25J424J675J452O79l21r87j167j229j304r92j53O17
55266C4845P37M64L87N25N44M71N33N10J8o96r56o57l92n09p27p41n84k71K91
$$ y = [50069, 48445, 46496, 45195, 44730, 44487, 44098, 43822, 43884, 44022, 43890, 43491, 43007, 42476, 41824, 41136, 40682, 40685, 41062, 41443, 41482, 41096, 40329, 39144, 37653, 36386, 35885, 35958, 35815, 35139, 34505, 34541, 35157, 35954, 36875, 38004, 39113, 39967, 40726, 41513, 41857, 41183, 39637, 37890, 36360, 35282, 35284, 36931, 39557, 41396, 41321, 39967, 38808, 38566, 38836, 38889, 38401, 37578, 36864, 36577, 36719, 37140, 37798, 38628, 39280, 39352, 38871, 38249, 37730, 37284, 37041, 37330, 38108, 38793, 38975, 38963, 39315, 40041, 40589, 40506, 39865, 39125, 38702, 38650, 38686, 38593, 38532, 38788, 39250, 39402, 38850, 37625, 36023, 34531, 33810, 34222, 35207, 35680, 35267, 34708, 34750, 35191, 35443, 35512, 35785, 36159, 36108, 35571, 35117, 35115, 35256, 35067, 34561, 34169, 34236, 34713, 35194, 35232, 34770, 34273, 34326, 35151, 36575, 38250, 39702, 40381, 40060, 39073, 37906, 36677, 35373, 34381, 34228, 34845, 35582, 36046, 36433, 36958, 37502, 37973, 38506, 39016, 39034, 38338, 37382, 36725, 36333, 35824, 35097, 34356, 33772, 33501, 33792]
55247C3792Q11P08J1m60k04K34J37k95l11K45Q17R70P39K45m89j195j368p68K20
55228C3839R07Q60K27l99n63m80p65j504j925j359k33L74N8n94q80o56q4O77J378
55209B8878J703J670J617J632J374P62L19M58P29L49o35j214o00P95J708J272
55193D0817k30j685k171j641o87J53P07Q96O13Om19k96J13K30j18n16n43k40M8
55174C5037J01q3m79j064j633j740j114m9P98J043R00P12M73ro34j057j097q37
55156B9268l72J98N92N88M24N47Q95Q98L37l05n92p49j137j516j363o78N9O05
55138B7699J114J600J688J127K87j05L19J133J564J310Q74Q88J285J520J468J527
55122D5298J774J750J365J230J619J768R94j43o22n09o42j070r81k52J20m36j170
$$ y = [33792, 34603, 35311, 35322, 34862, 34658, 34892, 35029, 34734, 34423, 34668, 35485, 36455, 37194, 37439, 36950, 35755, 34387, 33619, 33839, 34746, 35606, 35833, 35434, 34871, 34391, 33626, 32122, 30197, 28838, 28605, 28979, 29037, 28443, 27563, 26907, 26823, 27500, 28878, 30581, 32251, 33868, 35500, 36874, 37636, 37955, 38413, 39142, 39491, 38856, 37642, 37042, 37837, 39545, 40817, 40587, 38902, 36731, 35090, 34403, 34556, 35263, 36159, 36772, 36778, 36359, 36063, 36176, 36406, 36288, 35772, 35229, 34989, 35037, 35138, 35055, 34576, 33512, 31879, 30139, 29025, 28976, 29774, 30817, 31717, 32429, 32902, 32893, 32259, 31202, 30105, 29268, 28896, 29094, 29686, 30274, 30698, 31245, 32140, 33038, 33375, 33070, 32478, 31729, 30592, 29076, 27713, 27035, 27094, 27699, 28813, 30413, 32101, 33228, 33515, 33410, 33729, 34862, 36426, 37736, 38610, 39498, 40783, 42303, 43771, 45298, 47072, 48822, 50187, 51417, 53036, 54804, 55798, 55655, 55033, 54524, 53882, 52812, 51831, 51579, 51699, 51263, 50093]
55105E0093j204q18p58r38o47K57J156J528J369Q33M5p07j011p65l03l6p7k24
55087D7793j35L55R37R26K4j122j438o42L55M40m10j109p66K42O95l3j253j802
55069D3057j329n02n2nJ09N29R62R34L46l36m80N7Q05J181J019N17p7n37o88o14
55049D4896o20p81p84m52r1Q9M64J385K411K832K670K448K192J569Q37O54Q75
55032F0594O20k33p41m78k71p41j153o18M52J073J172J287J302O82l35q97q09
55015F0906o60o92n19r5J5m82j116j404j333j006l90K70M14j20p89j057r84q83
54997E0075p91n66j62M09J027J306Q54o9o00k43O02J309J788K194K333J916J193
54980F2575P91R45J343J705K020K131J670P46K60J011K559L659L854M006M921
$$ y = [50093, 48889, 48071, 47313, 46375, 45728, 45985, 47141, 48669, 50038, 50871, 50916, 50209, 49198, 48433, 48130, 48094, 48017, 47793, 47658, 48013, 48950, 49876, 49900, 48778, 47340, 46698, 47053, 47493, 47083, 45974, 45208, 45450, 46145, 46112, 44859, 43057, 41728, 41226, 41174, 41169, 41278, 41807, 42769, 43703, 44049, 43713, 43233, 43290, 44095, 45276, 46295, 46812, 46735, 46198, 45510, 44896, 44276, 43495, 42711, 42259, 42168, 42257, 42721, 44106, 46517, 49349, 52019, 54467, 56659, 58228, 59065, 59719, 60594, 61214, 60981, 60240, 59762, 59491, 58750, 57597, 56979, 57431, 58504, 59676, 60963, 62265, 62947, 62612, 61715, 60906, 60246, 59554, 59035, 58940, 58955, 58473, 57357, 55953, 54620, 53614, 53224, 53494, 53908, 53788, 52999, 51942, 50958, 50075, 49284, 48718, 48556, 48965, 49992, 51298, 52152, 52083, 51483, 51240, 51842, 53151, 54939, 57133, 59466, 61382, 62575, 63366, 64311, 65654, 67359, 69379, 71510, 73180, 73926, 74186, 75197, 77756, 81415, 85269, 89275, 94196]
54965I4196O128O690O752P273Q418R335R756J0595J2357J3927J3879J2245J0028
54952B21579P462L995k83m395p695j0329j2349j3388j3425j3003j2336j1089r360
54939A25384p999p449p017n883m279k982k189j520p87k16J8n0k37j95M27J552
54923H6578K736L825N134O641P646P737P588Q200R654J1168J2092J2197J1299
54910A92495R283O468L385K04l166o538r432j1480j2518j2472j1635j0751j0268
54897A23575r661q186o184m854m771n246n321m709l600k189q02J26M75N78O03
54882F9834K96m33j067j047m61J37L45P5o19j395j578p41O50J532J252Q3j197
54865F5666k007k245k129j923j748j608j489j348j110q12p20j040j454j278k41
$$ y = [94196, 100324, 107014, 113766, 121039, 129457, 138792, 148548, 159143, 171500, 185427, 199306, 211551, 221579, 229041, 233036, 232753, 228358, 220663, 210334, 197985, 184597, 171172, 158169, 145833, 134744, 125384, 117385, 109936, 102919, 97036, 92757, 89775, 87586, 86066, 85279, 85063, 85081, 85031, 84794, 84599, 85026, 86578, 89314, 93139, 98273, 104914, 112560, 120297, 127885, 136085, 145739, 156907, 168999, 181196, 192495, 201778, 208246, 211631, 211835, 208669, 202131, 192699, 181219, 168701, 156229, 144594, 133843, 123575, 113914, 105728, 99544, 94690, 89919, 84673, 79352, 74643, 71043, 68854, 68052, 68178, 68653, 69231, 69834, 70130, 69697, 68630, 67583, 67122, 67259, 67604, 67679, 67060, 65665, 64087, 63346, 63996, 65528, 66780, 66863, 65666, 63659, 61414, 59285, 57362, 55614, 54006, 52517, 51169, 50059, 49247, 48527, 47487, 46033, 44755, 44514]
54850D4514J084J825J599P04k59p46n61r6p1o75j174p93J71O33J22o53q35m88
54832D4301k19j74N2O29J237J583J748J832J745J592J825K611L321L181K319J631
54816F9214J583J729J636J699K568M111N558O535P359Q262Q945R214R591J0716
54802A48720J2329J3308J2761J0793Q094N135J974j344m481o958q479r129r297
54789A73426r369r369q940p797o221m919m296m028l457k366j182m38k45l02k70
54774A10227k5M54J261K545M263O017P343Q209R016J0033J1037J1691J2030J2243
54760B06344J2188J1526J0274Q714O796M114O75k824n784q326j0825j3137j4697
54747B05038j5177j4760j3867j2856j1822j0578r072p795p345p390o758m955k996
$$ y = [44514, 45598, 47423, 49022, 49726, 49467, 48721, 48160, 48064, 47993, 47318, 46144, 45351, 45522, 46155, 46277, 45624, 44789, 44301, 44082, 43908, 43960, 44589, 45826, 47409, 49157, 50989, 52734, 54326, 56151, 58762, 62083, 65264, 67583, 69214, 70797, 72526, 74162, 75861, 78429, 82540, 88098, 94633, 101992, 110254, 119199, 128413, 138004, 148720, 161049, 174357, 187118, 197911, 206005, 211140, 213114, 211770, 207289, 200331, 191852, 182723, 173426, 164057, 154688, 145748, 137951, 131730, 126811, 122515, 118487, 115030, 112664, 111482, 111044, 110799, 110497, 110227, 110202, 110656, 111917, 114462, 118725, 124742, 132085, 140294, 149310, 159343, 170380, 182071, 194101, 206344, 218532, 230058, 240332, 249046, 255842, 259956, 260631, 257807, 252023, 243697, 232872, 219735, 205038, 189861, 175101, 161234, 148378, 136556, 125978, 116906, 109111, 101766, 94376, 87618, 82663, 79667]
54734G9667k071k016j900j580j608j854j518n56J13J02J08N22N97k24j159j218
54718F5405p67q51j462j661j214r43j202j161k8J698K732K417J211J8o10p33p62
54701F2087r58j146r95n22n7K50N53Q96R93O57K00J63O83J346J653J524J266J162
54683F9755J179J138J121J451K176K840K969K630K242J946J551J040P26P92J056
54668I4612J301J591K040K534K925L244L548L757L923M442N630P157Q279Q695
54654A53678Q780Q956R158R058Q486P292N161J995j560m497o380p631q812r926
54640A73758j0606j0602r894q641p283o422o182n992n240l998k691j463m12j04
54626I4228r08j967j834l74Q50N80o52j556j842k015k097j643q09m24q90j725
$$ y = [79667, 77596, 75580, 73680, 72100, 70492, 68638, 67120, 66564, 66677, 66779, 66887, 67409, 68006, 67782, 66623, 65405, 64638, 63787, 62325, 60664, 59450, 58507, 57305, 56144, 56116, 57814, 60546, 62963, 64174, 64192, 63582, 62849, 62087, 61129, 59983, 58988, 58466, 58409, 58659, 59212, 60108, 61101, 61758, 61958, 62121, 62804, 64150, 65803, 67327, 68593, 69755, 70934, 72072, 73193, 74644, 76820, 79660, 82629, 85259, 87501, 89447, 90998, 92038, 92764, 93556, 94612, 95913, 97504, 99544, 102078, 105003, 108247, 111795, 115552, 119475, 123917, 129547, 136704, 144983, 153678, 162458, 171414, 180572, 189630, 198116, 205408, 210569, 212564, 211004, 206507, 200127, 192496, 183684, 173758, 163152, 152550, 142656, 134015, 126732, 120310, 114128, 108136, 102896, 98898, 96207, 94744, 94332, 94228, 93320, 91353, 89519, 89145, 89995, 90575, 89923, 88367, 86525, 84510, 82413, 80770, 79961, 79537, 78647, 76922]
54610G6922k285k358j982j289o25l50l76l45k08k05l13k69j44l24q71j411j652
54593F1915j550r80P1J023J146N65J03O6k2l96o60o90q69j148q11J79P16J75m62
54574E8371n4R53J301P82J77j91o08r72q33l26MJ98O74J134Q66J06q0N36R50N22
54554F3510j39k79K6N05J345K557L515L771L737L980M408M694M932N288N503N270
54538A12623M650L692K235N09p55j408k354m228o191o905o236n120m192l440k908
54523G9972k740k638k174j580j378j444j257r18r27j041m57O69J126M17m26m01
54507F4803J1j99r37j239p44m8K42J39p7j94m8M39R98J119N72k70o97l01O07J189
54487F5365Q90P1m17k42J31J83n4l22n86r18j203j323j357j277p58L31J462J895
$$ y = [76922, 74637, 72279, 70297, 69008, 68383, 68033, 67657, 67312, 67104, 66899, 66586, 66317, 66173, 65849, 64978, 63567, 61915, 60365, 59385, 59456, 60479, 61625, 62190, 62293, 62359, 62337, 61941, 61281, 60591, 59722, 58574, 57763, 57942, 58658, 58833, 58371, 58317, 59270, 60571, 61353, 61530, 61339, 60731, 59759, 58926, 58600, 58604, 58802, 59476, 60610, 61476, 61582, 61502, 62038, 62988, 63510, 63371, 63092, 63118, 63623, 64968, 67525, 71040, 74811, 78548, 82528, 86936, 91630, 96562, 101850, 107353, 112623, 117273, 120965, 123200, 123709, 122954, 121546, 119192, 114964, 108773, 101868, 95632, 90512, 86320, 82880, 79972, 77232, 74594, 72420, 70840, 69462, 68018, 66761, 65843, 64916, 63875, 63418, 64087, 65213, 65630, 65204, 64803, 64814, 64615, 63678, 62439, 61695, 61647, 61889, 62028, 61951, 61757, 61709, 62148, 63146, 64265, 64837, 64567, 63870, 63569, 64176, 65365, 66255, 66326, 65909, 65667, 65798, 65981, 65927, 65605, 65019, 64101, 62898, 61575, 60218, 58941, 58183, 58514, 59976, 61871]
54469F1871J484O65j44p92j084q01j06M41M27k8n31q40r73j042j070r65o26j16
54451E5770L82P96J211J579J620J204O39L19K33R9o2R7P22J460J774J386M41n81
54433F9089j108r32l98J8K66N75Q37N70l14j120r99J20J505K377K546K313K023
54416G7368J752J418J047Q49R63J279J624J995K407K627K397J880J547J499J271
54401A01923M40q30k024k773k927k456j584q68p42j045j240j046n96j25J63O5
54385H4335m60j035j155q06n24p41j306j776j830j390n81J28J86m48j080j067
54369G0450n33l3L23Q60J507J569O58n05p26K96J590K033J593J210J569K278K502
54352H6641K101J812K179K761K614J436j31j230j530j336j197j464k050k555k719
$$ y = [61871, 63355, 64020, 63876, 63084, 62000, 61199, 61093, 61534, 61961, 61933, 61402, 60562, 59589, 58547, 57477, 56512, 55886, 55770, 56152, 56948, 58159, 59738, 61358, 62562, 63201, 63520, 63753, 63852, 63790, 63887, 64609, 66069, 67843, 69229, 69670, 69089, 67981, 67049, 66651, 66669, 66935, 67510, 68347, 68917, 68603, 67483, 66484, 66604, 68109, 70486, 73032, 75345, 77368, 79120, 80538, 81585, 82434, 83397, 84676, 86300, 88295, 90702, 93329, 95726, 97606, 99153, 100652, 101923, 102363, 101533, 99509, 96736, 93809, 91353, 89769, 88901, 88159, 87114, 85874, 84828, 84232, 84107, 84270, 84335, 83875, 82840, 81685, 80879, 80355, 79614, 78308, 76532, 74702, 73312, 72731, 72859, 73045, 72597, 71517, 70450, 69917, 69884, 70207, 71067, 72574, 74143, 74801, 74296, 73570, 73866, 75456, 77489, 79082, 80292, 81861, 84139, 86641, 88742, 90554, 92733, 95494, 98108, 99544, 99413, 98183, 96653, 95317, 94120, 92656, 90606, 88051, 85332]
54337H5332k641k443k002j290p40q03j210j299j004q94j142j194q17o84j365k250
54321F3554k281j400n23k42k91l07l87o47q32o38j33K96K66k62q11o91J46Q24
54303E5641N37l53q31o73o36j158j631j293k26Q59J288P47n20j562j383j31R98
54286D9673J273J194J338J348P41k0j77J22J97L5J62N63P49P26R48J287J066K88
54268F1513k34j88k24o91q74j55Q61J153O89K42K02K86K33L5l50q55r61j91R75
54249F1466J354M69p82j178n12M22Q72P29L12k6k8L73Q68Q88J13j141k147k352
54231E9700j706n91M48R34P84M00K27K01j29q16j268j025m62k49l72k03N12J270
54213E7655J545J423J228R39L45l49n53%P66Q70Q4q22q95j18N72M14l52r80j096
$$ y = [85332, 82691, 80248, 78246, 76956, 76216, 75413, 74203, 72904, 71900, 71006, 69864, 68670, 67853, 67169, 65804, 63554, 61273, 59873, 59350, 59108, 58817, 58510, 58123, 57476, 56644, 56006, 55873, 56169, 56435, 56173, 55362, 54671, 54817, 55641, 56178, 55825, 54994, 54321, 53685, 52527, 50896, 49603, 49377, 50236, 51524, 52271, 51751, 50189, 48806, 48675, 49673, 50946, 52140, 53478, 54826, 55567, 55547, 55370, 55492, 55689, 55724, 55886, 56449, 57198, 57924, 58872, 60159, 61225, 61513, 61279, 61091, 60867, 60176, 59302, 59147, 60008, 61161, 61850, 62092, 62294, 62580, 62813, 62848, 62498, 61643, 60682, 60491, 61466, 62820, 63289, 62507, 61329, 60817, 61239, 62111, 62840, 63152, 63126, 63098, 63471, 64339, 65227, 65340, 64199, 62052, 59700, 57994, 57403, 57851, 58785, 59569, 59969, 60196, 60397, 60268, 59452, 58184, 57159, 56697, 56448, 56076, 55873, 56385, 57655, 59200, 60623, 61851, 62790, 63135, 62786, 62233, 62233, 62999, 63869, 63953, 63131, 62236, 62118, 62690, 63104, 62752, 61772, 60676]
54194F0676p43M1J118J904J778Q70j40r42j732k404k386j606q80r07j294j165
54178E2188l61M41N59r6j100j823j820j207m99N7O62J349J629J177M04r1l29o46
54160E0494r33q04l41m0n3p4Q1K45K89K49R9j59j91L22J101J513J485J493J644
54141E6420J389M63n34r04p74p51r84j049o76j35J35K4j90k10m9O0P7K74P07Q90
54121E4183L88l96o77m20l83q62j130n35M95J109J170J096R98P09M09M54O20K79
54103E7507n66j094p96j86o7m91q51p36l14L9J51J28J90M20O50O29L41O5M5K43
54083E5307L94K22l76j160j563j154j57P23J090J192J424J773J927J705J143M38
54067F2928m2K6M50N71J77j2P03J839K224J585Q00N00K21n87j411j280j74R16
$$ y = [60676, 59933, 59974, 61092, 62996, 64774, 65644, 65504, 64562, 62830, 60426, 58040, 56434, 55554, 54647, 53353, 52188, 51827, 52268, 52827, 52731, 51631, 49808, 47988, 46781, 46282, 46339, 47001, 48350, 49979, 51156, 51560, 51469, 51140, 50494, 49561, 48757, 48416, 48376, 48323, 48249, 48330, 48575, 48864, 49113, 49212, 49053, 48862, 49184, 50285, 51798, 53283, 54776, 56420, 57809, 58272, 57738, 56834, 56060, 55309, 54325, 53276, 52600, 52465, 52600, 52624, 52434, 52224, 52175, 52235, 52312, 52586, 53293, 54183, 54571, 54175, 53498, 53078, 52695, 51833, 50703, 50168, 50663, 51772, 52942, 54038, 55036, 55745, 56154, 56608, 57228, 57507, 56941, 55847, 55051, 54865, 54798, 54307, 53456, 52720, 52406, 52445, 52596, 52724, 52914, 53334, 53984, 54613, 54954, 55019, 55064, 55307, 55701, 55923, 55547, 54387, 52824, 51670, 51513, 52236, 53326, 54518, 55942, 57715, 59642, 61347, 62490, 62928, 62886, 62912, 63362, 63933, 64110, 64098, 64801, 66640, 68864, 70449, 71249, 71749, 71970, 71383, 69972, 68692, 68518, 69434]
54049F9434J262J125J155J518J872J899J695J680K093K572K445J631R46J201K197
54034I4725L060L372L447L578L667L652L703L809L696L358L097K853K078O72n39
54019A38228p80l48j08l68q14j223j598j833j841j907k280k584k331j865k041
54004A16307k929l629l567l137k882k739k520k434k531k288j350k79J86K17N33
53989H6958J089R86j93j623k123j480n89m91j362k361k397j210L07J025P20P8
53973G7334k60k65j56M8M00P17P11L06k66o04l86L39J024J124P54O08J046J605
53955H4079J708J494J532J912K131J925J642J651J822J893J957K266K768L281
53941A12061L942M962O034O486O144N618N461N449M979L875K482J147N5o04o90
$$ y = [69434, 70696, 71821, 72976, 74494, 76366, 78265, 79960, 81640, 83733, 86305, 88750, 90381, 91327, 92528, 94725, 97785, 101157, 104604, 108182, 111849, 115501, 119204, 123013, 126709, 130067, 133164, 136017, 138095, 138767, 138228, 137448, 137100, 136992, 136624, 135810, 134587, 132989, 131156, 129315, 127408, 125128, 122544, 120213, 118348, 116307, 113378, 109749, 106182, 103045, 100163, 97424, 94904, 92470, 89939, 87651, 86301, 86022, 86208, 86425, 86958, 88047, 89033, 88840, 87217, 85094, 83614, 83025, 82534, 81172, 78811, 76414, 75204, 75511, 76536, 77256, 77334, 77074, 76809, 76653, 76701, 77101, 77818, 78529, 78835, 78569, 77965, 77579, 77918, 78942, 80066, 80820, 81428, 82474, 84079, 85787, 87281, 88813, 90725, 92856, 94781, 96423, 98074, 99896, 101789, 103746, 106012, 108780, 112061, 116003, 120965, 126999, 133485, 139629, 145247, 150708, 156157, 161136, 165011, 167493, 168640, 168695, 168091, 167401]
53926A67401l86j0L79Q78J251J070M43J92R38K258L121L038K515K364K843L464
53910A91759L562K997K308K115K379K460J947J153O21L66n9q80j797k353k363
53895B04215k014j692j731k180k794l388m041m820n504n882o120o368o130m734
53881A46817k520q91p11j266j351r20r08j663k521k940l123l213k796j777j032
53866A19185j297j955j853j108r67j842k608k317j602j638k395k806k363j581
53852I2853j067q68q38r48j145j361j710k207k293j354K49J333J287O72J79k47
53836H2535p70r41l53M40N62J12j9M62Q88P27L01R2J3j77k41K33J069J540J189
53817H7662L45k44j34M88J057J221J163J317J765K082J816J042L41K54Q32J726
$$ y = [167401, 167015, 167005, 167384, 168262, 169513, 170583, 171026, 171218, 172156, 174414, 177535, 180573, 183088, 185452, 188295, 191759, 195321, 198318, 200626, 202741, 205120, 207580, 209527, 210680, 211301, 211667, 211608, 210728, 208931, 206578, 204215, 202201, 200509, 198778, 196598, 193804, 190416, 186375, 181555, 176051, 170169, 164049, 157681, 151551, 146817, 144297, 143406, 142695, 141429, 140078, 139158, 138250, 136587, 134066, 131126, 128003, 124790, 121994, 120217, 119185, 117888, 115933, 114080, 112972, 112005, 110163, 107555, 105238, 103636, 101998, 99603, 96797, 94434, 92853, 91786, 90918, 90080, 89132, 87987, 86626, 84916, 82709, 80416, 79062, 79311, 80644, 81931, 82603, 82782, 82535, 81765, 80824, 80471, 80911, 81473, 81585, 81566, 82028, 82916, 83643, 83944, 84036, 84049, 83872, 83631, 83864, 84933, 86473, 87662, 88007, 87763, 87629, 88117, 89174, 90395, 91558, 92875, 94640, 96722, 98538, 99580, 99921, 100175, 101007, 102733]
53801A02733K650L588M494M951M459L082J585P61Q15J450K223K591K103J001K83
53786A38769O47J503J653Q47o9m73o89j168j741k131k596l412m158m121l279k326
53770A17256j844j865k135k380k398k262k350k770k966k352j255o42q97j401j467
53755H8272j134q20o49n04m14m81o34p28p59p56o17l09n8j06l68n79o17n43m47
53736G7749m84q68j516j855j389m07K86L82L91Q18J422J527R41J96p1K37O19N34
53718G8512o0p19j064j174j269j203o96P8N39N04M59O97P81K70l60k14P26J466
53700G7273J302O41L09M84P38P97Q29J079J547K108K651L054L140K777K025J232
53684A01986Q22Q94J018O71n6m67q9O89J048O82P7q3L44Q96J006N81J01J32P41
$$ y = [102733, 105383, 108971, 113465, 118416, 122875, 125957, 127542, 128303, 129118, 130568, 132791, 135382, 137485, 138486, 138769, 139416, 140919, 142572, 143419, 143350, 142877, 142188, 141020, 139279, 137148, 134552, 131140, 126982, 122861, 119582, 117256, 115412, 113547, 111412, 109032, 106634, 104372, 102022, 99252, 96286, 93934, 92679, 92037, 91140, 89739, 88272, 87138, 86318, 85669, 85165, 84751, 84270, 83636, 82908, 82149, 81393, 80776, 80467, 80409, 80303, 79935, 79356, 78739, 78196, 77749, 77265, 76397, 74881, 73026, 71637, 71230, 71516, 71898, 72289, 73107, 74529, 76056, 76997, 77193, 77122, 77359, 77978, 78512, 78452, 77733, 76669, 75495, 74226, 73023, 72327, 72405, 72944, 73448, 73907, 74604, 75385, 75655, 75295, 75081, 75807, 77273, 78575, 79216, 79525, 80009, 80747, 81544, 82373, 83452, 84999, 87107, 89758, 92812, 95952, 98729, 100754, 101986, 102808, 103702, 104720, 105391, 105335, 104868, 104779, 105468, 106516, 107198, 107275, 107192, 107536, 108432, 109438, 110019, 110120, 110252, 110993]
53665A10993J402J479Q11j34n63MJ159J794J192q2p57l71L06M17O0j78j59j64
53647A17209k64l44m94p85q15j30R28J442J097M79J01k10o84j035j002r57j359
53630A13177j862j633n19P05J294J317J292J455J703J979K276K336J837R46L76
53615A26679N00Q00O27K43M55J200J384M77m91k61R34J786J737J436J493J780
53599A40779K022K236K313J960J346J103J374J604J554J758K482L062K914K495
53585A69002K465K526J995J103P04R27J068Q19O27P08N80r1p98p84j4P32O13m15
53567A81767j421j330k02O73L40n44o89K4O23O75P89J253J364N73n18r84p76n10
53549A81107m64m75m40m32m30l35j75mK13M36M99L48M4n10j381k062j824p80O7
$$ y = [110993, 112395, 113874, 114685, 114551, 113988, 113992, 115151, 116945, 118137, 118055, 117298, 116927, 117233, 117650, 117710, 117532, 117373, 117209, 116945, 116601, 116107, 115322, 114507, 114377, 115305, 116747, 117844, 118323, 118424, 118214, 117530, 116495, 115493, 114536, 113177, 111315, 109682, 109163, 109868, 111162, 112479, 113771, 115226, 116929, 118908, 121184, 123520, 125357, 126303, 126679, 127179, 127979, 128606, 128849, 129304, 130504, 131888, 132365, 131874, 131613, 132547, 134333, 136070, 137506, 138999, 140779, 142801, 145037, 147350, 149310, 150656, 151759, 153133, 154737, 156291, 158049, 160531, 163593, 166507, 169002, 171467, 173993, 175988, 177091, 177795, 178722, 179790, 180609, 181236, 181944, 182524, 182433, 181635, 180851, 180837, 181569, 182182, 181767, 180346, 179016, 178814, 179487, 179827, 179283, 178594, 178618, 179241, 179916, 180705, 181958, 183322, 183895, 183377, 182393, 181617, 181107, 180643, 180168, 179728, 179296, 178866, 178531, 178356, 178352, 178565, 179001, 179500, 179848, 179892, 179382, 178001, 175939, 174115, 173335, 173402]
53530A73402K29M08J253K190K352J991J961K229K038J429J355K168L025L206L113
53515B02349L459M112M401M140L843M068M914N985O659O588O147O146O907P836
53501B77554Q134P711P240P427Q369R528J0239J0367J0418J0886J1615J2077J2171
53488D03736J2272J2563J2792J2843J2988J3344J3539J3271J2822J2680J2897
53477E45747J3122J3125J2958J2799J2771J2836J2772J2431J2050J1931J1867
53466F84409J1428J0821J0720J1036J0728R425Q337Q708R906J0189Q908O988N315
53453H06918L964K963K609K574J812l2j968l040l639m712o289p625q339q616q502
53438G68078p881p141p073p935r091r740r655r176q789q795r080r229r088r089
$$ y = [173402, 173631, 174039, 175292, 177482, 179834, 181825, 183786, 186015, 188053, 189482, 190837, 193005, 196030, 199236, 202349, 205808, 209920, 214321, 218461, 222304, 226372, 231286, 237271, 243930, 250518, 256665, 262811, 269718, 277554, 285688, 293399, 300639, 308066, 316435, 325963, 336202, 346569, 356987, 367873, 379488, 391565, 403736, 416008, 428571, 441363, 454206, 467194, 480538, 494077, 507348, 520170, 532850, 545747, 558869, 571994, 584952, 597751, 610522, 623358, 636130, 648561, 660611, 672542, 684409, 695837, 706658, 717378, 728414, 739142, 748567, 756904, 765612, 775518, 785707, 794615, 801603, 806918, 810882, 813845, 816454, 819028, 820840, 820808, 818840, 815800, 812161, 807449, 801160, 793535, 785196, 776580, 768078, 760197, 753056, 745983, 738048, 728957, 719217, 709562, 700386, 691597, 682802, 673722, 664493, 655405, 646316]
53424F46316r653j0411j0522r708q515p494o586n499m180k817j620p84l17J59
53410E68369J023J961K251J916J985L170M797N663N588N484O063P179Q381R405
53396F33235J0066J0259J0304J0751J1664J2503J2989J3619J5001J6970J8787
53385G76148K0019K0874K1790K2973K4305K5448K6128K6442K6780K7319K7854
53374A046080K8250K8713K9303K9590K9226K8622K8400K8358K7666K6122K4531
53363A354861K3584K3019K2211K1022J9616J7942J5982J4120J2686J1374R696
53352A546113P739N844L702O34l240o914r814j2520j5742j9257k2316k4575k6064
53339A423590k6675k6386k5807k5732k6136k6185k5329k3934k2722k2016k1698
$$ y = [646316, 636663, 626252, 615730, 606022, 597507, 590013, 583427, 577928, 573748, 570931, 569311, 568527, 568210, 568369, 569392, 571353, 573604, 575520, 577505, 580675, 585472, 591135, 596723, 602207, 608270, 615449, 623830, 633235, 643301, 653560, 663864, 674615, 686279, 698782, 711771, 725390, 740391, 757361, 776148, 796167, 817041, 838831, 861804, 886109, 911557, 937685, 964127, 990907, 1018226, 1046080, 1074330, 1103043, 1132346, 1161936, 1191162, 1219784, 1248184, 1276542, 1304208, 1330330, 1354861, 1378445, 1401464, 1423675, 1444697, 1464313, 1482255, 1498237, 1512357, 1525043, 1536417, 1546113, 1553852, 1559696, 1563398, 1564032, 1560792, 1553878, 1544064, 1531544, 1515802, 1496545, 1474229, 1449654, 1423590, 1396915, 1370529, 1344722, 1318990, 1292854, 1266669, 1241340, 1217406, 1194684, 1172668, 1150970]
53328A150970k1564k1531k1641k1972k2432k2700k2593k2386k2362k2156k1060
53317I08573j9069j7097j5904j5281j4616j3701j2623j1259r587q149p594p796
53305G55897p977p736p393p371p712q318r002r287q638p251o076n653n446m690
53291F53347l430k217j111K22J658K615K948L216L869M749N634O638P705Q254
53277F94097P940P432P745Q926J0038J0435J0494J0835J1386J1617J1363J0996
53265H13304J0813J0646J0089Q978P561O334N611N243M718L659K133N14r01k035
53251H86667l042m182n594p005p923q305q837j0214j2236j3942j4656j4596j4498
53238G61637j4890j5770j6662j6907j6203j4992j4028j3458j2717j1473j0293
$$ y = [1150970, 1129406, 1107875, 1086234, 1064262, 1041830, 1019130, 996537, 974151, 951789, 929633, 908573, 889504, 872407, 856503, 841222, 826606, 812905, 800282, 789023, 779436, 771287, 763693, 755897, 747920, 740184, 732791, 725420, 717708, 709390, 700388, 691101, 682463, 675212, 669136, 663483, 658037, 653347, 649917, 647700, 646589, 646811, 648469, 651084, 654032, 657248, 661117, 665866, 671500, 678138, 685843, 694097, 702037, 709469, 717214, 726140, 736178, 746613, 757107, 767942, 779328, 790945, 802308, 813304, 824117, 834763, 844852, 853830, 861391, 867725, 873336, 878579, 883297, 886956, 889089, 889603, 888702, 886667, 883625, 879443, 873849, 866844, 858921, 850616, 841779, 831565, 819329, 805387, 790731, 776135, 761637, 746747, 730977, 714315, 697408, 681205, 666213, 652185, 638727, 626010, 614537, 604244]
53227F04244r983j0579j1423j2028j2420j2695j2798j2723j2584j2349j1852j1142
53215D61668j0494r958r227q117o920o073n645n348m907m296l780l763m404n294
53201C73442n817n918o244p252q514r241r181q673q000p220o524o196o143n944
53187B72575n539n404n813o330o374o009n749n767n751n469n006m464l836l303
53173A97761l283l883m597m803m415l796l174k513j918j715k033k549k859k855
53159A53368k596k027j166l87j93o33j260j606j500r79k29K89R9o77j295j239
53143A37969q35p22r89j270j416j519j391p39P4J13q76j922j987j263p24p70r63
53126A20770r01o16j48M92Q14P0j556k638k062m18P67R06O94P29O90J78m23m66
$$ y = [604244, 594261, 583682, 572259, 560231, 547811, 535116, 522318, 509595, 497011, 484662, 472810, 461668, 451174, 441216, 431989, 423872, 416952, 410879, 405234, 399886, 394979, 390683, 386903, 383140, 378736, 373442, 367625, 361707, 355463, 348211, 339697, 330456, 321275, 312602, 304602, 297382, 290858, 284662, 278519, 272575, 267036, 261632, 255819, 249489, 243115, 237106, 231357, 225590, 219839, 214370, 209364, 204900, 201064, 197761, 194478, 190595, 185998, 181195, 176780, 172984, 169810, 167297, 165379, 163664, 161631, 159082, 156223, 153368, 150772, 148745, 147579, 147192, 146999, 146366, 145106, 143500, 142000, 141021, 140792, 141081, 141180, 140503, 139208, 137969, 137134, 136412, 135423, 134153, 132737, 131218, 129827, 129088, 129162, 129275, 128399, 126477, 124490, 123227, 122503, 121733, 120770, 119869, 119253, 119105, 119597, 120411, 120481, 118925, 116287, 114225, 113807, 114574, 115480, 116174, 116903, 117593, 117771, 117348, 116882]
53108A16882n4J46j26m48m60l34l66m63l33lJ68k4l84n94n69m98o19j049j712
53089A09160k277k285j505k27R61J656J889J798J398P59J99L9J97K62Nm05o69
53072A10955o58l75J38P76J303J516J468J470J810K412K776K480J768J406J766
53057A31011K268K067J088n8j002j863k592k730k133j352r79r72j049j205j490
53042A19009j635j412j036p46l73J44K80l46j080r28OP29Q72J060J582J808J346
53025A19280Q32R46J322J173M79j93o39j075j460j464j030m55M6M56P82J090J547
53008A21637K027J934R31l78r98p15j84M8L8K9Q5K51O02R86J109R71Q00O75N14
52989A30362M91Q43J286J178N20J53O27J323J261M04l32j89O48J404J541J206
$$ y = [116882, 116828, 116974, 116848, 116400, 115940, 115606, 115240, 114777, 114444, 114441, 114609, 114585, 114201, 113607, 113038, 112540, 111921, 110872, 109160, 106883, 104598, 103093, 102866, 103827, 105483, 107372, 109170, 110568, 111327, 111526, 111565, 111762, 112024, 112029, 111624, 110955, 110297, 109922, 110060, 110836, 112139, 113655, 115123, 116593, 118403, 120815, 123591, 126071, 127839, 129245, 131011, 133279, 135346, 136434, 136376, 135374, 133511, 130919, 128189, 126056, 124704, 123725, 122753, 121704, 120499, 119009, 117374, 115962, 114926, 114180, 113807, 113951, 114231, 113885, 112805, 111877, 111883, 112612, 113484, 114544, 116126, 117934, 119280, 120112, 121058, 122380, 123553, 124032, 123839, 123200, 122125, 120665, 119201, 118171, 117716, 117762, 118218, 119000, 120090, 121637, 123664, 125598, 126529, 126151, 125153, 124438, 124254, 124302, 124340, 124369, 124454, 124705, 125307, 126293, 127402, 128373, 129173, 129848, 130362, 130853, 131696, 132982, 134160, 134680, 134833, 135460, 136783, 138044, 138448, 138116, 137927, 138575, 139979, 141520, 142726]
52973A42726J042J474K161K337J781J175J236J735J809J133L06kO7j49q36j421
52957A56574j325p46l66m37o04n33l76l39k30K15P99J086R60O13J54l33n31k25
52939A54356K31L08J04K00P30J250J521J719J754J196J97l23J13P92Q21L82K76
52922A65627O87J092J146J000Q25O50O23R04J377J730J783J495Q88K59O9K78J92
52905A80625n77j476j874k083k671l266l007k034j403j503j580j073m45l75q73
52890A56385j604k318k650k197j255p70j079j409j135p26q17r54l02Q92J565J389
52874A43015J111J300J631J610J245P67K10l66p58r88j365j865j897j122k18k50
52858A42060j382k614k909k198j244p52r08j441j866j751j143p11j139k175k697
$$ y = [142726, 143768, 145242, 147403, 149740, 151521, 152696, 153932, 155667, 157476, 158609, 158915, 158913, 158980, 158831, 157995, 156574, 155249, 154503, 154137, 153700, 153096, 152563, 152187, 151848, 151618, 151833, 152632, 153718, 154678, 155291, 155445, 155112, 154581, 154356, 154587, 154895, 154999, 155199, 155929, 157179, 158700, 160419, 162173, 163369, 163566, 163243, 163356, 164148, 164969, 165351, 165627, 166314, 167406, 168552, 169552, 170377, 171027, 171650, 172554, 173931, 175661, 177444, 178939, 179827, 180086, 180155, 180433, 180625, 180048, 178572, 176698, 174615, 171944, 168678, 165671, 163637, 162234, 160731, 159151, 158078, 157633, 157258, 156385, 154781, 152463, 149813, 147616, 146361, 145591, 144512, 143103, 141968, 141242, 140425, 139471, 139169, 140061, 141626, 143015, 144126, 145426, 147057, 148667, 149912, 150679, 150889, 150523, 149765, 148777, 147412, 145547, 143650, 142528, 142310, 142060, 140678, 138064, 135155, 132957, 131713, 130961, 130053, 128612, 126746, 124995, 123852, 123141, 122002, 119827, 117130]
52843A17130j960n45L14J02o25j137j213r72o36n40j000j804k221j830j068p05
52827A01290r68j426j515j006j24N60O04J82q9P1L22L53L56N95Q61Q52P11P05
52809A02334O99M94M20Q59J419J300N89L63J266K586L162K725J963J606J848K389
52793A26022K675K261J275M46L53P15P32N0q68j387j370j096p47k26N02J147J316
52776A31800R51L97M6k6k5k13o36j070j168q90o78r71j507j533q50j93k73p77
52758A22384q67m34k07o67j376j555r75q1N64P69Q34J121J473J257K48q30j120
52741A20538p72o18q72r16m60l5n1q0L62R29R95O20L53L60M05N23R81J721K344
52722A26327K683K851K817K418J841J559J650J660J316R34Q66R23P06K47o4n9
$$ y = [117130, 115170, 114625, 114939, 115041, 114416, 113279, 112066, 111094, 110458, 109918, 108918, 107114, 104893, 103063, 101995, 101290, 100322, 98896, 97381, 96375, 96251, 96811, 97415, 97597, 97508, 97579, 97901, 98254, 98610, 99205, 100066, 100918, 101629, 102334, 103033, 103527, 103947, 104806, 106225, 107525, 108114, 108477, 109743, 112329, 115491, 118216, 120179, 121785, 123633, 126022, 128697, 130958, 132233, 132679, 133032, 133747, 134479, 134529, 133661, 132274, 130904, 129808, 129061, 128835, 129337, 130484, 131800, 132751, 133148, 133194, 133168, 133143, 132930, 132294, 131224, 130056, 129166, 128488, 127517, 126010, 124477, 123627, 123434, 123161, 122384, 121517, 121083, 120876, 120209, 118833, 117278, 116303, 116222, 116786, 117555, 118389, 119510, 120983, 122240, 122488, 121658, 120538, 119766, 119148, 118276, 117360, 116900, 116865, 116814, 116734, 117096, 118025, 119020, 119640, 119993, 120353, 120758, 121281, 122262, 123983, 126327, 129010, 131861, 134678, 137096, 138937, 140496, 142146, 143806, 145122, 146056, 146922, 147845, 148551, 148798, 148734, 148675]
52706A48675l0k81o45o18L4Q18Q86l2j145j325l47Q31J077K33p84q91J88J705
52688A48349K575K366J603J010O29j6r28j396r18rL32j85r63j399j554j807k188
52671A45501k360k077j509j094j159j657k184k338k111j832j709j507r23q4N05
52656A23462M85l1o49j003q71k55N92J405K234L246M164M250L227J853J180J367
52640A44656J666J492J005O29M86M19K19l19j176j857j820j254r51j166j238p14
52624A40077k17n35j339j655j337j183j557j863j601j149j008r65o37l45o73j369
52608A22644j429m06R66J709J675J414J279J137Q59O45O71P45N75K59J60L07K20
52591A33430m90j558k306k336j768r41j64K53N7o49j344j512j105m73L9L13L12
$$ y = [148675, 148645, 148364, 147719, 147101, 147135, 147953, 148839, 148807, 147662, 146337, 145990, 146821, 147898, 148131, 147347, 146456, 146644, 148349, 150924, 153290, 154893, 155903, 156532, 156516, 155588, 154192, 153274, 153265, 153597, 153412, 152449, 151050, 149496, 147689, 145501, 143141, 141064, 139555, 138461, 137302, 135645, 133461, 131123, 129012, 127180, 125471, 123964, 123041, 122957, 123462, 123947, 123916, 123267, 122264, 121393, 121138, 121730, 123135, 125369, 128615, 132779, 137029, 140256, 142109, 143289, 144656, 146322, 147814, 148819, 149448, 149934, 150353, 150572, 150253, 149077, 147220, 145400, 144146, 143195, 142029, 140791, 140077, 139860, 139325, 137986, 136331, 134994, 133811, 132254, 130391, 128790, 127641, 126633, 125668, 125031, 124686, 124013, 122644, 121215, 120809, 121775, 123484, 125159, 126573, 127852, 128989, 129848, 130493, 131164, 131909, 132484, 132743, 132903, 133210, 133430, 132940, 131382, 129076, 126740, 124972, 124031, 123867, 124120, 124177, 123528, 122184, 120672, 119567, 119094, 119133, 119446, 119758]
52574A19758nm71o30j63N93Q50K64o32j099j063r43q43n04j2P0m65j066j157q59
52555A11623o32o08o63p41o87j74P06J272J206J188J758K081R67j092k219j651
52539A12334p06p93j547j706r32M9O12O78L60j25m47n34o73q34m62N52J312J053
52521A08191K96lM5l40j026j056l20J04m09j108j117p00o05q14p43k61J54J23
52503A00411k50o25p07m41j55k94q39j227j054n23LM76Q73Q21O1r62j447j108
52485I3013l42L94R77J460J822J941J616P75k29p16m13J10R6m71r08p16l4P03
52467I9078J120R75L42k44k11L56P90O50J20m10p37p06j50P44J352J198M48m05
52449A04310j051j397j369j031p29p85j092j249r78l46L59P73O54J40l57o00o55
$$ y = [119758, 119753, 119282, 118652, 118489, 119082, 119932, 120196, 119564, 118465, 117402, 116459, 115616, 115112, 115100, 115170, 114705, 113639, 112482, 111623, 110991, 110383, 109720, 108979, 108292, 108118, 108824, 110096, 111302, 112490, 114248, 116329, 117296, 116204, 113985, 112334, 111628, 110835, 109288, 107582, 106650, 106699, 107311, 107989, 108349, 108224, 107777, 107243, 106570, 105736, 105274, 105826, 107138, 108191, 108487, 108484, 108529, 108189, 107163, 106107, 105787, 105891, 105482, 104374, 103257, 102557, 101952, 101138, 100395, 100134, 100288, 100411, 100161, 99536, 98829, 98388, 98233, 97939, 97100, 95873, 94819, 94296, 94299, 94775, 95648, 96469, 96530, 95568, 94121, 93013, 92671, 93065, 94042, 95502, 97324, 99265, 100881, 101656, 101427, 100711, 100298, 100408, 100504, 100033, 99125, 98409, 98375, 99078, 100198, 101173, 101515, 101271, 101060, 101416, 102206, 102856, 102976, 102566, 101829, 101123, 100973, 101717, 103069, 104267, 104715, 104310, 103259, 101862, 100493, 99462, 98733, 97948, 96856, 95607, 94629, 94283, 94642, 95415, 96069, 96209, 95852, 95252, 94597]
52432I4597m58L21J647K729K790K052J342R32M04l54p46m06J64K66j11m88n97
52415A04084m48k1N89R45O76M4l36k81j25p6l5oj60l51j00O90J386J378Q28L10
52395A08991J0k79n38l63M46J539K308K392J776P27k98q63q82o06k45K19P27Q58
52377A15919K68o59r84k43R16J403Q77k9n45n09j86K51P81J309J696J916J954
52360A24135J634Q59Ml31j9M59O63O76P76R32R62R72J286J927K424K310J646R73
52342A42288P61R72J261J494J869K346K331J323j78r62m78N51J062Q43M35L09
52326A56227N72J240K224L109L409L111K640K354K321K513K836L110L289L694
52312A92649M596N728O654P416Q280Q931Q677P579O611O478O846P084P164P336
$$ y = [94597, 94139, 94460, 96107, 98836, 101626, 103678, 105020, 105952, 106356, 106002, 105256, 104850, 105014, 105280, 105169, 104681, 104084, 103636, 103615, 104204, 105149, 105825, 105869, 105533, 105252, 105127, 105051, 105016, 105010, 104850, 104499, 104399, 105089, 106475, 107853, 108681, 108991, 109001, 108722, 108184, 107821, 108267, 109806, 112114, 114506, 116282, 117009, 116711, 115848, 114966, 114360, 114115, 114334, 115061, 115919, 116187, 115528, 114544, 114301, 115217, 116620, 117497, 117468, 116923, 116414, 116228, 116479, 117260, 118569, 120265, 122181, 124135, 125769, 126628, 126632, 126301, 126282, 126741, 127404, 128080, 128856, 129788, 130750, 131722, 133008, 134935, 137359, 139669, 141315, 142288, 143049, 144021, 145282, 146776, 148645, 150991, 153322, 154645, 154467, 153505, 153027, 153578, 154640, 155483, 155918, 156227, 156799, 158039, 160263, 163372, 166781, 169892, 172532, 174886, 177207, 179720, 182556, 185666, 188955, 192649, 197245, 202973, 209627, 217043, 225323, 234254, 242931, 250510, 257121, 263599, 270445, 277529, 284693, 292029]
52298B92029P439P144O585O283O573P444Q618R516R535Q785Q177Q351Q861Q958
52284D04298Q743Q846R335R736R915J0127J0229R714Q665P795P399P001O289N614
52270E23706N209M712L948L476L678L904L305K133J486J848K629L081L043K695
52256E68853K135J453Q95P13R18J260J377J119Q26J099K089L211L755L650L393
52241E96746L475M110N252O479P168P160P084P571Q381Q835Q830Q840Q995Q927
52227F97853Q575Q407Q572Q494P643O254M930L951L298K906K640K305J993K034
52213G69855K381K439J803P75j55r48j727k299k490k555k787l028l061l192l813
52198G51198m640n035n016n201n845o432o365n486m027k525j825k450l868m862
$$ y = [292029, 299468, 306612, 313197, 319480, 326053, 333497, 342115, 351631, 361166, 369951, 378128, 386479, 395340, 404298, 413041, 421887, 431222, 440958, 450873, 461000, 471229, 480943, 489608, 497403, 504802, 511803, 518092, 523706, 528915, 533627, 537575, 541051, 544729, 548633, 551938, 554071, 555557, 557405, 560034, 563115, 566158, 568853, 570988, 572441, 573336, 574049, 574967, 576227, 577604, 578723, 579549, 580648, 582737, 585948, 589703, 593353, 596746, 600221, 604331, 609583, 616062, 623230, 630390, 637474, 645045, 653426, 662261, 671091, 679931, 688926, 697853, 706428, 714835, 723407, 731901, 739544, 745798, 750728, 754679, 757977, 760883, 763523, 765828, 767821, 769855, 772236, 774675, 776478, 777253, 777098, 776150, 774423, 772124, 769634, 767079, 764292, 761264, 758203, 755011, 751198, 746558, 741523, 736507, 731306, 725461, 719029, 712664, 707178, 703151, 700626, 698801, 696351, 692483, 687621]
52184F87621m828m206l669l439l527l887m052l355j916r05j256k564l669l954
52170F42394l609l066k746l020l837m481m220l127j953j360j619k641l776l940
52156E98999k677r75l53j093k069k294j957j727j777j886k003k201k452k702k989
52141E69844l188k976k346j833j854k073j843j141o37p90j308j595j528j564k108
52126E43060k937l419l239k775k525k430k086j521j281j621k034j880j136k63
52112E13913L85P54R56J299K192L678N229O354P199Q130R002R413R583J0214J1370
52097E99671J2145J1875J1120J0952J1634J2543J3146J3450J3544J3333J2899
52086G36312J2635J2719J2699J2012J0763R713R411R603R519Q650P157N651M636
$$ y = [687621, 682793, 678587, 674918, 671479, 667952, 664065, 660013, 656658, 654742, 653837, 652581, 650017, 646348, 642394, 638785, 635719, 632973, 629953, 626116, 621635, 617415, 614288, 612335, 610975, 609356, 606715, 602939, 598999, 596322, 595347, 594994, 593901, 591832, 589538, 587581, 585854, 584077, 582191, 580188, 577987, 575535, 572833, 569844, 566656, 563680, 561334, 559501, 557647, 555574, 553731, 552590, 551953, 551163, 549855, 548260, 546732, 545168, 543060, 540123, 536704, 533465, 530690, 528165, 525735, 523649, 522128, 520847, 519226, 517192, 515312, 514176, 513913, 514298, 515052, 516008, 517307, 519499, 523177, 528406, 534760, 541959, 550089, 559091, 568504, 578087, 588301, 599671, 611816, 623691, 634811, 645763, 657397, 669940, 683086, 696536, 710080, 723413, 736312, 748947, 761666, 774365, 786377, 797140, 806853, 816264, 825867, 835386, 844036, 851193, 856844, 861480]
52073H61480M173L980L724L207K354J163k10j447k315k872l345l732l812l578
52059H58770l509m132n268o043n766m716l828l681l957m020l725l427l309l102
52045H00287k600k111k074k355k325j647o49J73O81R61J006Q84R32J403J984K113
52029G96663J765J493J675K044K137J837J293O76K40K68O53P23q1j472k634l181
52013H04099l488m108n251o805q471r760j0278j0231j0376j1259j2657j3961j4834
52000F82620j5258j5299j5165j5247j5662j5900j5415j4495j3984j4041j3851
51989E18303j2837j1602j1200j1831j2837j3757j4748j5925j6905j7230j6865
51978C62566j6062j5025j3846j2587j1334j0213r488r295r347r118q401p418o409
$$ y = [861480, 865653, 869633, 873357, 876564, 878918, 880081, 879871, 878424, 876109, 873237, 869892, 866160, 862348, 858770, 855261, 851129, 845861, 839818, 834052, 829336, 825508, 821827, 817870, 813850, 810125, 806698, 803389, 800287, 797687, 795576, 793502, 791147, 788822, 787175, 786526, 786699, 787380, 788341, 789347, 790231, 791163, 792566, 794550, 796663, 798428, 799921, 801596, 803640, 805777, 807614, 808907, 809583, 809823, 810091, 810744, 811467, 811386, 809914, 807280, 804099, 800611, 796503, 791252, 784447, 775976, 766216, 755938, 745707, 735331, 724072, 711415, 697454, 682620, 667362, 652063, 636898, 621651, 605989, 590089, 574674, 560179, 546195, 532154, 518303, 505466, 493864, 482664, 470833, 457996, 444239, 429491, 413566, 396661, 379431, 362566, 346504, 331479, 317633, 305046, 293712, 283499, 274011, 264716, 255369, 246251, 237850, 230432, 224023]
51965B24023n452m700m280l866k960j706r24r86j352j601k171l415m569m569l520
51950A77952k395j611r21n00r04j901k454k177j782j742j605j132r91j571k104
51935A54162j867j393j462j632j008l3r2j388k549k504j659q77l51P9K65R8q5
51918A37704J4J12j72o32o69j08N93Q74O08J79O3K83L27j25n97l45N47J165R06
51899A40727J21n12p28n23Q4P99J064P87O12J014J537J539J294J604K449K909
51883A54777K505J898J937K561L068L105K992L197L907N033O332P470Q227Q795
51869B15804R774J1613J4094J6541J8654K0877K3718K6798K8965K9327K7736K4157
51857D68058J8146R530n74j0023j7183k1911k5029k7091k7906k7095k4904k2240
$$ y = [224023, 218571, 213871, 209591, 205725, 202765, 201059, 200135, 199149, 197797, 196196, 194025, 190610, 186041, 181472, 177952, 175557, 173946, 173025, 172525, 171621, 169720, 167266, 165089, 163307, 161565, 159960, 158828, 157837, 156266, 154162, 152295, 150902, 149440, 147808, 146800, 146767, 146675, 145287, 142738, 140234, 138575, 137698, 137347, 137426, 137691, 137789, 137704, 137718, 137830, 137658, 137026, 136357, 136249, 136842, 137716, 138324, 138503, 138566, 138849, 139176, 139051, 138454, 138109, 138656, 139821, 140727, 140848, 140336, 139608, 139085, 139169, 139968, 141032, 141819, 142431, 143445, 144982, 146521, 147815, 149419, 151868, 154777, 157282, 159180, 161117, 163678, 166746, 169851, 172843, 176040, 179947, 184980, 191312, 198782, 207009, 215804, 225578, 237191, 251285, 267826, 286480, 307357, 331075, 357873, 386838, 416165, 443901, 468058, 486204, 495734, 495160, 485137, 467954, 446043, 421014, 393923, 366017, 338922, 314018, 291778]
51845B91778j9980j8222j6430j4284j2127j0446r173p872o471n320m554l814k904
51832A60181k262k395l002l131k273q98J55N91O73O20L40j98p36j016j064r94
51816A44591p19j32N45R09Q35N37J87k23o17q07p94q26r85j024q18n97n37l65
51798A39160J93Q27R28L81l43p97q83n73K14J246J866J577N88l91q27p13m23l35
51780A41695n43p41n20R8N16J63q07j589j575r13j59M44J090J835K290K015J085
51763A44384L7o65r24q79p07n85n48l98O9P25J160J186R24N04l6m59l61K73Q75
51744A44575R58O11J31l73p46o37j18L9o41j432j348o92o41j339j485l20J100
51727A37642J288K94n62m85O1K37k77j175j748j299J15J438J619Q51J91N9j63
$$ y = [291778, 271798, 253576, 237146, 222862, 210735, 200289, 191116, 183244, 176773, 171453, 166899, 163085, 160181, 157919, 155524, 152522, 149391, 147118, 146220, 146375, 146966, 147639, 148259, 148599, 148401, 147665, 146649, 145585, 144591, 143872, 143740, 144285, 145194, 146029, 146566, 146753, 146530, 145913, 145106, 144312, 143486, 142501, 141477, 140659, 140062, 139525, 139160, 139353, 140180, 141108, 141489, 141146, 140349, 139466, 138893, 139107, 140353, 142219, 143796, 144384, 143993, 143166, 142453, 142030, 141695, 141152, 140411, 139891, 139989, 140505, 140668, 139861, 138272, 136697, 135784, 135625, 136069, 137159, 138994, 141284, 143299, 144384, 144421, 143756, 142832, 141953, 141246, 140661, 140113, 139715, 139784, 140509, 141669, 142855, 143779, 144283, 144247, 143788, 143427, 143700, 144575, 145533, 146144, 146275, 145902, 145156, 144519, 144401, 144440, 143799, 142367, 141019, 140327, 139686, 138347, 136862, 136542, 137642, 138930, 139224, 138662, 138177, 138238, 138475, 138198, 137023, 135275, 133976, 134091, 135529, 137148, 137999, 138190, 138249, 138086]
51710A38086q43j313q72K4L69N2j24J45K02l95j011q85l72l93q90q59J8P31M72
51691A32142o4K11R41P23p74k227k449j806j333j202r02l92j99m35n46j28N01
51674A22061P83N77J74q8o5J98N75R31J140J039N61l3k56Q7O91J195J538J713
51656A32821J536J071Q70J258J598J033j57p40k04M55J04j059j836j553o81p1
51640A34445p1m13p24r33j164j343j092l02M52M10l86j102j143p59m77l72k04
51623A24822J56O46J110J242Q23J33k29j24J5j1J13L58J09o66q32L46J759J785
51605A31555O10j40J29L98Q4M5Q83J686J466P67O95J097J026N34O50J651K529
51588A45665K360J343K30m79n55K6Q08J034M37m14p86m40L98J329J885J869J625
$$ y = [138086, 137243, 135930, 135058, 135082, 135451, 135503, 135379, 135524, 135726, 135331, 134320, 133435, 133063, 132670, 131780, 130921, 130939, 131670, 132142, 132078, 132289, 133230, 133953, 133179, 130952, 128503, 126697, 125364, 124162, 123260, 122868, 122669, 122234, 121688, 121560, 122061, 122844, 123421, 123595, 123507, 123442, 123640, 124215, 125146, 126286, 127325, 127886, 127853, 127597, 127684, 128375, 129570, 131108, 132821, 134357, 135428, 136298, 137556, 139154, 140187, 140030, 139290, 139086, 139541, 139645, 138586, 136750, 135197, 134516, 134445, 134374, 133961, 133237, 132304, 131140, 129797, 128705, 128403, 128855, 129265, 128879, 127777, 126634, 125875, 125398, 125026, 124822, 124978, 125624, 126734, 127976, 128799, 128932, 128703, 128579, 128594, 128583, 128696, 129054, 129163, 128497, 127665, 128011, 129770, 131555, 132165, 132025, 132154, 132552, 132636, 132681, 133564, 135250, 136716, 137483, 138178, 139275, 140301, 140835, 141485, 143136, 145665, 148025, 149368, 149598, 149119, 148564, 148590, 149398, 150432, 150869, 150455, 149669, 149229, 149627, 150956, 152841, 154710, 156335]
51571A56335J638J764J428O89L92R47J640J711J477J711K343K563K052J297O97
51556A78684J29m49o85m30j57l38p30o75L2R15J424J441J171P28L3r11j751j999
51538A76432j578r83p58q82r11o07j86M7j2l20p53j018q34l29kr1k87k94l69r31
51518A65334j845k471k497k316k463k917l090k421r46O29J406J019m7r96j472
51503A44907j652j626j147j66P79J086Q33N61M18l3r46j667j478o59k78q67j733
51486A36332j807r40K2L36J23j1K11N69Q30J026J228J316J125P66O04Q76J377
51469A43983J606J230M29k64m57j63M35J208J950K231J807J067O39M84p7j239
51453A54869k201k285k095k718m015m664m073l274l391l987l720k291p35L8K36
$$ y = [156335, 157973, 159737, 161165, 161854, 162246, 163193, 164833, 166544, 168021, 169732, 172075, 174638, 176690, 177987, 178684, 178813, 178364, 177679, 177249, 177092, 176754, 176024, 175349, 175381, 176296, 177720, 179161, 180332, 181060, 181093, 180182, 178431, 176432, 174854, 173871, 173113, 172231, 171320, 170713, 170527, 170574, 170562, 170242, 169489, 168471, 167637, 167308, 167306, 167215, 166928, 166634, 166265, 165334, 163489, 161018, 158521, 156205, 153742, 150825, 147735, 145314, 144368, 144997, 146403, 147422, 147375, 146379, 144907, 143255, 141629, 140482, 140316, 141095, 142181, 143014, 143575, 143993, 143960, 143014, 141347, 139869, 139210, 138932, 138065, 136332, 134525, 133585, 133607, 133943, 134066, 134055, 134266, 134835, 135665, 136691, 137919, 139235, 140360, 141126, 141730, 142606, 143983, 145589, 146819, 147248, 146984, 146527, 146364, 146799, 148007, 149957, 152188, 153995, 155062, 155701, 156185, 156108, 154869, 152668, 150383, 148288, 145570, 141555, 136891, 132818, 129544, 126153, 122166, 118446, 116155, 115420, 115458, 115694]
51438A15694M90Q52Q87L96k98o53l69L38Q15O13M2j73J14K98m9n10n26l14m66
51419A17181q69p30K01J069R60Q7n71o59q42j745k942l459l009k212j673j345
51403I9442r85o67m90k58Q5N7o75j462j295k50N67N47J75q8n28j190j221j30J009
51384I2643Q11l75r16j98P18Q66O65R09J496J800J624J160M56m67j225j385r45
51367I7637k00O10J242J325P69Jm68n10j88M54J112J143L65m47m82m2j44j042
51349A01135j918k060j732j613j862k017j598n43P37J696K093K094J819J077r6
51334I7212r88q83j09K99j6l48p5M94Q04Q32P48L77l19o47P4J332J766Q48m35
51315A00966q28l20No57j918k696k361j298l81m1m7j32m54j208k040k242j520
$$ y = [115694, 116184, 117036, 117923, 118319, 118021, 117368, 116999, 117337, 118152, 118765, 118807, 118634, 118748, 119046, 118997, 118487, 117961, 117647, 117181, 116312, 115582, 115783, 116852, 117812, 117899, 117328, 116669, 115827, 114082, 111140, 107681, 104672, 102460, 100787, 99442, 98457, 97790, 97300, 97042, 97127, 97184, 96509, 95047, 93752, 93502, 94069, 94616, 94791, 94703, 94175, 92985, 91764, 91634, 92643, 93454, 93079, 92163, 91965, 92683, 93549, 94214, 95123, 96619, 98419, 100043, 101203, 101659, 101192, 99967, 98582, 97637, 97437, 98047, 99289, 100614, 101383, 101384, 100916, 100406, 100218, 100672, 101784, 102927, 103292, 102845, 102363, 102321, 102177, 101135, 99217, 97157, 95425, 93812, 91950, 89933, 88335, 87792, 88529, 90225, 92318, 94412, 96231, 97308, 97212, 96224, 95341, 95232, 95531, 95515, 95167, 95092, 95586, 96390, 97222, 97970, 98347, 98028, 97381, 97455, 98787, 100553, 101401, 100966, 100138, 99818, 99823, 99166, 97248, 94552, 92191, 90893, 90512, 90471, 90424, 90292, 89838, 88630, 86590, 84348, 82828]
51298H2828k84Q34J493J660J445J059P26N31L96L29N28J158K078K844L004K483
51282A03112J769J593K184K959L148K698K249K202K209J679N31p88j810k347k493
51267A18895k513k633k807k786k480k028j473p20M8L18l7l42N5Q20J051N75J75
51250A04118L77P25N19j89p73q28m08L78J404K295K516J915R76L51K59L71K94
51233A14300N3M4M09P06M13l04p27n27j26M0J48N00Q53P90N30O61J127J199N79
51214A20668m3N0O05P81K27o42j327j679j667j216m91j1j78p68j198j289j430
51197A10392j832j947j128K72J018M64n98r92n84j05J62O16J303J548R96K91J26
51180A10002K96K56J75N30J046R27J64l50k13q7n21j011r47p90j384k360k332
$$ y = [82828, 82544, 83378, 84871, 86531, 87976, 89035, 89761, 90292, 90688, 91017, 91545, 92703, 94781, 97625, 100629, 103112, 104881, 106474, 108658, 111617, 114765, 117463, 119712, 121914, 124123, 125802, 126333, 125545, 123735, 121388, 118895, 116382, 113749, 110942, 108156, 105676, 103648, 102175, 101455, 101503, 101821, 101784, 101442, 101497, 102317, 103368, 103943, 104118, 104495, 105220, 105739, 105550, 104777, 103949, 103541, 103919, 105323, 107618, 110134, 112049, 113025, 113376, 113635, 114006, 114300, 114353, 114397, 114806, 115512, 115925, 115621, 114894, 114367, 114241, 114281, 114429, 114929, 115782, 116572, 117102, 117763, 118890, 120089, 120668, 120625, 120675, 121280, 122061, 122288, 121646, 120319, 118640, 116973, 115757, 115266, 115255, 115077, 114309, 113111, 111822, 110392, 108560, 106613, 105485, 105757, 106775, 107239, 106641, 105649, 105065, 104960, 105122, 105738, 107041, 108589, 109585, 109876, 110002, 110298, 110554, 110729, 111259, 112305, 113232, 113396, 113046, 112833, 112746, 112225, 111214, 110267, 109477, 108093, 105733, 103401]
51163A03401p82J072J740J159M13J96K34L4m09p80q18l97M41J301J603J167N01
51146A10076K44M87Q73J189J515J839J890J513R16L91m3n76j191j534j187p3J411
51129A17740K560K799K099J060N38R95K110L035L129K435J429L93o78j598j842
51114A36204j167j83J12n49j365j366n31J68j52j207j745q92P58J753J395L62
51098A31595m16q56j326j679j447p58k71k38k98j99r8M5O47J805K949L439L138
51081A36032K226J013J36K48J100J535Q10n60j645k173k253j667k88J167J607
51066A37288P66o43j830k488k630k468k287k009j110M96J812J730N40l28m5Q30
51050A27624J329J139O21K88N12J202J718J536J003R34J519K192K521K549K316
$$ y = [103401, 102619, 103691, 105431, 106590, 107003, 107199, 107433, 107467, 107058, 106278, 105460, 105063, 105504, 106805, 108408, 109575, 110076, 110320, 110807, 111680, 112869, 114384, 116223, 118113, 119626, 120542, 120933, 120890, 120314, 119123, 117589, 116402, 116329, 117740, 120300, 123099, 125198, 126258, 126796, 127791, 129901, 132936, 136065, 138500, 139929, 140322, 139644, 138046, 136204, 135037, 134854, 134966, 134417, 133052, 131686, 131155, 131323, 131171, 129964, 128219, 127327, 128085, 129838, 131233, 131595, 131179, 130323, 128997, 127318, 125871, 125113, 124842, 124604, 124306, 124107, 124009, 124054, 124701, 126506, 129455, 132894, 136032, 138258, 139271, 139407, 139655, 140755, 142290, 143100, 142540, 140895, 138722, 136469, 134802, 134514, 135681, 137288, 138054, 137411, 135581, 133093, 130463, 127995, 125708, 123699, 122589, 123085, 124897, 126627, 127167, 126839, 126794, 127624, 128953, 130092, 130713, 131001, 131513, 132715, 134433, 135969, 136972, 137906, 139425, 141617, 144138, 146687, 149003]
51035A49003J791J374J639K416K868K666K338K211J905J228O99P14R28J037J371
51020A74188K021K248J554P32Q82J864K654K865K976L206L233L001K959L338L880
51005B11601M375M944N688O548P515Q488R027Q841Q425Q628R581J0732J1877J3325
50991C29595J4916J5844J5865J5907J6936J8717K0285K1224K1794K2244K2685
50980E36012K3521K5217K7628L0027L2021L3903L5899L7584L8386L8358L7939
50969H96495L7092L5246L2241K8811K5741K2905J9598J5709J1969Q996O670M623
50957A146096K922J852J389J283J512K195L147L860L898L123J576n68l036n717
50943A163532q796j2451j6492k0521k4329k7945l1348l4400l6945l8848m0018
$$ y = [149003, 150794, 152168, 153807, 156223, 159091, 161757, 164095, 166306, 168211, 169439, 170138, 170852, 171780, 172817, 174188, 176209, 178457, 180011, 180743, 181625, 183489, 186143, 189008, 191984, 195190, 198423, 201424, 204383, 207721, 211601, 215976, 220920, 226608, 233156, 240671, 249159, 258186, 267027, 275452, 284080, 293661, 304393, 316270, 329595, 344511, 360355, 376220, 392127, 409063, 427780, 448065, 469289, 491083, 513327, 536012, 559533, 584750, 612378, 642405, 674426, 708329, 744228, 781812, 820198, 858556, 896495, 933587, 968833, 1001074, 1029885, 1055626, 1078531, 1098129, 1113838, 1125807, 1134803, 1141473, 1146096, 1149018, 1150870, 1152259, 1153542, 1155054, 1157249, 1160396, 1164256, 1168154, 1171277, 1172853, 1172285, 1169249, 1163532, 1154736, 1142285, 1125793, 1105272, 1080943, 1052998, 1021650, 987250, 950305, 911457, 871439]
50932H71439m0578m0757m0491l9383l7327l4804l2291k9708k6876k4165k2073
50921E02986k0437j8654j6557j4451j2434j0370q443p123o443n887n085m138l293
50908C69671k771k743k976k657j315K44Q02M11K58P82J174J009J097K137L554
50893C68677M526N159N767N917N275M661N067O178P019P659Q914J0588J1508J1445
50879D68360J1656J3086J5183J7025J8752K1068K4027K7016K9653L2158L5017
50868G13001L8635M3175M8384N3782N9083O4299O9290P3711P7505Q1155Q5110
50857A407130Q9186R2608R4490R4217R1742Q7544Q2002P4843O5566N4478M2777
50846B276583L1524K1065J1592L546k800p556j0582j1298r626o523k992Q81N248
$$ y = [871439, 830861, 790104, 749613, 710230, 672903, 638099, 605808, 576100, 549224, 525059, 502986, 482549, 463895, 447338, 432887, 420453, 410083, 401640, 394517, 388074, 382187, 377102, 372964, 369671, 366900, 364157, 361181, 358524, 357209, 357453, 358255, 358666, 358924, 359706, 360880, 361889, 362986, 365123, 368677, 373203, 378362, 384129, 390046, 395321, 399982, 405049, 411227, 418246, 425905, 434819, 445407, 456915, 468360, 480016, 493102, 508285, 525310, 544062, 565130, 589157, 616173, 645826, 677984, 713001, 751636, 794811, 843195, 896977, 956060, 1020359, 1089649, 1163360, 1240865, 1322020, 1407130, 1496316, 1588924, 1683414, 1777631, 1869373, 1956917, 2038919, 2113762, 2179328, 2233806, 2276583, 2308107, 2329172, 2340764, 2344310, 2341510, 2333954, 2323372, 2312074, 2302448, 2295925, 2292933, 2293814, 2299062]
50833B299062R414J2258J3323J2561R401L159n599j5331k5292l5994m7642n9156
50821B170164o9335p8031q5514r1460r5358r7316r7599r5836r1717q6094q0404
50810A201500p5000o8967o1715n3951m6850m0987l6256l2211k8243k3976j9738
50799G13606j6189j3318j0426p338m900l807l580l289k798k611k877l230l474
50786F35769l691l832l828m019m794n777o077n513n027n555o919q083q201p208
50772E57245n704m432l676l019j873k36J376K744M237O210Q500J0729J2712J4397
50758E99210J5730J6847J8065J9464K0773K1779K2596K3352K4111K5235K7329
50747H34491L0412L3650L6321L8753M1721M5247M8533N0873N2125N2394N1814
$$ y = [2299062, 2308476, 2320734, 2334057, 2346618, 2356019, 2359178, 2353579, 2338248, 2312956, 2276962, 2229320, 2170164, 2100829, 2022798, 1937284, 1845824, 1750466, 1653150, 1555551, 1459715, 1367998, 1281904, 1201500, 1126500, 1057533, 995818, 941867, 895017, 854030, 817774, 785563, 757320, 733344, 713606, 697417, 684099, 673673, 666335, 661435, 657628, 654048, 650759, 647961, 645350, 642473, 639243, 635769, 632078, 628246, 624418, 620399, 615605, 609828, 603751, 598238, 593211, 587656, 580737, 572654, 564453, 557245, 551541, 547109, 543433, 540414, 538541, 538305, 539681, 542425, 546662, 552872, 561372, 572101, 584813, 599210, 614940, 631787, 649852, 669316, 690089, 711868, 734464, 757816, 781927, 807162, 834491, 864903, 898553, 934874, 973627, 1015348, 1060595, 1109128, 1160001, 1212126, 1264520, 1316334]
50736A316334N0562M8575M5260L9966L2838K4760J6449Q032l94q212j4513j8630
50724A541027k0396k0145j8499j5939j2514q251l758N2K816M865O379O842N492
50711A467971K033l367j0317j8171k6030l3141l9283m4626m9324n3243n5901n6624
50699A079977n5099n1931m8295m4896m1539l7776l3616k9303k4932k0661j6944
50688F74985j4061j1603q948o013l098j47L140O531R217J0756J1575J2320J3160
50675F97814J3929J4441J4380J3336J1399R395P975O825N327L754L049L419M000
50662H09043M152M318N070N964O171N914O427Q314J0760J2642J3947J5577J7972
50649I26271K0428K1861K2044K1808K2018K2435K1918J9868J7094J4770J2919
$$ y = [1316334, 1366896, 1415471, 1460731, 1500697, 1533535, 1558295, 1574744, 1582776, 1582382, 1574170, 1559657, 1541027, 1520631, 1500486, 1481987, 1466048, 1453534, 1445283, 1441525, 1441577, 1444393, 1449258, 1455637, 1462479, 1467971, 1470004, 1466637, 1456320, 1438149, 1412119, 1378978, 1339695, 1295069, 1245745, 1192502, 1136601, 1079977, 1024878, 972947, 924652, 879756, 838217, 800441, 766825, 737522, 712590, 691929, 674985, 660924, 649321, 640373, 634360, 631262, 631115, 634255, 640786, 650003, 660759, 672334, 684654, 697814, 711743, 726184, 740564, 753900, 765299, 774694, 782669, 789494, 794821, 798575, 801624, 805043, 809043, 813195, 817513, 822583, 828547, 834718, 840632, 847059, 855373, 866133, 878775, 892722, 908299, 926271, 946699, 968560, 990604, 1012412, 1034430, 1056865, 1078783, 1098651, 1115745, 1130515, 1143434]
50638A143434J0580P427M307J942j39k765n823q465j0255j1465j2439j3292j4049
50625A088998j4570j4474j3736j3042j2955j2934j2005j0289q888q192p324n648
50613I54941l792k629j992j217l30Q3k46j279l240o349j0120j3715j6926k0099
50599H73090k3117k5278k6296k6677k6777k6187k4500k2127j9804j7632j5179
50588F19516j2383r730p551n565l370j062Q28J837J863J102l8r84j213o62K22
50573E82810R66J648K726M299N781O578O913P613R084J0825J2180J3204J4488
50560F79115J6293J8130J9282J9403J8572J7106J5492J4284J3748J3721J3959
50549H59105J4530J5631J7123J8649K0180K2055K4387K6797K8979L1170L3814
$$ y = [1143434, 1154014, 1161441, 1165748, 1167690, 1167551, 1164786, 1158963, 1150498, 1140243, 1128778, 1116339, 1103047, 1088998, 1074428, 1059954, 1046218, 1033176, 1020221, 1007287, 995282, 984993, 976105, 967913, 960589, 954941, 951149, 948520, 946528, 945311, 944981, 945064, 944818, 943539, 940299, 933950, 923830, 910115, 893189, 873090, 849973, 824695, 798399, 771722, 744945, 718758, 694258, 672131, 652327, 634695, 619516, 607133, 597403, 589852, 584287, 580917, 579855, 580683, 582520, 584383, 585485, 585447, 584463, 583250, 582588, 582810, 583776, 585424, 588150, 592449, 598230, 604808, 611721, 619334, 628418, 639243, 651423, 664627, 679115, 695408, 713538, 732820, 752223, 770795, 787901, 803393, 817677, 831425, 845146, 859105, 873635, 889266, 906389, 925038, 945218, 967273, 991660, 1018457, 1047436, 1078606, 1112420]
50538A112420L6975M0384M3855M7310N0516N3121N4925N5847N5749N4565N2507
50527A658174M9844M6540M2277L6717K9512K0459J0102j08q984j6803k4750l3127
50515A809853m0870m6866n1040n3851n5502n6003n5442n3705n0472m5884m0738
50504A259480l5579l0194k4455j9034j4512j0288n266N98O228J0770J4260J7031
50492A169039J9167K0643K1201J9961J5854Q815J08q766j7116k4866l1850l7743
50480A154447m2356m5626m7382m7505m6250m4270m2213m0272l8107l5281l1843
50469F93342k8360k5278k2377j9169j5674j2504j0192q630p156n128k462J71J955
50456E38538K824L581M953O861Q824J0635J2182J2987J2588J1207R547Q106P145
$$ y = [1112420, 1149395, 1189779, 1233634, 1280944, 1331460, 1384581, 1439506, 1495353, 1551102, 1605667, 1658174, 1708018, 1754558, 1796835, 1833552, 1863064, 1883523, 1893625, 1893517, 1884533, 1867730, 1842980, 1809853, 1768983, 1722117, 1671077, 1617226, 1561724, 1505721, 1450279, 1396574, 1346102, 1300218, 1259480, 1223901, 1193707, 1169252, 1150218, 1135706, 1125418, 1120152, 1120750, 1126978, 1137748, 1152008, 1169039, 1188206, 1208849, 1230050, 1250011, 1265865, 1274680, 1274788, 1266022, 1248906, 1224040, 1192190, 1154447, 1112091, 1066465, 1019083, 971578, 925328, 881058, 838845, 798573, 760466, 725185, 693342, 664982, 639704, 617327, 598158, 582484, 569980, 559788, 551158, 544002, 538874, 536412, 536583, 538538, 541362, 544943, 549896, 556757, 565581, 576216, 588398, 601385, 613973, 625180, 634727, 642833, 649978]
50443F49978O973P567Q146P918P173O873P229P597P720Q114R050J0143J1247J2824
50429G68552J4895J6549J7133J7276J8065J9737K1833K4076K6315K7992K8540
50418A000963K8273K8199K8853K9636K9469K7844K5288K2792K0676J8107J4105
50407A274205Q863L462j706p334j3741k0024k5284k9840l4393l8587m1410m2624
50395A031587m2904m2677m1744l9935l7460l4533l1247k7804k4352k0686j6583
50384F71662j2340q484n112j950J123M069O978R817J2093J3287J3490J3007J1721
50371G29361R376O185K511j704o444j0904j4222j6615j8820k0654k1371k1282
50359F15417k1631k2589k2776k1271j8897j6898j5385j3906j2566j1567j0379
$$ y = [649978, 656951, 664518, 672664, 680582, 687755, 694628, 701857, 709454, 717174, 725288, 734338, 744481, 755728, 768552, 783447, 799996, 817129, 834405, 852470, 872207, 894040, 918116, 944431, 972423, 1000963, 1029236, 1057435, 1086288, 1115924, 1145393, 1173237, 1198525, 1221317, 1241993, 1260100, 1274205, 1283068, 1286530, 1284824, 1277490, 1263749, 1243725, 1218441, 1188601, 1154208, 1115621, 1074211, 1031587, 988683, 946006, 904262, 864327, 826867, 792334, 761087, 733283, 708931, 688245, 671662, 659322, 650838, 645726, 643776, 644899, 648968, 655946, 665763, 677856, 691143, 704633, 717640, 729361, 738737, 744922, 747433, 745729, 739285, 728381, 714159, 697544, 678724, 658070, 636699, 615417, 593786, 571197, 548421, 527150, 508253, 491355, 475970, 462064, 449498, 437931, 427552]
50348D27552q342n792l734k654k211j865j251k63P31J132R82J197K380L906M760
50333D16528M821M625M294L618K906K849L514M213M461M411M314M199M128M184
50319D73065M092L414K311J578J724K428L123L689M272M769M888M603M302M438
50305E22696N173O265P229P624P205N860L607P69k019m228n850p167q184q534
50291E30446q002o919n916n328m900m178l186k580k927l942m809n193n482n903
50277D61181n956n051l261j073J203L247M410M239L313K816L206L796L785L244
50263D79099K855K934L142L039K661K461K660K884K683K331K650L849N009N077
50249E23334M034K640J384K12q14j330j227r58j071j707k572l201l323l129l139
$$ y = [427552, 419210, 413418, 409684, 407030, 404819, 402954, 401703, 401440, 402171, 403303, 404285, 405482, 407862, 411768, 416528, 421349, 425974, 430268, 433886, 436792, 439641, 443155, 447368, 451829, 456240, 460554, 464753, 468881, 473065, 477157, 480571, 482882, 484460, 486184, 488612, 491735, 495424, 499696, 504465, 509353, 513956, 518258, 522696, 527869, 534134, 541363, 548987, 556192, 562052, 565659, 566428, 564409, 560181, 554331, 547164, 538980, 530446, 522444, 515525, 509609, 504281, 499381, 495203, 492017, 489437, 486510, 482568, 477759, 472566, 467084, 461181, 455225, 450174, 446913, 445840, 447043, 450290, 454700, 458939, 462252, 465068, 468274, 472070, 475855, 479099, 481954, 484888, 488030, 491069, 493730, 496191, 498851, 501735, 504418, 506749, 509399, 513248, 518257, 523334, 527368, 530008, 531392, 531604, 530790, 529460, 528233, 527275, 526204, 524497, 521925, 518724, 515401, 512272, 509133]
50234E09133l544l912l759l250k867k637k157j259k00Q04J745K621L410M256N233
50219E03617O103O694P383Q621J0064J0870J0894J0925J1621J2745J3655J4068
50207F27260J4130J4253J4907J6153J7308J7599J7189J6878J6822J6282J4745
50196H03526J2551J0071P208M198K035J363J447Q78r75l776p004j0347j3633j6932
50182G90610k0425k3722k5775k6054k5453k5319k5787k5775k4480k2188j9650
50171E25982j7340j5395j3715j2039j0264q742p911p664p485p128o747o399n893
50158C99260n200m581m210l968l692l405l274l464m003m594m752m404m117m387
50144C41209m911m979m456l849l517l319l104l026l188l317l067k423j682j157
$$ y = [509133, 505589, 501677, 497918, 494668, 491801, 489164, 487007, 485748, 485548, 486352, 488097, 490718, 494128, 498384, 503617, 509720, 516414, 523797, 532418, 542482, 553352, 564246, 575171, 586792, 599537, 613192, 627260, 641390, 655643, 670550, 686703, 704011, 721610, 738799, 755677, 772499, 788781, 803526, 816077, 826148, 833356, 837554, 839589, 840952, 842399, 843277, 842302, 838526, 831522, 821175, 807542, 790610, 770185, 746463, 720688, 694634, 669181, 643862, 618075, 592300, 567820, 545632, 525982, 508642, 493247, 479532, 467493, 457229, 448487, 440576, 432912, 425427, 418299, 411552, 405153, 399260, 394060, 389479, 385269, 381301, 377609, 374204, 370930, 367466, 363463, 358869, 354117, 349713, 345596, 341209, 336298, 331319, 326863, 323014, 319497, 316178, 313074, 310048, 306860, 303543, 300476, 298053, 296371, 295214]
50130B95214r08o47j9R08J604J768J741J967K317K410K345K560L120L647L959
50115C21986M248M664N195N912O799P446P511P433P956Q934R375Q929Q472Q883
50101D23743R902J0729J1156J1490J1890J2352J3108J4449J6346J8662K1457K4637
50089E99921K7548K9574L1043L2970L5760L8642M0471M0750L9687L7681L5081
50078I89128L2332K9959K8236K6927K5476K3412K0548J6911J2683Q173L529j563
50066A215751p563j4230k0542k5677k9698l2853l4745l4900l3783l2406l0999
50055I18355k9065k6600k4261k2153j9617j6603j4175j2920j1945j0339q806q584
50043G13287r395r705q891p904p694q065q433q744r144r375r083q437p937p727
$$ y = [295214, 294306, 293659, 293640, 294548, 296152, 297920, 299661, 301628, 303945, 306355, 308700, 311260, 314380, 318027, 321986, 326234, 330898, 336093, 342005, 348804, 356250, 363761, 371194, 379150, 388084, 397459, 406388, 414860, 423743, 433645, 444374, 455530, 467020, 478910, 491262, 504370, 518819, 535165, 553827, 575284, 599921, 627469, 657043, 688086, 721056, 756816, 795458, 835929, 876679, 916366, 954047, 989128, 1021460, 1051419, 1079655, 1106582, 1132058, 1155470, 1176018, 1192929, 1205612, 1213785, 1217314, 1215751, 1208188, 1193958, 1173416, 1147739, 1118041, 1085188, 1050443, 1015543, 981760, 949354, 918355, 889290, 862690, 838429, 816276, 796659, 780056, 765881, 752961, 741016, 730677, 721871, 713287, 703892, 694187, 685296, 677392, 669698, 661633, 653200, 644456, 635312, 625937, 616854, 608417, 600480, 592753]
50029E92753p453o757n726m760m129l689l202k775k696k812k565j815j134r23
50015E42317o99J19J189J726J736J991K785L458L361K662J969J522J031Q6j312
50000E63941k555k946k706l027m647o730p891q031q241r011r546r106q002o869
49986D74633n832m831m089l690l302k764k369k130j432O9J777L004L960N276P013
49971D65293Q814J0613J2502J4282J5793J7390J9379K1268K2309K2469K2134K1154
49959F73400J9115J6381J3893J1943J0077Q239O968O252N177L108L21k972p236
49946G64666j2570j7839k1752k4292k6257k7778k8300k7835k7177k6720k5830
49935D98316k3842k1125j8669j6984j5716j4262j2390j0291q292o653n483m761
$$ y = [592753, 585300, 578543, 572817, 568057, 563928, 560239, 557037, 554262, 551566, 548754, 546189, 544374, 543240, 542317, 541618, 541737, 542926, 544652, 546388, 548379, 551164, 554622, 557983, 560645, 562614, 564136, 565167, 565253, 563941, 561386, 558440, 555734, 552707, 548060, 541330, 533439, 525408, 517167, 508156, 498610, 489504, 481502, 474633, 468801, 463970, 459881, 456191, 452889, 450125, 447756, 445626, 444194, 444263, 446040, 449044, 453004, 458280, 465293, 474107, 484720, 497222, 511504, 527297, 544687, 564066, 585334, 607643, 630112, 652246, 673400, 692515, 708896, 722789, 734732, 744809, 753048, 760016, 766268, 771445, 774553, 774874, 771902, 764666, 752096, 734257, 712505, 688213, 661956, 634178, 605878, 578043, 550866, 524146, 498316, 474474, 453349, 434680, 417696, 401980, 387718, 375328, 365037, 356745, 350092, 344609, 339848]
49923C39848m368m170m119m239m446m503m292m070m155m419m324l599k589j786
49909B84769j352j220j387j756j980j839j613j715k079k241j971j414p36j5N21
49894B63972N25%o18q89o67m3O39P53j30j573k481k201j126p8N54P93P09M46L48
49875B58933N76Q06O13L7n60r81j177r63k17P01J207J194J027R50Q56O92O16P36
49857B65046J005J484K208K804K700J904J117Q46Q12N06m8l80k24K43O41O36K24
49840B81524j60j25L9m05j541k455k314j322k17O81J379J634J244O27M26O00O04
49823B80219L09J28K06K30O1m2K0Kj94l84n05o62p23m66j79l90r33j033n46k54
49803B74864o00j029j026r67j258j433r54k91k86q31j123r36p71r11j160j435
$$ y = [339848, 335480, 331310, 327191, 322952, 318506, 314003, 309711, 305641, 301486, 297067, 292743, 289144, 286555, 284769, 283417, 282197, 280810, 279054, 277074, 275235, 273622, 271907, 269828, 267587, 265616, 264202, 263466, 263451, 263972, 264497, 264497, 263879, 262990, 262323, 262280, 262919, 263672, 263542, 261969, 259488, 257287, 256161, 256083, 256637, 257430, 258139, 258585, 258933, 259509, 260315, 260928, 260965, 260405, 259424, 258247, 257284, 257067, 257768, 258975, 260169, 261196, 262146, 263002, 263694, 264310, 265046, 266051, 267535, 269743, 272547, 275247, 277151, 278268, 279114, 279926, 280432, 280384, 280004, 279780, 280023, 280664, 281300, 281524, 281364, 281239, 281278, 280873, 279332, 276877, 274563, 273241, 273024, 273705, 275084, 276718, 277962, 278589, 279015, 279615, 280219, 280528, 280656, 280862, 281092, 281153, 281111, 281131, 281133, 280939, 280555, 280050, 279388, 278665, 278199, 278020, 277630, 276697, 275664, 275118, 274864, 274264, 273235, 272209, 271242, 269984, 268551, 267597, 267306, 267020, 266189, 265066, 264130, 263359, 262448, 261288, 259853]
49787B59853j735j715j008l8L59J06q7R3J96m1j99N3M24M88K06k59p06o80J72
49768B55482J381J930J556J070J134J444J517J522J697J728J319Q49P25O06k5
49753B73935q91j293j136q44n82k30L9m0k56j83M4p9n66q99p88m03O2M46M01j65
49733B66572n76j01Q97J330R18M46M36N50N54Q13J403J606R75R5k74k06n4L67
49715B75751J217J791J256n6r48q48k47K80O43Q35O52J27l27l49N9P19J433J958
49697B83946K177K301K517K575K193J747J926K641K926K154Q47l5j70P1L00M06
49681C08522M32N21Q66J421J793J657J216R89J145J261Q10j85j074j250p86l32
49665C17006k92l81j43L88Q70J337K143L276M260M919N715P026Q425R057Q556
$$ y = [259853, 258118, 256403, 255395, 255357, 255716, 255822, 255735, 255828, 256024, 255983, 255784, 255837, 256261, 256749, 256955, 256696, 255990, 255310, 255482, 256863, 258793, 260349, 261419, 262553, 263997, 265514, 267036, 268733, 270461, 271780, 272629, 273354, 273960, 273935, 273044, 271751, 270615, 269771, 269189, 268959, 268998, 268958, 268702, 268519, 268563, 268484, 267918, 267019, 266231, 265828, 265890, 266336, 266737, 266572, 265996, 265895, 266792, 268122, 269040, 269486, 269922, 270472, 271026, 271839, 273242, 274848, 275823, 275918, 275644, 275438, 275384, 275751, 276968, 278759, 280015, 279959, 279011, 278163, 277916, 278196, 278839, 279674, 280326, 280453, 280126, 279777, 279836, 280555, 281988, 283946, 286123, 288424, 290941, 293516, 295709, 297456, 299382, 302023, 304949, 307103, 307950, 307915, 307745, 307816, 308116, 308522, 308954, 309475, 310341, 311762, 313555, 315212, 316428, 317417, 318562, 319823, 320633, 320448, 319374, 318124, 317338, 317006, 316714, 316333, 316190, 316578, 317448, 318785, 320928, 324204, 328464, 333383, 339098, 346124, 354549, 363606, 372162]
49650C72162P215N440L270N04k818o037q053q136o650m785l483k846k541k306
49636C40936j916j118o9N57K89m76r26q00m82k42J04P32J408J724J537J142J045
49619C43445J550K406L024L189L292L640L833L330K431K063K507K980K782K310
49605C82782K445L226L761L396K559K240K917M167N231N707N680N402N043M725
49591D39281M538M450M338M180M098M137M180M199M329M484M258L506K888L306
49577D96172M808O462P360P391O937O254N430M601L973L653L593L615L473L107
49563E66829K822K973L439L762L780L759L756L377K478J683J697K366K911K915
49549F08547K659K538K620K804K998L069K925K740K749K824K588K008J530J461
$$ y = [372162, 379377, 384817, 388087, 388591, 385773, 379736, 371683, 363547, 356897, 352112, 348629, 345783, 343242, 340936, 339020, 337902, 337833, 338390, 338679, 338203, 337277, 336477, 335995, 335753, 335857, 336589, 337997, 339721, 341258, 342400, 343445, 344995, 347401, 350425, 353614, 356906, 360546, 364379, 367709, 370140, 372203, 374710, 377690, 380472, 382782, 385227, 388453, 392214, 395610, 398169, 400409, 403326, 407493, 412724, 418431, 424111, 429513, 434556, 439281, 443819, 448269, 452607, 456787, 460885, 465022, 469202, 473401, 477730, 482214, 486472, 489978, 492866, 496172, 500980, 507442, 514802, 522193, 529130, 535384, 540814, 545415, 549388, 553041, 556634, 560249, 563722, 566829, 569651, 572624, 576063, 579825, 583605, 587364, 591120, 594497, 596975, 598658, 600355, 602721, 605632, 608547, 611206, 613744, 616364, 619168, 622166, 625235, 628160, 630900, 633649, 636473, 639061, 641069, 642599, 644060]
49535F44060J581J592J585J849K500L575N139O921Q114Q066P112O232N894N691
49521G09911N144M262L182J871N55k2N66J602J880J066j38j113j984k961l726
49506G20095l904l749l857m390n002n418n706o008o319o566o683o649o576o621
49492F42647o658o202m960l362k231j982k423l226m125m691m482l644l038l327
49478E88296m206m751m480l797l437l659m063m120l724l153k558j805q86k13j47
49463E43297m63o73q08j345k354l163l131k342j327m31K70O98P70N93M29N72J260
49446E31852K514L960N050N622N923N993N320L488Q99j470k925l441l353k973
$$ y = [644060, 645641, 647233, 648818, 650667, 653167, 656742, 661881, 668802, 676916, 684982, 692094, 698326, 704220, 709911, 715055, 719317, 722499, 724370, 724925, 724903, 725469, 727071, 728951, 730017, 729879, 728766, 726782, 723821, 720095, 716191, 712442, 708585, 704195, 699193, 693775, 688069, 682061, 675742, 669176, 662493, 655844, 649268, 642647, 635989, 629787, 624827, 621465, 619234, 617252, 614829, 611603, 607478, 602787, 598305, 594661, 591623, 588296, 584090, 579339, 574859, 571062, 567625, 563966, 559903, 555783, 552059, 548906, 546348, 544543, 543657, 543444, 543297, 542834, 542161, 541353, 540008, 537654, 534491, 531360, 529018, 527691, 527260, 527530, 528228, 528998, 529591, 530020, 530592, 531852, 534366, 538326, 543376, 548998, 554921, 560914, 566234, 569722, 570621, 569151, 566226, 562785, 559432, 556459]
$$ [...]
##END NTUPLES=NMR SPECTRUM
##END=
