##TITLE=NES1018_872015066_9266120_aT6socKug7
##JCAMPDX= 6.0         $$ Bruker NMR JCAMP-DX V2.0
##DATA TYPE= NMR SPECTRUM
##DATA CLASS= NTUPLES
##ORIGIN= BRUKER
##OWNER= Administrator
$$ 1.72 TOPSPIN		Version 2.1
$$ 2015-08-24 18:02:36.076 -0700  Administrator@X
$$ Compression mode = diff/dup
##.OBSERVE FREQUENCY= 400.02188249412
##.OBSERVE NUCLEUS= ^1H
##.ACQUISITION MODE= SIMULTANEOUS (DQD)
##.ACQUISITION SCHEME= undefined
##.AVERAGES= 8
##.DIGITISER RES= 22
##SPECTROMETER/DATA SYSTEM= spect
##.PULSE SEQUENCE= zg30
##.SOLVENT NAME= COFFEE_meoh
##.SHIFT REFERENCE= INTERNAL, COFFEE_meoh, 1, 14.98509
##AUDIT TRAIL= $$ (NUMBER, WHEN, WHO, WHERE, PROCESS, VERSION, WHAT)
$$ ##TITLE= Audit trail, TOPSPIN		Version 2.1
$$ ##JCAMPDX= 5.01
$$ ##ORIGIN= Bruker BioSpin GmbH
$$ ##OWNER= Administrator
$$ $$ E:\/data/COFFEE/nmr/NES1018_872015066_9266120_aT6socKug7/20/pdata/1/auditp.txt
$$ ##AUDIT TRAIL=  $$ (NUMBER, WHEN, WHO, WHERE, PROCESS, VERSION, WHAT)
(   1,<2015-08-24 18:02:28.592 -0700>,<Administrator>,<X>,<go>,<TOPSPIN 2.1>,
      <created by zg
	started at 2015-08-24 18:01:22.858 -0700,
	POWCHK enabled, PULCHK disabled,
       configuration hash MD5:
       21 0F 79 D6 B3 7B B4 F6 88 20 88 DB 03 48 BD 9F
       data hash MD5: 64K
       35 BB A2 DE 15 B3 9D C5 DA 14 84 CF 59 E8 F1 C5>)
(   2,<2015-08-24 18:02:32.030 -0700>,<Administrator>,<X>,<proc1d>,<TOPSPIN 2.1>,
      <Start of raw data processing
       efp LB = 0 FT_mod = 6 PKNL = 1 PHC0 = 0 PHC1 = 0 SI = 32K 
       data hash MD5: 32K
       6B 38 85 E5 7F E5 58 E5 89 03 B3 3C 53 AA 44 44>)
(   3,<2015-08-24 18:02:32.311 -0700>,<Administrator>,<X>,<proc1d>,<TOPSPIN 2.1>,
      <pk PHC0 = 90.11536 PHC1 = 0 
       data hash MD5: 32K
       E4 A7 A1 76 65 7F 16 45 08 D8 BC 56 08 74 6C 9D>)
(   4,<2015-08-24 18:02:32.405 -0700>,<Administrator>,<X>,<proc1d>,<TOPSPIN 2.1>,
      <abs ABSG = 1 
       data hash MD5: 32K
       A4 17 6B 26 AF 86 7E 25 CB 7E 63 2C E0 FE 30 28>)
(   5,<2015-08-24 18:02:32.483 -0700>,<Administrator>,<X>,<proc1d>,<TOPSPIN 2.1>,
      <abs ABSG = 2 
       data hash MD5: 32K
       F3 7C 0A CC C6 CE 37 58 D4 88 CE 74 A8 F1 6B 4C>)
(   6,<2015-08-24 18:02:32.530 -0700>,<Administrator>,<X>,<proc1d>,<TOPSPIN 2.1>,
      <abs ABSG = 3 
       data hash MD5: 32K
       0B 7A 82 DD DC 61 5C 18 9A 4B 3A 75 E0 59 99 8D>)
(   7,<2015-08-24 18:02:32.592 -0700>,<Administrator>,<X>,<proc1d>,<TOPSPIN 2.1>,
      <abs ABSG = 4 
       data hash MD5: 32K
       AA C5 C8 4E 07 5F 6E 04 D4 C8 EB DA 84 9A AB 1F>)
(   8,<2015-08-24 18:02:32.655 -0700>,<Administrator>,<X>,<proc1d>,<TOPSPIN 2.1>,
      <abs ABSG = 5 
       data hash MD5: 32K
       F9 A2 C2 16 1A 8B 0A 84 D5 09 50 D9 F6 4A CA A0>)
$$ ##END=
$$ 
$$ $$ hash MD5
$$ $$ 1E C6 43 88 A7 AF AD 24 D7 06 6F EB 56 64 E7 88
##$RELAX= 
##$RELAX= 
##$RELAX= 
##$RELAX= 
##$RELAX= 
##$RELAX= 
##$RELAX= 
$$ Bruker specific parameters
$$ --------------------------
##$DU= <E:\>
##$EXPNO= 20
##$NAME= <NES1018_872015066_9266120_aT6socKug7>
$$ [...]
##$TP= (0..7)
150 150 150 150 150 150 150 150
##$TP07= 0
##$TPNAME0= <>
##$TPNAME1= <>
##$TPNAME2= <>
##$TPNAME3= <>
##$TPNAME4= <>
##$TPNAME5= <>
##$TPNAME6= <>
##$TPNAME7= <>
##$TPOAL= (0..7)
0.5 0.5 0.5 0.5 0.5 0.5 0.5 0.5
##$TPOFFS= (0..7)
0 0 0 0 0 0 0 0
##$TUNHIN= 0
##$TUNHOUT= 0
##$TUNXOUT= 0
##$USERA1= <user>
##$USERA2= <user>
##$USERA3= <user>
##$USERA4= <user>
##$USERA5= <user>
##$V9= 5
##$VALIST= <valist>
##$VCLIST= <CCCCCCCCCCCCCCC>
##$VD= 0
##$VDLIST= <DDDDDDDDDDDDDDD>
##$VPLIST= <PPPPPPPPPPPPPPP>
##$VTLIST= <TTTTTTTTTTTTTTT>
##$WBST= 2048
##$WBSW= 25
##$XGAIN= (0..3)
0 0 0 0
##$XL= 0
##$YL= 0
##$YMAX_a= 598522
##$YMIN_a= -503212
##$ZGOPTNS= <>
##$ZL1= 120
##$ZL2= 120
##$ZL3= 120
##$ZL4= 120
##$ABSF1= 14.98509
##$ABSF2= -5.573092
##$ABSG= 5
##$ABSL= 3
##$ALPHA= 0
##$AQORDER= 0
##$ASSFAC= 0
##$ASSFACI= 0
##$ASSFACX= 0
##$ASSWID= 0
##$AUNMP= <proc_prof1d_extract_pilot.lims>
##$AXLEFT= 0
##$AXNAME= <>
##$AXNUC= <1H>
##$AXRIGHT= 0
##$AXTYPE= 0
##$AXUNIT= <>
##$AZFE= 0.1
##$AZFW= 0.1
##$BCFW= 0
##$BC_mod= 0
##$BYTORDP= 0
##$COROFFS= 0
##$CY= 15
##$DATMOD= 1
##$DC= 0
##$DFILT= <>
##$DTYPP= 0
##$F1P= 0
##$F2P= 0
##$FCOR= 0.5
##$FTSIZE= 32768
##$FT_mod= 6
##$GAMMA= 0
##$GB= 0
##$INTBC= 1
##$INTSCL= 1
##$ISEN= 128
##$LB= 0
##$LEV0= 0
##$LPBIN= 0
##$MAXI= 10000
##$MC2= 0
##$MEAN= 0
##$ME_mod= 0
##$MI= 0
##$NCOEF= 0
##$NC_proc= -8
##$NLEV= 6
##$NOISF1= 0
##$NOISF2= 0
##$NSP= 0
##$NTH_PI= 0
##$NZP= 0
##$OFFSET= 14.98509
##$PC= 1
##$PHC0= 90.11536
##$PHC1= 0
##$PH_mod= 1
##$PKNL= yes
##$PPARMOD= 0
##$PPDIAG= 0
##$PPIPTYP= 0
##$PPMPNUM= 2147483647
##$PPRESOL= 1
##$PSCAL= 4
##$PSIGN= 0
##$PYNMP= <proc.py>
##$REVERSE= no
##$SF= 400.02
##$SI= 32768
##$SIGF1= 0
##$SIGF2= 0
##$SINO= 400
##$SIOLD= 32768
##$SPECTYP= <>
##$SREGLST= <1H.CDCl3>
##$SSB= 0
##$STSI= 32768
##$STSR= 0
##$SW_p= 8223.68421052631
##$SYMM= 0
##$S_DEV= 0
##$TDeff= 65536
##$TDoff= 0
##$TI= <>
##$TILT= no
##$TM1= 0
##$TM2= 0
##$TOPLEV= 0
##$USERP1= <user>
##$USERP2= <user>
##$USERP3= <user>
##$USERP4= <user>
##$USERP5= <user>
##$WDW= 1
##$XDIM= 32768
##$YMAX_p= 435254355
##$YMIN_p= -730307
##$CURPLOT= <Network HP LaserJet P1505>
##$CURPRIN= <$Network HP LaserJet P1505>
##$DFORMAT= <normdp>
##$LAYOUT= <+/1D_H.xwp>
##$LFORMAT= <normlp>
##$PFORMAT= <normpl>
##$SURQMSG= 1
$$ End of Bruker specific parameters
$$ ---------------------------------
##NTUPLES= NMR SPECTRUM
##VAR_NAME=  FREQUENCY,     SPECTRUM/REAL,   SPECTRUM/IMAG
##SYMBOL=    X,             R,               I
##VAR_TYPE=  INDEPENDENT,   DEPENDENT,       DEPENDENT
##VAR_FORM=  AFFN,          ASDF,            ASDF
##VAR_DIM=   32768,         32768,           32768
##UNITS=     HZ,            ARBITRARY UNITS, ARBITRARY UNITS
##FACTOR=    0.250966925370066, 1,           1
##FIRST=     8223.43324360094, -129640,      33928
##LAST=      0,             -91430,          -42275
##MIN=       0,             -730307,         0
##MAX=       8223.43324360094, 435254355,    0
$$ Real data points
##PAGE= N=1
##DATA TABLE= (X++(R..R)), XYDATA
$$ [...]
19480a57254j118c6944H5140d73739A04245c01687a46686M3635l6015A89495h2481
19468a46642r1959I6107b89619M2797C1716J10325o716n592e5252A0447b34951
19456B29229a77458H1403e3061C1938h679H8653c89968B3651a51479N6605I9538
19444a76127k47352A16113L36a41179A65339a19735j26726C2499E2J33638a405
19432D8951N5111E1079J28506q8631c60350A73347c89510A20240k9961N0955a53477
19420E5995p456A2447g1871A13650b4403j17261L6688A86473F2589A7367R9470
19409A16837B2786J79413d28598g7239A6371J73966j1264B6645P4302a67873j11238
19398b79111B57026d3132B15798a46867a4630F152a77902D1947a29636j52855
$$ y = [-157254, -158372, -36944, 85140, -473739, 104245, -301687, -146686, -103051, -139066, 189495, -82481, -146642, -238601, 96107, -289619, -246822, 31716, 142041, 135325, 129733, -55252, 10447, -234951, 229229, -177458, 81403, -53061, 31938, -8679, 88653, -389968, 23651, -151479, -94874, 99538, -176127, -423479, 116113, 116449, -141179, 165339, -119735, -246461, 32499, 52, 133690, -1405, 48951, 104062, 51079, 179585, 90954, -360350, 173347, -389510, 120240, 90279, 141234, -153477, 55995, 48539, 12447, -71871, 113650, -24403, -141664, -104976, 186473, 62589, 17367, 116837, 22786, 202199, -428598, -77239, 16371, 190337, 179073, 26645, 100947, -167873, -279111, 257026, -43132, 215798, -146867, -14630, 6152, -177902, 41947, -129636, -282491]
19388b82491i1364q9629a0420E1870J12620f474k7973j46570f9627I3465R1110
19377A84575c71107J69469P4852C7818d87004a04532M0252G223P8153b55303l1829
19366b87132P1478M6462I2755m4486D053a84105g4267k03672b3219A5504a75480
19354a42121f2167j53418R0100B32545f3068I6573b20499b2325j83629j02861
19344c08815A8092b16983e4003o6102j80619a34023l9543I1894a66989q5288B7018
19332A65382o1607p543l0749a75146K3267p6535a03928m45757A19432a7217q0753
19321i7970B817Q8130O4393k136B3803L36688D4767b87992l0885j38547A76305
19309i0957A32233j1743n0827J07578a86820B01885n8607a81507F4878b61984
$$ y = [-282491, -91364, -180993, -10420, 51870, 164490, -6474, -34447, -181017, -69627, 93465, 184575, -371107, -201638, -126786, 37818, -487004, -104532, -64280, 7223, 85376, -255303, -287132, -215654, -169192, 92755, 48269, 4053, -184105, -74267, -277939, -23219, 15504, -175480, -142121, -62167, -215585, -125485, 232545, -63068, 96573, -220499, -22325, -205954, -308815, 18092, -216983, -54003, -120105, -300724, -134023, -173566, 91894, -166989, -252277, 27018, 165382, 103775, 96232, 65483, -175146, -151879, -228414, -103928, -549685, 119432, -17217, -97970, 2817, 90947, 155340, 153204, 23803, 360491, 44767, -287992, -318877, -457424, 176305, -90957, 132233, 120490, 69663, 177241, -186820, 201885, 143278, -181507, 64878, -261984]
19298i2237o1078H4541R300K7269a24956I314d74404E0987f8201j31440j65320
19287c64961C08428d01175A15278f7403r4009A33684m7065a09153n2245d6551
19276F0266a90090o3154i2162j24924P7116B1482J90372b14209A00063h2756q1008
19265a63764C8073f1673L023J4556F1204a70338g4597A53158f2291A29725c19745
19253e4676B52858c13403A91511b94250B09119a90107D295a51169j04856N1215
19243b04810B67236I118c32706A26776a77459B3949f8679m6458A03785f5121n5866
19232a20987r2653H5090J26712e0028C2093c17890a45950l4100b7635l8665j67621
19221b33921A09282e5455B25827e4385B80317a04104D2302b62326G3674J01725
$$ y = [-92237, -153315, 84541, 93841, 121110, -124956, 9314, -474404, 50987, -68201, -199641, -364961, 308428, -401175, 115278, -67403, -161412, 133684, 86619, -109153, -161398, -46551, 60266, -190090, -253244, -92162, -217086, -139970, 21482, 211854, -214209, 100063, -82756, -163764, 38073, -61673, -58650, -44094, 61204, -170338, -74597, 153158, -62291, 129725, -319745, -54676, 252858, -313403, 191511, -294250, 209119, -190107, 4295, -151169, -256025, -204810, 267236, 9118, -332706, 126776, -177459, 23949, -68679, -115137, 103785, -65121, -120987, -213640, 85090, 211802, -50028, 32093, -317890, -145950, -180050, -27635, -66300, -233921, 109282, -55455, 225827, -54385, 280317, -104104, 42302, -262326, 73674, 175399]
19211A75399b87580A05195d4408j49186p2395A8821O8552A2137e9810a0210r2828
19200a03038j23092M9621F8676J65901E77M14893A78073e6660A67524b16054f8142
19188a72502E2458J05046k3694b52531D1305f8177k72451J45591Q6377j704B04097
19176b30300F9419a24730G968b65722A69750G1994a62415B01002c04804J8446
19166b86358g8411A60426f6192J5451r4139P262l9940A84518o0860a02150k54533
19155c56683G52b46193h9604b1327l12470a4459A55313a51960O8693K5384k8519
19144h6402C12978b49495E2003a64109B25336a79631d4823m91396G4410J8228
19134I2638g6331b3558c410o9721F15a36589k545B9473j2478J0411a69787P0080
$$ y = [175399, -287580, 105195, -44408, -193594, -265989, 18821, 87373, 12137, -59810, -10210, -103038, -226130, -176509, 68676, 234577, 577, 415470, 178073, -56660, 167524, -216054, -68142, -172502, 52458, 157504, 133810, -252531, 41305, -68177, -340628, -195037, -108660, -110364, 204097, -230300, 69419, -124730, 7968, -265722, 169750, 71994, -162415, 201002, -304804, -286358, -78411, 160426, -66192, -50741, -144880, -137618, -177558, 184518, 123658, -102150, -356683, 752, -246193, -89604, -21327, -333797, -14459, 155313, -151960, -83267, -57883, -86402, 312978, -249495, 52003, -164109, 225336, -179631, -44823, -536219, 74410, 92638, -76331, -23558, -3410, -73131, 615, -136589, -139134, 29473, 16995, 27406, -169787, -99707]
19122i9707A42770a46318B1117M3637b78977e923A8646e6610k04674A78786b8483
19110c3540o0515L4033o2967l26323B9071Q4826h4850B73891a28745d275n7587
19099f1862k20583a9170j08892O2526A04332c45932C2051a7442j4468B51348e3524
19087D0040R1046m9928b56694H539K76942E4714b16167k5632J05773F7053j466
19076F5587c18761E3645a94916Q9050q4948m1642A38500a40887l29860b4437A76835
19064a13134C22227A30264b79338J00002A6813h0485B3282a66282A21249a79412
19053b17446f0766l6304D5826a52824k17717B1928O9619J1163a55227g0700B19774
19041c8503q9250p123H6421K0996a9030A99057B2169a71466H0159a03640K1841
$$ y = [-99707, 142770, -146318, 21117, 64754, -278977, -5923, 18646, -56610, -261284, 178786, -28483, -33540, -94055, -60022, -122989, -449312, 29071, 113897, -84850, 273891, -128745, -4275, -61862, -282445, -19170, -128062, -65536, 104332, -345932, 32051, -17442, -31910, 251348, -53524, 40040, 131086, 81158, -256694, 8539, 285481, 54714, -216167, -241799, -136026, 67053, 65587, -318761, 53645, -194916, -105866, -190814, -232456, 138500, -140887, -470747, -24437, 176835, -113134, 322227, 130264, -279338, -179336, 16813, -80485, 23282, -166282, 121249, -179412, -217446, -60766, -97070, 45826, -152824, -370541, 21928, 91547, 102710, -155227, -70700, 219774, -38503, -127753, -134876, 86421, 107417, -19030, 199057, 22169, -171466, 80159, -103640, -81799]
19030h1799m998B04794E3431Q9057K16739j65817c5654k59060a36446H9082b7183
19018e7063b4600k88363i8460A41360J04804b52315B58109E9030J06964B002i6829
19006F5949J79147c2126A45353k0771K12577a79917F4586A4082g0798B8222K7683
18995E5905c80513a63715e4418l7123A64972D8447b92996a4394D0303b46644E1291
18983a79940A09755g6609G9086J3841f3550A62612a66444f8803j51558C3620J42542
18972A76162l8636b92675G8775Q510a60864a8454D5174b45278C7000a75704R506
18961a66198M9859B88902A1117b26018Q0931n3985G3234c54704G4232b55734E1100
18949b22768j18419B3727b66509p7622A01940K296C1190A083a12555I6039f1095
$$ y = [-81799, -86797, 204794, 53431, 142488, 359227, 193410, -35654, -294714, -136446, 89082, -27183, -57063, -24600, -312963, -98460, 141360, 246164, -252315, 258109, 59030, 165994, 2002, -96829, 65949, 245096, -32126, 145353, 124582, 337159, -179917, 64586, 14082, -70798, 28222, 55905, -380513, -163715, -54418, -91541, 164972, 48447, -292996, -14394, 40303, -246644, 51291, -179940, 109755, -76609, 79086, 92927, -63550, 162612, -166444, -68803, -220361, 33620, 176162, 137526, -292675, 78775, 87285, -160864, -18454, 45174, -245278, 37000, -175704, -166198, -116339, 288902, 11117, -226018, -145087, -199072, 73234, -354704, 74232, -255734, 51100, -222768, -341187, 23727, -266509, -344131, 101940, 104236, 31190, 1083, -112555, 96039, -61095]
18937b90058B2471d2829B51711a89113h4010m5027b741j31262j6661N2350m4141
18926a42455m8302K9126n4239B02561r7490i0420k11798B70750d4256A57370a97357
18914F2824b22039b9942K504j61853p6322A3520b07671k02382I7017J43689j4590
18903B26116f3727G0619P7572B2958c85127g4982c4400j88393a06638d3872D0040
18891a3442l82284A68360e3892o3668F3929J4686c75100a25746k85326e897j90743
18880a96640B55210c49780C83261j69646A7775b90981J40679A08742e8429A26062
18869G3966h9363B3631J5000K28422b38032B13700a54533q3366D6067e50j47280
18858a47830M8298c3701A4511J1170B116i0470b2744n7510b9797k1366A18618
$$ y = [-290058, 22471, -42829, 251711, -189113, -84010, -129037, -2741, -134003, -150664, -98314, -142455, -190757, -161631, -215870, 202561, 105071, -90420, -302218, 270750, -44256, 157370, -197357, 62824, -222039, -29942, -27438, -189291, -265613, 13520, -207671, -410053, 97017, 240706, 226116, -63727, 70619, 148191, 22958, -385127, -74982, -34400, -222793, -106638, -43872, 40040, -13442, -395726, 168360, -53892, -117560, 63929, 78615, -375100, -125746, -411072, -5897, -196640, 255210, -349780, 383261, 213615, 17775, -290981, -150302, 108742, -58429, 126062, 73966, -89363, 23631, 38631, 267053, -238032, 213700, -154533, -237899, 46067, -550, -147830, -99532, -33701, 14511, 25681, 2116, -90470, -22744, -80254, -29797, -51163, 118618]
18846A71304E5965b9094l29526a30960l2610C7474g9299A95411b59605j06716
18836c66321G7194f2368A9399c04324g3266j45433b1057B856a43447l5385B75853
18824A51224K08359b111o3208A08665a47197l4626A5993a92198g5528k35777a26421
18812a72911A25777N8249a72807D15268A64267K2606q1992i5859j80915i2165
18801A17623J50287f4445j2294m4140B18331l8661D654a51747j16063A92050c1888
18789a97382k3721J02827N8088k38936A28671b24063G2566A9074a14798B10466
18778A57151D6736J41017h9190E3292d2421I3760B4820b59402A58235n2761M3693
18767A49167d5376B63827E330a93224O8243a645B0050K0176f4201n5231A73493
$$ y = [171304, 55965, -29094, -358620, -130960, -163570, 37474, -79299, 195411, -259605, -366321, 77194, -62368, 19399, -304324, -73266, -218699, -21057, 2856, -143447, -178832, 275853, 151224, 359583, -2111, -65319, 108665, -147197, -181823, 15993, -192198, -75528, -311305, -126421, -172911, 125777, 184026, -172807, 415268, 164267, 186873, 104881, -95859, -276774, -92165, 117623, 267910, -64445, -76739, -120879, 218331, 179670, 4654, -151747, -267810, 192050, -31888, -197382, -221103, -118276, -60188, -299124, 128671, -224063, 72566, 19074, -114798, 210466, 157151, 46736, 187753, -89190, 53292, -42421, 93760, 24820, -259402, 158235, 105474, 149167, -45376, 263827, 5330, -193224, -124981, -1645, 20050, 40226, -64201, -119432, 173493]
18755B68384c484H8906b3040k6824o6617A72351D5583L8307n333O5683C6249b0999
18742a3235k53254c3643A70095b43554B01477f7629B7628d2380p2632B35833D2114
18730G2239M3080Q1661i395p6670j48486M3464A11478c248k38173a05878j02858
18719b08736O7727d4947I7454a50532J126A17845a24502n1823k93832A99891h5539
18707A11842n5086K59879c9944J7317A42216b78107J28171A05198N5771b28471
18696F9130a17543m5956B9904c71674I258b91550k9368A147a96388R2928H1407
18684I4828a32131c0928n1354p1607r060B20803I5463a12381j58796c4640B06213
18672g0749A60677d45782b0238k55894e006A78914a1870j34750M4405l08298a20348
$$ y = [268384, -3484, 88906, -23040, -49864, -116481, 172351, 45583, 83890, 78557, 144240, 36249, -20999, -13235, -266489, -33643, 170095, -243554, 201477, -67629, 27628, -42380, -115012, 235833, 42114, 72239, 115319, 196980, -9395, -86065, -234551, -191087, 111478, -3248, -241421, -105878, -208736, -141009, -44947, 97454, -150532, -149406, 117845, -124502, -176325, -470157, 199891, -85539, 111842, 56756, 316635, -39944, -22627, 142216, -278107, -149936, 105198, 160969, -228471, 69130, -117543, -163499, 29904, -371674, 9258, -291550, -320918, 1147, -196388, -103460, 81407, 94828, -132131, -30928, -82282, -153889, -162949, 220803, 95463, -112381, -271177, -34640, 206213, -70749, 160677, -445782, -20238, -276132, -5006, 178914, -11870, -146620, -102215, -410513, -120348]
18660a5021A24087a58144J9831A96762c8866j15002A0701g891A33013d11079f6522
18648e8221j20205M3363h956j22541H7245H078c5596a5382k47717B94768a40560
18636a05337j84205a17632M224k44342a44927A75115F4703c746k62389q5428F2985
18624D3245a15130n1857r3092N7389C963f3989G8789b99219O441O7593K338K6110
18612a96737i6421D1934P1099M0044a92630a9057j34562p0439A2010J12308a13782
18600B09925I840a90767M8557C507a70398j44252K0030a7116j13381j31165D8436
18588b62286B42287h3609l0348c2311A05792a5734j30703p8844G3119f5172A61980
18576B64324O7246B7841b488B57167b10485f2949K8033n79648B25921j09630a43647
$$ y = [-15021, 124087, -158144, -138313, 196762, -38866, -153868, 10701, -7891, 133013, -411079, -66522, -58221, -178426, -135063, -8956, -131497, 87245, 8078, -35596, -15382, -263099, 294768, -140560, -105337, -289542, -117632, -113408, -357750, -144927, 175115, 64703, -3746, -266135, -351563, 62985, 43245, -115130, -166987, -260079, -202690, 3963, -63989, 78789, -299219, -292778, -225185, -222847, -196737, -96421, 41934, 113033, 153077, -192630, -19057, -153619, -224058, 12010, 124318, -113782, 209925, 9840, -190767, -142210, 3507, -170398, -314650, -294620, -17116, -130497, -261662, 48436, -262286, 242287, -83609, -113957, -32311, 105792, -15734, -146437, -225281, 73119, -65172, 161980, 264324, 331570, 27841, -2488, 257167, -210485, -62949, -34916, -614564, 225921, 116291, -143647]
18564A77848Q3551b28083D5517i0318k21623A06722l1979c64019D7407b08860
18553A68939N9386d1465F5278a05149n1229F5893J2589a37329N9910k89630a42321
18541D93145a40692j4466d5228k82450A3537a49692A50165a45556E3090a33771
18530A24058g8982g679j64817F0445b29520j74313q4664J88774h764n4646l9639
18519a03049q3870K8683h929j08344A841a21335B5615K22531i9005A41171h8895
18507c4332D6007a49353A11692E2241c25198B31711D2839f1833j17946p1333a09488
18495I6090h3416B04153m2834i5455E9200J7010P3131L20068f4580j3520a5584
18483a26096q8542A00443a47961E2110L142c0263C0100b32862D7242h0964J1955
$$ y = [177848, 261399, -228083, 45517, -90318, -311941, 106722, 74743, -364019, 47407, -208860, 168939, 228325, -41465, 65278, -105149, -156378, 65893, 78482, -137329, -77419, -367049, -142321, 493145, -140692, -155158, -45228, -327678, 13537, -149692, 150165, -145556, 53090, -133771, 124058, -78982, -7679, -172496, 60445, -229520, -403833, -488497, -299723, -8764, -63410, -103049, -186919, -158236, -8929, -117273, 1841, -121335, 25615, 248146, -99005, 141171, -88895, -34332, 46007, -149353, 111692, 52241, -325198, 231711, 42839, -61833, -179779, -251112, -109488, 96090, -83416, 204153, 161319, -95455, 59200, 76210, 149341, 469409, -64580, -78100, -15584, -126096, -214638, 100443, -147961, 52110, 55252, -30263, 30100, -232862, 47242, -80964, -69009]
18472f9009G3231b1997l43447Q1086g9285k0186C1630b8615A36189P2469b31132
18460B36208b02971E713L17361g765J746o6672k11302B14166g7681A14747d38644
18448a79229j3054I7919f606j80488B7210Q3647c54950H2444l3708g2696j11336
18437a84032A02953N2773M2284a00076H8947k1963a3900k14879h9173j21285l4052
18426b44510J11601D5985a50339p4225c7551l32446B10908b40694j5615q5750
18416c42059A27722m8376h8303B5653d0780A70687E6398b333p2902C3837a87189
18404G8883a06763J9620j01121Q1786A98328P7305o9112A3695c644A27057F031
18392B02798b3438A86147b0646H98a56132B67339g3791J2997A22869R9655j06881
$$ y = [-69009, 73231, -21997, -365444, -284358, -79285, -99471, 31630, -28615, 136189, 208658, -231132, 236208, -202971, 5713, 323074, -7765, -6019, -72691, -283993, 214166, -77681, 114747, -438644, -179229, -192283, 97919, -6606, -187094, 27210, 110857, -354950, 82444, 48736, -72696, -184032, 102953, 155726, 198010, -100076, 88947, 66984, -13900, -228779, -89173, -210458, -244510, -132909, 45985, -150339, -224564, -37551, -369997, 210908, -240694, -256309, -342059, 127722, 79346, -88303, 25653, -40780, 170687, 56398, -2333, -75235, 33837, -187189, 78883, -106763, -87143, -188264, -106478, 198328, 275633, 206521, 13695, -3644, 127057, 6031, 202798, -23438, 186147, -20646, 898, -156132, 267339, -73791, -60794, 122869, 222524, 115643]
18381A15643K8668d38549h0486H5700f1277r0394A91163b73158i0195j95602E6721
18369E3217b86564a10894A93222n0254a01394A93836C4936d4480j62090B68858
18358G264d2393q9365j12763A49103n8227m010b12748p9427e8700r2288B23294
18346b25247O0704o3494A38481j3659h9421o6613n969B4129K2999d64212A9665
18334A27121f6830q0785N8621m0534b0978B20451a2802q9433K5344k5245k0666
18323a22802k5863A66124J3985f708B68764e7841K5731D3475f6043B11893a3394
18311b96536e5806A32694a67248r0625h9179p4181r6968A53220g2858K8829k9203
18300g3232p5298k43006C54589a75409O3124d8580a6124A23597g9404B3113Q0057
$$ y = [115643, 144311, -438549, -80486, 85700, -61277, -151671, 191163, -273158, -90195, -285797, 56721, 53217, -286564, -110894, 193222, 142968, -101394, 193836, 34936, -44480, -206570, 268858, 7264, -42393, -131758, -244521, 149103, 90876, 86866, -212748, -292175, -58700, -150988, 223294, -225247, -164543, -228037, 138481, 124822, -89421, -156034, -162003, 24129, 47128, -464212, 19665, 127121, -66830, -147615, -88994, -129528, -20978, 220451, -12802, -102235, -76891, -102136, -122802, -148665, 166124, 180109, -6708, 268764, -57841, -32110, 43475, -66043, 211893, -13394, -296536, -55806, 132694, -167248, -257873, -89179, -163360, -260328, 153220, -72858, -44029, -73232, -148530, -391536, 354589, -175409, -112285, -48580, -16124, 123597, -79404, 23113, 103170]
18289A03170j0159b81063c0650j40300l26930c0523l07983A974R0036J16740h7405
18277A07061a21579A72012d965l6623l9537C9474i7912j84485A11184a01155l6694
18266a37849n531F2611L0554g5003A57249G5434k632k8873A8048a13209j08817
18255b22026d4728B88111i1098b5438G7432N2359h8703A08772E1453J885J36834
18244A90172a67556Q1533b1966j71727I031K16282c52756J75044A07751a52067
18233b8600A88794C1081K20186A6377K39128b73041B9327P8747a3204A12061h4835
18221E0069b2847A52959C8442b82586a31171m3197Q2895o0580A87383H4183L01264
18210C85447a9612A42251a19070C5944c77631k316g0605m4251A51747B1405b05854
$$ y = [103170, 93011, -281063, -30650, -170950, -497880, -30523, -338506, 1974, 92010, 208750, -87405, 107061, -121579, 172012, -4965, -41588, -81125, 39474, -97912, -282397, 111184, -101155, -137849, -143380, 62611, 93165, -75003, 157249, 75434, 72802, 43929, 18048, -113209, -222026, -44728, 288111, -91098, -25438, 77432, 129791, -88703, 108772, 51453, 53338, 190172, -167556, -86023, -21966, -193693, 9031, 225313, -352756, -177712, 107751, -152067, -28600, 188794, 31081, 251267, 16377, 255505, -273041, 29327, 108074, -13204, 112061, -84835, 50069, -22847, 152959, 38442, -282586, -131171, -174368, -91473, -152053, 187383, 84183, 385447, -19612, 142251, -119070, 35944, -377631, -379947, -70605, -114856, 151747, 21405, -205854]
18198C3756J75085h4865I1750j5774j4439J17963G6565N0189a50170C02006a79660
18186a25572j19316I4295f453a493j26650A80087f7194C7747M3104R011c90754
18174c16498a47945o636B4135c05399A3852L2996o810b70195k5299B99719H845
18162i5188b3609m5192B67110d04240A04965a031j2279A69667f2279k0731k04059
18151b87069J39692B17871p8369i7927L528A70716a42115D9407a99731g8822q8148
18140a66970D1197b28696o0994J7470a5561j63742K6538D4770J41253c78998e913
18128D4589b24746E6931e57635A98178b6480B97614a88952g1884A64447a42827
18117f648G3401g0432E46454a48142e6818B90146j44293c7081A7446N7872L513
$$ y = [33756, 208841, -84865, 91750, 75976, 61537, 179500, 76565, 126754, -150170, 302006, -179660, -125572, -244888, 94295, -6453, -1493, -128143, 180087, -67194, 37747, 80851, 89862, -390754, -316498, -147945, -154581, 24135, -305399, 13852, 46848, 40038, -270195, -295494, 299719, 8845, -95188, -23609, -68801, 267110, -404240, 104965, -1031, -13310, 169667, -62279, -83010, -287069, -147377, 217871, 139502, -97927, -94399, 170716, -142115, 49407, -199731, -78822, -166970, 41197, -228696, -289690, -272220, -15561, -179303, -152765, 44770, 186023, -378998, -5913, 44589, -224746, 56931, -557635, 198178, -26480, 297614, -188952, -71884, 164447, -142827, -6648, 73401, -70432, 546454, -148142, -56818, 290146, 145853, -37081, 17446, 75318, 78831]
18106G8831a66267j88157h0641E5553b06544M2222P4960B8669K6225c6352j17228
18095a53580L0642A03708j4005A8262c7124J3354j67137r9715f8203A22318j3305
18084A09013J9155J29304a76400G2323d2283m1809A84771b14270i5000M5573j75809
18073b25236h4291c3058k1115r5832H7688d6348j91950B91780b55332h3290J1531
18062g1759A51481f1714o6513k44315H8981J57001a24197D69346A03274k8706
18052G4568a29834J2988A89793a39026F6784a84761E1826M5859c00987D7014J43403
18041A90417J17391b34929b5679K794k45913a01388A80158c9545B42966b40170
18030b02423C10914A1319a12304H169J80522B578b16594a2731l3535A36109k4853
$$ y = [78831, -166267, -354424, -80641, 55553, -206544, -164322, -89362, 28669, 54894, -36352, -153580, -122938, 103708, 89703, 18262, -37124, -23770, -190907, -290622, -68203, 122318, 109013, 128168, 257472, -176400, 72323, -42283, -84092, 184771, -214270, -95000, -49427, -225236, -84291, -33058, -54173, -150005, 87688, -46348, -238298, 291780, -255332, -83290, -71759, 151481, -61714, -128227, -372542, 88981, 245982, -124197, 469346, 103274, 74568, -129834, -116846, 189793, -139026, 66784, -184761, 51826, 97685, -300987, 47014, 190417, 307808, -234929, -25679, -22885, -268798, -101388, 180158, -39545, 242966, -240170, -202423, 310914, 11319, -112304, 8169, 188691, 2578, -216594, -12731, -46266, 136109, 111256]
18019A11256b46209k4765m8570h1982A16557E4024M8917f3781I9804J26601C7617
18007f2362F4056f4247A4624J20440m6140a32477k26444B86064a30714A2782d076
17995A17458J13725j2381I5483N447K3472l4675l5238J0946J87175k600j23134
17984A26876o2214c217B6438a70457A64892J25628a10443B90713G5216a62931
17973A71575G0140a71166I5437j7725K02690a84260H6961A735a51918l1608a4113
17961a01863c6643F1012J167a07391A15592J92766a88689I9006C2976b53314b9260
17949i1429A61272m7695a33468e5697k70556a5552k4748D6147a85858F4703k0110
17938D4593c6071j94396g1251A00848b1997A02473I890b0771A47311J5918n5100
$$ y = [111256, -246209, -270974, -319544, -81982, 116557, 54024, 102941, -63781, 99804, 226405, 37617, -62362, 64056, -64247, 14624, 135064, 88924, -132477, -358921, 286064, -130714, 12782, -4076, 117458, 231183, 218802, 95483, 100930, 124402, 89727, 54489, 65435, 252610, 250010, 126876, 64662, -3217, 26438, -170457, 164892, 290520, -110443, 290713, 75216, -162931, 171575, 70140, -171166, 95437, 77712, 280402, -184260, 86961, 1735, -151918, -183526, -14113, -101863, -36643, 61012, 62179, -107391, 115592, 308358, -188689, 99006, 32976, -253314, -29260, -91429, 161272, 113577, -133468, -55697, -326253, -15552, -40300, 46147, -185858, 64703, 44593, -36071, -230467, -71251, 100848, -21997, 102473, 9890, -20771, 147311, 163229, 108129]
17927A08129J0756a39509f8655A77452C8039c98580a5186A68322q0267f6064l9677
17916a05741L8709E7645f0067j34025k42185a25694A54250a45771b4440A62582
17905H6669P7949b36031A78594h3131E9804O701f4281C59254A15910A0837l596
17894G241R3562l4774L842J01884l0964R3663l768J00361a20007b0033A12762
17882e3015C51758b87016B33325b2193j12769A08277J10138A6574c5429j40473
17872a75902B5945K87180p3877H7624A263a1881k86577a15769A27760A0373J17554
17861A27927i9802A9719N5415g8490k33729a23318C2659Q060b54657B95618j5105
17850B80513A19414J46850b64227A59249j7438a6863B6702J38694k3002b43244
$$ y = [108129, 118885, -139509, -68655, 177452, 38039, -398580, -15186, 168322, 88055, -66064, -105741, -67032, 57645, -60067, -194092, -436277, -125694, 154250, -145771, -24440, 162582, 86669, 164618, -236031, 178594, -83131, 59804, 66505, -64281, 359254, 115910, 10837, 7241, 100803, 66029, 69871, 171755, 140791, 234454, 230686, 331047, -120007, -20033, 112762, -53015, 351758, -287016, 233325, -22193, -134962, 108277, 218415, 16574, -35429, -175902, 25945, 313125, 239248, 87624, 1263, -11881, -298458, -115769, 127760, 10373, 127927, -99802, 19719, 75134, -78490, -312219, -123318, 32659, 40719, -254657, 295618, 280513, 119414, 266264, -264227, 159249, 141811, -16863, 26702, 165396, 142394, -243244]
17839E1598K55872R7662a07013B0251J90331J52160j27454k9145k6515J82904
17829C62532b23513D4597b8028k01842E1138J40423N2437I429c2396q4091p080
17818a23567A0763J11624l3416a64172j7424J701d7936m2222A80373i439j33785
17807a43224m0868B08168i7176a1938j38171b0016C0148b99541J35694K791E8584
17795h9595C02240l4416B2569c4867A2395J05412a9964A28414c2321A3139f6577
17783A82909a34533A47769i8166J6313o0116H6722D832a1597m2610o3023a2267
17771A26441A1858b24504D9996P4837n2493j1745J35246j0133m9816B6209N0439
17760G6648a62789C10585B5824J63599P1978e9632A99056f5117B42432G6647d3079
$$ y = [51598, 307470, 405132, -107013, 20251, 210582, 362742, 235288, 206143, 179628, 362532, -223513, 44597, -28028, -229870, 51138, 191561, 243998, 9429, -32396, -116487, -123567, 10763, 122387, 88971, -164172, -181596, -179895, -47936, -90158, 180373, -9439, -143224, -184092, 208168, -97176, -11938, -150109, -20016, 30148, -299541, -163847, -161056, 58584, -89595, 302240, 267824, 22569, -34867, 12395, 117807, -19964, 128414, -32321, 13139, -66577, 182909, -134533, 147769, -98166, -81853, -141969, 86722, 4832, -11597, -54207, -117230, -12267, 126441, 11858, -224504, 49996, 124833, 72340, 60595, 195841, 185708, 135892, 26209, 76648, -162789, 310585, 25824, 189423, 261401, -59632, 199056, -65117, 242432, 76647, -43079]
17748H440J67913b8522I1482J49405p1466J01473L01r844i4140A06578f5011j80796
17736b45807A09817a6275q9609e685F132P2008J16193r4516c16252B5641M38879
17725D64520f6201j1614A08113O2050d6152F4779J24978F1071L42312j1679A28433
17713B3602J27873d5709j53323I4838J81614B3628K01941A10514a64597G7317
17702D8423e0281j7366k6587a7373A76534G2847a68657F2539O1238a38874n475
17691a44349A08207K14804j45894j9871h8392G4610J0021B6742P5900J88015P9454
17680C70111A77003q4779i192G9195a54070E3013L10062a06456B86328d5123E163
17668a33386o7657A05873c7448A22200R1874j06348o909Q8305M89774f5591H2063
$$ y = [8440, 176353, -28522, 91482, 240887, 169421, 270894, 271195, 261351, -94140, 106578, -65011, -245807, 109817, -16275, -105884, -5685, 6132, 78140, 194333, 99817, -316252, 25641, 464520, -66201, -77815, 108113, 170163, -46152, 64779, 189757, 61071, 403383, 391704, 128433, 23602, 151475, -45709, -199032, 94838, 276452, 23628, 225569, 110514, -164597, 77317, 48423, -50281, -67647, -94234, -17373, 176534, 72847, -168657, 62539, 123777, -138874, -144349, 108207, 323011, 177117, 157246, -88392, 74610, 84631, 26742, 102642, 290657, 370111, 177003, 92224, -9192, 79195, -154070, 53013, 363075, -106456, 286328, -45123, 5163, -133386, -201043, 105873, -37448, 122200, 214074, 107726, 100817, 189122, 678896, -65591, 82063]
17656A23981K21410A71414Q5846F9487J00084A4366a31989b1859j60806C21471
17645H069J60409A7026K8647i9544A75603K2562N8055g9720m5708D18297a4395
17633A81001c5495B60277b8352A51193h2804E2068a01739F945M3890K5195J26323
17622B02353n5341J52201A31566J02822g5241A63672e930n4708A46514J8048m2727
17611A21835B844i1318A50350e0651C45569H4518K14658j38771J73k2922J23309
17600B60965j6291e0316C02213A51052a09548C75072D701f4276a2565E25806a4395
17588g6313B82226j24469J08696j22809l2404a71528C92M1361j4901b51977A9176
17576i0848m4126b6343A78499Q5519A21800J71762p1644c7127C27094j53703h663
$$ y = [123981, 345391, 171414, 257260, 69487, 169571, 14366, -131989, -21859, -182665, 321471, 8069, 168478, 17026, 45673, -99544, 175603, 198165, 256220, -79720, -125428, 418297, -14395, 181001, -35495, 260277, -28352, 151193, -82804, 52068, -101739, 6945, 50835, 76030, 202353, 147012, 299213, 131566, 234388, -75241, 163672, -5930, -60638, 146514, 164562, 121835, 2844, -91318, 150350, -50651, 345569, 84518, 299176, 160405, 160578, 137656, 260965, 244674, -50316, 302213, 151052, -109548, 375072, 4701, -64276, -12565, 525806, -14395, -76313, 282226, 157757, 266453, 143644, 111240, -171528, 392, 41753, 26852, -251977, 19176, -90848, -134974, -26343, 178499, 264018, 121800, 293562, 221918, -37127, 327094, 173391, -8663]
17564d3164j49314N4069C633J26686L71157a30694B50870n8085B6695A2030c6179
17552B8730K42472a45134B49864o2405N4869q2080K4031G0853P7663J07062a29173
17540b23825B1494a7496B54248A8173J3006J35966J1166R9059C5958K82071n8383
17529B59646j2924C0042O0889J54671a967C95691J44934m5464j49076J72838j39888
17518C79035n8886K81594q4299F8390L76923A77039J56275j01094A07321P4039
17508A81360L19962j29860N9290j12424J29737j28032j02661J60491A09132l2976
17498G6156J97215J92112k2832j37463a04866B91516K23049A57745f873D00490
17487F218M27163A03158m7634n829J62802P8880o3236k8124o8915K5540Q3401
$$ y = [-43164, -192478, -138409, 3633, 130319, 501476, -130694, 250870, 192785, 26695, 12030, -36179, 28730, 271202, -145134, 249864, 187459, 242328, 160248, 184279, 70853, 148516, 255578, -129173, -223825, 21494, -17496, 254248, 18173, 31179, 167145, 178311, 277370, 35958, 318029, 259646, 246722, 30042, 90931, 245602, -1967, 395691, 540625, 495161, 346085, 518923, 379035, 320149, 601743, 517444, 68390, 445313, 177039, 333314, 232220, 107321, 181360, 501322, 371462, 430752, 318328, 448065, 320033, 217372, 377863, 109132, 76156, 273371, 465483, 442651, 305188, -104866, 291516, 514565, 157745, -6873, 400490, 6218, 433381, 103158, 55524, 49695, 212497, 291377, 228141, 200017, 131102, 156642, 240043]
17476B40043a05997A90714m6627L15536A74353O6066F0576O5000R4307J30646
17466C50529GP0269a36673B20059K7401K00145I1962Q0852K04891H6147M16601
17455E02748H4702L0041O8011B6764K39152A19702L3630J27323A00070a8570C51274
17443G81805B41486p8717D2984K4213M58750j99383e8727E83588B40452K40389
17433D80841B09771K00114j20019j19559O252B7208M28610K0349Q0009B43144
17422E7568M10480L1786K7613A14439K52710j48951I664M9869L58341D9136L00815
17411C49951L8181b1266A77838L42594k05792G5234J69393M17033A86767f3360
17400A05574L12184a81697C7458j2837K59647j32046g9506C75458j54448P8107
$$ y = [240043, -105997, 190714, 144087, 459623, 174353, 240419, 60576, 125576, 219883, 350529, 7, 70276, -136673, 220059, 247460, 447605, 91962, 172814, 377705, 86147, 502748, 84702, 114743, 182754, 26764, 265916, 119702, 153332, 280655, 100070, -18570, 351274, 781805, 241486, 162769, 42984, 67197, 525947, 326564, -58727, 583588, 240452, 480841, 209771, 409885, 289866, 170307, 176559, 27208, 455818, 476167, 556176, 243144, 57568, 468048, 499834, 527447, 114439, 367149, 218198, 9664, 59533, 417874, 49136, 349951, 388132, -21266, 177838, 520432, 314640, 75234, 244627, 661660, 186767, -63360, 105574, 417758, -181697, 37458, 24621, 284268, 152222, -79506, 375458, 221010, 299117]
17390B99117j18878J85803H6147J45748I5523b5883A65672K16142I6575K61085
17380C57660A06471L98763A16903L51628b5230A55345c4171A73265a0846A38937
17369B79228p247J21825J81585C7453J37312J63027A34302J50309b308D37996
17358A68980A7625N67788A96346K2786r8373K47340j28671H0130J17351q7487
17348A09994J98064L0629m2176A38327J63357j46625K72903A91523a10872C83347
17337G6892J67818m9029J41813J1202K07498A62345E1556L3018e7106C40876j34495
17326B06381a98726B41670J50788A45530O3118J41293j46254o7627E5707L19342
17316C75049J07961A22942K11711l9054M3848p3087A05016B0074K7175J21451
$$ y = [299117, 180239, 366042, 86147, 231895, 95523, -25883, 165672, 381814, 96575, 357660, 106471, 505234, 116903, 468531, -25230, 155345, -34171, 173265, -10846, 138937, 279228, 271981, 393806, 575391, 37453, 174765, 337792, 134302, 284611, -2308, 437996, 168980, 17625, 585413, 196346, 219132, 120759, 368099, 239428, 80130, 197481, 109994, 308058, 338687, 296511, 138327, 301684, 155059, 427962, 191523, -110872, 383347, 76892, 244710, 195681, 337494, 348696, 556194, 162345, 51556, 84574, -57106, 340876, 206381, -198726, 241670, 392458, 145530, 208648, 349941, 203687, 136060, 55707, 375049, 483010, 122942, 334653, 295599, 339447, 266360, 105016, 20074, 47249, 168700]
17306A68700L06910C6844K27944q7761K56474A37649J0842F6414h6628A86123
17295A68111J43204J55208j82735K18573C482L78767l723G8141K07081d651E47113
17283D33069j38599k2507j22154n7363L27552j82871R1323q6814J89671q2306
17273C49001l5112p8917q1390a1641A87311m4130a22066B18105K76546j55368
17263C39283k8627A18735K06492j21874K02932K2110J82043A00728L19973j48283
17253B72418K76625k70975k3695H4329N26300B16492P1525A40698R6168j02304
17243A34562M21262B49661K58870A70788O27516B47819i8920C70129D1286K41893
17233B83179L02996k91568J63607I0033J06173e6366D28622J69306j60563R1767
$$ y = [168700, 475610, 36844, 264788, 177027, 433501, 137649, 148491, 66414, -86628, 186123, 168111, 311315, 466523, 283788, 502361, 3482, 382249, 378526, 78141, 285222, -4651, 547113, 433069, 294470, 271963, 149809, 92446, 419998, 237127, 328450, 241636, 431307, 349001, 313889, 234972, 153582, -11641, 187311, 143181, -122066, 218105, 494651, 339283, 310656, 118735, 325227, 203353, 406285, 428395, 610438, 100728, 420701, 272418, 549043, 278068, 254373, 84329, 610629, 216492, 288017, 140698, 236866, 134562, 555824, 249661, 508531, 170788, 798304, 247819, -98920, 370129, 41286, 283179, 586175, 294607, 458214, 90033, 196206, -56366, 428622, 597928, 437365, 529132]
17223E29132j76544M6978k8614A16660L94463B40010K49365k5771k08092Q4333
17213C39845c0057B55171P9509A64894Q5722N2015P5001J21290m5939j02156o88
17202C50139p5424M6743K47810B49545j2419L88646A86773J87262L8717J15620
17192E28372l14J43950l10777L05397B96811J55915j93628J64232j7550A84451
17181C64618G0606K43113K46631A79358K31131l3625o8145J08970Q7023K07245
17171G11957k30149j16522l9962A22351R7188L72537k13589m5149K07667j85433
17161C55572l9019K7219l7141K71603K04353C28073K32016l6590R7336j76021
17151D44814A77773N36162k87803J93302J88381l89655J50565B38446N8809L59749
$$ y = [529132, 352588, 399566, 370952, 116660, 511123, 240010, 489375, 463604, 255512, 339845, -30057, 255171, 334680, 164894, 250616, 302631, 377632, 498922, 452983, 350827, 350139, 274715, 321458, 569268, 249545, 237126, 625772, 186773, 374035, 412752, 528372, 528058, 672008, 361231, 666628, 296811, 452726, 259098, 423330, 405780, 184451, 364618, 70606, 313719, 560350, 179358, 410489, 376864, 308719, 417689, 504712, 711957, 481808, 365286, 325324, 122351, 219539, 592076, 378487, 333338, 541005, 355572, 316553, 343772, 306631, 578234, 782587, 328073, 560089, 523499, 620835, 444814, 177773, 713935, 426132, 619434, 807815, 418160, 568725, 238446, 297255, 657004]
17141F57004j26707M8124j84466j84630L09481j46476M79581l34456j65741j46552
17131B05162L56183j36040O5094m387J94577j35029p3016j08101r2206k9277M16930
17120F59890A93078L56598o5359R3411J81087k70343J56582j85088K97779j36547
17110F21198r6300L08155B34520K77884k0700O5061J19594j65913K68369j27113
17100F51702B74746J62968l8431J72924l433Q6051J0057k0633j21713K72231J9004
17089H13771j96329j54652J43068J09069k11977L52440M3772k29515J27645l60381
17079D36911J80237m4643K15304l11771K74136k0048m3701o6367j14512L73229
17069H78775K78689p3311j76234j69612J22941O6830k24495P242n8030K91211
$$ y = [657004, 530297, 578421, 393955, 209325, 518806, 372330, 851911, 517455, 351714, 205162, 561345, 425305, 490399, 486012, 680589, 545560, 472544, 364443, 272237, 242960, 659890, 193078, 549676, 484317, 577728, 758815, 488472, 645054, 459966, 757745, 621198, 524898, 833053, 234520, 512404, 491704, 556765, 676359, 510446, 778815, 651702, 274746, 437714, 399283, 572207, 568774, 654825, 664882, 644249, 522536, 794767, 813771, 617442, 462790, 605858, 714927, 502950, 855390, 899162, 669647, 797292, 436911, 617148, 572505, 787809, 476038, 750174, 730126, 686425, 620058, 505546, 878775, 1157464, 1084153, 907919, 738307, 861248, 928078, 703583, 710825, 652795, 944006]
17059I44006l74316j6894R0227L72114C81876K82972J41827n621M0507O0649k76023
17048F26187M54719l00894m9440K37479J32586l86963L39017k11158J09173q4196
17038H66510j61985M84337j82578n02513O09607j44758M1683j18668J14012J43308
17028A148955l20384L5226N58013l65431O7953k50549K62421J15162j72769j26951
17018I51646J47418N6075l6541k91018K12394L59966l21046R6840Q8538l6962
17008A227310m1253j60203K22549L3760j19078Q4275k20851K34510j24009k4329
16998A112681Q4498J75620l31718K65537J60185j83265J48123n21081L89858k9010
16988A271428L68836j37689l7629K47375j42377j40325K69651m31815K93226l20926
$$ y = [944006, 569690, 552796, 643023, 1015137, 381876, 664848, 806675, 801054, 841561, 902210, 626187, 1080906, 780012, 730572, 968051, 1100637, 713674, 1052691, 841533, 950706, 866510, 704525, 1188862, 1006284, 503771, 1113378, 968620, 1010303, 891635, 1005647, 1148955, 828571, 863797, 1421810, 1056379, 1124332, 873783, 1136204, 1251366, 1078597, 951646, 1099064, 1155139, 1118598, 827580, 1039974, 1399940, 1078894, 1175734, 1264272, 1227310, 1186057, 1025854, 1248403, 1282163, 1163085, 1247360, 1026509, 1261019, 1137010, 1112681, 1197179, 1372799, 1041081, 1306618, 1466803, 1283538, 1431661, 910580, 1300438, 1271428, 1640264, 1502575, 1464946, 1712321, 1569944, 1429619, 1699270, 1267455, 1560681, 1239755]
16978A239755N60717l49988j47245L28475M4003k51662K89329l99660K32884L67153
16968A913761l51119K16118k02706J50836k4018K0655J27463k98917J88807P198
16958A748078J47002l55746M64663m61420M14295K07226l17412J39539j00482
16949A885743J21681O2924j69391K2151j22321K91414j52761J83075J94412k99002
16939B017925Q6123K6532k09211M19672q3380k16570K55419p3464Q0379k30432
16929B072993L44500k34590K87440J70676q4959K38856l99489k09854N94576o3015
16919B717134N0601j26758M1354J6070o1552O0716L24348k61285J38782K72417
16909C171827m14334j41419K50449K98530j19634O3390j89268K14351K59054k71387
$$ y = [1239755, 1800472, 1450484, 1303239, 1631714, 1675717, 1424055, 1713384, 1313724, 1546608, 1913761, 1562642, 1778760, 1576054, 1726890, 1702872, 1723527, 1850990, 1552073, 1740880, 1748078, 1895080, 1539334, 2003997, 1542577, 1956872, 2164098, 1846686, 1986225, 1885743, 2007424, 2070348, 1900957, 1923108, 1800787, 2092201, 1939440, 2122515, 2316927, 2017925, 2104048, 2130580, 1921369, 2341041, 2257661, 2041091, 2296510, 2223046, 2303425, 2072993, 2417493, 2182903, 2470343, 2641019, 2556060, 2794916, 2395427, 2185573, 2780149, 2717134, 2767735, 2640977, 2682331, 2698401, 2636849, 2697565, 3021913, 2760628, 2899410, 3171827, 2757493, 2616074, 2866523, 3165053, 3045419, 3108809, 2919541, 3133892, 3392946, 3121559]
16899C121559K88769J95397k35118j55721M43904k65500K06833k65108N11709
16890C846724o2123K60947k83129J58693J72699j61537n60081O39851J42385p360
16880D147069K62860q7735q4558J55590n2090j69002L25062K69644j39814L45717
16870D972743l45945K80985m6295L70014k39333J692K87113J21648r4625R8644
16860E406641L99777k18781J07454n0207M22869j00016J22561n6193J02932J46683
16850F283720K89539K54715k89830K90881J42681L7496j15037J3321M67283K5791
16840G400560O65166m37781Q2319K34704k3995L77626J06334M30039l11989M49116
16830H972099M03826l92062N55981l8860O4830K43455K12687J07862O10747J44792
$$ y = [3121559, 3410328, 3605725, 3370607, 3214886, 3658790, 3393290, 3600123, 3335015, 3846724, 3784601, 4045548, 3762419, 3921112, 4093811, 3932274, 3372193, 4012044, 4154429, 4147069, 4409929, 4322194, 4237636, 4393226, 4341136, 4172134, 4497196, 4766840, 4627026, 4972743, 4626798, 4907783, 4861488, 5231502, 4992169, 4993861, 5280974, 5402622, 5307997, 5406641, 5806418, 5587637, 5695091, 5644884, 6067753, 5967737, 6090298, 6034105, 6137037, 6283720, 6573259, 6827974, 6538144, 6829025, 6971706, 7009202, 6894165, 6907486, 7374769, 7400560, 8065726, 7627945, 7710264, 7944968, 7920973, 8298599, 8404933, 8834972, 8522983, 8972099, 9375925, 8983863, 9539844, 9500984, 9565814, 9809269, 10021956, 10129818, 10740565, 10885357]
16820A0885357n4982L34467N17278J70895m7097q2634N95440K50460L16873K27178
16810A3113235K52684N16575Q8491K61416K87849N16822K54352L67142J42864
16801A5801430M51867K70203J64084M89963O21395O06653J02345K00665R37565
16792A9646170K96307M17643R74677q4194N58782P42411Q33635P04301K47199
16783B4336931Q12126K55316J105950O31887Q01807O84463N23215Q59999J001173
16774C1012867Q17469J018540Q87228O52326J306059P11260R68748J364007J007292
16765C9745796J366506Q06195J156018J511660J092009J448561J648617J120188
16757D9895550J490946J417017J320199J495963J528586J664780J594021J348255
$$ y = [10885357, 10830375, 11164842, 11682120, 11853015, 11805918, 11723284, 12318724, 12569184, 12886057, 13113235, 13365919, 13882494, 13970985, 14232401, 14520250, 15037072, 15291424, 15658566, 15801430, 16253297, 16523500, 16687584, 17177547, 17798942, 18405595, 18507940, 18708605, 19646170, 19942477, 20360120, 21334797, 21250603, 21809385, 22551796, 23385431, 24089732, 24336931, 25149057, 25404373, 26510323, 27142210, 27944017, 28628480, 29151695, 30011694, 31012867, 31830336, 32848876, 33736104, 34388430, 35694489, 36405749, 37374497, 38738504, 39745796, 41112302, 41918497, 43074515, 44586175, 45678184, 47126745, 48775362, 49895550, 51386496, 52803513, 54123712, 55619675, 57148261, 58813041, 60407062, 61755317]
16749F1755317J358316K077335J491162J509797J389094J772298J767603J667146
16741G4788068J248215J608665J445737J661541R97378J308761J449702J115880
16733H5623947Q89053R52107Q51345P26000L24218P3953J80041O24355m6303l99180
16723H9799536k45794o60285m63045m59480m22952j052246j087166j422180m64793
16714H3521595j469359j007108j761702j397286j313896j661716j536312j834362
16706G1539854j486327j096535k037565j249097j810884j338809j763160j555417
16698E9202060j222751j728778j441388r78335j492406j433701j392032j519311
16690D7993358r97820j295760j499972r50047j137884j115874q95104j156806
$$ y = [61755317, 63113633, 65190968, 66682130, 68191927, 69581021, 71353319, 73120922, 74788068, 76036283, 77644948, 79090685, 80752226, 81749604, 83058365, 84508067, 85623947, 86513000, 87465107, 88316452, 89042452, 89366670, 89440623, 89620664, 90245019, 90198716, 89799536, 89553742, 88893457, 88430412, 87970932, 87547980, 86495734, 85408568, 83986388, 83521595, 82052236, 81045128, 79283426, 77886140, 76572244, 74910528, 73374216, 71539854, 70053527, 68956992, 66919427, 65670330, 63859446, 62520637, 60757477, 59202060, 57979309, 56250531, 54809143, 53830808, 52338402, 50904701, 49512669, 47993358, 46995538, 45699778, 44199806, 43249759, 42111875, 40996001, 40100897, 38944091]
16682C8944091r24693j082613j034104n54449j041473j037906q88781p77574o72307
16673C0930191p70099p72018p40618r88217l15375n37342n43476p38623p97921
16664B4726502n53709j33052o85370m98405r25654n9120o51462m77956n80630
16655B0161144l72541j58646n29384m57040m67753l20892j19716p49436k13299
16646A6772437k42063k59336m20226l72193l05584k48610k04908o53788j70948
16637A3894781K11659n41695m8923j84886m95219n1530k39996l37151k04368k0691
16627A1981981k91477l67912J60713m42076J8042k35477k82323q3311k29389j12340
16617A0116431M8972l91438o6723J5821k96531j58564j37831k44131k29446K13371
$$ y = [38944091, 38019398, 36936785, 35902681, 35348232, 34306759, 33268853, 32380072, 31602498, 30930191, 30160092, 29388074, 28647456, 27659239, 27343864, 26806522, 26263046, 25524423, 24726502, 24172793, 24039741, 23354371, 22855966, 21930312, 21871192, 21219730, 20741774, 20161144, 19788603, 19629957, 19100573, 18643533, 18175780, 17854888, 17735172, 16985736, 16772437, 16530374, 16271038, 15850812, 15478619, 15173035, 14924425, 14719517, 14065729, 13894781, 14106440, 13564745, 13515822, 13330936, 12835717, 12784187, 12544191, 12207040, 12002672, 11981981, 11690504, 11322592, 11483305, 11041229, 11059271, 10823794, 10541471, 10458160, 10228771, 10116431, 10165403, 9773965, 9707242, 9723063, 9426532, 9267968, 9130137, 8886006, 8656560, 8869931]
16607H869931m74947n9915M3327k27219j23318j2982j05346M8614n31249K04966
16597G631862j62121j67567j05107J38251k82525k4162j19377j50312j2939p9946
16587F666057l92343K95428j45347J33567m99504L3066j52741k81573L02325j61508
16577E797427k08118J25405J70062j46729n49994K17067K5334k9645j54234k51307
16567D995268j16952J67046M1759r7046k55292K0099j76939K11845J62l44197
16557D445753R4066K28407k99506R0009o5245R5815J20810l22751j14983k69939
16547D002436L90583l33476J1573J1330K89892n20551J54919k35135N829L674
16537C781074J38057L3400k27709N4325j70565Q1379l97496N40475r865n06493
$$ y = [8869931, 8394984, 8335069, 8378396, 8151177, 8027859, 8014877, 7909531, 7958145, 7426896, 7631862, 7469741, 7302174, 7197067, 7335318, 7052793, 7028631, 6909254, 6758942, 6746003, 6666057, 6273714, 6569142, 6423795, 6557362, 6057858, 6090924, 5938183, 5656610, 5958935, 5797427, 5589309, 5714714, 5884776, 5738047, 5188053, 5405120, 5430454, 5400809, 5246575, 4995268, 4878316, 5045362, 5087121, 4990075, 4734783, 4754882, 4577943, 4789788, 4789950, 4445753, 4539819, 4768226, 4468720, 4558729, 4493484, 4589299, 4710109, 4387358, 4272375, 4002436, 4393019, 4059543, 4071116, 4082446, 4372338, 3851787, 4006706, 3771571, 3777400, 3781074, 3919131, 3952531, 3724822, 3779147, 3608582, 3689961, 3292465, 3832940, 3823075, 3316582]
16527C316582L4173K20093J03835m05970K39114j21500j13687J80024k53363m5079
16517C154222J49176J075p1431l01652J87676j44239k78294M18249q8250j94877
16507B831655k1176P3040P091k85333O0538M25601l23863K52721j10128j75068
16497B735078K06137l97577J88155K26026k46867p5902R1592J25032k30739k76391
16487B344544M26759m36879K28746j28922O9761j60489o3694K89960j17476j68818
16477B283492K85105j13603L1453j95664j63313L53310j15967j51113M4871r7479
16467B161092J00734K10825n23623M38669k59977J48876j69792j18903r4233L60903
16457B254571j35183J9096K01J0408n5595l24723K63462r4639J54334n5222K02822
$$ y = [3316582, 3350755, 3570848, 3674683, 3268713, 3507827, 3386327, 3272640, 3452664, 3199301, 3154222, 3303398, 3304473, 3233042, 2931390, 3119066, 2974827, 2696533, 3114782, 3026532, 2831655, 2810479, 2883519, 2890610, 2605277, 2665815, 3091416, 2767553, 3020274, 2910146, 2735078, 2941215, 2543638, 2731793, 2957819, 2710952, 2635050, 2726642, 2851674, 2620935, 2344544, 2771303, 2334424, 2563170, 2434248, 2504009, 2343520, 2279826, 2569786, 2452310, 2283492, 2568597, 2454994, 2486447, 2290783, 2127470, 2480780, 2364813, 2213700, 2258571, 2161092, 2261826, 2472651, 1949028, 2387697, 2127720, 2276596, 2106804, 1987901, 1893668, 2254571, 2119388, 2138484, 2138685, 2149093, 2093498, 1768775, 2032237, 1937598, 2091932, 2036710, 2239532]
16446B239532m90882j29924L29583r1493o4236O668J06683j11808J46765k82959
16436A657929N03865k77852m4231J8366q5400R799k36928L01059k13525o7578
16426A565504L42892l60120K95392J93586j34459n3159l29766P0895j61018K12035
16416A641782J59995j69930m13861N29949J0416m13227N15435m34015Q6091J54113
16406A666748O1895n8188j76432M0426J39645k99414q5674O42565n45875m4911
16396A340785J42480J3507j02199k34070K27757M08898r9117K0389l91137j3885
16386A313408j82346L46960l49074J58689J19380M595k95240k9527L5782n627
16376A117000K81667j6252k39585M00403n92723M87151k35520J49535k58420N53687
$$ y = [2239532, 1748650, 1618726, 1948309, 1856816, 1792580, 1799248, 1905931, 1794123, 1940888, 1657929, 2161794, 1883942, 1839711, 1858077, 1772677, 1782476, 1545548, 1846607, 1633082, 1565504, 1908396, 1548276, 1843668, 2037254, 1902795, 1849636, 1519870, 1590765, 1429747, 1641782, 1801777, 1631847, 1217986, 1747935, 1758351, 1345124, 1860559, 1426544, 1512635, 1666748, 1728643, 1670455, 1494023, 1534449, 1674094, 1374680, 1289006, 1931571, 1385696, 1340785, 1483265, 1496772, 1394573, 1160503, 1388260, 1797158, 1698041, 1718430, 1327293, 1313408, 1131062, 1478022, 1128948, 1287637, 1407017, 1411612, 1116372, 1086845, 1122627, 1117000, 1398667, 1382415, 1142830, 1543233, 950510, 1437661, 1202141, 1351676, 1093256, 1646943]
16366A646943n48683K51140k81155L59774l48345O7291j30144J9675J08241p5316
16356A069421J86588j13187K75652q8459l33954M35528n72949L82666j90797j36174
16346I14335m6639L46099k44052P4974J61591O7874o9749o6950O9773l936l62032
16335H41288M16752Q0754n17244q8980L17634k31008M05648K9761m12174R1518
16325I33949J88402M9961k85350J91210p4756L0241n2331P248l18124L88913j43904
16314I15459K65972j42052J41526l5708L9844m67058K1777N13034k93883K630
16304I61541J54982j73784j13345J05508p170P7805m29550L66869M60425k79607
16294A123674m88110M51032m29163M53989j27880j53233L3126J0457l41488J36012
$$ y = [1646943, 1098260, 1349400, 1068245, 1428019, 1079674, 1146965, 1016821, 1036496, 1144737, 1069421, 1256009, 1142822, 1418474, 1330015, 996061, 1431589, 858640, 1241306, 1050509, 914335, 867696, 1213795, 969743, 1044717, 1206308, 1274182, 1204433, 1137483, 1207256, 1203320, 841288, 1258040, 1338794, 821550, 732570, 1050204, 819196, 1224844, 1254605, 842431, 933949, 1122351, 1172312, 886962, 1078172, 1003416, 1033657, 981326, 988574, 670450, 1059363, 915459, 1181431, 1039379, 1180905, 1145197, 1185041, 717983, 739760, 1252794, 958911, 961541, 1116523, 942739, 829394, 934902, 927732, 1005537, 575987, 942856, 1403281, 1123674, 635564, 1086596, 657433, 1111422, 983542, 830309, 863435, 873892, 532404, 668416]
16284F68416O0612j30227J93063N3545j76465j3314J79248q3011q1734K82144
16274I52277l93579K35092n7139K8742J74605k30041J62940C54790P30505r195
16264A076100m28261R9367j71892L65043j26034k25587M5079r7104j39450J81285
16254E78546M6556K45080C74486J33232J74506J01153j03449M1586j19464j8998
16244E83052J76657k51449J2540L34613j40675N5891j47291K4713k523K9346B75622
16232D51610m3782L97246j25710k62852M08278K9731k89326L921J42600r1474
16222F20242k98672J998P7089K93446p5209k32674L82399j13704L2333l03082
16212C84166N45209l95509J62888j14146N0845B56006O52295B57619J40294P7700
$$ y = [668416, 729028, 598801, 791864, 845409, 668944, 655630, 834878, 751867, 670133, 952277, 558698, 793790, 736651, 765393, 939998, 709957, 872897, 354790, 1085295, 1076100, 647839, 747206, 575314, 940357, 814323, 588736, 633815, 536711, 397261, 578546, 625102, 870182, 374486, 507718, 682224, 783377, 679928, 721514, 602050, 583052, 759709, 508260, 520800, 855413, 714738, 770629, 623338, 648051, 645528, 674874, 275622, 451610, 407828, 805074, 679364, 416512, 824790, 854521, 565195, 569116, 711716, 620242, 321570, 323568, 400657, 694103, 618894, 386220, 768619, 654915, 687248, 384166, 929375, 533866, 696754, 582608, 633453, 256006, 908301, 257619, 397913, 475613]
16202D75613A14038N7577L99049j27554Q1997M8559k57161K09442K8345j53914
16192D00378Q9959l3565l6061K19131k38651K58236M1468k55121K93065k94523
16182D44316H4752O43668l60606L29618n5386j59850r0252l6626j0232j34202
16172B10884J3136K48166A29062M87653j75586A19806N43346j45980q7906D5345
16161C16344R7139K33034B91825J37408j22257J67348j9143L1814j49466j06096
16151B31433J93167j21029k0729L0032j15593R8361J44379L9356K68903j14326
16141F33954j47387j35183L8909Q8773K35287A17301J87079L1921A48080L22818
16131D70898J326j95476K10558B43335K39228B35072J84927k03424J17614j30806
$$ y = [475613, 114038, 171615, 570664, 443110, 525107, 573666, 316505, 525947, 554292, 400378, 490337, 456772, 420711, 639842, 401191, 659427, 700895, 445774, 738839, 444316, 84752, 728420, 367814, 697432, 642046, 482196, 391944, 355318, 345086, 210884, 224020, 472186, 129062, 616715, 441129, 119806, 663152, 517172, 429266, 45345, 316344, 413483, 646517, 291825, 429233, 306976, 474324, 455181, 486995, 337529, 231433, 424600, 303571, 282842, 312874, 197281, 295642, 440021, 479377, 748280, 633954, 486567, 351384, 390293, 479066, 714353, 117301, 304380, 336301, 148080, 470898, 472224, 276748, 487306, 243335, 482563, 235072, 419999, 216575, 334189, 203383]
16121B03383J01282n0627O6685o588K23139j81562m9946J04717F2242N27338d3091
16109C81578K24262N5367B20646H0363q071K38596j16087P7586k709L7997m6745
16098B60930J96595M837H9481J35409N657j1717J94224j80280J06773L0148J13874
16087D83569m1140A35928J63730F3987N31487j76911J69812B10374k9470J76813
16077C57717a02381B8787L19103j12651J2268F1411K7401L11280I2337Q3635J50527
16066C26499H9474J77175P0616J6593M4704r2576M4782j14982K6871M2226D2764
16054C09003R5348N0221j2768A14603D7100K74012b45130B51501N4556A07141
16043D86351A66011C0068K02590J51189j72143D251J61551a62812I1016g3940
$$ y = [203383, 304665, 254038, 320723, 314135, 537274, 355712, 305766, 410483, 62242, 589580, -43091, 381578, 605840, 661207, 220646, 80363, 72292, 310888, 194801, 272387, 269678, 307675, 260930, 457525, 462362, 89481, 224890, 230547, 218830, 413054, 232774, 339547, 369695, 483569, 442429, 135928, 299658, 63987, 595474, 418563, 588375, 210374, 180904, 357717, -102381, 28787, 347890, 235239, 247507, 61411, 88812, 400092, 92337, 175972, 326499, 89474, 266649, 337265, 353858, 398562, 305986, 350768, 235786, 262657, 304883, 42764, 309003, 404351, 454572, 441804, 114603, 47100, 321112, -245130, 251501, 306057, 107141, 486351, 166011, 30068, 232658, 383847, 211704, 4251, 165802, -162812, 91016, -73940]
16032F8941K55741L3352j40331n2608L6967H5386e1138d768B64340R037e9096
16020D35710j65371b42267B8522a35577e8799j73820A18344n1152L44161a42503
16009A99723E3909K15143a81744F1984b262B04480l6203D1333j1757M6100J80917
15998B56593F1420b9019A71814O1484J40115r1018m0504G7546J80804L16373K11175
15987G85898L02736l02679k22442J83482n9445h581C01319j42750L1999p0435
15977A20133D3685b30200a6874B46326E340b2654I80a44579C8043R0457E7245
15965B16116P6105c3428B07375h7998k1571A72560K82708c79869A94404B3144
15954C57010b2854B8346b04247B29617A11886C1297K30498i5659c6396k34321
$$ y = [68941, 324682, 358034, 217703, 165095, 202062, 85386, -51138, -4768, 264340, 273377, -59096, 435710, 270339, -242267, 28522, -135577, -58799, -232619, 118344, 67192, 411353, -142503, 199723, 53909, 269052, -181744, 61984, -2262, 204480, 168277, 41333, 29576, 75676, 256593, 61420, -29019, 171814, 233298, 373413, 282395, 241891, 77546, 258350, 574723, 785898, 1088634, 785955, 563513, 746995, 687550, -8581, 301319, 158569, 190568, 120133, 43685, -230200, -16874, 246326, 5340, -22654, 980, -144579, 38043, 128500, 57245, 216116, 292221, -33428, 207375, -87998, -109569, 172560, 455268, -379869, 194404, 23144, 357010, -22854, 28346, -204247, 229617, 111886, 31297, 261795, -95659, -36396, -270717]
15944b70717A48753a44743A57154K81771D3321i9503F1689f2580B34032G8026
15933a76637D4193a87842A69421k7605F6743B7800M1292K48614i0429L1274j1097
15922g0252j66739a0600n9564r0377A44531j8012j0600J76303n888A3969J80808
15911A94777h6127a4786I4048J17641N3553A30300L5774K48411A57352q315Q5116
15900B34153J9554J36084e035l6962A8276K70840H7868L12862a77444d8754F8467
15888A71510K6040d9996C0160a10006C9418J79135c3110q480A08471a01126K4929
15877g6197B83644a43081O3831A96047j4443J9978a13781G3059c1567C6069O0674
15866I6743g0345J8294j81713d1448n1798C11953a78138A65182J735o3066J02161
$$ y = [-270717, 148753, -144743, 157154, 438925, 43321, -99503, 61689, -62580, 234032, 78026, -176637, 44193, -187842, 169421, 141816, 66743, 27800, 69092, 317706, -90429, -59155, -70252, -236991, -10600, -70164, -160541, 144531, 126519, 115919, 292222, 286334, 13969, 194777, -86127, -14786, 94048, 211689, 265242, 130300, 166074, 414485, 157352, 149037, 234153, 253707, 389791, -5035, -41997, 18276, 289116, 87868, 400730, -177444, -48754, 68467, 171510, 197550, -49996, 30160, -110006, 39418, 218553, -33110, -41590, 108471, -101126, -76197, 283644, -143081, -79250, 196047, 181604, 201582, -113781, 73059, -31567, 36069, 96743, -70345, -52051, -233764, -41448, -93246, 311953, -178138, 165182, 166917, 103851, 206012]
15855B06012m0523D2607A4312a16376I0171b2028N621A7604K57057b94332A58412
15843e5614F8013K94368g8871A32428h7338a1273E8029k2587l831a27691e0572
15831c4414H2334K3323a68300h033j07832j3061L5511B41326r1599Q0034g9057
15819D473c2889n3529j06734A09367a42342G5784b60630A91466d8123J1327k82885
15808c19681a36841a3092k16599R3561A75926m5595K84514g739A81556e0211A46494
15796b20491A47990l7597a97949B84457c0695l15380d4641k8197J6625I3659J60753
15785B54412g5117H4973J12384a70317Q43E4289c3850q6035B71841B6325J18239
15774A44564b38593K5216A02996c2686C6799a11030A65496c11856j0016B37009
$$ y = [206012, 165489, 42607, 14312, -116376, 90171, -22028, -16407, 17604, 274661, -294332, 158412, -55614, 68013, 362381, -78871, 132428, -87338, -11273, 58029, 35442, 31611, -127691, -50572, -34414, 82334, 105657, -168300, -8033, -115865, -128926, -93415, 241326, 149727, 229761, -79057, 4473, -32889, -86418, -193152, 109367, -142342, 75784, -260630, 191466, -48123, -36796, -319681, -136841, -13092, -229691, -136130, 175926, 130331, 414845, -7739, 181556, -50211, 146494, -220491, 147990, 110393, -197949, 284457, -30695, -346075, -44641, -72838, -56213, 93659, 254412, -75117, 84973, 197357, -170317, -169474, 54289, -33850, -119885, 271841, 26325, 144564, -238593, -213377, 102996, -32686, 36799, -111030, 165496, -311856, -321872, 237009]
15763a93855B47355h3551A64896J0288c0500k13599a0401G1358K82699A29195
15752C83557F2550O5877C5791a36093A2042g3920C34784J2172p2634k3183o931
15741B44208h8581j29967k3815A6347M8546a53966H9984D1738d1048D1688b27150
15729c8017C3346M1979J74160G1388m901b534n4674j06703a5671B17803j1544
15718B06259b6526l8092j9835k11756d7408k48567I882O2989J605g2254j5828
15707h8082j87052B75309H5651f4219B03376f4069A47236D8206A3057a03512C2538
15695A30955n5057M8746i2997G652O9369R0663q3087J14157a6040a765B05237
15683b6772j18845I9079B0371b9798A09323a72651j81740A02427N2236e0965k8589
$$ y = [-193855, 247355, -83551, 164896, 175184, -30500, -244099, -10401, 71358, 354057, 129195, 383557, 62550, 128427, 35791, -136093, 12042, -73920, 334784, 346956, 274322, 251139, 244208, -88581, -218548, -242363, 16347, 64893, -153966, 89984, 41738, -41048, 41688, -227150, -38017, 33346, 75325, 249485, 71388, 66487, -2534, -57208, -163911, -15671, 217803, 206259, -26526, -64618, -84453, -296209, -47408, -295975, 9882, 72871, 74476, -72254, -88082, -275134, 275309, 85651, -64219, 203376, -64069, 147236, 48206, 13057, -103512, 32538, 130955, 75898, 124644, -92997, 7652, 77021, 167684, 84597, 198754, -16040, -1765, 205237, -26772, -145617, 99079, 20371, -29798, 109323, -172651, -354391, 102427, 154663, -50965, -79554]
15672g9554j24293C35015d83183a64148A55975j9258J44672F373i14j6185A4340
15660c30200a13948I8090b5529A22411c44735I7315e5448A17481a81093Q9355
15650i1738p9425N5672C27987b17710A69147a82991c9436o9751j87287f2982k7052
15639i0034q1481E9059e3586C4702a76895c326q283B29967i9289B31144j04228
15628A26916b702o9543A70240E5292d8728C8516d09166g6089A37689k193a98311
15616C2893c36716e5464j9017G7625b5197k05606H945a05979O629j27044e2276
15604A04724a56162k11557c6673f307l60206I1770P7145p9239A2228b85376A17397
15592C2210K76073c42085F1145A961g9652l1407A81446a16282C5144K40558a79868
$$ y = [-79554, -203847, 335015, -483183, -164148, 155975, 136717, 281389, 6373, -914, -17099, 14340, -330200, -113948, 98090, -25529, 122411, -344735, 97315, -55448, 117481, -181093, -91738, -171163, -115491, 327987, -217710, 169147, -182991, -39436, -109187, -296474, -62982, -90034, -171515, 59059, -53586, 34702, -176895, -3326, -11609, 229967, -99289, 231144, 126916, -2702, -72245, 170240, 55292, -48728, 38516, -409166, -76089, 137689, 135496, -198311, 32893, -336716, -55464, -74481, 77625, -25197, -230803, 8945, -105979, -99350, -226394, -52276, 104724, -156162, -367719, -36673, -6307, -366513, 91770, 168915, 89676, 12228, -285376, 117397, 32210, 308283, -342085, 61145, 1961, -79652, -111059, 181446, -116282, 35144, 275702, -179868]
15580A95351c15145B43848q5921B409c8006A64567d00368F3988d7736j85240j53238
15569c86214B00659E5082h7803b7383C81139C7498P4906g3440C3830j2731e6837
15557c8499C3933b23988B29695d5240A8237L5998a70017q71A49054a77886d5534
15545a59288j76784e2374B0909a3428B11818A8324o86L14845A7665a82709e4377
15533a13397c9285A03838d2082j65287K3310I3958O3382J15812f9288R671k71616
15522c31233A77598g8115A95839J53185g9388C33147a14827A37069G59Q6638b47977
15510a73197A59731a84478A68658p1347j3957K31439e3829q5119L635B19586a47338
15498a97643A31742g9984b0076B00166B7608J26365g5798l1140F3051b43307O9635
$$ y = [195351, -315145, 243848, 157927, 2409, -38006, 164567, -400368, 63988, -47736, -232976, -386214, 200659, 55082, -87803, -27383, 381139, 37498, 112404, -73440, 33830, 21099, -56837, -38499, 33933, -223988, 229695, -45240, 18237, 54235, -170017, -170888, 149054, -177886, -45534, -159288, -336072, -52374, 20909, -13428, 211818, 18324, 17638, 332483, 17665, -182709, -54377, -113397, -39285, 103838, -42082, -207369, -184059, 93958, 157340, 273152, -69288, -59617, -331233, 177598, -78115, 195839, 349024, -79388, 333147, -114827, 137069, 759, 87397, -247977, -173197, 159731, -184478, 168658, 97311, 83354, 314793, -53829, -138948, -135313, 219586, -147338, -197643, 131742, -79984, -20076, 200166, 27608, 153973, -75798, -106938, 63051, -243307, -173672]
15487a73672A6045g1536B29821a14182e050A28968F787J44308g0641B02686R6177
15476B98863A43450J67161e10D31200B11289F1100A2469a35691B74239j5273a10010
15464b1073d020l6541o2638K6712F6677A1318g6813a8249A33921j0431E1010i2305
15451A08049g6350C84180E0716a49295f4359A10714J67629H1912L58358Q3430
15441E23700K11742H8458J77256R7044n4773j32603f0951A42934f3746p1650G43
15429b94413B07260b58188C00771D5239J39349f5060F7911O8186M678E1837J37136
15418A88973j2831E2152A6194l601K59445r2382a24718d4756P731B7411G385J59403
15406A66788p7500L9229b46818a00019C14043a80502D9912J84724b34311a06688
$$ y = [-173672, 16045, -71536, 229821, -114182, -5050, 128968, 6787, 151095, -70641, 202686, 298863, 143450, 310611, -510, 431200, 211289, 61100, 12469, -135691, 274239, 258966, -110010, -21073, -4020, -40561, -103199, -76487, 66677, 11318, -76813, -18249, 133921, 123490, 51010, -92305, 108049, -76350, 384180, 50716, -149295, -64359, 110714, 278343, 81912, 440270, 523700, 735442, 88458, 265714, 362758, 307985, 175382, -60951, 142934, -63746, -135396, 743, -294413, 207260, -258188, 300771, 45239, 184588, -65060, 67911, 136097, 140775, 51837, 188973, 176142, 52152, 16194, 12593, 272038, 179656, -124718, -44756, -37025, 27411, 7385, 166788, 89288, 128517, -246818, -100019, 314043, -180502, 49912, 234636, -234311, -106688]
15395B4435O7672a3713I224R2972C0569J37376l8699J2390m6775k5469K6809J50805
15383B47006A04915Q6360a65059g6703A24966P2464h3846D0392G503K60421h4197
15371A46123N0871N6989P3578J1993f8080I9009N5583E0416f8482A63597j6801
15360A46796B0166J57121a35700B53557a92820i3544C59132A24382a80864L4401
15350a46463G7377N5129e72B27263G2454k2167P6334l3134J67619o2447D9409
15338c26706A48535c8276j99856a2537j60285m31A25063L04352A90352J71744
15328C62096j50052g0372G1915M6995J1129J50165a28598A07254q653J64940a65299
15316C46007p5059p9485Q471h5025K4073B57615a20269A17107n3826J66815e0370
$$ y = [24435, 92107, -13713, 9224, 102196, 30569, 167945, 129246, 141636, 94861, 69392, 96201, 247006, 104915, 191275, -165059, -76703, 124966, 197430, -83846, 40392, 7503, 267924, -84197, 146123, 196994, 253983, 327561, 339554, -68080, 99009, 154592, 50416, -68482, 163597, 146796, 20166, 177287, -135700, 253557, -192820, -93544, 359132, 124382, -180864, -146463, 77377, 132506, -572, 227263, 72454, 50287, 126621, 93487, 261106, 198659, 49409, -326706, 148535, -38276, -238132, -12537, -172822, -173253, 125063, 429415, 190352, 362096, 212044, -70372, 71915, 118910, 130039, 280204, -128598, 107254, 98601, 263541, -165299, 346007, 270948, 191463, 199934, -85025, -60952, 257615, -120269, 117107, 63281, 230096, -50370]
15304C39644F9163J06540e6014B96205B5006i2804A08066O0175B6383M818g986
15292B63625g6002A29072D5338b62112N7819F1334B2941d0251K258m6088G2065
15280C1885c7571j63702a037C9836a8814B89769j32135F1891J74405a83311A13266
15268H7156b37812a00165K9855q8988J2398B67339a9186I8136L27617I5737h5770
15256D542K45748c23214A95002m5070O8712H868M09175L30682P65720K86691m50973
15245A350163O53031q28351A24246C1616L66391a3669m5873j60649g4419E4689
15234I5131J68828J75919c2290n9528B69205a10326B94434D6010j8896b52593
15223A00404N9790a67412A58421a26039c8005A2737a94452B38882F5859A5153
$$ y = [339644, 69163, 175703, -56014, 296205, 25006, -92804, 108066, 168241, 26383, 31201, -7986, 263625, -76002, 129072, 45338, -262112, -204293, 61334, 22941, -40251, -37993, -84081, 72065, 31885, -37571, -201273, -1037, 39836, -18814, 289769, 157634, 61891, 236296, -183311, 113266, 87156, -237812, -100165, -70310, -159298, -146900, 267339, -19186, 98136, 425753, 95737, -85770, 4542, 250290, -323214, 195002, 149932, 218644, 8868, 418043, 748725, 1514445, 1801136, 1350163, 2003194, 1174843, 124246, 31616, 398007, -13669, -59542, -220191, -74419, 54689, 95131, 263959, 439878, -32290, -91818, 269205, -110326, 294434, 46010, 27114, -252593, 100404, 160194, -167412, 158421, -126039, -38005, 12737, -194452, 238882, 65859, 15153]
15212A25302K9526g9636B14409D7064H320a14761A87456o7344a17013A34247h8386
15200b03286A13075e6157B09730J16118I2899J55744i5429G8846a053B64763G3756
15188b11731E720a92448A84059f1070j56450A69420k6150J19264c2593j45625
15178a78218j32504H7940j4872k7852p162H726J065L5797K09967J1082j14588
15167A52049e4850j7388B70353b52379A27638J01679I6271J43467A10188l6372
15157G3816K29010A37946J30639A00324J00181a47988A57716J33343i4857p1133
15147a65990B8118J11543K32670G1615A7110N1762M3532O9177b25621q487A79287
15135b70360B86717H0900L3205b2412C42207j41233F3874j2617J95025j15672
$$ y = [125302, 154828, -79636, 214409, 47064, 8320, -114761, 187456, 120112, -117013, 134247, -88386, -203286, 113075, -56157, 209730, 325848, 92899, 248643, -95429, 78846, -1053, 264763, 73756, -211731, 5720, -192448, 184059, -61070, -217520, 169420, 143270, 262534, -32593, -178218, -310722, 87940, 73068, 45216, 38054, 8726, 9791, 45588, 255555, 266637, 152049, -54850, -72238, 270353, -252379, 127638, 229317, 96271, 239738, 110188, 73816, 302826, 137946, 268585, 100324, 200505, -147988, 157716, 291059, -94857, -165990, 28118, 139661, 372331, 71615, 17110, 68872, 112404, 181581, -225621, -234108, 179287, -270360, 286717, 80900, 114105, -22412, 342207, 200974, 63874, 51257, 246282, 130610]
15125A30610a2758A58356g3431H5235a39040A48063m9285h0551A61289Q4444j16473
15114A29260J33080j25959O5087I7189c30036C39035M9808A77291L01921A30156
15103g8216A2197J06664C9484R3485h0011A22508J65076b8757j08099B62927h0088
15091B11873r1589k0963L58077b00939D32817r0452j47244H5237b09488B51290
15080A8669c6814B97441f9247J4987K3377A83656P5778e2716B87145K36719F7242
15068D01582B8503J06812J53703P842D9370K14015H0548g4123B05396m6445J85964
15057C44915j04297M3554G4576K14989F8415k3620J72997C2462J39770J59466
15047C31698I1392h8987B31768j1919n4480F5547N22222k47044q9708J77613A36695
$$ y = [130610, -12758, 158356, -73431, 85235, -139040, 148063, 98778, -80551, 161289, 245733, 129260, 262340, 136381, 201468, 97189, -330036, 339035, 388843, 177291, 479212, 130156, -78216, 12197, 118861, 39484, 132969, -80011, 122508, 287584, -28757, -136856, 262927, -80088, 211873, 120284, 99321, 457398, -200939, 432817, 342365, 195121, 85237, -209488, 251290, 18669, -36814, 297441, -69247, -54260, -30883, 183656, 259434, -52716, 287145, 523864, 67242, 401582, 28503, 135315, 289018, 296860, 49370, 263385, 80548, -74123, 205396, 158951, 344915, 240618, 284172, 74576, 289565, 68415, 44795, 217792, 32462, 172232, 331698, 91392, -88987, 231768, 219849, 165369, 65547, 587769, 340725, 251017, 428630, 136695]
15035E8855J0037L84684a07788B06899L10c0186D62373B04680J50342K01370k9918
15024E26474A88537q5538L86751p8358j2440j39183K94423k31140K09206B28321
15013B16383J6397M10460B74451j20456M4938M39761k76367r8085M7132L73121
15003F84495l34576q9677J24152A15922a01634D84529k33083J84197j0409k12464
14993B12770K42064k2165n9516l3253j30391L3009q3808L32076Q0823j49215D8900
14981B26990j2345K50558K14287L0740j79411J07579B38162K38443l3795A38346
14970E51493j60099m5328p8836Q0498L17141l30087K53665B37031L66036A65025
14959B12122C8819K11058M98879B25151r9874L96069k47541J00130a4442E12160
$$ y = [58855, 68892, 453576, -107788, 206899, 207209, -30186, 462373, 204680, 355022, 556392, 526474, 188537, 102999, 489750, 411392, 398952, 259769, 554192, 323052, 532258, 228321, 216383, 232780, 643240, 274451, 153995, 198933, 638694, 362327, 264242, 311374, 684495, 349919, 260242, 384394, 115922, -101634, 484529, 251446, 435643, 425234, 212770, 454834, 432669, 373153, 339900, 209509, 242518, 158710, 490786, 571609, 422394, 48900, 226990, 214645, 465203, 679490, 710230, 530819, 638398, 238162, 476605, 442810, 138346, 551493, 391394, 346066, 267230, 347728, 664869, 334782, 588447, 237031, 603067, 165025, 212122, 38819, 249877, 748756, 225151, 125277, 521346, 273805, 373935, -14442, 512160]
14948C12687Q7188O7678j38322O6750K55113j98175k21192J50821m2473j65058
14938A75017n037L9150L18121k14021D1837N05853J74450k5082M7817P0026j84199
14927F30702N64353m51245J02318n3570p2372k46538K56237K10827m7122M14113
14917A307703j27437J5295m98691K76068k69013K46333B73294J56489J98962m7264
14907E81481k76307N1000M57319B45093J05467R8912J36057B79144A12151L46806
14897D58957J07382k80664j7505K24918p260j50261n7662M0590K93266K2530l00739
14886C33552K77075q0641l0582j10933M4395K63947C16284K72059K74002l11040
14876E51305J68587k6404l16880j76873L85130G9438L97010B06975K62549j26725
$$ y = [312687, 399875, 467553, 329231, 395981, 651094, 452919, 231727, 382548, 340075, 175017, 169980, 209130, 527251, 313230, 41837, 547690, 722140, 697058, 744875, 814901, 630702, 1195055, 743810, 846128, 792558, 720186, 473648, 729885, 940712, 893590, 1307703, 1180266, 1195561, 696870, 972938, 703925, 950258, 273294, 429783, 628745, 581481, 305174, 356174, 813493, 245093, 350560, 449472, 585529, 279144, 112151, 458957, 566339, 285675, 268170, 493088, 485828, 335567, 277905, 318495, 611761, 634291, 333552, 610627, 529986, 499404, 388471, 432866, 696813, 316284, 588343, 862345, 551305, 719892, 693488, 376608, 199735, 584865, 79438, 476448, 206975, 469524, 342799]
14866C42799L73766l30146J34864k22082L2466L75401o9688C03011j00868J82470
14856C84613j23589L19000k26629J50897l7321A09698J90036J76591J7413o6840
14846D26898K61417k23763J28444J34770k54323K22540K48640C51932M25646j79379
14836E98199J78180l53935j01815L35847I3246L72927l8795J19659j35791m5255
14826C65991P7395L3502j10525P4104r7437o7377L41227k84221J64511j73950
14816C23220Q42R0443j54806K11643J75119j42400q6028L08896l50230J08454
14806D85153K76971k52644R4929q124J69935J1553M1224A51197M97148Q333O3108
14795G19786r3904k3212K34671j63313o1217B66856Q502L86006j27558k1736R3938
$$ y = [342799, 716565, 386419, 521283, 299201, 331667, 707068, 637380, 303011, 202143, 384613, 261024, 580024, 353395, 504292, 466971, 109698, 299734, 476325, 493738, 426898, 688315, 464552, 592996, 727766, 473443, 695983, 944623, 351932, 777578, 598199, 776379, 422444, 320629, 656476, 93246, 466173, 427378, 547037, 411246, 365991, 443386, 476888, 366363, 440467, 343030, 275653, 616880, 332659, 497170, 323220, 324062, 414505, 259699, 471342, 646461, 504061, 418033, 726929, 376699, 485153, 762124, 509480, 604409, 596285, 766220, 777773, 818997, 151197, 648345, 656678, 719786, 625882, 602670, 837341, 674028, 612811, 266856, 275358, 661364, 533806, 512070, 606008]
14784F06008J950B79827J1215J36777O969J4934J37143j03773J4033R8090j1388
14773E83827m0993m471M0810j78196O4626n9176P0442P6384J23710k9554J21089
14762G68498C79282L63587l08062K74968k23857J0672j17903k0701P0085K62915
14752F90986j67891q0259Q4115J43433l0312m2159K53774l16744k4086N8426P3730
14741F43013k38255R675K7682Q0881M22956r5953o5198M4803j45571J1606J12528
14730H08167j51603j03580K31934k35k0086L57900L4434o8324J57079J2217j8516
14719A239387Q0582k67524k2799l36510J15603r3784P0254J63674j93727R6282
14709H51438m9952K36462j02449k87667K31311n1923L098l44082M07637l6191
$$ y = [606008, 607958, 279827, 291042, 427819, 434788, 449722, 586865, 483092, 497125, 595215, 583827, 542834, 538363, 579173, 400977, 465603, 406427, 476869, 553253, 676963, 647409, 768498, 379282, 742869, 434807, 709775, 485918, 496590, 378687, 357986, 428071, 690986, 523095, 442836, 526951, 670384, 640072, 597913, 851687, 534943, 510857, 569283, 643013, 404758, 414433, 442115, 522996, 945952, 849999, 784801, 829604, 684033, 695639, 808167, 656564, 552984, 784918, 784683, 764597, 1122497, 1156931, 1088607, 1245686, 1257903, 1239387, 1319969, 1052445, 1029646, 693136, 808739, 714955, 785209, 948883, 755156, 851438, 801486, 1037948, 935499, 647832, 879143, 827220, 830318, 486236, 893873, 857682]
14699H57682N9840J79803O3418J35849l30204j27724M99500j88943k31941j50726
14689G66554P2429L3078k91576L30461K18997k51363j8147J60902r7878j89967
14679G33490L84857k72006p717J54971j33051J63400N897j46642k62885K51838
14669H72152J31928m05345N55920l74236K83251j23235j92036p9622q4594L29026
14659I13209j10511K36072j25597J08522k75608L48122r5679n2916J25422J05798
14649A176834l14923L41590J50955p0311m9570k2572q4163P4502R560J17235k36052
14638A093085N9681j10516j06520P0805J23441l1045L54651j70619k31203j49209
14628I02551J97319r8939M14988j84444M21343m20742j10923R8277L69397p8709
$$ y = [857682, 917522, 1097325, 1160743, 1296592, 966388, 838664, 1338164, 1149221, 917280, 766554, 838983, 872061, 580485, 910946, 1129943, 878580, 860433, 1021335, 923457, 733490, 1118347, 846341, 838624, 993595, 860544, 1023944, 1029841, 883199, 620314, 872152, 1004080, 598735, 1154655, 780419, 1063670, 940435, 748399, 668777, 584183, 913209, 802698, 1038770, 913173, 1021695, 746087, 1094209, 998530, 945614, 1071036, 1176834, 861911, 1203501, 1354456, 1284145, 1234575, 1212003, 1127840, 1202342, 1211902, 1329137, 1093085, 1152766, 1042250, 935730, 1006535, 1129976, 1098931, 1453582, 1282963, 1051760, 902551, 1099870, 1000931, 1415919, 1231475, 1652818, 1232076, 1121153, 1219430, 1588827, 1510118]
14618A510118j82706K12613J21172j01676J26857m80063J68044l29938J40875
14609A185296P7651j58573J01953L441O325K6094J67064l49159J04796M25878
14599A590766l24727L60247j10397O5336l06048M26775J36362k81056R5243q9054
14589A563447J14115J96705m80378K05256M0991K09609n8005k94104J83406k09810
14579A471232L61750K2666j38423R2376J45770j39856K00653l5887k7012j29494
14569A823775J97215J09862J0584K07211P9350l78479l3271K72753n4006O37172
14559B872166j36942M1034j94738M77310J81608n3856K89801L48976P50209R11116
14549E486684K508660L991959R524863J5181596n14158j7385429q109772E137864
$$ y = [1510118, 1327412, 1540025, 1661197, 1559521, 1686378, 1206315, 1374359, 1044421, 1185296, 1262947, 1104374, 1206327, 1209768, 1216093, 1242187, 1409251, 1060092, 1164888, 1590766, 1266039, 1626286, 1515889, 1581225, 1275177, 1701952, 1838314, 1557258, 1652501, 1563447, 1677562, 1874267, 1393889, 1599145, 1640136, 1849745, 1791740, 1497636, 1681042, 1471232, 1832982, 1855648, 1717225, 1809601, 1955371, 1815515, 2016168, 1980281, 1953269, 1823775, 2020990, 2130852, 2141436, 2348647, 2427997, 2049518, 2016247, 2289000, 2234994, 2872166, 2735224, 2776258, 2581520, 3058830, 3240438, 3186582, 3476383, 3825359, 4575568, 5486684, 7995344, 11987303, 21512166, 36693762, 36179604, 18794175, 10684403, 5137864]
14540C053728q01997m23012J06856M0432j69454J16386j30324M0131L8765N6210
14530A927721k68240K78213K87994k95604L14579m84480K97952J80165K69294
14521B507594m21476K6097K21142j45326J35562j53523j05346K56441j55997K54585
14511B419753j91606K14028Q8771Q9563M8629j80560L46338k66487n0482k18862
14501B299085M56254M32589k19836J91088j96423J81906k92906Q8413p7678L08288
14491C170780r021J79055j38547j92901L63056k87495L99065r9711L8180K99647
14481C722108k37429K87985j89335j37041L58478k45511k3777J32248M9718L75873
14471D093317j1423j10253j95317j5394O6595N25520j64100j08656J48671j21438
$$ y = [3053728, 2251731, 1828719, 1935575, 1976007, 1806553, 1922939, 1792615, 1832746, 1871511, 1927721, 1659481, 1937694, 2225688, 1930084, 2244663, 1760183, 2058135, 2238300, 2507594, 2086118, 2112215, 2333357, 2188031, 2323593, 2170070, 2064724, 2321165, 2165168, 2419753, 2228147, 2442175, 2530946, 2620509, 2669138, 2488578, 2834916, 2568429, 2517947, 2299085, 2755339, 3187928, 2968092, 3159180, 2962757, 3144663, 2851757, 2940170, 2862492, 3170780, 3161759, 3340814, 3202267, 3009366, 3372422, 3084927, 3483992, 3384281, 3422461, 3722108, 3484679, 3772664, 3583329, 3446288, 3804766, 3559255, 3535478, 3667726, 3717444, 4093317, 4081894, 3971641, 3776324, 3760930, 3827525, 4353045, 4188945, 4080289, 4228960, 4107522]
14461D107522K78292L35375m8908j97296j50168J24561J81917j80330J61590m6650
14451D565905L33646J88084o2326J38430m8690J60516r889J62997n0401J82041
14441E560313m23573N42383l91840K74728L24810j50503M26162k19953k85446
14432E657081N46160J64028n03655J94129R25737q36586L32716K04263K94402
14423F978275l80191M99096K24328J95135j43484p9314P01930j60304K08559J158
14413H045188J08174j56537K55767L5501J75705Q4559o0857J17286M81443N1453
14403I137682P2010K00629J17340m0420L36941K06789k2518K15545o6589L49674
14393A0507083L14883m5864J92094M18540K72299L40209j37916K79824L88894
$$ y = [4107522, 4385814, 4721189, 4672281, 4474985, 4324817, 4449378, 4631295, 4450965, 4612555, 4565905, 4899551, 5087635, 5025309, 5163739, 5115049, 5275565, 5265676, 5428673, 5378272, 5560313, 5136740, 5679123, 5287283, 5562011, 5886821, 5736318, 6162480, 5942527, 5657081, 6203241, 6367269, 5863614, 6057743, 6983480, 6146894, 6479610, 6683873, 6978275, 6598084, 7097180, 7321508, 7516643, 7373159, 7293845, 7995775, 7835471, 8044030, 8045188, 8153362, 7996825, 8252592, 8288093, 8463798, 8548357, 8487500, 8604786, 9086229, 9137682, 9209692, 9410321, 9527661, 9487241, 9824182, 10030971, 10008453, 10223998, 10157409, 10507083, 10821966, 10776102, 10968196, 11386736, 11659035, 11999244, 11861328, 12141152, 12530046]
14384A2530046J88628J24333M69429K44442o0521J60330m5090Q30160J09467K85038
14374A4836262L47985K57287K64765L61328J83352L86825N14580M21493O0477
14365A7634354N41827M20984L6271P20713O36890J09478N04136K57399J190882
14356B2052934j37857R06785K33148O67813M99794M41466N67807L99760J270140
14347B6901790M29332N67367P00193J137192P25435O87736P57621J048045R46784
14338C3901495M63343J523315R24402Q92795J121459J401924J190431J048694
14330D2467858J487667J671929J295897J344759J526260J745974J815135J913531
14322E5269010J746309K178691J920662J943044K350060K509981K604402K876562
$$ y = [12530046, 12718674, 12843007, 13312436, 13556878, 13496357, 13656687, 13611597, 14441757, 14551224, 14836262, 15184247, 15441534, 15706299, 16067627, 16250979, 16637804, 17152384, 17573877, 17634354, 18176181, 18597165, 18633436, 19354149, 19991039, 20100517, 20604653, 20862052, 22052934, 21915077, 22821862, 23055010, 23722823, 24222617, 24664083, 25231890, 25631650, 26901790, 27331122, 27898489, 28598682, 29735874, 30461309, 31149045, 31906666, 32954711, 33901495, 34364838, 35888153, 36812555, 37705350, 38826809, 40228733, 41419164, 42467858, 43955525, 45627454, 46923351, 48268110, 49794370, 51540344, 53355479, 55269010, 57015319, 59194010, 61114672, 63057716, 65407776, 67917757, 70522159, 73398721]
14314G3398721K714339K855364L853092K789305L706360L951992L852331M173361
14306A01294865M457585M826274M817144N595327N887707N775886O481387O726274
14298A45862449O907300P807655Q025046Q716698R390522R371652J0045905J0777390
14290B16904617J1279978J1672197J2457807J2545755J3252643J3581809J4173135
14283C05867941J3928333J4334075J4045954J4158651J3780540J2805920J2076932
14276D00998346J1135458R502755P749043M569890J298863m01418n72849k467643
14268D31812445m462104l968789n989091r557027j0666803j2363398j3343218
14261C71462015j4326055j5051418j4653625j5272532j4741739j4491332j4128574
$$ y = [73398721, 76113060, 78968424, 82821516, 85610821, 89317181, 93269173, 97121504, 101294865, 105752450, 110578724, 115395868, 120991195, 126878902, 132654788, 139136175, 145862449, 152769749, 160577404, 168602450, 177319148, 186709670, 196081322, 206127227, 216904617, 228184595, 239856792, 252314599, 264860354, 278112997, 291694806, 305867941, 319796274, 334130349, 348176303, 362334954, 376115494, 388921414, 400998346, 412133804, 421636559, 429385602, 433955492, 435254355, 434852937, 434280088, 431812445, 427350341, 423381552, 417392461, 407835434, 397168631, 384805233, 371462015, 357135960, 342084542, 327430917, 312158385, 297416646, 282925314, 268796740]
14254B68796740j2982125j1754770j2424516j1851966j1075004j0475838j0138295
14247A88094226r511759q408615q177805p555936p578026o993815o568573o145568
14239A27154129n617558n174425m938887n170349m509610m305404l933323l982955
14231H9521618l077393l541956l554382l107736k639759l165401k664608k312679
14223F5457704k417407k095393j937513j946881k193492k052237j850630j286121
14215D9678030j848312j349610j179704j555868j342737j297751j422113n52041
14207C9129894r99699j074053j160558j286524p68375j075518m99474o93517j162622
14198C0409554p83660p11229p33681r33706m09645k95921r78865o56066l36099
$$ y = [268796740, 255814615, 244059845, 231635329, 219783363, 208708359, 198232521, 188094226, 178582467, 170173852, 161996047, 154440111, 146862085, 139868270, 133299697, 127154129, 121536571, 116362146, 111423259, 106252910, 101743300, 97437896, 93504573, 89521618, 86444225, 82902269, 79347887, 76240151, 73600392, 70434991, 67770383, 65457704, 63040297, 60944904, 59007391, 57060510, 54867018, 52814781, 50964151, 49678030, 47829718, 46480108, 45300404, 43744536, 42401799, 41104048, 39681935, 39129894, 38130195, 37056142, 35895584, 34609060, 33840685, 32765167, 32265693, 31572176, 30409554, 29625894, 28914665, 28180984, 27247278, 26837633, 26541712, 25562847, 24906781, 24570682]
14189B4570682r68619m49286o56776m14582k09904n91376m15924o62873k63943
14180A9937399o64103k99858l11941n28217l99022m01631j44767j24091m01877
14171A6661892n78390R3185m88440m32335m06381J48716m19501n59638l75698
14162A3643410K1720j68843n76413L8224k05824m36564L2645k33079j72179k68765
14152A1674332N4004m60288j54269j48157j41064j72235k25794k81044j74162
14143I971323L24768p76540K71784k83855l04801o5193j29241K0217n394j59066
14133H864002j70917M0412o70904J57041q6140m23188K99341l47167n54395K31004
14123G339089p2982L09864l37806p2168k19398p6537m3967O8033m75677J42285
$$ y = [24570682, 23602063, 23152777, 22496001, 22081419, 21871515, 21280139, 20864215, 20201342, 19937399, 19273296, 18973438, 18661497, 18133280, 17734258, 17332627, 17187860, 17063769, 16661892, 16083502, 16176687, 15688247, 15255912, 14849531, 14998247, 14578746, 14019108, 13643410, 13665130, 13496287, 12919874, 12958098, 12752274, 12315710, 12348355, 12115276, 11943097, 11674332, 11728336, 11268048, 11113779, 10965622, 10824558, 10652323, 10426529, 10145485, 9971323, 10296091, 9519551, 9791335, 9507480, 9202679, 9137486, 9008245, 9028462, 9023068, 8864002, 8693085, 8733497, 8062593, 8219634, 8133494, 7710306, 8009647, 7662480, 7108085, 7339089, 7266107, 7575971, 7238165, 7165997, 6946599, 6870062, 6826095, 6894128, 6418451, 6560736]
14113F560736j21487K40266j64478r2698n4134n13122K17315J30606k97645k4796
14103E880563k60556j96881K34060j34185l7641L00176l80831j58026J0606J01619
14093E358904k38961J0595k23655l6450K56757n62081L63598l23110J72957l24001
14083D454553L77820j49793q8109k90508M16687o33561J97181j46608r8429r8595
14073C940638L23628N3983k69790k41511K28055q3135j96935J3166K2781R649
14063C800529O7117j34571j0326K42919o0937n16418J83782M3234n55528M53896
14053C513697l360J18301k13363j59273j50693K10790j46816j04127M059Q941
14043C078156K2710J79563k73390M9846j54212O6347j46811O3113K30641j61498
$$ y = [6560736, 6439249, 6679515, 6515037, 6422339, 6368205, 5855083, 6072398, 6203004, 5905359, 5880563, 5620007, 5423126, 5657186, 5523001, 5485360, 5785536, 5404705, 5246679, 5257285, 5358904, 5119943, 5130538, 4906883, 4870433, 5127190, 4565109, 4928707, 4605597, 4778554, 4454553, 4832373, 4682580, 4594471, 4303963, 4720650, 4087089, 4284270, 4137662, 4039233, 3940638, 4264266, 4318249, 4048459, 3806948, 4035003, 3951868, 3754933, 3768099, 3790880, 3800529, 3867646, 3733075, 3722749, 3965668, 3904731, 3388313, 3572095, 3615329, 3059801, 3513697, 3510337, 3628638, 3415275, 3256002, 3105309, 3316099, 3169283, 3065156, 3069215, 3078156, 3100866, 3280429, 3007039, 3056885, 2902673, 2969020, 2822209, 2885322, 3115963, 2954465]
14033B954465M21110m46438k47377K86431l49746M00597k31457j53358K5148m47599
14023B211776M34511k15589j30636J1981K7174j01136R7654n6892K61081j06884
14013B433040q1524K1053l10616Q9076M0634j5926l16898J29767J60953o5505
14003B084054m4849J4025j94040L45205l15977k1040K59215k4506k09855L02067
13993B194299k049K92949M6866K87215R68297K781917O653659J5186699J0496860
13984C8906712j4498169j0921612n379871k433669r77229o56854n73511j10072
13976C355725l00230N5302l49433k68977j77575R4346N1240m3176m0400n0317
13966B326505O3886n61040L31007l3306K2623k20555j3395r5495r633L7133k2111
$$ y = [2954465, 3375575, 2929137, 2681760, 2968191, 2618445, 3019042, 2787585, 2634227, 2659375, 2211776, 2646287, 2430698, 2300062, 2312043, 2339217, 2238081, 2335735, 2278843, 2539924, 2433040, 2351516, 2372569, 2061953, 2151029, 2191663, 2175737, 1858839, 1988606, 2149559, 2084054, 2039205, 2053230, 1859190, 2204395, 1888418, 1867378, 2126593, 2102087, 1892232, 2194299, 2192250, 2485199, 2532065, 2819280, 3787577, 6569494, 13223153, 28409852, 38906712, 24408543, 13486931, 8107060, 5673391, 4696162, 4039308, 3465797, 3355725, 3055495, 3110797, 2761364, 2492387, 2314812, 2409158, 2460398, 2417222, 2376822, 2326505, 2390391, 1829351, 2160358, 2127052, 2149675, 1929120, 1915725, 1820230, 1810597, 1847730, 1825619]
13955A825619j96618J48834j38050L66153j86113J28468R39k73585L21193m28974
13945A567866R7521j63299J08994j27672J94919J17755J06900l85134k05116L99055
13935A711789O9735j58376J68704j69095l138n2027k94536L90299J23399l39326
13925A447428K57744j24640J840j38716J64227p8814j12451L1973j82988K96967
13915A562570k31950k05396K38902l0565K53751k12654J06621O5515j51483K11436
13905A606747l46260j84615J39194Q9070j77888K96457J63152l07591K5054J37958
13895A441278k73219j7889M56576o93694J56087L52354j43350j35271k50798K65877
13885A157951J06490j55139j96412M14180k86285J49644l07212L14680N191k15540
$$ y = [1825619, 1629001, 1777835, 1639785, 2005938, 1819825, 1948293, 1949232, 1675647, 1996840, 1567866, 1665387, 1502088, 1611082, 1483410, 1678329, 1796084, 1902984, 1517850, 1312734, 1711789, 1781524, 1623148, 1791852, 1622757, 1619619, 1567592, 1273056, 1663355, 1786754, 1447428, 1705172, 1580532, 1582372, 1443656, 1607883, 1529069, 1416618, 1448591, 1265603, 1562570, 1330620, 1125224, 1364126, 1333561, 1587312, 1374658, 1481279, 1546794, 1395311, 1606747, 1260487, 1075872, 1215066, 1304136, 1126248, 1422705, 1585857, 1278266, 1303320, 1441278, 1168059, 1150170, 1606746, 913052, 1069139, 1421493, 1278143, 1142872, 892074, 1157951, 1264441, 1109302, 912890, 1327070, 1040785, 1190429, 883217, 1197897, 1203088, 987548]
13875I87548l2773J55260j81480K98226k88764J6867K98881k1313K7105j69240
13865A090317k45237j3257J7142J79063Q1345j33379j67218O1272L37160n50777
13855F56431K40871r9822N18343k01374k95810j28234K57712j15161J59154J76468
13845A168578m84484J55636J38722J20736l11056K70120k59506j56771P4173N85827
13835A301975m65238J86871j52805J93045k49880J23937j67618k77257O43603
13826A136633j53463K5261p3503K1921n7417m3175l8827j10496N2398J93024r2266
13815H60090m7626k35051K0444M02583j13174j9742j16737L8678j21776K74630
13805I42319k21412J73546o0383j73006r4661K77738j78550K44239j3792j08234
$$ y = [987548, 954775, 1110035, 928555, 1226781, 938017, 954884, 1253765, 1232452, 1259557, 1090317, 845080, 831823, 848965, 1028028, 1109373, 975994, 808776, 870048, 1207208, 656431, 897302, 797480, 1315823, 1114449, 818639, 690405, 948117, 832956, 992110, 1168578, 684094, 839730, 978452, 1099188, 788132, 1058252, 798746, 641975, 716148, 1301975, 836737, 1023608, 870803, 1063848, 813968, 937905, 770287, 493030, 1136633, 983170, 1008431, 934928, 956849, 899432, 856257, 817430, 706934, 759332, 952356, 860090, 812464, 577413, 597857, 1000440, 887266, 867524, 750787, 789465, 667689, 942319, 720907, 894453, 834070, 661064, 566403, 844141, 665591, 909830, 896038, 787804]
13795G87804j67675B83253M55340J03841J1290m25846K97856J7024k80505J33533
13785E95786K02846j87529o6385O9107B74097M58898K87229l37696K5249J68590
13775H76367l98850R9608J75032k7768n4196K27052j84902r6238l06260M16248
13765G26093j16414J17095l9558k46446K12931k67752J36210K53923K2808C26288
13754E67631J90046j06303J85767J30388j54628j3933q7651K66289l56434J30435
13744G51607j32458j19416O2595J16114B38273J78375K36473j46237j22986J2393
13734C96291J79322l4605k50637K40537j57560K14703J0358J48402B75286N64947
13724H40233k25448p4775q2559j79738o1498L83616J17073k20649J98349k39570
$$ y = [787804, 620129, 283253, 738593, 842434, 853724, 427878, 725734, 742758, 462253, 595786, 798632, 611103, 544718, 613825, 274097, 732995, 1020224, 682528, 707777, 876367, 477517, 577125, 752157, 724389, 670193, 897245, 712343, 616105, 309845, 726093, 609679, 726774, 687216, 440770, 653701, 385949, 522159, 776082, 798890, 326288, 567631, 757677, 651374, 837141, 967529, 812901, 798968, 711317, 977606, 621172, 751607, 619149, 499733, 562328, 678442, 238273, 416648, 653121, 506884, 383898, 396291, 575613, 541008, 290371, 530908, 373348, 588051, 598409, 746811, 275286, 840233, 614785, 540010, 457451, 277713, 216215, 599831, 716904, 496255, 694604, 455034]
13714D55034J5491n2646P5207J81604p9317Q9450j58797j39994K66568K7996l11928
13703C68668j38938L99234k07272J9733j22472R8711J43617k24551l2593J63050
13693D67187J818K47531p7167j54011j3000K73262J88075k93678k15022N7424
13683D82419k06781J48722o3976K18812J7125k42267K54417k17912j13158K75508
13673E52909j17203K9919R7604j01490j00623K48849k06850O8083j25103K00883
13663E46978B26746J1833J01941r8998K14434j25209K70124j86846k00317K74988
13653D88696k41862J80485A22593N85012j06010j32516a076C6781K57520K63251
13643E57552k49914j7334K68617J28644E1815M16004J48011j06196k8353k27146
$$ y = [455034, 470525, 417879, 493086, 674690, 595373, 684823, 526026, 386032, 652600, 680596, 368668, 229730, 628964, 421692, 441425, 318953, 417664, 561281, 336730, 304137, 467187, 469005, 716536, 639369, 485358, 472358, 745620, 933695, 640017, 424995, 482419, 275638, 424360, 360384, 579196, 596321, 354054, 608471, 390559, 277401, 552909, 435706, 465625, 563229, 461739, 361116, 609965, 403115, 471198, 346095, 546978, 226746, 238579, 340520, 241522, 455956, 330747, 600871, 414025, 213708, 488696, 246834, 427319, 122593, 707605, 601595, 469079, -1076, 36781, 294301, 557552, 307638, 290304, 558921, 687565, 51815, 467819, 615830, 509634, 481281, 254135]
13633B54135Q8365O09J40422j58299J28752k23245L20802q1851o706O17j76998
13622B86603n4954M6533J90256I4517K69824A05052L48231A80515M2616E2564
13611C33686P9L621j51923l5965j8648J10684P0432l3130C0057L34126J46792
13600E10975J2702E7411J18843K49914B05799K58104A40347K77842B06163J12396
13590C18559j06056K06093B02109K05345J56010B72557P7214j94R5660J58432
13580F03669p3671B37820n3395K84130j74693K46725j34499J04245j58067j16473
13570B35793J29431J76741j367l8617B19794B9276K39964B0407L98198O4691B39968
13558B86132L64268B47235K01860j97612m059J39167A48996J80289j51918L46097
$$ y = [254135, 342500, 343109, 483531, 325232, 453984, 230739, 551541, 469690, 462984, 463601, 286603, 231649, 278182, 468438, 94517, 364341, 105052, 453283, 180515, 223131, 52564, 333686, 333765, 337386, 185463, 149498, 130850, 241534, 311966, 278836, 30057, 364183, 510975, 523677, 57411, 176254, 426168, 205799, 463903, 140347, 418189, 206163, 318559, 212503, 418596, 202109, 407454, 563464, 272557, 349771, 349577, 445237, 603669, 529998, 237820, 184425, 468555, 293862, 540587, 406088, 510333, 352266, 235793, 365224, 541965, 540598, 501981, 219794, 29276, 269240, 20407, 418605, 483296, 239968, 286132, 650400, 247235, 449095, 251483, 247424, 386591, 148996, 329285, 177367, 523464]
13548E23464E3213L21439J51821A24858M14066j79845A70332K29788p9388a56903
13537C44704j41029L1053K4699N0846J15270q4540A48189d848A77907n1497L00411
13526D26821A19888K10762J0260r8117J77199l9114b62597H170K80426L7120i1022
13514C72044N6287Q4467j68267a30787B28383J00094O5030F181N45650h1824B76309
13502A15844L28562j51597J37987A54235P8461J34552O0043i3683C86493A44773
13491G3483J28311C6243Q7936i8343C44713m7613M5666j20548R3373p1577b3089
13479A66988a23726D02856n4239l4647Q5846A76914J43395j39857L905J09133
13469B93490J02345j94536m1449l0918n9139h3181D43977k06616K77385A76739
$$ y = [523464, 53213, 374652, 526473, 124858, 538924, 359079, 170332, 400120, 320732, -156903, 344704, 203675, 234728, 259427, 310273, 425543, 341003, 148189, -4848, 177907, 126410, 426821, 119888, 330650, 340910, 242793, 419992, 380878, -262597, 8170, 288596, 325716, -91022, 372044, 428331, 512798, 344531, -130787, 228383, 328477, 393507, 6181, 551831, -81824, 276309, 115844, 444406, 292809, 430796, 154235, 232696, 367248, 427291, -93683, 386493, 144773, 73483, 201794, 36243, 124179, -98343, 344713, 297100, 342766, 222218, 315591, 244014, -23089, 166988, -123726, 402856, 348617, 313970, 399816, 176914, 320309, 180452, 184357, 293490, 395835, 201299, 159850, 128932, 69793, -83181, 443977, 237361, 514746, 176739]
13458G2481M87821A35981J53464C4183K46707J7287r1983B1104K27652J84036
13448D32792A47902J71582G4383J6885L21631f1644B72897G4419J42224K17460
13438D34103j41095J78506j57853C1827c6976E1785a58963B92086A15621K60359
13428C75980R215A45922K91324A33337j3013h7206A96581o3976C6988M15168A91333
13416B55379j09614l5462O663L41073j29647j43264a9391D56510j89792a18514
13405C78165A65657n8832B3591f0391C93004j86039R7429I7286K77352j06843
13395B67795a1547r3725A96205P9570a6310A03422N3923n6267b8345A09020J57639
13384B66659J80533k15848l1609a64495C37029o6857D9652a04041A91857C2738
$$ y = [72481, 560302, 135981, 289445, 34183, 280890, 298177, 206194, 21104, 248756, 432792, 147902, 319484, 74383, 91268, 412899, -61644, 272897, 74419, 216643, 434103, 293008, 471514, 313661, 31827, -36976, 51785, -158963, 292086, 115621, 375980, 385195, 145922, 437246, 133337, 120324, -87206, 196581, 132605, 36988, 452156, 191333, 255379, 145765, 110303, 116966, 458039, 328392, 185128, -19391, 456510, 266718, -118514, 378165, 165657, 106825, 23591, -60391, 393004, 206965, 304394, 97286, 374638, 267795, -11547, -105272, 196205, 275775, -16310, 103422, 157345, 101078, -28345, 109020, 266659, 447192, 231344, 199735, -164495, 337029, 270172, 49652, -104041, 191857, 32738]
13373H7682J37505f1419K1853B22266p5595J61285j9789k6382n1096r3502a0332
13361A90929R3786J91159r9134j53574a17154D73785B02498a46950B61681J35
13351B61816J46789j67398N9525A5092N6105K61251q0181Q3579a31737A72318
13340A85349J01604j4083a58908A14051K3867J21144H4768J40154d0104D729a01344
13328i5599E8681i1741C01629O1253A69143L0434J22324k0032n6684m5335C2396
13316B93914A43753L6728D2967F974L30065j01282K7883I8786J62781F3044K12390
13305B75434j8519k7132q156F5119J08031b1733A77024L3702J54666j74560M7264
13294B38096J69607G0693O8016o819l0687L8724c8107a4321I5007O3277K28763
$$ y = [87682, 225187, -61419, -39566, 222266, 146671, 307956, 288167, 261785, 210689, 117187, -10332, 190929, 284715, 475874, 376740, 223166, -117154, 473785, 202498, -146950, 261681, 261816, 408605, 241207, 300732, 15092, 71197, 332448, 252267, 335846, -131737, 172318, 185349, 286953, 272870, -158908, 114051, 137918, 259062, 84768, 224922, -40104, 4729, -101344, -95599, 58681, -91741, 301629, 362882, 169143, 199577, 321901, 301869, 245185, 199850, 32396, 293914, 143753, 180481, 42967, 6974, 337039, 235757, 263640, 98786, 261567, 63044, 275434, 256915, 229783, 221627, 65119, 173150, -21733, 177024, 210726, 365392, 190832, 238096, 407703, 70693, 138709, 131890, 101203, 139927, -38107, -14321, 95007, 158284, 387047]
13283C87047A36198E4117N1369g3936k34381H4382j1594h4762l2615j2191f0951
13271A4839P2096f8139a2885k66480D0367K51069I411a38269L6141B61232A20939
13259B16520F3880j2131A8240n832n978Q9882Q0799B0205K4705M9649g0242C7289
13246A29047m4650J99934E2477A7967J86117a21386C14706J68549k08249F9926
13235B48877I5510O0855a0274A80055K21584a00403D14951B8752j3439J15537
13225A30850J25062b762A8799B252a11927L0967A57559B8508L71056A95732f570
13213G433g8370A22290a79382K2170g87q05q4145B98329G8601g2622A75181J45821
13201C21002a11330D0206K58841A49227b63148g3760B53675i6524I3061l4155
$$ y = [387047, 136198, 54117, 105486, -73936, -308317, 84382, 72788, -84762, -117377, -129568, -60951, 14839, 86935, -68139, -12885, -279365, 40367, 291436, 9411, -138269, -102128, 261232, 120939, 216520, 63880, 51749, 18240, 12408, 6430, 96312, 177111, 20205, 44910, 94559, -70242, 37289, 129047, 84397, 284331, 52477, 17967, 204084, -121386, 314706, 483255, 275006, 69926, 248877, 95510, 156365, -10274, 180055, 401639, -100403, 414951, 28752, 15313, 130850, 255912, -2762, 18799, 2252, -111927, -80960, 157559, 28508, 399564, 195732, -6570, 7433, -78370, 122290, -179382, -157212, -787, -1592, -85737, 298329, 78601, -72622, 175181, 321002, -111330, 40206, 299047, 149227, -263148, -73760, 253675, -96524, 93061, 58906]
13191E8906J34968J56590g0881B71280j06865G1993J40386F7380J69696p2674
13181A64402h8676C51614b89357F7529J27492C1780J30585J18904j34470i8890
13170I3976J27904m8149g6637A3860a10030D17387c1176m8674A80082J66636e6140
13158A58255G4098A4420J36485j2416I054J45691b96281A84103e8804A809K02154
13147B03963e5602J5358C78502a63742j7007L3077g2326C09502L9249i6152A5488
13135A81039a60843B53225a50333A987a2527I5945l5811a00452B77215G8865h9203
13123A40658j2297o40K20990q840j43609a6384F8395L25092j95385i1891C80278
13111G9193K46158R757j08666j4298k3863J44583A23333e5440C4341J15935J62765
$$ y = [58906, 193874, 350464, -70881, 271280, 164415, 71993, 212379, 67380, 237076, 164402, -88676, 351614, -289357, 67529, 195021, 31780, 162365, 281269, 146799, -98890, 93976, 221880, 173731, -76637, 13860, -110030, 417387, -31176, -79850, 180082, 346718, -56140, 158255, 74098, 14420, 150905, 138489, 9054, 154745, -296281, 184103, -58804, 1809, 203963, -55602, -40244, 378502, -163742, -180749, -147672, -72326, 309502, 348751, -96152, 15488, 181039, -160843, 253225, -150333, 1987, -12527, 95945, 60134, -100452, 277215, 78865, -89203, 140658, 128361, 127721, 348711, 339871, 196262, -16384, 68395, 393487, 198102, -91891, 380278, 79193, 325351, 335108, 226442, 212144, 188281, 332864, 123333, -55440, 34341, 150276, 313041]
13100C13041b60932A46351j6983J58654A04190E1332J450a42318e2358B81240
13089G2079N9666k0042K36906A47106E232d3126C72683i9344I5766J40497a82737
13077B00249f8580B46872j7113a77673A20310k7106a18329B73512r5571b5102
13066E63479a68501A96075I7376K43619H2982f3635B61532r1061E8310a70698
13055A14347d3741i562E05032A95495q0884J00971F2336j0423A9336e6449A50995
13043A54598K762a55154B38584J17955A34252J26259B2028a3772B66456e9248
13032A34475M9439m821O5830e2040J8207J0216A92736q6855N4663R9663j07929
13021A52278a33250A36455E6307d8076C45877d4076C4549R6783m2969f1754A27298
$$ y = [313041, -260932, 146351, 129368, 288022, 104190, 51332, 52782, -142318, -52358, 281240, 72079, 131745, 111703, 348609, 147106, 5232, -43126, 372683, -99344, 95766, 236263, -182737, 200249, -68580, 246872, 229759, -177673, 120310, 93204, -118329, 273512, 177941, -25102, 563479, -168501, 196075, 97376, 340995, 82982, -63635, 261532, 170471, 58310, -170698, 114347, -43741, -9562, 505032, 195495, 114611, 215582, 62336, 51913, 19336, -56449, 150995, 154598, 157360, -155154, 238584, 356539, 134252, 260511, 22028, -13772, 266456, -59248, 134475, 183914, 179093, 244923, -52040, -33833, -23617, 192736, 105881, 160544, 260207, 152278, -133250, 136455, 56307, -48076, 345877, -44076, 34549, 131332, 88363, -61754, 127298]
13009b71542D6794a55748B5089K50366A05233C545a38215f7342l7769C7972j513
12998C6459a52301c5756l63800a75092n6851C665a12183B46799o2167a45937C1963
12986C20587o4447G671K35805M2775a432A00886a54560B22057b5190B11816g4735
12974H4074i2552A75575d962j00860A32961c3586o44A68212J37383D9206b14395
12962D7249O8766R4066H9726P7238m9876j5663d3279j92589h4209M1229B40002
12950a7126k21615A34691m3010B8817a7833F5203a74883I3573e1743K0426Q444
12939b2873B3250J20722h6811B56485H1492f9509A74173b58200j12150A59787
12928B97223B6647J40118n1486b77355h384B06892K6407C5930K49777p7786a68147
$$ y = [-271542, 46794, -155748, 25089, 275455, 105233, 3545, -138215, -67342, -105111, 37972, 36459, -152301, -35756, -399556, -175092, -231943, 3665, -112183, 246799, 184632, -145937, 31963, 320587, 256140, 7671, 243476, 286251, -1432, 100886, -154560, 222057, -25190, 211816, -74735, 84074, -92552, 175575, -4962, -105822, 132961, -33586, -34230, 168212, 305595, 49206, -214395, 47249, 116015, 210081, 89726, 166964, 117088, 101425, -43279, -235868, -84209, -42980, 240002, -17126, -238741, 134691, 91681, 28817, -17833, 65203, -174883, 93573, -51743, -31317, -22873, 23250, 143972, -86811, 256485, 81492, -69509, 174173, -258200, -370350, 159787, 297223, 26647, 166765, 115279, -277355, -8384, 206892, 233299, 35930, 285707, 207921, -168147]
12916I033N6571K36528F7691J26891D6234a3966B18140E8812e3881r5523A0893
12904C38735d50854A58363b35868j6273b8029C7808M5144b94949B45067E6191
12893b62517h929G1455a2231A38292g0356j97218A33148B2889a32015L7155B71029
12881G0510L49698a15296F3376d445A34233R5184B4842O1459b88397a0096I6188
12869a17690j61145i9559B9941l285a99152B14269J57001b6581F8952i1346A76723
12857A29593O6372a35843K7566j7089o5866P1113l8849P3771A76207a33779B1011
12845B7072L6998b59300A86223b6598q6545H6543R9951B1733J30251a19942B61005
12833e5910K4577H5982J27228J56896g7828H393L85533a26008j06951A50656h0913
$$ y = [9033, 65604, 302132, 67691, 194582, 46234, -13966, 218140, 58812, -53881, -149404, 10893, 338735, -450854, 158363, -235868, -252141, -28029, 37808, 82952, -294949, 245067, 56191, -262517, -8929, 71455, -12231, 138292, -70356, -267574, 133148, 22889, -132015, -94860, 271029, 70510, 420208, -115296, 63376, -4445, 134233, 229417, 24842, 86301, -288397, -10096, 96188, -117690, -278835, -99559, 29941, 26656, -199152, 214269, 371270, -26581, 68952, -91346, 176723, 129593, 195965, -135843, -108277, -125366, -191232, -120119, -158968, -85197, 176207, -133779, 21011, 27072, 64070, -259300, 186223, -26598, -113143, 86543, 186494, 21733, 151984, -119942, 261005, -55910, -31333, 85982, 213210, 370106, -77828, 8393, 393926, -126008, -232959, 150656, -80913]
12821e5529A57338p7610K23819A42683e5416p7946K3564A28845e7564B8509K64367
12810B92876l091A35565j6910D7774g8626q9501A30427k3545B6297j231L26505
12799C51571B0047R3735R2446E8821J13811J69283f0181C6275J03677h9170J3536
12788g5634F2200a68770q0797K8025n152A1465a9852A12389a34040K354e1043
12776b11232B14465b43554D1844K44435A21393c6283A47889i5646A08940c56954
12765i4690A60201A0521a54676I000e4942i046J870k18323e4007k38001R7267
12754a94741A69147a30374b1342j54520Q7041B33935b34324E4510N9274i8442
12743D9262L2090d2522K88C57125j09319a09881A22179e9164j56559B82277a80298
$$ y = [-55529, 157338, 79728, 303547, 142683, -55416, -133362, -109798, 128845, -57564, 28509, 292876, 289785, 135565, 118655, 47774, -78626, -168127, 130427, 106882, 26297, 25066, 351571, 20047, 113782, 206228, 58821, 172632, 341915, -60181, 36275, 139952, -89170, -75634, 62200, -168770, -249567, -221542, -226694, 11465, -19852, 112389, -134040, -131686, -51043, -211232, 214465, -243554, 41844, 286279, 121393, -36283, 147889, -95646, 108940, -356954, -94690, 160201, 10521, -154676, 9000, -54942, -9046, -7176, -225499, -54007, -292008, -194741, 169147, -130374, -21342, -175862, -88821, 233935, -234324, 54510, 113784, -98442, 49262, 81352, -42522, -42234, 357125, 247806, -109881, 122179, -59164, -215723, 282277, -180298]
12731a57112A49520c8579n0660j3490B88427B1539a80582a3817A19520B2593c3572
12719a01648o8369D5567M9825L03452c168F8963J03272D3654J9903b23506C81421
12707a04364L8523A81419m5591K8653a9073o2871n9322d0326A2556g3600j33185
12696b06785B02592i1969o7564E4456J78863a52719C80558b8359C04471b27036
12685b03189B34929A04373b13424d8680B72728m3132Q1946K2951a77222A43163
12674h1507B8453b91507i4268D2122R9431j2584g9247A10793A2444a65048L3917
12663a31131m1191C10777a15273I2736j8300a29280A56948e5755A28859O2788
12653A91647c9212E1092J3357e3225j41216A19815j8868K1921e978j46191E9674
$$ y = [-157112, 149520, -38579, -89239, -102729, 288427, 21539, -180582, -13817, 119520, 22593, -33572, -101648, -170017, 45567, 95392, 398844, -3168, 68963, 172235, 43654, 63557, -223506, 381421, -104364, -65841, 181419, 135828, 164481, -19073, -81944, -141266, -40326, 12556, -73600, -206785, 202592, -91969, -159533, 54456, 233319, -152719, 380558, -28359, 304471, -227036, -203189, 234929, 104373, -213424, -48680, 272728, 229596, 311542, 334493, -177222, 143163, -81507, 28453, -291507, -94268, 42122, 141553, 128969, -79247, 110793, 12444, -165048, -131131, -172322, 310777, -115273, 92736, 74436, -129280, 156948, -55755, 128859, 191647, -39212, 51092, 64449, -53225, -194441, 119815, 100947, 122868, -5978, -152169, 59674]
12641D11351a23271H2188f2785a9582j4143r1887A16378M3094d29575i5167m6752
12630a41919C00216R3636A11468m8469j2550d0749C1257K16615D077K30748J9592
12619B54417a47442N4707C486Q5697a30127A04224D4030a85988B19872n3823a99422
12607B31585F8636d7295m7041k84583H7451a65370J3487E0276a47578E5109E326
12595b48442B73806A33961a13686o5914K0574C66609B7695b10212G4547a83928
12584e7323A64674n2681k8276c5386k33233j20121a51300c1712C520A394K08687
12573B10081K0859c6281B95533D8906j0427P9627b50804h3050C41425A0026L598
12562A3624J45491a0735k1850l2713B28896a48237A80203M287F9582b80381B9933
$$ y = [411351, -123271, 82188, -62785, -19582, -33725, -125612, 116378, 159472, -429575, -95167, -141919, 300216, 393852, 111468, 62999, 50449, -40749, 31257, 247872, 4077, 234825, 254417, -147442, -92735, 3486, 89183, -130127, 104224, 44030, -185988, 219872, 166049, -199422, 231585, 68636, -47295, -94336, -378919, 87451, -165370, -151883, 50276, -147578, 55109, 5326, -248442, 273806, 133961, -113686, -179600, -159026, 366609, 27695, -210212, 74547, -183928, -57323, 164674, 111993, 83717, -35386, -268619, -388740, -151300, -31712, 3520, 1394, 210081, 230940, -36281, 295533, 48906, 38479, 118106, -250804, -83050, 341425, 10026, 13624, 159115, -10735, -32585, -65298, 228896, -148237, 180203, 184490, 69582, -280381, 29933]
12550b63719a30939j40095B80435q7575J2994a10130K4747c1554A91520G8797
12539B55091F7572L8279J6381a43831M7145G2472f1752F1080a08267R52A47347
12527a38211A66674a86146B13142b89957B52002a49840a6323N444k17757B4470
12516B78461b92405f2667C73880F944P6522K91971B8737M1677i4015H0280a61075
12504c2604A01481L67083c17850g4048G7721a8293A07500b04148B02599b0920
12493c17048i5220j46408j53677E3925b88177I8932b60547B37276i2820b9562
12482A05789e726A10597N1919j1411d8330A90492l2133J04788h7721d808E109
12470h4142H483M953J68466F6614a47792I8682N7187a22136J5854G7920a40053
$$ y = [-263719, -130939, -271034, 280435, 192860, 205854, -110130, -85383, -31554, 191520, 78797, 255091, 67572, 105851, 122232, -143831, -96686, 72472, -61752, 61080, -108267, -107315, 147347, -138211, 166674, -186146, 213142, -289957, 252002, -149840, -16323, -10879, -228636, 24470, 278461, -292405, -62667, 373880, 6944, 83466, 375437, 28737, 70414, -94015, 80280, -161075, -32604, 101481, 468564, -317850, -74048, 77721, -18293, 107500, -204148, 202599, -20920, -317048, -95220, -241628, -395305, 53925, -288177, 98932, -260547, 237276, -92820, -29562, 105789, -5726, 110597, 162516, 151105, -48330, 190492, 158359, 263147, -87721, -4808, 5109, -84142, 8483, 13436, 181902, 66614, -147792, 98682, 155869, -122136, -106282, 77920, -140053]
12458h4102j3609f66D7738a50297O4015j38731M5944Q78a9658A04031a47675c2550
12445b4217G0577j9225M7262J37864a62741A4240b52341K8593B37009b08384P3722
12434a34662M0185A39976F2796L1994a79609K5082K2894d9297j99219J16640a5339
12422b92700B8647g23q4879j60241D71822A34877A7819c9469B74532b5067l5504
12411f0571J2247q9358j14288I4568a25768M9201D1251i0854c3145j38884A08714
12399G6557J5582A1417b24847f8785D0741a33291B1548J03600a7373l2717l53538
12388d03628A51329a19736C8219J4174j747K6117f0592B60231h9343c7835G6731
12376B23907b46518A02984a31241A73205a31951J9924q6024H8580N1961o945J17760
$$ y = [-84102, -97711, -666, 47738, -150297, -86282, -225013, -179069, -178191, -19658, 104031, -147675, -32550, -24217, 70577, 51352, 98614, 236478, -162741, 14240, -252341, -223748, 237009, -208384, -134662, -94477, 139976, 62796, 94790, -179609, -154527, -131633, -49297, -248516, -131876, -15339, -292700, 28647, -723, -85602, -245843, 471822, 134877, 17819, -39469, 274532, -25067, -60571, -48324, -137682, -251970, 94568, -125768, -76567, 41251, -90854, -33145, -172029, 108714, 76557, 92139, 11417, -224847, -68785, 40741, -133291, 21548, 125148, -17373, -50090, -403628, 151329, -119736, 38219, 52393, 50646, 76763, -60592, 260231, -89343, -37835, 76731, 223907, -246518, 102984, -131241, 173205, -131951, -112027, -198051, 88580, 140541, 133596, 251356]
12365B51356A15111h704A62762E8693h2394L0951G5105j4929J25090a47816E1614
12353A59053a03764A70684N0408g2018j14640H9929b69691G7100J50491C3228
12342D5364K63238b48146O5594N2767D0939M9791a00568a4551B7369J10721J2545
12331A50635k645l6867c00228e5567A52523b48261C7779a27508B35483E8004g2454
12319a95390k7960K7201O1675j70960B68769G2099A7020d8115k34260A17058B4688
12307h9429b8873A45634a18679a7241F5441A7026a29583B68296K59659A99254
12296a05385I3760A8784b97707A13260B7949P2269h7339j14730g6941j26500b7273
12284g5672A12893d8279K943J7490G5004J72714A1970Q7285l6459b7952b588m0038
$$ y = [251356, 115111, -8704, 162762, 58693, -82394, -51443, 75105, 60176, 185266, -147816, 51614, 159053, -103764, 170684, 221092, -72018, -186658, 89929, -269691, 77100, 227591, 33228, 45364, 308602, -248146, -182552, -129785, 40939, 90730, -100568, -14551, 27369, 138090, 150635, 147990, 111123, -300228, -55567, 152523, -248261, 37779, -127508, 235483, 58004, -72454, -195390, -223350, -196149, -134474, -305434, 268769, 72099, 17020, -48115, -282375, 117058, 24688, -89429, -28873, 145634, -118679, -17241, 65441, 17026, -129583, 268296, 527955, 199254, -105385, 93760, 18784, -297707, 113260, 27949, 100218, -87339, -202069, -76941, -203441, -27273, -75672, 112893, -48279, -45336, -27846, 75004, 247718, 11970, 99255, 62796, -27952, -2588, -42626]
12272d2626D6782M2548a25101q6897B63858n8617A4267a55614C74771j02242A9302
12260I7457R8173J14282m6077C1475J68801d3055n1768n7833b1906D9430K1603
12249G1033J34831a41245A79741H7551i591G0880c6278C7479b5392D5692J6713
12238F2405O9711L26346H3900b0285k09110g1106D1729b80770B75069a89184O0875
12227a28309E0335g1892A9780K53550R2699H0566M50865A24761a59723A56158
12216b65173C73650A41510b07065A91518J8266J01892g517j29667A37773c0184
12205E3685M7550N1958a74831A79452H7456O3485D7338J98417F5570N607J99119
12194B70296C5054f407B98865l8831o9673n2908l0779J70282p1843o828J43561
$$ y = [-42626, 46782, 89330, -125101, -211998, 263858, 205241, 14267, -155614, 374771, 272529, 19302, 97457, 195630, 309912, 263835, 31475, 200276, -43055, -94823, -152656, -21906, 49430, 71033, 205864, -141245, 179741, 87551, -9591, 70880, -36278, 37479, -25392, 45692, 62405, 132116, 458462, 83900, -20285, -229395, -71106, 41729, -280770, 275069, -189184, -128309, 50335, -71892, 19780, 273330, 366029, 80566, 531431, 124761, -159723, 156158, -265173, 373650, 141510, -207065, 191518, 209784, 311676, -7517, -137184, 137773, -30184, 53685, 101235, 153193, -174831, 179452, 87456, 150941, 47338, 245755, 65570, 71177, 270296, 35054, -6407, 298865, 260034, 190361, 137453, 106674, 276956, 205113, 198285, 341846]
12183C41846O8047a64957C44119a5746F2271J92311j17196n4935a3049D3806M28581
12172D72387A79796J635B9359L46036j67456K3031j2978l3243b2081B14275C1779
12160A67882e6564C48771e5062B02972c48414f3692F5520O7973F2303h9390C0338
12148b28576A04687a775I1619J81820M3876A09444b8184k47752f9948C65819a52993
12136E05475A36706J31899k2875a90371A22901M9252a02742j98667B76555A33993
12125a14233j14161R2255C5592J64322A7004R2021j2539a8323f072A74702m3947
12114A30755d54626A03255M7545e5394A82264a6926A81969e7556j6048G4916a81406
12102a00605A93041e5721A32658a46289J9249p3298B46671A7484e657A10986B098
$$ y = [341846, 409893, -164957, 344119, -15746, 62271, 254582, 137386, 82451, -13049, 43806, 472387, 179796, 181431, 29359, 375395, 207939, 230970, 217992, 184749, -22081, 214275, 31779, 167882, -56564, 348771, -55062, 202972, -348414, -63692, 65520, 133493, 62303, -89390, 30338, -228576, 104687, -1775, 91619, 273439, 317315, 109444, -28184, -275936, -69948, 365819, -152993, 505475, 136706, 268605, 245730, -190371, 122901, 172153, -102742, -301409, 276555, 133993, -114233, -228394, -136139, 35592, 199914, 17004, 109025, 96486, -18323, -6072, 174702, 130755, -454626, 103255, 150800, -55394, 182264, -16926, 181969, -57556, -73604, 74916, -181406, -100605, 193041, -55721, 132658, -146289, -127040, -200338, 246671, 17484, -5657, 110986, 2098]
12090b9649B61945b23115D7017h3321C48629d293n0953C65753P5209F0325f2203
12078A64529a8050H9043J17646b03122H9302J26817g3597F1199b65354E8046a43083
12066A12011J23772g1635A13158M24416j26915M37122C08310G3252J07600h9907
12055c4832I2562M9054O6376Q7618a31871I0550b91134j4357h914A5016K62045
12044B77061m5361a56913B744J81742J24324G1690e6929E1608J61321a58535A8948
12032C15861j27525g3338E6510J45948a2739k42621e8187k42717B0836L1554a55006
12020a2052k35136D23858A33552O8575h5768b8974C06930a85107o4352b4970k65392
12009b90362h4129G277J88974m9379g1627j77373F5935a1106j3931k35333g9120
$$ y = [-29649, 261945, -223115, 47017, -83321, 348629, -4293, -55246, 365753, 440962, 60325, -62203, 164529, -18050, 89043, 206689, -203122, 89302, 216119, -73597, 61199, -265354, 58046, -143083, 112011, 235783, -71635, 113158, 537574, 410659, 847781, 308310, 73252, 180852, -89907, -34832, 92562, 141616, 207992, 295610, -131871, 90550, -291134, -305491, -8914, 15016, 277061, 231700, -156913, 2744, 184486, 308810, 71690, -56929, 51608, 212929, -158535, 18948, 315861, 188336, -73338, 56510, 202458, -12739, -255360, -58187, -300904, 20836, 52390, -155006, -12052, -247188, 423858, 133552, 202127, -85768, -28974, 306930, -185107, -249459, -24970, -290362, -84129, 7277, 196251, 146872, -71627, -249000, 65935, -11106, -25037, -260370, -79120]
11997C9326a69416N9626d3975d738A42046J61246c80805J54234J5296f7279k2341
11986h9620c3018C7439b03931F7299a94231P7893H0926P144J51396a6683j46702
11975a63385I9411a79123P1269C5481J0284C442a70875f9411a2562j90985B56149
11963g5055j01820A26179b58859a06186A08646J6107i1500h449G8389a16884e2336
11951G3898b88551G9497O5423d5109B2683b55778a26616A57444f9481j47419e2166
11939i3354K2122D1333P6652f1026I6906l4561K1312a06079F6436B8176h9465
11927a32850E5554E178L0912a02843k34557A5236O1442Q9403b46551E3984f9088
11915a82684A63857i1443q4123j98678c6280A27777e3028l34738c0893A5646K864
$$ y = [39326, -169416, -109790, -43975, -4738, 142046, 303292, -380805, -226571, -211275, -67279, -89620, -33018, 37439, -203931, 67299, -194231, -116338, 80926, 88070, 239466, -16683, -163385, 99411, -179123, -107854, 35481, 45765, 3442, -170875, -69411, -12562, -203547, 256149, -75055, -176875, 126179, -258859, -106186, 108646, 124753, -91500, -8449, 78389, -116884, -52336, 73898, -288551, 79497, 144920, -45109, 22683, -255778, -126616, 157444, -69481, -216900, -52166, -93354, -71232, 41333, 117985, -61026, 96906, 62345, 83657, -106079, 66436, 28176, -89465, -132850, 55554, 5178, 36090, -102843, -337400, 15236, 76678, 166081, -246551, 53984, -69088, -182684, 163857, -91443, -175566, -374244, -36280, 127777, -53028, -387766, -30893, 15646, 18510]
11904A8510K0823a54943c4648A90131a20413A82237a32382D8807K29409f7488
11893b50961A45546O2756N3395A07893a73662c9610A42300o1067a35043c9387
11882a69001L6178l45088O5063A85832d57125J75851A4117a23574K0378N0861
11872e2335B4d18329B44118o8295i8360L4208B19440H239a06756A57403a37984
11860f762A25902E9365a44280B64300b25286o8965A10818a2225C10860a93797
11849a19376q6584B05767H8549h4906l7274a0471C5409a01514d756j65451C0019
11837D2941e2200B97745D0845A6512a04749a1722k15695h566a502k37980M4071
11826a95411B6521i8784J419A33311J8021c15891J40018C28807a68539B1249b39976
$$ y = [18510, 39333, -154943, -34648, 190131, -120413, 182237, -132382, 48807, 278216, -67488, -250961, 145546, 208302, 261697, 107893, -173662, -39610, 142300, 81233, -135043, -39387, -169001, -132823, -477911, -412848, 185832, -457125, -281274, 14117, -123574, -103196, -52335, 24, -418329, 244118, 175823, -98360, -64152, 219440, 8239, -106756, 157403, -137984, -6762, 125902, 59365, -144280, 264300, -225286, -294251, 110818, -12225, 310860, -193797, -119376, -205960, 205767, 88549, -84906, -122180, -10471, 35409, -101514, -4756, -170207, 30019, 42941, -52200, 297745, 40845, 16512, -104749, -11722, -227417, -8566, -1502, -239482, -195411, 26521, -98784, -97365, 133311, 151332, -315891, -175873, 328807, -168539, 21249, -239976]
11814b57742O1293D0920e8548C77835A39950o9438J7523a74792j09935B71730
11803E2957i2177l6595r646p3883l7930M4403m9335J08232B21964b8721D14206
11791b0559o7344M1443C04538a22224B73953H2008R18h6391q4615C86038f8420
11779a86362L4151A63273b6234k88576A20153i9375A21718J26968K36121b10750
11768A1075d7164H8780c95700a04385d3916C23976a59796A6986Q5630b25702A53842
11756f2376A0836i1604A267i7657C471N9954i8919d1211n317G1917b43531G3353
11743G63J21475b20596A83900E4307c9156C7968a35838e5445j64511P2594o0460
11732b07822K7246B75127g6638J0225C1042K9153M6688b00603c8451m1202k4896
$$ y = [-257742, -196449, 40920, -58548, 377835, 139950, 70512, 88035, -174792, -284727, 271730, 52957, -92177, -128772, -138418, -212301, -250231, -205828, -255163, -146931, 221964, -28721, 414206, -20559, -87903, -46460, 304538, -122224, 273953, 82008, 82926, -86391, -171006, 386038, -68420, -186362, -152211, 163273, -26234, -314810, 120153, -99375, 121718, 248686, 484807, -210750, 11075, -47164, 88780, -395700, -104385, -43916, 323976, -159796, 16986, 102616, -225702, 153842, -62376, 10836, -91604, 1267, -97657, 3471, 63425, -98919, -41211, -46528, 71917, -243531, 73353, 763, 122238, -220596, 183900, 54307, -39156, 37968, -135838, -55445, -219956, -147362, -207822, -180576, 275127, -76638, -66413, 31042, 60195, 106883, -200603, -38451, -79653, -104549]
11721a04549j06523A22197a251j87047C50064a27567B90252F0017L7785b7442
11710a20176j23135A60085f437l6822R774j62603l21417A34089B3637K1197O1999
11699A06833b36346A20188L2929a84494Q9606L0147C53790A74131a06048I2382
11688A31616a1249j05154d7587A04229j1147a47486B6942Q5208J21610d3225C9357
11676I177R6166m6951a295n0029I4151b57056Q9808A42283c10185A12257a72390
11664E287L287k570M5608B3380Q5609a68493P9471r8529f0991K2417o1825K2387
11652g8012A5528O5333A8040a29443b8908A45713B5733e6829B9636b9106p7458
11641a06564p23E8853e7145A73584J31525a04670j37965D2236d1423j04610E2463
$$ y = [-104549, -211072, 122197, -1251, -188298, 350064, -127567, 290252, 60017, 97802, -27442, -120176, -243311, 160085, -6437, -43259, -33485, -196088, -517505, 134089, 23637, 44834, 106833, -236346, 120188, 153117, -184494, -94888, -64741, 353790, 174131, -106048, 92382, 131616, -11249, -116403, -47587, 104229, 93082, -147486, 26942, 112150, 233760, -43225, 39357, 9177, 105343, 58392, -1295, -51324, 94151, -257056, -167248, 142283, -310185, 112257, -172390, 5287, 8574, 6004, 51612, 23380, 108989, -168493, -89022, -187551, -60991, -38574, -100399, -78012, 15528, 80861, 18040, -129443, -28908, 145713, 25733, -56829, 29636, -29106, -106564, -107287, 58853, -57145, 173584, 305109, -104670, -242635, 42236, -41423, -146033, 52463]
11629A21789m8675K9026C5497A011a76519A10977R9583k8819d968B10487m2657
11618A67830a15630E0593J59972D60M9283a57194A71898a88443r0903B27562c81540
11606A50736b85583c8747j6283B21947H6357E736a24997l6738c8649p3011B72697
11594a91819j0563h4364d1400q8205F9791e7269h028l20295J62561B23144b08382
11582a42838B80539Q6192f3251B05341J1815c6786o9580A18375a4422n3498I9882
11570C13733D3404L58J91090L0767e2051E5241q795L3804K20595r1218l7351J26494
11558B98770d0545A32151R9370A07165B5422j0952g495A7548b00110B6552A997
11546a0733q4162C2175J70423m2101a21996d3620B7610b51891A63769g3997K9454
$$ y = [121789, 73114, 102140, 35497, 1011, -176519, 110977, 210560, 181741, -4968, 210487, 167830, -115630, 50593, 210565, 460, 49743, -157194, 171898, -188443, -279346, 227562, -381540, 150736, -285583, -38747, -55030, 221947, 86357, 5736, -124997, -161735, -38649, -111660, 272697, -191819, -202382, -84364, -41400, -129605, 69791, -57269, -8028, -328323, -165762, 223144, -208382, -142838, 280539, 366731, -63251, 205341, 217156, -36786, -106366, 118375, -14422, -67920, 99882, 313733, 43404, 43762, 234852, 265619, -52051, 55241, 46446, 80250, 300845, 209627, 172276, 298770, -40545, 132151, 231521, 107165, 25422, 14470, -7495, 17548, -200110, 26552, 1997, -10733, -94895, 32175, 202598, 160497, -121996, -43620, 27610, -251891, 163769, -73997, -44543]
11535d4543p1167A17463i3399k01948i4672A80421a40837d1810p6535A63191d0795
11523C2411h8079E4053i4496C0464a21687A10129h1411J0913l9768o385j0053
11512a26704c3804A85398H7246P5648j4173M56855A38974a87054A43111l599P5668
11501B15180q7833a62687p7007A7932b3075A08139e856C11135C5278h0504b3290
11489d473j89612b4085q1262i839j40416e7877A25167K54903A45314b35718B35125
11477c28042a30095D2682J72659a3605C2551a5777A90044n3436P4403g938j95182
11466b03120B52843J08706c1225C59433A40289b35784Q5868c4237A97956b30090
11455a7557C5729b6213c518j70049G948b40254e5100E2360j300j7120K95368a34099
$$ y = [-44543, -115710, 117463, -93399, -295347, -94672, 180421, -140837, -41810, -118345, 163191, -40795, 32411, -88079, 54053, -94496, 30464, -121687, 110129, -81411, -70498, -110266, -116651, -126704, -33804, 185398, 87246, 162894, 148721, 605576, 138974, -187054, 143111, 139512, 215180, 127347, -162687, -239694, 17932, -23075, 108139, -5856, 311135, 35278, -80504, -23290, -4473, -194085, -24085, -105347, -9839, -150255, -57877, 125167, 380070, 145314, -235718, 235125, -328042, -130095, 42682, 215341, -13605, 32551, -15777, 190044, 136608, 211011, -7938, -203120, 252843, 361549, -31225, 359433, 140289, -235784, -149916, -34237, 197956, -230090, -17557, 35729, -26213, -3518, -173567, 7948, -240254, -55100, 52360, 51060, 33940, 329308, -134099]
11442b6984F9701J48424J38487j17667j04322H388a6030A18557f0851q2660A60119
11430f7738B63008C1631b07519a878B06845a29410j47611g9833F0256P4561b8397
11418c154o6576A50255K10462C8236a12919r2836c0492k10337e6580o4616J3043
11407a08153A30909L018o4596b61948j3125A82745K2821D3331i0934H7771a35210
11395a97737B6151j146m870a05907J2203B90245a26686B27182a02251d3002j11666
11384a54668C3927Q4411O0062c20539A0941Q3103C6865A5554a93203M9492B29893
11372a11375M6819B7350N7658k5772d22575a53827D6678K57766A43085J61018
11362C04103H617J28187B4040Q8913a3479A20635D0580a73375G6654p749J34451
$$ y = [-26984, 69701, 218125, 356612, 238945, 134623, 8388, -16030, 118557, -60851, -143511, 160119, -67738, 263008, 31631, -207519, -1878, 206845, -129410, -277021, -79833, 60256, 134817, -28397, -3154, -69730, 150255, 360717, 38236, -112919, -205755, -30492, -240829, -56580, -121196, -108153, 130909, 133927, 69331, -261948, -275073, 182745, 205566, 43331, -90934, 87771, -135210, -197737, 26151, 25005, 20135, -105907, -93704, 290245, -126686, 227182, -102251, -43002, -154668, 33927, 118338, 178400, -320539, 10941, 94044, 36865, 15554, -193203, -143711, 229893, -111375, -64556, 27350, 85008, 59236, -422575, -153827, 46678, 304444, 143085, 304103, 8617, 136804, 24040, 112953, -13479, 120635, 40580, -173375, 76654, 68905, 203356]
11351B03356k0836k6320d15822H3478l9076A1977h5891A09180l5237a00310A82880
11339c81045f2997k65199A7833d38563a77419A05559i5794a2446j27787j16781
11329b57014i67k54691J05692A4322a33714e0861k89212a69489H6977b28529Q3521
11318a45008O5321n7937C4291d07159A3395n331b42944G982M8965c07222q6587
11307c93809I2066a03483r0606l18773H7106a7917I5375l3418Q391i0190B1223
11295a25129j93605F8232J7125h2890d485A1061J48926D1559r111b23830A65600
11283A17293n38B0040b08871j9024a3894C70359a77709A95134f4753p9052m966
11272a48771L3681M0535C34920A13892a69156o9793N7986A41959a07057K7184
$$ y = [203356, 182520, 156200, -415822, 83478, 44402, 11977, -85891, 109180, 73943, -100310, 182880, -381045, -62997, -328196, 17833, -438563, -177419, 105559, -95794, -12446, -140233, -257014, -967, -255658, -149966, 14322, -133714, -50861, -340073, -169489, 86977, -228529, -145008, -79687, -137624, 34291, -407159, 13395, 8064, -242944, 7982, 56947, -307222, -393809, 92066, -103483, -194089, -512862, 87106, -17917, 95375, 61957, 70348, -90190, 21223, -125129, -318734, 68232, 85357, -82890, -4485, 11061, 159987, 41559, 32448, -223830, 165600, 117293, 116755, 20040, -208871, -227895, -13894, 370359, -177709, 195134, -64753, -143805, -148771, -115090, -74555, 334920, 113892, -169156, -238949, -180963, 141959, -107057, -79873]
11262g9873B4233a38387J1383L2396q2200D3248j053b31280a08032d6853p8731
11251a25584L3169j4620M5943o9288j48225i866k29476D477f8707J2045J6362
11240d0300A38428c86781J65152A2250d7667A07655A493a50122c1656B23903b50786
11228G6532b11865P6399A36657N1415G1613b83831J23865C1003J28787A6410f7318
11216i1388A08833g3949j09548O8441E0639b17788d9521A39185d8571k7305j8156
11205i4032E6872a87206B5291a73497E0876N5318i2490K6095a6157A24331l8803
11194H5528B4498c5254I8186b6243j03235k1794q7899R316N7806g2870I6810M5050
11182A41860a91169e6141j90251f9967m3708B4675J85680q3858a87223j3506B26022
$$ y = [-79873, 24233, -138387, -127004, -94608, -176808, 43248, 42195, -231280, -108032, -46853, -125584, -92415, -107035, -61092, -130380, -278605, -9866, -239342, 4477, -68707, -56662, -40300, 138428, -386781, -221629, 12250, -47667, 107655, 1493, -150122, -31656, 223903, -250786, 76532, -211865, -135466, 136657, 188072, 71613, -283831, -159966, 31003, 159790, 16410, -67318, -91388, 108833, -73949, -183497, -115056, 50639, -217788, -49521, 139185, -48571, -75876, -94032, 56872, -187206, 25291, -173497, 50876, 106194, -92490, -66395, -16157, 124331, 85528, 24498, -35254, 98186, -26243, -129478, -151272, -239171, -229855, -172049, -72870, 96810, 141860, -191169, -56141, -246392, -69967, -113675, 24675, 210355, 126497, -187223, -200729, 226022]
11170A43529a26854H0097j4585g1292k56101P7214B35675b16891a8650j83501
11160b02151e7678k20069h8137M1021o2200r9838f3356l3616j55440I4669a27665
11148a03125B3787L07893A211i4972r620B5294K9629M6402k1261a45358F2390
11136A3281N7456a31676A93493b71785A30346J92049l1404a17242j41268a01732
11125A88340R2581r580a08551D2961c07651B8202d0009B04903f646G4494a23504
11113A31292i1871C89634e2444J0666l9894L1730E4990K1599a73575H6752J32424
11102B19176r0887a2437B49352f4143k52454J49750B39718H9087c48825D2208
11091b27761J01637A66537a19552A26289J5488o3919N12946A27649Q5187E5334
$$ y = [143529, -126854, 80097, 65512, -71292, -327393, -250179, 235675, -216891, -18650, -202151, -57678, -277747, -88137, -47116, -109316, -209154, -63356, -96972, -252412, 94669, -127665, -103125, 23787, 331680, 1211, -94972, -104592, 25294, 54923, 101325, 80064, -145358, 62390, 13281, 70737, -131676, 193493, -271785, 130346, 322395, 290991, -117242, -258510, -101732, 188340, 280921, 271341, -108551, 42961, -307651, 28202, -40009, 204903, -6646, 74494, -123504, 131292, -91871, 389634, -52444, -41778, -81672, -49942, 54990, 76589, -173575, 86752, 219176, 128289, -12437, 249352, -64143, -316597, -166847, 239718, 89087, -348825, 42208, -227761, -126124, 166537, -119552, 126289, 141777, 77858, 590804, 127649, 212836, 55334]
11080C24406j33220b7856A25008m7811k8544d6435C85226K6168A88597N0222J5948
11069B54767E6129f7426B82231I3982h158D0953J26639B2052L06011J00895k1403
11058D07555j88793m792L50327A545K15389r3599N8794I1035N58306k10642B18633
11046C27119K67052k14014o3907n4653M02846p7514K56181C69275A45377J78556
11036C23933K35749J34679k43057p961K38688B40894Q3904J83162j1201A98225
11025C84578l2893A62681J60104J01428j82125J30753J15443B18424J76253J36997
11015E31674p4078K52295l00483j4593j67974K72065A83301J68884n0819P9422
11005C80788m8281M9379A67803L53995K598k32284J74978j34798J78432A27251
$$ y = [324406, 191186, -27856, 125008, 77197, 48653, -46435, 385226, 411394, 188597, 238819, 254767, 56129, -67426, 282231, 93982, -8158, 40953, 167592, 22052, 328063, 428958, 407555, 218762, 213970, 564297, 1545, 216934, 123335, 182129, 91035, 649341, 438699, 218633, 327119, 594171, 380157, 316250, 261597, 664443, 586929, 843110, 369275, 145377, 323933, 559682, 694361, 451304, 443343, 682031, 240894, 324798, 507960, 496759, 198225, 384578, 351685, 162681, 322785, 424213, 242088, 372841, 488284, 218424, 394677, 531674, 457596, 709891, 409408, 394815, 226841, 498906, 183301, 352185, 301366, 380788, 332507, 381886, 167803, 521798, 524396, 292112, 467090, 332292, 510724, 127251]
10994B44075M8947J67912j61456m2287o9637M76434j37110j65133A44607L08144
10984D52751J6991J11385q5121J49924q1116K12784K69216l21362k07348L77876
10974H95980K2388P6829j84407K99131Q237K01902k62830L94909p9807K60512
10964A632844j20044J51360l97966K68567o08403O2413p2525L80809j50701j63948
10954I82406J80770M1479j9854j74633L62058m29450K71m50880J45995j76936
10944D61226l1956A62685k1481K15823J17164j86212j22223P9469h6120B11474
10933A74529a39308A58532P5520a21713m0264A78781h1536C30112D518e7931A80933
10921b15903a07327c2976j49881E7588J62996I7796a53849a6615k02036A39028
$$ y = [244075, 293022, 460934, 299478, 257191, 187554, 663988, 526878, 361745, 144607, 452751, 469742, 581127, 496006, 645930, 564814, 777598, 1046814, 725452, 518104, 895980, 918368, 995197, 810790, 1109921, 1118158, 1320060, 1057230, 1452139, 1372332, 1632844, 1512800, 1664160, 1266194, 1534761, 926358, 988771, 916246, 1297055, 1146354, 982406, 1163176, 1204655, 1184801, 1010168, 1372226, 942776, 943047, 492167, 638162, 461226, 429270, 162685, 141204, 357027, 474191, 287979, 165756, 245225, -86120, 211474, 174529, -139308, 158532, 234052, -121713, -161977, 178781, -81536, 330112, 4518, -57931, 180933, -215903, -107327, -32976, -182857, 57588, 220584, 97796, -153849, -16615, -218651, 139028]
10910b69274A81701n1407a02759k0990I340b09641O7707j59359O5986B58638j4976
10899B43662f3469K9051A00576a34388o4234L0483D9261J43070H1944K8417a5438
10887A36341a16015m0718o8163O416k3985i4468b1382A56250n7703B3360J02201
10876A25561a58117F6113a19934A06854N3541p4679J23814a58499A04254l6683
10866F7571F021k821J13967b19377Q6905A66391a02826C12482H6263l4825J95080
10855B46518A15910C8721A7929K24838e5794B27829q2495e1032k44150A29960
10844a37896A45209J6772c01382a32347B3658N6777a04760B71927L3079A36778
10833B9214f8683j09616A32775l422c4709I1390B315K4427a27289j2960a785k46015
$$ y = [-269274, 181701, 130294, -102759, -123749, 9340, -209641, -141934, -301293, -235307, 258638, 243662, -63469, -34418, 100576, -134388, -198622, -168139, 49261, 192331, 81944, 110361, -15438, 136341, -116015, -156733, -224896, -218480, -242465, -94468, -21382, 156250, 98547, 23360, 125561, -158117, 66113, -119934, 106854, 160395, 85716, 209530, -158499, 104254, 67571, 6021, 3200, 117167, -219377, -132472, 166391, -102826, 312482, 86263, 51438, 246518, 115910, 38721, 17929, 242767, -55794, 227829, 145334, -51032, -295182, 129960, -137896, 145209, 161981, -301382, -132347, 23658, 80435, -104760, 271927, 305006, 136778, 29214, -68683, -178299, 132775, 129353, -34709, 91390, 2315, 26742, -127289, -140249, -1785, -247800]
10821b47800O6044e7925o0758N5397A44222a78689b2959j20748f3006k84193i8866
10809a22816j70608B47752c9916q4191d9136k45224M2718Q7683n2791i9513r9513
10798a99026L1112N3548j10276A3306J40969k5275d31B73535h0951F4549h3703
10786a85206k10230a26119l05773A33047D8797L2286b01425g0592O288B52803
10775a37522K0003J7188M4737j22415B15171N4222c46582H139b99780J20088k00087
10764c79779J22273a15418j95749a35334r6344A59356E5344a33234c4287C04374
10753b84517f9536m4367j31082B12315a87525b0578k47286F5696J07414L2824
10743B05934b0944F4733L2302A3657a49314B49941C7783g0413J1306m1797g911
$$ y = [-247800, -181756, -57925, -118683, -63286, 144222, -178689, -22959, -143707, -63006, -347199, -98866, -122816, -293424, 247752, -39916, -124107, -49136, -294360, -251642, -163959, -216750, -99513, -199026, -167914, -114366, -224642, 13306, 154275, 129000, -431, 273535, -80951, 64549, -83703, -185206, -395436, -126119, -431892, 133047, 48797, 81083, -201425, -70592, -64304, 252803, -137522, -117519, -100331, -55594, -178009, 215171, 269393, -346582, 8139, -299780, -179692, -379779, -257506, -115418, -311167, -135334, -231678, 159356, 55344, -133234, -34287, 304374, -284517, -69536, -113903, -244985, 212315, -187525, -20578, -267864, 65696, 173110, 205934, -20944, 64733, 97035, 13657, -149314, 249941, 37783, -70413, -59107, -100904, -7911]
10731I7360J10183I8116b99063a00715C1472J23129c67868a01770A80914m4D306
10719A14c54466g1765J9558D0617R1606b1908l01229A16244A6503J24078a35367
10707a86775B60725C4a82426H1012b04098J3356P8952B20651i1963p9999m2357
10696b14319H0087b58614b4525j49871L9898N846G4324a19715B2572a23210N8765
10685f4445Q208l67785D2154p20a47011j02203P7791c1793j29630l084H332J41543
10673A49875c2862j62943A17919l1569a03412d5200C9321a44323a4925A15172
10662A46392D8323i8100k3790D1020R8734K4785b03485j9257j18247J47614k7246
10651b20621B3312N9193g2992C577L9940a22552j907A12638c62341A89272h5264
$$ y = [97360, 207543, 98116, -299063, -100715, 31472, 154601, -367868, -101770, 180914, 180870, 4306, 114, -354466, -71765, -52207, 40617, 132223, -21908, -323137, 116244, 16503, 140581, -135367, -186775, 260725, 34, -182426, 81012, -204098, -190742, -111790, 220651, -91963, -171962, -214319, 80087, -258614, -24525, -174396, -134498, -128652, 74324, -119715, 22572, -123210, -64445, -56237, -424022, 42154, 41434, -147011, -249214, -171423, -31793, -161423, -164507, 8332, 149875, -32862, -195805, 117919, 86350, -103412, -45200, 39321, -144323, -14925, 115172, 146392, 48323, -98100, -121890, 41020, 139754, 164539, -203485, -222742, -340989, -193375, -220621, 23312, 82505, -72992, 3577, 43517, -122552, -124459, 112638, -362341, 189272, -85264]
10639f0122A5815O3534a6935F7944J19858M2996b55326B60435b39288M3712A20760
10627d15028C4153g6316b5538A19254a11348H5703a48933a1239E7278f8322a3603
10615a29427M4810L117n05927I9491a39474C6004i1332j77512E2987b04175g4841
10603H6112a37206A00033c5932j50699l1621A96779b76525F4595a74747l18700
10593d93447c6504h923I6947l9987a4011B66775a82321C92700G2828h5520A2234
10581b22941a00346d6878A4941b84020c8097r2889j26028j75600d8412L953A03944
10569a42572M5596J9338b1694B8255K6510d1997A80829i5072j43091G2061Q9605
10558A61666f0718q4497E4981a59441B96810A062b4099C51504a05271q0910A18747
$$ y = [-60122, 15815, 79349, -16935, 67944, 187802, 230798, -255326, 260435, -239288, -195576, 120760, -415028, 34153, -76316, -25538, 119254, -111348, 85703, -148933, -11239, 57278, -68322, -13603, -129427, -84617, -81500, -587427, 99491, -139474, 36004, -91332, -268844, 52987, -204175, -74841, 86112, -137206, 100033, -35932, -186631, -218252, 196779, -276525, 64595, -174747, -493447, -36504, -8923, 96947, 56960, -14011, 266775, -182321, 392700, 72828, -85520, 12234, -222941, -100346, -46878, 14941, -284020, -38097, -130986, -257014, -432614, -48412, -44459, 103944, -142572, -96976, -77638, -21694, 28255, 54765, -41997, 180829, -95072, -238163, 72061, 161666, -60718, -145215, 54981, -159441, 296810, 1062, -24099, 351504, -105271, -186181, 118747]
10546A60579b1131j50625b4432r5281F3597a79137A5296J60284B0764K98390j15774
10535B03380b70309R4909j7649i5161m2444e0818C15973D3573j6357b78907C11396
10523a9549j02696C7928a5963f807A40977B5078O0397K55657A30795a5608B79672
10511b21301A25877J3835h939B31379b50161A622R4623a36358C52081G6419R3835
10500A70254o7524a91930e5432J2310k64130K4546A3477b3108D911a76098C1641
10488D2231H758e8281j02866H6138M5995N635A6326a78395A61357d3397C02997
10476E0391K16481A27171K2279b32975A32445a34926o3660m1860A66237m9974
10466A16263R4005j04819a66541j48755f9039K5979a4495J066l75057a72288B05018
$$ y = [160579, -21131, -171756, -24432, -119713, 63597, -179137, 15296, 175580, 20764, 319154, 203380, -270309, -175400, -193049, -95161, -137605, -50818, 315973, 43573, 27216, -278907, 311396, -19549, -122245, 37928, -15963, -6807, 140977, 25078, 85475, 341132, 130795, -15608, 279672, -221301, 125877, 139712, -8939, 231379, -250161, 1622, 96245, -136358, 352081, 76419, 170254, 102730, -191930, -55432, -43122, -307252, -282706, 13477, -23108, 4911, -176098, 31641, 42231, 8758, -58281, -161147, 86138, 132133, 137768, 16326, -178395, 161357, -43397, 302997, 50391, 266872, 127171, 149450, -232975, 132445, -134926, -198586, -240446, 166237, 116263, 210268, 105449, -166541, -315296, -69039, -43060, -14495, -13429, -388486, -172288, 205018]
10454a95240R4405A51820c82988h0163j9883A28195O3127p2000a28513M7634k0889
10443a01768H7259a11312d4490p4682o7652j7049P8677A9047a47258N9073a4583
10431E871N9369a60340E3336K19302a04833A65990f0478j67115K9267P6841B9056
10419a02728p7656e6651A24166a65843a0303j95207l05252a23501D120b98857
10408a9959k99128J0164h9587B0801e8795A70633h3216A12095a81523a3013A78181
10396g3468j08980N7528c2509p9018c807k42178a19286A11143Q0886R6809I5200
10384A29351k7999j7521C5842a33297d703j91778h6401p3335M2544C8474L65497
10373D03971j76538E4061Q1353a75936F5341J73653c2793D48608k06949I6760
$$ y = [-195240, -100835, 151820, -382988, -80163, -100046, 128195, 191322, 119322, -128513, -80879, -101768, 87259, -111312, -44490, -119172, -186824, -203873, -125196, 19047, -147258, -88185, -14583, 5871, 65240, -160340, 53336, 272638, -104833, 165990, -60478, -227593, -198326, -121485, 29056, -102728, -180384, -56651, 124166, -165843, -10303, -205510, -510762, -123501, 4120, -298857, -19959, -319087, -308923, -89587, 20801, -58795, 170633, -83216, 112095, -181523, -13013, 178181, -73468, -182448, -124920, -32509, -111527, -3807, -245985, -119286, 111143, 192029, 288838, 95200, 129351, 101352, 83831, 35842, -133297, -4703, -196481, -86401, -159736, -117192, 38474, 403971, 227433, 54061, 135414, -175936, 65341, 238994, -32793, 448608, 241659, 96760]
10362B47919K07575j77385r3362P7216d4368A70979H4994m1J87712i6347B28547
10350B0551J96313n4457K39300a11388B00273A2875J35149K05725R0570q0072
10340C64247j50740L6794L86622k81259a28320C85784A37987J79813h898j13651
10330a22549D1743P8705J31212c5099j6497A53562M8590b25259A9248b70243C5740
10318A55909P7764a39491B00322r6657g6109A35244a26073D9588J56127C4697
10307a08097M422M8630j00395r6844B53696c435A6979b41378B13157c3852j6007
10296d9859k38401C5510P4926a7010A09204a72950A74374G4741J16757E8344c7791
10284a35492f0955A04503e0016G3138a15432q3348p2811R6321B96226a12257r8727
$$ y = [247919, 455494, 278109, 184747, 261963, -44368, 170979, 84994, 84953, 272665, -96347, 228547, 20551, 216864, 162407, 401707, -111388, 200273, 12875, 148024, 353749, 444319, 364247, 213507, 250301, 636923, 355664, -128320, 385784, 137987, 317800, -8898, -122549, 41743, 120448, 251660, -35099, -51596, 153562, 202152, -225259, 19248, -270243, 35740, 155909, 233673, -139491, 200322, 103665, -76109, 135244, -126073, 49588, 205715, 34697, -108097, -103675, -55045, -155440, -252284, 253696, -3435, 16979, -241378, 213157, -33852, -49859, -288260, 35510, 110436, -17010, 109204, -172950, 174374, 74741, 191498, 58344, -37791, -135492, -60955, 104503, -50016, 73138, -115432, -198780, -271591, -175270, 296226, -112257, -210984]
10273b10984N7475N3397A43017F092J13894K79496A57563d91074G7945b10899
10262a04003J0503C49738a14518r493r2934d4817o0709C9891L14050l2223n0787
10251B70931J67837A68969C5682K50866D9247K05959P7677A27205D8683i0314
10240f6605l36702a67128A2271b26317k0432J19894B1436J71431b4611j65962
10230a90573e8176n0509K4463j6453a4105k98336g1573k18296D3683h5776K0225
10219f5551H2946k2462J12926h3286c0167j35083C23062c62853A3748J89471o1135
10208A42084C7447b30429k7889K2606m4498a4551l01303l1970A20430q624B8254
10196e3708k44580B04916o7873i7944l0976m1579J7058a2687j06324A04068a33591
$$ y = [-210984, -153509, -100112, 143017, 6092, 119986, 399482, 157563, -491074, 77945, -210899, -104003, -93500, 349738, -114518, -124011, -216945, -44817, -105526, 39891, 353941, 321718, 270931, 438768, 168969, 35682, 286548, 49247, 255206, 332883, 127205, 48683, -90314, -66605, -403307, -167128, 12271, -226317, -246749, -126855, 21436, 192867, -24611, -190573, -58176, -108685, -84222, -100675, -14105, -312441, -71573, -289869, 43683, -85776, -65551, 82946, 60484, 173410, -83286, -30167, -165250, 323062, -362853, 13748, 203219, 142084, 37447, -230429, -258318, -235712, -280210, -14551, -315854, -347824, 120430, 111806, 28254, -53708, -298288, 204916, 137043, -97944, -128920, -170499, -153441, -12687, -119011, 104068, -133591]
10184a61200N6165A45189A2328a679B7343R3100D8908O1000h9759p7110k4887
10173a91756e3457j59883i7412D86190b556l34980a61295M1787G0093c0557E6833
10161C6586a64946B55506a76129J8194j07568g7247k02632C5056c45703a55099
10150a76400c0440j9302F3230a58883a7086A01619a04282A60090c7392C3032a38983
10138B96573I5868D6916a51447D6274j4921M6591b4139E5845L2603J58319A23180
10126A98192c4107B70343d2036m9941A70403b35644B06091a39289d3124I3310
10115a18341n7751E1030a91584c8916o911o4292A2719m941J33613a72627A00798
10103C1783a41835k70477D26745a72852M1443d2063A0488h0687E7562a45599j06371
$$ y = [-161200, -105035, 145189, 12328, -1679, 27343, 120443, 48908, 109908, -89759, -166869, -191756, -53457, -213340, -97412, 486190, -2556, -337536, -161295, -119508, 70093, -30557, 56833, 36586, -164946, 255506, -176129, -157935, -265503, -77247, -279879, 35056, -345703, -155099, -176400, -30440, -49742, 63230, -158883, -17086, 101619, -104282, 160090, -37392, 33032, -138983, 296573, 95868, 46916, -151447, 46274, 31353, 77944, -24139, 55845, 88448, 246767, 123180, 198192, -34107, 270343, -42036, -91977, 170403, -235644, 206091, -139289, -43124, 93310, -118341, -176092, 51030, -191584, -38916, -45827, -110119, 12719, 7778, 141391, -172627, 100798, 31783, -141835, -412312, 426745, -172852, -131409, -42063, 10488, -80687, 57562, -145599, -251970]
10092b51970K0827m5479b392p2673A93328A2005k986b73906g0314B15218m7592
10081A67626a07521j07189A68613h422A71337D1844d6056q3833B17576D5953g6664
10069g0044o1910M4784A87660g0837o611j52946o9557F6919c20104b9084n7774
10058h6858A23215j4449g7512j46653M0961A9428a35548A664g5260c4985A34903
10046b69155d332B9596b42682A33628D0855c04430B36303b41067C00368G1397
10035a47982P0456k39981h8525r5727a4020A73543n2990a58920r9105a16669j61672
10024b78341B06947b81209h0995k02888A28958c37930J38594a2085q5381r6943
10014a94409k136A48770K15422a70682A4220a91236e7562D9166f5190j42197N5138
$$ y = [-251970, -231143, -276622, -2392, -75065, 193328, 12005, 9019, -273906, -70314, 215218, 167626, -107521, -214710, 168613, -8422, 171337, 41844, -46056, -129889, 217576, 45953, -76664, -70044, -131954, -87170, 187660, -70837, -77448, -230394, -299951, 66919, -320104, -29084, -86858, 123215, 108766, -77512, -224165, -183204, 19428, -135548, 1664, -75260, -34985, 134903, -269155, -4332, 29596, -242682, 133628, 40855, -304430, 236303, -241067, 300368, 71397, -147982, -77526, -317507, -88525, -184252, -14020, 173543, 120553, -158920, -258025, -116669, -278341, 206947, -281209, -80995, -283883, 128958, -337930, -199336, -12085, -97466, -194409, -196545, 148770, 364192, -170682, 14220, -191236, -57562, 49166, -65190, -207387, -152249]
10003a52249d8222l9438k02659a07757j71090L7106a13228F9693a56949A00271
9992H8971c6303k32842a16852G0544K67444j59260o7514f3871j58018L9756d1726
9980a63137b979B3400a58697B40268d4092l752j60077A91693C0453a32758j89899
9969c22657P6733a10185o3154I0506e2362j58146C2198N5576C8059b49410J18039
9958a31371F1264a17631e0316C10875c8231j0803k02797d0555k94233a15557p8894
9947a94451M8836c5062j24398A1894c03574L8380a3106k2591l38682J84922B21776
9935c50883i0741m3763A29490B0661a83089d2824C22975d128k42991D8248G786
9923a50404P3694j20375E454J43269a24030j61917M1483A86075a66690A56553
$$ y = [-152249, -48222, -87660, -290319, -107757, -278847, -241741, -113228, 69693, -156949, 100271, 88971, -36303, -269145, -116852, 70544, 337988, 178728, 111214, -63871, -221889, -182133, -41726, -163137, -2979, 23400, -158697, 240268, -44092, -47844, -207921, 191693, 30453, -132758, -322657, -245924, -110185, -173339, 90506, -52362, -210508, 32198, 87774, 38059, -249410, -131371, 61264, -117631, -50316, 310875, -38231, -49034, -251831, -40555, -334788, -115557, -194451, -145615, -35062, -159460, 11894, -303574, -265194, -13106, -35697, -374379, -189457, 221776, -350883, -90741, -134504, 129490, 20661, -183089, -42824, 322975, -4128, -247119, 48248, 7786, -150404, -76710, -197085, 5454, 148723, -124030, -285947, -244464, 186075, -166690, 156553]
9912f4024D711b10181k3262l50237c3583a1327k27759B99330a83652A36713b41735
9900b19491H4055K7054i6066C96264j91383r1272a34622e4761J3176A21561a61548
9888A60544C3862J12057o3043J88257a04371A13449c38429a075j79528C5564J8540
9877E4104J3917a52653A1368g9267N314G3295a91144r8389A2255J85812a74404
9865a19588q6298b0778j05444J1942q8643A11287D472L4180J08382C1771i8421
9853b59596A09020a56177I4143a48211D419f8558j37359B098b20358E4154H212
9841a53625j50533a22932E6207b41971o4560B50031a96422O1834r2763O8882q7672
9830b46141B5911c39286B4808P903a02147B0193a70042j15290g8410m8113j06187
$$ y = [-64024, 4711, -210181, -233443, -583680, -33583, -11327, -239086, 299330, -183652, 136713, -241735, -219491, 84055, 111109, -96066, 396264, 204881, 113609, -134622, -54761, -41585, 121561, -161548, 160544, 33862, 145919, 82876, 271133, -104371, 113449, -338429, -1075, -180603, 35564, 54104, 68021, -152653, 11368, -79267, -73953, 73295, -191144, -289533, 12255, 198067, -174404, -119588, -205886, -20778, -126222, -114280, -202923, 111287, 4472, 38652, 147034, 31771, -98421, -259596, 109020, -156177, 94143, -148211, 4419, -68558, -205917, 2098, -220358, 54154, 8212, -153625, -304158, -122932, 56207, -241971, -306531, 250031, -196422, -134588, -227351, -158469, -246141, 25911, -339286, 24808, 32711, -102147, 20193, -170042, -285332, -78410, -126523, -232710]
9819b32710M6709h5003m0618A55523c36917a60517O0192j04807K954D9864i8915
9807A33823k0077b6223j19093A97316c85086g7018m5296j8805d3516j46536N8994
9796a31058A00270a6321E020a644C5109G261P2853K13087j7509f8865j07450c6921
9783c90586a73678b1131k25442b6971E7943e6846J893k03035B2677L2060N7215
9772A11952i0250a3138A64344h7234A17412d8951j99535M3118d1412e434j97115
9761b02549I9255B9211a92898b8722m24088i4939d6467n6531C39026j20037b34144
9749c4168k4512j52371g7793L4044l18644a1795j14720l6014p3605e8953r7262
9738a56215j48950f6608k80633a36772L8531r3961f3823I5255L623c52346E8167
$$ y = [-232710, -186001, -85003, -125621, 155523, -336917, -160517, -100325, -205132, -202178, 49864, -98915, 133823, 113746, -26223, -145316, 197316, -385086, -77018, -122314, -141119, -43516, -190052, -131058, 100270, -16321, 5020, -1644, 35109, 7261, 80114, 293201, 275692, -68865, -176315, -36921, -390586, -173678, -21131, -246573, -26971, 57943, -56846, -54953, -257988, 22677, 54737, 111952, -90250, -13138, 164344, -87234, 117412, -48951, -248486, -205368, -41412, -5434, -202549, 99255, 29211, -192898, -28722, -452810, -94939, -46467, -102998, 339026, 218989, -234144, -34168, -58680, -211051, -77793, -43749, -362393, -11795, -126515, -162529, -236134, -58953, -156215, -305165, -66608, -347241, -136772, -98241, -192202, -63823, 95255, 98878, -352346, 58167]
9726g7781j00955r0215c6236j64948A24478f4575j4737m2195a9676n0150B35451
9714b63110J7569k26352A23035A2737K20122B4132a64388j38219L5659J03286
9704a63662B4079L3670d8038j97667D01885d24F2431h8737b9996C7409i5457N682
9692h9775A51403C7118K31079m8173C0231a43620D0127J25742m4897a06502B39195
9680D8890B0689e3426j34736C31143A2844L7225a75007C7960c28701a39230D1917
9668c02572e7728k98732J63363Q4645d3487j2340n1140d5155o0994b0392E4161
9656A16859J25385A08203O9462i6557c8527b523o7007j02465d0440k7066A22087
9644a46193A72695a88422g8571j08446A68855a03542D0690N4259g0731F905b62898
$$ y = [-77781, -178736, -268951, -36236, -201184, 124478, -64575, -79312, -121507, -19676, -69826, 235451, -263110, -245541, -471893, 123035, 12737, 232859, 24132, -164388, -302607, -266948, -163662, 24079, 57749, -48038, -245705, 401885, -424, 62431, -88737, -29996, 37409, -95457, -89775, 151403, 37118, 268197, 220024, 30231, -143620, 40127, 165869, 120972, -106502, 239195, 48890, 20689, -53426, -188162, 331143, 12844, 50069, -175007, 37960, -328701, -139230, 41917, -302572, -57728, -356460, -193097, -108452, -43487, -55827, -106967, -45155, -106149, -20392, 54161, 116859, 242244, 108203, 177665, -96557, -38527, -2523, -69530, -171995, -40440, -67506, 122087, -146193, 172695, -188422, -78571, -187017, 168855, -103542, 40690, 94949, -70731, 6905, -262898]
9632A71674a31974M5639p5805a8538j57775C35178i5306A45274L814a00799A4837
9620a25475K7797A1918E107K25771C8492a16515j19903m1126Q6347q0884m0128
9609c12209a02026L5516K6184j65217g9061l3152d2078j06873H4125a0694j52917
9598a63611H2204J69532a51260N5870P75k65630F8125a6451B17783a02708l8860
9587a41568f6313j09824N0O872A62730K50574b71577i994j14533C55470a93858
9575D2147M15912e184A7303J5016c06677K0352C2790a67078j31620D00259E4907
9563A14997a15152q6528B56867j10803a19422j14846c0017k46820a16877J0151
9553a06726m2516r8969J1996C13435e8820R654F2936A8399b40853r3800A89710
$$ y = [171674, -131974, -86335, -162140, -18538, -176313, 335178, -95306, 145274, 149088, -100799, 14837, -125475, -97678, 11918, 5107, 230878, 38492, -116515, -236418, -277544, -191197, -272081, -312209, -102026, -66510, -40326, -205543, -79061, -112213, -42078, -148951, 84125, -10694, -163611, 82204, 251736, -151260, -95390, -94615, -360245, 68125, -16451, 217783, -102708, -141568, -66313, -176137, -176087, -169215, 162730, 413304, -271577, -9994, -124527, 355470, -193858, 42147, 458059, -5184, 17303, 32319, -306677, -286325, 32790, -167078, -298698, 400259, 54907, 114997, -115152, -201680, 256867, 146064, -119422, -234268, -30017, -276837, -116877, -106726, -149242, -248211, -236215, 313435, -58820, -49166, 62936, 18399, -240853, -334653, 189710]
9541a98175M3250j23438B6365R7706k6100a37667O8289c3884j51431I0472j8232
9530G2240b01982A27576d9145A56109c8825A295h9597D1541c11257C0121a09237
9518G903K1958a28204C0341J00135a21962B42485a45022j1505b20l24797j8415
9507c43432J68542j4667f3128B44146c17350F4609f0614j67550F3811a4686j37485
9496a52171m0420i5595F641f52k7741m82302A959c31828b6284G4360j6472J02441
9484A60329O6943d3403j53176R6442l5475L2906j40598K1323B19048k7986L2285
9473B23347O3539d3839A67000c54325D3047M9421N0097e6958A49946g9962C9031
9461g9267A05b52943j53383a38476A40634k493b34076a04982M264J6739q8288
$$ y = [-198175, -154925, -278363, 26365, 124071, 97971, -137667, -69378, -33884, -185315, 90472, 72240, -201982, 127576, -49145, 156109, -38825, 1295, -89597, 41541, -311257, 30121, -109237, 7903, 29861, -128204, 30341, 130476, -121962, 242485, -145022, -156527, -220, -325017, -343432, -174890, -189557, -63128, 244146, -317350, 64609, -60614, -228164, 63811, -14686, -152171, -192591, -95595, 6641, -652, -28393, -510695, 1959, -331828, -26284, 74360, 57888, 160329, 227272, -43403, -196579, -100137, -135612, -102706, -243304, -221981, 219048, 191062, 223347, 286886, -43839, 167000, -354325, 43047, 92468, 142565, -56958, 149946, -79962, 39031, -79267, 105, -252943, -406326, -138476, 140634, 138141, -234076, -104982, -100718, -83979, -172267]
9450a72267H9564b03576g8603L0530a0670r4671A77535c94821a13136D3534g8873
9438A26201J7963a69875A48075d62302c1521n1833k44015F9747b38722A94125
9427b9278D0415b25196d5324l76993g0939O792A29193A3918b15988A5674R9119
9416A14793f3793l6754m9904o1737J04652A65205a09740A21445K9910o8910h4029
9404b29280d454G1644N2904a80144h578j36083F7477c23115J37531j24194A72839
9392c48079h6880k1766C150f9317A0581L2566Q8032b37068d8494j26838A05635
9380A37990i2673d5992c223k07043C56725A4205M6306J5897b46116l4583D236
9368I9174b258j08379B03569A5055K13283c79108P2366A49827f0605I7033g966
$$ y = [-172267, 89564, -203576, -78603, -48073, -10670, -105341, 177535, -394821, -113136, 43534, -78873, 126201, 144164, -169875, 148075, -462302, -31521, -83354, -327369, 69747, -238722, 194125, -29278, 40415, -225196, -45324, -422317, -70939, -64147, 129193, 13918, -215988, 15674, 114793, -63793, -100547, -150451, -212188, -107536, 165205, -109740, 121445, 151355, 82445, -84029, -229280, -4454, 71644, 124548, -180144, -8578, -144661, 67477, -323115, -185584, -309778, 172839, -348079, -86880, -108646, 3150, -69317, 10581, 43147, 131179, -237068, -48494, -175332, 105635, 137990, -92673, -45992, -3223, -210266, 356725, 14205, 60511, 76408, -246116, -280699, 4236, 99174, -2258, -110637, 203569, 15055, 228338, -379108, -306742, 149827, -60605, 97033, -7966]
9356G511c6726f144I4506D6822c15285J38867B09534a10994E2127a02412D3491
9344a57979l0619B40928j03279n1291m1989b48806A33606A3578P8485N7488c09415
9332g1811p2037d7877B39121d8088C3268o968h1408A60113h6896L01j04856R2043
9320i9408j22085H5112b25168f0495I9124D0939b50795a21759B77562b54103b4965
9308H3850d9638k05490j09763J08834i4236A69728R0952j19265b93469J756a29883
9296a20867O154j1411B61452A1451g2106n8173o2719g6125k15775f3977n1346
9285a15323E6654p104J05655a2096B19945F4215M6459A9008f9996k6327K2980
9274g3343B29832a2310k33126M7458e9587B14800g3476A14718E5454c98200c5941
$$ y = [7511, -36726, -6144, 94506, 46822, -315285, -176418, 209534, -110994, 52127, -102412, 43491, -157979, -188598, 240928, 137649, 86358, 44369, -248806, 133606, 13578, 92063, 149551, -309415, -71811, -143848, -47877, 239121, -48088, 33268, 26300, -81408, 160113, -86896, -86595, -191451, -99408, -221493, 85112, -225168, -60495, 99124, 40939, -250795, -121759, 277562, -254103, -24965, 83850, -49638, -255128, -364891, -256057, -94236, 169728, 260680, 141415, -293469, -291713, -129883, -120867, -114713, -126124, 261452, 11451, -72106, -130279, -192998, -76125, -291900, -63977, -115323, 56654, 49550, 155205, -12096, 219945, 64215, 110674, 19008, -69996, -96323, -73343, 229832, -12310, -245436, -197978, -59587, 214800, -73476, 114718, 55454, -398200, -35941]
9262a65113Q359e7692j74328J5362l4880d1510A65144a6203j15110D1483c30190
9250g6126j2036n910q5939c9344j6974j78645E0084Q5317a38003A68307k8577
9239A39730m5802a68914f7191A41482a13072G6989B9816j616a88757k7799d8485
9227G5617Q235Q6652e3298J1329j16130L718j71938f2272n6195B9117J59138b99776
9214e0893B23668e12991a51013B03902J83785I3451f978k42395A77179c04506
9203I1075O5005C3974b49133A16467M058M2705a21802A20684P8209c41109J58868
9192a82241g8964C700a67032m9003i4555E0590K78987b37612K6795B30830g6762
9180a77432I4973b4529E669K63664b74307N5118Q2217f1949j23985B06850k9207
$$ y = [-165113, -156754, -57692, -232020, -216658, -251538, -41510, 165144, -16203, -131313, 41483, -330190, -76126, -88162, -94072, -180011, -39344, -56318, -234963, 50084, 135401, -138003, 168307, 139730, 93928, -168914, -67191, 141482, -113072, 76989, 29816, 28200, -188757, -216556, -48485, 75617, 83852, 170504, -53298, -41969, -158099, -154381, -326319, -62272, -118467, 29117, 188255, -299776, -50893, 223668, -512991, -151013, 203902, 387687, 93451, -6978, -249373, 177179, -304506, 91075, 156080, 33974, -249133, 116467, 120525, 163230, -121802, 120684, 198893, -341109, -182241, -78964, 3700, -167032, -216035, -94555, 50590, 329577, -237612, -210817, 230830, -76762, -177432, 94973, -24529, 5669, 269333, -274307, -219189, -136972, -61949, -185934, 206850, 177643]
9169A77643J7353i9651A0618L80300e8204j4668k23673h1814E3104a9829E3540
9157D0856a88588d9169n286k5510D1052J64832b78038A06332g6608k13863F1215
9145b42301F1022m590b36879c1609A50775a97857j1732B13627B3933R7435L6769
9134A58137a02655b0952k54827i1314k1787j61335f6579B838g3625r0147G0774
9122a14156p405j4742B29235h0751l41124K02563K3935A19426c2895A17807D62
9110a73789j2524j7525A2588c52032R6397Q6271A3488J75988b6351k3693D7236
9098b82772B57845j20378a73209B7365a04557k37990E5620M7462f0637A3942d5399
9086A51757a82396C23964A37419c08774q1513H1928J80178b6090A62322B1601
$$ y = [177643, 194996, -99651, 10618, 390918, -58204, -72872, -296545, -81814, 53104, -19829, 53540, 40856, -188588, -49169, -54455, -79965, 41052, 205884, -278038, 106332, -76608, -290471, 61215, -242301, 61022, 56432, -236879, -31609, 150775, -197857, -209589, 213627, 23933, 121368, 158137, -102655, -20952, -275779, -91314, -113101, -274436, -66579, 2838, -73625, -163772, 70774, -114156, -121561, -136303, 229235, -80751, -421875, -219312, -195377, 119426, -32895, 117807, 462, -173789, -186313, -203838, 12588, -352032, -255635, -169364, 13488, 189476, -26351, -50044, 47236, -282772, 257845, 137467, -173209, 27365, -104557, -342547, 55620, 103082, -60637, 13942, -45399, 151757, -182396, 323964, 137419, -308774, -390287, 81928, 262106, -26090, 162322, 21601]
9075I8170a28125N0500c8607l75995A03612b00547d8439E638a1168j60374a5603
9063b6428l40162a71169j21345A48230D4146Q2723c3494r6600O1953g902I4331
9051b34758i9516r858A11163J14526a64969k35939a48391j49322N4474j08351
9041c51590A43021l2330m0926f3929F6093a78970B12615e237j33669B27325i4366
9029b04316h8885j2783B34807I2184b36409e3388A29705a03146p1278j7896f6611
9017h6019F2907a44676B49770a38278A41355a74532N8075r842I6426c29121H3705
9005f0766C17967H4843B2003A0848b13773B50355a50517K4099f883G4225a51516
8993A21776m4048o36h2984o693k05813A6674J06187k192L8792P9399a31243B97245
$$ y = [98170, -128125, -77625, -38607, -414602, 103612, -200547, -48439, 5638, -11168, -171542, -15603, -26428, -366590, -171169, -292514, 148230, 44146, 126869, -33494, -130094, -68141, -7902, 94331, -234758, -99516, -109374, 111163, 225689, -164969, -400908, -148391, -297713, -243239, -351590, 143021, 110691, 69765, -63929, 66093, -178970, 212615, -5237, -138906, 227325, -94366, -204316, -88885, -101668, 234807, 92184, -236409, -53388, 129705, -103146, -174424, -192320, -66611, -86019, 62907, -144676, 249770, -138278, 141355, -174532, -116457, -126299, 96426, -329121, 83705, -60766, 317967, 84843, 22003, 10848, -213773, 250355, -150517, -126418, -6883, 74225, -151516, 121776, 77728, 77092, -82984, -89677, -295490, 16674, 122861, 120669, 159461, 238860, -131243, 297245]
8980d65316b22711H0885g0044c94j69115M3229A55921e0964j49605j45845H9405
8968a3413k44255J01332L0618N2239D6511a83779F423f4203o7530A6602f9652
8956H3698B079J93352c49353J68123Q6291d6170j0316C09920a12181A2235K83972
8945B96207a55984A97116b646H5971a31159B13104a24229c3265m0814m9259C5230
8933A0429g0336C29540m4035f3261o8466A60339m4370A6696J22482c0233O067
8922b4166A11546J0161K30811J368404K639983A569527D64329A61654J41318m1471
8912B61501d51309f9459J7969A95633g0310j75625G2689h3453a1967A5330a13062
8900b93888N309e4690A67933a6175j185m2631l21449E9209i4523A28672A0568
$$ y = [-465316, -222711, 80885, -70044, -394, -169509, -126280, 155921, -50964, -200569, -346414, 89405, -13413, -257668, -156336, -125718, -73479, 46511, -183779, 6423, -64203, -131733, 16602, -69652, 83698, 2079, 195431, -349353, -181230, -94939, -46170, -56486, 309920, -112181, 12235, 296207, -155984, 197116, -2646, 85971, -131159, 213104, -124229, -33265, -74079, -123338, 35230, 10429, -70336, 329540, 285505, -63261, -131727, 160339, 115969, 16696, 139178, -30233, -24166, 111546, 121707, 352518, 1720922, 4360905, 1569527, 464329, 161654, 302972, 261501, -451309, -69459, -51490, 195633, -70310, -245935, 72689, -83453, -11967, 15330, -113062, -293888, -288579, -54690, 167933, -16175, -17360, -59991, -381440, 59209, -94523, 128672, 10568]
8888b04910A12838a65037F5425A1966b25173l0174D8650E219J47937j5991e6699
8876A14024d33134B7606O0055a30915A13902b0096k24488a4070E3534B261b5296
8864D1312d07387B3815a55564M6651A28063A7878h1337D1997f6415j1293I9791
8852I3984c7282k32760A31942a5025j69063L361K6150K4943H4983g8104k37604
8841c15708R8762j08763a20723j94494b9280j14404a8657k87747J47746K8852
$$ y = [-204910, 112838, -165037, 65425, 11966, -225173, -255347, 48650, 5219, 153156, 137165, -56699, 114024, -433134, 27606, 87661, -130915, 113902, -20096, -244584, -14070, 53534, 2261, -25296, 41312, -407387, 23815, -155564, -108913, 128063, 17878, -81337, 41997, -66415, -77708, 99791, 93984, -37282, -270042, 131942, -15025, -184088, -180727, -154577, -129634, 84983, -78104, -315708, -216946, -325709, -120723, -315217, -29280, -143684, -18657, -306404, -158658, -129806]
$$ [...]
##END NTUPLES=NMR SPECTRUM
##END=
