##TITLE=NES1019_944594_9265988_20jGaNkMBR
##JCAMPDX= 6.0         $$ Bruker NMR JCAMP-DX V2.0
##DATA TYPE= NMR SPECTRUM
##DATA CLASS= NTUPLES
##ORIGIN= BRUKER
##OWNER= Administrator
$$ 1.72 TOPSPIN		Version 2.1
$$ 2015-07-09 17:33:25.738 -0700  Administrator@X
$$ Compression mode = diff/dup
##.OBSERVE FREQUENCY= 400.02188249412
##.OBSERVE NUCLEUS= ^1H
##.ACQUISITION MODE= SIMULTANEOUS (DQD)
##.ACQUISITION SCHEME= undefined
##.AVERAGES= 64
##.DIGITISER RES= 22
##SPECTROMETER/DATA SYSTEM= spect
##.PULSE SEQUENCE= noesygpps1d.comp
##.SOLVENT NAME= COFFEE_meoh
##.SHIFT REFERENCE= INTERNAL, COFFEE_meoh, 1, 14.9631
##AUDIT TRAIL= $$ (NUMBER, WHEN, WHO, WHERE, PROCESS, VERSION, WHAT)
$$ ##TITLE= Audit trail, TOPSPIN		Version 2.1
$$ ##JCAMPDX= 5.01
$$ ##ORIGIN= Bruker BioSpin GmbH
$$ ##OWNER= Administrator
$$ $$ E:\/data/COFFEE/nmr/NES1019_944594_9265988_20jGaNkMBR/12/pdata/1/auditp.txt
$$ ##AUDIT TRAIL=  $$ (NUMBER, WHEN, WHO, WHERE, PROCESS, VERSION, WHAT)
(   1,<2015-07-09 17:33:20.160 -0700>,<Administrator>,<X>,<go>,<TOPSPIN 2.1>,
      <created by zg
	started at 2015-07-09 17:21:50.831 -0700,
	POWCHK enabled, PULCHK disabled,
       configuration hash MD5:
       21 0F 79 D6 B3 7B B4 F6 88 20 88 DB 03 48 BD 9F
       data hash MD5: 64K
       0D 7E 1F 24 64 F8 1F F3 5F 1A C0 02 CD B5 46 A7>)
(   2,<2015-07-09 17:33:23.644 -0700>,<Administrator>,<X>,<proc1d>,<TOPSPIN 2.1>,
      <Start of raw data processing
       efp LB = 0.3 FT_mod = 6 PKNL = 1 PHC0 = 0 PHC1 = 0 SI = 128K 
       data hash MD5: 128K
       39 B2 D2 44 D3 8D 65 D7 2F 04 E3 3A F2 BF BC CB>)
(   3,<2015-07-09 17:33:24.550 -0700>,<Administrator>,<X>,<proc1d>,<TOPSPIN 2.1>,
      <pk PHC0 = -86.33606 PHC1 = 0 
       data hash MD5: 128K
       FE 25 1D 1F BA B5 29 CC 65 A0 68 F9 B4 89 3C 73>)
(   4,<2015-07-09 17:33:24.941 -0700>,<Administrator>,<X>,<proc1d>,<TOPSPIN 2.1>,
      <abs ABSG = 1 
       data hash MD5: 128K
       F4 1C 26 85 7E DD 18 17 52 6E 99 17 F8 64 D9 11>)
(   5,<2015-07-09 17:33:25.050 -0700>,<Administrator>,<X>,<proc1d>,<TOPSPIN 2.1>,
      <abs ABSG = 2 
       data hash MD5: 128K
       21 2C 52 9D D5 F7 64 A8 99 10 5B 12 06 24 AA 26>)
(   6,<2015-07-09 17:33:25.128 -0700>,<Administrator>,<X>,<proc1d>,<TOPSPIN 2.1>,
      <abs ABSG = 3 
       data hash MD5: 128K
       67 9B 54 65 CF EC 31 4C 0C BF 44 44 05 8D E7 CE>)
(   7,<2015-07-09 17:33:25.238 -0700>,<Administrator>,<X>,<proc1d>,<TOPSPIN 2.1>,
      <abs ABSG = 4 
       data hash MD5: 128K
       65 3A F6 DF AD F0 02 8E B3 FE 6B EA 7B 05 BC 0D>)
(   8,<2015-07-09 17:33:25.347 -0700>,<Administrator>,<X>,<proc1d>,<TOPSPIN 2.1>,
      <abs ABSG = 5 
       data hash MD5: 128K
       AB 9E D6 02 D2 E6 3E 8E 8B A0 DF 08 17 41 FA AE>)
$$ ##END=
$$ 
$$ $$ hash MD5
$$ $$ 86 6A 15 A9 58 41 30 08 D9 1B AF F5 57 91 CA 08
##$RELAX= 
##$RELAX= 
##$RELAX= 
##$RELAX= 
##$RELAX= 
##$RELAX= 
##$RELAX= 
##$RELAX= 
$$ Bruker specific parameters
$$ --------------------------
##$DU= <E:\>
##$EXPNO= 12
$$ [...]
150 150 150 150 150 150 150 150
##$TP07= 0
##$TPNAME0= <>
##$TPNAME1= <>
##$TPNAME2= <>
##$TPNAME3= <>
##$TPNAME4= <>
##$TPNAME5= <>
##$TPNAME6= <>
##$TPNAME7= <>
##$TPOAL= (0..7)
0.5 0.5 0.5 0.5 0.5 0.5 0.5 0.5
##$TPOFFS= (0..7)
0 0 0 0 0 0 0 0
##$TUNHIN= 0
##$TUNHOUT= 0
##$TUNXOUT= 0
##$USERA1= <user>
##$USERA2= <user>
##$USERA3= <user>
##$USERA4= <user>
##$USERA5= <user>
##$V9= 5
##$VALIST= <valist>
##$VCLIST= <CCCCCCCCCCCCCCC>
##$VD= 0
##$VDLIST= <DDDDDDDDDDDDDDD>
##$VPLIST= <PPPPPPPPPPPPPPP>
##$VTLIST= <TTTTTTTTTTTTTTT>
##$WBST= 2048
##$WBSW= 25
##$XGAIN= (0..3)
0 0 0 0
##$XL= 0
##$YL= 0
##$YMAX_a= 7594267
##$YMIN_a= -16459765
##$ZGOPTNS= <>
##$ZL1= 120
##$ZL2= 120
##$ZL3= 120
##$ZL4= 120
##$ABSF1= 14.9631
##$ABSF2= -5.595081
##$ABSG= 5
##$ABSL= 3
##$ALPHA= 0
##$AQORDER= 0
##$ASSFAC= 0
##$ASSFACI= 0
##$ASSFACX= 0
##$ASSWID= 0
##$AUNMP= <proc_prof1d_extract.lims>
##$AXLEFT= 0
##$AXNAME= <>
##$AXNUC= <1H>
##$AXRIGHT= 0
##$AXTYPE= 0
##$AXUNIT= <>
##$AZFE= 0.1
##$AZFW= 0.1
##$BCFW= 0
##$BC_mod= 0
##$BYTORDP= 0
##$COROFFS= 0
##$CY= 15
##$DATMOD= 1
##$DC= 0
##$DFILT= <>
##$DTYPP= 0
##$F1P= 0
##$F2P= 0
##$FCOR= 0.5
##$FTSIZE= 131072
##$FT_mod= 6
##$GAMMA= 0
##$GB= 0
##$INTBC= 1
##$INTSCL= 1
##$ISEN= 128
##$LB= 0.3
##$LEV0= 0
##$LPBIN= 0
##$MAXI= 10000
##$MC2= 0
##$MEAN= 0
##$ME_mod= 0
##$MI= 0
##$NCOEF= 0
##$NC_proc= -2
##$NLEV= 6
##$NOISF1= 0
##$NOISF2= 0
##$NSP= 0
##$NTH_PI= 0
##$NZP= 0
##$OFFSET= 14.9631
##$PC= 1
##$PHC0= -86.33606
##$PHC1= 0
##$PH_mod= 1
##$PKNL= yes
##$PPARMOD= 0
##$PPDIAG= 0
##$PPIPTYP= 0
##$PPMPNUM= 2147483647
##$PPRESOL= 1
##$PSCAL= 4
##$PSIGN= 0
##$PYNMP= <proc.py>
##$REVERSE= no
##$SF= 400.020008796583
##$SI= 131072
##$SIGF1= 0
##$SIGF2= 0
##$SINO= 400
##$SIOLD= 131072
##$SPECTYP= <>
##$SREGLST= <1H.CDCl3>
##$SSB= 0
##$STSI= 131072
##$STSR= 0
##$SW_p= 8223.68421052631
##$SYMM= 0
##$S_DEV= 0
##$TDeff= 65536
##$TDoff= 0
##$TI= <>
##$TILT= no
##$TM1= 0
##$TM2= 0
##$TOPLEV= 0
##$USERP1= <user>
##$USERP2= <user>
##$USERP3= <user>
##$USERP4= <user>
##$USERP5= <user>
##$WDW= 1
##$XDIM= 131072
##$YMAX_p= 418966686
##$YMIN_p= -14496
##$CURPLOT= <Network HP LaserJet P1505>
##$CURPRIN= <$Network HP LaserJet P1505>
##$DFORMAT= <normdp>
##$LAYOUT= <+/1D_H.xwp>
##$LFORMAT= <normlp>
##$PFORMAT= <normpl>
##$SURQMSG= 1
$$ End of Bruker specific parameters
$$ ---------------------------------
##NTUPLES= NMR SPECTRUM
##VAR_NAME=  FREQUENCY,     SPECTRUM/REAL,   SPECTRUM/IMAG
##SYMBOL=    X,             R,               I
##VAR_TYPE=  INDEPENDENT,   DEPENDENT,       DEPENDENT
##VAR_FORM=  AFFN,          ASDF,            ASDF
##VAR_DIM=   131072,        131072,          131072
##UNITS=     HZ,            ARBITRARY UNITS, ARBITRARY UNITS
##FACTOR=    0.0627417313425164, 1,          1
##FIRST=     8223.62146879497, 2337,         -51843
##LAST=      0,             3157,            -51439
##MIN=       0,             -14496,          0
##MAX=       8223.62146879497, 418966686,    0
$$ Real data points
##PAGE= N=1
##DATA TABLE= (X++(R..R)), XYDATA
$$ [...]
67415 109541 109478 109061 109021 109420 109846 110205 110823 111875 113127 114202 114780 114620 113807 112926 112530 112399 111766 110368
67397 110368 108811 107746 107142 106677 106412 106630 107256 107927 108602 109595 110881 111763 111588 110617 109865 110070 111077
67380 111077 112313 113559 114974 116516 117735 118244 118115 117637 116901 115816 114431 113028 111996 111746 112582 114400
67364 114400 116541 118207 119061 119307 119256 119058 118863 118953 119470 120130 120455 120375 120431 121202 122496 123363 123090 121973 120839
67345 120839 120013 119256 118643 118820 120094 121908 123703 125769 128553 131474 133309 133749 133767 134251 135005 135425 135504
67328 135504 135613 135673 135185 134012 132701 131990 132222 133178 134312 135174 135761 136383 137141 137723 137864 137767 137812 138048 138288
67309 138288 138547 139030 139738 140461 141177 142119 143358 144613 145656 146645 147819 149056 149963 150344 150380 150345 150325 150196
67291 150196 149770 148955 147875 146874 146315 146363 146915 147630 148029 147792 147201 147140 148263 150178 151815 152708 153480 154799
67273 154799 156306 157082 156967 156789 157244 158179 159151 160168 161465 162895 163984 164503 164624 164635 164734 165027 165420 165577
67255 165577 165298 164981 165433 167138 169830 172784 175380 177359 178729 179570 179968 180153 180548 181429 182447 182805
67239 182805 182165 181137 180594 180672 180740 180287 179467 178846 178941 179938 181529 183047 184122 185150 186741 188791 190592
67222 190592 191839 192931 194175 195365 196413 197702 199316 200488 200512 199861 199688 200370 201208 201539 201519 201740 202607
67205 202607 204233 206415 208537 209899 210411 210637 211021 211436 211725 212212 213250 214572 215614 216385 217504 219338
67189 219338 221496 223335 224641 225630 226559 227615 229052 231036 233305 235243 236464 237204 237975 238945 239857 240516
67173 240516 241106 241939 243064 244277 245426 246566 247908 249687 251969 254467 256736 258698 260822 263504 266372
67158 266372 268597 269864 270632 271385 272075 272581 273326 274956 277511 280363 282969 285334 287641 289775 291433
67143 291433 292567 293493 294564 295898 297424 299106 300968 302921 304731 306328 308086 310483 313398 315960
67129 315960 317386 317850 318312 319570 321692 324267 326831 329009 330651 332083 334030 336994 340704 344348 347365
67114 347365 349905 352514 355514 358727 361817 364771 367864 371126 374038 376014 377147 378205 379848 382056
67100 382056 384413 386750 389315 392382 395868 399387 402689 405963 409534 413206 416233 418203 419717 421755
67086 421755 424506 427420 430275 433504 437240 440830 443803 446692 450265 454346 458171 461643 465499 470214
67072 470214 475384 480256 484361 487556 490009 492322 495213 498868 502876 506852 510798 514788 518741 522635
67058 522635 526651 530964 535676 540902 546607 552315 557408 561798 565950 570195 574489 578828 583317 587717
67044 587717 591568 595022 598922 603736 608984 614109 619290 624849 630448 635553 640296 645092 649813 654138
67030 654138 658530 663897 670299 676821 682899 688968 695496 702062 707938 713115 718204 723641 729494 735885
67016 735885 742999 750556 757743 764062 770085 777011 785361 794366 802907 810813 818884 827698 836890 845762
67002 845762 854097 862057 869677 876950 884195 891877 900097 908645 917483 926839 936809 947116 957255 966771
66988 966771 975544 984008 992845 1002233 1011629 1020561 1029293 1038319 1047595 1056842 1066259 1076189 1086311 1095981
66974 1095981 1105408 1115669 1127361 1139884 1152209 1163771 1174449 1184400 1194168 1204385 1215049 1225643
66962 1225643 1236125 1247131 1258854 1270500 1281338 1291677 1302216 1313071 1324086 1335568 1347866
66951 1347866 1360605 1373140 1385559 1398400 1411513 1424070 1435752 1447167 1458919 1470965 1483135
66940 1483135 1495672 1508833 1522297 1535321 1547384 1558595 1569662 1581392 1593864 1606075 1616894
66929 1616894 1626477 1636285 1647447 1659546 1671334 1682269 1692911 1704050 1715921 1728213 1740371 1751841
66917 1751841 1762405 1772506 1782990 1794265 1805775 1816481 1825851 1834219 1842177 1849911 1857322 1864579
66905 1864579 1872183 1880384 1888853 1897053 1904733 1911891 1918515 1924644 1930528 1936403 1942110 1947215 1951510 1955176
66891 1955176 1958487 1961593 1964556 1967380 1969949 1972189 1974261 1976326 1978135 1979167 1979330 1979192 1979341 1979749 1979930
66876 1979930 1979518 1978485 1976997 1975303 1973639 1971971 1969956 1967313 1964130 1960596 1956562 1951690 1945948 1939691
66862 1939691 1933223 1926619 1920016 1913729 1907848 1901870 1894986 1886730 1877307 1867395 1857706 1848611 1840016 1831606
66848 1831606 1823191 1814759 1806257 1797562 1788697 1779760 1770508 1760346 1749054 1737248 1725758 1714639 1703273
66835 1703273 1691356 1679290 1667508 1655904 1644207 1632458 1620833 1609268 1597621 1585970 1574403
66824 1574403 1562707 1550574 1538015 1525225 1512278 1499299 1486770 1475130 1464076 1452772 1440833
66813 1440833 1428721 1417027 1405762 1394515 1382978 1371105 1359005 1346955 1335282 1324020 1312780
66802 1312780 1301110 1288902 1276448 1264271 1252849 1242137 1231320 1219453 1206579 1193857 1182336
66791 1182336 1171938 1161904 1151833 1141847 1132034 1122235 1112326 1102307 1092134 1081820 1071604 1061736
66779 1061736 1052157 1042697 1033430 1024463 1015496 1006046 996075 986003 976117 966440 957129 948428 940074 931371
66765 931371 922168 913310 905660 899057 892638 885918 879046 872165 865088 857642 849944 842153 834212 825986
66751 825986 817461 808718 799868 791131 782880 775457 768914 762922 756925 750460 743467 736311 729467 723185
66737 723185 717444 712081 706850 701463 695744 689723 683456 676859 669934 663108 657056 652056 647748 643592
66723 643592 639396 635225 630995 626454 621544 616562 611861 607476 603058 598218 592976 587858 583377 579377
66709 579377 575092 570037 564672 559879 555914 552214 548254 544191 540499 537249 534035 530480 526623 522825
66695 522825 519416 516413 513523 510477 507294 504093 500701 496752 492229 487604 483266 479068 474669 470074
66681 470074 465627 461644 458282 455454 452638 449072 444529 439646 435136 430971 426872 423261 420927 419765
66667 419765 418630 416651 414033 411325 408544 405460 402210 399133 396257 393397 390554 387851 385240 382592
66653 382592 379925 377376 375077 373173 371665 370125 367951 365106 362194 359571 356882 353850 351004 349034
66639 349034 347773 346410 344469 342024 339204 336181 333483 331630 330416 329117 327405 325530 323692 321856
66625 321856 320121 318593 316856 314313 311163 308287 305974 303571 300761 298294 296815 295736 294113 292191
66611 292191 291097 291119 291140 289938 287441 284574 282318 281131 280806 280663 280024 278746 277223 275917 274975 274227
66595 274227 273356 272136 270669 269342 268335 267301 265809 264008 262524 261701 261277 260786 259962 258726 257156
66580 257156 255645 254719 254463 254354 253824 252762 251311 249517 247510 245792 244898 244806 245003 245156 245388 245828 246212
66563 246212 246085 245244 243853 242254 240796 239702 238948 238314 237607 236700 235364 233356 230889 228768 227612 227022
66547 227022 225946 224051 222325 221983 223009 224234 224729 224593 224241 223507 221978 219886 217935 216190 213797
66532 213797 210207 206224 203305 202066 201994 202402 202928 203106 202318 200629 199024 198211 197604 196106 193643 191208
66516 191208 189476 188061 186282 184047 181841 180295 179860 180419 180971 180302 178291 176147 175027 174792 174522 173801
66500 173801 172987 172480 172331 172497 172905 173237 173131 172722 172610 173085 173631 173405 172145 170448 169177 168642 168449 168137
66482 168137 167765 167617 167508 166907 165853 165167 165387 165913 165703 164475 162744 160950 159181 157593 156441 155631
66466 155631 154800 153929 153347 153013 152319 150890 149161 147880 147279 146939 146255 144923 143217 141904 141610 142143 142699
66449 142699 142818 142826 143239 144104 145098 145896 146169 145543 144015 142223 140987 140624 140863 141254 141394 140949 139834 138425
66431 138425 137300 136728 136556 136598 136935 137693 138666 139349 139437 139164 139051 139299 139639 139844 140157 141013 142455 144116
66413 144116 145685 147082 148162 148579 148116 146984 145691 144694 144154 143919 143753 143645 143722 143704 142787 140522 137617
66396 137617 135327 134039 133046 131736 130360 129406 128821 128295 127858 127715 127741 127553 126925 125835 124313 122554 120986
66379 120986 119951 119414 119154 118970 118531 117452 115909 114839 115035 116186 117256 117650 117554 117234 116605 115608 114514
66362 114514 113592 112769 111864 111066 110890 111649 112967 113969 114067 113587 113407 113904 114507 114463 113764 113020 112615 112364 111990
66343 111990 111557 111287 111110 110576 109288 107497 106130 105988 106888 107860 108177 107846 107084 105965 104863 104605 105513
66326 105513 106695 106961 106226 105408 105132 105273 105611 106070 106209 105352 103581 101983 101477 101861 102381 102760 103203 103796
66308 103796 104420 105037 105574 105658 104935 103581 102109 100768 99534 98630 98584 99571 101037 102155 102476 102023 101029
66291 101029 99775 98509 97297 96045 94804 93949 93826 94268 94700 94746 94525 94316 94191 94111 94141 94365 94714 95101
66273 95101 95574 96150 96635 96812 96715 96424 95807 94859 94179 94544 95888 97203 97646 97293 96569 95481 93906 92316
66255 92316 91583 92101 93465 94972 96129 96721 96761 96483 96196 96042 95918 95542 94553 92804 90715 89122 88534
66238 88534 88679 88952 89053 88999 88806 88528 88385 88496 88614 88459 88180 88147 88448 88873 89239 89475 89525 89487 89579 89696 89368
66217 89368 88549 88039 88496 89367 89481 88524 87189 86101 85375 85160 85663 86551 87178 87608 88533 89944 90790 90385
66199 90385 89370 88726 88541 88383 88259 88439 88732 88665 88226 87832 87757 88010 88572 89289 89740 89613 89048 88292 87313
66180 87313 86094 84952 84139 83455 82786 82617 83401 84701 85664 86185 86879 87999 89128 89995 90863 91890 92676
66163 92676 92797 92322 91541 90574 89500 88561 87927 87452 86897 86290 85889 85897 86274 86729 86840 86312 85175 83658 82006
66144 82006 80543 79718 79740 80234 80628 80862 81339 82164 82899 83183 83216 83385 83734 84027 84096 83906 83401 82472 81000
66125 81000 78906 76377 74091 72887 73030 74041 75349 76829 78518 80146 81292 81808 81864 81721 81700 82062
66109 82062 82614 82635 81675 80294 79559 79794 80311 80414 80182 80042 80027 79866 79549 79366 79449 79616 79625 79281 78376 76880
66089 76880 75298 74468 74752 75618 76207 76166 75694 74971 73921 72612 71544 71308 72060 73433 74906 76101 76815
66072 76815 76988 76770 76537 76657 77120 77491 77386 77009 77004 77655 78446 78661 78269 77912 78056 78540 78961 79122 78875 77977
66052 77977 76452 74933 74219 74521 75348 76088 76467 76518 76396 76301 76408 76790 77442 78283 79035 79204 78375 76526 74021
66033 74021 71473 69656 69179 69864 70676 70759 70424 70608 71446 72000 71610 70869 70839 71725 72822 73507 73809 74134 74868
66014 74868 76235 78097 79823 80686 80586 80195 80339 81333 82932 84644 85992 86682 86790 86774 87144 88012 88961
65997 88961 89466 89497 89634 90404 91474 91761 90543 88316 86323 85392 85429 85896 86325 86337 85587 84008 81929 79805
65979 79805 77912 76420 75456 74954 74605 74219 74010 74301 75104 76200 77450 78765 79934 80880 81942 83407
65963 83407 84739 84869 83524 81721 80571 79979 79065 77590 76324 75977 76399 77037 77725 78624 79616 80157 79785
65946 79785 78644 77453 76963 77363 78222 79064 79888 80885 81779 81921 81182 80369 80382 81245 82271 82910 83002 82433 81184
65927 81184 79818 79300 80029 81313 82102 81987 81238 80159 78895 77801 77509 78367 79977 81496 82349 82552 82365
65910 82365 81829 80761 79205 77680 76825 76806 77228 77595 77671 77399 76776 75959 75293 74970 74811 74591 74473 74838 75758
65891 75758 76928 78068 79095 79916 80316 80149 79411 78171 76761 75982 76551 78126 79384 79476 79007 79126 79941
65874 79941 80489 80088 79057 78002 77003 75789 74280 72692 71357 70638 70761 71481 72154 72320 72036 71527 70852
65857 70852 70082 69463 69090 68684 68061 67575 67653 68059 68099 67571 67062 67230 68125 69310 70305 70731 70372 69452 68686
65838 68686 68721 69492 70289 70556 70426 70376 70549 70719 70970 71946 74061 76608 78222 78348 77829 77830 78530 79196 79180 78478
65818 78478 77566 77134 77810 79601 81630 82843 83040 82874 82919 83149 83352 83554 83819 84004 84003 83996 84263 84858 85592 86218
65798 86218 86569 86638 86521 86162 85330 84084 83080 82961 83455 83563 82730 81417 80434 80163 80565 81432 82382 83023
65780 83023 83407 83990 84887 85562 85516 84899 84128 83324 82469 81732 81221 80713 80085 79741 80144 81188 82461 83811
65762 83811 85121 85842 85454 84283 83210 82551 81871 80868 79777 78753 77519 75970 74599 73927 73767 73368
65746 73368 72110 69946 67462 65680 65405 66468 67780 68353 68109 67587 67195 66992 66932 66924 66761 66312 65808 65722
65728 65722 66329 67455 68608 69275 69208 68552 67694 66929 66321 65856 65569 65476 65556 65858 66413 67027 67408 67608 68005
65709 68005 68646 68946 68398 67331 66506 66094 65584 64762 64244 64799 66466 68570 70300 71022 70416 68814 67229
65692 67229 66519 66468 66175 65458 65306 66622 68909 70725 71277 71047 70882 70972 70881 70235 69085 67801 66799 66269
65674 66269 66058 65913 65842 66040 66379 66276 65278 63616 62042 61230 61426 62458 63842 65074 66002 66851 67733 68359
65656 68359 68449 68251 68324 68901 69731 70504 71182 71896 72739 73649 74409 74889 75338 76184 77305 77851 77225 76040 75568
65637 75568 76297 77561 78612 79436 80319 81136 81494 81237 80496 79428 78229 77194 76436 75685 74670 73559 72699
65620 72699 72003 70967 69451 68127 67892 68918 70465 71606 71979 71776 71270 70642 70208 70388 71199 72009 72102
65603 72102 71451 70685 70413 70795 71653 72568 72878 72073 70418 68879 68198 68275 68658 69296 70403 71707 72385 71944
65585 71944 70882 70218 70407 70930 70997 70461 69832 69460 69041 68107 66726 65424 64500 63806 63220 62933 63044 63179
65567 63179 62813 61876 60813 60116 59994 60437 61334 62396 63126 63084 62319 61435 61094 61376 61742 61705 61385 61256 61477
65548 61477 61722 61684 61484 61491 61921 62695 63574 64335 64889 65291 65645 65953 66100 65955 65445 64628 63748 63108 62747 62360
65528 62360 61672 60760 59871 59139 58758 59187 60715 62871 64718 65805 66450 67036 67500 67671 67684 67835 68344 69497
65510 69497 71621 74596 77665 80112 81945 83601 85242 86665 87711 88320 88286 87435 86088 84976 84582 84830
65494 84830 85477 86490 87911 89588 91313 93077 94994 97004 98792 99977 100348 99993 99331 98904 98912 98943 98421
65477 98421 97475 97129 98346 100966 103878 106216 107993 109574 111089 112707 114959 118160 121730 124682 126830
65462 126830 128915 131501 134299 136818 139104 141366 143200 143722 142501 140042 137276 134730 132227 129282
65448 129282 125672 121582 117297 112945 108606 104473 100707 97353 94572 92659 91521 90406 88695 86713
65434 86713 85201 84101 82632 80631 78992 78469 78661 78551 77569 75778 73584 71618 70454 70010 69649 69185
65418 69185 69237 70174 71297 71754 71754 72094 72780 72989 72343 71439 71035 71243 71662 71837 71515 70824 70248 70141 70316 70397
65398 70397 70453 70976 72377 74784 78009 81250 83248 83455 82904 83167 84541 85981 86775 87282 87846 87977 87275
65381 87275 86478 86820 88601 90965 93004 94597 96245 98434 101321 104876 109232 114758 121727 130088 139794
65366 139794 151079 163915 177258 189440 199469 207436 213540 217320 218223 216429 212636 207337 200703
65353 200703 192982 184603 176043 167821 160403 153857 147874 142411 137994 135018 133095 131605 130659 130885 132287
65338 132287 133962 135069 135594 135916 136164 136337 136718 137675 139085 140312 140765 140277 139011 137234 135216 133077
65322 133077 130594 127365 123303 118831 114463 110366 106490 102925 99824 97079 94477 92117 90222 88501
65308 88501 86280 83543 81258 80219 79943 79308 78013 76730 75961 75449 74830 74181 73670 73174 72527 71816 71156
65291 71156 70489 69756 68973 68008 66700 65367 64715 64946 65364 65213 64541 63883 63427 63000 62579 62311 62150 61993
65273 61993 62066 62701 63730 64577 65011 65410 66165 67141 67853 67900 67162 65869 64616 64060 64419 65358 66336 66886 66623
65254 66623 65424 63800 62799 63224 65016 67470 69860 71732 72892 73498 74067 75060 76465 77998 79639
65239 79639 81615 83803 85532 86251 86148 85831 85551 85086 84332 83582 83088 82631 81794 80486 78997 77681 76816
65222 76816 76716 77559 78962 79945 79643 78122 76395 75528 75705 76229 76340 75856 74928 73475 71269 68556 66144
65205 66144 64612 63760 63060 62355 61736 61046 60032 58913 58245 58154 58237 58308 58753 59836 61099 61815 61801 61433 61101
65186 61101 60934 60915 60891 60600 59976 59388 59299 59764 60502 61379 62466 63624 64456 64782 64869 64995 65033 64705 64119 63784
65166 63784 64081 64842 65450 65272 64093 62344 60897 60395 60659 60883 60573 60092 60077 60505 60724 60428 60109 60314
65148 60314 60854 61126 60955 60682 60547 60503 60627 61175 62072 62821 63114 63159 63148 62841 62087 61396 61427 62016 62313 61906
65128 61906 61342 61355 62014 62923 63944 65292 66965 68431 69059 68759 68090 67806 68328 69601 71318 73173 74870
65111 74870 76053 76431 76163 76011 76905 79154 82115 84687 86156 86631 86863 87767 89894 93049 96404 99294
65095 99294 101946 105212 109561 114620 119760 124713 129443 133842 137972 142261 146950 151519 155173 157759
65081 157759 159725 161233 161946 161753 161079 160225 158878 156565 153226 149094 144330 139072 133538 127857 122030
65066 122030 116293 111223 107223 104120 101474 98969 96342 93294 89864 86598 83950 81735 79526 77324
65052 77324 75389 73612 71629 69460 67521 66005 64715 63582 62847 62630 62685 62731 62667 62299 61244 59423 57410
65035 57410 56037 55696 56168 56947 57593 57901 57959 57959 57935 57800 57658 57816 58362 59041 59777 60985 62892 64699 65028
65016 65028 63450 61099 59483 59008 59044 59131 59484 60283 61118 61480 61400 61213 60940 60344 59522 59006 59165 59816 60475
64997 60475 60799 60725 60414 60119 59992 59977 60018 60284 60902 61472 61243 59946 58265 57237 57298 57968 58387 58094 57376
64978 57376 56918 57019 57260 57102 56670 56654 57422 58603 59546 59888 59619 58996 58513 58591 59093 59457 59457 59488 59885 60353
64958 60353 60395 60026 59698 59648 59626 59240 58454 57823 58173 59747 61664 62631 62251 61222 60173 58974 57490 56267
64940 56267 55894 56139 56343 56351 56475 56841 57338 57944 58508 58489 57500 55965 54686 54015 53935 54598 55992 57344 57778
64921 57778 57518 57577 58199 58537 58072 57483 57720 58865 60270 61291 61585 61287 61187 62134 63867 64995 64539 62991
64903 62991 61442 60248 59119 58054 57441 57376 57459 57250 56546 55335 53835 52499 51689 51404 51531 52146 53285
64886 53285 54644 55807 56640 57142 57161 56604 55822 55369 55430 55786 56252 56826 57433 57887 58113 58163 58014 57586 57045
64867 57045 56805 57118 57807 58455 58799 58951 59269 59967 60792 61185 60880 60262 60026 60507 61412 62108 62098 61333 60204
64848 60204 59185 58452 57910 57592 57773 58592 59731 60647 61021 60847 60265 59443 58546 57714 57122 57068 57782 59121
64830 59121 60684 62268 63893 65324 66007 65727 64973 64307 63732 63008 62277 61876 61795 61828 62094 62814 63617 63709 62865
64811 62865 61778 61250 61423 61979 62651 63277 63616 63472 62859 61939 60950 60288 60352 61094 61923 62318 62377 62583 63185
64792 63185 64054 64983 65795 66197 65928 65185 64595 64472 64306 63329 61576 60033 59566 60023 60694 61442 62834 65104
64774 65104 67499 68998 69374 69219 69077 68957 68604 67901 66931 65947 65298 65160 65333 65477 65519 65589 65677 65677 65706 65925
64754 65925 66011 65338 63906 62657 62495 63309 64325 65079 65564 65642 64972 63631 62348 61869 62341 63437 64828
64737 64828 66340 67826 69114 70045 70513 70522 70216 69759 69209 68635 68289 68410 68862 69215 69283 69291 69414 69439 69109 68550
64717 68550 68109 67979 68211 68845 69699 70254 70205 70030 70505 71595 72343 72019 71014 70341 70573 71504 72583 73355
64699 73355 73631 73501 73129 72484 71460 70370 69979 70739 72202 73532 74430 75187 75997 76656 76944 76849 76349 75361
64681 75361 74098 73113 72748 72726 72526 72042 71677 71858 72631 73683 74666 75509 76424 77525 78481 78763 78271 77559
64663 77559 77234 77309 77383 77329 77493 78138 78978 79473 79458 79153 78630 77662 76320 75357 75489 76355 76664 75578 73590
64644 73590 71855 71010 70925 71229 71577 71594 71105 70516 70528 71324 72253 72470 71687 70331 69162 68803 69354 70318 70980
64625 70980 70921 70184 69094 68090 67485 67187 66822 66431 66746 68274 70308 71520 71520 71144 71124 71256 71197 71297 71974
64606 71974 72805 72961 72337 71548 70967 70390 69654 69004 68644 68341 67766 67041 66760 67485 69186 71095 72278 72506
64588 72506 72439 72784 73516 74181 74708 75420 76350 77140 77737 78603 79916 81045 81304 80979 81020 81744 82395 82175 81300
64569 81300 80658 80643 80754 80335 79321 78167 77364 77210 77729 78537 79003 78890 78695 78963 79397 79129 77968 76878
64551 76878 76909 77975 78971 78927 77834 76481 75784 76200 77557 79310 80951 82166 82783 82800 82460 82046 81556 80828
64533 80828 79956 79245 78711 78061 77316 77000 77415 78075 78243 77719 76714 75241 73198 70932 69214 68556 68891
64516 68891 69875 71123 72117 72410 72122 71954 72398 73139 73465 73121 72454 71787 71036 70117 69453 69649 70689 71887
64498 71887 72753 73539 74577 75498 75652 75111 74568 74280 73823 73038 72464 72456 72561 72303 72055 72471 73401 74066 74147 74093
64478 74093 74432 75253 76280 77002 76818 75583 73956 72832 72433 72334 72218 72139 72161 72283 72689 73555 74619 75514
64460 75514 76486 78157 80419 82187 82538 81608 80108 78441 76729 75322 74756 75174 76097 76770 76730 76199 75906
64443 75906 76330 77134 77630 77695 77752 77835 77358 76100 74865 74595 75240 76047 76682 77450 78462 79279 79542 79465 79458 79535
64423 79535 79390 78845 78042 77294 76964 77332 78289 79207 79427 78985 78617 78862 79434 79733 79718 79741 79674 78866 77229 75719
64403 75719 75247 75538 75657 75390 75434 76318 77813 79395 80687 81343 81133 80439 80139 80649 81442 81809 81777 81942 82713
64384 82713 84015 85512 86797 87501 87519 87045 86271 85237 84109 83270 82824 82344 81503 80701 80626 81281 81925 81968
64366 81968 81499 80892 80399 80283 80891 82201 83547 84248 84429 84833 85806 86840 87263 87067 86734 86484 86086 85365
64348 85365 84477 83613 82792 82162 82113 82840 83986 85094 86193 87621 89379 91076 92462 93652 94827 96002
64332 96002 97164 98338 99504 100712 102244 104340 106706 108622 109649 109974 110014 109967 109796 109394 108641 107575
64316 107575 106511 105769 105250 104588 103692 102778 101904 100965 100249 100395 101532 102887 103616 103663 103495 103417 103609 104458
64298 104458 106174 108157 109278 108995 107915 107195 107519 108646 109777 110343 110469 110657 111110 111688 112523 114216
64282 114216 117103 120655 123927 126440 128375 130239 132645 136030 140106 143740 145948 146927 147670 148712 149708
64267 149708 150133 149742 148351 145807 142468 139146 136295 133668 131036 128786 127360 126481 125472 124132 122780
64252 122780 121570 120297 118940 117863 117284 116978 116741 116814 117526 118779 120254 121922 123917 126032 127829 129363
64236 129363 131330 134300 138116 142252 146375 150265 153506 155755 157210 158408 159623 160770 161806 162799
64222 162799 163640 164085 164100 163817 163147 161913 160402 159219 158352 156908 154219 150907 148395 147534 148046 149155
64206 149155 150326 151414 152499 153733 155207 156879 158695 160706 162922 165145 167122 168812 170363 171826
64192 171826 173059 173951 174662 175539 176775 178180 179301 179792 179678 179244 178802 178557 178522 178427 177899 176869 175638
64175 175638 174356 172715 170530 168316 166829 166176 165892 165729 165725 165578 164804 163750 163632 165151 167660 170138
64159 170138 172455 175108 178277 181816 185872 190800 196508 202383 207919 213182 218764 225470 233707 242846
64145 242846 251514 258888 265353 271530 277141 281443 284360 286367 287401 286761 284129 279986 274844 268773
64131 268773 261986 255276 249390 244233 239086 233469 227542 221775 216496 211802 207796 204634 202190 199811
64117 199811 196823 193385 190415 188477 187224 186250 185927 186768 188426 190066 191459 192918 194340 195302 196116
64102 196116 197806 200713 203985 206883 209851 213730 218549 223741 229164 235120 241533 247828 253739 259734
64088 259734 266376 273511 280359 286341 291676 297002 302412 307043 309804 310386 309378 307517 305177 302502
64074 302502 299652 296722 293676 290425 286827 282669 277925 273062 268733 265174 262204 259824 258422 258261
64060 258261 259096 260457 262012 263562 265086 266943 269681 273360 277334 280849 283733 286407 289567 293936
64046 293936 299941 307328 315362 323611 332298 341706 351589 361447 371123 380760 390347 399632 408434 416805
64032 416805 424941 433016 440979 448422 454816 460034 464502 468801 473318 478268 483627 488909 493442 497202
64018 497202 501111 506147 512376 519062 525422 530888 535000 537633 539382 541299 544126 547974 552725 558508
64004 558508 565705 574625 585126 596488 607819 618853 630308 643315 658579 676151 695728 716817
63992 716817 738773 761128 784008 807988 833494 860550 889164 919749 952998 989437 1029196
63981 1029196 1072272 1118890 1169505 1224367 1283307 1346165 1413298 1485321 1562486 1644856 1733242
63970 1733242 1829493 1935673 2053478 2184861 2332804 2500939 2692745 2911773 3162635 3451264
63960 3451264 3784280 4168561 4611425 5120548 5703170 6365055 7109451 7935950 8839844
63951 8839844 9812978 10845767 11928637 13051730 14203307 15367830 16524372 17646139
63943 17646139 18702036 19660210 20492110 21175558 21696071 22046245 22223440 22226946 22056331
63934 22056331 21711682 21195186 20513546 19680787 18719961 17661497 16538157 15379644 14210130
63925 14210130 13048820 11911552 10812021 9762643 8774937 7858965 7022123 6268275 5597657
63916 5597657 5007189 4491075 4041968 3652297 3314889 3022860 2769678 2549698 2358357
63907 2358357 2191530 2044938 1914422 1796771 1690023 1593087 1505147 1425227 1352027 1284178
63897 1284178 1220764 1161440 1105868 1053288 1002984 954961 909722 867424 827645 789973 754294
63886 754294 720427 687976 656845 627443 600099 574624 550789 528826 508882 490223 471681
63875 471681 452953 434976 418864 404868 392487 381189 370715 360882 351395 341949 332484 323396
63863 323396 315380 308974 304170 300500 297323 293970 289964 285518 281627 279159 277881 276814 275598 274935
63849 274935 275547 277219 279151 280817 282051 282595 282045 280170 277045 272970 268480 264192 260353 256648 252641
63834 252641 248175 243102 236996 229729 222171 215701 210884 207066 203419 199850 196609 193456 189821 185698
63820 185698 181834 178869 176597 174338 171818 169348 167184 165101 162794 160443 158537 157216 156070 154630
63806 154630 152790 150712 148598 146692 145303 144560 144202 143732 142745 141122 139142 137488 136865 137263 137750 137324
63790 137324 135950 134486 133599 133080 132336 131166 129801 128369 126807 125282 124330 124298 124851 125301 125359 125253 125135
63773 125135 124714 123678 122226 120945 120275 120253 120634 121048 121180 121035 120941 121074 121164 120869 120268 119639 119005 118331 118037
63754 118037 118697 120208 121836 123177 124492 125950 127225 128192 129459 131664 134658 137857 141049 144363 147744
63739 147744 151093 154803 159575 165708 172994 181237 190370 200057 209724 219191 228931 239522 251109 263425
63725 263425 275989 288049 298578 306672 311890 314145 313367 309449 302514 293151 282327 270961 259521
63712 259521 248055 236612 225538 215257 205954 197605 190184 183657 177881 172729 168271 164654 161881
63699 161881 159848 158491 157674 157047 156281 155421 154802 154650 155001 155935 157599 159983 162855 165939 169069 172332
63683 172332 176302 181929 189777 199405 209881 220785 232217 243863 254777 264472 273591 282916 292025
63670 292025 299530 304426 306586 306009 302403 295809 287022 276907 265664 253314 240651 229027 219114
63657 219114 210432 202308 194805 188402 183134 178563 174448 170975 168339 166469 165282 164914 165551 167183 169581
63642 169581 172410 175361 178286 181181 183968 186485 188896 191892 196082 201301 206930 212832 219492 227247
63628 227247 235918 245370 255920 267940 281389 295955 311273 326836 342160 357337 373103 390026
63616 390026 407767 425182 440715 452699 460085 463334 464055 463235 460354 454803 447607 440973 436356 433702
63602 433702 432313 431623 431143 430340 428780 426007 421421 414734 406383 396985 386520 374733 362204 350263
63588 350263 339684 330059 320593 311013 301605 292914 285547 279770 275175 271167 267779 265538 264566 264467 265125
63573 265125 266891 269802 273386 277524 282781 289486 297142 305304 314492 325690 339248 354753 371634
63560 371634 389374 407470 425757 444588 464207 483939 502255 517537 528660 535284 538084 538542
63548 538542 538042 537134 535850 534603 534447 536484 541125 547806 555312 562642 569690 576807 583631 588730 590599
63533 590599 588568 582530 572387 558319 541139 521743 500514 477773 454450 431594 409505 388121
63521 388121 368110 350604 335791 322651 310312 298884 288672 279439 271101 264436 260215 257897
63509 257897 255978 253631 251388 250196 250340 251470 253116 254888 256491 257914 259527 261809 265092 269683
63495 269683 275996 284252 294126 305000 316588 329118 342826 357551 372911 388658 404595 420239
63483 420239 434785 447505 458074 466410 472198 474611 472637 465934 455396 442687 429056 414748
63471 414748 399618 384001 368718 354417 341295 329397 318737 309091 300075 291637 284189 278086
63459 278086 273172 269019 265409 262361 259894 258013 256908 256873 257973 259923 262420 265544 269763 275471 282559
63444 282559 290576 299258 308761 319271 330650 342712 355700 370159 386303 403748 421834 440014
63432 440014 458037 476112 494895 514973 536206 557829 579233 600234 620368 638296 652230
63421 652230 660863 663790 661347 654415 644299 632492 620397 609216 599846 592677 587450 583403 579475
63408 579475 574489 567441 557843 545766 531540 515627 498747 481765 465185 448936 432916 417617
63396 417617 403937 392409 382821 374635 367606 361852 357373 353676 350146 346891 344949 345394 348307 352882
63382 352882 358371 364519 371209 378313 386116 395442 406995 420831 436646 454217 473282 493399 514344
63369 514344 536440 560112 585227 611153 637201 662529 685697 704861 718615 726579 729173 727147
63357 727147 721327 712590 701891 690267 678755 668106 658560 649906 641728 633544 624806 614925 603368
63344 603368 589804 574251 557079 538792 519835 500718 482158 464738 448473 433066 418588
63333 418588 405475 393800 383099 373201 364715 358229 353412 349362 345627 342341 339525 336851 334189
63320 334189 331963 330717 330528 330952 331466 331907 332533 333585 334791 335506 335438 334982 334625 334224 333128 330903 327753
63303 327753 324388 321645 320037 319373 318924 318150 317106 316023 314894 313840 313481 314312 315816 316857 317072 317281
63287 317281 318300 319837 321009 321719 322981 325745 329652 333223 335323 336220 337069 338537 340259 341583 342379
63272 342379 342943 343485 344094 344933 346116 347507 348928 350430 352089 353688 354896 355639 356035 356170 356262 356868 358463
63255 358463 360814 363132 364861 366082 367194 368534 370284 372446 374899 377692 381237 385920 391570 397620
63241 397620 403820 410487 418080 426783 436619 447681 460145 474187 489853 506852 524537 542314
63229 542314 560067 578001 596147 614283 632331 650494 668888 687231 704994 721786 737545
63218 737545 752461 766777 780659 794322 808179 822677 837890 853468 868998 884081 897963
63207 897963 909447 917462 921457 921107 916032 906113 891751 873498 851749 827090 800549 773143 745592
63194 745592 718848 694306 672771 653635 635886 619670 606076 595654 588059 583088 581103 582317
63182 582317 586405 592936 601500 611404 622125 634140 648369 664569 681214 697312 713426 730345
63170 730345 747664 764478 780782 797288 814148 830648 846013 859912 872243 882900 891678 898110
63158 898110 901571 901775 898842 892617 882319 867365 848253 826213 802272 777134 751685 726902
63146 726902 703235 680555 658776 638229 619392 602521 587532 574041 561596 550077 539757
63135 539757 530836 523147 516586 511500 508187 506166 504468 502695 501381 501169 502001 503315 504805 506734 509430
63120 509430 512636 515574 517819 519994 523251 528055 533802 539710 545637 551804 558175 564542 570906 577307
63106 577307 583424 588820 593399 597219 600006 601416 601763 601967 602614 603518 604304 604997 605745 606339 606360 605707 604704
63089 604704 603749 603009 602402 601752 601026 600495 600550 601257 602214 603049 604014 605847 609007 613166 617580 621785 625787
63072 625787 629708 633581 637593 642255 648072 655105 663031 671547 680568 690163 700623 712557 726562
63059 726562 742653 760168 778436 797515 818275 841788 868519 897923 928896 960846 994332
63048 994332 1030430 1069542 1111085 1154220 1198417 1243219 1287978 1332226 1376059 1419794 1463303
63037 1463303 1505942 1547094 1586619 1624887 1662481 1699821 1736915 1773384 1808720 1842444 1874177
63026 1874177 1903655 1930455 1953401 1970366 1979204 1978984 1969926 1952119 1924968 1888221 1843074 1791773
63014 1791773 1736420 1678594 1619929 1562406 1507902 1457561 1411618 1369771 1331918 1298725 1271318
63003 1271318 1250291 1235248 1225463 1220724 1221196 1226801 1237147 1251896 1270677 1292671 1316776 1342302
62991 1342302 1369156 1397198 1425739 1453918 1481328 1507973 1533702 1558038 1580693 1601922 1621964
62980 1621964 1640131 1654864 1664901 1669996 1670241 1665080 1653635 1635782 1612113 1582794 1547306 1505632
62968 1505632 1459041 1409194 1357066 1303322 1249202 1196167 1144854 1095155 1047380 1002662 961972
62957 961972 925260 891887 861620 834807 811681 791709 773756 756859 740803 725861 712098
62946 712098 699161 686755 675033 664304 654573 645507 636747 628133 619763 611872 604438 596931 588838
62933 588838 580493 572863 566342 560252 553882 547447 541588 536377 531452 526766 522480 518350 513963 509526
62919 509526 505707 502603 499478 495722 491592 487817 484937 483229 482833 483540 484667 485477 485847 486407 488008
62904 488008 490935 494558 497783 499916 501017 501455 501432 501025 500355 499389 497895 495921 494064 492854 492103 491241
62888 491241 490065 488701 487034 484771 482018 479261 476760 474434 472392 471077 470738 471100 471697 472259 472784
62873 472784 473467 474582 476176 477906 479411 480700 481958 483197 484428 485879 487510 488557 488236 486831 485444
62858 485444 484672 484082 482961 480976 478088 474549 471064 468292 466078 463803 461546 459990 458990 457190 453663
62843 453663 449079 444636 440558 436464 432605 429689 427660 425574 422734 419284 415628 411896 408115 404409
62829 404409 400838 397347 394026 391119 388694 386552 384531 382619 380717 378567 376079 373626 371815 371019
62815 371019 371113 371629 372155 372632 373323 374514 376297 378585 381221 384030 386971 390267 394308 399276 404952 410919
62799 410919 416934 423091 429710 437084 445246 454035 463433 473675 484893 496866 509421 522897 537882
62786 537882 554617 573086 593596 616754 642864 671921 704200 740201 779833 822404 867801
62775 867801 917067 971310 1030542 1094083 1161521 1232492 1305915 1380290 1454625 1528288 1599921
62764 1599921 1667236 1727959 1780446 1823348 1855408 1875818 1884162 1879789 1861869 1830526 1787425 1734765
62752 1734765 1674090 1606539 1533845 1458336 1382022 1306339 1232695 1162506 1096331 1033517 973205
62741 973205 915486 861290 811442 766143 725118 687785 653421 621740 593298 568790 547830
62730 547830 528984 511216 494806 480488 468256 457574 448322 440794 434842 429717 424771 419810 414805
62717 414805 409896 405814 403610 403631 405164 407377 410175 413918 418837 425164 433366 443641 455348 467557
62703 467557 480176 494151 510567 529893 552081 576951 604276 633732 665134 698771 735473
62692 735473 776177 821264 870268 922337 976903 1033637 1091685 1149324 1204628 1256193 1302910
62681 1302910 1343314 1375679 1398841 1412578 1417072 1412250 1397857 1373961 1341229 1300742 1253786 1201885
62669 1201885 1146882 1090701 1034869 980311 927599 877214 829440 784287 741895 702864 667763
62658 667763 636261 607258 580023 554837 532312 512460 494741 478673 464025 450615 438312
62647 438312 427128 417014 407652 398707 390190 382343 375232 368635 362235 355786 349242 342903 337208 332189
62633 332189 327389 322590 318294 315105 312835 310686 308164 305395 302688 300306 298591 297699 297128 296086 294520
62618 294520 293277 293020 293439 293855 294162 294781 296022 297959 300702 304304 308471 312775 317149 321852 326998
62603 326998 332530 338652 345822 354195 363517 373858 386046 400928 418377 437514 457876 479967
62591 479967 504612 532184 562612 595742 631310 668728 707212 746070 784691 822395 858549
62580 858549 892656 923973 951112 972404 986796 994125 994528 988019 974835 955796 931925 903951
62568 903951 872572 839092 805224 772043 739431 706854 674536 643555 614795 588200 563237
62557 563237 539801 518223 498455 479776 461521 443821 427291 412234 398455 385685 373787
62546 373787 362594 351984 342177 333702 326927 321770 317758 314235 310601 306715 303078 300378 298868 298401
62532 298401 298848 300057 301547 302808 303974 305728 308467 312005 316105 320685 325401 329735 333859 338804
62518 338804 345389 353524 363022 374414 388257 404033 420654 437937 456872 478397 502537 528828
62506 528828 556943 586586 617215 648247 679397 710477 740834 769144 793881 814111 829740
62495 829740 840869 846989 847079 840528 827678 809470 787022 761705 735067 708247 681708 655820
62483 655820 631332 608877 588412 569593 552437 537088 523234 510367 498508 488071 479105 471150
62471 471150 463833 457126 451120 446029 442338 440352 439589 439142 438711 438781 439707 441156 442589 443805 444857 445825
62455 445825 446916 448368 450072 451647 453054 454760 457110 459806 462198 463722 463885 462207 458508 453064
62441 453064 446300 438511 430011 421195 412257 403062 393580 384245 375723 368466 362577 357837 353702 349592
62427 349592 345523 342291 340817 341391 343713 347414 352259 357994 364323 371058 378153 385645 393718 402679
62413 402679 412641 423222 433739 443786 453541 463456 473626 483390 491569 497192 500112 500917 500279 498483
62399 498483 495527 491507 486795 481926 477312 473000 468723 464343 460121 456383 452943 449215 445013 440986
62385 440986 438016 436411 435950 436608 438893 443394 450257 459222 470059 482792 497591 514710 534605
62372 534605 557838 584638 614662 647378 682538 719941 758885 798376 838027 878275 919406
62361 919406 960683 1000682 1038021 1071454 1099661 1121627 1137062 1145957 1147899 1142402 1129909 1111934
62349 1111934 1090133 1065642 1039191 1011305 982270 952341 922077 892063 862310 832489 802828
62338 802828 774268 747573 722873 700268 680273 663224 648697 635943 624617 614755 606355 599358
62326 599358 593840 589892 587483 586570 587061 588448 589829 590607 590856 590719 589859 587836 584662 580485 575100 568372
62310 568372 560972 554036 548033 542413 536318 529258 521231 512806 505126 499226 495100 491856 488952 486837
62296 486837 486113 486482 487014 487262 487719 489218 492170 496432 501621 507398 513535 519804 525934 531726 537229
62281 537229 542676 548153 553428 558234 562739 567608 573516 580585 588363 596400 604850 614436 625889 639504
62267 639504 655340 673644 694813 718974 745989 776011 809697 847422 888391 930994 974002
62256 974002 1016878 1058669 1097215 1130032 1155692 1173784 1183880 1185538 1179432 1167530 1151527 1131673
62244 1131673 1107610 1079871 1049849 1018682 986953 955406 925177 897106 871316 847661 826251
62233 826251 807404 791352 778060 767063 757541 748841 740930 734048 728049 722501 717298 712655 708506
62220 708506 704431 700315 696600 693746 691871 691001 691125 691856 692571 693187 694361 696643 699893 703779 708399
62205 708399 713975 720383 727576 736231 747503 761983 779156 797877 817373 837961 860772 886522
62193 886522 914562 943509 972764 1002762 1033618 1064183 1092827 1118520 1140668 1158550 1171692
62182 1171692 1180486 1185756 1188013 1187733 1186025 1184235 1182981 1182369 1183096 1186589 1193868 1204970 1219642 1237866
62168 1237866 1259304 1282779 1306827 1330506 1353217 1373938 1391197 1403973 1412417 1417560 1420365 1421161
62156 1421161 1419981 1417148 1413158 1407968 1400889 1391503 1380441 1368907 1357734 1347336 1338348 1331660 1327756
62143 1327756 1326484 1327597 1331069 1336706 1343867 1351894 1360597 1370182 1380918 1393087 1406973 1422602 1439614
62130 1439614 1457665 1476934 1498036 1521413 1546928 1574101 1602591 1632326 1663186 1694789 1726781
62119 1726781 1759233 1792487 1826490 1860586 1894144 1927264 1960616 1994706 2029448 2064330 2098695
62108 2098695 2132030 2164306 2196107 2228239 2261141 2294736 2328756 2362969 2397188 2431345 2465650
62097 2465650 2500512 2536272 2573132 2611284 2650996 2692591 2736496 2783203 2833069 2886287 2943270
62086 2943270 3004850 3071721 3143642 3219401 3297380 3375742 3452198 3524391 3591130 3653208 3712738
62075 3712738 3771775 3831556 3892630 3954989 4017728 4078911 4136275 4188394 4235199 4277364 4315382
62064 4315382 4349377 4379480 4405841 4428151 4445670 4458093 4466077 4470544 4471631 4468695 4461105 4448649
62052 4448649 4431271 4409004 4382325 4352196 4319570 4285073 4249273 4212966 4177061 4142322 4109267
62041 4109267 4078206 4049264 4022483 3997851 3975161 3954018 3934336 3916761 3902229 3890976 3882259
62030 3882259 3875208 3869747 3866547 3866177 3868372 3872017 3875853 3879390 3883241 3888455 3895555 3904302 3914178 3924773
62016 3924773 3935762 3946963 3958540 3970760 3983319 3995250 4005814 4015299 4024608 4034132 4043319 4051341
62004 4051341 4057877 4062978 4066295 4066762 4063169 4054800 4041144 4021042 3992683 3954770 3907475 3852015 3789713
61991 3789713 3721984 3650890 3578872 3507728 3438263 3370970 3306458 3245092 3186810 3131684 3080169
61980 3080169 3032395 2987608 2944805 2903694 2864567 2827438 2791851 2757527 2724777 2694138 2665842
61969 2665842 2639621 2614793 2590616 2566889 2544273 2523701 2505381 2488555 2472290 2456245 2440612
61958 2440612 2425670 2411606 2398566 2386526 2375197 2364366 2354328 2345764 2339115 2334294 2331140 2329914
61946 2329914 2331099 2334783 2340560 2348069 2357373 2368653 2381737 2396230 2412059 2429667 2449634 2472318
61934 2472318 2497936 2526815 2559331 2595534 2634971 2677123 2722152 2771247 2826139 2888309 2958870
61923 2958870 3039244 3131767 3239463 3365422 3512581 3684014 3883142 4113614 4379059 4682913
61913 4682913 5028275 5417983 5855026 6342878 6885050 7483847 8139007 8846563 9597423
61904 9597423 10375174 11153718 11896405 12558111 13090528 13449536 13602898 13536483 13257295 12791975
61894 12791975 12180756 11469142 10700620 9912356 9133491 8384837 7679639 7025310 6425354
61885 6425354 5880508 5389291 4948640 4554711 4203413 3890640 3612505 3365426 3145918
61876 3145918 2950558 2776499 2621847 2485091 2364205 2256687 2160461 2074277 1997284 1928767
61866 1928767 1868439 1816400 1772409 1735601 1705265 1681492 1664477 1653401 1646618 1643020 1642731 1646327
61854 1646327 1653811 1664609 1678089 1693532 1709718 1725213 1739285 1752112 1763727 1773167 1779295 1782321
61842 1782321 1783750 1784607 1784350 1781959 1777682 1773182 1770234 1769851 1772406 1777787 1785250 1793638 1802060 1810092 1817204
61827 1817204 1822348 1824370 1822679 1817411 1809214 1799066 1788158 1777670 1768563 1761510 1756922 1755088 1756488
61814 1756488 1761923 1772118 1787245 1807013 1831253 1860169 1894062 1933109 1977540 2027779 2084347
61803 2084347 2147717 2218284 2296294 2381904 2475634 2578800 2693225 2820475 2961677 3118127
61793 3118127 3291773 3485034 3700586 3941698 4212628 4518427 4864414 5255898 5698235
61784 5698235 6196969 6758009 7387853 8093580 8882505 9761592 10736683 11811383 12985525
61775 12985525 14253077 15599032 16995282 18396831 19740763 20949544 21938826 22629081
61767 22629081 22959440 22900081 22458421 21676430 20620720 19369752 18002116 16587893 15183610
61758 15183610 13830597 12556060 11375812 10297420 9322762 8449580 7672376 6983244 6372922
61749 6372922 5832061 5352406 4927276 4550895 4217358 3920637 3655680 3418945 3207524
61740 3207524 3018282 2848377 2696079 2560224 2439049 2330368 2232830 2146124 2069790 2002513
61730 2002513 1942817 1889736 1842466 1799830 1760473 1723238 1687183 1651557 1615940 1580095 1543640
61719 1543640 1506336 1468768 1432257 1397921 1366138 1336838 1309695 1283996 1259076 1235076 1212604
61708 1212604 1191489 1170664 1149582 1128937 1109524 1091182 1073440 1056478 1040724 1026037 1012038
61697 1012038 998782 986401 974481 962521 950677 939398 928589 917890 907509 898061 889648 881803
61685 881803 874261 867288 861237 856220 852087 848372 844446 840153 836056 832649 829584 826147 822139 817782
61671 817782 813175 808493 804322 800961 797675 793492 788587 783955 779895 775819 771576 767839 764847 761775
61657 761775 757902 753691 750132 747547 745572 743940 742759 742230 742431 743252 744326 745267 746059 747027 748397 750270
61641 750270 752930 756635 761029 765498 770399 777174 786655 797799 808840 819439 830902 844275 858925
61628 858925 873210 885938 896665 904842 909429 909698 906150 900142 892574 883324 872095 859352 845997
61615 845997 832500 818949 805775 793738 783069 773193 763488 753848 744337 734805 725279 716375 708817
61602 708817 702649 697230 691964 686790 682023 677924 674469 671492 669030 667519 667478 668985 671585 674783 678539
61587 678539 683222 689191 696421 704480 712962 722029 732406 744679 758760 774231 790919 808795 827537
61574 827537 846830 867059 889094 913229 938881 965478 993044 1021557 1050309 1078533 1106356
61563 1106356 1134457 1162858 1190639 1216964 1241885 1265855 1288852 1310457 1330691 1350312 1370054
61552 1370054 1389829 1408951 1426964 1443842 1459356 1472692 1482931 1489539 1492172 1490372 1483922 1473318
61540 1473318 1459447 1442955 1424315 1404377 1384281 1364763 1345996 1328148 1311685 1297073 1284606
61529 1284606 1274589 1267342 1262909 1261153 1262225 1266553 1274396 1285833 1301265 1321371 1346400 1376097
61517 1376097 1410594 1450909 1498245 1553244 1616309 1688263 1770248 1863294 1968411 2086824 2219646
61506 2219646 2367534 2531060 2711256 2909285 3125575 3359487 3609503 3872999 4145469
61497 4145469 4419945 4687024 4935315 5152390 5326563 5449022 5515183 5524752 5480971 5389742
61487 5389742 5258872 5097339 4914415 4718671 4517268 4315967 4119649 3932554 3757995
61478 3757995 3598154 3454319 3327082 3216207 3120700 3039547 2972396 2919371 2880332 2854520
61468 2854520 2840841 2838235 2845824 2862827 2888313 2920976 2959302 3002045 3048269 3096794 3145965 3194292
61456 3194292 3241041 3285838 3327957 3366629 3402022 3435439 3468423 3502039 3537003 3574036 3613841
61445 3613841 3657037 3704313 3756310 3813034 3873509 3936245 3999928 4063494 4125679 4184757 4238692
61434 4238692 4285358 4322689 4348896 4362653 4363133 4350019 4323713 4285533 4237406 4181255 4118828 4052169
61422 4052169 3983950 3916925 3853070 3793450 3738905 3690572 3649650 3616884 3592384 3575716 3566016
61411 3566016 3562221 3563497 3569397 3579516 3593138 3609375 3627328 3645678 3662250 3674588 3681229 3682291
61399 3682291 3678848 3672097 3663186 3653379 3644044 3636699 3633395 3636880 3650032 3675113 3713696 3767205 3837285
61386 3837285 3925677 4033952 4163395 4314940 4489120 4686074 4905591 5146990 5408739 5688004
61376 5688004 5980281 6279191 6576442 6861969 7124366 7351789 7533415 7661214 7731338 7744481
61366 7744481 7704961 7619005 7493117 7333244 7144706 6932313 6700469 6453460 6195855 5932432
61356 5932432 5667494 5404344 5145464 4893008 4648918 4414898 4192697 3984340 3791693
61347 3791693 3615732 3456481 3313655 3187138 3076851 2982489 2903443 2838777 2787223 2747447
61337 2747447 2718463 2699765 2691099 2692225 2702664 2721431 2747074 2778184 2813828 2853345 2895913 2940654
61325 2940654 2986922 3034082 3081058 3126493 3169325 3208948 3245156 3278433 3310059 3341167 3371672
61314 3371672 3400760 3428423 3455591 3482576 3508167 3530708 3549289 3563395 3572063 3574250 3569802 3559431
61302 3559431 3543849 3523329 3497869 3467279 3431176 3389310 3341907 3289518 3232744 3172397 3109711
61291 3109711 3046118 2982970 2921634 2863492 2809519 2760167 2716091 2678663 2649169 2627562 2612511
61280 2612511 2602687 2597571 2597027 2600558 2607246 2616046 2625796 2635029 2642206 2646473 2648164 2648154 2646505 2642021 2633518
61265 2633518 2621177 2606107 2588865 2569488 2549171 2530924 2517958 2512083 2514248 2525907 2548918 2584496
61253 2584496 2633164 2695605 2772715 2864718 2970722 3089132 3217957 3354684 3496153 3638368
61243 3638368 3775913 3901711 4007947 4087288 4133261 4140481 4106130 4031698 3922673 3786189
61233 3786189 3629218 3458546 3280986 3102669 2928354 2761704 2605734 2462500 2332683
61224 2332683 2215939 2111609 2019010 1937446 1866199 1804308 1750182 1701803 1657718 1617681 1582235
61213 1582235 1551899 1526899 1507211 1492473 1482114 1475999 1474696 1478693 1487528 1500140 1515943 1534942
61201 1534942 1556663 1579435 1600971 1619296 1632890 1640533 1641764 1637563 1630003 1620887 1610904 1600064
61189 1600064 1588403 1575814 1561549 1544520 1524177 1500692 1474351 1445271 1413912 1381369 1348836
61178 1348836 1316993 1286173 1256859 1229697 1205098 1183089 1163489 1146152 1131045 1118076 1106693
61167 1106693 1095797 1084468 1072785 1061498 1050882 1040528 1030446 1021597 1014881 1010148 1006701 1004142
61155 1004142 1001900 998330 991256 979398 962722 941710 917210 891006 865502 842316 821636 803147
61143 803147 787044 773798 763418 755413 749328 745042 742588 741859 742381 743439 744537 745737 747395 749681
61129 749681 752550 755944 759621 762943 765340 767001 768660 770741 773184 776129 780202 785851 792749 800125
61115 800125 807493 814965 823040 832100 841781 850763 857388 860548 859836 855040 846009 833096 817344 800049
61101 800049 782277 764704 747467 730203 712587 694893 677732 661346 645672 631061 618309
61090 618309 607750 598794 590564 582666 575164 568300 562419 557783 554171 550968 547950 545705 545099 546549
61076 546549 549988 555208 561917 569564 577333 584456 590607 596129 601673 607475 613183 618579 624015 629698
61062 629698 635015 639336 643117 647228 651339 654169 655527 656976 659981 664383 669317 674690 680927 688003
61048 688003 695697 704391 714675 726309 738369 750301 762216 774192 785944 797210 807878 817574
61036 817574 825542 831241 834959 837633 839883 841172 840155 836225 830523 824941 820256 815883 811382 807323
61022 807323 804388 802513 801391 801074 801554 802474 803894 806770 812003 819575 829207 841245 856106 873382
61008 873382 892369 913084 935996 961229 988863 1019614 1054263 1092770 1134889 1181326 1233217
60997 1233217 1290678 1352917 1419594 1490797 1565599 1641743 1717143 1791077 1864158 1938231 2016381
60986 2016381 2101850 2196591 2301560 2418284 2548966 2695226 2858535 3042934 3256511 3509905
60976 3509905 3814316 4181015 4621023 5144415 5761682 6487638 7344207 8360227 9571965
60967 9571965 11026747 12784059 14904348 17419247 20283904 23325736 26227455 28591046
60959 28591046 30087347 30616368 30366569 29725494 29108163 28815595 28973384 29517943 30197644
60950 30197644 30617196 30366855 29200724 27150603 24490785 21586647 18742907 16138411
60942 16138411 13843851 11866767 10184686 8763406 7568357 6569658 5740626 5055315
60934 5055315 4489402 4021930 3634548 3310051 3033239 2792733 2580821 2391879 2221830
60925 2221830 2068526 1931196 1808944 1700064 1602616 1515183 1437166 1368675 1309671 1258534
60915 1258534 1211682 1165407 1118315 1071655 1027470 986959 950437 917924 889274 864067 841783
60904 841783 822030 804628 789645 777276 767372 759159 751733 744916 739313 735516 733489 732660 732206 731194
60890 731194 728859 724915 719461 712625 704506 695330 685279 674262 662300 650045 638350 627284 616143
60877 616143 604562 593068 582425 573022 565073 558693 553436 548459 543666 540094 538617 538805 539711 541283
60863 541283 544146 548396 553493 559204 565780 573193 581030 589291 598587 609318 621212 633802 646821
60850 646821 659980 673025 686297 700687 716609 733369 749847 765453 780056 793338 804710
60839 804710 813845 821046 827137 833064 839381 845874 851711 856035 858316 858281 855910 851657 846348 840616 834638
60824 834638 828517 822515 816511 809456 799894 787247 772426 757051 742128 727642 713467 700365
60812 700365 689676 681921 676188 671217 666760 663441 661643 661203 662073 664499 668325 672710 676856 680635
60798 680635 684316 687999 691545 694714 697205 698858 699903 700666 700975 700295 698525 696214 693886 691685 689840
60783 689840 688860 689075 690552 693716 699268 707056 715753 724304 733156 743392 755133 767546 780026 792539
60769 792539 804987 817014 828361 838738 847416 853615 857328 859250 859924 859482 858135 856347 854479 852735
60755 852735 851391 850504 849543 847970 846187 845146 844879 844145 841931 838720 835725 833242 830187 825152 817613
60740 817613 808205 798050 787821 777412 766487 755132 743730 732444 721243 710344 700120 690570
60728 690570 681379 672578 664653 657895 652166 647466 644201 642553 642052 642176 643036 645092 648387 652445 656720
60713 656720 660849 664620 668012 671195 674257 676991 679094 680454 681115 681065 680245 678571 675732 671148 664409
60698 664409 655777 646129 636402 627077 618072 609050 599918 591003 582620 574606 566626 558910 552207 546886
60684 546886 542531 538670 535452 533253 532027 531545 531992 533789 536879 540713 544937 549755 555570 562590 570722
60669 570722 579574 588575 597368 606039 614655 622787 629964 636491 643186 650199 656732 662193 667128 672633
60655 672633 679238 686762 694895 703453 712378 721966 732854 745223 758116 770087 780496 789642 797708
60642 797708 804287 809140 812790 815951 818758 820903 822201 822677 822346 821253 819500 816921 812994 807403 800494
60627 800494 792831 784598 775842 766912 758022 748565 737596 725053 711897 699070 686962 676054 667152
60614 667152 660539 655455 651038 647354 644976 643926 643734 644378 646461 650410 656046 663116 671797 682441
60600 682441 695019 709066 724071 739810 756325 773569 790981 807501 822078 834191 843821 851091
60588 851091 856061 858779 859299 857675 854065 848738 841820 833092 822261 809416 795085 779872 764198
60575 764198 748368 732705 717523 703051 689427 676778 665284 655170 646498 638981 632131 625608
60563 625608 619353 613406 607845 602966 599277 597152 596585 597317 598962 600953 602754 604385 606476 609555 613484
60548 613484 617810 622390 627317 632494 637719 643151 649245 656232 663999 672639 682907 696050 713136
60535 713136 734430 759332 787147 818067 853105 892626 935013 977009 1015306 1047578 1072308
60524 1072308 1088297 1094665 1091204 1078699 1059111 1035359 1010526 986995 966215 949034 935892 926807
60512 926807 921595 920251 922762 928421 935614 942634 948728 954285 960052 966336 973054 980348 988863 999306
60498 999306 1011988 1027096 1045296 1067707 1095403 1129352 1170779 1221026 1280859 1350453 1430194
60487 1430194 1520855 1622692 1735173 1858324 1993917 2144716 2313125 2501504 2713514 2953903
60477 2953903 3226244 3530555 3861753 4208344 4551583 4866846 5127587 5309940 5396186 5377128
60467 5377128 5253675 5037032 4746823 4407613 4044717 3680180 3330076 3004105 2707027
60458 2707027 2440373 2203641 1995250 1813283 1655609 1519612 1402376 1301307 1214261 1139145
60448 1139145 1073906 1017063 967786 925226 888154 855459 826695 801799 780424 761698 744576
60437 744576 728404 713224 699469 687280 676306 666354 657823 651050 645519 640375 635552 631683 628948
60424 628948 626793 624920 623783 623806 624810 626544 629113 632369 635493 637799 639578 641553 643802 645835 647531
60409 647531 649305 651326 653181 654630 656202 658566 661428 663575 664271 664257 664850 666163 666891 666095 664499 663481
60393 663481 663389 663717 664590 666978 671239 676314 680827 684416 687684 691302 695475 699887 703804 706499 707821
60378 707821 708229 708271 708279 708481 708913 709255 709298 709565 710907 713359 716032 718221 720026 721722 723268 724793 726848
60361 726848 729682 732790 735666 738639 742497 747583 753566 759817 765804 771521 777686 785035 793322 801620
60347 801620 809789 818847 829488 841107 852919 865239 878719 892811 905993 917300 926824 934804
60335 934804 941000 945054 946884 946670 944892 942385 939933 937822 936070 935010 935169 936629 938857 941318 943965
60320 943965 947042 950452 953312 954245 952303 947647 941074 933024 923516 912951 902186 891576 880675
60307 880675 869312 858329 848673 840329 832743 825820 819844 814784 810424 806972 804915 804301 804664 805562
60293 805562 806827 808468 810663 813554 816689 818979 819707 819308 818793 818693 818979 819611 820608 821912 823664 826346
60277 826346 830175 834694 839491 844871 851227 858154 865002 871980 879943 889177 899168 909545 920608 932984
60263 932984 947314 964174 983698 1005407 1028947 1054850 1084054 1116944 1153470 1193903 1238691
60252 1238691 1287742 1340701 1397859 1460043 1527704 1600979 1680603 1767797 1863064 1965851 2075491
60241 2075491 2191585 2313209 2438487 2565262 2691462 2814531 2931331 3039218 3136755 3222945
60231 3222945 3296236 3354813 3397611 3424588 3436195 3432924 3415455 3385091 3344015 3294929 3240349
60220 3240349 3182462 3123793 3067492 3016380 2972082 2935726 2909113 2894316 2892258 2902662 2925535
60209 2925535 2961833 3012482 3077563 3156710 3249564 3355377 3472724 3599767 3734207 3872759
60199 3872759 4011370 4146303 4274462 4392529 4496679 4583708 4651823 4699884 4726526 4730667
60189 4730667 4712352 4672528 4612406 4533714 4439272 4332726 4217878 4098627 3979192 3863702
60179 3863702 3755509 3657133 3570606 3497530 3439083 3396431 3371085 3364478 3377292 3409333 3459779
60168 3459779 3527147 3609087 3702464 3803616 3908457 4012708 4112323 4203676 4283379 4348364 4396412
60157 4396412 4426338 4437568 4430030 4404839 4364648 4312845 4252655 4187398 4121279 4059239 4005884
60146 4005884 3964753 3938370 3928527 3936588 3963927 4012154 4082726 4176457 4293698 4434974 4601194
60135 4601194 4793298 5012045 5258152 5532199 5834063 6162400 6514740 6887956 7278483
60126 7278483 7681988 8092871 8504274 8908688 9298550 9666237 10003916 10303991 10560012
60117 10560012 10767142 10921848 11021522 11064464 11049896 10977792 10848911 10665290 10430721 10150838
60107 10150838 9832982 9485992 9119813 8744883 8371624 8010031 7669062 7355864 7075423
60098 7075423 6830777 6623512 6454288 6323362 6230716 6175621 6156351 6170784 6217144 6293497
60088 6293497 6396316 6519976 6657839 6803414 6950323 7091700 7220177 7328507 7410412 7461556
60078 7461556 7480265 7467171 7423838 7351782 7252809 7129715 6986070 6825360 6650557 6464405
60068 6464405 6269820 6070104 5868983 5670460 5478516 5296822 5128483 4975586 4839008
60059 4839008 4719017 4616196 4531540 4465706 4418810 4391236 4384079 4398278 4433612 4489024 4563659
60048 4563659 4657003 4767985 4894343 5032762 5179169 5328798 5476434 5616898 5745246 5856587
60038 5856587 5946197 6010249 6046508 6054173 6033060 5983141 5904895 5799956 5671314 5523056 5359992
60027 5359992 5187283 5009982 4832859 4660683 4498289 4349672 4216904 4100513 4001119 3920240
60017 3920240 3859274 3818423 3797181 3795365 3813153 3850648 3908177 3986610 4086526 4207310 4347818
60006 4347818 4507573 4686186 4881432 5088719 5302431 5516900 5726050 5923276 6102335
59997 6102335 6257930 6385390 6480813 6542073 6569116 6562782 6523722 6452680 6351199 6221823 6068308
59986 6068308 5896106 5712061 5523141 5335616 5155295 4987446 4835794 4702180 4587720
59977 4587720 4493847 4421847 4372022 4343929 4337044 4350725 4383976 4435734 4504929 4589872 4688136
59966 4688136 4797540 4916688 5043876 5175880 5308442 5437548 5559682 5671347 5769294 5851219
59956 5851219 5915783 5962241 5990677 6002475 6000002 5985942 5963271 5935631 5907176 5882249 5865651
59945 5865651 5862864 5879317 5919369 5986403 6083706 6214753 6382695 6589972 6838360 7128959
59935 7128959 7461983 7836565 8250400 8699143 9176099 9672340 10176491 10673964 11146878
59926 11146878 11575438 11939774 12221275 12404100 12477485 12437680 12288174 12038761 11704449 11303870
59916 11303870 10856787 10381975 9896702 9416742 8955437 8522503 8124233 7764770 7446863
59907 7446863 7171913 6940201 6751282 6603983 6496548 6427502 6396234 6402198 6443807 6518724
59897 6518724 6624989 6761135 6925169 7113802 7322262 7543958 7770336 7991647 8197914
59888 8197914 8378836 8523394 8620876 8662909 8644566 8564138 8423020 8226096 7981497 7699420
59878 7699420 7391051 7067916 6740975 6419484 6110582 5819635 5550398 5304887 5083605
59869 5083605 4885967 4710232 4553335 4411570 4281617 4160671 4045925 3934787 3825851
59860 3825851 3719208 3615787 3516779 3423634 3337946 3261082 3194107 3137882 3092878 3058980 3035782
59849 3035782 3022628 3017748 3017696 3018366 3016489 3009608 2995176 2970933 2936310 2892655 2842062 2786822 2729872
59836 2729872 2674402 2622476 2574813 2532161 2495884 2466814 2444661 2429314 2421841 2423263 2433052 2449898
59824 2449898 2473608 2505237 2545407 2593484 2648629 2710956 2781107 2858847 2942331 3028613 3114623
59813 3114623 3197487 3274061 3340622 3393583 3430726 3451783 3458232 3453077 3440680 3425894 3412599 3402913
59801 3402913 3397709 3397515 3403010 3415331 3436479 3469399 3517474 3583907 3671511 3782658 3919360 4083658
59789 4083658 4278049 4505387 4768367 5069312 5410064 5790855 6207958 6651178 7102166
59780 7102166 7533844 7911966 8200239 8368534 8400776 8298741 8080512 7774911 7414311 7028429
59770 7028429 6640990 6269328 5925306 5616089 5344728 5111155 4913460 4749034 4615217
59761 4615217 4509460 4429161 4371606 4334317 4315467 4313819 4328394 4358380 4403266 4462857 4537278
59750 4537278 4627116 4733342 4856709 4997384 5155530 5332112 5528810 5747314 5989224 6256424
59740 6256424 6550943 6874415 7228278 7614592 8036020 8494667 8991207 9525112 10095030
59731 10095030 10698209 11329474 11980617 12640466 13295458 13930736 14531776 15086363 15586709
59722 15586709 16031171 16424533 16776705 17101174 17414185 17733803 18077685 18460567 18893210
59713 18893210 19382564 19931499 20538045 21195409 21892549 22613972 23339205 24043814 24701963
59704 24701963 25288494 25780083 26157332 26408088 26529560 26527681 26415267 26210804 25937411 25621040
59694 25621040 25288473 24965744 24676586 24440906 24274610 24190860 24200867 24313220 24533558 24866021
59684 24866021 25314721 25883074 26571939 27379024 28299361 29324608 30440441 31623836 32841639
59675 32841639 34050229 35196080 36218124 37052680 37640337 37933443 37902866 37542785 36872182
59666 36872182 35932164 34779699 33479787 32098341 30696584 29326503 28027191 26822861
59658 26822861 25722684 24721111 23798082 22921206 22052349 21157481 20215332 19221332 18186286
59649 18186286 17131204 16080424 15055831 14074265 13147512 12282761 11482878 10747507 10074811
59640 10074811 9462382 8907043 8404925 7952140 7544865 7178710 6848926 6551681 6284664
59631 6284664 6046198 5834423 5647535 5483981 5341923 5219070 5113477 5023952 4949203 4887119
59621 4887119 4835326 4791901 4754986 4722139 4690603 4657881 4621522 4578667 4526484 4463170 4388478
59610 4388478 4303523 4210231 4110704 4006876 3900895 3795526 3693498 3596397 3504848 3419756
59600 3419756 3342545 3274001 3213897 3162175 3119537 3086330 3061786 3045074 3036287 3035530 3041797 3053716
59588 3053716 3070868 3093314 3120130 3149302 3178864 3207454 3234113 3258448 3280902 3302163 3322515
59577 3322515 3342352 3363003 3386275 3413465 3445591 3484271 3531292 3587309 3651928 3725258 3808661
59566 3808661 3903827 4011784 4133075 4268327 4418396 4584362 4767508 4968957 5189285 5428762
59556 5428762 5687741 5966128 6262439 6573924 6897637 7230708 7569404 7908659 8243051
59547 8243051 8567964 8879681 9174898 9450771 9705409 9938127 10149436 10341034 10515573
59538 10515573 10675819 10823617 10959561 11083737 11197036 11302240 11404330 11509799 11624927
59529 11624927 11753288 11893602 12039414 12180780 12306229 12403446 12459480 12462124 12402079 12273770
59519 12273770 12074603 11804779 11468557 11074945 10636109 10164879 9673547 9173883 8676894
59510 8676894 8192021 7726527 7285359 6871356 6485947 6130052 5804315 5508584 5241859
59501 5241859 5003061 4791381 4605591 4443745 4304048 4185458 4086884 4006483 3942527 3894571
59491 3894571 3863027 3847958 3849012 3866166 3899630 3949211 4014696 4096864 4197329 4317227 4456641
59480 4456641 4615347 4793563 4991767 5210132 5448145 5704426 5976895 6263131 6559932
59471 6559932 6861819 7160222 7444798 7705456 7932681 8116605 8247280 8316746 8320764 8258888
59461 8258888 8133769 7950748 7717544 7443586 7139233 6814964 6480447 6143865 5811935
59452 5811935 5490187 5182894 4892967 4622226 4371587 4140873 3929155 3735989 3561926
59443 3561926 3407139 3269994 3147888 3039245 2943704 2860544 2788111 2725019 2670885 2625505
59433 2625505 2588113 2557869 2534384 2517282 2505872 2499625 2498393 2501687 2508279 2517069 2527922 2541095
59421 2541095 2556243 2572597 2589974 2609021 2630549 2655167 2683705 2717370 2757093 2802729 2852999
59410 2852999 2906013 2959832 3013182 3066610 3123311 3188241 3265710 3357796 3465331 3590016 3734792
59399 3734792 3902079 4092276 4304163 4536351 4788630 5063100 5364733 5700211 6075566
59390 6075566 6494853 6960756 7474950 8036746 8641648 9281664 9946223 10621945 11292475
59381 11292475 11940441 12550623 13111756 13616499 14061110 14445196 14770896 15042011 15263821
59372 15263821 15442634 15583773 15689398 15758387 15787795 15773641 15710880 15594201 15419652 15185645
59362 15185645 14893542 14548950 14162718 13749518 13324822 12903110 12497463 12118005 11769162
59353 11769162 11449004 11151762 10870354 10596611 10321233 10035880 9735786 9420069 9089997
59344 9089997 8747939 8397822 8045489 7697742 7360852 7039857 6738843 6461294 6209711
59335 6209711 5985020 5786938 5615198 5469986 5350952 5256489 5184718 5134687 5105738 5096051
59325 5096051 5102832 5123796 5157350 5201157 5251576 5304815 5357787 5407484 5450371 5482966 5502447
59314 5502447 5506450 5493113 5462010 5414582 5353094 5279456 5195411 5103324 5006175 4906857 4807881
59303 4807881 4711609 4620425 4536651 4462301 4398770 4346826 4307129 4280704 4268608 4271350 4289170
59292 4289170 4322914 4373987 4443321 4530879 4636298 4759571 4900869 5060130 5236927 5430281
59282 5430281 5638401 5858825 6088722 6324538 6561378 6793320 7014503 7219497 7402776
59273 7402776 7558742 7682809 7772282 7826252 7845312 7831546 7788108 7718296 7625181 7511987 7382052
59262 7382052 7237982 7081122 6911975 6730775 6537864 6334574 6124428 5913173 5707168
59253 5707168 5511787 5331113 5168197 5024935 4902108 4800189 4720145 4663373 4631174 4624597
59243 4624597 4644663 4692566 4769751 4877964 5019124 5195239 5408501 5661194 5954987 6290146
59233 6290146 6665398 7077987 7523105 7993013 8476753 8960233 9426280 9855413 10227967
59224 10227967 10526304 10735643 10844351 10845235 10736908 10523354 10212551 9816399 9351518 8838216
59214 8838216 8297501 7748610 7207995 6688421 6198229 5742337 5324276 4946529 4609169
59205 4609169 4309757 4045210 3812839 3609493 3431396 3275750 3141403 3027128 2930250 2847838
59195 2847838 2778254 2720516 2672968 2633681 2601617 2576378 2557171 2542906 2533064 2527713 2526943 2530874
59183 2530874 2539929 2554502 2574570 2600054 2631189 2668139 2710718 2758996 2813810 2876104 2946012
59172 2946012 3022905 3106004 3194616 3288231 3386737 3490094 3597375 3706391 3814436 3918994
59162 3918994 4017551 4107408 4185886 4250258 4297506 4325179 4332911 4322215 4294451 4249956 4189746
59151 4189746 4116925 4035562 3948962 3859701 3770339 3682908 3598382 3517764 3443234 3377176 3320503
59140 3320503 3272946 3234706 3206707 3189369 3182139 3184334 3195856 3217153 3249079 3292657 3348414 3416169
59128 3416169 3496008 3589149 3697252 3821198 3961208 4117891 4292360 4485351 4696835 4926453
59118 4926453 5173779 5438191 5718823 6014473 6323054 6641219 6964666 7288402 7606216
59109 7606216 7910253 8191563 8440777 8647967 8802609 8894930 8917904 8868219 8746214 8555816
59099 8555816 8304435 8002228 7660906 7292719 6909389 6520961 6135339 5758815 5396502
59090 5396502 5052097 4727865 4425298 4145365 3887906 3651649 3435426 3238880 3061482
59081 3061482 2901559 2756915 2625879 2507126 2399125 2300516 2210576 2128602 2053322 1983588
59071 1983588 1919140 1860011 1805682 1755578 1709860 1668810 1631794 1597680 1565997 1536860 1510014
59060 1510014 1484753 1460572 1437252 1414497 1392156 1370525 1349819 1329657 1309677 1290331 1272469
59049 1272469 1256550 1242822 1231730 1223264 1216274 1209293 1201898 1194709 1188464 1183812 1181586 1182388 1186169
59036 1186169 1192891 1203168 1217468 1235099 1254928 1276734 1300829 1326554 1352093 1375688 1396233
59025 1396233 1412904 1425148 1433126 1437510 1438937 1438235 1436801 1435950 1436081 1437193 1439877 1444977 1452536 1461960
59011 1461960 1473003 1485700 1499525 1513478 1526834 1538969 1548663 1554533 1556087 1553526 1546729 1535446
58999 1535446 1520448 1503548 1486331 1469556 1453682 1439143 1426072 1414490 1404818 1397573 1392654 1389602
58987 1389602 1388419 1389444 1392602 1397487 1403978 1412064 1421336 1431519 1443247 1457365 1473640 1491110 1509582
58974 1509582 1529800 1552163 1576303 1602002 1629672 1659767 1692424 1727704 1765450 1804951 1845411
58963 1845411 1886663 1928765 1971076 2012529 2052634 2091452 2128885 2164998 2200868 2238153 2277933
58952 2277933 2320934 2368633 2422858 2484178 2551789 2625175 2704938 2791854 2886128 2987819 3097254
58941 3097254 3214828 3341181 3477618 3625649 3786093 3959483 4147258 4351675 4574662
58932 4574662 4817728 5083012 5373349 5691228 6038735 6418641 6834479 7289264 7785041
58923 7785041 8323822 8907847 9538459 10215526 10938064 11704312 12510378 13349039 14209669
58914 14209669 15078173 15936318 16761527 17527817 18207222 18771673 19195851 19460171 19552362
58905 19552362 19468093 19211993 18798154 18248050 17586772 16840577 16036167 15199299 14352340
58896 14352340 13513151 12695982 11912254 11170254 10475247 9830476 9237589 8696076 8203322
58887 8203322 7755564 7348308 6976120 6633273 6315168 6018677 5741419 5481703 5239071
58878 5239071 5013656 4804691 4610500 4429955 4262883 4109054 3967842 3838937 3722161
58869 3722161 3616410 3519955 3431993 3352783 3282106 3218879 3162447 3112870 3069550 3031006 2996627
58858 2996627 2967390 2944204 2926627 2913867 2905952 2903245 2905768 2913814 2928404 2950407 2979813 3016398
58846 3016398 3060445 3112384 3172287 3240103 3315902 3399782 3492146 3594064 3706656 3830299 3965283
58835 3965283 4112908 4274684 4450724 4640553 4845497 5068663 5312390 5577533 5865717
58826 5865717 6180450 6525207 6902064 7313239 7762487 8253803 8789735 9371734 10000844
58817 10000844 10676846 11397403 12158508 12954363 13775595 14608179 15434487 16234110 16982981
58808 16982981 17653421 18217128 18648768 18927638 19038873 18975721 18741060 18346378 17809985
58799 17809985 17155967 16412206 15606509 14763635 13905377 13051299 12217636 11416104 10654838
58790 10654838 9939726 9273968 8657532 8088728 7566123 7088234 6652334 6255000 5893551
58781 5893551 5566003 5270064 5003174 4763266 4548587 4356816 4184629 4027541 3879812
58772 3879812 3735527 3590834 3445064 3299598 3156480 3018350 2888242 2768197 2658465
58763 2658465 2558614 2468613 2388333 2316973 2253771 2198487 2150594 2108893 2072569 2041582 2015414
58752 2015414 1992590 1972195 1954738 1940590 1928833 1918628 1910456 1904706 1900121 1894944 1888673 1881329
58740 1881329 1871896 1859029 1842777 1824262 1804106 1782291 1759077 1734822 1709272 1681996 1653108
58729 1653108 1622781 1590589 1556223 1520253 1483366 1445545 1406830 1368060 1329911 1292088 1254541
58718 1254541 1218608 1185756 1155843 1127787 1101278 1076714 1054156 1033620 1015840 1001458 989875
58707 989875 979992 971612 965102 960220 956304 953083 950179 946266 939847 930545 918828 904964 889117
58694 889117 871963 854363 836917 820475 806267 794742 785117 776847 770540 766487 763486 760296 757339
58681 757339 755782 755928 757727 761770 768392 776692 785779 795978 807355 818276 827263 835465 845528
58668 845528 858707 874813 894144 917373 943867 971908 1000119 1026743 1047930 1059017 1058007 1046680
58656 1046680 1028573 1007359 986656 969227 955799 945777 939126 936450 937685 942254 950392 962817
58644 962817 979178 998249 1019641 1043974 1071490 1101901 1135508 1173056 1214373 1258442 1304957
58633 1304957 1354776 1408947 1468413 1534533 1608768 1691945 1784739 1888644 2005529 2136770 2283774
58622 2283774 2448568 2632420 2834445 3052975 3287585 3537844 3800139 4067189 4330270
58613 4330270 4580141 4805978 4995490 5137056 5221570 5243293 5201099 5099403 4946863 4753994
58603 4753994 4532256 4293813 4049694 3807777 3573404 3351156 3144440 2954006 2778987
58594 2778987 2619383 2476065 2348839 2236438 2138240 2054198 1983162 1922955 1871940 1828753
58584 1828753 1790801 1755067 1720555 1688149 1658042 1629041 1600321 1571923 1543380 1513827 1483744
58573 1483744 1454798 1427657 1401648 1376769 1354177 1334265 1315939 1298189 1280766 1262812 1242404
58562 1242404 1218069 1189728 1158057 1124300 1090723 1059716 1032048 1007151 985030 966482 951659
58551 951659 939928 930944 924110 917179 907413 894341 879594 864017 846861 828023 809024 791308
58539 791308 775266 761264 749838 740524 732150 724563 718430 713269 707648 701564 696612 693318 690299
58526 690299 686599 682918 679947 677387 675397 675161 677166 680369 683804 687570 691692 695466 698492 700924
58512 700924 702333 701750 699229 695918 692248 687615 682029 676472 671402 666597 662673 660870 661055 661827 662935
58497 662935 665648 670345 675748 681002 686441 691698 695240 696658 697558 699240 701082 701905 701299 699026 694830
58482 694830 689541 684782 680967 677088 672772 668825 665529 662342 659607 658452 658552 658039 656091 653503 650354
58467 650354 645531 639263 633659 629875 627027 624787 624571 627024 630604 633978 637775 642747 648208 653504
58453 653504 659088 664864 669308 671470 672209 672405 671694 669978 668473 668306 669706 673228 679790 688697 697540
58438 697540 704800 710572 714254 713996 709410 702392 694237 684278 672504 661010 651531 643751 637244 632766
58424 632766 630313 628352 626445 626390 629311 633820 638468 643813 650603 658223 666427 676429 688736 701943
58410 701943 715006 728436 741906 753045 760171 763984 765216 763052 757370 749973 741976 732499 721580
58397 721580 711647 704239 697871 691089 685006 680780 677235 673275 670106 668693 667388 664476 660885 658103
58383 658103 655781 653842 654744 660970 671968 685626 700711 715841 728534 737858 746003 754908 763407
58370 763407 769869 775297 781325 787388 792479 797596 803942 810747 817291 824951 834794 845387 855412 866118
58356 866118 878605 891104 901665 911102 920361 927312 929409 927525 924215 920153 915138 910491 907361
58343 907361 904602 901248 899192 900543 904358 908816 914447 922234 930797 938650 947140 957918 969638 980322
58329 980322 990890 1003009 1015553 1026611 1037048 1048766 1061384 1073957 1087935 1104958 1123583
58318 1123583 1141387 1158297 1174671 1188453 1197748 1204017 1209243 1212282 1211707 1209829 1209949 1211733 1213204
58305 1213204 1215124 1219371 1225062 1230386 1236384 1244961 1255138 1265123 1276018 1289563 1304400 1318563 1333350
58292 1333350 1350692 1369058 1386197 1403605 1423970 1446581 1469606 1494372 1522939 1553965 1585584
58281 1585584 1619671 1658446 1699557 1739493 1779192 1821137 1863687 1903609 1941483 1979007 2013718
58270 2013718 2042303 2066711 2091229 2116014 2139390 2163783 2193019 2226066 2259752 2295336 2336025
58259 2336025 2380359 2424557 2469231 2517412 2568354 2619701 2673293 2732213 2794791 2858227 2925172
58248 2925172 2999657 3079639 3160937 3245288 3336733 3433463 3531551 3633461 3744119 3861799 3981909
58237 3981909 4106726 4241974 4386804 4536727 4693389 4861548 5039617 5223587 5417200
58228 5417200 5627559 5853932 6091978 6345566 6622655 6922942 7241988 7584054 7957795
58219 7957795 8362872 8794714 9259209 9768445 10325570 10929215 11589263 12322148 13134522
58210 13134522 14029256 15024276 16147532 17418110 18853752 20495284 22404931 24648475
58202 24648475 27307397 30507090 34403588 39137401 44821707 51572119 59522433 68825883
58194 68825883 79697236 92478895 107647870 125771443 147516034 173703463 205210391
58187 205210391 242494605 284741065 328930850 369481629 399227014 411878028 404813324
58180 404813324 380295513 344161574 303018207 261961178 223915032 190137819 160917254
58173 160917254 136030593 115044183 97507616 82997127 71075786 61302999 53291304
58166 53291304 46720128 41308160 36814052 33060811 29927139 27314820 25143533 23364695
58158 23364695 21950675 20870188 20090447 19595919 19387377 19469785 19858006 20588846 21715655
58149 21715655 23301768 25431338 28203235 31662253 35680890 39856300 43499053 45785779
58141 45785779 46078582 44248836 40749378 36351590 31765999 27436297 23564701 20213801
58133 20213801 17367473 14967150 12952567 11279383 9902968 8768908 7829258 7052633
58125 7052633 6411978 5877393 5426791 5049319 4731988 4454857 4203853 3976244 3768952
58116 3768952 3572682 3381733 3198765 3025693 2859766 2702024 2559581 2435560 2325569
58107 2325569 2227126 2143555 2075530 2017468 1965200 1918796 1875151 1826458 1769378 1708140 1646033
58096 1646033 1581596 1515667 1453994 1399526 1349223 1301257 1258291 1220968 1185361 1149892 1118099
58085 1118099 1091615 1066829 1041228 1016751 994181 970526 944815 920528 899485 879016 857765
58074 857765 838475 822330 806256 788687 772563 759802 747989 735296 723572 713826 703751 692546
58062 692546 683341 677891 673387 667248 660625 654490 646726 636002 624483 613988 603256 591440 580379
58049 580379 571066 561681 551455 542681 536641 531303 525281 520244 517179 514054 509606 505790 504123 503099
58035 503099 501467 500605 501451 502493 502957 504475 507449 509280 508539 507401 507603 507462 505522 503798 504607 506949
58019 506949 508666 509616 510363 510325 509461 509332 510449 511054 510335 510138 511631 513113 513071 512541 512341 510891 507062
58002 507062 502508 498831 494921 489278 482524 475483 467220 457150 446823 437590 428867 420595 414818 412678
57988 412678 412335 412047 412834 415814 419324 421189 421758 422325 422558 421821 421121 421434 421850 421458 421279 422385 424011
57971 424011 425523 428193 432803 437360 439536 439752 439773 439887 439561 439251 439429 439276 438311 437880 439201 441419 443356
57954 443356 445540 448735 452170 455192 459052 465079 472576 480382 488895 498628 508275 516185 522363 527171
57940 527171 529558 528435 524441 518542 510316 499352 486805 473781 459769 444472 429473 416097
57928 416097 403283 389717 376467 365275 355700 346268 337181 329516 322898 316262 310005 305194 301598
57915 301598 298619 297232 298819 302805 307530 312815 319745 328541 338445 349154 360680 372400 383685
57902 383685 394775 405729 415517 423551 430968 438885 446525 452659 457582 461913 464745 464939 463117 460387
57888 460387 456169 449401 440901 432408 424125 415362 406818 400014 394982 390598 386836 384786 384811 386390 389384
57873 389384 393812 398985 404430 411059 419758 429557 438872 447785 457250 466746 474650 480440 484676 487330
57859 487330 487939 486965 485192 482256 477475 471609 466011 460540 454121 446914 440091 433945 428100 423198 420420
57844 420420 419527 419194 419030 419579 420676 421625 422760 424940 427684 429565 430289 430555 430025 427338 422228 415819
57828 415819 408647 400017 389533 377840 365666 353419 341708 330920 320399 309379 298583 289548
57816 289548 282563 276634 271216 266489 262200 257833 253806 250972 249078 247219 245660 245613 247283 249741 252666
57801 252666 256676 261958 268113 275360 284388 295056 306705 319660 334828 351937 369824 388418
57789 388418 408625 430109 450808 468761 482831 491687 494040 490310 482412 471549 457808 442076
57777 442076 426347 411462 396325 380193 364297 350342 338647 328488 319204 310415 302249 295861
57765 295861 292559 291925 291916 291263 290639 291100 292677 295050 298281 302143 305841 309075 312472 316360 320094 323163
57749 323163 325946 328782 331246 333090 335066 338105 342255 346963 351845 356779 361802 367232 373368 379911
57735 379911 386278 392517 399199 406476 414148 422614 432626 443969 455521 466861 478798 492065 506637
57722 506637 522688 540988 561731 583889 606402 629343 653524 679696 708488 740330 775010
57711 775010 812081 852132 897019 948473 1007052 1072646 1145416 1226142 1316392 1418475 1534528
57700 1534528 1665504 1811692 1973969 2153557 2350713 2564877 2796090 3044735 3309198
57691 3309198 3584464 3862810 4134348 4386540 4604895 4775735 4888581 4936839 4918532 4837683
57681 4837683 4704006 4530064 4328682 4112463 3893503 3681807 3484317 3306072 3151574
57672 3151574 3024516 2927318 2862163 2832040 2839791 2885787 2965586 3067403 3170190 3245862 3267655
57661 3267655 3220526 3106603 2942560 2751684 2555729 2370201 2203817 2060347 1940485 1843121
57651 1843121 1766558 1709351 1670022 1646587 1637367 1642196 1661806 1696027 1743641 1804093 1878273 1967321
57639 1967321 2071758 2192145 2329420 2484055 2655806 2844703 3051040 3273417 3507332
57630 3507332 3746078 3982048 4206439 4408578 4576664 4699304 4766781 4772670 4715947 4601580
57620 4601580 4438512 4237082 4008066 3762514 3510819 3261494 3020855 2793244 2581073
57611 2581073 2385157 2205609 2042291 1894442 1760685 1639924 1531763 1435686 1350333 1273923
57601 1273923 1205031 1142748 1086602 1036444 991905 951915 915386 882262 853012 827059 802777
57590 802777 779212 756726 735780 716306 698585 683378 670514 658586 646843 636258 627841 620967
57578 620967 614403 608124 603076 599818 598351 598614 600170 602021 603724 606239 610830 617502 625317 633769
57564 633769 643128 653831 666313 681009 697852 716229 736063 758445 784483 814083 846628 882368
57552 882368 922354 967428 1018120 1075266 1139975 1213161 1295626 1388345 1492071 1607025 1733420
57541 1733420 1871887 2022945 2186431 2361786 2548118 2743065 2941685 3136719 3319436
57532 3319436 3480044 3608395 3695694 3735921 3726116 3666684 3562307 3421667 3254980 3071567
57522 3071567 2879459 2685800 2496308 2314799 2144037 1986417 1843164 1713749 1597235
57513 1597235 1493664 1403275 1325075 1257285 1198659 1148334 1105010 1067567 1036055 1010834 990972
57502 990972 974699 961259 951247 945235 943142 944855 950390 959474 971956 988696 1011195 1040320
57490 1040320 1076067 1118419 1167624 1223855 1287525 1359860 1442379 1535874 1640724 1757896 1888530
57479 1888530 2032500 2188336 2354623 2530389 2713602 2899703 3081539 3249935 3394351
57470 3394351 3504172 3570619 3588188 3555199 3473917 3350097 3191757 3008002 2808570 2603108
57460 2603108 2399388 2202067 2013721 1836760 1673673 1525839 1393148 1274662 1168939
57451 1168939 1074035 988309 911310 843147 783121 729726 681756 638524 599216 563037 529878
57440 529878 499902 472584 447102 423542 402632 384334 367790 352602 338987 326565 314227
57429 314227 301524 289125 277598 266764 256574 247559 239897 232959 226218 219795 213703 207432 200806
57416 200806 194423 188765 183560 178544 174110 170641 167815 165144 162629 160380 158123 155690 153520 152104
57402 152104 151253 150367 149171 147804 146498 145465 144857 144546 144145 143415 142423 141278 140076 139065 138352 137487
57386 137487 135898 133851 132323 131778 131652 131234 130465 129731 129455 130088 131808 134008 135727 136828 138089 139926
57370 139926 141822 143410 145211 147676 150178 151759 152409 152904 153693 154642 155662 156920 158403 159711 160396
57355 160396 160380 160132 160447 161813 163938 166171 168366 170792 173198 174631 174501 173210 171356 168859 165403
57340 165403 161331 157529 154588 152441 150681 148935 147125 145620 144934 145194 146149 147729 150091 152989 155707
57325 155707 157982 160477 163896 168040 172177 176048 180029 184484 189412 194648 200152 206190 213316 221861
57311 221861 231345 240785 249875 259493 270764 283935 298433 313647 329320 345500 362519 380880
57299 380880 400820 422160 444668 468346 493264 519480 547227 576597 606764 636104 663531
57288 663531 689262 713723 736129 754751 768254 776059 777594 772017 758969 739144 713853 684265
57276 684265 651240 615758 579305 543664 510155 479099 450226 423674 400226 380377 363514
57265 363514 348414 334410 321708 310672 301171 292805 285546 279855 275982 273320 270791 267941 265291
57252 265291 263343 261761 260042 258522 257878 257829 257292 255863 254234 252930 251565 249853 248492 248430 249784 252026
57236 252026 254676 257343 259610 261528 263807 266952 270582 274125 277716 281788 286233 290667 295287 300740
57222 300740 307316 314835 323123 331973 340836 349237 357497 366447 376481 387299 398490 409801 420964
57209 420964 431876 442934 454632 466836 478985 491011 503528 517064 531639 547153 563548
57198 563548 580464 597292 613909 630946 649045 668217 688179 708941 730653 753150 776113
57187 776113 799636 824338 850835 879251 909256 940433 972611 1005963 1040830 1077438 1115712
57176 1115712 1155420 1196473 1239095 1283630 1330236 1378794 1429100 1480904 1533747 1587093 1640864
57165 1640864 1695633 1751896 1809273 1866869 1924309 1981926 2039921 2097951 2155787 2213850 2272823
57154 2272823 2333087 2394795 2457989 2522256 2586684 2650628 2714097 2776923 2837975 2896060 2951592
57143 2951592 3006708 3063524 3122609 3183253 3244657 3306514 3368726 3431045 3493185 3555151 3617240
57132 3617240 3679585 3741824 3803412 3864249 3924690 3984868 4044391 4103023 4161508 4221439 4284477
57121 4284477 4351943 4424977 4504633 4591598 4685985 4787645 4896814 5014525 5142410 5282233
57111 5282233 5435920 5606350 5798099 6017200 6270095 6562834 6901169 7291579 7743171
57102 7743171 8270053 8893068 9640214 10546717 11655888 13019983 14699178 16758213 19262108
57093 19262108 22272183 25842888 30019786 34838028 40319671 46469850 53273386 60688449
57085 60688449 68626758 76917377 85275818 93314159 100604136 106760392 111493902 114616794
57077 114616794 116023881 115685773 113660237 110100804 105243097 99370800 92777701 85739032
57069 85739032 78494955 71244224 64146527 57330840 50903431 44949452 39528585 34671077
57061 34671077 30378779 26630316 23387367 20600964 18217470 16183008 14445944 12958826
57053 12958826 11680380 10575972 9616000 8774689 8030868 7368659 6775955 6242468 5759943
57044 5759943 5323124 4928734 4573298 4252830 3964134 3704890 3472298 3262850 3073627
57035 3073627 2902781 2748410 2607950 2479098 2360593 2251688 2151536 2059450 1975123 1898127
57025 1898127 1827474 1761931 1700500 1642565 1587981 1537048 1489960 1446281 1405312 1366857 1331107
57014 1331107 1297905 1266756 1237539 1210593 1186003 1163345 1142139 1122123 1103141 1085372 1069723
57003 1069723 1057525 1049898 1047835 1052631 1065530 1087152 1118185 1160812 1218895 1296897 1399469 1532111
56991 1532111 1700591 1907177 2144283 2388730 2601918 2740488 2775012 2704673 2555997 2366686
56981 2366686 2168099 1977867 1802453 1642681 1497792 1367468 1252085 1151809 1066069 994010
56971 994010 934724 886645 847498 815385 789418 768878 752517 739222 728682 720804 715198 712032
56959 712032 712825 719411 732182 749736 769552 788013 800183 801126 788544 764219 732820 699282
56947 699282 666904 637097 610259 586611 566332 549417 535865 525989 520103 518018 519305 524069
56935 524069 533031 546900 566220 591794 624299 662813 703756 741286 768608 779769 771885 746704
56923 746704 709737 667347 624433 584017 547569 515151 486122 460344 438355 420255 405259
56912 405259 392641 382385 374464 368302 363428 359925 357644 355670 353141 350074 346928 343991 341675 340617
56898 340617 340816 341357 341681 342511 344865 348818 354035 360939 370367 382548 397303 415003 436334 461083
56884 461083 487534 512711 532761 543853 544019 534401 518322 499235 479727 461694 446380 434216
56872 434216 425229 419578 417388 418509 422910 430985 442963 458533 477705 501670 532175 570364 616599
56859 616599 670426 729242 786898 834630 864100 870340 853359 818250 773198 725829 680673 639843
56847 639843 605006 577589 557773 544803 538388 538850 546110 559741 580154 608758 646843 695246
56835 695246 755189 828254 914544 1010513 1107769 1193225 1251625 1271002 1248269 1190333 1109868
56824 1109868 1019813 930212 847446 774482 711904 659463 616946 584007 560042 544640 537715
56813 537715 539057 548255 565352 591174 626872 673357 730820 797522 867930 932175 978271 996343
56801 996343 982539 940481 879343 809736 740180 676065 620253 573604 535486 504995 481983
56790 481983 466505 457643 453785 454066 458751 468257 482631 502127 527344 558320 593790 631165 666452
56777 666452 694043 707826 703781 682119 647204 605421 562477 521591 483671 449066 418699 393267
56765 393267 372138 354081 338799 326753 317658 310159 303093 296195 289556 283384 278346 275157 273493
56752 273493 272118 270298 268300 266437 264555 262663 261121 259865 258267 256069 253620 251014 247915 244569
56738 244569 241920 240230 238534 236053 233264 230938 228907 226607 224140 222027 220337 218783 217346 216226
56724 216226 215416 214754 214106 213241 211920 210303 208821 207531 206215 205231 205400 206683 207900 208270 208426 209291
56708 209291 210682 211775 212284 212417 212161 211430 210521 209713 208712 207118 205193 203619 202779 202711 203429 204754 206170
56691 206170 207303 208245 209075 209541 209646 210031 211190 212700 213762 214167 214212 214052 213692 213244 212682 211687 210239
56674 210239 208983 208449 208254 207618 206344 204784 203146 201418 199735 198311 197195 196436 196195 196334 196305 195807
56658 195807 195152 194582 193816 192780 192164 192552 193427 193771 193316 192583 192036 191907 192479 193743 194998 195539 195584 195891
56640 195891 196611 197209 197304 196929 196139 195044 194158 194075 194816 195961 197224 198375 198916 198584 197975 197934 198397 198576
56622 198576 198224 197886 197864 197776 197368 197002 196977 196958 196538 195965 195855 196355 196979 197204 196940 196351 195423 193992 192291
56603 192291 191178 191456 192954 194667 195810 196320 196351 195903 195177 194722 194825 195243 195840 196911 198460 199730 200064
56586 200064 199850 200038 201092 202911 205315 207905 209821 210407 210062 209900 210688 212477 214900 217289 218833 219282
56570 219282 219340 219890 221070 222589 224589 227492 231218 235194 239082 242958 246903 250938 255169 259500 263373
56555 263373 266329 268630 270829 272932 274518 275523 276319 277134 277865 278392 278637 278411 277576 276211 274393 272104
56539 272104 269561 267226 265147 262805 259948 257033 254442 251934 249424 247496 246394 245306 243589 242059
56525 242059 241935 242986 243855 243845 243201 241919 239567 236315 233042 230252 227751 225392 223305 221329 219054
56510 219054 216451 213818 211219 208679 206733 205976 206222 206842 207623 208452 208613 207554 206101 205667 206393 207297
56494 207297 208064 209254 210743 211596 211849 212917 215550 218661 220969 222715 224861 227505 229987 231998 233731
56479 233731 235324 236852 238593 240823 243494 246387 249292 251902 253917 255497 257262 259722 262943 266708
56465 266708 270578 273950 276620 279164 282117 284935 286560 286898 286873 287014 286910 286205 285166 284044 282755 281554
56449 281554 281219 282175 284013 286159 288420 290697 292895 295341 298596 302524 306114 308437 309231 308470 306054
56434 306054 302184 297459 292400 287325 282551 278112 273441 268167 263071 259293 256653 253873 250507 247474
56420 247474 245466 244087 242959 242439 242547 242312 241002 239252 238238 238260 238730 239048 238987 238685 238601 239036 239498 239157
56402 239157 238048 237133 237040 237532 238373 239721 241339 242371 242453 242301 242791 244099 246019 248283 250268 251273
56386 251273 251572 252375 254344 256926 259453 261974 264528 266567 267731 268466 269333 270417 271820 273896 276487
56371 276487 278713 280077 281011 281891 282365 282189 281893 281998 282290 282480 282880 283850 285196 286566 287863 288876 289305
56354 289305 289504 290385 292193 294188 295909 297808 300214 302740 305272 308477 312613 316862 320619 324608 329888
56339 329888 336511 343835 351371 358667 365203 371160 377468 384420 391034 396448 401050 405510 409640 413076
56325 413076 416175 419252 421667 422665 422520 421998 421304 420324 419181 417761 415389 411845 408070 405061 402656
56310 402656 400174 397575 395254 393303 391751 390879 390558 389977 388787 387832 388025 389212 390825 392823 395166
56295 395166 397224 398711 400532 403732 408179 413134 418493 424527 430975 437313 443610 450408 458128 467089
56281 467089 477586 489472 502248 515901 530901 547193 564175 581980 601552 623098 645883
56270 645883 670147 697677 729701 765818 805992 851859 904692 963524 1026866 1095081 1169472
56259 1169472 1250099 1336066 1427022 1522820 1622395 1724286 1827467 1930414 2030345 2124669 2212206
56248 2212206 2291651 2360106 2414891 2456034 2485368 2504020 2512327 2511435 2503272 2489451 2471438 2451019
56236 2451019 2429244 2405770 2380459 2354454 2328215 2299809 2266865 2228967 2186274 2137268 2080365
56225 2080365 2016797 1949368 1878933 1804616 1726977 1648375 1570261 1492455 1415224 1340083 1268368
56214 1268368 1200839 1138575 1082468 1031792 984952 941490 901860 865712 832348 802496 777544
56203 777544 757070 739140 722990 709471 698818 689933 682077 675480 670105 665437 661650 659418 658596
56190 658596 658632 660210 664804 672574 682144 692312 702489 711792 719432 725873 732024 737578 741707 744914
56176 744914 748333 751563 753118 752724 751328 749197 746077 742887 741034 740207 738962 737396 737084 738498 740784
56161 740784 744054 749597 757594 766787 776645 787774 800102 812791 826199 841860 860251 880594
56149 880594 902943 928485 957741 990647 1028592 1074246 1129268 1194447 1272281 1367056 1481947
56138 1481947 1618070 1776548 1959072 2165720 2393959 2639657 2896570 3154409 3399997
56129 3399997 3621855 3813307 3972661 4103556 4215077 4317740 4416930 4510497 4591839 4653055
56119 4653055 4686387 4687358 4658802 4609932 4550127 4484312 4412913 4332202 4233679 4106627 3944190
56108 3944190 3746926 3521221 3276828 3025805 2780167 2548314 2334592 2142025 1973056
56099 1973056 1827462 1702348 1594993 1503807 1426619 1360802 1305383 1260348 1223659 1191814 1163601
56088 1163601 1140296 1121848 1105974 1091532 1079490 1069891 1061059 1052651 1046361 1042759 1040431 1038903 1039287
56075 1039287 1041356 1043292 1045037 1048535 1053955 1059192 1063868 1070102 1078415 1086694 1094329 1103407 1114468 1125027
56061 1125027 1133867 1142971 1153560 1164018 1173483 1183680 1195400 1206865 1217544 1229859 1245195 1261761
56049 1261761 1278326 1296392 1316702 1337235 1356748 1376899 1399035 1422361 1446923 1474606 1505397
56038 1505397 1536570 1567352 1600407 1636910 1674351 1711039 1748344 1786486 1822738 1856196 1889869
56027 1889869 1925695 1961917 1997604 2034981 2074856 2114627 2153403 2194220 2238626 2284188 2329955
56016 2329955 2378972 2432537 2487581 2542873 2602088 2667435 2736100 2806515 2882025 2964476 3050312
56005 3050312 3137267 3228842 3327738 3431030 3536453 3647252 3765972 3889635 4016065 4148726
55995 4148726 4290182 4437050 4586586 4741832 4905121 5073465 5245944 5428659 5626717
55986 5626717 5838578 6063928 6309112 6578536 6869060 7179579 7517550 7889089 8291918
55977 8291918 8725701 9199694 9722016 10291767 10911001 11593940 12354705 13197334 14129005
55968 14129005 15171958 16351500 17685513 19199863 20943196 22976053 25364125 28202124
55960 28202124 31629909 35802399 40851279 46890794 54045436 62456793 72295661 83816456
55952 83816456 97407215 113576666 132928863 156206363 184326816 218181827 258012023
55945 258012023 302416666 347439721 386553172 412253225 418966686 405617824 376009992
55938 376009992 336739500 294269053 253098210 215583662 182612598 154253506 130166001
55931 130166001 109880225 92947998 78940862 67410562 57921550 50105372 43655785
55924 43655785 38300537 33811998 30025668 26817876 24075482 21703471 19641448 17847494
55916 17847494 16275224 14881980 13644839 12549529 11573133 10692346 9898051 9186777 8546562
55907 8546562 7964097 7436612 6963815 6536139 6142677 5782755 5458382 5162723 4886924
55898 4886924 4631096 4398020 4182664 3978124 3785762 3609721 3447230 3293476 3150197
55889 3150197 3020298 2899544 2782464 2671276 2570211 2476102 2383274 2293135 2210349 2133764
55879 2133764 2059503 1989030 1925919 1868121 1811296 1756618 1707683 1662726 1617332 1572165 1530969
55868 1530969 1493369 1456342 1420429 1388082 1358186 1328333 1300202 1276808 1256808 1237320 1219830
55857 1219830 1207496 1199046 1191301 1185473 1185090 1189641 1196006 1204201 1215892 1228920 1238889 1244693 1247045
55844 1247045 1243046 1227741 1200204 1163311 1118929 1068222 1015314 965407 919891 877542 839219
55833 839219 806838 779123 753214 729508 710347 694992 680518 666843 656322 649075 643021 637836
55821 637836 634577 632021 627637 621762 616918 613485 609823 605936 603129 600585 596125 589856 583420 576294
55807 576294 566603 554997 543907 533464 521939 509815 499515 491296 483087 474306 466251 458716 449752
55794 449752 438943 427737 416445 404073 391150 379707 370325 361901 354216 347987 342668 337030 331736
55781 331736 328649 327894 328240 329750 333033 336305 336265 331733 323712 312478 297816 281802 267932 257248
55767 257248 248115 239744 232989 227768 222862 218413 215709 214292 212155 209024 206652 205618 204633 203308
55753 203308 202821 203412 203820 203713 204198 205519 206672 207618 209404 211546 211646 208278 202356 195341 188102 181750
55737 181750 177388 174613 172074 169646 168247 167654 166601 165001 163922 163355 162108 159985 157958 156199 154002
55722 154002 151598 149914 148689 147007 145519 145732 147315 148592 149605 152064 156162 160232 163887 168841
55708 168841 176036 184439 193233 202814 212954 222261 230186 237382 243446 246483 245628 242042 236756 229523
55694 229523 220397 210539 200777 191105 182029 174603 168766 163570 159280 157198 157098 157080 156423 156312 157173 157606
55678 157606 156888 156328 157153 158914 160908 163304 165874 167357 167187 166456 166302 166661 167141 167690 167868 166914 165004
55661 165004 163044 160949 157780 153750 150260 147686 145111 142585 141507 142159 142916 142585 141549 139959 136971
55646 136971 132672 128685 125791 122737 118385 113316 108437 103820 99799 97271 95888 93850 90649 88175
55632 88175 87897 88718 88866 88105 86703 83985 79662 75246 72480 71305 70696 70373 70412 70256 69496 68805 68930
55615 68930 69535 69952 70131 69984 68869 66777 65015 64690 65312 65722 65485 64627 63076 61264 60258 60363 60541
55598 60541 60010 59456 59839 60967 62053 62714 62688 61598 59818 58606 58629 59298 60090 61363 63156 64465 64630
55581 64630 64348 64446 64768 65006 65416 65841 65306 63614 62179 62127 62695 62637 62208 62524 63827 65596 67651 70042
55563 70042 72460 74753 77420 80669 83602 85123 85130 84135 82398 80145 77876 75772 73435 70799 68555
55548 68555 67130 66080 65050 64428 64492 64821 65116 65657 66411 66715 66420 66329 66919 67702 68386 69460 70964 71945
55530 71945 71860 71314 70656 69197 66649 64062 62281 60673 58390 55765 53445 51260 48970 46994 45444
55515 45444 43584 41311 39961 40497 42004 43094 43630 43915 43440 41866 40177 39386 38990 38041 36807 36020
55499 36020 35350 34063 32440 31177 30139 29015 28420 28955 29847 29921 29304 28885 28759 28531 28456 28898 29305 29109
55481 29109 28991 29843 31023 31088 29793 28021 26205 24256 22594 21793 21435 20650 19590 19205 19794 20909 22301
55464 22301 23806 24654 24130 22740 21687 21458 21807 22562 23379 23315 21969 20585 20714 22133 23322 23609 23537
55447 23537 23506 23480 23854 25183 27043 28271 28365 27710 26707 25655 25183 25631 26275 26215 25730 25690 26027 25974 25481
55428 25481 25141 25027 24835 24943 25993 27603 28744 29299 29982 30867 31270 31057 30883 31105 31560 32308 33435 34239
55410 34239 33849 32636 31891 32104 32714 33460 34729 36486 38068 39177 40064 40680 40707 40470 40693 41212 40991 39516
55392 39516 37252 34678 31883 29135 26822 24769 22600 20781 20252 20978 21920 22476 22937 23510 24012 24614
55376 24614 25722 26928 27123 25929 24095 22393 21099 20588 21237 22543 23429 23706 24227 25390 26557 27232
55360 27232 27718 28200 28257 27751 27364 27757 28898 30505 32329 33776 34109 33395 32504 31936 31453 31045 31250 32105
55342 32105 32702 32319 31206 29817 28026 25714 23517 22356 22530 23585 24749 25351 25234 24907 24894 24983 24668
55325 24668 24161 24159 24599 24584 23741 22776 22399 22545 22982 23903 25377 26855 27668 27648 26961 25845 24751 24215 24324
55306 24324 24735 25325 26231 27157 27347 26597 25655 25246 25143 24630 23502 22267 21593 21748 22389 22848 22859 22972 23909
55287 23909 25597 27234 28249 28739 28982 28992 28614 27725 26362 24861 23664 22789 21849 20957 21049 22701 25064
55270 25064 26741 27383 27671 28056 28324 28201 27586 26375 24779 23534 23076 22849 22230 21741 22354 23977 25654
55253 25654 26948 28037 28711 28575 28114 28306 29152 29702 29583 29312 29103 28544 27639 27037 27040 27345 27863 28740 29573
55234 29573 29746 29580 29977 30872 31267 30893 30566 30708 30882 31023 31700 32836 33493 33399 33322 33520 33246 32377 32073
55215 32073 32979 34036 34054 33377 33060 33291 33603 33833 34029 34070 34060 34478 35275 35524 34600 33041 31755 31058 30935
55196 30935 31484 32519 33479 34183 34967 35755 35930 35526 35486 36164 36554 35742 34184 32876 32080 31589 31375 31245
55178 31245 30655 29569 28822 29023 29890 31146 33112 35764 38149 39576 40440 41094 40920 39427 37416 36013
55162 36013 35296 34820 34725 35284 36038 36444 36818 37677 38696 39291 39690 40427 41267 41600 41513 41603 42103 42980 44381
55143 44381 46218 47835 48942 50264 52384 54555 55666 55859 56131 56789 57393 57782 58051 57907 57118 56296 56038
55126 56038 55598 53707 50621 48053 46934 46451 45587 44526 44031 44278 44890 45598 46381 47156 47702 47781 47311 46537
55108 46537 45975 45962 46331 46639 46561 45997 45097 44320 44100 44338 44598 44858 45445 46225 46638 46807 47594 49152 50426
55089 50426 50783 51097 52311 53857 54613 54708 55173 56273 57384 58245 59230 60526 62000 63701 65594 67019
55073 67019 67310 66809 66405 66251 65795 64908 64072 63503 62999 62693 63137 64523 66396 68187 69576 70453 71048 71874
55055 71874 73064 74070 74579 75273 76945 79216 80972 81746 81811 81200 79628 77308 74963 72993 71335 70050
55039 70050 69273 68737 68117 67706 67952 68472 68423 67770 67258 67157 66951 66448 66286 67031 68421 69764 70589 70734 70246
55020 70246 69290 67826 65506 62350 59257 57259 56392 55911 55408 55032 54821 54573 54299 54062 53473 52115 50406
55003 50406 49276 48937 48679 47911 46773 45759 45372 46094 48044 50644 53206 55688 58281 60574 62010 62991
54987 62991 64534 66835 69133 71013 72917 75171 77449 79471 81469 83681 86102 88922 92475 96543
54973 96543 100441 104057 108090 113048 118662 124557 130817 137530 144479 151701 159768 169068 179205 189568
54959 189568 200179 211630 224381 238289 252592 266075 277317 284883 287455 284290 275875 263795
54947 263795 249542 233715 216757 199851 184317 170463 157852 146406 136380 127517 119270 111863
54935 111863 106160 102338 99536 96985 94737 93176 92552 93082 94835 97387 100196 103295 106962 110941 114913
54920 114913 119567 126134 134783 144583 155202 167485 181966 197832 213755 228769 241763 251056
54908 251056 255261 254180 248514 239277 227659 214673 200568 185289 169707 155504 143436 132654
54896 132654 122267 112724 104971 99029 94209 90161 86946 84475 82564 81251 80533 80025 79313 78389 77412
54881 77412 76360 75220 74139 73098 71835 70341 69054 68284 67811 67256 66439 65251 63623 61841 60381
54866 60381 59328 58441 57804 57723 57925 57665 56890 56478 56965 57815 58261 58149 57555 56422 55032 54080 53791 53633
54848 53633 53327 53354 53958 54543 54703 54996 55923 56889 57089 56801 56838 57206 57245 56823 56490 56592 57000 57602 58479 59660
54828 59660 61142 62880 64464 65238 65260 65566 66874 68559 69648 70365 71762 74177 77049 80163 84048 89014
54812 89014 94613 100375 106449 113239 120865 129375 139226 151180 165581 181774 198417 214550 230190
54799 230190 245431 259054 268716 272744 271227 265218 255673 243646 230655 217932 205652 193512
54787 193512 181778 171091 161611 153012 145108 137945 131571 126254 122607 120819 120037 119205 118289 118010 118658
54772 118658 119951 121948 125215 129971 135747 142156 149493 158413 169348 182297 196887 212670 229571
54759 229571 247902 267504 287058 304670 318959 329089 334034 332697 324962 312098 295873 277647
54747 277647 258430 239310 221341 205025 190137 176114 162649 149969 138519 128490 119849 112760
54735 112760 107477 103728 100621 97475 94394 91769 89661 87988 86860 86258 85741 84972 84218 83859 83697 83326
54719 83326 82888 82871 83271 83556 83402 83004 82679 82534 82487 82294 81645 80530 79380 78612 78239 78179 78562 79387 80221
54700 80221 80704 81015 81395 81545 81060 80164 79463 79236 79487 80340 81758 83108 83724 83764 83939 84648 85929 87931
54682 87931 90577 93024 94356 94804 95436 96668 97916 98792 99756 101332 103484 106045 109076 112450 115705
54667 115705 118672 121804 125564 129863 134318 138678 142869 146976 151283 155944 160612 164901 169167 174199
54653 174199 180052 185994 191781 198211 205947 214427 222497 229560 235496 239782 241397 239546 234115 225599
54639 225599 214949 203337 191646 180160 168913 158238 148671 140432 133249 126771 121035 116526 113740
54626 113740 112576 112219 111792 111054 110210 109178 107570 105490 103831 103426 104229 105689 107624 110252 113416 116273
54610 116273 117971 118488 118603 119059 119845 120323 119968 118822 117229 115406 113479 111700 110266 108937 107192 104858
54594 104858 102360 100256 98653 97176 95375 93151 90888 89158 88165 87495 86491 84914 83173 81920 81411
54579 81411 81176 80384 78708 76802 75609 75256 75074 74719 74621 75074 75629 75864 76064 76435 76288 74993 73304 72634
54561 72634 73172 73878 74307 75228 77161 79440 81267 82714 84118 85346 86381 87849 90148 92627 94504
54546 94504 96133 98494 101765 105303 108857 112767 117027 121102 124929 129161 133966 138295 140896 141564 140820
54531 140820 138839 135456 131026 126448 122169 117755 112728 107360 102305 97790 93585 89569 85950 82995
54517 82995 80868 79618 79007 78458 77570 76615 76114 75986 75619 74844 74207 74174 74642 75460 76760 78371 79555 79982
54499 79982 80450 81947 84301 86502 88070 89295 90243 90504 90102 89889 90634 92207 93966 95502 96695 97397
54483 97397 97467 97013 96356 95830 95679 95986 96608 97286 97875 98404 98992 99784 100855 101967 102675 102907 103210 104026 105020
54464 105020 105529 105481 105297 105040 104360 103270 102315 101765 101239 100378 99369 98560 98011 97771 98162 99353 100854 101776
54446 101776 101505 100014 97750 95389 93506 92262 91476 91053 91098 91560 91988 91869 91085 90012 89226 89046 89185
54429 89185 88931 87932 86749 86316 86953 88182 89460 90656 91842 93052 94341 95699 96856 97498 97721 97924
54413 97924 98219 98385 98465 98916 100048 101703 103697 106157 109164 112407 115438 118130 120707 123480 126648 130175
54397 130175 133806 137290 140459 142926 143998 143371 141692 139905 138205 136196 133909 131835 129950 127603
54383 127603 124548 121326 118340 115303 112029 109048 106911 105410 103960 102261 100242 97877 95551 94074
54369 94074 93810 94179 94468 94630 94871 95022 94939 95065 95823 96752 96942 96120 94738 93266 92074 91755 92751 94670
54351 94670 96652 98473 100661 103447 106256 108439 110078 111716 113649 115747 117768 119617 121280 122626
54337 122626 123353 123254 122546 121673 120686 119096 116598 113619 110827 108313 105656 102653 99609 96928 94731 92859
54321 92859 90992 88847 86477 84373 83042 82528 82438 82295 81719 80526 78898 77278 75821 74168 72033 69820
54305 69820 68285 67722 67779 67924 67735 66901 65424 63785 62544 61747 61034 60260 59693 59552 59724 60064 60666 61686
54287 61686 63033 64399 65532 66423 67232 68038 68671 68824 68318 67158 65461 63582 62241 62042 62762 63537 63947
54270 63947 64491 65725 67389 68828 69909 71005 72352 73911 75650 77418 78665 78877 78284 77685 77546 77669
54254 77669 77754 77873 78331 79369 80946 82523 83105 81994 79570 77030 75267 74260 73542 72886 72430 72371 72654
54237 72654 72862 72496 71549 70635 70288 70334 70292 70136 70180 70378 70375 70242 70523 71368 72172 72402 72342 72674 73547 74389 74494
54216 74494 73678 72457 71653 71638 71960 71964 71672 71673 72112 72333 71712 70375 68845 67412 66232 65631 65783 66272 66452
54197 66452 66175 65788 65484 65084 64490 63943 63665 63522 63254 62911 62880 63492 64628 65707 66093 65665 64997 64885 65661
54178 65661 66999 68349 69411 70207 70840 71286 71341 70786 69709 68670 68257 68365 68180 67174 65916 65466 66026
54161 66026 66698 66717 66458 66833 68063 69451 70234 70271 69998 70040 70785 71944 72608 72101 70767 69555 68937 68638
54143 68638 68388 68319 68520 68774 68990 69427 70191 70897 71142 70964 70564 69942 69140 68522 68426 68801 69486 70542 71956
54124 71956 73304 74126 74440 74521 74413 74053 73616 73290 72844 71873 70402 68855 67592 66758 66432 66472 66373 65758 64892
54105 64892 64297 64056 63948 64035 64467 64753 64034 62243 60363 59281 58886 58601 58296 58287 58759 59555 60303 60552 60065
54086 60065 59195 58683 58821 59133 59178 59276 59970 61033 61610 61345 60834 60837 61441 62230 62897 63357 63492 63208 62692 62275
54066 62275 62014 61727 61457 61579 62286 63318 64451 65892 67813 69710 70723 70582 69814 69033 68418 67949 67743
54049 67743 68002 68904 70602 73011 75636 77972 80071 82296 84569 86471 88122 90228 93045 96003 98678
54034 98678 101415 104551 107766 110790 114026 117816 121697 125222 128931 133591 138891 143886 148361 152684
54020 152684 156561 159195 160725 162314 164556 166824 168590 170335 172610 174933 176297 176215 174797 172353 169433
54005 169433 166729 164360 161584 157757 153260 149013 145407 142221 139305 136738 134447 132279 130443 129321
53991 129321 128699 127708 125795 123432 121569 120589 120217 120338 121331 123289 125385 126609 127005 127522 128581 129464
53975 129464 129437 128805 128307 127939 127072 125498 123706 122254 121425 121357 121938 122664 123107 123423 123877 124093 123445 122070
53957 122070 120740 119821 119052 118325 117872 117647 117374 117392 118580 121130 124118 126677 128934 131498 134745 138939
53941 138939 144359 150837 157755 164886 172551 180499 187380 191980 194483 195876 196603 196396 194975 192270 188395
53926 188395 184029 180416 178287 177053 175708 174210 173381 173733 175131 177322 180095 183039 185861 188799 192082
53911 192082 195194 197503 199500 202509 207070 212483 218161 224480 231739 239044 245014 249237 252326 254648
53897 254648 255701 254921 252628 249818 247208 244799 242412 240251 238666 237461 235901 233538 230688 227807
53883 227807 224654 220463 214858 208244 201240 194066 186666 179240 172406 166740 162220 158264 154365 150561
53869 150561 147134 144078 141168 138483 136402 134972 133668 131876 129319 125961 121967 117923 114563 112003
53855 112003 109734 107623 106346 106286 106613 106198 105070 104120 103562 102615 100839 98942 97871 97675 97682 97476 97256
53838 97256 97340 97638 97622 96770 95095 93226 91914 91447 91617 92061 92456 92539 92254 91887 91842 92256 92986 93863 94735
53819 94735 95367 95545 95311 94928 94728 95105 96450 98785 101606 104325 106729 108784 110282 111153 111954 113511
53803 113511 116075 119255 122729 126517 130511 134305 137757 141245 145124 149205 153087 156761 160609 164859
53789 164859 169185 172777 174916 175679 176069 177112 178775 180073 180334 179894 179483 179386 179500 179772 180062 179854 178657
53772 178657 176655 174574 172930 171779 171148 171132 171356 170884 169071 166366 163826 161976 160527 159191 158245 157979
53756 157979 157953 157232 155287 152363 149056 145849 143059 140841 139094 137605 136322 135164 133591 130880 127146
53741 127146 123622 121469 120570 119924 118981 117990 117155 116176 114886 113762 113349 113444 113337 112804 112465 112977 114107
53724 114107 114916 114924 114813 115719 117814 119960 120912 120680 120418 121110 122693 124388 125517 125881 125660 125292 125367 126382
53706 126382 128437 131196 134224 137320 140449 143382 145612 146831 147376 147933 148814 149802 150697 151639 152754 153869
53690 153869 154844 155895 157186 158375 158976 159157 159763 161431 163920 166348 167920 168491 168662 169390 171274 174101
53674 174101 177080 179482 181009 181749 182047 182326 182788 183229 183292 182884 182268 181884 182201 183522 185591 187496 188414
53657 188414 188524 188873 190153 191864 192913 192877 192444 192561 193372 194180 194434 194514 195238 196680 197860 197785 196535 195052
53639 195052 194118 193842 194023 194531 195209 195710 195729 195477 195725 197173 199556 201582 202130 201547 201326 202374 204049
53622 204049 205210 205747 206521 208075 210017 211645 212623 212981 212916 212840 213370 215014 217821 221328 224759 227510
53606 227510 229603 231621 234058 236940 240171 243873 248112 252626 257202 262032 267226 272252 276447 279932
53592 279932 283398 287122 290814 294460 298643 303883 310122 317033 324298 331411 337682 342743 346845 350570
53578 350570 354524 359189 364618 370213 375280 379821 384287 388574 391975 394295 396279 398573 400836 402318
53564 402318 402777 402381 401233 399594 398169 397514 397259 396387 394206 390719 386351 381770 377832 375114 373441
53549 373441 372170 370858 369441 367902 366146 364143 361857 359122 355909 352681 350169 348748 348241 348233 348361
53534 348361 348395 348435 348973 350463 352771 355302 357648 359859 362135 364621 367534 371155 375548 380516 385999
53519 385999 392175 399090 406465 414119 422296 431203 440419 449251 457726 466811 477371 489236 501595
53506 501595 514076 527038 540819 555194 569764 584564 600060 616756 634980 654793 675789
53495 675789 697225 718714 740690 763854 788238 813149 837965 862608 887348 912524 938449
53484 938449 965016 991330 1016320 1039974 1063458 1087665 1112109 1135758 1158560 1181479 1205105
53473 1205105 1228965 1252363 1275383 1298630 1322227 1345477 1367538 1388155 1407600 1426056 1443326
53462 1443326 1459197 1473830 1487510 1500118 1511184 1520565 1528819 1536734 1544645 1552419 1559975 1567422 1574595
53449 1574595 1580636 1584302 1584779 1582153 1577108 1570307 1562144 1552773 1541969 1528949 1512911 1494055 1473756
53436 1473756 1453331 1432874 1411609 1389118 1365650 1341430 1316310 1290227 1263552 1236824 1210436
53425 1210436 1184585 1159156 1133711 1108106 1083213 1060473 1040553 1022844 1006425 990991 976613
53414 976613 963192 950622 939166 929230 920976 914464 909932 907600 907453 909412 913479 919491 927104 936335
53400 936335 947737 961620 977398 994193 1011877 1031100 1052389 1075657 1100495 1126551 1153705
53389 1153705 1182160 1212314 1244345 1278056 1313359 1350628 1390230 1431952 1475321 1520337 1567379
53378 1567379 1616502 1667355 1719754 1773860 1829701 1886894 1945021 2003997 2063920 2124735 2186120
53367 2186120 2247567 2308562 2368800 2428176 2486447 2542997 2597044 2647894 2694898 2737501 2775669
53356 2775669 2810044 2841301 2869523 2894565 2916714 2936387 2953293 2966523 2975598 2980854 2982607 2980396
53344 2980396 2973361 2961027 2943284 2919681 2889103 2850405 2803500 2749865 2691840 2631353 2569430
53333 2569430 2506843 2444670 2383824 2324431 2266243 2209446 2154482 2101206 2048852 1996846 1945196
53322 1945196 1894114 1843800 1794557 1746526 1699358 1652883 1608117 1566671 1528888 1493398 1459008
53311 1459008 1426246 1396385 1369707 1345600 1323862 1304766 1287927 1272059 1256140 1240247 1225042
53300 1225042 1210972 1198165 1186640 1176341 1167189 1159291 1152861 1147810 1143584 1139570 1135618 1132208 1130188
53287 1130188 1130159 1131815 1134081 1136294 1139176 1144210 1152055 1162154 1174006 1188180 1205590 1226176 1248862
53274 1248862 1272694 1297526 1323577 1350757 1378514 1406156 1433210 1459691 1486052 1512683 1539430
53263 1539430 1565751 1591294 1616108 1640177 1663003 1683835 1702292 1718690 1733774 1748165 1761906
53252 1761906 1774463 1785105 1793318 1798886 1801725 1801823 1799262 1794111 1786255 1775473 1761682 1744944 1725285
53239 1725285 1702738 1677611 1650411 1621399 1590513 1557877 1524173 1490301 1456902 1424375 1393043
53228 1393043 1362961 1333804 1305275 1277469 1250503 1224001 1197379 1170514 1143673 1116867 1089797
53217 1089797 1062393 1034854 1007113 978883 950382 922439 895641 869934 845375 822593 801976
53206 801976 782912 764529 746783 730112 714254 698293 681864 665461 649398 633198 616470
53195 616470 599745 583854 568769 553683 538183 522878 508734 496054 484239 472374 459954
53184 459954 447128 434408 422252 410863 400248 390239 380458 370454 360040 349410 338793 328064
53172 328064 316953 305719 295354 286785 279837 273279 266100 258528 251584 245815 240871 236215 231745
53159 231745 227521 223432 219500 216158 213730 211809 209662 207161 204801 202825 200894 198824 197096 196237
53145 196237 196110 196226 196518 197245 198284 199096 199528 200165 201561 203468 205129 206201 207017 208010 209146 209883 209503
53128 209503 207505 204077 200222 197043 194720 192439 189510 186218 183304 180923 178590 176019 173494 171376
53114 171376 169669 168200 166869 165549 164063 162429 160858 159348 157599 155522 153579 152258 151435 150560 149415
53099 149415 148345 147804 147885 148308 148663 148635 148158 147373 146338 144855 142805 140616 139135 138808 139140 139151 138347 137012
53081 137012 135501 133607 130965 127941 125527 124240 123581 122913 122407 122544 123087 123275 122943 122651 122589 122127 120786
53064 120786 119015 117582 116722 116298 116272 116479 116365 115645 114983 115346 116747 118207 118940 119022 118824 118366 117530 116564
53046 116564 116031 116338 117431 118900 120319 121532 122624 123595 124179 124075 123260 122034 120835 120063 119874 120059
53030 120059 120271 120427 120674 120915 120712 119808 118414 116801 114977 113064 111576 110959 111083 111514 112048 112634 113065
53013 113065 113184 113195 113384 113660 113738 113561 113256 112925 112823 113428 114839 116368 117216 117346 117199 116887 116330 115965 116528
52994 116528 118063 119867 121538 123505 126355 130099 134247 138183 141390 143698 145378 146658 147261 146832 145668
52979 145668 144447 143318 141920 140274 138857 137678 136079 133821 131609 130096 128939 127399 125484 123936
52965 123936 123293 123334 123384 122963 122270 122111 123010 124412 125173 124938 124519 124733 125414 125861 125726 125073 124072 123128 122924
52946 122924 123779 125159 126263 126882 127291 127540 127352 126626 125649 124880 124765 125592 127135 128562 129113 128900 128736
52929 128736 129218 130165 130933 131044 130561 130002 129856 130034 129979 129473 129091 129503 130468 130940 130282 129071 128557 129529 131797
52910 131797 134566 137053 138773 139571 139660 139598 139922 140637 141236 141384 141396 141801 142605 143302 143507 143268 142817 142379 142205
52891 142205 142416 142800 143051 143223 143609 144250 144952 145763 146917 148295 149520 150699 152469 154997 157451 158931
52875 158931 159621 160611 162774 166047 169647 172739 175060 177052 179262 181756 184364 187310 190902 194591 197123
52860 197123 197988 198041 198273 198606 198490 198069 197999 198429 198861 198858 198315 197215 195836 195109 196096 198892 202422 205396
52842 205396 207167 207713 207236 205997 204370 202840 201863 201537 201329 200424 198518 196060 193583 191097 188363 185411
52826 185411 182443 179576 177011 175175 174250 173795 173203 172297 171099 169389 167041 164561 162650 161332 160065
52811 160065 158667 157577 157128 157096 157014 156597 155786 154755 153892 153478 153360 153149 152675 151945 150874 149399 147734
52794 147734 146081 144305 142335 140723 140214 140770 141591 142101 142391 142628 142667 142382 141920 141442 140989 140677 140591 140423
52776 140423 139769 138815 138170 137925 137542 136899 136661 137162 137635 137204 136106 135164 134426 133235 131461 129725 128247
52759 128247 126381 123704 120932 119096 118205 117342 115923 114251 112809 111627 110546 109651 109043 108510 107826 107142
52743 107142 106651 106025 104722 102858 101214 100245 99605 98876 98229 97998 98036 98028 98183 99139 101243 104290 107760 110903
52725 110903 112860 113294 112956 113056 113957 114875 114989 114413 113914 114006 114645 115491 116166 116284 115528 113799 111298 108416
52707 108416 105535 102876 100565 98762 97547 96601 95326 93492 91552 90030 88824 87433 85748 84194
52693 84194 83102 82315 81521 80658 79882 79303 78839 78246 77393 76620 76586 77500 78646 79047 78483 77484 76447 75328
52675 75328 74244 73692 73783 73716 72562 70477 68699 68242 68870 69556 69786 70084 71076 72386 72878 72015 70489 69324
52657 69324 68838 68818 69183 69862 70363 70172 69541 69177 69158 68890 68268 68141 69172 70816 71979 72332 72496 73113 74280
52638 74280 75837 77774 80239 83368 87146 91196 94665 96494 96056 93641 90360 87452 85498 84167 82801
52623 82801 81236 79992 79614 79987 80450 80510 80284 80206 80438 80699 80653 80261 79678 79011 78420 78328 79163 80785 82441
52604 82441 83431 83641 83374 82969 82731 82965 83812 85150 86788 88586 90335 91793 92951 93945 94602 94500 93696
52587 93696 92959 92916 93351 93667 93658 93386 92761 91770 90849 90470 90598 91032 91991 93726 95780 97334 98173 98733 99321
52568 99321 99919 100618 101639 102941 104408 106260 108549 110378 110521 108964 107076 106009 105708 105681 105992 106943
52552 106943 108311 109426 109820 109528 108993 108720 108795 108743 108219 107670 107770 108324 108498 108118 107944 108428 109124 109611 110175
52533 110175 111085 111909 112172 112054 111846 111306 110280 109457 109685 110749 111580 111623 111330 111274 111359 111119 110483 109997 110330
52514 110330 111583 113092 114074 114483 114995 116128 117668 119020 119763 119753 119101 118306 118058 118608 119550 120371 120968
52497 120968 121455 121839 122122 122475 123050 123844 124867 126213 127815 129370 130586 131289 131358 130982 130952 132111 134349
52480 134349 136615 138013 138395 137851 136367 134221 132044 130137 128278 126479 125187 124351 123093 120930 118677
52465 118677 117448 117244 117186 116731 115958 115030 114051 113265 112777 112280 111503 110745 110536 110994 111825 112578 112636 111510 109613
52446 109613 108139 107700 107651 107358 107346 108353 109898 110824 110855 110598 110342 109903 109432 109307 109339 109098 108947 109635 110911
52427 110911 111681 111705 111911 112696 113083 112191 110634 109709 109847 110565 111403 112243 113004 113610 114104 114392 114180 113491 112929
52408 112929 113052 113694 114295 114681 115177 116009 116917 117429 117446 117515 118434 120392 122604 124080 124724 125308 126431 127928
52390 127928 129362 130545 131376 131656 131490 131571 132597 134470 136338 137420 137620 137397 137217 137254 137575 138498 140463
52373 140463 143404 146487 148815 150357 151834 153704 155644 157022 157546 157367 156941 156894 157636 158886 159854 160118
52357 160118 160114 160548 161515 162519 163206 163705 164251 164833 165468 166542 168425 170676 172186 172477 172533 173736 176081
52340 176081 178220 179382 180473 182798 186320 189865 192651 194893 197112 199527 202175 205045 207974 210728
52326 210728 213183 215243 216774 217937 219289 221086 222752 223599 223910 224643 226143 227799 229031 229950 230919
52311 230919 232050 233359 235000 237112 239760 243101 247248 251917 256577 261008 265428 270102 275180 280840
52297 280840 287109 293566 299742 305836 312613 320579 329694 339765 350485 361082 370700 379337 387858
52284 387858 396921 406480 416499 427398 439413 452070 464741 477221 489454 501240 512740 524797
52272 524797 538139 552470 566771 580359 593247 605713 617964 630168 642406 654471 665882
52261 665882 676223 685543 694489 703892 713932 723769 732252 738960 744240 748421 751581 754021 756287 758407
52247 758407 759609 759128 757061 754305 751964 750763 750481 749880 747790 744496 741495 739776 739009 738649 738904 740077
52231 740077 741787 743705 746576 751576 758846 767392 776319 785490 795005 804747 814642 824959 836127 848378
52217 848378 861521 874872 887568 899232 910245 921128 931802 941732 950613 958525 965514 971344
52205 971344 975763 978821 980908 982536 983919 984668 984026 981544 977415 972119 965954 958990 951211 942588 933321
52190 933321 924095 915734 908396 901438 894204 886616 878784 870577 861996 853586 845993 839221 832688 825879
52176 825879 818748 811759 805719 801195 797731 794007 789147 783646 778619 774495 770820 767035 762914 758451
52162 758451 753915 749936 747071 745248 743944 742707 741232 739184 736380 733100 729876 727061 724857 723462
52148 723462 722776 722224 721337 720295 719457 718588 717118 715003 712740 710588 708349 705866 703167 700062 696144
52133 696144 691328 686015 680679 675697 671452 668022 664697 660378 654684 648297 642082 636341 631012 626030
52119 626030 621205 616229 611138 606451 602494 598858 594892 590519 586222 582395 579126 576579 575193 575274 576485
52104 576485 577963 578998 579586 580278 581532 583358 585564 588088 590944 594043 597369 601192 605840 611376 617761
52089 617761 625260 634258 644709 656121 668235 681326 695680 711042 726884 743028 759660 776774
52077 776774 793918 810649 827090 843786 861077 878779 896507 914016 931085 947338 962591
52066 962591 977186 991503 1005190 1017458 1028205 1038213 1047900 1056494 1062992 1067520 1071112 1074336 1076770
52053 1076770 1077716 1076923 1074552 1070918 1066386 1061162 1055097 1047878 1039410 1029882 1019608 1009060 998832 989264
52039 989264 980223 971570 963577 956476 949845 943048 936254 930404 926174 923422 921782 921216 921779 923241 925231
52024 925231 927568 930383 934018 938747 944358 950186 955909 962078 969311 977117 984225 990135 995580 1001294
52010 1001294 1006980 1011872 1015677 1018514 1020411 1021382 1021680 1021482 1020522 1018336 1014617 1008998 1000890 990088 977372
51995 977372 964030 950756 937328 923192 907958 891388 873339 853852 833084 811171 788371
51984 788371 765302 742715 720917 699570 678117 656305 634374 612862 592188 572245 552455
51973 552455 532464 512713 494116 477198 461776 447451 434075 421585 409743 398406 387897
51962 387897 378741 370946 363786 356453 348770 341192 334307 328517 324041 320888 318750 317167 315935 315183
51948 315183 314890 314527 313448 311621 309743 308468 307671 306622 304854 302729 301048 300154 299544 298379 296228
51933 296228 293266 289974 286821 284101 281815 279725 277703 275905 274345 272475 269646 266011 262538 260008
51919 260008 258395 257322 256659 256384 256210 255704 254623 253046 251428 250583 251084 252466 253477 253470 253062 253122 253644
51902 253644 254121 254410 254526 254005 252340 249931 247845 246660 246102 245758 245520 245331 245057 244626 243897 242553 240636
51885 240636 238978 238434 238814 239175 239057 238704 238259 237651 237242 237594 238454 238860 238483 237913 237410 236475 235164 234724
51867 234724 236097 238507 240466 241685 243169 245846 249796 254452 258779 261555 262353 262155 262372 263266 263919
51852 263919 263633 262702 261844 261443 261486 261767 262038 262197 262345 262397 261857 260370 258352 256573 255166 253498 251083
51835 251083 248239 245793 244469 244567 245830 247522 248818 249302 248969 247951 246469 244870 243360 241768 239942
51820 239942 238219 237006 235981 234372 232225 230718 230748 231574 231445 229519 226689 224418 223095 221819 219676
51805 219676 216856 214308 212493 210947 209211 207766 207526 208491 209439 209173 207733 206075 204821 203745 202458
51790 202458 201130 200253 199907 199645 199113 198436 197822 197108 196063 195038 194903 196174 198490 201079 203513 205804
51774 205804 207996 209998 211791 213570 215490 217314 218339 217753 215264 211415 207229 203450 200209 197330
51760 197330 194687 192164 189533 186638 183649 180982 179001 177852 177489 177718 178237 178756 179098 179236 179330 179668
51744 179668 180307 180819 180641 179842 179283 179827 181495 183596 185478 186930 187982 188670 189130 189675 190531 191445 191702
51727 191702 190701 188526 185817 183102 180527 178304 176948 176678 176874 176641 175821 174886 174006 172844 171320 169857
51711 169857 168703 167673 166813 166642 167339 168346 169224 170291 171772 173015 173334 173171 173451 174061 174059 173426 173522 175411
51693 175411 178543 181607 184110 186615 189829 194005 199018 204484 209918 215163 220765 227709 236737 247846
51679 247846 260174 272100 281658 287341 288703 286208 280568 272455 262799 252915 243936 236117 228985 222202
51665 222202 216053 210947 206753 202911 199089 195441 192305 189925 188427 187683 187218 186591 185927 185687 185912 186109
51649 186109 185981 185745 185510 184871 183545 181995 180936 180534 180517 180757 181193 181417 180958 179988 179213 179052 179263 179432
51631 179432 179410 179314 179455 180238 181712 183193 183759 183222 182285 181665 181437 181386 181588 182360 183722 185110 185659 184850
51613 184850 183088 181587 181463 182805 184739 186315 187227 187825 188703 190269 192489 195031 197682 200425 203011
51598 203011 204926 206209 207930 211213 215904 220857 225526 230523 236483 243046 249318 254785 259399 263175
51584 263175 266132 268331 269703 270076 269583 268659 267366 265210 262076 258948 257063 256519 256323 255749 255137 255286
51568 255286 256597 258968 262123 265761 269619 273628 277918 282553 287402 292276 296936 300873 303416 304373
51554 304373 304427 304567 305109 305524 305175 303903 301833 298925 295076 290474 285519 280381 274918 269095 263245 257750
51538 257750 252675 247858 243278 239142 235644 232720 230073 227425 224704 221946 218967 215349 211001 206606
51524 206606 203148 200976 199659 198742 198147 197671 196706 194924 192868 191286 190189 189091 187996 187434 187447 187230
51508 187230 186022 183967 181815 180069 178664 177332 176001 174851 174015 173213 171863 169781 167672 166559 166760
51493 166760 167714 168813 169916 170974 171680 171861 171980 172841 174821 177570 180414 182911 185065 187201 189666
51478 189666 192683 196444 201222 207173 214068 221392 228734 235949 243032 250069 257277 264717 271954 278292
51464 278292 283460 287757 291396 294068 295348 295256 294115 292068 289057 285170 280624 275330 268786 260614 251131
51449 251131 241311 232198 224392 218033 213084 209477 207087 205739 205286 205470 205671 205158 203881 202798 203055
51434 203055 204888 207589 210378 212940 215214 217231 219315 221976 225265 228444 230539 231034 229941 227465
51420 227465 223857 219443 214511 209161 203403 197310 191066 184999 179649 175542 172659 170261 167509 164276
51406 164276 161143 158581 156337 153805 150907 148383 147014 146663 146244 144694 141839 138341 135070 132642 131224
51391 131224 130423 129447 127741 125485 123326 121655 120358 119153 117923 116704 115586 114610 113703 112795 112096 111986
51375 111986 112418 112723 112364 111645 111254 111344 111559 111740 111932 111809 110828 109079 107379 106378 106127 106617 107959 109748
51357 109748 110943 111008 110724 111356 113318 116115 119246 122632 126277 130036 133738 137286 140670 144080 147884
51342 147884 152263 156998 161725 166192 170159 173343 175695 177438 178566 178575 177047 174347 171360 168628 165946
51327 165946 162687 158346 152926 147062 141651 137165 133395 129929 126657 123734 121321 119545 118408 117506
51313 117506 116164 114134 111934 110221 109069 108107 107097 106043 104988 104004 103194 102436 101454 100445 100206 101198
51297 101198 102778 103898 104250 104223 104046 103736 103712 104585 106164 107418 107740 107678 108103 109118 110202 111026 111689 112320
51279 112320 112880 113324 113683 113997 114280 114522 114609 114287 113350 111858 110129 108506 107093 105716 104182 102579 101247
51262 101247 100359 99727 99186 98969 99455 100581 101757 102398 102297 101569 100499 99472 98778 98335 97761 96837 95765
51245 95765 94932 94603 94904 95889 97433 99171 100717 101934 102853 103476 103846 104275 105202 106685 108176 109071 109368
51228 109368 109554 109874 110050 109852 109581 109678 110121 110565 110971 111649 112730 113988 115236 116556 118018 119520 121008
51211 121008 122605 124386 126208 127815 128933 129345 129203 129185 129921 131212 132309 132966 133724 135057 136805 138578
51195 138578 140183 141396 142012 142405 143350 144860 145883 145717 145043 144783 144572 143383 141315 139664 139183 139204 138737
51178 138737 137714 136826 136616 136988 137289 136767 135192 133083 131142 129545 128101 126847 126069 125891 126305 127398
51162 127398 129022 130345 130496 129727 129316 130173 131969 133679 134448 133822 131822 129106 126650 124932 123652 122348
51146 122348 120953 119657 118586 117813 117350 117013 116510 115756 114857 113773 112346 110711 109319 108485 108164 108148 108145
51129 108145 107739 106719 105424 104385 103775 103622 104289 105985 107882 108680 108269 107925 108516 109379 109525 109162 109243
51112 109243 110018 110883 111412 111771 112217 112827 113761 115257 117216 119097 120382 120993 121311 121833 122677 123346 123220
51095 123220 122453 122068 122962 125032 127483 129716 131622 133301 134910 136646 138516 140190 141327 141993 142589
51080 142589 143452 144715 146385 148357 150485 152776 155280 157623 158986 158931 158096 157735 158610 160438 162280 163212
51064 163212 162851 161556 160085 158808 157398 155433 153114 151082 149638 148460 147079 145382 143679 142453
51050 142453 141967 141929 141623 140585 139031 137503 136274 135360 134961 135504 137069 139059 140613 141328 141525 141787 142310
51033 142310 142871 143426 144450 146390 148909 151117 152514 153329 153966 154628 155554 156987 158620 159611 159578 159189 159366
51016 159366 160278 161573 163166 165206 167495 169595 171414 173169 174823 176072 176930 177893 179430 181644 184424
51001 184424 187648 191252 195397 200424 206339 212412 217728 222118 226192 230508 235148 240136 245823 252653
50987 252653 260832 270287 280715 291599 302503 313445 324894 337459 351815 368717 388590 411023
50975 411023 435163 460804 488760 520026 554899 593089 634367 678716 726001 775826 827708
50964 827708 881306 936496 993222 1051165 1109365 1166162 1219642 1268296 1311426 1348954 1380753
50953 1380753 1406224 1424718 1436403 1442291 1443213 1439234 1430432 1417876 1403263 1387858 1372430 1357947
50941 1357947 1345395 1334735 1324848 1314829 1304692 1294477 1283414 1270531 1255547 1238422 1218445
50930 1218445 1194567 1166453 1134514 1098984 1059792 1017433 973204 928186 882553 836398 790837
50919 790837 747662 707997 671780 638554 608230 580870 556173 533596 512949 494505 478489
50908 478489 464727 452877 442748 434165 426697 419847 413626 408730 405973 405492 406524 407921 408836 409046
50894 409046 408809 408620 409037 410477 412842 415390 417276 418407 419548 421452 424102 427079 430412 434533 439419
50879 439419 444347 448856 453607 459834 468004 477375 486945 496456 506360 517159 529151 542705 558322
50866 558322 576268 596458 618964 644409 673583 706748 743721 784588 829973 880526 936576
50855 936576 998577 1067532 1144541 1229980 1323454 1424466 1532711 1647632 1768095 1892733
50845 1892733 2020497 2150492 2281152 2409579 2531778 2643669 2742019 2824568 2889646 2936145
50835 2936145 2964047 2974695 2970216 2952731 2924291 2887381 2845085 2800607 2756861 2716475 2681800
50824 2681800 2654508 2634962 2621984 2613273 2606217 2598490 2588011 2572516 2549546 2517080 2474136 2420565
50812 2420565 2356373 2281494 2196311 2102232 2001709 1897705 1792955 1689514 1588848 1492290
50802 1492290 1401246 1316892 1239882 1170500 1108971 1055435 1009794 971818 941317 918000 901301
50791 901301 890630 885707 886375 892146 902195 915773 932335 951315 972021 993741 1015641 1036561
50779 1036561 1055234 1070807 1082970 1091599 1096489 1097448 1094348 1087098 1075810 1060998 1043313 1023102
50767 1023102 1000544 976199 951006 925666 900389 875338 850890 827331 804789 783750 765179
50756 765179 749712 737017 726392 717779 711814 709033 709467 713016 719795 729991 743649 760771 781419
50743 781419 805596 833132 863876 898081 936564 980330 1029931 1085220 1145824 1211765 1283425
50732 1283425 1360952 1443876 1531203 1621463 1712535 1801753 1886478 1964555 2034299 2094252 2142984
50721 2142984 2178876 2200125 2205525 2195537 2172290 2138302 2095555 2046050 1992816 1939697 1890119 1846223
50709 1846223 1808928 1778374 1754359 1736711 1725160 1718633 1714800 1710795 1704389 1694282 1679470 1658755
50697 1658755 1630885 1594878 1550384 1498214 1440527 1380036 1318907 1258608 1200588 1146357 1096823
50686 1096823 1052179 1012750 979371 952568 931859 916409 906100 901450 902712 909606 921845 939468
50674 939468 962603 991249 1025293 1064415 1107900 1154815 1204298 1255418 1306852 1357086 1404945
50663 1404945 1449600 1490100 1525487 1555519 1580793 1601802 1618238 1629511 1635592 1637003 1634365 1628435
50651 1628435 1620267 1610674 1599605 1586604 1571910 1556608 1541721 1527756 1515276 1505265 1498552 1495323
50639 1495323 1495535 1499401 1507168 1518784 1534106 1552966 1574456 1596541 1617134 1635527 1652282 1667804
50627 1667804 1681619 1692963 1701396 1706706 1708905 1708672 1707404 1706514 1706902 1709243 1714310 1722674 1734366 1749085
50613 1749085 1766407 1785423 1804435 1821491 1835209 1844877 1849985 1850079 1845114 1835546 1821951 1804674 1783868
50600 1783868 1759641 1731920 1700164 1663361 1620576 1571785 1518220 1461703 1403625 1344657 1285380
50589 1285380 1226772 1170027 1116182 1066106 1020403 978926 940635 904433 870190 838750 810977
50578 810977 787052 766593 749095 734215 721897 712399 706007 702656 701862 703121 706360 711972 720384
50565 720384 731505 744657 759167 774975 792433 811613 832250 854422 878678 905193 933305
50554 933305 962498 993531 1027895 1066247 1107927 1151955 1197824 1245164 1293230 1341110 1388044
50543 1388044 1433341 1476354 1516940 1555692 1593475 1630909 1668468 1706791 1746494 1787738 1830196
50532 1830196 1873342 1916641 1959831 2003356 2048423 2096227 2147100 2200643 2256554 2315000 2376059
50521 2376059 2439100 2502801 2565595 2625951 2682493 2734136 2780038 2819183 2849946 2870293 2878592
50510 2878592 2874238 2857509 2828918 2788956 2738399 2678572 2611103 2537597 2459808 2380096 2301416
50499 2301416 2226722 2158446 2098456 2048158 2008378 1979214 1960181 1950445 1948832 1953755 1963453 1976493
50487 1976493 1992022 2009488 2028016 2045939 2060668 2068869 2066922 2051763 2021821 1977417 1920196 1852164
50475 1852164 1775387 1692458 1606620 1520849 1436888 1355519 1277668 1204741 1137775 1076702 1020804
50464 1020804 969709 923686 883126 848009 817868 792050 769932 750936 734504 720247 708284
50453 708284 699128 692910 688804 685742 683760 684059 687413 692965 699090 705143 711847 720164 730366 742176
50439 742176 755273 769505 784984 802138 821344 842475 865128 889325 915572 944096 974420
50428 974420 1005900 1038346 1071958 1107036 1143958 1183021 1223916 1265690 1307598 1349707 1392274
50417 1392274 1434931 1477115 1519117 1562002 1606568 1653027 1701630 1752627 1805188 1857055 1905972
50406 1905972 1951118 1992661 2030324 2063111 2090273 2111776 2127687 2137561 2140594 2135955 2122841 2100674
50394 2100674 2069535 2030178 1983443 1929873 1870020 1804769 1735095 1661834 1586112 1509835 1435366
50383 1435366 1364660 1298890 1238770 1184898 1137839 1098214 1066737 1043787 1028826 1020538 1017744 1020006
50371 1020006 1027204 1038828 1053836 1070940 1088595 1104791 1117285 1124297 1124926 1118928 1106300 1087142
50359 1087142 1061808 1031090 996350 959422 922157 885815 850914 817631 786213 756890 729615
50348 729615 704151 680474 658894 639734 623002 608435 595746 584759 575389 567588 561269 556267
50336 556267 552436 549843 548793 549536 551960 555600 559903 564483 569203 574200 579812 586376 594052 602853
50322 602853 612790 623853 635900 648746 662365 676858 692146 707860 723680 739712 756435 774315
50310 774315 793504 813743 834391 854632 873889 892059 909250 925340 940004 953161 965164
50299 965164 976399 986803 995953 1003565 1009769 1014840 1018748 1021028 1021202 1019383 1016276 1012313 1006791 998142
50285 998142 985243 968292 948336 926349 903065 879377 856191 833784 811763 789853 768377
50274 768377 747792 728117 709172 691117 674278 658573 643486 628670 614321 600914 588823
50263 588823 578255 569310 561949 555926 550778 545895 540854 535900 531979 529881 529341 529333 529251 529406 530227 531469
50247 531469 532630 533873 536014 539527 543921 548242 551988 555411 559053 563120 567370 571481 575385 579174
50233 579174 582860 586389 589780 592911 595263 596262 595994 595200 594373 593240 591425 589217 587232 585546 583648
50218 583648 581165 578188 574940 571572 568348 565634 563567 561905 560221 558091 555297 552237 550003 549567
50204 549567 550871 553184 556276 560628 566335 572546 578399 584010 590035 596724 604000 612083 621296 631326
50190 631326 641299 650620 659244 667060 673617 678672 682499 685202 686031 683862 678261 669838 659713 648971
50176 648971 638578 629279 621242 613969 606852 599823 593348 587878 583524 580251 578113 577109 577013 577518 578457
50161 578457 579725 581013 581826 581706 580349 577630 573720 569129 564412 559854 555591 551876 548890 546384 543918
50146 543918 541510 539571 538108 536533 534563 532921 532590 533598 535029 536208 537386 539211 541908 545195
50132 545195 548725 552392 556273 560391 564521 568258 571420 574343 577503 580721 582988 583406 582248 580820
50118 580820 580140 580003 579542 578446 577195 576141 574915 573072 570910 569189 568245 567930 568394 570286 573937 578782
50102 578782 583980 589455 596080 605024 617092 632517 651065 672366 696261 722914 752714 786317
50090 786317 824750 869163 920351 978723 1044671 1118486 1199685 1286759 1377724 1470496 1562508
50079 1562508 1650522 1731473 1803411 1865503 1917687 1961015 1998022 2031879 2064961 2098393 2132476
50068 2132476 2166514 2197944 2222341 2234861 2231630 2210081 2168959 2108885 2032821 1945464 1851842
50057 1851842 1756231 1661837 1571034 1485705 1407397 1337036 1274566 1219103 1169701 1125852 1087243
50046 1087243 1053244 1022944 995688 971401 950252 932061 916192 902113 889891 879865 871835
50035 871835 864965 858639 853089 848907 846259 844883 844505 844696 844536 843120 840523 837715 835331 832973 829873
50020 829873 825758 820838 815357 809595 804023 799038 794653 790679 787055 783739 780504 777269 774579 773367
50006 773367 774020 775906 778013 780011 782615 786932 793562 802265 812335 823153 834408 845980 857697
49993 857697 869211 880180 890683 901393 913063 925770 938949 952217 965813 980053 994794
49982 994794 1009875 1025758 1043288 1063027 1085354 1111085 1141410 1177258 1219243 1268231 1325469
49971 1325469 1392108 1469011 1556951 1656268 1766121 1884504 2008952 2136478 2262688 2382105
49961 2382105 2490375 2586092 2670285 2744786 2811716 2873895 2934436 2995430 3057137 3118169 3175628
49950 3175628 3224876 3259866 3274545 3264609 3228526 3167470 3084455 2983260 2867828 2742156 2610118
49939 2610118 2474930 2338866 2203706 2071355 1943747 1822267 1707556 1599936 1499856
49930 1499856 1407898 1324482 1249574 1182696 1123223 1070679 1024608 984229 948551 916893 889010
49919 889010 864523 842533 822086 802833 784978 768733 753921 739885 725581 710071 693211
49908 693211 675685 658131 640496 622514 604491 587159 570974 555968 542216 529963 519313
49897 519313 510150 502395 496019 490807 486414 482673 479596 477089 474933 473044 471452 470015 468360 466191
49883 466191 463572 460987 459242 459017 460188 461715 462557 462623 462570 462870 463514 464444 465721 467207 468651 470237
49867 470237 472682 476603 482119 489122 497534 507133 517560 528857 541720 556985 574998 595677 619053
49854 619053 645606 676225 711898 753236 800274 852970 911900 978106 1052161 1133650 1221494
49843 1221494 1314030 1408366 1500159 1584776 1658775 1720251 1768471 1804064 1829563 1848968 1866299
49832 1866299 1884538 1905448 1929350 1954470 1976883 1991663 1994160 1980360 1946875 1891753 1815681
49821 1815681 1722233 1616794 1505231 1393092 1285018 1184173 1092129 1009418 936098 871795
49811 871795 815661 766763 724500 688387 657563 630847 607278 586311 567583 550852 536101
49800 536101 523325 512127 501875 492295 483512 475421 467574 459869 452795 446630 440851 434876 428971
49787 428971 423778 419178 414376 409111 404153 400383 397852 395904 393893 391629 389415 387795 387051 386840 386557
49772 386557 386048 385654 385602 385720 385898 386379 387341 388495 389424 390180 391221 392799 394568 395879 396466 396891 398200
49755 398200 400962 404692 408382 411497 414202 416811 419466 422388 425897 429918 433844 437243 440440 444091
49741 444091 448397 452944 457206 460977 464414 467798 471149 473948 475458 475507 474778 474115 473683 473012 471681 469753
49725 469753 467637 465694 463920 461908 459331 456545 454467 453628 453593 453560 453253 452925 452756 452747 453099 454122 455710
49708 455710 457334 458687 459950 461289 462518 463562 464931 467283 470561 473953 476762 479077 481467 484175
49694 484175 486824 488861 490092 490704 490874 490598 489927 489180 488721 488654 488905 489554 490799 492469 493823 494138 493440
49677 493440 492381 491351 489988 487829 485242 483252 482389 482060 481415 480570 480565 482129 484846 487662 489910 491724
49661 491724 493676 496225 499319 502327 504506 505705 506531 507586 508692 509142 508610 507520 506532 506039 506254 507389
49645 507389 509371 511586 513365 514800 516708 519584 522768 525004 525775 525818 526253 527463 528977 530289 531432
49630 531432 532808 534649 536847 539238 541931 545199 548965 552576 555357 557407 559483 561928 564153 565528
49616 565528 566443 567907 570286 573082 575989 579468 584046 589598 595736 602395 609607 616984 624003 630691
49602 630691 637678 645684 655263 666776 680132 694600 709330 724147 739508 755709 772472 789375
49590 789375 806435 824196 843371 864344 886813 910096 934059 959588 987683 1018295 1050640
49579 1050640 1084579 1120887 1159927 1200867 1242758 1285840 1331110 1379074 1429680 1483168 1539999
49568 1539999 1599830 1661407 1723841 1787360 1852401 1918544 1984923 2051280 2117833 2184169 2248950
49557 2248950 2310857 2369311 2423971 2473972 2518036 2555142 2584656 2605935 2618299 2621666 2616991 2605752
49545 2605752 2588936 2566644 2538818 2506239 2470630 2433695 2396264 2358587 2321305 2285713 2252936
49534 2252936 2223245 2196498 2172973 2153278 2137547 2125310 2116426 2111699 2112175 2118016 2128479 2142989
49522 2142989 2161787 2185368 2213581 2245611 2280779 2319023 2360450 2404606 2450497 2497345 2545053
49511 2545053 2593711 2642694 2690394 2734796 2774130 2807121 2832909 2850945 2860784 2861806 2853211 2834388
49499 2834388 2805210 2765884 2716775 2658658 2593049 2521936 2447012 2369335 2289735 2209251 2128922
49488 2128922 2049343 1970818 1893945 1819706 1748825 1681222 1616396 1554219 1495121 1439494 1387261
49477 1387261 1338164 1292265 1249826 1210728 1174291 1139861 1107415 1077482 1050398 1025766 1002699
49466 1002699 980554 959353 939509 921247 904451 888972 874929 862556 851823 842302 833420 824903
49454 824903 816976 810081 804307 799151 794002 788804 784072 780215 777143 774559 772416 770896 770166 770279 771096
49439 771096 772120 772717 772775 772979 774166 776551 779871 784049 789300 795694 803086 811525 821401 833086 846568
49424 846568 861272 875889 888554 897890 904053 908480 912576 917023 922250 928816 936919 946099 955886
49411 955886 966431 978103 990761 1003867 1017133 1030691 1044822 1059882 1076321 1094315 1113426
49400 1113426 1132945 1152570 1172420 1192447 1212166 1231041 1248915 1266052 1283000 1300412 1318695
49389 1318695 1337623 1356423 1374395 1391497 1408351 1425675 1443605 1461578 1478983 1495930 1513147
49378 1513147 1531104 1549539 1568076 1587001 1607064 1628520 1650743 1672848 1694555 1716404 1739208
49367 1739208 1763265 1788027 1812608 1836674 1860785 1885893 1912694 1941447 1972009 2003847 2036342
49356 2036342 2069408 2103569 2139224 2176184 2214236 2253809 2295571 2339590 2385548 2433708 2485066
49345 2485066 2540479 2600059 2663424 2730104 2799699 2872207 2948370 3029228 3115052 3205086 3298502
49334 3298502 3395176 3495311 3598686 3704603 3812245 3920715 4028987 4136199 4241846 4345314
49324 4345314 4445328 4540126 4628072 4707837 4778088 4837423 4884770 4919665 4942126 4952385 4950791
49313 4950791 4937878 4914518 4882041 4842089 4796213 4745606 4691293 4634459 4576444 4518525 4461909
49302 4461909 4407820 4357384 4311340 4270061 4233882 4203194 4178163 4158566 4144149 4135045 4131690 4134385
49290 4134385 4143109 4157723 4178055 4203760 4234339 4269431 4308838 4352059 4398013 4445618 4494565
49279 4494565 4545100 4596921 4648552 4697903 4743147 4782990 4816491 4843004 4862069 4872941 4874286
49268 4874286 4864636 4843244 4810319 4766499 4712363 4648521 4575977 4496244 4411038 4321879 4230027
49257 4230027 4136824 4043824 3952271 3862490 3774288 3688047 3604894 3525547 3449550 3376108 3305236
49246 3305236 3237419 3172599 3110320 3050767 2994688 2942121 2891906 2842824 2794660 2747883 2702802
49235 2702802 2659383 2617453 2576670 2536616 2497263 2459074 2422446 2387341 2353685 2321688 2291461
49224 2291461 2262766 2235542 2210310 2187566 2167077 2148269 2131031 2115547 2101569 2088587 2076728
49213 2076728 2066806 2059240 2053401 2048282 2043442 2039016 2035178 2031968 2029539 2028271 2028525 2030323 2033280 2036947
49199 2036947 2041403 2047424 2055766 2066258 2077934 2090159 2103242 2117681 2133172 2148915 2164792 2181624
49187 2181624 2199983 2219188 2237943 2255793 2273497 2292013 2311551 2331806 2352574 2373765 2395062
49176 2395062 2416195 2437507 2459749 2483140 2507003 2530482 2553327 2575748 2597898 2619859 2641952
49165 2641952 2664657 2688244 2712724 2738113 2764397 2791249 2818083 2844582 2871058 2898198 2926450
49154 2926450 2955651 2985157 3014345 3043059 3071574 3100118 3128527 3156452 3183807 3210931 3238369
49143 3238369 3266504 3295222 3323744 3351003 3376450 3400458 3423759 3446623 3468923 3490938 3513625
49132 3513625 3537881 3563722 3590340 3616713 3642003 3665694 3687781 3708828 3729457 3749554 3768138
49121 3768138 3784202 3797703 3809606 3820924 3831748 3841188 3848145 3852143 3853575 3853293 3851934 3849501 3845577
49108 3845577 3840072 3833684 3827439 3821799 3816424 3810863 3805188 3799732 3794484 3789118 3783637 3778683 3775156 3773624
49094 3773624 3774076 3776100 3779324 3783865 3790305 3799069 3809784 3821493 3833536 3846006 3859332 3873620 3888555
49081 3888555 3903671 3918524 3932694 3945913 3958224 3969857 3980883 3990963 3999415 4005640 4009585 4011850
49069 4011850 4013102 4013309 4011649 4007304 4000232 3991092 3980675 3969553 3958087 3946362 3934069 3920737 3906220
49056 3906220 3890901 3875356 3859883 3844327 3828197 3811083 3793126 3775050 3757485 3740253 3722573
49045 3722573 3703966 3684640 3664950 3644870 3624273 3603436 3582978 3563386 3544757 3526742 3508519
49034 3508519 3489141 3468324 3446778 3425412 3404378 3383255 3361969 3340905 3320063 3298752 3276405
49023 3276405 3253247 3229851 3206385 3182669 3158679 3134619 3110607 3086686 3063129 3040458 3019017
49012 3019017 2998606 2978558 2958322 2938110 2918862 2901294 2885092 2869448 2854382 2840887 2829586
49001 2829586 2819871 2810834 2802463 2795284 2789201 2783487 2777824 2772655 2768387 2764778 2761211 2757164 2752350 2746835
48987 2746835 2741100 2735714 2730874 2726488 2722552 2719026 2715461 2711306 2706625 2702030 2697797 2693469 2688337 2681850
48973 2681850 2673593 2663524 2652438 2641565 2631414 2621491 2611414 2601652 2592682 2583951 2574381 2563686
48961 2563686 2552654 2542149 2532285 2522522 2512235 2501183 2489681 2478375 2467785 2458140 2449578 2442182
48949 2442182 2435711 2429645 2423765 2418451 2414227 2411282 2409555 2408937 2409167 2409976 2411609 2414839 2420090 2426969 2434988
48934 2434988 2444300 2455145 2467048 2479373 2492531 2507816 2526003 2546697 2569163 2593182 2618908
48923 2618908 2646393 2675580 2706442 2738833 2772431 2807011 2842576 2879038 2915909 2952495 2988396
48912 2988396 3023854 3059594 3096206 3133559 3171031 3208466 3246615 3286310 3327465 3369373 3411822
48901 3411822 3455380 3500581 3547414 3595769 3645888 3698056 3752237 3808261 3866174 3926081 3987826
48890 3987826 4050988 4115116 4179836 4244923 4310391 4376406 4442948 4509566 4575490 4639983 4702625
48879 4702625 4763354 4822072 4878147 4930470 4978304 5021910 5061978 5098559 5130915 5158316 5180446
48868 5180446 5197024 5207672 5212450 5212041 5206966 5196889 5181037 5159179 5131913 5100172 5064686 5025810
48856 5025810 4983597 4938113 4889840 4839615 4787984 4734734 4679328 4621726 4562537 4502455 4441803
48845 4441803 4380721 4319497 4258558 4198260 4138876 4080829 4024769 3971262 3920385 3871706 3824732
48834 3824732 3779329 3735747 3694395 3655717 3620161 3588002 3559149 3533183 3509615 3488061 3468378
48823 3468378 3450746 3435537 3422894 3412477 3403789 3396690 3391433 3388263 3387178 3387996 3390517 3394701 3400934
48810 3400934 3409947 3422161 3437169 3454180 3472840 3493284 3515475 3539053 3563904 3590353 3618584
48799 3618584 3648263 3679057 3711158 3744999 3780634 3817644 3855451 3893518 3931450 3969256 4007406
48788 4007406 4046362 4086064 4126083 4166203 4206684 4247910 4289938 4332445 4375070 4417767 4460751
48777 4460751 4504099 4547527 4590636 4633265 4675426 4717072 4758128 4798581 4838185 4876171 4911647
48766 4911647 4944245 4974005 5000696 5023751 5042922 5058466 5070511 5078707 5082685 5082413 5077837 5068667
48754 5068667 5054828 5036795 5015176 4990355 4962807 4933318 4902352 4869560 4834374 4796878 4757599
48743 4757599 4716681 4673750 4628559 4581375 4532765 4483283 4433213 4382381 4330472 4277857 4225882
48732 4225882 4175968 4128679 4083994 4042067 4003077 3966641 3932170 3899803 3870336 3844224 3821352
48721 3821352 3801808 3786016 3773758 3763790 3755038 3747772 3743148 3741844 3743518 3747431 3753215 3761191 3772203
48708 3772203 3787065 3806038 3828953 3855859 3887099 3922561 3961347 4002698 4046959 4095098 4147425
48697 4147425 4203340 4262324 4324579 4390525 4460152 4533290 4610303 4692096 4779380 4872085 4969417
48686 4969417 5070294 5173712 5278924 5385399 5492551 5599337 5704058 5804619 5899059 5985806
48676 5985806 6063491 6130745 6186337 6229446 6259581 6276246 6278939 6267641 6243222 6207183 6161056
48665 6161056 6106134 6043685 5975167 5902053 5825525 5746435 5665556 5583730 5501739 5420137 5339261
48654 5339261 5259318 5180396 5102513 5025852 4950836 4877704 4806064 4735194 4664831 4595277 4526611
48643 4526611 4458317 4390103 4322683 4257096 4193388 4130562 4067809 4005146 3942736 3880317 3817799
48632 3817799 3755857 3695359 3636409 3578534 3521661 3466302 3412726 3360493 3309042 3258372 3208795
48621 3208795 3160268 3112316 3064613 3017371 2971073 2925992 2882073 2839235 2797572 2757164 2717836
48610 2717836 2679294 2641583 2605186 2570598 2537889 2506792 2477062 2448571 2421225 2395087 2370555
48599 2370555 2348217 2328418 2311132 2296205 2283535 2273019 2264505 2257897 2253146 2250125 2248698 2248937 2251045
48586 2251045 2254992 2260401 2266830 2273930 2281360 2288921 2296932 2306068 2316596 2328142 2340486 2354103 2369411
$$ [...]
##END NTUPLES=NMR SPECTRUM
##END=
