##TITLE=NES1022_BrazilUW_9265944_LWrop1z5D7
##JCAMPDX= 6.0         $$ Bruker NMR JCAMP-DX V2.0
##DATA TYPE= NMR SPECTRUM
##DATA CLASS= NTUPLES
##ORIGIN= BRUKER
##OWNER= Administrator
$$ 1.72 TOPSPIN		Version 2.1
$$ 2015-07-09 22:48:49.410 -0700  Administrator@X
$$ Compression mode = diff/dup
##.OBSERVE FREQUENCY= 400.02188249412
##.OBSERVE NUCLEUS= ^1H
##.ACQUISITION MODE= SIMULTANEOUS (DQD)
##.ACQUISITION SCHEME= undefined
##.AVERAGES= 8
##.DIGITISER RES= 22
##SPECTROMETER/DATA SYSTEM= spect
##.PULSE SEQUENCE= zg30
##.SOLVENT NAME= COFFEE_meoh
##.SHIFT REFERENCE= INTERNAL, COFFEE_meoh, 1, 14.98509
##AUDIT TRAIL= $$ (NUMBER, WHEN, WHO, WHERE, PROCESS, VERSION, WHAT)
$$ ##TITLE= Audit trail, TOPSPIN		Version 2.1
$$ ##JCAMPDX= 5.01
$$ ##ORIGIN= Bruker BioSpin GmbH
$$ ##OWNER= Administrator
$$ $$ E:\/data/COFFEE/nmr/NES1022_BrazilUW_9265944_LWrop1z5D7/10/pdata/1/auditp.txt
$$ ##AUDIT TRAIL=  $$ (NUMBER, WHEN, WHO, WHERE, PROCESS, VERSION, WHAT)
(   1,<2015-07-09 22:48:41.925 -0700>,<Administrator>,<X>,<go>,<TOPSPIN 2.1>,
      <created by zg
	started at 2015-07-09 22:47:35.566 -0700,
	POWCHK enabled, PULCHK disabled,
       configuration hash MD5:
       21 0F 79 D6 B3 7B B4 F6 88 20 88 DB 03 48 BD 9F
       data hash MD5: 64K
       68 DD 51 17 34 22 E1 C8 67 02 9D E1 E5 37 F0 EA>)
(   2,<2015-07-09 22:48:45.238 -0700>,<Administrator>,<X>,<proc1d>,<TOPSPIN 2.1>,
      <Start of raw data processing
       efp LB = 0 FT_mod = 6 PKNL = 1 PHC0 = 0 PHC1 = 0 SI = 32K 
       data hash MD5: 32K
       5B A9 8F C2 21 29 01 7B 1C C2 0F 59 09 31 04 D4>)
(   3,<2015-07-09 22:48:45.535 -0700>,<Administrator>,<X>,<proc1d>,<TOPSPIN 2.1>,
      <pk PHC0 = 91.10413 PHC1 = 0 
       data hash MD5: 32K
       33 EB 0E 30 27 7C 7F 62 49 0D DE 24 60 58 26 00>)
(   4,<2015-07-09 22:48:45.644 -0700>,<Administrator>,<X>,<proc1d>,<TOPSPIN 2.1>,
      <abs ABSG = 1 
       data hash MD5: 32K
       F7 97 64 A8 4D CF 8F 01 1D 5C CF B4 0F 40 5E 6D>)
(   5,<2015-07-09 22:48:45.691 -0700>,<Administrator>,<X>,<proc1d>,<TOPSPIN 2.1>,
      <abs ABSG = 2 
       data hash MD5: 32K
       F9 C1 11 F6 63 67 18 C4 2D 18 14 8F C6 A6 B4 5B>)
(   6,<2015-07-09 22:48:45.769 -0700>,<Administrator>,<X>,<proc1d>,<TOPSPIN 2.1>,
      <abs ABSG = 3 
       data hash MD5: 32K
       0F 3C DE A5 65 53 2F EA BE 39 42 31 C8 F0 89 BD>)
(   7,<2015-07-09 22:48:45.831 -0700>,<Administrator>,<X>,<proc1d>,<TOPSPIN 2.1>,
      <abs ABSG = 4 
       data hash MD5: 32K
       6A B1 79 10 B9 AD 21 B3 88 80 65 A4 94 08 47 88>)
(   8,<2015-07-09 22:48:45.894 -0700>,<Administrator>,<X>,<proc1d>,<TOPSPIN 2.1>,
      <abs ABSG = 5 
       data hash MD5: 32K
       2D 8F D8 74 53 9C 14 2F 6C A7 31 D4 B9 95 26 6F>)
$$ ##END=
$$ 
$$ $$ hash MD5
$$ $$ 96 B8 FE D0 8F CA 08 6D F0 60 4D 07 15 BF 6A F0
##$RELAX= 
##$RELAX= 
##$RELAX= 
##$RELAX= 
##$RELAX= 
##$RELAX= 
##$RELAX= 
$$ Bruker specific parameters
$$ --------------------------
##$DU= <E:\>
##$EXPNO= 10
##$NAME= <NES1022_BrazilUW_9265944_LWrop1z5D7>
$$ [...]
150 150 150 150 150 150 150 150
##$TP07= 0
##$TPNAME0= <>
##$TPNAME1= <>
##$TPNAME2= <>
##$TPNAME3= <>
##$TPNAME4= <>
##$TPNAME5= <>
##$TPNAME6= <>
##$TPNAME7= <>
##$TPOAL= (0..7)
0.5 0.5 0.5 0.5 0.5 0.5 0.5 0.5
##$TPOFFS= (0..7)
0 0 0 0 0 0 0 0
##$TUNHIN= 0
##$TUNHOUT= 0
##$TUNXOUT= 0
##$USERA1= <user>
##$USERA2= <user>
##$USERA3= <user>
##$USERA4= <user>
##$USERA5= <user>
##$V9= 5
##$VALIST= <valist>
##$VCLIST= <CCCCCCCCCCCCCCC>
##$VD= 0
##$VDLIST= <DDDDDDDDDDDDDDD>
##$VPLIST= <PPPPPPPPPPPPPPP>
##$VTLIST= <TTTTTTTTTTTTTTT>
##$WBST= 2048
##$WBSW= 25
##$XGAIN= (0..3)
0 0 0 0
##$XL= 0
##$YL= 0
##$YMAX_a= 608373
##$YMIN_a= -505223
##$ZGOPTNS= <>
##$ZL1= 120
##$ZL2= 120
##$ZL3= 120
##$ZL4= 120
##$ABSF1= 14.98509
##$ABSF2= -5.573092
##$ABSG= 5
##$ABSL= 3
##$ALPHA= 0
##$AQORDER= 0
##$ASSFAC= 0
##$ASSFACI= 0
##$ASSFACX= 0
##$ASSWID= 0
##$AUNMP= <proc_prof1d_extract_pilot.lims>
##$AXLEFT= 0
##$AXNAME= <>
##$AXNUC= <1H>
##$AXRIGHT= 0
##$AXTYPE= 0
##$AXUNIT= <>
##$AZFE= 0.1
##$AZFW= 0.1
##$BCFW= 0
##$BC_mod= 0
##$BYTORDP= 0
##$COROFFS= 0
##$CY= 15
##$DATMOD= 1
##$DC= 0
##$DFILT= <>
##$DTYPP= 0
##$F1P= 0
##$F2P= 0
##$FCOR= 0.5
##$FTSIZE= 32768
##$FT_mod= 6
##$GAMMA= 0
##$GB= 0
##$INTBC= 1
##$INTSCL= 1
##$ISEN= 128
##$LB= 0
##$LEV0= 0
##$LPBIN= 0
##$MAXI= 10000
##$MC2= 0
##$MEAN= 0
##$ME_mod= 0
##$MI= 0
##$NCOEF= 0
##$NC_proc= -8
##$NLEV= 6
##$NOISF1= 0
##$NOISF2= 0
##$NSP= 0
##$NTH_PI= 0
##$NZP= 0
##$OFFSET= 14.98509
##$PC= 1
##$PHC0= 91.10413
##$PHC1= 0
##$PH_mod= 1
##$PKNL= yes
##$PPARMOD= 0
##$PPDIAG= 0
##$PPIPTYP= 0
##$PPMPNUM= 2147483647
##$PPRESOL= 1
##$PSCAL= 4
##$PSIGN= 0
##$PYNMP= <proc.py>
##$REVERSE= no
##$SF= 400.02
##$SI= 32768
##$SIGF1= 0
##$SIGF2= 0
##$SINO= 400
##$SIOLD= 32768
##$SPECTYP= <>
##$SREGLST= <1H.CDCl3>
##$SSB= 0
##$STSI= 32768
##$STSR= 0
##$SW_p= 8223.68421052631
##$SYMM= 0
##$S_DEV= 0
##$TDeff= 65536
##$TDoff= 0
##$TI= <>
##$TILT= no
##$TM1= 0
##$TM2= 0
##$TOPLEV= 0
##$USERP1= <user>
##$USERP2= <user>
##$USERP3= <user>
##$USERP4= <user>
##$USERP5= <user>
##$WDW= 1
##$XDIM= 32768
##$YMAX_p= 438804671
##$YMIN_p= -689497
##$CURPLOT= <Network HP LaserJet P1505>
##$CURPRIN= <$Network HP LaserJet P1505>
##$DFORMAT= <normdp>
##$LAYOUT= <+/1D_H.xwp>
##$LFORMAT= <normlp>
##$PFORMAT= <normpl>
##$SURQMSG= 1
$$ End of Bruker specific parameters
$$ ---------------------------------
##NTUPLES= NMR SPECTRUM
##VAR_NAME=  FREQUENCY,     SPECTRUM/REAL,   SPECTRUM/IMAG
##SYMBOL=    X,             R,               I
##VAR_TYPE=  INDEPENDENT,   DEPENDENT,       DEPENDENT
##VAR_FORM=  AFFN,          ASDF,            ASDF
##VAR_DIM=   32768,         32768,           32768
##UNITS=     HZ,            ARBITRARY UNITS, ARBITRARY UNITS
##FACTOR=    0.250966925370066, 1,           1
##FIRST=     8223.43324360094, -156522,      -51120
##LAST=      0,             -201159,         -50914
##MIN=       0,             -689497,         0
##MAX=       8223.43324360094, 438804671,    0
$$ Real data points
##PAGE= N=1
##DATA TABLE= (X++(R..R)), XYDATA
$$ [...]
$$ plain form
19468 -143266 -188152 80009 -74691 -327769 -112649 -17160 5977 -3177 -62597 -263080 -243907
19457 -243907 -16159 -109339 -250978 -108152 -51002 -235450 290639 -68223 -80909 -84751 193911
19445 -207860 -68607 -153015 -57838 -46173 -11004 11572 -63044 -392397 161400 -108473 5311
19433 4069 -369716 -322908 -92219 -70111 72877 228862 187323 25488 -114415 -123389 85461
19421 -14596 -106398 -239302 -146790 -190772 -90267 149062 54283 -126237 -238835 82992 110680
19410 110680 136991 -115598 99987 113950 75330 -308922 -121366 -123498 103297 166005 -161039
19398 -48615 -35915 256088 186532 13127 -64016 -13194 -75920 168962 127023 157088 -299741
19386 -146466 12973 -47300 -201837 29909 -153924 95335 -97106 44363 121930 -260897 36876
$$ packed form
19468a43266m4886H0009g4691k53078a12649a7160E977c177n9420k00483J9173
19457b43907a6159r3180j41639a08152e1002j84448B90639f8223j2686l842A93911
19445b07860f8607q4408e7838J1665a1004A1572f3044l29353A61400a08473E311
19433D069c69716M6808i2219K2108G2877J55985m1539B5488a14415q974H5461
19421a4596r1802j32904R2512m3982i0267A49062E4283a26237j12598H2992K7688
19410A10680K6311a15598I9987J3963l8620c08922a21366k132A03297O2708a61039
19398d8615J2700B56088o9556A3127f4016a3194o2726A68962m1939L0065b99741
19386a46466A2973d7300j54537B9909a53924I5335i7106D4363P7567b60897C6876
$$ plain form
19374 -32182 -202740 -141568 -260318 -221635 43712 -107188 -105089 91239 -28280 -328405 -505415
19363 -505415 -51419 -141027 -155200 -205759 -41983 99442 -28421 -83538 -224020 -343255 87485
19351 -77925 272506 -172896 -167940 -214638 -195167 175273 206099 -63002 -264648 -256369 -101317
19339 -211275 -34992 -154124 -192422 -144453 -202075 -87780 152521 -192841 -207299 32281 416861
19328 416861 -356803 -120481 -95408 -463670 -61801 -6844 22882 108711 -262930 -11023 286448
19316 60649 -41532 -56753 30149 63133 -39787 -209071 -299883 -60373 90462 12684 -315016
19304 -105027 84149 204026 -198479 117966 57872 -198399 -264339 -188901 -40372 37137 -46632
19292 -37205 -185556 182075 -325963 -97751 -57900 -342716 -204091 -223343 180376 64297
$$ packed form
19374c2182j70558O1172j18750L8683D3712a07188K099I1239b8280l00125j77010
19363e05415e1419q9608j4173n0559d1983I9442b8421n5117j40482j19235H7485
19351g7925B72506a72896M956m6698J9471A75273L0826f3002k01646Q279a01317
19339b11275c4992j19132l8298M7969n7622h7780A52521a92841j4458C2281L84580
19328D16861c56803a20481K5073l68262f1801f844B2882Q5829b62930a1023B86448
19316F0649d1532j5221C0149L2984c9787j69284r0812f0373I0462A2684c15016
19304a05027H4149J19877a98479A17966E7872a98399o5940P5438d0372C7137d6632
19292c7205j48351A82075c25963i7751L9851k84816J38625j9252A80376F4297
$$ plain form
19281 -20153 -921 -23304 -264563 -78405 -2627 -326744 46904 3944 -41992 -131674 -297910 -195518
19269 -195518 -386726 -53548 -5385 -127849 -255313 83594 -262866 -154258 -173673 -150960 37021
19257 -119855 37947 -204776 -143589 80364 -13944 -103554 176809 -100459 -15168 -172399 -411528
19246 -411528 -1252 -73353 -80946 -343870 -232701 193937 -340431 -111846 57760 -47153 -63364
19235 -63364 75935 -314023 -357818 20590 -178784 21381 -217512 -276298 -228812 141461 106892
19224 106892 -266366 -101924 113191 110495 -191260 104495 264586 -256755 -131087 -234076
19214 -234076 -325550 -42334 -244520 37429 -6059 -365272 265099 31034 19725 151825 -71902
19202 143094 96737 220487 6168 -150874 -344651 -82461 -19658 -109285 -80799 58191 -114763
$$ packed form
19281b0153i21k2383k41259g8405b627l24117D6904C944d1992q9682j66236J02392
19269a95518j91208e3548e385j22464j27464H3594b62866J08608j9415K2713C7021
19257a19855C7947b04776O1187H0364a3944q9610A76809a00459a5168j57231k39129
19246d11528a252p2101p593k62924J11169A93937c40431a11846E7760d7153j6211
19235f3364G5935c14023m3795B0590a78784B1381b17512n8786M7486A41461l4569
19224A06892b66366a01924A13191k696a91260A04495J60091b56755J25668j02989
19214b34076r1474d2334k02186C7429f059l59213B65099C1034j1309J32100g1902
19202A43094m6357J23750F168a50874j93777h2461a9658q9627K8486E8191a14763
$$ plain form
19190 -199787 -115809 24998 240738 -216063 -36847 -63633 9747 -151448 -3567 -104933 -167024
19179 -167024 -200570 19719 167273 -264189 -108371 -2429 66153 262903 -95978 -381569 33356
19167 -259794 69217 -53940 31598 -173710 -141416 149084 4922 152449 34221 -53670 84136
19155 25756 -93124 -176873 -76515 20275 3501 92735 118496 -44514 233469 -20888 210784
19143 -255191 211552 -205914 -3119 -32162 -112172 88824 291633 -198416 83477 173051 410206
19132 410206 113804 -75839 -283715 64209 262623 163136 -162889 64445 -176698 61586
19121 -142301 -324413 143576 -253481 10981 35741 -12337 -179924 20588 -299325 58184
19110 -258103 220539 -166591 158782 -114403 -114203 -132478 64275 -54547 -281486 46566 225610
$$ packed form
19190a99787Q3978B4998K15740b16063c6847k6786I747a51448c567j01366o2091
19179a67024l3546A9719J47554b64189a08371b429F6153J96750i5978k85591C3356
19167b59794F9217e3940C1598a73710L2294A49084D922J47527C4221e3670H4136
19155B5756i3124q3749g6515B0275C501Q9234K5761d4514B33469b0888B10784
19143b55191B11552b05914c119k9043q0010H8824K02809a98416H3477Q9574K37155
19132D10206A13804g5839k07876F4209J98414r9487a62889F4445a76698F1586
19121a42301j82112A43576b53481A0981K4760a2337j67587B0588b99325E8184
19110b58103B20539a66591A58782a14403K00j8275F4275e4547k26939D6566J79044
$$ plain form
19099 225610 146933 -74749 159070 -172250 99722 -84797 -8092 149474 -3909 -126566 261927
19087 -27529 173895 50994 122940 -101002 -37930 -161920 -98831 -6650 196630 -80944 -88359
19076 -88359 -37570 100920 -260015 -199364 -227493 15185 -48383 -323642 -258140 -104544 280576
19064 -186384 -280445 -179671 -75666 -64645 -217622 -83681 -179435 187617 81332 225767 -40986
19052 257375 142118 -363604 301468 -163291 104212 4519 42596 -227435 -8507 -203656
19042 -203656 78352 -163647 -218823 -159969 -32591 364190 -48886 -15942 197884 -160866 -53700
19030 -130428 -104701 -315004 147684 -241565 -55316 -256656 24617 187357 -345503 -11381
19019 -51788 72411 -235782 47510 -2168 355349 -300416 255429 248450 58149 -200127 -20379
$$ packed form
19099B25610p8677g4749A59070a72250I9722h4797h092A49474c909j22657B61927
19087b7529A73895E0994P1946a01002c7930j23990O3089f650A96630h0944p415
19076h8359c7570A00920b60015O0651k8129A5185d8383k75259O5502a04544B80576
19064a86384r4061J00774g5666J1021j52977h3681r5754A87617H1332J44435d0986
19052B57375j15257c63604C01468a63291A04212D519L8077b27435h507j95149
19042b03656G8352a63647n5176N8854c2591C64190d8886a5942A97884a60866e3700
19030a30428K5727k10303A47684b41565e5316k01340B4617J62740c45503a1381
19019e1788G2411b35782D7510b168C55349c00416B55429o979E8149b00127b0379
$$ plain form
19007 98457 -8609 -34664 -125352 -322592 136176 -46994 -101934 -80271 22276 -35197 -94509
18996 -94509 -85860 72698 -90087 107131 -205600 78619 -144012 -366347 -168086 -10704 -71736
18985 -71736 13307 269577 -361501 84716 -152926 -35488 -250780 97836 72806 -149467 -120533
18974 -120533 63181 137520 192053 -1796 308373 445059 136746 163803 -121860 -132704 -188364
18963 -188364 -219526 -391649 -90849 -202641 88807 -279698 -103741 -197033 61650 105082 -30866
18951 -189840 21767 -21602 -171836 203772 -119844 -167782 -176162 -81838 254194 120834 -2018
18939 -218841 -197048 -134607 108877 -115048 223294 9535 -242254 351600 -18306 210843
18928 -52560 23053 -166101 -54628 283620 310961 405736 -253941 -96538 -10300 -333096 51482
$$ packed form
19007I8457h609k6055r0688j97240A36176d6994n4940K1663B2276c5197n9312
18996i4509Q649G2698i0087A07131b05600G8619a44012k22335a68086a0704o1032
18985g1736A3307K56270c61501H4716a52926c5488k15292I7836k5030a49467K8934
18974a20533F3181P4339N4533a796C08373J36686A36746K7057a21860j0844n5660
18963a88364l1162j72123i0849j11792H8807b79698a03741r3292F1650M3432c0866
18951a89840B1767b1602j50234B03772a19844m7938q380h1838B54194A20834b018
18939b18841K1793O2441A08877a15048B23294I535b42254C51600a8306B10843
18928e2560B3053a66101e4628B83620K7341R4775b53941i6538a0300l22796E1482
$$ plain form
18916 -65181 15960 276265 214851 74439 36088 23081 121668 11255 597903 670492 426352
18905 426352 442317 -132444 -374584 40075 -405969 -160319 -394932 -249362 79788 -10118
18894 -55707 -352011 148534 -51962 184254 -51236 -211646 43817 -93410 -9568 -249180 -245076
18883 -245076 -183873 -149320 -25639 -153380 162049 107281 -154414 -35713 -6003 -212559 -42659
18871 43421 -249734 84510 32653 -320174 -234768 66118 78343 -50031 -25064 -130672 117274
18859 7164 -196897 -288427 197270 169416 66037 81677 -26087 174538 -254693 -23771 81244
18847 15124 -242448 141675 -1648 88420 160869 -3990 -39108 -68115 118963 -26593 24383
18835 -80402 -87483 -159789 -241663 183283 -212011 -87395 -78154 247545 131646 -79132 -24138
$$ packed form
18916f5181A5960K60305o1414G4439C6088j3007R8587A1255N86648P2589k44140
18905D26352J5965a32444k42140D0075d05969a60319k34613J45570G9788a0118
18894e5707k96304A48534e1962A84254e1236j60410D3817i3410i568k39612M104
18883b45076O1203L4553b5639j27741A62049n4768a54414c5713f003k06556d2659
18871D3421b49734H4510C2653c20174Q5406F6118J2225e0031K4967j05608A17274
18859G164a96897r1530A97270k7854F6037J5640b6087A74538b54693b3771H1244
18847A5124b42448A41675a648H8420P2449c990l5118k9007A18963b6593B4383
18835h0402p081p2306q1874A83283b12011h7395R241B47545j15899g9132b4138
$$ plain form
18823 39454 -154819 -38952 267593 -295590 -71432 -155196 267712 241526 -46428 34897 -112285
18811 -144619 -295072 47287 -68747 262312 65913 -89721 372695 56807 -34465 202912 107287
18800 107287 -32798 -172946 -403277 -173717 -177844 -227850 223907 -401618 155034 83608
18790 83608 77191 199950 -84979 197711 45536 103598 -223123 -69386 111992 -219787 306765
18778 66628 74113 164062 -59824 -57829 -43764 -64749 4204 -145440 308513 -14829 -118211 73035
18765 -170687 14587 -137178 86801 -90506 -251439 -295225 -194522 -34867 -174058 79580 -18235
18753 308734 124583 -143272 -53058 317486 -246 -378058 158510 103011 -125326 156989
18742 -259376 65778 37360 175994 -177199 -47288 -237485 -5028 338800 313049 -180691 26169
$$ packed form
18823C9454a54819c8952B67593b95590g1432q3764B67712k6186d6428C4897a12285
18811a44619j50453D7287f8747B62312F5913h9721C72695E6807c4465B02912r5625
18800A07287c2798j40148k30331a73717m127n0006B23907d01618A55034p1426
18790H3608o417J22759h4979A97711D5536N8062b23123f9386A11992b19787C06765
18778F6628P485Q9949e9824J995J4065k0985D204a45440C08513a4829j03382G3035
18765a70687A4587a37178H6801i0506j60933m3786J00703c4867j39191G9580a8235
18753C08734A24583a43272e3058C17486b46l77812A58510n5499a25326A56989
18742b59376F5778k8418J38634a77199d7288j90197e028C38800k5751a80691B6169
$$ plain form
18730 -18908 -189173 -243759 -217367 -67680 -264548 -146586 319742 151130 125048 -287857
18719 -309686 -187414 -68661 16848 56133 -209439 -241712 -181763 -65482 -85780 261242 73621
18707 -6598 237241 22162 -9104 -246383 -263358 250446 -44291 -303308 1493 114045 -43732
18695 140241 -239837 47507 -59178 -68153 7878 -1147 139554 -16874 -106685 50674 -119626
18683 -76157 -193155 192405 -90276 -246850 -74303 -126508 -94949 -245116 -27297 -129500 -306201
18672 -306201 -251692 57276 2504 -144503 -299805 -354123 -498866 -168315 -76834 92176 179582
18661 179582 -46706 71275 -77928 -121036 -176615 -304323 -207830 -22926 -140407 -153765 -43495
18649 51628 -155401 -163075 44302 439885 64202 -185669 142984 -537398 268593 13045 7917
$$ packed form
18730a8908j70265n4586K6392f7680j96868J17962C19742A51130k6082b87857
18719c09686J22272f8661A6848L9285b09439l2273N9949f5482k0298B61242G3621
18707f598B37241B2162i104k37279j6975B50446d4291k59017A493J12552d3732
18695A40241b39837D7507e9178q975G878a147A39554a6874q9811E0674a19626
18683g6157j16998A92405i0276j56574g4303n2205L1559j50167b7297j02203j76701
18672c06201N4509E7276B504a44503j55302n4318j44743a68315g6834I2176Q7406
18661A79582d6706G1275g7928m3108n5579j27708R6493b2926j17481j3358d3495
18649E1628a55401p674D4302L95583F4202a85669A42984e37398B68593A3045n128
$$ plain form
18638 7917 -137905 37807 38207 -58178 190619 -213789 -124743 -67233 52124 -176603 203534
18626 -40329 -25915 374005 -312464 -223214 2322 -315940 132882 121436 -192961 -338801 31316
18614 -69478 6596 -104069 -112436 -255677 -11115 124009 91177 -29951 -358411 300129 -243053
18602 -53439 29494 -21199 351581 309878 191086 131231 27595 -63739 -167082 -137114 172591
18590 -377643 231610 25592 -242929 -93585 138117 5622 -19681 -17490 84654 23567 -94888
18578 -3307 -91853 -300014 155164 -216377 -83504 -17950 -84085 -46647 -9434 81968 -167089
18566 -120210 -15050 -23406 145841 61906 61726 168350 -330299 -52583 131553 -75042 -8436
18554 -153901 223258 -67373 -174446 117488 426254 -65380 46093 -74189 -285290 -261084
$$ packed form
18638G917a37905C7807M00e8178A90619b13789Q9046N7510E2124a76603B03534
18626d0329J4414C74005c12464Q9250B322c15940A32882j1446a92961j45840C1316
18614f9478F596a04069q367j43241a1115A24009l2832b9951l28460C00129b43053
18602e3439B9494b1199C51581m1703j18792n9855B7595f3739j03343K9968A72591
18590c77643B31610B5592b42929i3585A38117E622a9681K191H4654B3567i4888
18578c307q8546k08161A55164b16377h3504a7950o6135L7438i434H1968a67089
18566a20210a5050q356A45841F1906j80J06624c30299e2583A31553g5042h436
18554a53901B23258f7373j07073A17488L08766f5380D6093g4189k11101K4206
$$ plain form
18544 -261084 -158838 -399082 -148741 -122521 55212 -21377 138173 -75795 -73553 -114121 -57054
18532 203104 83676 33816 -65753 62826 -266443 16927 -272234 -241868 -84283 -21758 -5099
18520 -364473 59563 -217673 201470 -39942 86487 -246725 36820 -69230 2380 152039 -437617
18508 -45634 105019 -303435 -55177 122141 -304412 -104767 73755 292560 -99303 12591
18497 -66093 -202001 -95012 92777 -189021 -311199 -267381 104463 240414 -110812 273796
18486 -83245 263123 22203 30190 23226 -311042 93398 213352 -109465 33880 158632 -95763
18474 184906 -342837 36688 -58045 -372392 -118033 -178381 -79323 101127 28982 -424493
18463 -184851 -147081 103079 85254 266388 34526 75158 -125807 23908 -20335 -34025 -144824
$$ packed form
18544b61084J02246k40244a48741K6220E5212b1377A38173g5795K242m0568e7054
18532B03104H3676C3816f5753F2826b66443A6927b72234L0366h4283b1758e099
18520c64473E9563b17673B01470c9942H6487b46725C6820f9230B380J49659d37617
18508d5634A05019c03435e5177A22141c04412a04767G3755K18805i9303A2591
18497f6093j35908i5012I2777a89021j22178M3818A04463J35951a10812B73796
18486h3245B63123B2203P987o964c11042I3398J19954a09465C3880J24752i5763
18474A84906c42837C6688e8045l14347a18033o0348g9323A01127B8982d24493
18463a84851L7770A03079j7825J81134C4526M0632a25807B3908b0335j3690j10799
$$ plain form
18452 -144824 -337691 74677 87560 164281 -145816 195762 -467001 -147721 -153283 -66847 125932
18440 2693 -129615 -84225 5762 167893 166960 6611 171170 -106252 56521 -13048 418226 -50180
18427 149922 -91899 -44303 -458419 79432 -260150 71808 88982 -132483 -86722 -152222 91665
18415 -392238 160884 155726 -126302 -109052 -177925 69840 -22259 191393 -198638 -254966 353947
18403 236019 -152386 13561 -139443 -173947 -147376 20484 230569 -160893 -76751 -150741 -166536
18392 -166536 109645 28630 -254642 125654 151937 -168323 -52676 -308206 -94538 -92633 167191
18380 -119829 -120837 238093 -270019 28075 165316 -310923 137223 -116314 73799 194949
18370 194949 -214813 103871 -155985 26624 -210895 -107169 40076 -76838 -96854 107224
$$ packed form
18452a44824j92867G4677J2883P6721a45816A95762d67001a47721n562f6847A25932
18440B693a29615M5390E762J62131r33F611J64559a06252E6521a3048D18226e0180
18427A49922i1899d4303m14116G9432b60150G1808J7174a32483M5761o5500I1665
18415c92238A60884n158a26302J7250o8873F9840b2259A91393a98638n6328C53947
18403B36019a52386A3561a39443l4504K6571B0484K10085a60893g6751p3990j5795
18392a66536A09645B8630b54642A25654K6283a68323e2676k55530i4538J905A67191
18380a19829j008B38093b70019B8075J37241c10923A37223a16314G3799J21150
18370A94949b14813A03871a55985B6624b10895J03726D0076g6838k0016A07224
$$ plain form
18359 101035 133067 249230 -261389 14937 -233635 133587 -82813 197582 -438574 -66552
18348 123450 -230709 -186157 -335237 -31936 204609 3318 72209 -110174 -31688 -17798 -242730
18337 -242730 155065 -154653 300803 -172663 -143885 -104854 376375 61463 -134926 -309658
18327 -309658 103885 88890 -28959 319268 -130044 205465 154557 33914 164241 -155424
18316 61734 44288 -26291 30506 189258 -175234 135045 93702 -150573 5958 -282450 -121378
18304 149929 -143518 55859 -21677 75255 -86700 -166750 1459 -57441 42252 40643 -110750
18292 64521 -57464 -21931 -92371 -36958 -244006 -39865 -71240 -62392 116554 -157503 173915
18280 10506 -254282 -240327 64068 -180133 -116325 -197906 58407 205312 -166837 148454 -230542
$$ packed form
18359A01035L2032J16163b61389A4937b33635A33587h2813A97582d38574f6552
18348A23450b30709M4552j49080c1936B04609C318O8891a10174c1688J3890k24932
18337b42730A55065a54653C00803a72663K8778L9031C76375F1463a34926j74732
18327c09658A03885j4995b8959C19268a30044B05465n0908C3914J30327a55424
18316F1734j7446b6291C0506J58752a75234A35045m1343a50573E958b82450a21378
18304A49929a43518E5859b1677G5255h6700q0050A459e7441D2252j609a10750
18292F4521e7464b1931p0440c6958k07048c9865l1375Q848A16554a57503A73915
18280A0506b54282J3955F4068a80133O3808q1581E8407J46905a66837A48454b30542
$$ plain form
18268 76704 -165105 -108074 -201269 65466 -44320 171639 -75186 -208570 33516 -299531 139735
18256 -153180 243686 -67336 370945 -2267 -177062 -118913 39447 -406505 -128324 -48598 25574
18244 23195 39216 -310095 108510 -107706 -238271 6128 -445710 188517 -141899 170092
18233 241069 -60457 38534 250450 -305096 37418 -43294 -168689 219568 -270989 87378
18222 -24852 159083 155444 101748 276786 -91658 -93381 110029 94734 -63352 61670 -75456
18210 105151 -335042 -191376 184158 220246 -119000 46232 -126262 54944 -80543 -69488
18200 -69488 -33686 174211 241763 162752 90544 -288251 239781 -140890 525365 -18140 -226718
18189 -226718 -39761 -3665 220273 -49731 -355967 -135290 -130822 300926 -71077 5183 10637
$$ packed form
18268G6704a65105N7031r3195F5466d4320A71639g5186j33384C3516b99531A39735
18256a53180B43686f7336C70945b267j74795N8149C9447d06505a28324d8598B5574
18244B3195J6021c10095A08510a07706j30565F128d45710A88517a41899A70092
18233B41069f0457C8534K11916c05096C7418d3294j25395B19568b70989H7378
18222b4852A59083l639n3696J75038i1658j723A10029j5295f3352F1670g5456
18210A05151c35042J43666A84158L6088a19000D6232a26262E4944h0543J1055
18200f9488c3686A74211O7552p9011p2208b88251B39781a40890E25365a8140k08578
18189b26718c9761c665B20273d9731l06236a35290M468C00926g1077E183N454
$$ plain form
18178 10637 56772 -112205 90016 24373 -158039 -219763 190938 -228910 196888 126994 -167805
18166 -270202 1220 42945 -16396 67979 -272159 160961 153254 149880 165945 -192834 -68302
18154 -76521 -51110 -92053 -78428 -144802 303531 -236075 -369383 162840 -71720 297263 82642
18142 -219833 82389 22219 -20821 -222966 -304415 -230691 133726 66206 -232483 92864 -216957
18130 -447760 -183626 153477 85172 281232 -29723 228992 166418 -452255 412252 -177878
18119 188768 -36528 148852 -73466 10882 -35811 -117902 -69828 -49502 -115656 1440 77435
18108 77435 -85605 -115167 -91183 -38085 -96288 -396978 -219429 -212355 238574 144433 283694
18097 283694 82228 -120482 -190508 256208 -272773 237460 169958 -347098 58417 -185538
$$ packed form
18178A0637M6135a12205I0016B4373a58039o1724A90938b28910A96888o9894a67805
18166b70202A220M1725a6396F7979b72159A60961p707l374J6065a92834f8302
18154g6521K5411m0943J3625o6374C03531b36075j33308A62840g1720B97263H2642
18142b19833H2389B2219b0821k02145q1449P3724A33726F6206b32483I2864b16957
18130d47760a83626A53477o8305J96060b9723B28992o2574d52255D12252a77878
18119A88768c6528A48852g3466A0882c5811q2091M8074K0326o6154A440P5995
18108G7435h5605k9562K3984c8085n8203l00690J77549P074B38574r4141J39261
18097B83694H2228a20482p0026B56208b72773B37460o7502c47098E8417a85538
$$ plain form
18086 -21481 -72922 146015 -121339 111529 71458 118045 -100617 76977 -26584 -41505 27087
18074 64315 114372 -452015 109456 -114313 24014 38071 -154227 -292763 76715 95521 115957
18063 115957 -34793 -302410 114247 196617 -217799 -148008 202583 -52528 -36443 -298833
18053 -298833 161440 170875 31038 93762 160240 -47793 78886 -127201 -32671 130535 110817
18042 110817 -57144 54056 -175630 -101284 -25847 7743 208796 -160981 19576 -93406 249373
18030 211739 139628 -71918 -108104 40172 276234 -32417 318383 -207418 -4474 -212806 -338942
18019 -338942 147310 229137 -71961 98481 -160113 -23683 -78279 -484784 -188941 231519
18008 134013 -108076 122228 8282 -152092 198116 349 290230 -67026 -45806 42934 147822
$$ packed form
18086b1481n1441A46015a21339A11529m0071M6587a00617G6977b6584j4921B7087
18074F4315N0057d52015A09456a14313B4014J4057a54227j38536G6715J8806K0436
18063A15957c4793k67617A14247Q2370b17799O9791B02583e2528J6085k62390
18053b98833A61440R435C1038O2724O6478d7793G8886a27201c2671A30535j9718
18042A10817e7144E4056a75630P4346b5847G743K01053a60981A9576i3406B49373
18030B11739p2111g1918l6186D0172K36062c2417C18383b07418d474k08332j26136
18019c38942A47310Q1827g1961I8481a60113b3683n4596m06505a88941B31519
18008A34013a08076A22228H282a52092A98116C49K89881f7026K1220D2934J04888
$$ plain form
17997 147822 161367 12079 -65318 -127195 23576 48645 201254 -249435 131333 -108793 358754
17985 -70938 -116951 -200793 35435 -289334 151960 -132410 14030 -171240 93317 -125856 -30586
17973 425089 -79912 -199751 228371 -96166 157070 84687 -209636 -70135 -11685 149136
17962 141062 114109 162491 -198106 29698 306154 113303 -46184 174753 -8834 201677 -59722
17950 80593 38883 -26013 236096 -3868 -22194 -144624 56449 208745 -24885 -464489 196056
17938 -43872 -181633 -96405 -12857 24468 58887 57948 145369 175434 -63321 -262787 82252 77650
17926 77650 -472357 -401562 274567 61805 -307946 296168 -220516 -227113 87099 196450 316454
17915 316454 140807 -182355 -70018 129549 127413 9389 -207074 192094 -194535 5877 -105634
$$ packed form
17997A47822J3545A2079f5318o1877B3576K5069J52609b49435A31333a08793C58754
17985g0938m6013q3842C5435b89334A51960a32410A4030a71240I3317a25856c0586
17973D25089g9912j19839B28371i6166A57070p2383b09636g0135a1685A49136
17962A41062k6953M8382a98106B9698K76456A13303d6184A74753h834B01677e9722
17950H0593C8883b6013B36096c868j8326j22430E6449J52296b4885m39604A96056
17938d3872j37761Q5228a2857B4468L4419r39Q7421L0065f3321j99466H2252m602
17926G7650d72357P0795B74567F1805c07946B96168b20516o597H7099J09351J20004
17915C16454A40807a82355g0018A29549k136I389b07074A92094a94535E877a05634
$$ plain form
17903 29186 14678 -298955 601299 -70864 260334 -166866 131110 -251554 100096 169247
17893 169247 -78941 -60017 63467 282022 224060 65769 295739 -152198 -3017 38994 65938
17882 65938 272333 7173 -59414 -42644 156368 120542 174780 225513 181307 -345751 327149
17870 129496 -116762 -297852 -160108 -317363 71785 41326 -110554 272852 -135017 46975
17859 242708 176971 -39505 71208 190590 112103 444288 382228 -4911 1787 65313 -76556
17847 409131 -115898 -7870 69881 22548 -101758 -25667 -134412 236046 66196 2777 -19991
17835 6819 -228930 -139368 337276 -26756 91745 98436 149080 -37811 261051 152224 238173
17824 238173 130352 75631 77147 264785 25929 -164821 -24206 -90107 18685 -29914 -41641
$$ packed form
17903B9186j4508b98955F01299g0864B60334a66866A31110b51554A00096O9151
17893A69247g8941J8924F3467K18555n7962F5769K29970a52198c017C8994K6944
17882F5938K06395G173e9414J6770A56368l5826N4238N0733m4206c45751C27149
17870A29496a16762j81090J37744j57255G1785l0459a10554B72852a35017D6975
17859B42708o5737c9505G1208J19382p8487L32185o2060d911A787O3526g6556
17847D09131a15898g870F9881B2548a01758b5667j08745B36046F6196B777a9991
17835F819b28930Q9562C37276b6756I1745O691N0644c7811B61051j08827Q5949
17824B38173j07821n4721J516J87638B5929a64821b4206o5901A8685b9914j1727
$$ plain form
17813 -41641 -72255 -222846 -130178 -82460 -83712 56525 12558 -52342 210455 79982 266841
17802 266841 192767 -10790 250521 299306 -137471 257801 -24824 30941 -29764 53502 185943
17791 185943 -18112 -72709 303458 123154 72936 356254 -366953 53632 -1301 34864 261719
17780 261719 46924 280639 145331 246583 -143872 105603 -64794 79426 -272072 -31378
17769 14218 -256082 -38843 165922 202462 141699 174098 325411 470524 -283 -11268 92740
17757 294262 355350 261927 -164418 245360 -162560 266661 151640 233090 294515 -97114
17746 72633 -30067 -93920 185241 156850 -2805 155648 10628 92947 -21097 -17879 -17632 225600
17733 -165697 254273 -182674 298557 99834 123179 51803 463651 460068 -233019 281166
$$ packed form
17813d1641l0614j50591R2668M7718j252E6525A2558e2342B10455G9982J86859
17802B66841p4074a0790B50521M8785a37471B57801b4824C0941b9764E3502J32441
17791A85943a8112n4597C03458A23154n0218K83318c66953E3632a301C4864K26855
17780B61719D6924K33715j35308J01252a43872A05603f4794G9426b72072c1378
17769A4218b56082c8843A65922L6540o0763L2399J51313J45113b83j0985I2740
17757B94262O1088r3423a64418B45360a62560B66661j15021Q1450O1425i7114
17746G2633c0067o3853A85241k8391b805A55648A0628Q2319b1097L218K47B25600
17733a65697B54273a82674B98557I9834K3345E1803M11848l583b33019B81166
$$ plain form
17722 -70960 220101 154661 306690 -57353 195211 96079 366295 95262 80117 77892 -1259
17710 -47296 -121568 88338 130230 5048 -18330 -78771 271150 -71528 152906 -290136 388242
17698 -54273 189742 97599 232859 9021 71720 51707 299373 -28041 424518 17584 -9776
17686 431741 443275 374062 177771 229150 85384 -126375 32054 115468 -1222 19106 1372
17674 -130769 208101 239490 -130794 -103523 120783 66333 473182 56027 282889 399407
17664 399407 267987 -57723 156582 -444693 -193034 230930 -6669 23282 354206 105228
17653 -46165 70385 -26815 118656 630 -134204 9226 -20049 31418 323834 -10682 236831
17641 -4443 -127875 255763 87338 87187 186725 -62993 -166536 114609 56309 92496 42751
$$ packed form
17722g0960B20101o5440J52029e7353A95211I6079K70216I5262j5145k225a259
17710d7296p4272H8338M1892E048a8330o0441B71150g1528A52906b90136C88242
17698e4273A89742r2143J35260I021O2699k0013K47666b8041D24518A7584i776
17686D31741J1534o9213A77771N1379H5384a26375C2054Q3414a222A9106A372
17674a30769B08101L1389a30794K7271A20783n4450M06849E6027K26862J16518
17664C99407j31420e7723A56582d44693a93034B30930f669B3282L30924A05228
17653d6165G0385b6815A18656F30a34204I226b0049C1418K92416a0682B36831
17641d443j23432B55763H7338j51R9538f2993j03543A14609E6309L6187D2751
$$ plain form
17629 141588 -192257 455684 -65099 46367 -31221 202950 104605 62829 -106321 61983 184547
17618 184547 243289 345883 -54508 114860 110822 25171 189424 494021 -47346 195443 228767
17607 228767 205119 61520 95696 3793 63917 -67013 3466 -80014 158954 -181914 -61451
17595 30157 134279 233615 116167 289070 175006 222015 341285 -33701 235863 355000
17585 355000 414801 156600 -120474 407640 229348 200555 242581 98250 35622 -53196 329234
17573 297837 174323 54127 -158254 303355 341286 29415 -36551 80336 340075 228 289079
17562 289079 216574 351862 153266 6272 -58515 281963 275606 -219854 210456 305378 136149
17550 203607 337532 16250 275958 154881 136143 -69395 38129 307264 186679 506699
$$ packed form
17629A41588a92257D55684f5099D6367c1221B02950r8345m1776a06321F1983J22564
17618A84547N8742J02594e4508A14860m038B5171J64253L04597d7346A95443L3324
17607B28767k3648F1520L4176C793O0124f7013C466h0014A58954a81914f1451
17595C0157J04122R9336A16167J72903j14064M7009J19270c3701B35863J19137
17585C55000N9801A56600a20474D07640j78292k8793M2026I8250C5622e3196C29234
17573B97837j23514E4127a58254C03355L7931B9415c6551H0336K59739B28K88851
17562B89079p2505J35288A53266F272e8515B81963o357b19854B10456R4922A36149
17550B03607J33925A6250K59708j21077j8738f9395C8129K69135j20585L20020
$$ plain form
17540 506699 294688 115276 319108 499851 212645 269703 142006 517335 158688 -43140
17529 333760 339981 818688 387739 868953 613647 833039 964842 709497 1279837 824594
17519 824594 423232 494436 392535 671534 331704 218284 236205 404296 966164 839505
17509 839505 1065117 817644 848406 523392 850696 249173 157991 575428 527056 446915
17499 446915 638922 221044 331191 386301 244880 377569 333913 140642 407537 167599
17488 282653 407039 291922 283867 350612 336455 282253 285758 536816 117556 304693 436374
17477 436374 244645 62742 462092 527701 402459 162338 370764 415836 252791 494939
17467 494939 334051 559088 155530 119909 60889 162425 358073 -94791 -20571 89376
$$ packed form
17540E06699k12011A15276K03832J80743B12645N7058j27697L75329A58688d3140
17529C33760O221M78707C87739M81214k55306K19392J31803k55345N70340m55243
17519H24594m01362P1204j01901K78999C31704j13420J7921J68091N61868j26659
17509H39505K25612k47473L0762l25014L27304B49173r1182M17437m8372q0141
17499D46915J92007B21044J10147N5110j41421J32689m3656A40642K66895A67599
17488B82653J24386j15117q055O6745j4157n4202L505K51058A17556J87137J31681
17477D36374j91729F2742L99350O5609j25242A62338K08426M5072j63045K42148
17467D94939j60888K25037A55530l5621n9020J01536J95648i4791b0571H9376
$$ plain form
17456 376018 358544 248128 261393 507705 175662 113164 359222 312388 624813 610451
17446 610451 107695 709578 807055 275331 521180 213304 159351 270056 120710 360660
17436 360660 228222 583214 49757 366638 401225 63942 300894 468361 306753 319636
17426 319636 138415 447101 295801 491473 103712 437844 469745 311153 197881 380288
17416 380288 459202 25373 430279 239364 518564 644002 515370 588664 266411 357703
17406 357703 493508 286787 306501 179445 107527 132465 -218859 -8194 -31892 326832 403713
17395 403713 254335 388284 168577 217175 335650 135037 403245 86038 229251 496031
17385 496031 386911 211414 338186 337172 12184 197662 118966 218993 -51709 276721
$$ packed form
17456C76018j7474j10416J3265K46312A75662o2498K46058m6834L12425j4362
17446F10451A07695O01883R7477B75331K45849B13304n3953J10705A20710K39950
17436C60660j32438L54992D9757L16881L4587F3942K36952J67467j61608J2883
17426C19636A38415L08686j51300J95672A03712L34132L1901j58592j13272J82407
17416C80288P8914B5373M04906j90915K79200J25438j28632P3294B66411R1292
17406C57703J35805k06721J9714j27056p1918K4938b18859h194k3698C26832P6881
17395D03713j49378J33949A68577M8598J18475A35037K68208H6038J43213K66780
17385D96031j09120j75497J26772j014A2184J85478p8696J00027e1709B76721
$$ plain form
17374 92757 531087 376186 132802 299570 314134 341528 306943 247335 -188544 259339
17363 -180274 50171 90773 184323 401641 384602 -26273 402226 134412 393013 298812 184800
17352 184800 341982 293126 423331 100292 544919 233735 154585 267163 80088 287510
17342 287510 -44297 195814 123891 214832 82055 37353 84302 206974 583795 473494 202885
17330 124735 685730 363511 448660 632054 202957 308510 206695 240924 497965 349878
17320 349878 691625 275455 335690 -36839 140217 253123 576980 299104 199906 256875
17310 256875 358187 477830 91605 236000 67926 404992 59802 83818 491478 328005
17300 328005 354122 134069 539556 296831 400564 -177356 444768 532877 404422 380436
$$ packed form
17374I2757M38330j54901A32802J66768J4564K7394l4585n9608a88544B59339
17363a80274E0171M0602R3550K17318j7039b6273D02226A34412K58601r4201j14012
17352A84800J57182m8856J30205A00292M44627B33735p9150J12578H0088K07422
17342B87510d4297A95814p1923R0941H2055C7353M6949J22672L76821j10301B02885
17330A24735N60995l22219Q5149J83394B02957J05553j01815L4229K57041j48087
17320C49878L41747B75455O0235c6839A40217J12906L23857k77876r9198N6969
17310B56875J01312J19643I1605J44395F7926L37066E9802K4016M07660j63473
17300C28005K6117A34069M05487k42725J03733a77356D44768Q8109j28455k3986
$$ plain form
17290 380436 297041 430456 536367 368575 170241 555192 123964 725300 171086 279343
17280 279343 426513 222100 583719 347500 557354 326017 370607 167107 332137 84207
17269 274613 608572 164816 221580 486874 316008 459197 565669 348251 594691 376293
17259 376293 407402 424028 295550 544203 247742 392504 317679 571716 225490 448854
17249 448854 366530 392193 418059 330716 556371 390640 306769 558652 177058 187046 321089
17238 321089 378009 226496 503780 794016 673541 451053 687986 235257 286348 409899
17228 409899 534265 378681 446584 348566 701935 332457 377168 416498 375593 575047
17218 575047 379285 346725 592656 454305 183029 313740 552181 779324 453482 620145
$$ packed form
17290C80436q3395J33415J05911j67792A70241L84951A23964O01336A71086J08257
17280B79343J47170k04413L61619k36219K09854k31337M4590A67107J65030H4207
17269B74613L33959A64816N6764K65294j70866J43189J06472k17418K46440k18398
17259C76293L1109J6626j28478K48653B47742J44762p4825K54037B25490K23364
17249D48854q2324K5663K5866q7343K25655j65731q3871K51883A77058R988J34043
17238C21089N6920j51513K77284K90236j20475k22488K36933B35257N1091J23551
17228D09899J24366j55584O7903r8018L53369C32457M4711L9330m0905J99454
17218E75047j95762l2560K45931j38351A83029J30711K38441K27143l25842J66663
$$ plain form
17208 620145 479090 701471 541612 294316 579369 337201 377320 518870 496492 509580
17198 509580 542707 813829 285561 619582 594544 717379 427912 763735 609518 699455
17188 699455 353025 465861 482838 427556 456881 364027 503799 459569 599674 734739
17178 734739 795049 584720 443551 551715 634044 591677 521559 607609 689646 596819 291824
17166 719936 647476 491773 753052 415738 275646 494006 592767 529116 470470 737882
17156 737882 478837 562778 740913 509670 614370 592266 682690 718331 889699 672598
17146 672598 837824 674245 801760 729812 513771 819206 304205 513231 676656 591792
17136 591792 415864 455868 687329 513059 600038 674808 536297 759203 721172 912985
$$ packed form
17208F20145j41055K22381j59859k47296K85053k42168M0119J41550k2378J3088
17198E09580L3127K71122B85561L34021k5038J22835k89467L35823j54217Q9937
17188F99455l46430J12836J6977n5282K9325r2854J39772m4230J40105J35065
17178G34739O0310k10329j41169J08164Q2329m2367p0118Q6050Q2037r2827B91824
17166G19936p2460j55703K61279l37314j40092K18360R8761o3651n8646K67412
17156G37882k59045Q3941J78135k31243J04700k2104R0424L5641J71368k17101
17146F72598J65226j63579J27515p1948k16041L05435C04205K09026J63425q4864
17136E91792j75928M0004K31461j74270Q6979P4770j38511K22906l8031J91813
$$ plain form
17126 912985 617872 643778 374328 663700 639803 808588 857616 616208 1016671 1029054
17116 1029054 499028 892112 747164 546674 1241356 810552 800614 640933 846918 585736
17106 585736 737850 687215 457073 852631 637948 893385 399760 683484 1118359 911754
17096 911754 1011831 1009020 621033 805578 889450 1080451 771011 765666 698517 958896 756336
17085 756336 794741 728664 738876 875972 504356 718033 1104149 1002035 773395 826511
17075 826511 896207 1095539 593050 967038 1134875 979509 863451 1214082 919292 960111
17065 960111 1231896 1131656 767545 906547 1041377 1142254 1163087 1307599 1386903 834125
17055 834125 1121895 1080035 898899 1280586 937997 1043834 852507 839995 1163244 982133
$$ packed form
17126I12985k95113K5906k69450K89372k3897J68785M9028k41408M00463J2383
17116A029054D99028L93084j44948k00490O94682m30804r938j59681K05985k61182
17106E85736J52114n0635k30142L95558k14683K55437C99760K83724M34875k06605
17096I11754J00077k811l87987J84545Q3872J91001l09440n345o7149K60379k02560
17085G56336L8405o6077J0212J37096l71616K13677L86116j02114k28640N3116
17075H26511O9696J99332n02489L73988J67837j55366j16058L50631k94790M0819
17065I60111K71785j00240l64111J39002J34830J00877K0833J44512P9304n52778
17055H34125K87770m1860j81136L81687l42589J05837j91327j2512L23249j81111
$$ plain form
17045 982133 957994 986291 1231481 752600 1103651 1149536 1151875 1106489 1302635 1427746 836390
17034 836390 1142678 999888 1311302 1118491 1249108 943945 1228726 1221608 1276803 1331738
17024 1331738 1044933 1167067 1430095 1107837 1159284 1698484 1072939 1117607 1258620 1701129
17014 1701129 1319909 1529678 1424618 1515845 1216933 951575 1444139 1345555 1371164 1410786
17004 1410786 1660866 1397708 1532581 1585381 1635337 1228625 1784290 1493959 1621462 1538198
16994 1538198 1602133 1510184 1779061 1736310 1503281 1466983 1852228 1671213 1897369 1731394
16984 1731394 1653585 1907916 1400404 1733221 1852050 1674978 1750125 1805285 1491091 1638036
16974 1638036 1582038 1997604 1819323 1975422 2008597 1616756 2306659 1875079 2056635 1944850
$$ packed form
17045I82133k4139K8297K45190m78881L51051M5885K339m5386J96146J25111n91356
17034H36390L06288j42790L11414j92811J30617l05163K84781p118N5195N4935
17024A331738k86805J22134K63028l22258N1447N39200o25545M4668J41013M42509
17014A701129l81220K09769j05060R1227k98912k65358M92564r8584K5609L9622
17004A410786K50080k63158J34873N2800M9956m06712N55665k90331J27503q3264
16994A538198O3935r1949K68877m2751k33029l6298L85245j81015K26156j65975
16984A731394p7809K54331n07512L32817J18829j77072P5147N5160l14194J46945
16974A638036n5998M15566j78281J56099L3175l91841O89903m31580J81556j11785
$$ plain form
16964 1944850 1866176 2022505 2114876 1978151 2265570 2130217 2292182 1940230 2486944 2493845
16954 2493845 2074095 2213699 2436070 2044214 2194496 2376883 2009010 2400018 2409324 2296267
16944 2296267 2292678 2375680 2233425 2419304 2322280 2531223 2651727 2607290 2484050 2748998
16934 2748998 2853234 2401041 2576819 2580503 2689841 2786826 2759016 2712733 2897122 2816230
16924 2816230 2727179 2801825 2978391 2943029 2981071 2988498 2981101 3135303 3179160 2878449 3398996
16913 3398996 3275087 3085633 3103406 3230173 3441563 3592615 3355678 3365875 3607215 3902685
16903 3902685 3379978 3798627 3671542 3957868 3499672 3676234 3995950 4088089 4023663 4065245
16893 4065245 3936700 4265259 3932620 4564389 4500433 4488945 4372307 4606435 4752133 4249088
$$ packed form
16964A944850p8674J56329R2371j36725K87419j35353J61965l51952N46714O901
16954B493845m19750J39604K22371l91856J50282J82387l67873L91008R306j13057
16944B296267l589Q3002j42255J85879r7024K08943J20504m4437j23240K64948
16934B748998J04236m52193J75778L684J09338R6985k7810m6283J84389q0892
16924B816230q9051P4646J76566l5362L8042P427p397J54202M3857l00711N20547
16913C398996j23909j89454J7773J26767K11390J51052k36937J0197K41340K95470
16903C902685n22707M18649j27085K86326m58196J76562L19716R2139o4426M1582
16893D065245j28545L28559l32639O31769o3956j1488j16638K34128J45698n03045
$$ plain form
16883 4249088 4583646 4502035 4675671 4685404 4941010 5077082 4806135 4761177 5331602 5199712
16873 5199712 5430548 5617577 5519268 5310576 5401145 5479789 5464258 5755649 5654491 6106671
16863 6106671 5614839 6079976 6231212 6079748 6097741 6725723 6305408 6714367 6977064 6934132
16853 6934132 6675483 7080456 7161075 6979655 7212579 7277237 7586777 7756652 7926763 7804125
16843 7804125 7603911 8143858 8330238 8679890 8582238 8666489 8642813 8880819 9167192 9318110
16833 9318110 9743413 9712599 9711010 9613721 10259359 10209037 10201743 10779028 10530349 11107090 11363237
16822 11363237 11630416 11507503 11592099 11979095 12053343 12639775 12982084 12948333 13379207 13750954
16812 13750954 13899047 14193977 14085777 14627550 14853556 15180199 15756913 15890547 16143674
$$ packed form
16883D249088L34558q1611J73636R733K55606J36072k70947m4958N70425j31890
16873E199712K30836J87029r8309k08692R0569P8644j5531K91391j01158M52180
16863F106671m91832M65137J51236j51464J7993O27982m20315M08959K62697m2932
16853F934132k58649M04973Q0619j81420K32924O4658L09540J69875J70111j22638
16843G804125k00214N39947J86380L49652r7652Q4251k3676K38006K86373J50918
16833I318110M25303l0814j589r7289O45638n0322p294N77285k48679N76741K56147
16822A1363237K67179j22913Q4596L86996P4248N86432L42309l3751M30874L71747
16812A3750954J48093K94930j08200N41773K26006L26643N76714J33634K53127
$$ plain form
16803 16143674 16372055 17162532 17152460 18082193 18165592 18585374 18732726 19092989 19413681 20038414
16793 20038414 20722393 20911900 21295470 21996596 22387796 23123065 23455601 23757295 24563236
16784 24563236 25185323 26130127 26463940 27073099 27679007 28587242 29230246 29946540 30845243
16775 30845243 31832160 32382367 33191570 33999022 34839436 35879190 36800354 37670240 38594848
16766 38594848 39624774 40750497 41697416 43019856 44029031 45069934 46170766 47499654
16758 47499654 48705285 49752258 50929658 52437615 53785221 55004951 56351218 57524801
16750 57524801 58939501 60459400 61761249 63091687 64385700 65698948 67324969 68462554
16742 68462554 69628680 71245324 72376387 73597123 74627519 75764966 77028586 77869657
$$ packed form
16803A6143674K28381P90477j0072R29733Q3399M19782J47352L60263L20692O24733
16793B0038414O83979J89507L83570P01126L91200P35269L32536L01694Q05941
16784B4563236O22087R44804L33813O09159O05908R08235O43004P16294Q98703
16775C0845243R86917N50207Q09203Q07452Q40414J039754R21164Q69886R24608
16766C8594848J029926J125723R46919J322440J009175J040903J100832J328888
16758D7499654J205631J046973J177400J507957J347606J219730J346267J173583
16750E7524801J414700J519899J301849J330438J294013J313248J626021J137585
16742F8462554J166126J616644J131063J220736J030396J137447J263620Q41071
$$ plain form
16734 77869657 78821491 79613092 80478442 81074266 81857648 82448563 82910218 83158515 83429210
16725 83429210 83107273 83677360 83355725 82899927 82661011 82173649 82093986 81284525 80547970
16716 80547970 79831081 78901535 78140097 77201989 76068510 74858216 73671948 72731719 71523404
16707 71523404 70049767 68816697 67430151 66263056 64438931 63765124 61990837 61037586
16699 61037586 59663931 57888055 57009248 55439827 54356626 52815350 51255553 50279566
16691 50279566 49188321 47992296 46715586 45451033 44499630 43551049 42629171 41272825
16683 41272825 40379868 39323647 38475870 37566766 36325056 35628295 34678727 33943643 33383294
16674 33383294 32316776 31475403 30910082 29933431 29681086 28749484 27971910 27100648 26824962
$$ packed form
16734G7869657R51834P91601Q65350N95824P83382N90915M61655K48297K70695
16725H3429210l21937N70087l21635m55798k38916m87362p9663q09461p36555
16716H0547970p16889r29546p61438r38108j133479j210294j186268r40229j208315
16707G1523404j473637j233070j386546j167095j824125o73807j774287r53251
16699F1037586j373655j775876q78807j569421j083201j541276j559797r75987
16691E0279566j091245j196025j276710j264553r51403r48581r21878j356346
16683D1272825q92957j056221q47777r09104j241710o96761r49568p35084n60349
16674C3383294j066518q41373n65321r76651k52345r31602p77574q71262k75686
$$ plain form
16665 26824962 26298900 25833656 25031389 24369793 23556611 23359437 22592418 22394917 21662096
16656 21662096 21607795 20752637 20378739 20143444 19849933 19311759 19000513 18661074 18337529
16647 18337529 17870622 17435003 17038261 16686358 16621817 16471243 15544032 15469245 15157505 14870358
16637 14870358 14656804 14616676 13987651 13981169 13703748 13498977 13273471 13050651 12776458 12371155
16627 12371155 12077592 12096843 12365793 11824845 11245890 11272296 11038825 10823956 10690270 10760709
16617 10760709 10450267 10393546 10034124 10055184 9897299 10044640 9344512 9339270 9303303 9247667
16607 9247667 9041883 8860853 8897923 8988117 8561197 8331138 7836032 8239615 8076727 7985744
16597 7985744 7968764 7727122 7648035 7302343 7778532 7461332 7243145 7057865 7049413 7154013
$$ packed form
16665B6824962n26062m65244q02267o61596q13182j97174p67019j97501p32821
16656B1662096n4301q55158l73898k35295k93511n38174l11246l39439l23545
16647A8337529m66907m35619l96742l51903o4541j50574r27211p4787l11740k87147
16637A4870358k13554m0128o29025o482k77421k04771k25506k22820k74193m05303
16627A2371155k93563J9251K68950n40948n78955K6406k33471k14869j33686P0439
16617A0760709l10442n6721l59422K1060j57885J47341p00128n242l5967n5636
16607I247667k05784j81030L7070R0194m26920k30059m95106M03583j62888r0983
16597G985744j6980k41642p9087l45692M76189l17200k18187j85280q452J04600
$$ plain form
16587 7154013 7057634 6891165 6848800 6679866 6542111 6439585 6167261 6368106 6027378 6183189
16577 6183189 5979489 5854173 6229848 5672888 5750518 5573347 5642705 5434592 5234379 5870899
16567 5870899 5160656 5635728 4995478 5119771 5099613 5179743 5026334 4712171 5053691 5038018
16557 5038018 4894083 4524094 4253117 4431346 4635827 4421358 4467771 4596824 4574657 4414440
16547 4414440 4203094 4484976 4061102 4318342 4196957 4106324 4191466 4271743 3986300 3873126
16537 3873126 3889698 3905100 3921697 3876349 3848726 3890304 3817819 3555879 3655305 3537486 3826961
16526 3826961 3484299 3564203 3648558 3567567 3436549 3421439 3353587 3410889 3516692 3371927
16516 3371927 3232398 3382288 3185356 3062762 3373360 3441112 3033102 3287188 3164254 3031668
$$ packed form
16587G154013r6379j66469m2365j68934j37755j02526k72324K00845l40728J55811
16577F183189k03700j25316L75675n56960P7630j77171O9358k08113k00213O36520
16567E870899p10243M75072o40250J24293k0158Q0130j53409l14163L41520j5673
16557E038018j43935l69989k70977J78229K04481k14469M6413J29053k2167j60217
16547D414440k11346K81882m23874K57240j21385r0633Q5142Q0277k85443j13174
16537C873126J6572J5402J6597m5348k7623M1578p2485k61940R9426j17819K89475
16526C826961l42662P9904Q4355q0991j31018j5110o7852N7302J05803j44765
16516C371927j39529J49890j96932j22594L10598O7752m08010K54086j22934j32586
$$ plain form
16506 3031668 2933452 2733028 3102716 2877955 2885473 2726623 2576651 2556177 2667917 3288337
16496 3288337 2813765 2734730 3104708 2516560 2590961 2916940 2435673 2388750 2597720 2736308
16486 2736308 2587676 2518755 2714720 2258844 2547376 2267573 2237914 2426910 2354755 2188015
16476 2188015 2538489 2501012 2572633 2166799 2055162 2298703 2480457 2554055 2150968 2295625
16466 2295625 2194832 2298666 2514448 2323385 1980184 1834676 2143755 2096799 2178081 2133763
16456 2133763 2262054 1989776 2207799 2256486 2069247 2055591 1895085 1904323 2256272 1691398
16446 1691398 1446996 1759748 1719409 1806963 1738997 2000057 1729071 1897999 1925422 1871455
16436 1871455 1743245 2061890 1811288 2117518 1711647 2007492 2150411 1384356 1769684
$$ packed form
16506C031668r8216k00424L69688k24761P518j58850j49972k0474J11740O20420
16496C288337m74572p9035L69978n88148P4401L25979m81267m6923K08970J38588
16486B736308j48632o8921J95965m55876K88532k79803k9659J88996p2155j66740
16476B188015L50474l7477P1621m05834j11637K43541J81754P3598m03087J44657
16466B295625j00793J03834K15782j91063l43201j45508L09079m6956Q1282m4318
16456B133763J28291k72278K18023M8687j87239j3656j60506R238L51949n64874
16446A691398k44402L12752m0339Q7554o7966K61060k70986J68928K7423n3967
16436A871455j28210L18645k50602L06230m05871K95845J42919p66055L85328
$$ plain form
16427 1769684 1639798 1838127 1523763 1431093 1804483 1581842 1513308 1761841 1514614 1604126
16417 1604126 1588654 1644181 1803278 1386878 1769160 1562538 1848546 1537701 1646435 1141221
16407 1141221 1642854 1736541 1534828 1602346 1703340 1539252 1456821 1426956 1810409 1411535
16397 1411535 1329830 1589364 1349542 1292899 1212310 1808757 1145646 1370942 1238176 1306191
16387 1306191 983369 1474206 1141317 1365737 1218762 1257505 1636839 1601483 1317486 1482994
16377 1482994 1243928 1214401 1474589 1024485 1135111 1665796 1352862 1185659 1117104 1370684
16367 1370684 1239096 1455481 996645 1087352 1220433 1292467 1279959 1402846 1376230 1168619
16357 1168619 843998 1162307 1468285 1102275 952243 1195239 873591 796120 1036431 1062294
$$ packed form
16427A769684j29886J98329l14364r2670L73390k22641o8534K48533k47227Q9512
16417A604126j5472N5527J59097m16400L82282k06622K86008l10845J08734n05214
16407A141221N01633R3687k01713O7518J00994j64088q2431k9865L83453l98874
16397A411535q1705K59534k39822n6643q0589N96447o63111K25296j32766O8015
16387A306191l22822M90837l32889K24420j46975L8743L79334l5356k83997J65508
16377A482994k39066k9527K60188m50104J10626N30685l12934j67203o8555K53580
16367A370684j31588K16385m58836R0707J33081P2034j2508J22887k6616k07611
16357A168619l24621L18309L05978l66010j50032K42996l21648p7471K40311K5863
$$ plain form
16347 1062294 1062844 1006409 894165 1169539 1349302 1060353 1328413 1074684 1030238 912898
16337 912898 881569 971843 968290 865464 1135574 1135694 897353 1225094 1027688 958973 1288332
16326 1288332 916460 1155140 831499 811609 683078 723000 1040996 816206 1226098 716249
16316 716249 994033 826317 1199436 712089 997652 841247 955029 1136577 992790 849616
16306 849616 842562 984433 805585 1020341 785689 1015250 605871 837011 793737 996148
16296 996148 724236 1159562 993988 1041395 785068 638312 840096 731017 797057 886704
16286 886704 540767 962621 538540 631040 796833 944560 766160 552288 745308 848179
16276 848179 693416 655776 440236 913361 959625 456651 1096170 890545 405281 789502
$$ packed form
16347A062294N50n6435j12244K75374J79763k88949K68060k53729m4446j17340
16337I12898l1329R0274l553j02826K70110J20k38341L27741j97406o8715L29359
16326A288332l71872K38680l23641j9890j28531L9922L17996k24790M09892n09849
16316G16249K77784j67716L73119m87347K85563j56405J13782J81548j43787j43174
16306H49616p054J41871j78848K14756k34652K29561m09379K31140m3274K02411
16296I96148k71912M35326j65574M7407k56327j46756K01784j09079O6040Q9647
16286H86704l45937M21854m24081R2500J65793J47727j78400k13872J93020J02871
16276H48179j54763l7640k15540M73125M6264D56651O39519k05625D05281L84221
$$ plain form
16266 789502 784765 586889 769582 646840 551620 494310 803624 706601 666312 707073 657799
16255 657799 848698 740070 648918 594975 611273 668432 633037 873875 611908 627288 405543
16244 405543 608497 404808 463958 443599 547384 418279 603464 479440 464874 479012
16234 479012 882737 588033 309345 517055 447872 510030 213326 360078 699658 452702
16224 452702 743607 459462 640497 712631 962046 602828 190328 387263 926009 315546
16213 597405 364230 348289 495437 476101 337777 580502 458147 509251 342416 406692
16203 406692 736769 390240 488114 423579 431623 383870 310229 469925 290206 367902 502738
16192 502738 496395 581994 444628 404266 429523 424630 585381 469297 302670 620782 569967
$$ packed form
16266G89502m737j97876J82693j22742r5220n7310L09314r7023m0289M0761m9274
16255F57799J90899j08628r1152n3943J6298N7159l5395K40838k61967J5380k21745
16244D05543K02954k03689N9150k0359J03785j29105J85185j24024j4566J4138
16234D79012M03725k94704k78688K07710o9183O2158B13326J46752L39580k46956
16224D52702K90905k84145J81035P2134K49415l59218A90328J96935N38746C15546
16213E97405k33175j5941J47148j9336j38324K42725j22355N1104j66835O4276
16203D06692L30077l46529R7874o4535Q044m7753p3641J59696j79719P7696J34836
16192E02738o343Q5599j37366m0362K5257m893J60751j16084j66627L18112n0815
$$ plain form
16181 569967 752696 382030 376121 734819 329273 575963 566770 415581 512604 297799
16171 297799 619583 623712 631268 187081 438365 486192 435961 483286 551961 250268 622161
16160 622161 418524 217761 97553 215018 129547 511557 250695 794259 274934 144762
16150 144762 40959 188992 418999 362994 486812 706209 342158 64479 499781 165644
16139 349650 343118 452821 420218 816886 28531 538910 382481 56772 233843 349003
16129 349003 315403 248486 90789 417746 474274 121746 353542 515304 11091 -36639 610775
16117 5540 152252 125880 316136 303809 542161 347586 426142 181506 20118 344700 532966
16106 532966 119663 201387 123935 268536 446461 242942 247730 284665 231428 352395 189234
$$ packed form
16181E69967J82729l70666n909L58698C29273K46690r193j51189R7023k14805
16171B97799L21784M129P556A87081K51284M7827n0231M7325O8675B50268L71893
16160F22161k03637k00763I7553J17465q5471L82010B50695N43564B74934j30172
16150A44762D0959J48033K30007n6005J23818K19397C42158F4479M35302A65644
16139C49650o532J09703l2603L96668B8531N10379j56429E6772J77071J15160
16129C49003l3600o6917I0789L26957N6528A21746K31796J61762A1091c6639F10775
16117E540J46712k6372J90256j2327K38352j94575P8556A81506B0118L24582J88266
16106E32966A19663Q1724p7452J44601J77925k03519M788L6935n3237J20967j63161
$$ plain form
16095 189234 30267 420834 282532 509813 424132 172485 348807 666610 -89143 35138
16084 411662 469426 298625 146829 474887 188014 165647 -188371 262552 390394 100754
16073 123340 312413 228296 91070 346325 4125 209230 44605 -155497 -131617 84473 364254
16062 364254 407266 333934 142624 140976 232035 270699 116697 87153 148980 464210 442795
16051 442795 222600 148081 32084 438950 237463 101334 125682 186236 236499 -30856 275547
16039 162305 156855 158545 400646 180611 200054 306041 155360 362481 -123214 -11925 151491
16027 46568 51134 251910 -161627 50995 -5281 174281 32399 -25481 160815 -94925 -32376
16015 428373 184317 -205774 96578 -25330 101508 141566 357098 300204 35673 246373
$$ packed form
16095A89234C0267L90567j38302K27281q5681A72485J76322L17803h9143C5138
16084D11662N7764j70801A46829L28058A88014k2367a88371B62552J27842A00754
16073A23340J89073q4117I1070K55255D125K05105D4605a55497K3880H4473K79781
16062C64254M3012p3332A42624j648R1059L8664A16697k9544O1827L15230k1415
16051D42795k20195p4519C2084M06866k01487A01334K4348O0554N0263c0856B75547
16039A62305n450J690K42101A80611J9443J05987j50681K07121a23214a1925A51491
16027D6568M566K00776a61627E0995e281A74281C2399b5481A60815i4925c2376
16015D28373A84317b05774I6578b5330A01508M0058K15532n6894C5673K10700
$$ plain form
16005 246373 242204 242539 106406 339635 448468 268909 119915 246447 34776 236651 206514
15994 206514 229625 -61603 77367 438542 270998 790154 566968 963384 963282 1106182 1031840
15983 1031840 676833 711193 385082 20705 292965 -181817 196490 -120747 -109505 117917
15972 429732 265190 150219 -14647 58461 64404 261090 492495 63485 122594 346996 9743
15960 59848 -54440 243168 106777 168969 -245835 143441 5307 164620 88960 209267 97108
15948 -77563 76720 83109 -112969 36084 -335180 262839 -161464 -20853 112914 -70331 -117950
15937 -117950 -223068 -452903 376213 -469060 -19445 263836 120487 439433 -203960 -4570
15926 363932 -35237 156697 -655 -85781 263762 -52946 166332 -29833 224209 144183 228700
$$ packed form
16005B46373m169L35A06406K33229J08833j79559A19915J26532C4776K01875l0137
15994B06514K3111f1603G7367L61175j67544N19156k23186L96416j02J42900p4342
15983A031840l55007L4360l26111B0705K72260a81817A96490a20747J1242A17917
15972D29732j64542j14971a4647E8461N943J96686K31405F3485N9109K24402I743
15960E9848e4440B43168A06777O2192b45835A43441E307J59313p5660J20307I7108
15948g7563G6720O389a12969C6084c35180B62839a61464b0853A12914g0331m7619
15937a17950j05118k29835C76213d69060a9445B63836A20487L18946b03960d570
15926C63932c5237A56697f55q5126B63762e2946A66332b9833B24209q0026Q4517
$$ plain form
15915 228700 -216906 -64541 -299822 -249844 135114 -61084 -129500 262184 -262786 -99542
15904 -15799 52091 219567 98714 127548 206061 -259304 64914 60837 116989 47852 293712
15893 293712 172196 -16224 170885 -269093 -103547 291966 92336 -75655 -193146 101797
15882 134640 60272 -173319 21313 11746 -11766 102208 40510 23716 56108 -73630 -321638
15871 -321638 -161222 325385 153082 -198814 -180227 -55486 307014 -78177 125995 -238398
15860 119109 21990 -90157 -135057 32184 -126932 67347 119230 -57117 34685 -34745 60992
15848 427679 192964 -58125 -41595 235582 96130 -13793 217064 -14685 145872 -258530
15837 -158189 268391 -324154 -192014 205611 189542 290488 -85700 40640 -367654 34671
$$ packed form
15915B28700b16906f4541k35281M9978A35114f1084o8416B62184b62786i9542
15904a5799E2091J67476I8714K8834P8513b59304F4914m077N6152D7852K45860
15893B93712j21516a6224A70885b69093a03547B91966I2336g5655j17491A01797
15882A34640F0272a73319B1313r567a1766A02208D0510j6794L2392g3630k48008
15871c21638J60416C25385A53082a98814J8587e5486C07014g8177A25995b38398
15860A19109B1990i0157m4900C2184a26932F7347N1883e7117C4685c4745F0992
15848D27679A92964e8125J6530B35582I6130a3793B17064a4685A45872b58530
15837a58189B68391c24154J32140B05611j6069J00946h5700D0640c67654C4671
$$ plain form
15826 108570 310339 13477 188520 -165934 -246393 157889 -178720 -98770 254823 -57022
15815 -224511 220052 28323 -188318 -324273 199336 63203 -3854 106098 -318986 197701
15804 107485 -29322 109957 79367 -79277 123404 244743 52634 140224 -88353 -14888 -122101
15793 -122101 204097 -110078 208130 -181008 -57340 -168713 22464 -11537 171077 127399
15783 127399 -251437 146474 -13039 -96343 -46341 91534 -128362 -99140 -91984 -139472 -48005
15771 -224702 -142230 352105 31932 331120 77512 -42925 -205635 -154179 14141 319831 34857
15759 42118 -170888 201857 -46179 3890 -2594 412239 -104563 124105 177171 169447 110713
15748 110713 183266 319114 183887 144241 153288 103944 -194161 77916 79012 -121139 154541
$$ packed form
15826A08570K01769A3477J75043a65934q0459A57889a78720P9950B54823e7022
15815b24511B20052B8323a88318j35955A99336F3203c854A06098c18986A97701
15804A07485b9322A09957l0590g9277A23404J21339E2634Q7590h8353a4888j07213
15793a22101B04097a10078B08130a81008e7340j11373B2464a1537A71077m3678
15783A27399b51437A46474a3039q3304d6341I1534a28362K9222P156m7488d8005
15771b24702Q2472C52105C1932K99188G7512d2925j62710N1456A4141L05690C4857
15759D2118a70888B01857d6179C890b594D12239a04563A24105N3066p724n8734
15748A10713P2553J35848j35227l9646R047m9344a94161G7916J096a21139A54541
$$ plain form
15736 -139924 287427 79602 165659 237137 103154 -90298 -257162 -173104 -137548 102507 165211
15725 165211 162481 -243836 -55410 -7901 193179 -14436 154523 311730 129526 158614 -857
15713 -9150 -164987 -202174 -60593 242649 -72860 -100390 -13364 -161826 -5608 310665 64672
15701 -12507 12996 -93680 316827 155693 167915 58169 34141 -201729 42559 -29335 -142714
15690 -142714 177243 -1826 156936 -83227 185263 -83440 -21317 -217889 118369 -135596
15679 69772 65288 129015 19598 -115187 -109465 -186588 46054 -60977 -134891 155235 -267598
15667 151497 -41553 289127 -89874 70627 -30824 -40659 177662 85704 -2534 -136052 -142410
15656 -142410 28737 199202 -133514 396959 -5980 116190 -187928 -200796 261194 -83926
$$ packed form
15736a39924B87427G9602Q6057P1478A03154i0298j66864Q4058L5556A02507O2704
15725A65211k730b43836e5410g901A93179a4436A54523J57207A29526K9088h57
15713i150j55837l7187f0593B42649g2860k7530a3364j48462e608C10665F4672
15701a2507A2996i3680C16827A55693J2222E8169k4028b01729D2559b9335j13379
15690a42714A77243a826A56936h3227A85263h3440b1317j96572A18369a35596
15679F9772m484O3727A9598a15187N722p7123D6054f0977p3914A55235b67598
15667A51497d1553B89127h9874G0627c0824r835A77662H5704b534j33518o358
15656a42410B8737J70465a33514C96959e980A16190a87928j2868B61194h3926
$$ plain form
15645 -22402 -293710 -267848 -253276 130167 -17113 25090 147705 115592 -275596 34414 -141563
15633 122178 168356 20932 44665 -284742 31223 -111175 -83338 -152218 54633 10688 307462
15622 307462 -121641 -164669 12686 -157616 160299 250169 21717 57174 16306 -143082 31343
15610 172495 127982 -322673 120209 -62370 111988 -266485 -125153 65649 -60815 -374628
15600 -374628 128338 253948 124189 -46072 -90592 -90921 250288 111932 -35224 -199034 62702
15588 365643 -131047 -325173 34765 59573 133170 110284 91220 -324343 -18510 -6209 -198710
15577 -198710 -6179 -113438 283688 -472406 297131 -287934 67851 -173817 345466 130550
15566 -228212 -111320 435715 150397 388315 31943 -63928 239165 98151 35447 -130739
$$ packed form
15645b2402k71308K5862J4572A30167a7113B5090J22615l2113b75596C4414a41563
15633A22178M6178B0932K3733b84742C1223a11175K7837o8880E4633A0688K96774
15622C07462a21641m3028A2686a57616A60299Q9870B1717L5457A6306a43082C1343
15610A72495m4513c22673A20209f2370A11988b66485a25153F5649f0815l13813
15600c74628A28338J25610A24189d6072m4520l29B50288A11932c5224j63810F2702
15588C65643a31047j94126C4765K4808P3597k2886j9064c24343a8510f209j92501
15577a98710f179j07259B83688d72406B97131b87934F7851a73817C45466A30550
15566b28212a11320D35715A50397K37918C1943f3928B39165I8151C5447a30739
$$ plain form
15555 -18109 -104162 56327 269542 175726 -33711 115998 -545256 -77559 171527 116788 404549
15544 404549 -116738 -119624 -83890 55474 -100270 153079 139524 71946 121077 337795 76794
15532 221362 234543 349248 233959 16801 46923 305667 303651 201891 225331 -348 9695
15520 306495 159609 180429 -27690 -6124 208522 229471 213116 47163 92566 -91117 -16888
15508 -96854 170067 -290329 205058 114485 194049 -187520 -133393 69401 84150 -228346 230150
15496 329344 36143 -290752 -143356 235958 191752 171372 145360 -125215 233674 5916 -217403
15484 -476045 114971 46575 170483 79435 221639 201667 580057 677523 489036 374473
15474 374473 92183 96009 529034 -72422 216130 28483 -166175 -62118 127771 229106 400668
$$ packed form
15555a8109q6053E6327K13215r3816c3711A15998e45256g7559A71527n4739K87761
15544D04549a16738k886L5734E5474a00270A53079j3555o7578M9131K16718G6794
15532B21362J3181J14705j15289A6801L0122K58744k016j01760K3440c48I695
15520C06495j46886K0820b7690f124B08522K0949j6355D7163M5403i1117a6888
15508i6854A70067b90329B05058r0573P9564a87520N4127F9401J4749b28346B30150
15496C29344C6143b90752a43356B35958m4206k0380k6012a25215B33674E916b17403
15484d76045A14971D6575J23908G9435J42204j9972L78390R7466j88487j14563
15474C74473I2183L826M33025g2422B16130B8483a66175f2118A27771J01335J71562
$$ plain form
15463 400668 207049 328588 69666 179900 -202297 -165405 -124820 -214056 -50186 69252 274662
15452 274662 -50969 -24028 51414 413551 145249 347945 582341 640038 1352148 1179975
15442 1179975 726227 436706 298419 -42296 -19967 -274176 359915 -218540 154623 -155042
15431 39368 73628 -128349 -60288 -121982 7609 -70746 -64530 -563 30535 10818 -16663 392411
15418 173719 -19305 185834 212388 263465 -134087 60325 -187434 -210154 -353509 184709
15407 108199 -69243 13921 269098 180363 -279334 185632 -48577 -112934 55793 -59228 19094
15395 135750 -166772 222431 116121 36681 201413 -18720 97222 -108724 103277 61374
15385 61374 127219 -277109 -121443 -135564 191192 92858 83175 264040 279146 26532 -75597
$$ packed form
15463D00668j93619J21539F9666J10234b02297L6892M0585q9236e0186F9252K05410
15452B74662e0969b4028E1414L62137A45249K02696K34396N7697P12110j72173
15442A179975m53748k89521j38287d2296a9967k54209C59915b18540A54623a55042
15431C9368L4260a28349f0288o1694G609g0746O216e63C0535A0818a6663C92411
15418A73719a9305A85834K6554N1077a34087F0325a87434k2720j43355A84709
15407A08199f9243A3921K55177q8735b79334A85632d8577o4357E5793e9228A9094
15395A35750a66772B22431j06310C6681J64732a8720I7222a08724A03277m1903
15385F1374O5845b77109a21443j4121A91192I2858r683J80865J5106B6532g5597
$$ plain form
15373 22662 89796 159835 570459 380239 243454 225428 444050 -164727 -54523 251831
15362 204839 44430 140944 -23871 127488 177692 248425 15823 -131561 87675 -56757 62024
15350 443083 387185 274056 229291 -19548 76509 -46546 167198 292032 113368 666330
15340 666330 572618 355502 234693 468332 282993 192550 228203 155311 -11735 162926
15329 33783 119674 145991 22116 240739 0 -14401 188467 457466 232395 35800 179505
15318 179505 -40060 234301 70946 103193 -13243 -276730 281771 300537 -221629 176014
15307 237092 193357 -63736 170016 37089 276560 -268808 216966 91774 140920 -217723
15296 300006 266325 -47380 -92714 -73379 165272 215890 207271 130967 243912 96662 300893
$$ packed form
15373B2662O7134P0039M10624j90220j36785j8026K18622a64727e4523B51831
15362B04839D4430R6514b3871A27488N0204P0733A5823a31561H7675e6757F2024
15350D43083n5898j13129m4765a9548G6509d6546A67198J24834A13368N52962
15340F66330r3712k17116j20809K33639j85339r0443L5653p2892a1735A62926
15329C3783Q5891K6317B2116K18623@a4401A88467K68999k25071C5800J43705
15318A79505d0060B34301G0946L2247a3243k63487B81771J8766b21629A76014
15307B37092m3735f3736A70016C7089K39471b68808B16966I1774M9146b17723
15296C00006l3681d7380m5334J9335A65272N0618q619p6304J12945I6662K04231
$$ plain form
15285 300893 -285334 -14568 153080 330786 4661 13327 136345 -46128 -81146 -227419 -140708
15274 -140708 17097 -134818 -106158 139752 -27512 -52879 -9262 -77123 111888 -44522 -329075
15263 -329075 -251289 367278 158281 187683 166764 -143338 -39570 -98389 69114 203214 13258
15251 213134 869 -390211 238226 6534 461119 534517 332549 560378 683183 2289975
15241 2289975 1466738 1381052 1498443 927064 -226001 -90262 227681 73804 243622 -198728
15230 5009 22221 101737 -85162 167842 222617 -203999 401266 -47875 99290 -68080 108067
15218 81861 212738 -419181 -265807 276933 251235 -80777 127366 139340 140172 -118298 -222422
15207 -222422 -207550 88916 144619 245416 113626 -107405 102136 62388 -104925 -38489
$$ packed form
15285C00893b85334a4568A53080J77706D661Q666J23018d6128l5018j46273Q6711
15274a40708A7097a34818K8660A39752b7512k5367i262o7861A11888d4522k84553
15263c29075P7786C67278A58281K9402k0919a43338c9570n8819F9114J34100A3258
15251B13134H69c90211B38226F534M54585P3398k01968K27829J22805J606792
15241B289975q23237q5686J17391n71379b26001i0262B27681G3804J69818a98728
15230E009J7212P9516h5162A67842N4775b03999D01266d7875I9290f8080A08067
15218H1861J30877d19181J53374B76933k5698h0777A27366J1974Q32a18298j04124
15207b22422J4872H8916N5703J00797A13626a07405A02136l9748a04925c8489
$$ plain form
15196 -32614 32481 -46735 -315291 335066 161600 -48911 -16964 315949 149836 224694 259
15184 211153 -148127 67352 168220 147367 -1939 214613 564 54534 -256755 -133537 34796
15172 52805 -257857 13671 185103 34848 -152820 -133391 92784 265799 -64482 188990 -269742
15160 -286672 89909 -202786 223327 208613 48631 -8196 -87819 -181472 60025 282370 232618
15149 232618 471126 149562 -104439 263258 -12107 321898 -145882 -103418 296171 -9961
15138 -40050 -124324 -54020 50375 -294366 -108897 76259 250927 89938 35247 -12621 -6427
15127 -6427 179078 -163152 411094 566219 80856 297334 142616 -272388 205387 146366
15117 146366 396421 291508 260550 180352 73381 339582 -64395 169191 140246 -333759
$$ packed form
15196c2614C2481d6735k68556C35066A61600d8911a6964C15949A49836P4858B59
15184B11153a48127F7352J00868k0853a939B14613E64N3970b56755J23218C4796
15172E2805b57857A3671J71432C4848a52820J9429I2784J73015f4482A88990b69742
15160b86672H9909b02786B23327j4714D8631h196p9623r3653F0025K22345m9752
15149B32618K38508A49562a04439B63258a2107C21898a45882M2464B96171i961
15138d0050q4274e4020E0375b94366a08897G6259J74668H9938C5247a2621O194
15127f427A79078a63152D11094J55125H0856K16478A42616b72388B05387n9021
15117A46366K50055j04913l0958q0198G3381K66201f4395A69191k8945c33759
$$ plain form
15106 -1056 93462 12994 206325 -51572 -121742 178562 -129408 87712 120075 308290 3003
15094 -3494 314185 73145 394946 154547 85197 314542 461144 44912 344862 176284
15084 176284 278913 170040 34553 77067 -38836 -383914 111391 132912 151810 320400
15074 320400 247974 64437 153068 -88786 294584 381978 446103 89677 -51677 -17016 206955
15062 67049 557228 -42426 352156 496851 213104 360651 390989 193059 375057 -474 55544
15050 673382 127842 572929 616041 347749 317806 495126 240155 192260 358243 291708
15040 291708 488782 440639 268385 419069 -5824 -66496 142975 498054 316765 414033
15030 414033 897738 755478 796756 585908 222067 420713 705921 213933 133506 322353
$$ packed form
15106a056I3462A2994J93331e1572p0170A78562a29408H7712L2363J88215C003
15094c494C14185G3145L21801A54547o9350K29345J46602D4912K99950j68578
15084A76284J02629j08873C4553M2514c8836l45078A11391K1521J8898J68590
15074C20400p2426F4437Q8631h8786B94584Q7394O4125H9677e1677a7016B06955
15062F7049M90179d2426C52156J44695B13104J47547L0338A93059J81998d74E5544
15050F73382A27842M45087M3112k68292k9943J77320B40155m7895J65983o6535
15040B91708J97074m8143j72254J50684e824o0672A42975L55079j81289R7268
15030D14033M83705j42260M1278k10848B22067J98646K85208B13933q0427J88847
$$ plain form
15020 322353 555088 478113 769257 422087 538653 263633 -13275 460426 410833 387280
15010 387280 517810 500807 606853 287809 498141 417643 229965 257858 422001 194976
14999 670248 195048 359198 372876 581737 405517 536506 223032 385584 222714 327099
14989 327099 844359 235316 234744 443074 745606 549649 531062 418689 728505 807438
14979 807438 665573 498752 571707 318578 419415 322208 220496 895965 791447 538956
14969 538956 707158 686521 558694 150645 308722 344157 424020 659344 361138 145549
14958 307811 400125 499950 401455 102965 252168 297569 355726 169962 219532 953647 477274
14947 477274 603731 563314 609487 512580 384595 671739 428128 611781 193695 620238
$$ packed form
15020C22353K32735p6975K91144l47170J16566B63633a3275D60426m9593k3553
15010C87280J30530j7003J06046B87809K10332q0498j87678K7893J64143A94976
14999F70248A95048J64150J3678K08861j76220J30989B23032J62552j62870J04385
14989C27099N17260B35316n72K08330L02532j95957j8587j12373L09816P8933
14979H07438j41865j66821P2955k53129J00837r7207j01712O75469j04518k52491
14969E38956J68202k0637j27827A50645J58077L5435P9863K35324k98206A45549
14958C07811R2314R9825r8495A02965J49203M5401N8157A69962M9570P34115m76373
14947D77274J26457m0417M6173r6907j27985K87144k43611J83653A93695M26543
$$ plain form
14937 620238 329609 595737 559422 802958 747758 1006528 1214573 912961 1215569 1270072
14927 1270072 1291015 2011530 1553327 1374602 1349329 1288135 1806872 2083034 2147813 1928056
14917 1928056 1484010 1511201 1067447 908654 703441 597698 374799 731312 360605 507976
14907 507976 42886 534275 334225 498224 355364 397738 246629 225988 102721 396688
14897 396688 298918 559964 516284 365271 201592 270651 557232 549622 512148 521067 687342
14886 687342 763950 702913 747870 872455 489937 662535 568734 562052 567205 731618 377637
14875 377637 319740 739255 265752 227865 212787 644118 574250 758473 757091 577940 312351
14864 312351 316473 183541 551545 618037 291457 640895 202228 57367 158766 449485
$$ packed form
14937F20238k90629K66128l6315K43536n5200K58770K08045l01612L02608N4503
14927A270072K0943P20515m58203j78725k5273o1194N18737K76162O4779k19757
14917A928056m44046K7191m43754j58793k05213j05743k22899L56513C60605J47371
14907E07976D2886M91389k00050J63999j42860M2374j51109k0641A02721K93967
14897C96688r7770K61046m3680j51013j63679O9059K86581p610l7474Q919J66275
14886F87342P6608o1037M4957J24585l82518J72598r3801o682N153J64413l53981
14875C77637n7897M19515B65752l7887j5078M31331o9868J84223j382j79151k65589
14864C12351M122j32932L68004O6492B91457L49438B02228E7367J01399K90719
$$ plain form
14854 449485 469889 224889 345015 543628 509379 538551 514133 951870 909202 1005136 1014247
14843 1014247 1091007 1189227 1043294 917927 963576 652643 535886 249745 838458 750809
14833 750809 537852 159673 338486 481838 931337 392631 550863 300941 274510 567148
14823 567148 335829 269084 667243 631560 799982 463944 526739 458970 429270 712661
14813 712661 613369 652902 428792 471076 855100 842095 807010 942806 933113 819974 862707
14802 862707 812495 563889 471762 519284 810904 780712 555955 616147 589054 717929 874359
14791 874359 289212 244001 484216 431387 392899 663796 746918 416466 505911 400513
14781 400513 587351 611095 699969 774096 327871 1076251 892833 1075037 733229 865352
$$ packed form
14854D49485K0404B24889J20126J98613l4249K9172k4418M37737m2668R5934R111
14843A014247P6760R8220j45933j25367M5649l10933j16757B49745N88713q7649
14833G50809k12957A59673J78813J43352M49499C92631J58232k49922k6431K92638
14823E67148k31319o6745L98159l5683J68422l36038O2795o7769k9700K83391
14813G12661r9292L9533k24110M2284L84024j3005l5085J35796r693j13139M2733
14802H62707n0212k48606r2127M7522K91620l0192k24757O0192k7093J28875J56430
14791H74359B89212m5211K40215n2829l8488K70897Q3122l30452Q9445j05398
14781D00513J86838K3744Q8874P4127C27871P48380j83418J82204l41808J32123
$$ plain form
14771 865352 515718 642740 441531 538975 874768 640150 735170 608861 694609 638924
14761 638924 690039 472714 648689 477278 925954 731969 692308 622968 547966 637026
14751 637026 562891 743959 676200 759215 698454 224353 679997 893194 995002 636401
14741 636401 872760 714250 534649 678501 898434 913268 865169 1038434 1104860 785409
14731 785409 1090897 1063636 1288399 1225682 1453527 1616017 1469659 1561959 974554 992323
14721 992323 1166166 853912 871863 881227 662244 646022 496906 1264841 745953 867949
14711 867949 853747 547046 1080215 1085638 442172 1408812 1178237 1359784 1410529 1839855
14701 1839855 1378896 1548915 1205200 1190591 1005176 1134434 1048116 761682 971592 930473
$$ packed form
14771H65352l49634J27022k01209R7444L35793k34618R5020j26309Q5748n5685
14761F38924N1115k17325J75975j71411M48676j93985l9661o9340p5002Q9060
14751F37026p4135J81068o7759Q3015o0761B24353M55644K13197J01808l58601
14741F36401K36359j58510j79601J43852K19933J4834m8099J73265O6426l19451
14731G85409L05488k7261K24763o2717K27845J62490j46358R2300n87405J7769
14721I92323J73843l12254J7951R364k18983j6222j49116P67935n18888J21996
14711H67949j4202l06701N33169N423D42172R66640k30575J81547N0745M29326
14701A839855m60959J70019l43715j4609j85415J29258q6318k86434K09910m1119
$$ plain form
14691 930473 680004 855719 903119 709002 806264 1198101 996637 846062 804832 1013972
14681 1013972 961825 821682 612498 934860 979696 750994 915790 1019485 840139 922126
14671 922126 902644 806542 832656 925455 968322 627106 964635 1171741 930762 586339
14661 586339 886916 968287 806359 855533 1054701 1220811 1182818 1158875 1320178 1268491
14651 1268491 1180404 1028655 1285797 1128050 1127275 1188464 906312 908078 1161565 1149578 1181501
14640 1181501 1319605 1116654 1105939 1143968 1145619 966312 1009568 1047351 1199985 1000196
14630 1000196 1212494 1002814 1168901 1063354 918818 934532 1045881 1403517 1054871 1367935
14620 1367935 1166965 1179103 1256429 1299340 1322644 1305686 1300802 1559958 1286922 1434586 1449189
$$ packed form
14691I30473k50469J75715M7400j94117R7262L91837k01464j50575m1230K09140
14681A013972n2147j40143k09184L22362M4836k28702J64796J03695j79346Q1987
14671I22126j9482r6102K6114R2799M2867l41216L37529K07106k40979l44423
14661E86339L00577Q1371j61928M9174J99168J66110l7993k3943J61303n1687
14651A268491q8087j51749K57142j57747p75O1189k82152J766K53487j1987L1923
14640A181501J38104k02951j0715L8029J651j79307M3256L7783J52634j99789
14630A000196K12298k09680J66087j05547j44536J5714J11349L57636l48646L13064
14620A367935k00970J2138P7326M2911K3304j6958m884K59156k73036J47664J4603
$$ plain form
14609 1449189 1467039 1476443 1277748 1285383 1564931 1458076 1420687 1473599 1476627 906348 1573129
14598 1573129 1431462 1286182 1419471 1312221 1739223 1536851 1496100 1505410 1890055 1684235
14588 1684235 1546701 1953871 1549728 1522217 1761595 1491114 1741795 1705678 1376553 1868133
14578 1868133 1817250 1779949 2223331 2220392 1772554 1977384 2208313 2121603 2108422 1975971
14568 1975971 2367122 2322423 2170895 2159150 2263347 1983314 2351585 2296231 2787318 2423300
14558 2423300 2621901 2914340 2983069 3037558 3499488 3341821 4026003 4726855 5502261 7917833
14548 7917833 11617102 18358308 34017746 42125607 16660754 7492533 3806831 2692871
14540 2692871 2829362 3012940 5238158 3951077 2328307 1842511 1923771 1953234 2029839
$$ packed form
14609A449189J7850R404j98695P635K79548j06855l7389N2912L028n70279O66781
14598A573129j41667j45280J33289j07250M27002k02372m0751R310L84645k05820
14588A684235j37534M07170m04143k7511K39378k70481K50681l6117l29125M91580
14578A868133n0883l7301M43382k939m47838K04830K30929q6710j3181j32451
14568A975971L91151m4699j51528j1745J04197k80033L68271n5354M91087l64018
14558B423300J98601K92439O8729N4489M61930j57667O84182P00852P75406K415572
14548G917833L699269O741206J5659438Q107861A6660754G492533l685702j113960
14540B692871J36491J83578K225218j287081j622770m85796Q1260K9463P6605
$$ plain form
14531 2029839 2046205 1797838 2211954 1902886 1907631 2048957 2212015 2108332 2044343 2424973
14521 2424973 2412956 2073508 2397726 2420503 2244612 2080104 2640242 2590721 2415116 2496536
14511 2496536 1980348 2493368 2571142 2749316 2705851 2468063 2509592 2636329 2852349 2831786
14501 2831786 2908791 2927746 3075191 2947262 3128187 3094885 2795802 3074709 3264650 3118906
14491 3118906 3243278 2984649 2932818 3174826 2872118 3338099 3222809 3472357 3409063 3207587
14481 3207587 3479769 3498564 3932863 3617737 3776177 3610805 3474268 3773133 3921134 3984188
14471 3984188 3882776 4031465 4133536 4041494 4462806 4506784 3886007 4455111 4339497 4470090
14461 4470090 4494878 4584742 4616444 4744245 4449346 4718122 4582342 4892910 4539364 4627168
$$ packed form
14531B029839J6366k48367M14116l09068M745J41326J63058j03683o3989L80630
14521B424973j2017l39448L24218K2777j75891j64508N60138m9521j75605Q1420
14511B496536n16188N13020P7774J78174m3465k37788M1529J26737K16020k0563
14501B831786P7005J8955J47445j27929J80925l3302k99083K78907J89941j45744
14491C118906J24372k58629n1831K42008l02708M65981j15290K49548o3294k01476
14481C207587K72182J8795M34299l15126J58440j65372j36537K98865J48001O3054
14471C984188j01412J48689J02071r2042M21312M3978o20777N69104j15614J30593
14461D470090K4788Q9864L1702J27801k94899K68776j35780L10568l53546Q7804
$$ plain form
14451 4627168 5024447 5036752 5254239 5026732 5058354 5210583 5156652 5175332 5529512 5418422
14441 5418422 5403306 5506048 5644786 5829308 5750161 5609855 6030810 6109366 5921704 6102908
14431 6102908 6241428 6418639 6506942 6592984 6761031 6839975 7024052 7014734 7476882 7605264
14421 7605264 7608410 7480618 7710509 7667855 7572453 7767211 7957343 7908306 8272885 8555350
14411 8555350 8453935 8756520 8623692 8864207 8791609 9108939 8971037 9294549 9295917 9296568
14401 9296568 9577442 9316018 9706166 10247980 9862168 10553402 10542830 10947620 10695728 11170249
14391 11170249 11107456 11405890 11624143 11983839 12391723 12518060 12574970 13324370 13133739 13220462
14381 13220462 13462845 13546461 13741934 14228929 14600413 14324730 15257461 15564971 15594531 16081044
$$ packed form
14451D627168L97279J2305K17487k27507L1622J52229n3931J8680L54180j11090
14441E418422j5116J02742J38738J84522p9147j40306M20955P8556j87662J81204
14431F102908J38520J77211Q8303Q6042J68047P8944J84077r318M62148J28382
14421G605264L146j27792K29891m2654r5402J94758J90132m9037L64579K82465
14411H555350j01415L02585j32828K40515p2598L17330j37902L23512J368O51
14401I296568K80874k61424L90148N41814l85812O91234j0572M04790k51892M74521
14391A1170249o2793K98434K18253L59696M07884J26337N6910P49400j90631Q6723
14381A3220462K42383Q3616J95473M86995L71484k75683R32731L07510K9560M86513
$$ plain form
14371 16081044 16359743 16940469 17138572 17386372 17701751 17949330 18055115 18804974 19068575
14362 19068575 19355346 19718442 20219719 20959249 20886035 21531198 22220813 22653308 22889410
14353 22889410 23701597 24529021 24855927 25526178 25859724 26783564 27603148 28100621 28941742
14344 28941742 29459611 30317323 31188290 31946597 32934739 33939657 34640125 35795534 36947778
14335 36947778 37631025 38996537 40435879 41517772 42515099 44136972 45673269 47001307
14327 47001307 48939577 50730027 52512382 54120431 56340544 57863380 59984839 62236785
14319 62236785 64686026 66877518 69295030 71803476 74663573 77465983 80300528 83594346
14311 83594346 87273941 90538966 94279565 98208712 102821460 107173847 111936354 116938792
$$ packed form
14371A6081044K78699N80726J98103K47800L15379K47579J05785P49859K63601
14362A9068575K86771L63096N01277P39530p3214O45163O89615M32495K36102
14353B2889410Q12187Q27424L26906O70251L33546R23840Q19584M97473Q41121
14344B8941742N17869Q57712Q70967P58307R88142J004918P00468J155409J152244
14335C6947778O83247J365512J439342J081893R97327J621873J536297J328038
14327D7001307J938270J790450J782355J608049K220113J522836K121459K251946
14319F2236785K449241K191492K417512K508446K860097K802410K834545L293818
14311H3594346L679595L265025L740599L929147M612748M352387M762507N002438
$$ plain form
14303 116938792 122011251 127793702 134035975 140244201 146996397 154309055 161818564 169328160
14295 169328160 177699489 185952742 195641295 205325274 215671925 226210521 237694790
14288 237694790 249647746 261691702 274146759 287417208 300698003 314395076 328064308
14281 328064308 342189409 355830744 369801143 382892320 395446400 407474244 417851848
14274 417851848 426627647 431460368 432889430 434262316 436263934 438804671 435344271 430497962
14266 430497962 426355053 418589175 407190611 394282439 380083328 365054283 349619011
14259 349619011 334263099 318885554 303675789 288841534 274642672 260594258 247301122
14252 247301122 234597597 222553706 210996415 200479464 192058406 182070326 172983748
$$ packed form
14303A16938792N072459N782451O242273O208226O752196P312658P509509P509596
14295A69328160Q371329Q253253R688553R683979J0346651J0538596J1484269
14288B37694790J1952956J2043956J2455057J3270449J3280795J3697073J3669232
14281C28064308J4125101J3641335J3970399J3091177J2554080J2027844J0377604
14274D17851848Q775799M832721J429062J372886K001618K540737l460400m846309
14266D30497962m142909p765878j1398564j2908172j4199111j5029045j5435272
14259C49619011j5355912j5377545j5209765j4834255j4198862j4048414j3293136
14252B47301122j2703525j2043891j1557291j0516951q421058r988080r086578
$$ plain form
14245 172983748 164385602 156499166 149144228 141601356 134964988 128911271 123001936 117765954
14237 117765954 112433330 107323415 102751118 98289614 94287074 90247240 87011491 83675392
14229 83675392 80010893 76826929 73905992 71044491 68581055 65862581 63114197 61162539
14221 61162539 59249400 57249557 55456840 53363303 51547985 49812059 48463249 47081755
14213 47081755 45488983 44426893 42344218 41186748 40354404 39303685 38358585 37556043
14205 37556043 36429438 35035491 33977633 33084979 32103212 32138611 31120654 29934243 28902114
14196 28902114 28201580 27641483 26875284 26439938 25644552 25281298 24238059 23898642 23286108
14187 23286108 22641702 22003550 21951563 21213853 20543064 20033475 19962947 19327137 18639011 18283397
$$ packed form
14245A72983748q598146p886436p354938p542872o636368o053717n909335n235982
14237A17765954n332624n109915m572297m461504m002540m039834l235749l336099
14229H3675392l664499l183964k920937k861501k463436k718474k748384j951658
14221F1162539j913139j999843j792717k093537j815318j735926j348810j381494
14213D7081755j592772j062090k082675j157470q32344j050719r45100q02542
14205C7556043j126605j393947j057858q92654r81767L5399j017957j186411j032129
14196B8902114p00534n60097p66199m35346p95386l63254j043239l39417o12534
14187B3286108o44406o38152n1987p37710o70789n09589p0528o35810o88126l55614
$$ plain form
14177 18283397 17948265 17777751 17401998 17134279 16703265 16302076 16191706 15879957 15461136
14168 15461136 14899248 14667274 14714676 14417300 14159281 13867563 13787158 13277007 13246564 12728767
14158 12728767 12637047 12671666 12076856 12388650 11893669 11600620 11222586 10916308 10936373 10568609
14148 10568609 10748115 10678697 10316668 10306084 10029520 10038657 9874096 9406759 9624315 9402223
14138 9402223 9363615 9018936 8526926 8661978 8608932 8549612 8690044 8226014 8154760 8133670
14128 8133670 7781304 7939931 7645578 7555964 7503966 7532601 7530283 7494644 6864466 7003430
14118 7003430 6824050 6901862 6794485 6812488 6451952 6416690 6251445 6359152 6199179 5979882
14108 5979882 5653322 6028760 6017424 6028486 6121314 5833956 5539154 5423868 5450841 5748963
$$ packed form
14177A8283397l35132j70514l75753k67719m31014m01189j10370l11749m18821
14168A5461136n61888k31974M7402k97376k58019k91718q0405n10151l0443n17797
14158A2728767r1720L4619n94810L11794m94981k93049l78034l06278K0065l67764
14148A0568609J79506o9418l62029j0584k76564R137j64561m67337K17556k22092
14138I402223l8608l44679m92010J35052n3046n9320J40432m64030p1254k1090
14128H133670l52366J58627k94353q9614n1998K8635k318l5639o30178J38964
14118G003430j79380P7812j07377J8003l60536l5262j65245J07707j59973k19297
14108E979882l26560L75438j1336J1062R2828k87358k94802j15286K6973K98122
$$ plain form
14098 5748963 5478985 5403895 5212247 4897703 5037734 4871199 4951694 4850078 5130136 4891230
14088 4891230 4685144 4713727 4862871 4739241 4480151 4537603 4506935 4268795 4312922 4392879
14078 4392879 4211178 4386260 3944217 4240575 4068806 3589647 3997473 4144877 3722811
14069 3722811 4212359 3731178 4010890 3574057 3630743 3640252 3608668 3916551 3882833 3612305
14059 3612305 3685209 3798336 3483171 3456826 3348332 3286540 3433391 3271447 3090574 3269538
14049 3269538 3182918 3294975 2973984 3484676 3086112 3013907 3045496 2927552 3037748 3080991
14039 3080991 3006171 2776993 2831354 2614559 2997847 2987487 2842838 3291123 3325023 2850303
14029 2850303 2897108 2946701 2682556 2619268 2645692 2571927 2310159 2471356 2613164 2345530
$$ packed form
14098E748963k69978p5090j91648l14544J40031j66535Q0495j01616K80058k38906
14088D891230k06086K8583J49144j23630k59090N7452l0668k38140M4127P9957
14078D392879j81701J75082m42043K96358j71769m79159M07826J47404m22066
14069C722811M89548m81181K79712m36833N6686R509l1584L07883l3718k70528
14059C612305P2904J13127l15165k6345j08494o1792J46851j61944j80873J78964
14049C269538q6620J12057l20991N10692l98564p2205L1589j17944J10196M3243
14039C080991p4820k29178N4361k16795L83288j0360j44649M48285L3900m74720
14029B850303M6805M9593k64145o3288K6424p3765k61768J61197J41808k67634
$$ plain form
14019 2345530 2729812 2242836 2355983 2517488 2447415 2443092 2619261 2134915 2300559 2218232
14009 2218232 2229612 2357534 2117059 2201047 2316848 2031986 2150773 1934638 2016292 2183669
13999 2183669 2144523 2537220 2093846 2054136 1749520 2236649 2156068 2200746 2610882 2776045
13989 2776045 3864368 6617293 11654032 23684759 45485850 25918991 13306355 8303875
13981 8303875 5303141 4059413 3376662 3131228 3241876 2878830 2603442 2552596 2367422
13972 2367422 2541046 2218507 2375770 2319308 2400792 2142084 2098790 2060591 2146083 1954639
13962 1954639 1992482 1979761 2406914 2251473 1764614 2065890 1801086 1981085 2040174 1863609
13952 1863609 1611147 1705511 1937515 1516309 2129769 1559876 1703055 1818712 1772592 1508551
$$ packed form
14019B345530L84282m86976J13147J61505p0073m323J76169m84346J65644q2327
14009B218232J1380J27922k40475Q3988J15801k84862J18787k16135Q1654J67377
13999B183669l9146L92697m43374l9710l04616M87129q0581M4678M10136J65163
13989B776045J088323K752925N036739J2030727K1801091j9566859j2612636n002480
13981H303875l000734j243728o82751k45434J10648l63046k75388n0846j85174
13972B367422J73624l22539J57263n6462Q1484k58708m3294l8199Q5492j91444
13962A954639L7843j2721M27153j55441m86859L01276k64804J79999N9089j76565
13952A863609k52462R4364K32004m21206O13460n69893J43179J15657m6120k64041
$$ plain form
13942 1508551 1734511 1812742 1749979 1498589 1448010 1701019 1591914 1657340 1695939 1307112
13932 1307112 1864557 1464983 1754438 1355308 1614741 1295100 1331296 1483271 1302734 1475213
13922 1475213 1721510 1450771 1340772 1479454 1027805 1455063 1276485 1319954 1460406 1457113
13912 1457113 1245704 1370277 1221667 1325750 1377724 1529014 1062969 1175284 1149421 1156398
13902 1156398 1276548 1474962 1293485 1165303 1274281 1063690 1298477 1174019 1452903
13893 1452903 1213913 1132026 1307824 1438713 1221308 944913 1510528 1102824 1067584 1070466
13883 1070466 1069007 963403 1130272 1006252 1076093 1106187 909176 1303886 1024554 996203
13873 996203 919660 1342076 1082364 1014345 791295 1548625 928838 1314213 925487 944641
$$ packed form
13942A508551K25960P8231o2763k51390n0579K53009j09105O5426L8599l88827
13932A307112N57445l99574K89455l99130K59433l19641L6196J51975j80537J72479
13922A475213K46297k70739j09999J38682m51649M27258j78578M3469J40452l293
13912A457113k11409J24573j48610J04083N1974J51290m66045J12315k5863O977
13902A156398J20150J98414j81477j28182J08978k10591K34787j24458K78884
13893A452903k38990q1887J75798J30889k17405k76395N65615m07704l5240K882
13883A070466j459j05604J66869j24020O9841L0094j97011L94710k79332k8351
13873I96203p6543M22416k59712o8019k23050P57330o19787L85375l88726J9154
$$ plain form
13863 944641 1050773 926163 750614 1251245 847844 887653 872122 706827 1101101 861442
13853 861442 887238 999633 976557 894977 536541 726318 1220243 831333 553683 681800
13843 681800 771882 866447 822269 888190 1071937 1056135 1027388 611453 917330 872630 627134
13832 627134 916328 638230 930772 809181 668916 906007 764980 651838 580918 761244
13822 761244 551694 1072516 604776 781170 1114653 918326 566416 890949 734285 714595
13812 714595 775089 1034128 588284 533575 755851 863219 809276 824046 910903 887386 627962
13801 627962 1056042 938682 941393 650054 541017 421794 854249 492059 990195 560995
13791 560995 620460 655839 711478 693160 812499 636597 718739 928206 810324 452088
$$ packed form
13863I44641J06132j24610j75549N00631m03401L9809j5531j65295L94274k39659
13853H61442K5796J12395k3076q1580l58436J89777M93925l88910k77650J28117
13843F81800R0082R4565m4178O5921J83747j5802k8747m15935L05877m4700k45496
13832F27134K89194k78098K92542j21591j40265K37091j41027j13142p0920J80326
13822G61244k09550N20822m67740J76394L33483j96327l51910L24533j56664j9690
13812G14595O0494K59039m45844n4709K22276J07368n3943J4770Q6857k3517k59424
13801F27962M28080j17360K711k91339j09037j19223M32455l62190M98136m29200
13791E60995N9465L5379N5639j8318J19339j75902Q2142K09467j17882l58236
$$ plain form
13781 452088 606111 596983 490926 861228 548912 565240 524034 439150 643823 764929
13771 764929 895473 497186 532873 806378 594586 936853 903912 851963 373975 743552
13761 743552 833841 673664 512582 535175 491263 642006 698869 473672 514957 264586
13751 264586 401894 346849 791069 642876 586902 654586 525155 562658 589794 536410 532224
13740 532224 549560 712383 405779 540942 531378 496168 628729 851038 487812 788270
13730 788270 674509 592662 507971 560660 794471 664589 157789 340891 854458 488392
13720 488392 512243 210464 494063 640365 518886 323211 636199 416613 454461 234262
13710 234262 479230 540418 392052 357163 241677 578031 599155 377117 439464 479219
$$ packed form
13781D52088J54023r128j06057L70302l12316J6328m1206q4884K04673J21106
13771G64929J30544l98287L5687K73505k11792L42267l2941n1949C73975L69577
13761G43552R0289j60177j61082K2593m3912J50743N6863k25197M1285k50371
13751B64586J37308n5045M44220j48193n5974O7684j29431L7503K7136n3384m186
13740E32224J7336J62823l06604J35163r564l5210J32561K22309l63226L00458
13730G88270j13761q1847q4691N2689K33811j29882A57789J83102N13567l66066
13720D88392K3851B10464K83599J46302j21479j95675L12988k19586L7848k20199
13710B34262K44968O1188j48366l4889j15486L36354K1124k22038O2347L9755
$$ plain form
13700 479219 571882 551425 447424 389856 367032 617156 366769 640303 862215 477870
13690 477870 783864 466812 598706 558921 453868 528578 356164 147334 374398 565710
13680 565710 376330 254550 665498 94555 265806 346531 322064 192236 582860 329517
13670 329517 288655 540801 502844 443999 514229 113542 464266 269801 575407 478977
13660 478977 742035 250989 575162 137597 586902 368118 542178 751550 391483 611565
13650 611565 371838 470566 244882 384752 65072 199496 190951 493195 195339 403060
13640 403060 194885 404734 516852 248318 350484 405802 322177 345180 104756 326089
13630 326089 120757 544567 402851 183121 299045 542062 396090 488760 260118 567398
$$ packed form
13700D79219R2663k0457j04001n7568k2824K50124k50387K73534K21912l84345
13690D77870L05994l17052J31894l9785j05053P4710j72414A47334K27064J91312
13680E65710j89380j21780M10948I4555J71251Q0725k4467j29828L90624k53343
13670C29517m0862K52146l7957n8845P0230A13542L50724j94465L05606r6430
13660D78977K63058B50989L24173A37597M49305k18784J74060K09372l60067K20082
13650F11565k39727R8728k25684J39870F5072J34424q545L02244A95339K07721
13640D03060A94885K09849J12118B48318J02166N5318q3625K3003A04756K21333
13630C26089A20757M23810j41716A83121J15924K43017j45972R2670k28642L07280
$$ plain form
13620 567398 214254 138098 426138 13922 525811 407480 323010 395321 329690 305345 120112
13608 422242 202862 363603 240113 647274 273517 314959 241838 184197 183809 189009 300876
13597 300876 -12083 389026 256906 384168 248802 454939 393483 458725 364559 304521
13587 304521 401715 323416 318874 328428 248478 340643 389250 348309 658458 170688 283266
13576 283266 265486 279223 466483 486547 42987 233400 299434 490273 -62956 244745 354583
13565 354583 376718 80934 67544 353063 145694 392014 539351 270071 -73827 330289
13554 312825 111209 325730 363779 301682 247211 250912 342984 401315 465014 103068 419446
13543 419446 491121 401667 150142 176077 214146 249362 242011 -171267 320889 288575 366677
$$ packed form
13620E67398B14254p6156K88040A3922N11889j18331q4470P2311o5631k4345A20112
13608D22242B02862J60741j23490M07161B73517M1442p3121n7641l88N200J11867
13597C00876a2083C89026j32120J27262j35366K06137o1456O5242r4166o0038
13587C04521R7194p8299m542R554p9950R2165M8607m0941L10149A70688J12578
13576B83266j7780J3737J87260K0064D2987J90413O6034J90839f2956B44745J09838
13565C54583K2135H0934j3390K85519A45694K46320J47337k69280g3827C30289
13554C12825A11209K14521L8049o2097n4471L701R2072N8331O3699A03068L16378
13543D19446P1675q9454A50142K5935L8069L5216p351a71267C20889l2314P8102
$$ plain form
13532 366677 96503 176609 258229 234900 73140 77237 294410 307058 318432 203994 337501
13521 337501 316381 213761 67149 388295 7504 201598 265985 347629 432627 177866 682699
13510 682699 26846 343699 416156 16319 110843 -48941 469213 -24940 118579 323880 85171
13498 244662 381135 194855 -53295 271347 87935 523999 248052 203516 267490 342741
13488 342741 -83430 397183 118308 108755 231273 95703 479918 118157 119849 132043 207841
13477 207841 247114 -5573 88982 373609 193828 262917 115187 447753 -161589 423265
13466 268611 400333 179598 233870 178096 380876 383130 109357 339465 210855 791108
13456 791108 202836 120328 262996 6898 184095 124768 254549 236611 342195 -2501 104977
$$ packed form
13532C66677I6503Q0106Q1620k3329G3140M097K17173J2648J1374j14438J33507
13521C37501k1120j02620F7149L21146G504J94094O4387Q1644Q4998A77866N04833
13510F82699B6846L16853P2457A6319R4524d8941D69213b4940A18579K05301H5171
13498B44662J36473j86280e3295B71347H7935M36064B48052m4536O3974P5251
13488C42741h3430C97183A18308r553J22518I5703L84215A18157J692J2194P5798
13477B07841L9273e573H8982K84627j79781O9089A15187L32566a61589D23265
13466B68611J31722A79598N4272n5774K02780K254A09357K30108j28610N80253
13456G91108B02836q2508J42668F898J77197n9327J29781j7938J05584b501A04977
$$ plain form
13444 179560 335305 267605 75199 303606 219285 456655 175023 320569 -11478 -60366
13434 -60366 281841 227849 318746 397590 419519 -177689 123037 -106857 80401 367198 559561
13423 559561 20927 -214865 32333 -30880 109073 307602 446081 336158 276091 -25091
13412 403306 -106715 191714 228566 236102 314579 498797 418256 111901 70044 321090 218393
13401 218393 213332 118415 137358 -42160 341937 239655 110695 -103927 6527 413249 208842
13390 208842 225972 317468 158935 15380 112466 400140 144179 135885 386580 138431 69499
13379 69499 105515 276516 -29581 374406 350941 424223 50321 27565 354159 66214 202309
13368 202309 -42554 286591 -59244 272030 503398 211585 262238 315976 181249 294342
$$ packed form
13444A79560J55745o7700G5199K28407q4321K37370A75023J45546a1478m8888
13434f0366B81841n3992R0897P8844K1929a77689A23037a06857H0401K86797J92363
13423E59561B0927b14865C2333c0880A09073J98529J38479j09923o0067b5091
13412D03306a06715A91714L6852P536P8477J84218q0541A11901m1857K51046j02697
13401B18393n061r4917J8943d2160C41937j02282A10695a03927F527M06722k04407
13390B08842J7130R1496j58533A5380R7086K87674A44179q294K50695A38431o8932
13379F9499L6016J71001b9581C74406k3465P3282E0321k2756L26594F6214J36095
13368B02309d2554B86591e9244B72030K31368B11585N0653N3738j34727J13093
$$ plain form
13358 294342 366054 285409 6286 103997 374275 347912 -33180 28943 487529 248220 -4258
13346 -85322 195867 109665 124204 251699 198624 389386 155685 558565 183553 301999
13336 301999 289572 384236 236428 65345 219228 35367 464339 541004 209458 352300
13326 352300 385198 320776 174812 472385 184226 126631 436534 -158112 90229 48990
13316 48990 183153 241210 -162650 266237 -81839 448986 404787 165060 10525 -21191 194045
13304 507486 277850 139379 -227554 306077 -52119 4220 -214124 21554 129479 127890 81330
13293 81330 528567 87007 218031 155394 -26983 60947 523221 -104655 -115653 15793 282458
13282 282458 2723 -52827 30347 50987 -213955 -169539 327414 165096 217173 -7361 193121
$$ packed form
13358B94342P1712q0645F286R7711K70278k6363c3180B8943M58586k39309d258
13346h5322A95867q6202J4539J27495n3075J90762A55685M02880A83553J18446
13336C01999j2427R4664j47808F5345J53883C5367M28972P6665B09458J42842
13326C52300L2898o4422j45964K97573A84226n7595L09903a58112I0229m1239
13316D8990J34163N8057a62650B66237h1839D48986m4199A65060A0525b1191A94045
13304E07486k29636j38471b27554C06077e2119D220b14124B1554J07925j589m6560
13293H1330M47237H7007J31024o2637b6983F0947M62274a04655j0998A5793K66665
13282B82458B723e2827C0347K0640b13955M4416C27414j62318N2077g361A93121
$$ plain form
13270 301279 136647 82572 135580 144054 183036 334181 -63783 81294 422080 7048 -65277
13258 39131 -93866 237024 172956 -12286 -200099 64270 -115597 -146870 257351 314124 16274
13246 -113403 260178 100565 220314 -6043 -40056 -11800 -75914 132242 -137968 -112494 -159489
13235 -159489 125444 299639 8544 275370 -165476 222351 60568 325745 102445 447800
13225 447800 -101773 -61244 356288 253469 -94121 122564 182899 94337 183519 231209 -90481
13213 -63392 -273123 190926 219929 148184 52694 181477 -57548 24626 121942 162074 -70394
13201 68502 273789 55686 285327 150653 18469 -17488 229678 439135 172989 211871
13191 211871 -133703 -29315 -157303 212601 186258 437111 39081 184368 -203216 178092
$$ packed form
13270C01279A36647n4075N3008Q474L8982J51145f3783H1294L40786G048f5277
13258C9131i3866B37024o4068a2286j87813F4270a15597l1273B57351N6773A6274
13246a13403B60178A00565J19749f043l4013a1800o4114A32242a37968K5474m6995
13235a59489A25444J74195H544K66826a65476B22351F0568K65177A02445L45355
13225D47800a01773M0529C56288j02819i4121A22564O0335q8562Q9182M7690i0481
13213f3392k09731A90926K9003p1745E2694J28783e7548B4626R7316M0132g0394
13201F8502K05287E5686K29641j34674A8469a7488B29678K09457A72989L8882
13191B11871a33703b9315j27988B12601k6343K50853C9081J45287b03216A78092
$$ plain form
13180 204239 -133238 72102 26801 72324 199339 174377 81564 -72493 -52914 372608 -226821
13168 79692 -132977 54406 255835 -163233 124524 105423 -193487 166978 176168 200281 158410
13157 158410 30651 -275520 -137938 53283 83761 67914 269815 -72487 -331444 323293
13146 59135 132145 195142 -32449 100319 -116613 98672 18677 338239 237379 402097 148190
13134 -33424 158741 106678 -11503 -23712 -443537 -119927 -122685 368036 10324 129534 -216002
13122 292574 283808 -336789 429567 -107921 -79956 -86635 29174 143140 1529 121063 191050
13111 191050 80223 202703 222996 -143189 -229763 243394 151916 414493 462003 263931
13101 263931 363313 -157393 39234 -45267 59393 -163127 81004 -98898 121984 71262 74352
$$ packed form
13180B04239a33238G2102B6801M5523J27015k4962H1564g2493J9579C72608b26821
13168G9692a32977E4406K01429a63233A24524j9101a93487A66978R190K4113m1871
13157A58410C0651b75520J37582E3283L0478j5847K01901g2487k58957C23293
13146E9135P3010O2997c2449A00319a16613I8672A8677L19562j00860J64718A48190
13134c3424A58741n2063a1503j2209m19825a19927k758C68036A0324J19210b16002
13122B92574q766c36789D29567a07921K7965o679B9174J13966A529J19534O9987
13111A91050H0223J22480K0293a43189q6574B43394r1478K62577M7510j98072
13101B63931R9382a57393C9234d5267E9393a63127H1004i8898A21984n0722L090
$$ plain form
13090 74352 22961 232055 -58842 -203420 108138 187985 -288550 47265 -116028 3937 246750
13079 246750 7645 429361 -137336 387174 98054 156864 12030 302659 100015 -334384
13068 47317 221287 -31188 170922 -124785 -360246 170855 -121917 -75269 -158405 203101
13057 -154146 -52825 248340 1402 176959 274486 61905 215607 140057 249420 25693 186751
13046 186751 425701 175397 64895 -24076 -182044 31125 109567 315118 -78719 35078 120450
13035 120450 333470 -12957 92829 241038 -153947 223540 136419 -42746 -29066 233958
13024 418882 -21483 -219140 321617 -21946 19896 83195 95774 -65273 91844 88215 191661
13013 191661 9196 -246367 -43203 246103 408805 -169843 -100618 -294591 89188 187755 -189372
$$ packed form
13090G4352B2961K09094e8842j44578A08138P9847b88550D7265a16028C937K42813
13079B46750G645M21716a37336C87174I8054N8810A2030K90629A00015c34384
13068D7317J73970c1188A70922a24785k35461A70855a21917M6648q3136B03101
13057a54146e2825B48340A402J75557R7527F1905J53702p5550J09363B5693J61058
13046A86751K38950A75397F4895b4076j57968C1125P8442K05551g8719C5078Q5372
13035A20450K13020a2957I2829J48209a53947B23540q7121d2746J3680B33958
13024D18882b1483j97657C21617b1946A9896O3299J2579f5273I1844l629J03446
13013A91661I196b46367d3203B46103J62702a69843O9225j93973H9188R8567a89372
$$ plain form
13001 -2822 -14186 27561 98994 54626 40639 125345 -120979 -22623 8740 101857 -148285 -48949
12988 279568 251697 224642 398546 185390 -63270 -224960 -3892 -219333 -31132 -207829 171887
12976 105992 54005 -169334 2563 -365467 -57437 51019 291789 -38763 -52281 106662 18063
12964 -102464 15817 208444 31221 -166076 195803 -59918 28224 -118040 266525 78774
12953 198689 -115793 200869 83959 -89900 -6217 -32530 98173 369377 -55325 -49186 287819
12941 4428 42023 -134974 -281034 -78922 -170112 -177706 220135 -207342 -118967 -93913 226421
12929 -36579 -271140 -41990 256737 -425240 458755 -82033 63728 193533 59897 75931 211069
12918 211069 172825 18628 335058 246169 179421 50852 -8252 -204568 -106793 72095 -74266
$$ packed form
13001b822j1364B7561P1433m4368j3987Q4706a20979b2623H740R3117a48285d8949
12988B79568k7871k7055J73904A85390f3270j61690c892k15441c1132j76697A71887
12976A05992n1987a69334B563c65467e7437E1019K40770c8763j3518A06662A8063
12964a02464A5817J92627C1221a66076A95803e9918B8224a18040B66525G8774
12953A98689a15793B00869H3959h9900f217k6313I8173K71204e5325O139B87819
12941D428L7595a34974j46060g8922r1190p594B20135b07342Q8375K5054B26421
12929c6579k34561d1990B56737d25240D58755h2033F3728J29805E9897J6034J35138
12918B11069l8244A8628L16430q8889o6748E0852h252j96316R7775G2095g4266
$$ plain form
12906 147611 -231610 136914 -28757 33536 212842 -152506 44119 -31344 -88125 -264806
12896 -264806 -150569 74220 -88290 401046 115605 27888 38733 -357949 61046 -64837 -14661
12884 241012 66442 122994 60792 151897 111901 212258 -41951 -189773 202539 115544 -5905
12872 233005 138284 19390 -116226 91882 -235531 130371 -33011 62979 -212775 -360136
12862 -360136 411422 -436546 181680 -57058 65906 113647 69628 -194613 70825 152025 -94763
12850 13284 20481 -258679 -189643 214397 289231 73813 -203530 144844 26495 -110186 165818
12838 -145437 128496 109953 -164493 -77718 -312606 92746 342090 -63150 91080 6687 104488
12827 104488 174181 257012 -219815 148985 69837 -396522 -69972 200961 77932 -148064
$$ packed form
12906A47611b31610A36914b8757C3536J79306a52506D4119c1344n6781j76681
12896b64806J14237G4220h8290D01046A15605B7888J0845c57949F1046f4837a4661
12884B41012F6442N6552F0792R1105l9996J00357d1951j47822B02539q6995e905
12872B33005r4721A9390a16226I1882b35531A30371c3011F2979b12775j47361
12862c60136D11422d36546A81680e7058F5906M7741m4019a94613G0825Q1200i4763
12850A3284P197b58679O9036B14397P4834G3813b03530A44844B6495a10186A65818
12838a45437A28496j8543a64493g7718k34888I2746K49344f3150I1080F687R7801
12827A04488O9693Q2831b19815A48985F9837c96522f9972B00961G7932a48064
$$ plain form
12816 -150416 302392 216066 118015 -105859 -266817 80056 254101 50260 -84407 -44564 -104580
12805 -104580 -160021 17373 -127587 -112639 -227726 142754 311414 250251 -18622 364766
12794 27144 -14900 334955 409993 -106773 128088 135864 -286671 -103388 -236892 40795 94539
12783 94539 -103094 -68071 -314740 338790 23104 193941 -187724 -214005 158261 -219414
12772 64186 14431 69641 -164517 186053 408066 -112854 36517 -130663 -70054 -167850 -72497
12760 -334845 -150977 34009 -50803 128370 -205403 -188413 -55096 -237189 184441 57778
12749 -160086 -446243 -34797 -369346 44405 -37426 263854 154023 131973 -396647 92898
12738 276842 -27084 283800 -117162 136963 98131 93876 -242826 -70245 -369034 -329253 -364192
$$ packed form
12816a50416C02392q6326r8051a05859j60958H0056J74045E0260h4407L9843o0016
12805a04580n5441A7373a27587J4948j15087A42754J68660o1163a8622C64766
12794B7144a4900C34955P5038a06773A28088P776b86671a03388j33504D0795N3744
12783I4539a03094L5023k46669C38790B3104J70837a87724k6281A58261b19414
12772F4186A4431N5210a64517A86053K22013a12854C6517a30663O0609r7796g2497
12760c34845a50977C4009e0803A28370b05403J6990e5096j82093A84441E7778
12749a60086k86157c4797l34549D4405c7426B63854j09831k2050c96647I2898
12738B76842b7084B83800a17162A36963l8832m255b42826g0245k98789L9781l4939
$$ plain form
12727 -364192 -31030 -56607 304512 9705 199344 -47766 285359 -119725 -145336 402637 -116024
12715 45793 173987 128940 -165115 -90367 -192265 89639 -26919 223366 -33308 17755 -151869
12703 -140032 -15589 210412 173244 58907 84825 -153946 148901 97327 136974 -78621 61590
12691 -165899 -50358 113397 -179512 185079 312150 139451 199892 -88220 81015 -16221
12680 184970 -259053 135816 113372 97879 -4881 -116824 -167774 -115557 -29514 38379 -40344
12668 -77766 268166 76983 -8277 -188909 184939 106664 52338 39091 -128669 72938 3002
12656 54965 163179 -7195 -136618 377990 -240661 -456063 258933 408817 202630 -275304
12645 -335710 139644 -136188 -172854 -96857 131798 90036 -42342 124958 97042 -46550 -202450
$$ packed form
12727c64192c1030k5577C04512I705J89639d7766B85359a19725k5611D02637a16024
12715D5793J28194m5047a65115P4748j01898H9639b6919B23366c3308A7755a51869
12703a40032a5589B10412l7168E8907K5918a53946A48901n1574L9647g8621F1590
12691a65899e0358A13397a79512A85079J27071A39451O0441h8220H1015a6221
12680A84970b59053A35816k2444j5493d881j11943n0950N2217b9514C8379d0344
12668g7766B68166G6983h277j80632A84939p8275E2338j3247a28669G2938C002
12656E4965J08214g195j29423C77990b40661k15402B58933J49884B02630b75304
12645c35710A39644a36188l6666P5997A31798m1762d2342A24958k7916d6550j55900
$$ plain form
12634 -202450 157205 291510 257085 189877 73255 -119863 163321 10332 50943 -178847
12623 -12968 93123 -31644 -3573 216634 108296 254536 -133045 23857 -47002 65866 27556
12611 2021 -55906 -14282 125390 71481 -194470 243488 -83572 -85450 70292 -10669 271501
12599 319478 206335 81762 96335 111085 52797 -50810 31820 -21368 212449 69095 -1669
12587 52521 62149 40551 60634 -21586 345903 -85239 -8015 -144709 -922 187662 -39302 269099
12574 57837 -55848 131617 -25417 -93546 -146877 81808 -368150 30833 240078 44328 -473509
12562 351089 -331220 -239486 40579 -251265 -198683 -148710 -121061 -68458 -120892 155226 13805
12550 -52797 452639 -79541 -191891 -77385 -320071 -47996 -135768 -147020 122 -271811 272818
$$ packed form
12634b02450A57205J34305l4425o7208G3255a19863A63321A0332M0611a78847
12623a2968I3123c1644c573B16634A08296J46240a33045B3857d7002F5866B7556
12611B021e5906a4282A25390n3909a94470B43488h3572j878G0292a0669B71501
12599C19478j13143H1762J4573J4750E2797e0810C1820b1368B12449F9095a669
12587E2521R628k1598K0083b1586C45903h5239h015j36694i22A87662c9302B69099
12574E7837e5848A31617b5417o8129n3331H1808c68150C0833K09245D4328d73509
12562C51089c31220R1734D0579b51265N2582M9973K7649N2603n2434A55226A3805
12550e2797D52639g9541j12350g7385k42686d7996q7772j1252A22b71811B72818
$$ plain form
12538 -107649 19443 -167594 -156046 -321027 138986 64368 -357097 281646 -36678 260 -262832
12526 149696 22395 157588 -30533 143361 24849 113213 -141209 -60187 129852 -14205 306258
12514 286431 -194934 -7118 342948 38675 138745 469559 13786 65474 -95828 -46131 15797
12502 142908 -115669 26284 91762 37431 -16654 -13642 283541 154683 151689 250288 -171368
12490 -279641 -40982 49825 -206757 119210 -180079 -7647 -316523 131559 -153463 -167362
12480 -167362 7676 136022 -147651 44809 150820 -292276 64566 122930 -131908 240826
12469 -163433 -378761 299502 -156874 311212 35490 -295906 91397 308262 28528 261700
12459 261700 204869 366853 -196475 54755 -240156 5039 -92453 120015 -231752 -212900 29710
$$ packed form
12538a07649A9443a67594J1548j64981A38986F4368c57097B81646c6678B60b62832
12526A49696B2395J35193c0533A43361B4849Q8364a41209f0187A29852a4205C06258
12514B86431a94934g118C42948C8675J00070L30814A3786N1688i5828d6131A5797
12502A42908a15669B6284O5478C7431a6654L012B83541j28858k994R8599a71368
12490b79641d0982D9825b06757A19210a80079g647l08876A31559a53463j3899
12480a67362G676J28346a47651D4809J06011b92276F4566N8364a31908B40826
12469a63433k15328B99502a56874C11212C5490b95906I1397K16865B8528K33172
12459B61700n6831J61984a96475E4755b40156E039i2453A20015b31752J8852B9710
$$ plain form
12447 25598 -255139 171897 -81898 220798 -176996 127238 -104361 -132589 -149763 -393300
12437 -393300 -320838 56892 -37091 -75485 -227345 231018 -144827 116048 -154863 -125247
12427 -125247 -261304 -35982 115316 -92248 86483 -66846 -159901 -204218 -138715 5811 -85000
12415 -156664 116568 -333314 60079 66769 -1667 156230 263476 7481 -34557 83420 1978
12403 -136529 294926 -140467 288483 176342 106743 11087 119257 -149068 -7317 -75837
12393 -75837 -156303 140088 -89836 -64903 508102 118879 194652 183594 -41427 298667 13652
12381 118633 -22080 -66640 32346 44305 212321 68287 9500 -38750 288392 50486 46182
12370 46182 -49256 93220 49808 2936 -247854 -40732 302215 123467 -49060 56123 334954
$$ packed form
12447B5598b55139A71897h1898B20798a76996A27238a04361k8228j7174k43537
12437c93300P2462E6892c7091l8394j51860B31018a44827A16048a54863K9616
12427a25247j36057c5982A15316i2248H6483f6846r3055m4317O5503E811h5000
12415a56664A16568c33314F0079O690a667A56230J07246G481c4557H3420A978
12403a36529B94926a40467B88483j12141o9599A1087J08170a49068g317o8520
12393g5837q0466A40088h9836K4933E08102A18879P5773j1058d1427B98667A3652
12381A18633b2080m4560C2346J1959J68016F8287I500c8750B88392E0486m304
12370D6182d9256I3220m3412B936b47854d0732C02215A23467d9060E6123K78831
$$ plain form
12359 334954 51797 -219050 5080 -253100 -34256 135528 205251 -348304 -60046 -110 -63127
12348 -63127 -19944 -170825 -145305 86260 125300 264306 93351 25767 55950 -132703 -130838
12337 -130838 67258 -67915 -40189 396311 -13542 273042 91179 129765 256073 -15482 -251665
12326 -251665 339270 161829 129424 336651 258859 243491 178247 -83097 141716 273238
12316 273238 -203405 188572 84572 193920 172789 222346 174953 117512 -39877 109555 -107690
12304 206769 50817 -19723 -33726 -161171 112462 429331 102871 -116119 351986 86721
12293 -92193 317522 69780 200658 194590 172095 -39026 -25488 146744 -78900 -109938 -224731
12282 -224731 256783 111145 23101 400282 299824 -29479 5621 -148752 33512 467377
$$ packed form
12359C34954E1797b19050E080b53100c4256A35528O9723c48304f0046a10o3017
12348f3127a9944j50881K5520H6260L9040J39006I3351B5767L0183a32703J865
12337a30838F7258f7915K7726C96311a3542B73042I1179L8586J26308a5482k36183
12326b51665C39270A61829l2405K07227p7792j5368o5244h3097A41716J31522
12316B73238b03405A88572H4572J09348k1131M9557m7393n7441c9877A09555a07690
12304B06769E0817a9723j4003j27445A12462L16869A02871a16119C51986H6721
12293i2193C17522F9780J30878o068k2495c9026J3538A46744g8900l1038j14793
12282b24731B56783A11145B3101L77181j00458b9479E621a48752C3512M33865
$$ plain form
12272 467377 105438 40759 75923 28010 182024 158714 101847 111656 13136 45962 67499
12261 67499 -68589 401308 315488 7724 -43388 35395 -77214 85159 -247108 -45752 275829
12249 -301035 -74238 -211861 159869 118023 -23052 50646 182353 145324 183621 -92178 -79814
12238 -79814 -16000 68204 86303 340640 249413 63428 241740 -21680 110712 121647 275019
12227 275019 119303 -33463 171123 63278 -122120 -238853 387854 12863 296432 311205
12217 311205 -76756 411007 103140 53954 371186 352529 7251 -3102 60215 241792 148472
12206 148472 364362 61308 -109516 214511 10607 334634 257182 518603 211504 134436
12196 134436 284468 96956 54258 94413 18749 -169280 333985 195164 10647 272511
$$ packed form
12272D67377A05438D0759L5164B8010J54014k3310n6867R809A3136L2826K1537
12261F7499f8589D01308q5820G724d3388C5395g7214H5159b47108d5752B75829
12249c01035g4238j37623A59869m1846b3052E0646J31707l7029L8297i2178J2364
12238g9814a6000F8204J8099K54337r1227F3428J78312b1680A10712J0935J53372
12227B75019A19303c3463A71123F3278a22120j16733C87854A2863K83569J4773
12217C11205g6756D11007A03140m9186L17232j8657G251c102F0215J81577r3320
12206A48472K15890F1308a09516B14511A0607L24027p7452K61421B11504p7068
12196A34436J50032I6956m2698M0155A8749a69280C33985j38821A0647K61864
$$ plain form
12186 272511 86660 108560 447737 141761 155426 95459 47903 181699 134174 103889 254384
12175 254384 15035 64498 85639 197381 505889 267049 -36950 356882 105966 74448
12165 74448 -53029 182983 98778 74504 3509 -215926 200341 100044 90580 -103404 60008
12153 440000 256833 -19586 94939 -80421 -135072 63331 323093 -63074 -65032 -46354 -115819
12142 -115819 -172980 270239 324293 253688 65900 -49793 311056 132710 39870 21641 349358
12131 349358 448896 287431 20816 97536 493403 298974 114341 176446 371852 -209350
12120 275954 268576 265316 289338 150518 -54054 114714 2388 -87225 343805 31177 120964
12109 120964 418453 318514 37486 -179612 215293 -78270 -17957 160203 291395 42792
$$ packed form
12186B72511H6660K1900L39177A41761J3665n9967m7556J33796m7525l0285J50495
12175B54384A5035M9463K1141J11742L08508k38840c6950C56882A05966l1518
12165G4448e3029A82983q4205k4274C509b15926B00341A00044r464a03404F0008
12153D40000j83167a9586I4939h0421n4651F3331K59762f3074j958J8678o9465
12142a15819n7161B70239N4054p0605F5900d9793C11056A32710C9870j8229L27717
12131C49358R9538j61465B0816P6720L95867j94429A14341O2105J95406b09350
12120B75954p378l260K4022j38820e4054A14714B388h7225C43805C1177Q9787
12109A20964K97489r9939C7486a79612B15293g8270a7957A60203J31192D2792
$$ plain form
12098 195467 -72691 240207 -18325 112158 -31461 57733 6737 79359 -104967 -92568 31336
12086 -19285 -93363 336404 -50182 178080 259792 156553 -62889 324213 -262306 28773 -4805
12074 271131 117820 66430 150187 154093 125849 -521054 176479 38293 -9574 152228 345314
12063 345314 -153335 38553 108628 -107227 17989 72786 -10292 -180561 7607 122307 -35554
12051 256886 192701 -100097 45519 328729 -138117 169388 -93903 -8700 -65611 -274891 122309
12039 -14608 29910 -59031 23788 484844 -79114 166505 -260659 -79199 153352 4029 -23105
12027 295991 48002 376935 -497057 -86850 -4138 -278492 103101 65647 -377823 -134427
12016 156542 -37758 52418 -74754 114277 -154935 -89450 -26880 87834 -136766 18762 56424
$$ packed form
12098A95467g2691B40207a8325A12158c1461E7733F737P2622a04967J2399C1336
12086a9285p4078C36404e0182A78080Q1712j03239f2889C24213b62306B8773d805
12074B71131A17820n1390Q3757L906k8244e21054A76479C8293i574A52228J93086
12063C45314a53335C8553P0075a07227A7989N4797a0292j70269G607J14700c5554
12051B56886o4185a00097D5519K83210a38117A69388i3903h700n6911k09280A22309
12039a4608B9910e9031B3788M61056g9114A66505b60659g9199A53352D029b3105
12027B95991D8002L28933d97057h6850d138k74354A03101l7454c77823a34427
12016A56542c7758E2418g4754A14277a54935O5485b6880H7834a36766A8762L7662
$$ plain form
12005 56424 -173257 220046 42765 -92260 19705 -315853 -121426 -4561 -21269 -255142 179734
11993 47430 100451 3047 -133800 -36536 -9610 -19777 -81214 -296386 12225 -118344 86637
11981 -173077 97256 -316235 35534 -38910 35648 39891 10656 -122440 -408306 96242 -179465
11969 33725 -502849 -56002 -331778 -214321 193370 -14426 -494738 141865 -186569 -33002
11958 111826 17390 -371807 71027 -149447 234386 -39200 220530 262928 25344 125143 366739
11947 366739 -245805 44844 -136760 -228903 274728 335803 311102 213240 -203152 -17917 30671
11935 1902 -4604 -28823 -178691 -133708 -45145 -231213 131893 143568 -39830 25661 89553
11924 89553 -220129 42004 -73928 75750 -70397 -3129 24788 43805 110713 -216163 70777
$$ packed form
12005E6424a73257B20046D2765i2260A9705c15853a21426d561j6708k33873A79734
11993D7430N3021C047a33800c6536i610j0167o1437k15172A2225a18344H6637
11981a73077I7256c16235C5534c8910C5648M243A0656a22440k85866I6242a79465
11969C3725e02849e6002k75776J17457A93370a4426m80312A41865a86569c3002
11958A11826A7390c71807G1027a49447B34386c9200B20530M2398B5344R9799K41596
11947C66739b45805D4844a36760r2143B74728O1075k4701r7862b03152a7917C0671
11935A902d604k4219j49868M4983d5145j86068A31893J1675c9830B5661O3892
11924H9553b20129D2004g3928G5750g0397c129B4788J9017O6908b16163G0777
$$ plain form
11912 -342003 -161056 -478787 83734 132391 123936 -26202 -85169 -129818 -113228 52882 181875
11901 181875 152692 240955 -69850 344888 -47943 -228172 -292372 87231 -57619 -171305 189540
11889 -116336 -89701 214841 166121 -285258 64328 163914 -54724 -109445 -173933 758 2475 160993
11877 160993 298465 -116563 -315329 271081 -115196 206953 -73788 -112242 386582 55835
11866 136381 12818 -6955 -9610 -66854 -184560 -370819 -81798 -422329 2366 -148824 -372678
11855 -372678 -67068 -155513 100010 5194 157649 -70444 -65063 27167 106569 -63026 -31678
11844 -31678 -11633 89067 -27527 -69807 -176574 -159009 -49041 -110337 52303 -1238 -154172
11833 -154172 99134 -167390 272215 10290 -292191 117734 51057 -24894 -111141 -32838 108232
$$ packed form
11912c42003a61056l17731H3734M8657q455b6202n8967m4649J6590E2882J28993
11901A81875k9183Q8263f9850C44888d7943j80229o4200H7231e7619j13686A89540
11889a16336K6635B14841m8720b85258F4328R9586e4724n4721o4488G58J717J58518
11877A60993J37472a16563j98766B71081a15196B06953g3788l8454C86582E5835
11866A36381A2818f955k655n7244j17706j86259h1798l40531B366a48824k23854
11855c72678f7068q8445A00010E194J52455g0444N381B7167P9402f3026L1348
11844c1678a1633H9067b7527m2280j06767J7565d9041o1296E2303a238j52934
11833a54172I9134a67390B72215A0290b92191A17734E1057b4894q6247c2838A08232
$$ plain form
11821 307288 -361439 -136194 -5538 72939 15073 -33007 -40929 19037 -96208 -188184 -156960
11810 -156960 78181 32159 -102501 -101495 16924 -33159 -44234 -110892 -170969 146378 76798
11799 76798 -134363 44285 106038 -79288 -39244 -35930 -30044 208086 -215540 -336143 25995
11787 61108 -206755 -128902 182875 -17451 -156496 -116956 110972 -154603 -171601 -19931 -34886
11776 -34886 -268991 -226803 262744 -168252 162459 65592 -25676 -133069 100217 -43886
11765 195599 173120 157174 25894 18621 -82235 9068 40368 -77122 -440411 76854 -345859
11753 -44810 -59530 239784 -133918 68990 -3086 199514 351785 365810 -38282 218689 248072
11742 248072 205845 65494 -84876 257944 186007 -125278 -195180 43640 100320 96105 74741
$$ packed form
11821C07288c61439a36194e538G2939A5073c3007p922A9037i6208r1976L1224
11810a56960G8181C2159a02501J006A6924c3159j1075o6658o0077A46378o9580
11799G6798a34363D4285O1753g9288c9244L314N886B08086b15540j20603B5995
11787F1108b06755P7853A82875a7451j39045L9540A10972a54603j6998a9931j4955
11776c4886k34105M2188B62744a68252A62459F5592b5676j07393A00217d3886
11765A95599k2479j5946B5894p273h2235I068L1300g7122l63289G6854c45859
11753d4810j4720B39784a33918F8990c086A99514J52271J4025c8282B18689K9383
11742B48072m2227F5494h4876B57944p1937a25278o9902D3640N6680m215k1364
$$ plain form
11731 74741 -243347 -133960 94629 62827 54278 -95653 -120024 -78266 -49788 330496 -194926
11719 144909 -174957 94951 -42716 118547 134369 40135 47312 54282 191245 226758 74321
11707 355192 -100707 176095 68303 30304 -64047 -147409 -58373 153474 -214101 -241130 100646
11695 32329 209222 -30728 -38732 -146322 167630 86522 93467 -328980 -66904 -85307 -8539
11683 -41545 -202496 9314 -130867 -97956 -92343 -2879 -67745 200277 203292 -57514 37383 -90760
11670 188953 7590 81038 -165282 -253183 -266540 -348834 -14483 -249950 -58809 -198115 160181
11658 32717 -16962 -86548 -253589 -161842 11114 -176138 16422 304659 -149114 42379 118271
11647 118271 291725 -27520 -184015 159698 618 131783 276123 55315 99723 47435 -77214
$$ packed form
11731G4741b43347J09387I4629l1802q549i5653k4371M1758K8478C30496a94926
11719A44909a74957I4951d2716A18547J5822D0135P177O970J36963L5513G4321
11707C55192a00707A76095F8303C0304f4047q3362e8373A53474b14101k7029A00646
11695C2329J76893c0728q004j07590A67630q1108O945c28980f6904j8403h539
11683d1545j60951I314a30867L2911N613b879o4866B00277L015e7514C7383i0760
11670A88953G590P3448a65282q7901j3357q2294a4483k35467e8809j39306A60181
11658C2717a6962o9586j67041R1747A1114a76138A6422K88237a49114D2379P5892
11647A18271J73454b7520j56495A59698F18J31165J44340E5315M4408D7435g7214
$$ plain form
11635 62726 52778 -86533 -207787 -10794 23794 108387 -114258 -9238 -121405 100783 -1706
11623 -25877 -29795 150435 -45538 50600 142888 -12019 -7991 66669 -72232 -71099 76188 -98511
11610 -172874 -26443 -178259 208865 -108220 -278608 50369 -301733 30740 233821 85546
11599 -153968 134860 259416 -6861 124653 -238111 46609 322737 140940 9904 -186727
11588 92155 -91509 28332 437660 159110 170525 13825 322401 120957 169874 197260 -69572
11576 -317995 -164057 109229 171483 126223 62911 12580 -81922 -241291 -41556 -155018 -121715
11565 -121715 53553 248838 158229 95246 2426 -8406 -5004 178172 109832 -67448 103551
11553 -85611 -105955 93529 -118994 180954 -150666 -131054 39008 28359 339692 89932 -132661
$$ packed form
11635F2726r948h6533j21254a0794B3794Q4593a14258i238j12167A00783a706
11623b5877l918A50435d5538E0600R2288a2019M028F6669g2232J133G6188i8511
11610a72874b6443j51816B08865a08220j70388E0369c01733C0740K03081H5546
11599a53968A34860J24556f861A24653b38111D6609K76128A40940I904a86727
11588I2155i1509B8332M09328A59110J1415A3825L08576A20957M8917K7386f9572
11576c17995J53938A09229O2254m5260F2911A2580h1922j59369d1556j13462L3303
11565a21715E3553J95285r0609o2983B426h406L402A78172o8340f7448A03551
11553h5611k0344I3529a18994A80954a50666J9612C9008j0649L11333H9932a32661
$$ plain form
11541 3839 168848 52916 234965 -2388 -54742 -134776 15408 99346 323450 169264 -26085
11529 72911 100491 -57737 -42533 248526 77365 145371 -202890 194649 -110684 76624 73373
11518 73373 -84823 38179 30328 171934 89078 -58100 160108 19155 56324 386136 -122695
11506 142106 40897 284974 -35410 187878 193870 -3211 64005 392674 167091 73851 104071
11495 104071 132534 -124603 -115904 37090 259456 181155 168009 116487 -51730 231267 -15222
11483 1776 197026 439681 -54478 264444 17206 -3931 -22179 259797 -45598 142800 193437
11472 193437 -272160 -27458 41302 28745 267700 128738 115300 -139418 150125 -238148
11461 43674 151579 197410 47488 13583 -70107 74623 152682 15928 -863 236981 -2043 -69216
$$ packed form
11541C839J65009E2916J82049b388n2354q0034A5408Q3938K24104j54186b6085
11529G2911K7580e7737J5204B48526G7365O8006b02890A94649a10684G6624l251
11518G3373h4823C8179p851J41606q2856e8100A60108A9155L7169L29812a22695
11506A42106D0897K44077c5410A87878N992c211F4005L28669A67091G3851L0220
11495A04071K8463a24603Q699C7090K22366p8301j3146n1522e1730B31267a5222
11483A776J95250K42655e4478B64444A7206c931j8248B59797d5598A42800N0637
11472A93437b72160b7458D1302j2557K38955A28738j3438a39418A50125b38148
11461D3674J07905M5831D7488A3583g0107G4623P8059A5928h63B36981b043o7173
$$ plain form
11449 -69216 45041 -133678 32298 261593 210671 24975 111980 -226649 90877 299436 83132
11437 194861 176418 110954 -94573 26959 50778 195199 104766 -88567 142541 120322 120411 2261
11424 -60414 152099 -166125 22919 -123750 -179981 39134 -27902 234989 -78437 454075 43193
11412 144663 206395 -141664 -101210 -187544 -44599 114114 -256780 143619 250126 -29627
11401 124144 -53084 -144763 -66928 120096 211486 20006 -258192 -209802 143059 122087 351913
11390 351913 -184892 -25306 -183143 -18740 -274592 -211046 -65212 301606 58300 -271356
11379 -36695 -4733 33867 -35431 -61757 85676 -181507 -186980 4317 11596 -60298 202068 15915
11366 -167727 69550 -53733 93432 113298 -6734 -86132 247201 -351182 48192 8116 -81896
$$ packed form
11449f9216D5041a33678C2298K29295n0922B4975Q7005b26649I0877K08559H3132
11437A94861j8443o5464i4573B6959K3819J44421r0433h8567A42541k2219Q9B261
11424f0414A52099a66125B2919a23750n6231C9134b7902B34989g8437D54075D3193
11412A44663O1732a41664M0454q6334d4599A14114b56780A43619J06507b9627
11401A24144e3084r1679f6928A20096R1390B0006b58192M8390A43059k0972K29826
11390C51913a84892b5306j57837a8740k55852O3546f5212C01606E8300b71356
11379c6695d733C3867c5431k6326H5676a81507n473D317P279f0298B02068A5915
11366a67727F9550e3733I3432J9866f734p9398B47201c51182D8192H116h1896
$$ plain form
11354 359514 -293184 -181039 -286909 49261 102778 -110759 231221 88877 185282 62739
11343 131934 -395937 79799 -12464 -108383 -184529 -237644 -166971 -7836 144545 31334 -290850
11331 75723 -187449 -62405 -159775 9807 537058 -62204 29000 -87213 -107260 -61555 -108452
11320 -108452 -113856 -286664 -120324 139155 -18680 -235058 4142 -11793 -70330 -218002 -339146
11309 -339146 -207635 -137964 -167214 249784 -71154 240687 276198 -210147 38853 -207205
11298 60077 261726 -555237 76225 -305665 188581 -171134 19752 15479 -6601 226945 38102
11286 -226103 -26979 60174 31716 -262703 -299557 -134086 -148131 201460 -153612 -61808 -56407
11275 -56407 135090 -21773 -116557 -2678 125627 -10844 -187133 -172007 174597 166182 26424
$$ packed form
11354C59514b93184J12145j05870D9261N3517a10759B31221H8877R6405F2739
11343A31934c95937G9799a2464r5919p6146n3115P0673g836A44545C1334b90850
11331G5723a87449f2405r7370I807N27251f2204B9000h7213k0047M5705m6897
11320a08452n404j72808a20324A39155a8680k16378D142a1793n8537j47672j21144
11309c39146J31511O9671k9250B49784g1154B40687L5511b10147C8853b07205
11298F0077K01649e55237G6225c05665A88581a71134A9752m273f601B26945C8102
11286b26103b6979F0174k8458b62703l6854a34086j4045B01460a53612f1808N401
11275e6407A35090b1773r4784b678A25627a0844j76289J5126A74597q415B6424
$$ plain form
11263 -176445 97290 -126002 101825 289887 67825 35938 107909 92727 -242175 159455
11252 105351 -306592 125519 49688 131276 111879 118411 -209119 -257749 -34106 -56476 57493
11240 -55307 -156472 -78464 69456 149549 -349698 -294525 -130512 83820 -10833 143803 -31289
11228 213182 -147698 -504 -104548 92959 140898 -200145 -177103 -170337 -464557 -268701 248270
11216 -16530 -86433 -240957 -195140 -47851 -189688 -64978 -82252 -7600 -211493 14735 -140178
11204 97396 -125011 -38994 51565 7329 -108316 -266220 -207245 291953 -18465 57052 -4607
11192 -107436 -77751 -122796 156667 -65443 -11429 -8645 -17631 -41512 254175 -135896 -53535
11180 82834 -112914 -98137 -172680 66008 -64549 130728 14065 -407123 -180499 -73549 34919
$$ packed form
11263a76445I7290a26002A01825J88062F7825l1887P1971j5182b42175A59455
11252A05351c06592A25519D9688Q1588j9397O532b09119m8630c4106k2370E7493
11240e5307j01165P8008F9456Q0093c49698N5173a30512H3820a0833A43803c1289
11228B13182a47698e04j04044I2959M7939b00145K3042O766k94220J95856B48270
11216a6530o9903j54524M5817d7851j41837f4978j7274g600k03893A4735a40178
11204I7396a25011c8994E1565G329a08316j57904N8975B91953a8465E7052d607
11192a07436K9685m5045A56667f5443a1429K784q986k3881B54175a35896e3535
11180H2834a12914J4777p4543F6008f4549A30728A4065d07123a80499g3549C4919
$$ plain form
11168 -188300 165330 26743 -308663 117652 -28070 -308766 -302107 -122654 -247581 -244604 -125402
11157 -125402 -243839 -177943 -70099 3331 220332 162089 -5454 -126209 -311647 -138067 29205
11145 -269072 85098 -103391 -235521 -126140 233953 -196696 -99186 -20236 -60118 23605
11134 -104316 78 -23323 -183715 129797 132090 137879 -28496 132019 73388 -98434 -382146 140372
11121 -32696 331367 -126178 -65703 96270 120211 278220 207531 -153887 86293 149555 267728
11110 267728 -114920 -11179 122854 -159556 110770 294784 -91763 49025 -164646 275108
11099 258947 -21329 -150159 -35743 135910 301105 493405 26380 268766 21549 48207
11089 48207 287190 201684 -62795 200293 161106 117614 -22823 -237701 406637 -114935 290879
$$ packed form
11168a88300A65330B6743c08663A17652b8070k80696O659a22654j24927K977J19202
11157a25402j18437O5896g0099C331K17001n8243e454j20755j85438a38067B9205
11145b69072H5098a03391j32130J09381B33953a96696R7510b0236l9882B3605
11134a04316G8b3323j60392A29797K293N789b8496A32019n8631i8434k83712A40372
11121c2696C31367a26178O0475I6270K3941J58009p0689a53887H6293O3262J18173
11110B67728a14920a1179A22854a59556A10770J84014i1763D9025a64646B75108
11099B58947b1329j28830c5743A35910J65195J92300B6380K42386B1549K6658
11089D8207K38983q5506f2795B00293l9187m3492b2823k14878D06637a14935B90879
$$ plain form
11077 383913 34900 166143 133948 113695 263960 363101 190183 475945 181886 500700
11067 500700 426173 172601 409825 134869 421288 272658 181737 664254 176043 270420
11057 270420 362447 766738 700597 252782 694364 595671 479396 458020 578240 576018 749216
11046 749216 710244 962350 791503 874483 496548 1047571 580597 757530 516202 916879
11036 916879 797659 708046 918233 699444 535771 608315 688172 618659 505642 632545
11026 632545 832672 750657 723466 817169 886170 829496 651812 681720 660609 696292 465605
11015 465605 750778 282741 516089 595267 522021 736580 568349 513112 515537 377211
11005 377211 756505 852666 344228 331753 520483 439865 681393 603665 483428 696586
$$ packed form
11077C83913C4900J31243l2195k0253J50265R9141j72918K85762A81886L18814
11067E00700p4527A72601K37224A34869K86419j48630r0921M82517A76043R4377
11057B70420R2027M04291o6141B52782M41582r8693j16275k1376J20220k222J73198
11046G49216l8972K52106j70847Q2980l77935N51023m66974J76933k41328M00677
11036I16879j19220q9613K10187k18789j63673P2544P9857o9513j13017J26903
11026F32545K00127q2015k7191R3703O9001n6674j77684K9908k1111L5683k30687
11015D65605K85173B82741K33348P9178p3246K14559j68231n5237K425j38326
11005C77211L79294R6161C44228j2475J88730q0618K41528p7728j20237K13158
$$ plain form
10995 696586 374286 535680 644924 505965 503052 700396 554274 582435 722195 663201
10985 663201 465716 882684 990544 619545 616228 926398 807362 950196 854073 1145641
10975 1145641 863368 937201 947876 1199612 1357095 1670540 1745854 1952173 2038209 1845107
10965 1845107 2533519 2396736 2725345 2753109 2791776 2671133 2322408 1963342 1627605 1614682
10955 1614682 1408544 1352486 1282250 1136776 1298787 1657224 1539723 1282427 1242327 1078728
10945 1078728 696513 732522 567441 335429 559678 447933 364498 314023 -4552 36966
10934 485967 46837 166048 121361 -124935 481961 20007 25280 201638 213611 -58753 11051
10922 -248112 143105 454381 199322 126957 125730 133301 -242996 -33105 -80365 179989 23095
$$ packed form
10995F96586l22300J61394J09244j38959k913J97344j46122K8161J39760n8994
10985F63201j97485M16968J07860l70999l317L10170j19036J42834r6123K91568
10975A145641k82273P3833J0675K51736J57483L13445P5314K06319Q6036j93102
10965A845107O88412j36783L28609K7764L8667j20643l48725l59066l35737j2923
10955A614682k06138n6058p0236j45474J62011L58437j17501k57296m0100j63599
10945A078728l82215L6009j65081k32012K24249j11745q3435n0475d552C6966
10934D85967D6837J19211m4687a24935D81961B0007N273J76358J1973e8753A1051
10922b48112A43105L11276A99322p2365j227P571b42996c3105m7260A79989B3095
$$ plain form
10910 217701 103812 -181440 -32104 -127855 -183744 297281 -175873 161810 -107370 -107788 68239
10898 -124591 -253382 73998 50297 404289 145059 -114237 -277287 162385 352685 -66132
10887 -118766 -153796 -111793 -57807 14334 219894 -356504 -300010 -99103 -183975 -79728 -82340
10876 -82340 -20571 -147748 91715 56376 -84149 -193581 -165668 -304627 -59353 -139772 -65737
10864 -370877 -329323 67821 202087 -163644 -156204 238634 36572 215550 -60915 -23766 -23955
10853 -23955 -96894 -186817 -32308 -22264 -197559 -22002 -187499 -384016 5982 334915 -68158
10841 -101864 68872 -44849 -33613 -105099 115392 96444 139871 255073 -71737 -71635 72472
10829 -383510 -179570 -67399 -90145 1136 -26770 -127508 149085 83156 -86972 -73326 -30194
$$ packed form
10910B17701A03812a81440c2104r5751n5889B97281a75873A61810a07370m18F8239
10898a24591j28791G3998k3701L53992A45059a14237j63050A62385J90300f6132
10887a18766l5030M2003N3986A4334K05560c56504N6494i9103q4872g9728k612
10876h2340b0571j27177I1715l5339h4149j09432K7913j38959e9353q0419f5737
10864c70877M1554F7821J34266a63644P440B38634C6572J78978f0915b3766j89
10853b3955p2939q9923c2308J0044j75295b2002j65497j96517E982L28933f8158
10841a01864F8872d4849J1236p1486A15392j8948M3427J15202g1737J02G2472
10829c83510a79570f7399k2746A136b6770j00738A49085o5929h6972J3646c0194
$$ plain form
10817 53192 -217993 158898 22076 56055 -187111 83919 86658 1112 -69238 152752 -36336
10805 142392 83135 165165 -305283 23975 -194527 79242 -31231 -98078 -140552 10172 23317
10794 23317 -304235 -124215 -173350 -140704 93631 -157440 102730 -445064 -51222 80068 258558
10783 258558 148135 -1449 120400 -126567 -208874 55364 284509 -16240 -184868 -162906 -50044
10771 123394 -76207 228546 -229249 -63792 100713 -250809 -127591 86164 -210589 -377358
10761 -377358 -5783 140886 185199 -76634 112198 -326034 119298 -269509 -186594 -91439 -122932
10750 -122932 179963 -70291 -169244 -149635 391531 -115242 -51727 103947 -157214 -50021
10739 -6918 -89293 9432 129733 -41677 -258505 21397 263093 -387624 29902 -54832 -254938
$$ packed form
10817E3192b17993A58898B2076L3979a87111H3919K739A112f9238A52752c6336
10805A42392n9257Q2030c05283B3975a94527G9242c1231o6847m2474A0172J3145
10794B3317c04235a24215m9135L2646I3631a57440A02730d45064e1222H0068J78490
10783B58558j10423a449A20400a26567q2307E5364K29145a6240j68628K1962e0044
10771A23394g6207B28546b29249f3792A00713b50809J23218H6164b10589j66769
10761c77358e783A40886M4313g6634A12198c26034A19298b69509Q2915i1439l1493
10750a22932A79963g0291r8953J9609C91531a15242e1727A03947a57214e0021
10739f918q2375I432J20301d1677k16828B1397K41696c87624B9902e4832k00106
$$ plain form
10728 -254938 405683 40666 256307 -49836 -193463 -116319 27865 155965 64864 -8344 197108
10716 -194729 -191336 -79420 -25139 165453 -128206 -27726 -3359 -153857 265424 -207476 -69989
10704 111587 -71124 -132903 -130699 -379296 131508 -262494 -328742 -353817 -327966 153082 -271109
10692 -119083 -104203 -292488 237589 134376 19615 -111297 239205 143073 413454 -337897
10681 -225841 36659 -57507 -316269 -256167 40519 -124744 4409 165779 -276335 233567 -94772
10669 177260 -171299 -354943 55887 -242112 -14411 12914 134744 104923 -227814 -375796
10659 -375796 -360864 390121 143058 -70093 -190227 -156826 96319 -164264 -50002 -137471 -349661
10648 -349661 -2810 181696 38452 -212093 -190753 -186136 -143497 239345 -148842 -1414 -285335
$$ packed form
10728b54938D05683D0666K15641d9836j43627P7144B7865J28100F4864h344A97108
10716a94729L393g9420b5139A65453a28206b7726c359j50498B65424b07476f9989
10704A11587g1124o1779K204k48597A31508b62494o6248k5075K5851A53082b71109
10692a19083J4880j88285B37589j03213A9615a11297B39205r6132K70381c37897
10681b25841C6659e7507k58762O0102D0519a24744D409J61370b76335B33567i4772
10669A77260a71299j83644E5887b42112a4411A2914J21830k9821b27814j47982
10659c75796J4932C90121A43058g0093j20134L3401I6319a64264e0002q7469k12190
10648c49661b810A81696C8452b12093K1340M617M2639B39345a48842a414k83921
$$ plain form
10637 -285335 87435 -161 136053 -55033 -135927 -91190 -286676 90678 -85397 -18491 441079
10625 -94834 -14821 -154161 109160 -389943 -180549 -194867 -25177 -249611 165974 -350368
10614 45150 96210 -200951 -469289 -61146 37566 -242196 -217750 -196912 96729 64823 119290
10603 119290 352248 -112435 130412 -66598 179824 -156095 -207941 250513 226836 -78307
10592 -216566 -47635 -54359 -224384 -483461 22153 -196004 46190 208013 -5162 113985 210522
10581 210522 6145 48795 185192 -179412 -20788 -199637 -45850 72895 -347889 260693 -10988
10569 -288068 -268707 80934 64131 123749 -190899 3099 -188001 19922 64757 124499 135301
10558 135301 -48698 -119107 49512 -112792 235744 -325828 282721 -202663 -133382 -221109
$$ packed form
10637b85335H7435a61A36053e5033q0894M4737j95486I0678h5397a8491D41079
10625i4834a4821j39340A09160c89943a80549j4318b5177k24434A65974c50368
10614D5150N1060b00951k68338f1146C7566b42196K4446K0838I6729l1906N4467
10603A19290K32958a12435A30412f6598A79824a56095n1846B50513k3677g8307
10592b16566d7635o724j70025k59077B2153a96004D6190J61823e162A13985R6537
10581B10522F145M2650J36397a79412b0788j78849d5850G2895c47889B60693a0988
10569b88068J9361H0934j6803N9618a90899C099a88001A9922M4835N9742J0802
10558A35301d8698p0409D9512a12792B35744c25828B82721b02663O9281q7727
$$ plain form
10548 -221109 52335 22582 -171369 -74307 -147490 23014 37958 10215 -73134 130861 175103
10537 175103 -128568 -204370 127723 -38234 -94386 -173210 -267358 276785 -171456 -68150 -135340
10526 -135340 -76595 -72630 284250 -67810 60066 -103575 -210512 -37869 -480437 129971 -151291
10514 111360 1893 -351478 -52092 -5494 -116438 30301 177223 -158613 -186830 125449 -145642
10502 -182824 227977 165811 359479 -73823 201676 -116383 412239 171396 356492 -64642
10491 52677 137753 -29351 32395 -96986 22071 -80405 176197 136784 -125557 -178724 -154197
10480 -154197 -44309 -301411 -205822 -124245 34338 26916 197764 -9473 122618 305750 329339
10469 329339 293869 -103620 -31543 275547 -23331 330618 272810 -191305 119721 -110390
$$ packed form
10548b21109E2335B2582a71369g4307p3183B3014J4944A0215g3134A30861M4242
10537A75103a28568p5802A27723c8234n6152p8824r4148B76785a71456f8150o7190
10526a35340N8745L965B84250f7810F0066a03575j06937c7869m42568A29971a51291
10514A11360A893c51478e2092e494j10944C0301J46922a58613k8217A25449a45642
10502a82824B27977o2166J93668g3823B01676a16383D12239A71396J85096f4642
10491E2677Q5076b9351C2395i6986B2071h0405A76197l9413a25557n3167K4527
10480a54197d4309k57102R5589Q1577C4338p422J70848i473A22618J83132K3589
10469C29339l5470a03620c1543B75547b3331C30618n7808a91305A19721a10390
$$ plain form
10458 16288 239357 -314971 -126485 -190681 -109189 138763 -40427 22711 -160495 50075 -148879
10446 -234531 -99616 -134371 49492 112825 56255 -139455 -165018 44482 -297711 6045 -116812
10434 -152217 -67897 -59129 -283816 -186860 -113964 109161 18970 -124359 -54791 -375606 239955
10422 146795 -186290 233859 -90481 -195863 40397 121015 -205205 112904 -353697 113674
10411 -11357 115572 122990 17445 146756 -156072 -275712 51902 -84940 -84541 5094 -89909 291229
10398 42029 215672 -285378 -134931 90085 -503569 255363 12821 -190752 -38828 153648
10387 4237 238637 54726 -79105 165409 -85539 116087 -10788 -56446 197021 166319 33854
10375 96874 -8426 20853 356375 221416 243653 -96403 25888 -58294 131822 23578 81554
$$ packed form
10458A6288K23069c14971a26485o4196Q1492A38763d0427B2711a60495E0075a48879
10446b34531i9616l4755D9492O3333E6255a39455k5563D4482b97711F045a16812
10434a52217f7897Q768k24687R6956P2896A09161A8970a24359e4791l20815B39955
10422A46795a86290B33859i0481j05382D0397Q0618b05205A12904c53697A13674
10411a1357A15572P418A7445J29311a56072j19640E1902h4940L99E094h9909B91229
10398D2029J73643b85378a34931I0085e03569B55363A2821a90752c8828A53648
10387D237K34400E4726g9105A65409h5539A16087a0788m5658A97021l0702C3854
10375I6874h426B0853L35522j34959K2237i6403B5888e8294A31822B3578N7976
$$ plain form
10364 81554 307873 271084 310523 390067 483541 60393 107673 184488 140547 25861 289201
10353 289201 220535 211808 34062 -57264 -24030 263596 616503 547831 635672 365679 182249
10341 103065 434102 265617 220167 452567 458274 179398 137371 123628 -93612 342626 38548
10329 628896 204655 167286 128651 109886 62622 -113939 51100 45891 82432 -196194 131637
10317 119571 442002 464194 365272 142820 125355 43055 -249222 -131051 46585 74535 293102
10306 293102 -343119 -69151 -8026 36473 376637 17533 -215061 -159257 113924 155724 -201753
10294 37332 56055 135911 -160120 -51331 256836 186727 306323 -108952 195498 -18903 137793
10282 22500 169621 -105583 -84765 220650 -71847 -156910 62645 182127 -55631 -79440 -216510
$$ packed form
10364H1554K26319l6789L9439P9544R3474F0393M7280P6815m3941B5861K63340
10353B89201o8666q727C4062e7264b4030B63596L52907o8672Q7841k69993A82249
10341A03065L31037j68485m5450K32400N707A79398m2027j3743i3612C42626C8548
10329F28896B04655l7369l8635j8765m7264a13939E1100n209L6541a96194A31637
10317A19571L22431K2192r8922A42820j7465D3055b49222J18171D6585K7950K18567
10306B93102c43119f9151h026C6473L40164A7533b15061N5804A13924M1800b01753
10294C7332J8723P9856a60120e1331B56836p0109J19596a08952A95498a8903A37793
10282B2500J47121a05583K0818B20650g1847q5063F2645J19482e5631k3809j37070
$$ plain form
10271 -216510 76621 -61494 175432 -151520 -104825 -118352 -284429 -201602 -167194 -241504 -71297
10259 28514 31927 -330593 -120955 -367 239420 17037 207162 -42173 133668 -3899 -8999 480937
10246 36552 88640 -9125 232200 46396 -259771 50107 -50338 59153 63656 -82268 67778 -39837
10233 40980 -166298 -72984 130168 -126802 -111269 -288309 60740 -56483 -28986 308026 -156932
10221 -110610 -78441 83149 -46571 27569 180983 -41972 -259071 -92878 -225266 -469976 -196810
10209 -416887 162787 78592 -96353 -2660 39555 181858 -41323 -383854 -182540 -149326 -233093
10198 -233093 -74032 -127129 -299533 -391591 -284944 -269825 44650 -309956 106191 -61658 132500
10186 -228352 -94429 213685 6026 102579 -7205 -95136 -148671 -32849 -9661 -68300 -346541 90798
$$ packed form
10271b16510G6621f1494A75432a51520M6695j3527j66077Q2827L4408p4310g1297
10259B8514L413c30593a20955c67B39420A7037J90125d2173A33668c899n100D80937
10246C6552N2088i125B32200D6396b59771E0107e0338E9153M503h2268F7778c9837
10233D0980a66298g2984A30168a26802J5533j77040F0740e6483K7497C08026a56932
10221a10610L2169H3149d6571B7569J53414d1972k17099i2878j32388k44710a96810
10209d16887A62787G8592i6353b660C9555J42303d1323l42531a82540L3214q3767
10198b33093g4032n3097j72404r2058J06647J5119D4650c09956A06191f1658A32500
10186b28352i4429B13685F026R6553g205q7931n3535c2849i661n8639k78241I0798
$$ plain form
10173 -355382 -148269 -221312 13238 -325908 -189587 119085 -390436 -111757 -44571 10166
10162 -119360 50619 -4644 219135 -80296 -210160 85749 -80758 -120568 -168901 -166104 -311263
10151 -311263 -166251 207295 -279693 72005 -217553 -290977 -114150 85847 -3721 26584 -81929
10139 -241980 -379434 161098 64128 -115717 -21881 -355819 -182229 -68423 -290815 -129399
10128 250200 -146637 -178338 64792 -95492 -2621 62664 -28218 -46783 -106470 -248719 -38173
10116 105460 -123159 -147778 -46902 120867 -423272 -88434 -57073 -308516 -101331 74746
10105 -224577 -96275 -197611 -83323 -42105 -84709 135050 167690 136649 -212186 -40782 13301
10093 -154125 -238130 14145 -286677 -10877 95801 -56045 26475 13868 323822 -117408 -198190
$$ packed form
10173c55382a48269p3043A3238c25908J36321A19085c90436a11757d4571A0166
10162a19360E0619d644B19135h0296j29864H5749h0758l9810m8333K797j45159
10151c11263J45012B07295b79693G2005b17553p3424a14150H5847c721B6584h1929
10139b41980j37454A61098F4128a15717b1881l33938J73590f8423k22392a29399
10128B50200a46637l1701F4792i5492b621F2664b8218j8565n9687j42249c8173
10116A05460a23159k4619d6902A20867d23272h8434L1361k51443a01331G4746
10105b24577i6275j01336h3323M1218m2604A35050L2640l1041b12186d0782A3301
10093a54125q4005A4145b86677a0877I5801e6045B6475j2607L09954a17408q0782
$$ plain form
10082 -198190 -83872 -147069 -8148 -22985 194186 -124972 21360 163195 205611 -316758 272666
10070 -88258 -46903 101049 -306691 -149377 73011 -131589 -25952 116476 -74966 -186955
10060 -186955 -113343 -153229 -285679 -94052 -166904 195486 -132187 76352 -71092 -46262 -51264
10049 -51264 -237284 -50713 197395 70935 69723 -166842 -259951 -1936 -53072 -479 -98741 26665
10036 -153709 -354253 17482 -74896 -107680 -1894 -176726 -198922 91970 -242319 -86030 -158285
10025 -158285 1618 -339140 -194965 -417242 66543 -150049 50760 -23054 -21925 -192234 -39202
10013 47614 66945 9821 134128 -267190 129720 -179086 -240229 -153753 21564 -114880 -59827
10002 -59827 39960 -21992 103277 -143854 -141470 -128462 294150 -46582 -97813 -168980 -98191
$$ packed form
10082a98190h3872o3197h148j4837A94186a24972B1360J41835M2416c16758B72666
10070h8258M1355A01049c06691a49377G3011a31589b5952A16476g4966j11989
10060a86955P3612l9886j32450i4052p2852A95486a32187G6352g1092K4830n002
10049e1264j86020e0713A97395G0935j212a66842r3109a936n1136d79r8262B6665
10036a53709k00544A7482g4896l2784a894j74832k2196I1970b42319h6030p2255
10025a58285A618c39140J44175k22277F6543a50049E0760b3054J129j70309c9202
10013D7614J9331I821J24307b67190A29720a79086o1143Q6476B1564a14880N5053
10002e9827C9960b1992A03277a43854K384J3008B94150d6582n1231p1167P0789
$$ plain form
9991 -98191 -14987 185808 -111176 -435142 -134173 -211370 -98476 58280 346222 -152813 -274507
9980 -274507 248314 20279 -86125 -238925 25496 -49985 8496 -183277 -258182 -264433 -7462 37357
9967 82042 -43763 -13373 -31932 125632 -282071 -208046 -130570 130071 278941 -144086 -283987
9956 -283987 -194335 -213895 55739 -171845 -39508 -133166 -251774 81620 -424887 -201400 -314500
9945 -314500 67304 -212559 -103167 -122607 -313704 -213671 126034 -75784 -315585 196871
9934 8762 81147 -361614 17023 -157171 -302001 -239052 -23102 -43666 -224032 -57320 -157006
9923 -157006 -100667 214477 -57278 48161 -174638 -150539 156485 -69820 69347 -232432 -278841
9912 -278841 -142462 -410689 -297370 -233206 -279692 -74107 -53283 229645 -2408 117957 -356647
$$ packed form
9991i8191a4987A85808a11176l23966a34173p7197i8476E8280K87942a52813j21694
9980b74507B48314B0279h6125j52800B5496d9985H496a83277p4905o251g462C7357
9967H2042d3763a3373j8559A25632b82071P4025P7476A30071J48870a44086j39901
9956b83987Q9652j9560E5739a71845c9508r3658j18608H1620d24887b01400j13100
9945c14500F7304b12559a03167j9440j91097J00033A26034g5784k39801A96871
9934H762P2385c61614A7023a57171j44830O2949b3102k0564j80366e7320r9686
9923a57006N6339B14477e7278D8161a74638K4099A56485f9820F9347b32432m6409
9912b78841J36379k68227J13319O4164m6486g4107K0824B29645b408A17957c56647
$$ plain form
9900 51898 -376442 -30939 -210286 -107124 46093 -103862 -240589 4903 -272888 82951 -22782
9888 -253945 276058 -232622 -91947 -136889 -130073 1852 -146174 -146742 -234377 -343728 53838 -101997
9875 -259640 -303799 -69292 4416 -65777 -107829 -308283 -41901 -335610 62093 -32876 151126
9863 -65816 -7404 -392165 -121714 -5125 -179339 -205397 229598 -15101 120208 -34563 121513
9851 223707 36399 -147349 -168175 -145035 357057 104259 -266440 -126185 147890 -45474
9840 68988 46540 -3332 -105602 -137714 -227866 -32433 98313 -1216 188078 -187641 -72328 134991
9827 -169693 -240376 -100189 -125698 -184086 43607 213300 49520 125605 -127501 -86646 72778
9815 -227764 32151 107845 -178959 -168363 -437645 49852 -50678 187911 -38214 69906 -207167
$$ packed form
9900E1898c76442c0939j79347J03162D6093a03862j36727D903b72888H2951b2782
9888b53945B76058b32622i1947m4942O816A852a46174n68q7635j09351E3838a01997
9875b59640m4159f9292D416f5777m2052k00454d1901k93709F2093c2876A51126
9863f5816g404l84761a21714e125j74214k6058B29598a5101A20208c4563A21513
9851B23707C6399a47349k0826K3140C57057A04259b66440a26185A47890d5474
9840F8988k2448c332j02270l2112r0152c2433I8313a216A88078a87641g2328A34991
9827a69693p0683a00189k5509n8388D3607J69693D9520P6085a27501M0855G2778
9815b27764C2151P5694a78959J0596k69282D9852e0678A87911c8214F9906b07167
$$ plain form
9803 125311 31327 -303937 -179419 -298908 -1133 -159337 71566 -361199 -276554 101214 -11194
9791 -33047 -69936 -176972 51552 -110340 68132 1407 31102 -405897 210272 -14295 192414
9779 -113790 -101092 -58284 19408 140784 24262 -274717 -189500 -55494 80076 -44325 178742
9767 126105 -121712 36628 -72007 -97265 93086 147888 -5517 -253441 -2842 239389 -248670
9755 -209637 293037 227181 -94622 -180392 143412 -73558 -127062 -255880 -428299 10558 -72511
9743 7572 -214387 398777 22448 60409 80944 -195783 1907 -297544 -120275 15082 -47779
9731 -210235 131046 -45440 -10822 233010 -152784 -174305 -46243 29115 58180 437743 -205209
9719 120235 -92044 104853 321430 293597 -54911 -86998 -67137 -72013 -217767 42120 -70597
$$ packed form
9803A25311C1327c03937J24518j19489a133j58204G1566c61199Q4645A01214a1194
9791c3047l6889j07036E1552a10340F8132A407K9695d05897B10272a4295A92414
9779a13790J2698M2808A9408J21376B4262b74717Q5217e5494H0076d4325A78742
9767A26105a21712C6628g2007k5258I3086N4802e517k47924b842B39389b48670
9755b09637B93037o5856i4622q5770A43412g3558n3504j28818j72419A0558g2511
9743G572b14387C98777B2448L7961K0535a95783A907b97544a20275A5082d7779
9731b10235A31046d5440a0822B33010a52784k1521d6243B9115K9065L79563b05209
9719A20235i2044A04853K16577k7833e4911l2087J9861m876j45754D2120g0597
$$ plain form
9707 -75252 24285 -238000 82379 159034 -424060 118915 162498 -214259 -28621 -184532 201927
9695 139642 -102297 -367126 -1973 21835 77548 -80282 157239 -487030 199007 -256575 -103378
9683 -22830 81529 -140758 -221170 31331 230458 4804 -354748 26242 241183 -181693 -92786
9672 -92786 -151552 28908 172894 -96093 -290964 9570 -456075 -4201 51861 -76649 -4542 -187248
9660 -187248 -290076 -488786 -119854 48852 -194041 -66320 -86197 146319 297427 98219
9649 -293548 -37572 -212128 -530722 -69739 18230 -92542 56409 -335349 9741 -163065 -65103
9637 -181091 -318238 192029 -152191 -282924 -85592 193524 -59889 24587 -239632 -67333
9626 -78692 69360 -282977 -41567 -282848 -507152 -212946 -57108 242608 -87883 -283751 -183667
$$ packed form
9707g5252B4285b38000H2379P6655d24060A18915M3583b14259b8621j55911B01927
9695A39642a02297k64829a973B1835N5713h0282A57239d87030A99007b56575a03378
9683b2830H1529a40758q0412C1331J99127D804c54748B6242K14941a81693Q8907
9672i2786n8766B8908J43986i6093j94871I570d56075d201E1861g6649d542j82706
9660a87248j02828j98710a19854D8852a94041f6320j9877A46319J51108I8219
9649b93548c7572j74556l18594f9739A8230i2542E6409c35349I741a63065f5103
9637a81091j37147A92029a52191j30733h5592A93524e9889B4587b39632f7333
9626g8692F9360b82977d1567k41281k24304b12946e7108B42608h7883j95868J00084
$$ plain form
9615 -183667 -10031 -406935 -276303 -38075 163388 74657 -311214 219383 99345 72198 155626
9604 155626 -113182 13506 47463 -36102 87067 36398 -214560 265112 -137563 269673 -64786
9592 36637 87305 -31017 124895 -106669 -205774 156579 -108128 -133579 180878 -207003 -133686
9581 -133686 180899 -95243 -151688 -278399 -67058 28769 95845 188214 197299 16719 916 -7998
9568 167664 213 -273005 -106435 -62060 -72750 9711 -105359 -192971 56377 152330 -75771 -328509
9556 -328509 41812 37911 -277231 -111261 -210117 -73965 84368 102609 117870 -258360 -71707
9544 -112564 25041 -52892 -91290 222478 -8297 -427725 -171612 67702 -214028 -213041 170545
9532 228888 -55076 -223234 37182 -120936 -50191 -28832 -224580 272390 211133 -94193 2472
$$ packed form
9615a83667a0031l96904J30632c8075A63388G4657c11214B19383I9345k7147Q3428
9604A55626a13182A3506L3957c6102H7067C6398b14560B65112a37563B69673f4786
9592C6637N0668c1017A24895a06669r9105A56579a08128k5451A80878b07003P3317
9581a33686A80899i5243n6445j26711f7058B8769O7076R2369R085A6719I16g998
9568A67664B13b73005a06435M4375j0690I711a05359q7612E6377R5953g5771k52738
9556c28509D1812l901b77231a11261r8856g3965H4368J8241J5261b58360g1707
9544a12564B5041e2892l8398B22478h297m19428a71612F7702b14028R87A70545
9532B28888e5076j68158C7182a20936e0191K1359j95748B72390o1257i4193B472
$$ plain form
9520 46287 -161099 136208 -190417 -155422 51988 52095 48549 -40588 -331472 203426 -80162
9508 -144045 -201659 -384277 -203277 113644 -112654 -122294 152649 55648 -394547 -231247
9498 -231247 -69287 289760 -279598 -150340 163879 -87541 -69052 -136078 -119689 21772 167959
9487 167959 183157 284846 -157393 -151588 15037 -41976 -330552 -100686 -79271 -2029 -74632
9476 -74632 -174425 -178608 -127356 -301774 -7008 -99667 -4813 -470090 -266151 -235243 -123355 338832
9463 -66883 -198306 -51679 -221946 -301356 4802 13146 210600 73497 21374 -463628 169052
9451 157815 -90298 -96342 -218603 -158020 -47922 35811 116363 -48194 -174069 -381054 120926
9439 90278 -310841 -178309 62956 -158117 44081 305358 -158121 -303384 51560 -12534 -26932
$$ packed form
9520D6287a61099A36208a90417L4995E1988J07l546d0588k90884B03426h0162
9508a44045n7614j82618J81000A13644a12654r640A52649E5648c94547J63300
9498b31247f9287B89760b79598J29258A63879h7541J8489o7026J6389B1772J46187
9487A67959J5198J01689a57393N805A5037d1976k88576a00686K1415b029p2603
9476g4632r9793m183N1252j74418g008r2659d813m65277K03939L0908J11888C38832
9463f6883j31423e1679j70267p9410D802Q344J97454G3497B1374d63628A69052
9451A57815i0298o044j22261O0583d7922C5811Q0552d8194j25875k06985A20926
9439I0278c10841J32532F2956a58117D4081K61277a58121j45263E1560a2534j4398
$$ plain form
9428 -26932 -209153 -344239 -44633 -188548 -290753 -52362 40349 -67917 85973 -81784 -113889
9417 -113889 -208547 300919 -61270 -107087 -144908 -193801 222771 -82246 38306 -171331 129248
9405 -71002 58170 268670 335458 103550 -2227 -54154 165306 10508 112743 -31234 -125873
9394 -125873 24025 76902 -19390 -254900 125188 -111458 -212999 -46154 -33944 -111923 -108932
9383 -108932 -371736 -361206 -291186 -44965 -156044 -75691 136937 -78652 282564 -428887 135622
9371 -81789 -8217 -263815 -179033 -288121 -198862 110857 260624 260572 -43392 -117744 134209 -122947
9358 -211075 -291231 -226627 15099 -123374 -293061 -296024 -714 -5803 -155905 28744 20461 -284019
9345 67601 71778 -43773 -57957 51331 -82921 -139796 -139298 -206118 66727 -107642 -74663 -107811
$$ packed form
9428b6932j82221j35086d4633j43915j02205e2362D0349f7917H5973h1784l2105
9417a13889r4658C00919f1270m5817l7821m8893B22771h2246C8306a71331A29248
9405g1002E8170K10500O6788A03550b227n1927A65306A0508J02235c1234r4639
9394a25873B4025N2877a9390k35510A25188a11458j01541d6154J2210p7979K991
9383a08932k62804J0530P0020d4965j11079g5691A36937g8652B82564d28887A35622
9371h1789h217k55598Q4782j09088Q9259A10857J49767n2d3392p4352A34209a22947
9358b11075q0156O4604A5099a23374j69687k963g14n089j50102B8744q283b84019
9345F7601M177d3773j4184E1331h2921n6875M98o6820F6727a07642L2979l3148
$$ plain form
9333 -107811 163543 211546 -206374 -123033 55748 24865 209148 167807 27277 70628 96792
9322 96792 -303730 294443 -7693 255553 74163 58781 -118729 126725 200944 -83264 31975
9310 -43520 90607 -90083 -166081 -205102 -183176 -167858 -285724 17699 -179919 -328130 -305247
9299 -305247 2753 -39963 623 144420 125716 18218 11329 -92481 -322530 -268689 -329394 -145073
9286 -50914 -95712 -54491 49523 -161868 99516 229507 -105879 182081 -190664 120241 -97225
9274 -264707 -182583 -44210 -72512 -45591 -107601 162013 -107763 -128016 -159629 -306353 75298
9262 99320 -221880 38533 126822 -149951 -238921 30423 -190386 -207280 -334922 128406 -474268
9250 196643 -154375 13862 -77053 -113095 -179199 -53549 67183 -133146 80950 -106308 -41642
$$ packed form
9333a07811A63543M8003b06374Q3341E5748B4865J84283m1341B7277M3351K6164
9322I6792c03730B94443g693B55553G4163j5382a18729A26725P4219h3264C1975
9310d3520I0607i0083p5998l9021K1926J5318j17866A7699a79919j48211K2883
9299c05247B753c9963F23J43797j8704A8218o889i2481k30049N3841o0705a45073
9286e0914m4798M1221D9523a61868I9516J29991a05879A82081a90664A20241i7225
9274b64707Q2124d4210k8302K6921o2010A62013a07763k0253l1613j46724G5298
9262I9320b21880C8533Q8289a49951q8970C0423a90386j6894j27642A28406d74268
9250A96643a54375A3862g7053l6042o6104e3549F7183a33146H0950a06308d1642
$$ plain form
9238 -169378 -384693 -230548 -9936 -382380 -137775 60602 -13227 32209 -191310 -66700 -462120
9227 -462120 323149 -82252 29648 -89778 -86342 1616 -179016 -137244 -2797 -6427 -228893 227871
9214 -23843 -125905 -268618 -137910 129854 115023 -84158 -16041 -30050 113155 86419 -48947
9202 167965 -82830 80816 -8659 -34040 138998 125356 -186592 105001 -302221 -149371 -152751
9191 -152751 -338275 -91048 -386843 -55105 -74385 159905 207710 176767 263573 -94841 -146471
9180 -146471 -178680 -153217 -30455 -124847 189839 -41922 -159827 -63331 -239222 -278340 -64273
9168 -114335 -336222 115028 168336 -51263 266180 55155 -73703 -235303 70170 -409377 -34454
9156 -49716 -16941 21135 -94472 68712 -298168 -106742 17706 47227 -147783 -27282 -219522
$$ packed form
9238a69378k15315J54145i936l72444a37775F0602a3227C2209a91310f6700l95420
9227d62120C23149h2252B9648h9778L436A616a79016M1772b797l630k22466B27871
9214b3843j02062j42713J30708A29854j4831h4158a6041j4009A13155k6736d8947
9202A67965h2830H0816h659k5381A38998j3642a86592A05001c02221a49371l380
9191a52751j85524i1048k95795e5105j9280A59905M7805l0943Q6806i4841n1630
9180a46471l2209K5463c0455r4392A89839d1922j17905f3331j75891l9118f4273
9168a14335k21887A15028N3308e1263B66180E5155g3703j61600G0170d09377c4454
9156d9716a6941B1135i4472F8712b98168a06742A7706K9521a47783b7282j92240
$$ plain form
9145 -219522 -211794 -32677 -21169 -97888 -65772 -630063 -119972 230049 -87046 -328346 55648
9133 382060 -141751 70480 -71883 183882 -56904 -37453 -566778 120947 27115 140634 -139985
9121 117647 -39954 2942 -12459 89356 -82400 -91848 -15032 -285294 32222 -119685 299785
9109 9042 2538 -26721 -82780 186521 -397301 -290114 -121057 -47261 170327 37703 15343
9097 3611 -167964 -32808 -223312 -179802 33377 -228859 70947 -3636 -124281 5756 43265 -10383
9084 -39683 -147751 48743 -156184 -154129 -55538 -256243 -195583 381414 172774 -116221 -123154
9073 -123154 118911 157945 -300101 -16033 139640 378766 -152606 164166 -58752 -109199
9063 -109199 149980 -118042 63078 20571 -40159 -97653 -65609 80177 -369040 171906 -32311
$$ packed form
9145b19522P728c2677J1508p6719L2116n64291a19972B30049h7046k41300E5648
9133C82060a41751G0480g1883A83882e6904J9451n29325A20947B7115J13519a39985
9121A17647c9954B942a2459H9356h2400r448a5032k70262C2222a19685B99785
9109I042B538b6721n6059A86521c97301J07187a21057d7261A70327C7703A5343
9097C611a67964c2808j90504M3510C3377b28859G0947c636j20645E756L7509a0383
9084c9683j08068D8743a56184K055e5538k00705O0660C81414A72774a16221o933
9073a23154A18911L9034c00101a6033A39640K39126a52606A64166e8752n0447
9063a09199A49980a18042F3078B0571d0159n7494L2044H0177c69040A71906c2311
$$ plain form
9051 -94847 13172 -318550 228504 9875 121010 41400 180440 -99388 -111539 -129032 -336192
9040 -336192 -120431 -266742 -81901 167573 -187585 -318609 -77665 -7454 -376117 20117 -515256
9028 -408387 -63782 -108584 200053 -293880 53646 164231 -78340 -412692 -29506 75485 11839
9016 -74223 100896 -184353 231341 23726 197909 -12487 -174534 140980 61358 53318 -435931
9004 -92818 27784 -354668 83426 -313606 45490 -23899 231300 -191351 -107435 419321 -165101
8992 190118 -309760 131341 -125728 -89047 -141184 -223933 -103924 39830 -129088 -26874 54166
8980 -201257 -232511 -88577 -10992 -35396 -247128 3892 -280193 49901 -77133 -104958 -129951
8969 -129951 -14381 -58999 184215 -8071 220372 -54248 -85606 364580 -276957 -80541 120723
$$ packed form
9051i4847A3172c18550B28504I875J11135D1400J39040i9388j2151j7493k07160
9040c36192a20431j46311h1901A67573a87585j31024g7665g454l68663B0117e15256
9028d08387f3782m4802B00053b93880E3646J10585g8340l34352b9506G5485A1839
9016g4223A00896a84353B31341B3726J74183a2487j62047A40980F1358q040d35931
9004i2818B7784c54668H3426c13606D5490b3899B31300a91351Q3916D19321a65101
8992A90118c09760A31341a25728L6681n2137q2749a03924C9830a29088b6874E4166
8980b01257l1254h8577a0992k4404k11732C892b80193D9901g7133k7825k4993
8969a29951a4381m4618A84215h071B20372e4248l1358C64580b76957h0541A20723
$$ plain form
8957 99361 -205215 12668 51664 74799 -14781 80807 -165233 -215033 32904 -97386 30701
8945 -248499 66169 -219993 14844 166993 -274256 -215284 31593 52719 -135507 -57393 6308
8933 -213876 -6457 -241818 5017 266101 145438 -256601 419450 105279 105142 -150294 -282221
8922 -282221 127898 47518 24273 -86826 135894 483942 -39765 317295 158969 -200141
8911 197468 -47591 -496252 -393376 -25686 -18740 221819 -237677 146739 -110718 23072 -26499
8899 381192 -194106 54524 13357 -167354 -224563 -388742 -138686 -65557 -237998 -205194 -93081
8887 239593 -94520 -304122 44306 -79996 -70522 -87560 -441575 -75083 67980 135689 -249116
8875 -103940 -436915 -142141 -273875 -30610 35829 -105304 239721 -32707 -226766 -52178
$$ packed form
8957I9361b05215A2668L8996K3135a4781H0807a65233m9800C2904i7386C0701
8945b48499F6169b19993A4844J52149b74256N8972C1593K1126a35507e7393F308
8933b13876f457k35361E017K61084j20663b56601D19450A05279j37a50294j31927
8922b82221A27898D7518k3245h6826A35894L48048c9765C17295j58326b00141
8911A97468d7591m48661J02876b5686O946B21819b37677A46739a10718B3072b6499
8899C81192a94106E4524A3357a67354n7209j64179a38686f5557j72441L2804i3081
8887B39593i4520k09602D4306g9996R474j7038l54015g5083F7980O7709b49116
8875a03940l32975a42141j31734c0610C5829a05304B39721c2707j94059e2178
$$ plain form
8864 -109907 39576 -153428 56181 -185592 13011 23917 159049 -267474 -49001 -48920 -10343
8852 32242 113947 -40227 -75916 -16345 -222064 9862 76854 34157 -128280 -2071 200002 -7769
8839 57126 -284469 285776 -159431 190065 96822 328028 14163 82994 -318888 117726
8828 -63706 -116124 -209103 -25944 97399 45237 -123271 76284 -153928 183218 132588 -17741
$$ packed form
8864a09907C9576a53428E6181a85592A3011J0906J35132b67474d9001Q1a0343
8852C2242Q1705d0227l5689a6345k05719I862O6992C4157a28280b071B00002g769
8839E7126b84469B85776a59431A90065r3243K31206A4163O8831c18888A17726
8828f3706n2418r2979b5944I7399D5237a23271G6284a53928A83218n0630a7741
$$ [...]
##END NTUPLES=NMR SPECTRUM
##END=
