##TITLE=NES1022_BrazilUW_9265944_LWrop1z5D7
##JCAMPDX= 6.0         $$ Bruker NMR JCAMP-DX V2.0
##DATA TYPE= NMR SPECTRUM
##DATA CLASS= NTUPLES
##ORIGIN= BRUKER
##OWNER= Administrator
$$ 1.72 TOPSPIN		Version 2.1
$$ 2015-07-09 23:01:53.285 -0700  Administrator@X
$$ Compression mode = diff/dup
##.OBSERVE FREQUENCY= 400.02188249412
##.OBSERVE NUCLEUS= ^1H
##.ACQUISITION MODE= SIMULTANEOUS (DQD)
##.ACQUISITION SCHEME= undefined
##.AVERAGES= 64
##.DIGITISER RES= 22
##SPECTROMETER/DATA SYSTEM= spect
##.PULSE SEQUENCE= noesygpps1d.comp
##.SOLVENT NAME= COFFEE_meoh
##.SHIFT REFERENCE= INTERNAL, COFFEE_meoh, 1, 14.96368
##AUDIT TRAIL= $$ (NUMBER, WHEN, WHO, WHERE, PROCESS, VERSION, WHAT)
$$ ##TITLE= Audit trail, TOPSPIN		Version 2.1
$$ ##JCAMPDX= 5.01
$$ ##ORIGIN= Bruker BioSpin GmbH
$$ ##OWNER= Administrator
$$ $$ E:\/data/COFFEE/nmr/NES1022_BrazilUW_9265944_LWrop1z5D7/12/pdata/1/auditp.txt
$$ ##AUDIT TRAIL=  $$ (NUMBER, WHEN, WHO, WHERE, PROCESS, VERSION, WHAT)
(   1,<2015-07-09 23:01:47.972 -0700>,<Administrator>,<X>,<go>,<TOPSPIN 2.1>,
      <created by zg
	started at 2015-07-09 22:50:18.066 -0700,
	POWCHK enabled, PULCHK disabled,
       configuration hash MD5:
       21 0F 79 D6 B3 7B B4 F6 88 20 88 DB 03 48 BD 9F
       data hash MD5: 64K
       C9 09 66 DB 59 C2 0D BE 4D 5A 04 BF 07 F8 CC 2E>)
(   2,<2015-07-09 23:01:51.144 -0700>,<Administrator>,<X>,<proc1d>,<TOPSPIN 2.1>,
      <Start of raw data processing
       efp LB = 0.3 FT_mod = 6 PKNL = 1 PHC0 = 0 PHC1 = 0 SI = 128K 
       data hash MD5: 128K
       02 29 3C 82 65 5D 3D 18 4B 7F 62 05 27 91 19 E1>)
(   3,<2015-07-09 23:01:52.035 -0700>,<Administrator>,<X>,<proc1d>,<TOPSPIN 2.1>,
      <pk PHC0 = -86.12732 PHC1 = 0 
       data hash MD5: 128K
       32 33 68 87 2C 61 27 F0 9B 82 C2 53 D8 1B EF D6>)
(   4,<2015-07-09 23:01:52.441 -0700>,<Administrator>,<X>,<proc1d>,<TOPSPIN 2.1>,
      <abs ABSG = 1 
       data hash MD5: 128K
       DA 62 3D BB 8C 35 FA C7 64 0C 57 2B 62 59 45 FC>)
(   5,<2015-07-09 23:01:52.550 -0700>,<Administrator>,<X>,<proc1d>,<TOPSPIN 2.1>,
      <abs ABSG = 2 
       data hash MD5: 128K
       38 17 A9 27 25 8F EE BA C4 FA 28 8C F1 28 2E 4D>)
(   6,<2015-07-09 23:01:52.644 -0700>,<Administrator>,<X>,<proc1d>,<TOPSPIN 2.1>,
      <abs ABSG = 3 
       data hash MD5: 128K
       34 65 27 B2 43 F8 A6 1E 55 B0 8B 63 09 F6 A6 00>)
(   7,<2015-07-09 23:01:52.738 -0700>,<Administrator>,<X>,<proc1d>,<TOPSPIN 2.1>,
      <abs ABSG = 4 
       data hash MD5: 128K
       41 D4 A6 46 BF 8F A0 9D 1B D1 53 D2 7C 35 19 DB>)
(   8,<2015-07-09 23:01:52.863 -0700>,<Administrator>,<X>,<proc1d>,<TOPSPIN 2.1>,
      <abs ABSG = 5 
       data hash MD5: 128K
       9C A8 3C 22 D8 53 7F DD F5 9D D1 CD AB 86 EC 2C>)
$$ ##END=
$$ 
$$ $$ hash MD5
$$ $$ F7 DA 97 78 D7 CA 3A 72 02 A1 3C 82 15 24 8F 8D
##$RELAX= 
##$RELAX= 
##$RELAX= 
##$RELAX= 
##$RELAX= 
##$RELAX= 
##$RELAX= 
##$RELAX= 
$$ Bruker specific parameters
$$ --------------------------
##$DU= <E:\>
##$EXPNO= 12
$$ [...]
##$TP07= 0
##$TPNAME0= <>
##$TPNAME1= <>
##$TPNAME2= <>
##$TPNAME3= <>
##$TPNAME4= <>
##$TPNAME5= <>
##$TPNAME6= <>
##$TPNAME7= <>
##$TPOAL= (0..7)
0.5 0.5 0.5 0.5 0.5 0.5 0.5 0.5
##$TPOFFS= (0..7)
0 0 0 0 0 0 0 0
##$TUNHIN= 0
##$TUNHOUT= 0
##$TUNXOUT= 0
##$USERA1= <user>
##$USERA2= <user>
##$USERA3= <user>
##$USERA4= <user>
##$USERA5= <user>
##$V9= 5
##$VALIST= <valist>
##$VCLIST= <CCCCCCCCCCCCCCC>
##$VD= 0
##$VDLIST= <DDDDDDDDDDDDDDD>
##$VPLIST= <PPPPPPPPPPPPPPP>
##$VTLIST= <TTTTTTTTTTTTTTT>
##$WBST= 2048
##$WBSW= 25
##$XGAIN= (0..3)
0 0 0 0
##$XL= 0
##$YL= 0
##$YMAX_a= 7974985
##$YMIN_a= -16564666
##$ZGOPTNS= <>
##$ZL1= 120
##$ZL2= 120
##$ZL3= 120
##$ZL4= 120
##$ABSF1= 14.96368
##$ABSF2= -5.594501
##$ABSG= 5
##$ABSL= 3
##$ALPHA= 0
##$AQORDER= 0
##$ASSFAC= 0
##$ASSFACI= 0
##$ASSFACX= 0
##$ASSWID= 0
##$AUNMP= <proc_prof1d_extract.lims>
##$AXLEFT= 0
##$AXNAME= <>
##$AXNUC= <1H>
##$AXRIGHT= 0
##$AXTYPE= 0
##$AXUNIT= <>
##$AZFE= 0.1
##$AZFW= 0.1
##$BCFW= 0
##$BC_mod= 0
##$BYTORDP= 0
##$COROFFS= 0
##$CY= 15
##$DATMOD= 1
##$DC= 0
##$DFILT= <>
##$DTYPP= 0
##$F1P= 0
##$F2P= 0
##$FCOR= 0.5
##$FTSIZE= 131072
##$FT_mod= 6
##$GAMMA= 0
##$GB= 0
##$INTBC= 1
##$INTSCL= 1
##$ISEN= 128
##$LB= 0.3
##$LEV0= 0
##$LPBIN= 0
##$MAXI= 10000
##$MC2= 0
##$MEAN= 0
##$ME_mod= 0
##$MI= 0
##$NCOEF= 0
##$NC_proc= -2
##$NLEV= 6
##$NOISF1= 0
##$NOISF2= 0
##$NSP= 0
##$NTH_PI= 0
##$NZP= 0
##$OFFSET= 14.96368
##$PC= 1
##$PHC0= -86.12732
##$PHC1= 0
##$PH_mod= 1
##$PKNL= yes
##$PPARMOD= 0
##$PPDIAG= 0
##$PPIPTYP= 0
##$PPMPNUM= 2147483647
##$PPRESOL= 1
##$PSCAL= 4
##$PSIGN= 0
##$PYNMP= <proc.py>
##$REVERSE= no
##$SF= 400.020008566203
##$SI= 131072
##$SIGF1= 0
##$SIGF2= 0
##$SINO= 400
##$SIOLD= 131072
##$SPECTYP= <>
##$SREGLST= <1H.CDCl3>
##$SSB= 0
##$STSI= 131072
##$STSR= 0
##$SW_p= 8223.68421052631
##$SYMM= 0
##$S_DEV= 0
##$TDeff= 65536
##$TDoff= 0
##$TI= <>
##$TILT= no
##$TM1= 0
##$TM2= 0
##$TOPLEV= 0
##$USERP1= <user>
##$USERP2= <user>
##$USERP3= <user>
##$USERP4= <user>
##$USERP5= <user>
##$WDW= 1
##$XDIM= 131072
##$YMAX_p= 416880909
##$YMIN_p= -12774
##$CURPLOT= <Network HP LaserJet P1505>
##$CURPRIN= <$Network HP LaserJet P1505>
##$DFORMAT= <normdp>
##$LAYOUT= <+/1D_H.xwp>
##$LFORMAT= <normlp>
##$PFORMAT= <normpl>
##$SURQMSG= 1
$$ End of Bruker specific parameters
$$ ---------------------------------
##NTUPLES= NMR SPECTRUM
##VAR_NAME=  FREQUENCY,     SPECTRUM/REAL,   SPECTRUM/IMAG
##SYMBOL=    X,             R,               I
##VAR_TYPE=  INDEPENDENT,   DEPENDENT,       DEPENDENT
##VAR_FORM=  AFFN,          ASDF,            ASDF
##VAR_DIM=   131072,        131072,          131072
##UNITS=     HZ,            ARBITRARY UNITS, ARBITRARY UNITS
##FACTOR=    0.0627417313425164, 1,          1
##FIRST=     8223.62146879497, 1844,         -56866
##LAST=      0,             4234,            -56995
##MIN=       0,             -12774,          0
##MAX=       8223.62146879497, 416880909,    0
$$ Real data points
##PAGE= N=1
##DATA TABLE= (X++(R..R)), XYDATA
$$ [...]
67356 171857 172589 174139 176008 177203 177513 177748 178492 179298 179524 179348 179372 179622 179635 179261 178796 178443 178222 178298 178872
67337 178872 179765 180609 181411 182436 183569 184327 184608 184895 185579 186509 187399 188282 189318 190461 191536 192455 193254
67320 193254 194120 195386 197169 198913 199746 199482 198929 198975 199684 200541 201184 201529 201503 201191 201100 201734 202871 203727
67302 203727 203938 204004 204577 205650 206732 207561 208315 209185 210106 210968 211847 212888 214068 215233 216310 217352 218386
67285 218386 219343 220220 221244 222756 224857 227156 228974 229919 230326 231031 232642 235024 237572 239802 241533
67270 241533 242604 242817 242331 241810 241894 242572 243276 243579 243609 243771 244273 244995 245768 246638 247824 249411 251099 252373
67252 252373 252975 253181 253593 254706 256675 259378 262460 265366 267527 268709 269259 269918 271265 273230 275165
67237 275165 276467 277115 277568 278255 279314 280747 282530 284532 286546 288505 290489 292498 294422 296276 298165
67222 298165 299904 301039 301471 301763 302535 303835 305414 307323 309777 312577 315163 317246 318970 320483 321746
67207 321746 322817 323916 325099 326232 327316 328528 329802 330798 331412 331968 332688 333406 334048 335031 336757 338967
67191 338967 341051 342872 344887 347496 350621 353906 356978 359526 361459 363078 364762 366395 367467 367935
67177 367935 368612 370343 372985 375605 377656 379521 381787 384405 386883 389077 391386 394148 397170 399956
67163 399956 402191 403911 405386 406956 408842 410967 413050 415015 417210 420086 423679 427499 430899 433536
67149 433536 435567 437504 439825 442666 445888 449320 452781 455964 458727 461527 465111 469466 473543 476458
67135 476458 478621 481139 484346 487589 490362 492923 495651 498499 501363 504441 507856 511366 514819 518495
67121 518495 522549 526467 529633 532197 534882 538025 541320 544487 547635 550853 553921 556708 559575 563051
67107 563051 567182 571441 575285 578688 582118 586036 590468 595038 599354 603293 607004 610773 614928 619628
67093 619628 624574 629110 632859 636267 640252 645249 650723 655695 659685 663080 666643 670736 675101 679407
67079 679407 683877 689123 695353 701946 708031 713371 718497 723986 729824 735556 740957 746372 752309 758731
67065 758731 764944 770338 775069 779770 784751 789868 795130 800853 807007 812954 818280 823488 829353 835877
67051 835877 842416 848657 854824 861032 867115 873196 879758 886819 893633 899576 904953 910498 916426 922440
67037 922440 928452 934772 941646 949008 956750 964882 973321 981726 989637 996712 1002881 1008395 1013655 1018887
67023 1018887 1024082 1029394 1035379 1042563 1050830 1059575 1068355 1077032 1085300 1092588 1098760 1104624 1111325 1119300
67009 1119300 1128050 1136885 1145618 1154463 1163498 1172369 1180551 1187875 1194819 1202214 1210512 1219369 1228067 1236336
66995 1236336 1244594 1253298 1262311 1271143 1279666 1288213 1296890 1305166 1312547 1319499 1327294 1336812 1347734 1359004
66981 1359004 1369816 1380000 1389772 1399492 1409543 1419993 1430294 1439648 1447875 1455704 1464000 1472928 1482080
66968 1482080 1491174 1500248 1509218 1517745 1525800 1534019 1543089 1552852 1562393 1571110 1579392 1587995 1597020 1605864
66954 1605864 1614098 1621944 1629758 1637491 1644956 1652335 1659955 1667658 1674926 1681733 1688821 1696907 1705917 1715225
66940 1715225 1724346 1733075 1741248 1748840 1756195 1763701 1771196 1778167 1784586 1791119 1798274 1805721 1812769 1819220
66926 1819220 1825310 1831063 1836186 1840679 1845089 1850009 1855528 1861334 1867087 1872523 1877397 1881620 1885424 1889205
66912 1889205 1893186 1897328 1901451 1905277 1908437 1910702 1912296 1913786 1915556 1917526 1919442 1921249 1922958 1924326
66898 1924326 1924944 1924696 1923933 1923164 1922738 1922782 1923177 1923447 1922918 1921217 1918571 1915475 1912223 1908900 1905715 1902995
66882 1902995 1900801 1898786 1896548 1894041 1891535 1889228 1886951 1884245 1880748 1876556 1872158 1867925 1863752 1859272
66868 1859272 1854309 1848961 1843387 1837743 1832272 1827071 1821773 1815829 1809187 1802328 1795498 1788383 1780833 1773456
66854 1773456 1766943 1761047 1754804 1747761 1740350 1733014 1725530 1717576 1709496 1702035 1695442 1689222 1682715 1675626
66840 1675626 1667980 1659875 1651329 1642201 1632217 1621316 1610056 1599405 1589927 1581307 1572897 1564569 1556708
66827 1556708 1549451 1542300 1534657 1526440 1517877 1508949 1499395 1489192 1478718 1468436 1458659 1449582 1441145
66814 1441145 1432782 1423773 1414113 1404782 1396765 1389914 1383011 1374892 1365310 1354842 1344297 1334235 1324782
66801 1324782 1315727 1306837 1298091 1289583 1281258 1272861 1264149 1255130 1246143 1237613 1229620 1221726 1213529 1205250
66787 1205250 1197387 1189715 1181328 1171997 1162798 1154699 1147040 1138405 1128776 1119681 1112071 1105110 1097589 1089585
66773 1089585 1081938 1074749 1067388 1059710 1052359 1045806 1039754 1033616 1027048 1019929 1012362 1004864 998096 992142
66759 992142 986368 980176 973580 966853 960016 952988 945957 939165 932478 925623 918820 912671 907247 901721
66745 901721 895264 888077 881119 874888 868901 862439 855409 848244 841313 834762 828739 823323 818263 813150
66731 813150 807860 802574 797382 792204 787091 782230 777559 772707 767496 762176 756997 751903 746844 741988
66717 741988 737317 732404 726995 721536 716666 712356 707999 703198 698018 692576 686906 681260 676011 671187
66703 671187 666495 661892 657720 654137 650861 647661 644746 642363 640285 637935 634873 631021 626671 622355
66689 622355 618479 614851 610884 606384 601875 597914 594453 591113 587738 584269 580399 575929 571359 567619
66675 567619 565094 563256 561277 558655 555282 551346 547390 544093 541683 539640 537134 533758 529824 526095
66661 526095 523231 521254 519439 516862 513178 508860 504712 501263 498529 496150 493679 490926 488099 485493
66647 485493 483084 480575 477747 474568 471048 467341 463926 461253 459106 456746 453855 450911 448418 446184
66633 446184 443733 441051 438483 436121 433764 431355 429045 426896 424857 422948 421137 419234 417232 415550
66619 415550 414467 413475 411795 409428 407095 405119 403091 400766 398511 396515 394226 391169 387840 385166
66605 385166 383376 381923 380343 378614 376809 374936 373165 371775 370770 369819 368622 367127 365389 363514
66591 363514 361737 360354 359467 358827 357872 355971 352933 349453 346718 345249 344382 343202 341668 340383 339540
66576 339540 338712 337581 336224 334659 332733 330623 328872 327661 326535 325159 323917 323394 323588 323983 324097
66561 324097 323598 322148 319680 316779 314370 312935 312206 311625 310861 309913 308945 308123 307439 306627 305393 303786
66545 303786 302236 301122 300307 299224 297390 294845 292038 289391 287045 285020 283447 282524 282231 282195 281857 280855
66529 280855 279327 277808 276709 275918 275059 274019 272921 271617 269732 267413 265535 264758 264685 264367 263359 261910
66513 261910 260423 259221 258514 258008 256857 254734 252719 252235 253096 253556 252480 250619 249349 248964 248780 248301
66497 248301 247601 246830 245945 244862 243645 242608 242158 242185 241664 239570 236318 233576 232380 232195 232179 232401 233059
66480 233059 233373 232425 230639 229304 228699 227757 225716 223270 221736 221600 222155 222239 221180 219301 217541 216488
66464 216488 215895 215286 214660 214214 213751 212934 211876 210949 210196 209460 208914 208833 209015 209055 209056 209377 209750 209406 208129
66445 208129 206557 205343 204638 204435 204809 205610 206435 207033 207264 206779 205359 203599 202507 202290 202187 201602 200658
66428 200658 199505 197956 196153 194776 194154 193847 193539 193558 193976 194006 193100 192053 192092 193149 193931 193568 192475
66411 192475 191540 191173 191230 191420 191550 191619 191750 191882 191665 190844 189577 188166 186647 184964 183313 181981 180905
66394 180905 179722 178209 176482 174874 173760 173363 173509 173749 173842 173883 173868 173473 172541 171438 170666 170393 170645 171490
66376 171490 172650 173319 172966 172043 171313 170716 169562 167757 166083 165179 164851 164630 164493 164729 165483 166626 167809
66359 167809 168432 167905 166247 164228 162622 161449 160203 158749 157628 157371 157689 157715 157067 156381 156537 157550
66343 157550 158597 158987 158684 157917 156919 156192 156303 156971 156968 155530 153426 151889 150914 149515 147528 146080 145976
66326 145976 146516 146478 145672 144894 144684 144796 144836 144880 145262 146036 146858 147346 147419 147276 147105 146919 146660 146277 145640 144594
66306 144594 143304 142322 142040 142145 141930 141134 140225 139795 139871 139910 139345 138115 136686 135533 134645 133739 132947 132848
66288 132848 133580 134377 134493 134256 134591 135639 136564 136750 136537 136487 136497 136038 134978 133788 133042 132891 132980 132831 132418
66269 132418 132270 132751 133379 133288 132333 131249 130588 130051 129151 128053 127329 127147 127088 126687 125860 124877 124104 123678 123329
66250 123329 122675 121776 121169 121277 122038 123219 124689 126146 126957 126736 125933 125478 125875 126796 127434 127069 125577
66233 125577 123678 122540 122733 123628 124078 123594 122582 121622 120923 120453 120168 119988 119823 119716 119803 120118 120565 121024
66215 121024 121255 120862 119721 118391 117691 117770 117995 117849 117535 117528 117912 118493 119212 120047 120710 120905 120793 120740 120651 119994
66195 119994 118675 117420 116993 117292 117586 117477 117267 117369 117724 117928 117742 117290 116872 116706 116781 116930 117122 117677
66177 117677 118889 120366 121066 120359 118912 118065 118254 118510 117725 116086 114870 115022 116396 118359 120585 122919
66161 122919 124874 125801 125596 124872 124307 124087 124076 124197 124444 124760 125213 126069 127336 128370 128382 127368 126071 124981
66143 124981 123862 122459 121138 120370 119958 119315 118342 117476 116904 116245 115144 113761 112486 111475 110669 110073
66127 110073 109721 109508 109272 109068 109163 109695 110360 110581 110074 109175 108471 108164 108014 107871 107851 107858 107387 106156 104652
66108 104652 103627 103265 103261 103455 103876 104290 104329 104041 103757 103411 102649 101670 101256 101661 102154 102074 101745 101800 102114 102116 101874
66087 101874 102101 103103 104336 105162 105523 105706 105801 105665 105262 104826 104702 105094 105906 106829 107552 107894 107749 107111
66069 107111 106170 105164 104077 102772 101565 101295 102433 104320 105667 105771 104931 103810 102835 102211 102042 102175
66053 102175 102199 101802 101017 100033 98985 98016 97384 97260 97498 97740 97728 97472 97220 97366 98255 99887 101769 103231
66035 103231 103943 104074 103937 103644 103193 102751 102565 102632 102787 103210 104408 106349 107897 107714 105746 103385 102051
66018 102051 102007 102668 103538 104428 105157 105638 106191 107338 109124 110949 112125 112441 112156 111655 111293 111396 112177 113518
66000 113518 114979 116175 117189 118408 119831 120824 120850 120253 119883 119995 120004 119404 118362 117231 115981 114528 113179
65983 113179 112327 111943 111770 111732 111746 111384 110272 108698 107377 106688 106541 106816 107430 107993 107956 107182 106044 104973
65965 104973 104246 104106 104586 105194 105292 104849 104360 104008 103486 102755 102352 102627 103212 103589 103681 103523 102837 101533 100277
65946 100277 99902 100353 100742 100410 99461 98280 97041 95829 94833 94169 93775 93682 94179 95481 97289 98839 99436
65929 99436 98960 97886 96900 96425 96434 96576 96434 95725 94536 93439 93174 93979 95318 96435 97128 97731 98419 98873
65911 98873 98777 98369 98269 98850 99947 101120 101992 102366 102260 101926 101756 102051 102880 104090 105338 106166 106215 105456
65893 105456 104100 102342 100472 99174 99225 100538 101880 102057 101197 100413 100380 100853 101448 102096 102560 102273 101098
65876 101098 99651 98459 97394 96399 96069 96763 97708 97872 97418 97296 97627 97594 96939 96416 96443 96345 95510 94434
65858 94434 93853 93512 92604 91059 89646 88964 88982 89505 90457 91646 92702 93373 93644 93558 93134 92431 91514 90458
65840 90458 89537 89200 89593 90259 90649 90798 91155 91819 92324 92220 91627 91071 90971 91337 91875 92360 92885 93689 94728
65821 94728 95656 96295 96846 97403 97547 96764 95191 93624 92818 92961 93796 94992 96379 97943 99607 101043 101879
65804 101879 102147 102221 102234 101901 101156 100486 100283 100221 99755 98964 98422 98385 98608 98767 98631 98037 97234 96999 97724 98556
65784 98556 98274 96939 95814 95604 95770 95817 96160 97136 98093 98336 98295 98789 99561 99578 98619 97625 97405 97814 98333
65765 98333 98716 98843 98539 97908 97418 97362 97561 97757 97896 97818 97171 96000 95016 94788 94893 94384 92975 91327 90157
65746 90157 89516 88968 88136 86937 85638 84793 84816 85422 85815 85650 85427 85608 85708 84907 83375 82281 82311 82824
65728 82824 82784 81980 80901 79944 79327 79375 80138 80867 80642 79580 78714 78630 78918 79120 79403 79859 79930 79182 78117
65709 78117 77488 77191 76623 75884 75751 76510 77621 78649 79707 80722 80976 79938 78103 76533 75854 76058 76913
65692 76913 78080 78969 79065 78450 77746 77467 77606 77843 77994 78242 78992 80363 81754 82158 81153 79439 78137
65675 78137 77744 78014 78676 79799 81395 83107 84434 85083 85019 84463 83898 83776 83997 83961 83357 82746 83051 84501
65657 84501 86273 87256 87068 86350 86076 86581 87278 87388 86860 86409 86677 87619 88788 89832 90543 90718 90323 89622
65639 89622 88821 87779 86393 85119 84618 84911 85348 85476 85452 85457 85220 84469 83416 82415 81455 80407 79554 79330
65621 79330 79697 80258 80933 81997 83353 84337 84533 84389 84642 85359 85855 85503 84371 83034 81952 81117 80266
65604 80266 79369 78759 78677 78836 78675 78009 77117 76200 75152 74014 73255 73270 73846 74417 74666 74574 74122 73326 72515
65585 72515 72172 72464 73190 74119 75051 75619 75490 74885 74533 74892 75687 76355 76678 76783 76741 76502 76120 75804 75766 76087
65565 76087 76698 77377 77885 78172 78387 78630 78859 79074 79391 79762 79814 79210 78077 76880 75959 75362 75012 74793 74491
65546 74491 73942 73248 72680 72332 72053 71787 71738 72083 72657 73095 73301 73625 74530 76066 77705 78731 78831 78273
65528 78273 77549 76937 76451 76056 75782 75703 75969 76756 78045 79473 80561 81120 81264 81140 80852 80607 80624 80841 81040
65509 81040 81383 82417 84262 86103 86973 86919 86905 87542 88385 88664 88271 87750 87633 88226 89735 92040 94325 95502
65491 95502 95267 94412 93907 93938 94105 94159 94132 93960 93515 93050 93107 93824 94655 94991 94853 94790 95280 96397 97893 99396
65471 99396 100625 101641 102877 104824 107573 110597 112952 113875 113430 112527 112027 111817 111060 109289 106908 104572
65455 104572 102595 101081 100028 98953 97008 94089 91444 90446 90950 91537 91240 90295 89203 87942 86457
65440 86457 85262 84990 85596 86365 86575 85945 84662 83171 81850 80781 79998 79794 80401 81398 81978 81926 81793 81935
65422 81935 82032 81899 82071 82901 83599 83032 81277 79573 78717 78329 77827 77362 77321 77488 77292 76714 76440 77086 78601
65403 78601 80454 82165 83545 84599 85432 86288 87463 88975 90334 90928 90781 90681 91257 92103 92244 91527 91137
65386 91137 92447 95547 99251 102443 105086 107840 111152 115092 119816 125646 132484 139635 146503 153178
65372 153178 160038 167065 173993 180778 187233 192319 194694 194199 192142 189717 186769 182583 177272 171750
65358 171750 166676 162130 158070 154416 150789 146816 142758 139294 136656 134379 131877 128831 125111 120932
65344 120932 117121 114668 113813 113994 114669 115659 116630 116951 116429 115655 115259 115147 114755 113626 111487 108242 104352
65327 104352 100883 98662 97524 96658 95433 93649 91412 89198 87715 87102 86491 84921 82563 80519 79519
65312 79519 79355 79503 79627 79390 78474 77114 76105 75934 76308 76817 77565 78763 80086 80981 81361 81431 81012 79698
65294 79698 77699 75890 74799 74048 73067 71908 70979 70376 69988 69991 70619 71476 71662 70806 69587 69030 69534 70743
65276 70743 72007 72771 72816 72490 72521 73267 74283 74912 75161 75616 76504 77311 77452 77032 76710 77004 77927 79146 80256
65257 80256 80964 81239 81427 82038 83229 84541 85298 85319 84992 84597 83920 82864 82102 82491 83864 85084 85471 85568
65239 85568 86158 87137 87903 88317 88612 88626 87897 86436 84793 83328 81961 80587 79218 77763 76198 74949
65223 74949 74545 74842 75143 75141 75145 75325 75406 75279 75273 75488 75452 74772 73664 72553 71633 71123 71361 72212 72880 72780 72233
65202 72233 71855 71698 71409 70879 70222 69532 69101 69480 70685 71732 71644 70697 69987 69966 70124 69988 69603 68973 67898
65183 67898 66705 66429 67685 69690 70912 70593 69329 68205 67677 67378 66830 66085 65539 65284 65041 64733 64730 65270
65165 65270 66011 66547 67055 68006 69372 70559 71109 71076 70736 70274 69780 69312 68922 68707 68658 68361 67259 65516
65147 65516 64232 64284 65192 65766 65662 65655 66455 67921 69497 70775 71522 71720 71762 72110 72617 72728 72450 72515 73313
65128 73313 74285 74760 74879 75225 75888 76424 76549 76453 76500 76912 77671 78567 79392 80216 81309 82755 84385 86127
65110 86127 88120 90392 92771 95215 97841 100481 102670 104328 106046 108329 110910 113204 115148 117178
65096 117178 119618 122537 125973 129875 133891 137607 140917 143874 146375 148308 149870 151241 152071 151751 150215
65081 150215 148055 145798 143485 140959 138132 134812 130700 125847 120830 116216 112027 107940 103816 99831
65067 99831 96237 93249 90991 89303 87645 85524 83014 80625 78631 76818 75019 73586 72998 73089 73065 72361
65051 72361 71229 70353 70107 70344 70716 70933 70872 70677 70667 70847 70671 69625 67985 66571 65680 64787 63482 62247
65033 62247 61868 62406 63247 63976 64688 65507 66295 66941 67466 67645 66994 65508 64112 63825 64574 65280 65233 64949 65467
65014 65467 67109 69204 70809 71379 70951 70103 69656 69982 70565 70653 70320 70362 70995 71333 70554 69051 67816 67094
64996 67094 66385 65580 65230 65574 66036 66013 65656 65535 65917 66729 67897 69295 70516 71049 70688 69636 68303 67128
64978 67128 66454 66351 66589 66847 66936 66804 66496 66170 66061 66355 67074 67998 68630 68472 67631 66959 67236 68306 69361
64959 69361 69932 70117 69969 69365 68584 68339 68911 69779 70428 70998 71662 71906 71070 69405 67998 67645 68179 68861
64941 68861 69124 68966 68824 69083 69648 70130 70444 70826 71192 70975 69951 68761 68174 68146 68113 67907 67813 67943 68130
64922 68130 68381 68869 69442 69642 69252 68487 67596 66670 65875 65486 65583 65943 66346 66721 67019 67151 67082 66838 66427 65929
64902 65929 65551 65421 65447 65562 65896 66477 66952 66945 66528 66074 65828 65896 66399 67244 68022 68526 69104 69960 70489 70051
64882 70051 69153 69007 69865 70707 70712 70193 69780 69477 69050 68678 68644 68797 68900 69183 70015 71223 72214 72653 72662 72452
64862 72452 72041 71308 70163 68801 67832 67808 68438 68639 67678 66015 64725 64341 64628 65180 65794 66321 66596 66645
64844 66645 66764 67311 68423 69806 70819 71066 70947 71238 71943 72096 71106 69795 69499 70374 71306 71433 71022 70705
64826 70705 70515 70047 69179 68211 67490 67215 67493 68263 69180 69772 69815 69517 69334 69574 70119 70501 70305 69531 68547
64807 68547 67787 67555 67984 68943 69950 70433 70269 69952 70070 70638 71122 71112 70774 70493 70235 69558 68291 66936
64789 66936 66236 66479 67382 68495 69498 70219 70640 70879 70994 70902 70715 70951 71944 73090 73296 72332 71196 70837
64771 70837 71026 70969 70602 70627 71419 72481 73062 72859 72070 71131 70526 70558 71166 72106 73274 74676 76103 77137
64753 77137 77525 77313 76633 75600 74462 73534 72910 72412 71874 71290 70673 70041 69576 69550 69970 70503 70844 70948 70868
64734 70868 70588 70164 69831 69829 70205 70817 71365 71476 71007 70298 69831 69657 69519 69527 70164 71431 72550 72919 72920 73233
64714 73233 73711 73620 72826 72073 72021 72563 73192 73513 73224 72143 70588 69393 69218 69990 71214 72571 73951 75165
64696 75165 75979 76398 76711 77221 77974 78630 78643 77792 76577 75777 75488 75010 73915 72795 72525 73101 73743 74014
64678 74014 74232 74771 75518 76195 76809 77560 78512 79530 80350 80630 80193 79326 78638 78458 78572 78663 78825 79425 80546
64659 80546 81739 82408 82453 82454 83061 84173 85018 85186 85135 85295 85127 83855 81886 80561 80390 80464 79986 79450 79697
64640 79697 80559 81216 81419 81519 81633 81638 81795 82535 83681 84594 85096 85539 86028 86299 86471 87068 88060 88628 88219
64621 88219 87202 86131 84974 83606 82467 82081 82218 82125 81418 80305 79109 78084 77553 77667 77989 77774 76787
64604 76787 75574 74865 74933 75534 76212 76600 76642 76619 76841 77301 77742 78032 78274 78542 78641 78229 77175 75818 74869
64585 74869 74878 75641 76256 75920 74643 73101 71926 71300 71110 71232 71704 72765 74646 77156 79591 81338 82512
64568 82512 83632 84746 85314 85137 84874 85203 85797 85700 84668 83553 83168 83309 83265 82946 82901 83332 83716 83602 83262
64549 83262 83185 83240 82818 81696 80258 78871 77513 76208 75391 75457 76115 76589 76494 76208 76271 76631 76741 76316 75689
64530 75689 75309 75097 74560 73504 72296 71376 70845 70707 71205 72498 74111 75141 75126 74489 74022 74161 74806 75608
64512 75608 76288 76754 77097 77359 77312 76569 75013 73069 71430 70515 70162 69877 69443 69277 69993 71527 72934 73278
64494 73278 72603 71800 71684 72436 73739 75008 75571 75125 74145 73544 73818 74684 75505 75767 75244 74181 73329 73375
64476 73375 74236 75201 75795 76101 76291 76392 76513 76699 76481 75300 73557 72479 72537 72810 72442 71980 72511 74083
64458 74083 75863 77404 78788 79764 79847 79311 79205 80077 81346 82115 82043 81247 80002 78845 78440 78915 79565 79506
64440 79506 78528 77213 76406 76552 77327 77921 77920 77804 78271 79237 80018 80347 80599 80997 81286 81376 81599 82028 82110 81405
64420 81405 80162 78774 77183 75343 73838 73376 73908 74876 76089 77703 79443 80616 81033 81262 81678 81831
64404 81831 81235 80383 80343 81369 82450 82447 81377 80282 80034 80599 81456 82276 82933 83162 82713 81870 81416 81845 82811
64385 82811 83532 83579 83078 82325 81483 80669 80087 79982 80463 81409 82539 83625 84623 85529 86156 86285 86065 86058 86707
64366 86707 87971 89604 91558 93796 95941 97510 98520 99453 100606 101845 103160 104945 107405 110004 112001
64351 112001 113365 114652 116056 117237 118216 119827 122795 126797 130963 135119 139942 145940 152838 160058
64337 160058 167286 174342 180865 186402 190566 192960 193203 191255 187462 182145 175460 167822 160057 152849
64323 152849 146349 140665 136267 133374 131315 129140 126720 124604 122889 120960 118457 115764 113317 111072
64309 111072 109004 107583 107197 107441 107511 107133 106722 106723 107185 107904 108632 109134 109284 109199 109210 109726 111104 113431 116255
64290 116255 118767 120488 121665 122829 124148 125470 126766 128093 129179 129547 129238 129119 130222 132866 136423
64275 136423 139759 141872 142401 141773 140750 139677 138252 136154 133746 131890 131123 131189 131390 131195 130451 129254
64259 129254 127826 126469 125479 125067 125337 126264 127578 128797 129509 129647 129480 129388 129697 130579 131993 133832 136183
64242 136183 139171 142365 144697 145509 145525 146210 148126 150534 152729 155012 157918 161134 163900 166096 168198
64227 168198 170324 172029 173035 173570 173945 174410 175505 177889 181566 185777 189984 194556 200156 206794 213793
64212 213793 220411 226122 230560 233585 235277 235576 234059 230436 225213 219501 214128 209135 204198 199294
64198 199294 194832 191240 188544 186315 183984 181262 178383 175957 174528 174151 174393 174774 175173 175635 175885 175377
64182 175377 173995 172430 171546 171577 172231 173290 174652 175982 176953 177896 179618 182374 185515 188480 191691 196095
64166 196095 202042 209017 216349 223907 232138 241563 252170 263227 273888 284014 294158 304736 315578
64153 315578 326398 337207 347885 357710 365758 371565 375059 376076 374416 370247 364022 356033 346409
64140 346409 335511 323933 312085 300149 288469 277586 267710 258472 249438 240725 232968 226787 222308
64127 222308 219081 216312 213320 209871 206179 202670 199855 198204 197780 197920 197604 196362 194719 193635 193632 194604
64111 194604 196247 198336 200613 202771 204760 206932 209660 212961 216674 220838 225490 230181 234228 237643
64097 237643 241311 245843 250685 254882 258421 262125 266332 270448 273948 277044 280010 282425 283597 283361
64083 283361 282002 279681 276400 272381 268074 263892 260182 257225 254945 252878 250800 249194 248649 248996 249529
64068 249529 249926 250416 251094 251731 252445 253958 256804 260583 264390 267801 271158 275038 279686 285038 291041
64053 291041 297820 305482 313819 322362 330849 339494 348636 358262 368147 378364 389265 400852 412558
64040 412558 423830 434697 445499 456311 466976 477607 488626 500215 512041 523757 535562
64029 535562 547902 560587 572505 582343 589465 594057 596648 597695 597445 595891 592965 589066 585332 582936
64015 582936 581996 581520 580601 579391 578811 579623 582078 586119 591583 598310 606408 616314 628358 642290 657486
64000 657486 673545 690540 708805 728702 750525 774358 800017 827264 856075 886642 919329
63989 919329 954769 993801 1036941 1083915 1133965 1186602 1241959 1300511 1362767 1429254 1500557
63978 1500557 1577289 1660234 1750596 1850099 1960785 2084674 2223565 2379227 2554031 2751503
63968 2751503 2976092 3232352 3524632 3857711 4237384 4669991 5161304 5715615 6335043
63959 6335043 7018763 7762677 8560200 9403688 10285373 11197336 12130638 13073580 14009529
63950 14009529 14916027 15766634 16534825 17197747 17738473 18146738 18418068 18551322 18545873 18400408
63940 18400408 18113919 17687781 17127782 16445729 15660038 14794402 13874650 12925242 11966844
63931 11966844 11015527 10083548 9181152 8318016 7503285 6744717 6048223 5417764 4854662
63922 4854662 4356675 3918481 3533790 3197055 2903354 2647587 2424630 2230132 2060565
63913 2060565 1912525 1782507 1667489 1565355 1474482 1393103 1319293 1251498 1188806 1130638
63903 1130638 1076378 1025463 977602 932588 889951 849244 810692 775016 742229 711092 680279
63892 680279 649772 620564 593214 567383 542729 519511 498104 478430 460167 443155 427378
63881 427378 412844 399608 387659 376728 366477 356893 348119 339939 331894 323963 316611 310033 303876
63868 303876 297937 292614 288317 284888 281998 279723 278298 277521 276853 275993 275084 274438 274241 274357 274253 273331
63852 273331 271504 269284 267152 265129 263053 260908 258583 255634 251658 246717 241214 235571 230191 225431
63838 225431 221261 217194 212850 208438 204451 201128 198385 195988 193495 190350 186434 182356 178902 176358
63824 176358 174562 173259 172077 170484 168250 165830 163894 162618 161755 161126 160587 159736 158255 156534 155441
63809 155441 155382 155881 156116 155565 154191 152387 150759 149696 149138 148891 148966 149244 149047 147616 145041 142246 140008
63792 140008 138389 137141 136145 135247 134112 132592 131024 129953 129710 130291 131427 132556 133002 132417 131067 129638
63776 129638 128783 128780 129346 129765 129434 128415 127361 126912 127277 128305 129637 130737 131100 130653 129878 129446 129792 130913
63758 130913 132364 133480 133932 134159 135064 137150 140088 143161 145993 148850 152420 157288 163396 169995 176351
63743 176351 182541 189333 197271 206181 215619 225468 235939 247230 259374 272110 284770 296525 306940
63730 306940 316068 323753 329113 331136 329700 325682 320003 312828 303773 292745 280432 267968 256107
63717 256107 244782 233593 222674 212812 204586 197756 191757 186560 182584 179874 177825 175832 173831
63704 173831 172076 170771 170123 170392 171470 172629 173164 173260 173905 175914 179332 183728 188625 193560 198233 202971
63688 202971 208699 216032 224615 233759 243496 254414 266458 278535 289570 299522 308960 317861 325231
63675 325231 329798 330813 328258 322584 314407 304310 292804 280379 267514 254683 242439 231408
63663 231408 221955 213813 206324 199202 192900 188130 185162 183657 182965 182472 181898 181470 181674 182705 184284
63648 184284 186063 188000 190244 192934 196283 200540 205618 211068 216696 222982 230507 239189 248376 257531
63634 257531 266484 275282 284206 293770 304261 315334 326465 337580 348646 358714 366116 369893 370638
63621 370638 369709 368007 365739 362950 359894 357029 354867 353715 353339 353038 352158 350507 348278 345760 343095
63606 343095 340083 336220 331175 325270 319217 313405 307780 302373 297385 292589 287264 281149 275072 270183
63592 270183 266771 264288 262306 260899 260085 259455 258609 257749 257644 259007 261937 265870 270094 274355 278973
63577 278973 284423 290970 298706 307676 317819 328965 341030 353994 367476 380580 392431 402725
63565 402725 411476 418454 423286 425994 427004 426658 425215 423385 422349 422959 425224 428803 433668 439937 447355
63550 447355 455363 463627 472181 481047 489988 498595 506366 512720 517275 520130 521610 521620 519507 514688 507162
63535 507162 497213 484857 469887 452426 433212 413306 393653 374895 357448 341672 327918 316247
63523 316247 306076 296391 286608 277172 269088 262966 258695 255905 254315 253581 253183 252669 251962 251377 251402 252347
63507 252347 254000 255764 257412 259594 263170 268136 273745 279727 286791 295688 306329 318163 330905
63494 330905 344429 358340 372229 386149 400340 414582 428174 440352 450392 457605 461711 463056
63482 463056 461917 457833 450244 439719 427861 415902 403920 391563 378885 366201 353625 341171
63470 341171 329061 317656 307289 298284 290872 284933 280075 276152 273384 271821 271056 270739 271063 272411
63456 272411 274767 277857 281741 286850 293448 301383 310431 320604 331930 344080 356524 369059 382060
63443 382060 396060 411224 427347 444205 461502 478445 493871 507132 518481 528185 535612 539811
63431 539811 540879 540097 538598 536459 533243 528924 523961 518915 514384 510968 508800 507076 504360 499485
63417 499485 492180 482975 472585 461363 449311 436558 423553 410670 397910 385386 373786 363796
63405 363796 355169 347021 339139 332384 327653 324973 323846 323894 324837 326353 328412 331366 335374 340101 345332
63390 345332 351452 358867 367278 376016 384878 394176 404243 415342 427776 441565 456070 470467 484550
63377 484550 498686 513035 527133 540172 551336 560016 566110 570067 572296 572693 571116 568146 564873
63364 564873 561967 559472 557435 556099 555299 554270 552373 549619 546132 541442 534799 526035 515714 504396
63350 504396 492084 478594 464260 450012 436715 424611 413531 403398 394215 385718 377558 369956
63338 369956 363685 359095 355557 352269 349328 347438 346781 346677 346394 345733 344828 343862 343194 343305 344256 345432
63322 345432 346110 346212 346340 347144 348733 350649 352311 353439 354029 353999 353121 351434 349484 347870 346668 345543
63306 345543 344335 343226 342333 341446 340178 338239 335691 333114 331372 330859 331100 331372 331577 332071 332839 333448
63290 333448 333817 334370 335181 335602 335104 334042 333154 332693 332545 332911 334233 336445 338769 340421 341242 341601 341929
63273 341929 342506 343477 344837 346340 347554 348129 348110 347918 347943 348185 348472 348946 350016 351747 353604 355084 356316
63256 356316 357741 359324 360593 361496 362716 364862 367594 370021 371921 374130 377641 382595 388374 394361
63242 394361 400293 406108 411950 418330 425790 434235 443076 452219 462439 474339 487368 500451 513349
63229 513349 526781 541270 556575 572363 588740 605781 623070 640174 657200 674371 691300
63218 691300 707209 721929 736232 751098 766879 783291 799959 816745 833509 849720 864392
63207 864392 876515 885529 891277 893520 891729 885519 875227 861861 846471 829671 811760 793153
63195 793153 774565 756763 740247 725252 712000 700787 691795 685007 680426 678169 678090 679580 682169
63182 682169 686347 693303 703611 716478 730513 744930 759664 774619 789439 804126 819376 835860
63170 835860 853286 870470 886368 900850 914433 927498 940035 951963 963290 973713 982371 988318
63158 988318 991194 991177 988325 982345 973027 960528 945035 926509 905164 882106 859070 837395 817414
63145 817414 798879 781668 765873 751381 737778 724851 712992 702887 694804 688422 683315 679360
63133 679360 676558 674727 673638 673272 673634 674371 674908 675008 674929 674961 675089 675204 675408 675912 676782 677847 678704 678728
63115 678728 677402 674891 672105 669909 668314 666670 664568 662244 660113 658242 656466 654815 653532 652777
63101 652777 652523 652782 653676 655181 656953 658733 660862 664165 669140 675450 682333 689372 696658 704325 712237
63086 712237 720216 728322 736712 745183 753024 759447 764329 768485 773045 778442 784151 789433 794081 798280
63072 798280 802111 805658 809404 813966 819366 825031 830614 836410 842757 849500 856384 863690 872077 881906
63058 881906 893060 905316 918578 932807 948037 964591 983063 1003943 1027280 1052797 1080372
63047 1080372 1110335 1143157 1178697 1215925 1253627 1291376 1329541 1368389 1407524 1446288 1484276
63036 1484276 1521273 1557151 1592256 1627562 1663839 1700651 1736629 1770734 1802939 1833606 1862529
63025 1862529 1888609 1910154 1925372 1932916 1932230 1923368 1906459 1881616 1849377 1810904 1767479 1720033
63013 1720033 1669459 1617279 1565602 1516252 1470050 1427005 1387019 1350297 1317278 1288503 1264673
63002 1264673 1246586 1234667 1228522 1227091 1229355 1234838 1243469 1255180 1269796 1287202 1307315 1329780
62990 1329780 1353785 1378291 1402487 1426058 1449070 1471666 1493934 1515999 1537916 1559273 1578990
62979 1578990 1595854 1609329 1619545 1626325 1628477 1624297 1612707 1593709 1567912 1535981 1498558 1456347
62967 1456347 1410046 1360351 1308194 1254883 1201824 1150103 1100343 1052877 1007892 965396 925250
62956 925250 887399 852045 819435 789497 761872 736377 713188 692360 673330 655262 637913
62945 637913 621847 607676 595347 584256 573801 563639 553731 544418 536214 529195 522727 516132 509483
62932 509483 503367 497915 492551 486755 480593 474362 468148 462060 456525 451935 448124 444584 441124 437996
62918 437996 435456 433585 432487 432263 432632 432933 432752 432241 431663 430865 429519 427645 425476 422939 419708 415817
62902 415817 411763 407859 403874 399536 395055 390854 387010 383331 379806 376701 374320 372885 372453 372567 372168
62887 372168 370309 366980 362927 358800 354926 351773 349852 348901 347795 345714 343027 340690 339178 338428 338380
62872 338380 338962 339634 339586 338493 336768 335068 333793 332932 332129 330974 329552 328520 328355 328693 328853 328827 329203
62855 329203 330230 331601 333196 335365 338250 341432 344466 347288 349849 351894 353487 355207 357367 359491
62841 359491 361008 362084 363204 364271 364712 364294 363274 361967 360662 359757 359341 358824 357677 356379 355901 356284
62825 356284 356586 356323 356068 356359 356923 357445 358266 359650 361076 362008 362868 364424 366666 369114 371892 375495
62809 375495 379596 383087 385469 387419 389806 392866 396539 400893 405905 411404 417563 424863 433258 441987
62795 441987 450641 459884 470620 482915 496290 510712 526684 544629 564760 587360 612669 640544
62783 640544 670759 703546 739424 778597 820946 866495 915406 967515 1022339 1079553 1139035
62772 1139035 1200395 1262766 1324983 1385584 1442706 1494505 1539761 1577626 1606796 1625530 1632739
62761 1632739 1628686 1614382 1590627 1557855 1516591 1467877 1413474 1355695 1296580 1236992 1176835
62750 1176835 1116361 1056843 999689 945380 893715 844789 799150 757100 718394 682668 649783
62739 649783 619664 592156 567237 545089 525748 508771 493452 479373 466641 455545 446107 438076
62727 438076 431296 425840 421654 418304 415359 412883 411240 410460 410201 410380 411447 413839 417486 422028 427312
62712 427312 433463 440762 449658 460644 473771 488489 504279 521400 540721 562889 587934 615645
62700 615645 645981 679043 714886 753577 795364 840634 889604 941994 996932 1053152 1109238
62689 1109238 1163750 1215356 1263022 1305921 1342890 1372146 1391973 1401734 1401826 1392616 1373932 1345842
62677 1345842 1309463 1266615 1218934 1167640 1113891 1058890 1003722 949406 896964 847095 799877
62666 799877 755115 712933 673748 637817 605159 575788 549616 526108 504471 484278 465620
62655 465620 448610 433081 418877 406062 394639 384323 374811 366131 358452 351684 345462 339558 334127
62642 334127 329504 325741 322381 318730 314445 309874 305753 302542 300119 298111 296380 295027 293976 292745
62628 292745 290835 288376 286130 284730 284073 283729 283744 284522 285852 286639 286059 284695 284035 284893 286777 288844
62612 288844 290986 293725 297337 301542 306048 311105 317273 324788 333390 342839 353339 365277 378698
62599 378698 393298 408878 425485 443189 462111 482777 506046 532344 561154 591489 622666
62588 622666 654389 686258 717552 747472 775328 800475 822230 839949 853090 861214 863954 861034
62576 861034 852457 838772 821071 800447 777547 752786 726854 700551 674187 647651 621214 595740
62564 595740 571881 549471 527959 506981 486278 465621 445278 426182 409136 394147 380860
62553 380860 369240 359298 350574 342587 335568 330097 326085 322682 319115 315129 310824 306642 303437 301890
62539 301890 301810 302419 303265 304338 305526 306645 308006 310261 313597 317732 322698 328895 336185 343697 350913
62524 350913 358332 366693 376105 386351 397548 409996 423733 438718 455234 473718 494331 516914
62512 516914 541151 566586 592807 619861 648221 678010 708453 738275 766344 791720 813467
62501 813467 830855 843569 851383 853816 850473 841634 828168 810938 790523 767509 742782 717447
62489 717447 692489 668398 645067 622223 600056 579268 560420 543451 528006 513966 501398
62478 501398 490127 479726 470005 461372 454583 449995 447030 444510 441709 438971 437041 435948 435045 434077
62464 434077 433612 434185 435532 437028 438465 439993 441627 443315 445259 447671 450189 451940 452225 450925 448301
62449 448301 444640 440092 434631 428199 421048 413860 407332 401640 396433 391250 385811 380099 374453 369543
62435 369543 365948 363697 362407 361928 362638 364992 368884 373603 378476 383465 389114 395887 403693 412134 421081
62420 421081 430763 441243 452031 462308 471440 479242 485882 491655 496731 500993 504139 505953 506455 505855
62406 505855 504436 502430 499839 496487 492416 488203 484600 481799 479250 476278 472781 469357 466900 466030
62392 466030 466749 468663 471638 476073 482326 490130 498964 508845 520339 533927 549844 568438 589997
62379 589997 614179 640189 667718 697140 728593 761460 795013 828966 862975 896128 927484
62368 927484 956728 983811 1008275 1029359 1046493 1059153 1066560 1068172 1064408 1056459 1045410 1031903
62356 1031903 1016488 999684 981699 962524 942474 922236 902318 882739 863351 844181 825300
62345 825300 806663 788395 771124 755753 742816 732133 723182 715677 709630 704928 701204 698259 696313
62332 696313 695499 695336 695050 694309 693304 692198 690884 689184 686844 683445 678801 673311 667359 660487 651924
62317 651924 641928 631760 622143 612621 602732 592918 583765 575210 567176 560230 554836 550507 546538 543125
62303 543125 540923 539832 539090 538400 538237 539148 541423 545247 550486 556438 562391 568345 574599 580907 586757
62288 586757 592311 598220 604552 610745 616691 623151 630847 639842 649970 661251 673608 686763 700791
62275 700791 716361 734131 754161 776112 799749 825053 852117 881048 911852 944335 978248
62264 978248 1013313 1048815 1083323 1115243 1143590 1167918 1187699 1202293 1211440 1215288 1213989 1207785
62252 1207785 1197402 1183787 1167441 1148569 1127879 1106610 1085658 1065290 1045882 1028290 1013217
62241 1013217 1000671 990277 981700 974620 968809 964501 962160 961618 961863 962019 962177 963002 964940 968077 972411
62226 972411 977832 984082 990989 998553 1006661 1015045 1023727 1033151 1043613 1054908 1066792 1079424 1093031
62213 1093031 1107431 1122311 1137742 1153983 1170958 1188374 1206358 1225603 1246828 1270286 1295871
62202 1295871 1323450 1352978 1384338 1417258 1451459 1486854 1523478 1561159 1599295 1636991 1673132
62191 1673132 1706273 1734832 1757904 1775874 1789939 1801119 1810044 1817483 1824488 1831867 1839983 1849296
62179 1849296 1860832 1875887 1895255 1918697 1944979 1972577 2000645 2029197 2058162 2086525 2112809
62168 2112809 2136217 2156898 2175321 2191956 2207397 2222102 2235963 2248664 2260353 2271355 2281428
62157 2281428 2290179 2298187 2306776 2316488 2326724 2337197 2348730 2362093 2376909 2392418 2408600 2425844
62145 2425844 2444051 2462833 2482192 2502383 2523421 2545265 2568088 2591816 2615813 2639617 2663600
62134 2663600 2688334 2713736 2739503 2765917 2793342 2821225 2848452 2874652 2900344 2925880 2950990
62123 2950990 2975463 2999481 3023063 3045706 3066812 3086083 3103446 3119025 3133279 3146759 3159589
62112 3159589 3171487 3182305 3192233 3201578 3210704 3220066 3229772 3239125 3247224 3254146 3261101 3269340 3279414
62099 3279414 3291594 3306354 3324034 3344464 3367368 3392874 3421251 3452192 3484542 3516552 3546347
62088 3546347 3572537 3594845 3614169 3631868 3648882 3665359 3680681 3693559 3702343 3705678 3703083 3694981
62076 3694981 3682354 3666377 3648015 3627582 3604700 3578855 3549962 3518310 3484215 3448042 3410507
62065 3410507 3372476 3334314 3295713 3256334 3216303 3175789 3134401 3091520 3047159 3001978 2956370
62054 2956370 2910131 2863328 2816866 2771687 2727776 2684652 2642603 2602628 2565106 2529255 2494152
62043 2494152 2459664 2426056 2393295 2361274 2330367 2301116 2273473 2246795 2220600 2195019 2170494
62032 2170494 2147256 2125134 2103734 2082732 2062033 2041637 2021518 2001805 1982947 1965302 1948623
62021 1948623 1932438 1916993 1903264 1891817 1882260 1874165 1867927 1864128 1862539 1862459 1863827 1867235 1872886
62008 1872886 1880102 1887867 1895218 1900894 1903050 1899659 1889116 1870615 1844380 1811673 1774294 1733786
61996 1733786 1691116 1647042 1602559 1559003 1517702 1479379 1443784 1410218 1378669 1350152 1325533
61985 1325533 1304351 1285255 1267409 1250901 1235891 1222125 1209384 1197799 1187452 1178136 1169803 1162771
61973 1162771 1157185 1152609 1148543 1145101 1142804 1141912 1142344 1144136 1147604 1152988 1160237 1169282 1180325 1193684
61959 1193684 1209368 1227001 1246271 1267443 1291216 1318034 1347685 1379767 1414374 1452002 1492814
61948 1492814 1536354 1582114 1630092 1680636 1734008 1790376 1850048 1913334 1980152 2050201 2123684
61937 2123684 2201565 2284796 2373481 2467302 2566838 2673997 2790871 2918539 3057593 3209730
61927 3209730 3378314 3567294 3780037 4019364 4288153 4589388 4925712 5299289 5711987
61918 5711987 6165308 6659924 7195148 7768360 8374105 9002803 9639427 10262594 10844691
61909 10844691 11353509 11755507 12020369 12126280 12064611 11841897 11477683 10999568 10438409
61900 10438409 9825156 9188336 8551503 7931775 7340474 6784732 6268390 5792216 5354591
61891 5354591 4952878 4584630 4248148 3942347 3666037 3417172 3193124 2991814 2812046
61882 2812046 2652336 2509963 2381933 2266655 2163954 2073539 1994173 1924402 1863363 1810519
61872 1810519 1765058 1726038 1692981 1666030 1645363 1630477 1620129 1613230 1609837 1610961 1617216 1628008
61860 1628008 1642246 1659365 1679190 1701224 1724768 1749507 1775313 1801458 1826636 1849797 1870456
61849 1870456 1888189 1902465 1913207 1921161 1927574 1933751 1940823 1949403 1959332 1970108 1981663 1994374
61837 1994374 2008286 2022707 2036642 2049310 2060205 2069013 2075607 2079931 2081974 2082182 2081778 2082235 2084484
61824 2084484 2089008 2096553 2108155 2124446 2145512 2171519 2202898 2239765 2281658 2328098 2379040 2434715
61812 2434715 2495541 2562397 2636509 2718840 2809912 2910302 3020891 3142524 3276036 3422922
61802 3422922 3585526 3766299 3967246 4190340 4438090 4713480 5019865 5361314 5742645
61793 5742645 6168604 6643113 7169646 7752149 8395293 9103751 9881103 10728951 11646546
61784 11646546 12630591 13674149 14763844 15876513 16977462 18020994 18952554 19712928
61776 19712928 20246003 20509018 20480967 20165546 19589028 18795125 17837776 16772767 15650797
61767 15650797 14514229 13396653 12322910 11309144 10364080 9491456 8692079 7964707 7306392
61758 7306392 6712874 6178971 5699043 5267637 4879890 4531383 4217974 3936178 3683460
61749 3683460 3457628 3255892 3074832 2911291 2763009 2628436 2506289 2395418 2294894
61740 2294894 2204043 2122362 2049269 1983872 1925135 1872372 1825417 1784135 1747897 1715755 1686995
61729 1686995 1661344 1638607 1618138 1598518 1577830 1554559 1528431 1500248 1470960 1441172 1411460
61718 1411460 1382475 1354393 1326689 1298863 1271168 1244372 1219134 1195864 1174745 1155440 1137101
61707 1137101 1119155 1101936 1086172 1072074 1059260 1047272 1035778 1024521 1013553 1003284 993913
61696 993913 985067 976422 968330 961205 954552 947317 939073 930238 921194 911950 902697 893918 885723 877711
61682 877711 869742 862285 855734 849874 844319 838990 833838 828537 822909 817300 812119 807192 801959 796167
61668 796167 789997 783672 777341 771295 765900 761173 756684 752027 747302 743050 739702 737131 734731 731927
61654 731927 728655 725326 722325 719574 716537 712662 707813 702358 696912 692008 688030 685256 683772 683382
61640 683382 683849 685306 688245 693038 699706 708184 718483 730415 743449 757081 770983 784477 796233
61627 796233 805057 810763 813741 813772 809941 801884 790579 777693 764456 751377 738635 726426 715051
61614 715051 704784 695564 686868 678203 669792 662468 656772 652480 649103 646417 644290 642388 640453 638629
61600 638629 637117 635668 633835 631665 629831 629001 629274 630184 631063 631463 631594 632446 635262 640653 648181 656788
61584 656788 665623 674612 684447 695972 709470 724476 740435 757485 776430 797894 821661 846854
61572 846854 872622 898547 924591 950743 976696 1001732 1025070 1046429 1066269 1085359 1104176
61561 1104176 1122741 1140938 1158845 1176793 1195241 1214590 1234990 1256324 1278418 1301210 1324594
61550 1324594 1348242 1371753 1394828 1416957 1436941 1453171 1464638 1471454 1474256 1473384 1468857 1460853
61538 1460853 1449848 1436424 1421271 1405286 1389353 1374073 1359977 1347800 1338189 1331183 1326400 1323737
61526 1323737 1323599 1326465 1332620 1342347 1355935 1373433 1394778 1420283 1450606 1486128 1526836 1573038
61514 1573038 1625733 1685918 1753987 1830297 1915964 2012419 2120224 2238939 2368395 2509676
61504 2509676 2664596 2834449 3019593 3219988 3435516 3665277 3906565 4154618 4403124
61495 4403124 4644484 4869611 5068289 5230888 5350401 5423341 5449461 5431327 5373908 5283661
61485 5283661 5167427 5032027 4884334 4730692 4575897 4423124 4274920 4133712 4001250
61476 4001250 3878290 3765262 3662743 3570849 3488704 3415097 3349529 3292336 3244197 3205828 3177669
61465 3177669 3159323 3149607 3147592 3153220 3166360 3185599 3208663 3233874 3260648 3288740 3317613 3346559
61453 3346559 3374981 3402630 3429968 3458112 3487954 3519525 3552732 3588468 3628224 3672729 3721713
61442 3721713 3775019 3832950 3895112 3959605 4023945 4086436 4146169 4201928 4251611 4292783 4323593
61431 4323593 4343198 4351450 4348335 4333848 4308472 4273501 4230619 4181371 4127418 4071127 4015287 3962064
61419 3962064 3912484 3866895 3825492 3788248 3754715 3724144 3695824 3669492 3645795 3626260 3612351
61408 3612351 3604405 3601746 3603706 3610052 3620450 3634033 3649582 3665665 3680575 3692929 3702743 3711362
61396 3711362 3719938 3728401 3736429 3744985 3756362 3772945 3796507 3828499 3870431 3923852 3990406 4071943
61384 4071943 4170216 4286300 4420601 4573462 4745498 4937088 5147652 5375445 5617759 5870963
61374 5870963 6130218 6389181 6639986 6873535 7080123 7250507 7377414 7456891 7488574 7474548
61364 7474548 7417775 7321377 7188953 7024861 6833737 6619832 6387057 6139661 5882664 5621545
61354 5621545 5361490 5106769 4860506 4624872 4401590 4192345 3998642 3821238 3659871
61345 3659871 3513805 3382639 3266455 3165223 3078376 3005063 2944496 2895801 2857859 2829756
61335 2829756 2811345 2802909 2804238 2814298 2831838 2855907 2885700 2920298 2958752 3000174 3043645 3088319
61323 3088319 3133665 3179234 3224093 3266918 3306691 3342695 3373627 3397479 3413028 3421161 3424246 3424425
61311 3424425 3422973 3420921 3419485 3419676 3421782 3425251 3428951 3431793 3433336 3433519 3431666 3426224 3415865 3400286
61297 3400286 3379444 3352657 3319328 3280230 3237220 3191789 3144678 3096737 3049251 3003308 2959569
61286 2959569 2918676 2881164 2846966 2815781 2788038 2764775 2746512 2733051 2724445 2721148 2722718 2727167
61274 2727167 2732059 2735625 2736478 2733128 2724611 2711225 2694124 2674562 2653919 2633861 2615712 2599964
61262 2599964 2586979 2577916 2574425 2577681 2588328 2607189 2635360 2673541 2721742 2779694 2847193 2924067
61250 2924067 3010156 3105435 3209940 3323535 3445871 3576206 3712678 3851419 3986492 4110756
61240 4110756 4216748 4297185 4345551 4357281 4330942 4268489 4174418 4054610 3915664 3764532
61230 3764532 3607874 3451166 3298385 3152475 3015759 2889680 2774513 2669835 2575247 2490374
61220 2490374 2414313 2345534 2282348 2223239 2166933 2112692 2060732 2012109 1968102 1929697 1897314
61209 1897314 1870489 1847798 1827411 1807804 1787821 1766467 1743299 1719041 1695358 1673791 1655021
61198 1655021 1638839 1624321 1610159 1595352 1579653 1563118 1545556 1526893 1507723 1488787 1470111
61187 1470111 1451375 1432852 1415119 1397983 1380726 1363398 1346841 1331341 1316365 1301832 1288478
61176 1288478 1276530 1265176 1253980 1243882 1236068 1230742 1227746 1227512 1230453 1236053 1243452 1252358 1262339
61163 1262339 1271585 1277294 1277281 1270713 1257755 1239438 1217661 1194461 1170983 1147513 1124247 1101609
61151 1101609 1079986 1059681 1041002 1024084 1008795 995036 982732 971264 959554 947280 935504
61140 935504 925434 916990 909315 902258 896445 892100 888671 885651 883071 881087 879660 878706 878091 877489 876710
61125 876710 876293 877358 880727 886184 892413 897581 900414 900968 899944 897056 890721 879917 865726 850296
61111 850296 834776 819065 803184 787799 773446 760106 747650 735979 724712 713414 702219
61100 702219 691675 681977 672932 664621 657381 651061 644967 638690 632458 626550 620957 615846 611762 609113
61086 609113 607778 607404 607825 608992 610816 613244 616350 620321 625416 631793 639188 647038 655179 664080 673967
61071 673967 684095 693502 702152 710638 718946 726416 732987 739619 747154 755391 763669 771788 779968 788264
61057 788264 796447 804234 811288 817170 821674 825214 828609 832417 836569 840664 844502 848119 851360 853759
61043 853759 855101 855920 857054 858778 860795 862910 865192 867444 869162 870151 870729 871285 872321 874856 879852
61028 879852 886978 894876 903042 912458 923927 936884 950593 965544 982746 1002462 1024538 1049190
61016 1049190 1076563 1106216 1138023 1172823 1211261 1252879 1297436 1346175 1400473 1460091 1524296
61005 1524296 1593928 1670563 1754000 1842157 1933189 2026396 2121691 2220134 2324791 2439334 2565802
60994 2565802 2705093 2858984 3029609 3217314 3421366 3643211 3887715 4162100 4476290
60985 4476290 4844002 5280387 5797845 6406104 7115888 7939986 8892672 9994440 11279816
60976 11279816 12798450 14610650 16784661 19378605 22373336 25572947 28572567 30885440
60968 30885440 32182196 32464162 32035553 31323636 30711120 30468403 30726788 31416418 32214224
60959 32214224 32620413 32182101 30719593 28385885 25537122 22542750 19668855 17061480
60951 17061480 14777172 12814997 11142255 9716670 8499983 7460716 6573189 5817701
60943 5817701 5179209 4643184 4193254 3813056 3488633 3208519 2963459 2747138 2555879
60934 2555879 2386607 2235945 2101494 1982410 1877917 1786349 1706247 1636965 1577145 1523550
60924 1523550 1472550 1422319 1372998 1325436 1280498 1238962 1201130 1166634 1135006 1106120 1079786
60913 1079786 1055397 1032342 1010402 989490 969421 950119 931545 913270 894716 875979 857758
60902 857758 840298 823195 806543 791374 778453 767435 757738 749466 742650 736374 729659 722852 717094
60889 717094 712576 708269 703399 698355 693908 690282 687334 685155 683967 683663 683867 684462 685812 688338 691972
60874 691972 696206 700733 705813 711907 719047 726816 734859 743059 751268 759258 767098 775178 783606 791809
60860 791809 799023 805050 810376 815611 820993 826412 831800 837468 843924 851232 858628 865048 870018 873766
60846 873766 876531 878150 878498 877898 876819 875294 872837 868803 862694 854412 844526 834235 824799 816844
60832 816844 810143 803992 797790 791410 785147 779267 773653 768046 762546 757674 753873 751221 749711 749543
60818 749543 750844 753131 755308 756356 756121 755394 755085 755229 754950 753493 751087 748579 746499 744939 744174 744756
60802 744756 746784 749562 752302 754839 757353 759756 761882 764179 767672 773020 779825 786990 793617 799501
60788 799501 804980 810514 816332 822266 827795 832392 835949 838876 841781 845079 848949 853460 858503 863644
60774 863644 868310 872179 875186 877171 877876 877468 876607 875589 873652 869640 863307 855582 847452 839009 829751
60759 829751 819505 808700 797915 787475 777536 768284 759846 752063 744571 737149 729839 722622 715225
60746 715225 707488 699823 692920 686984 681603 676443 671729 667904 665167 663593 663366 664552 666813 669674
60732 669674 672899 676354 679703 682580 684985 687175 689190 690708 691309 690647 688453 684563 678959 671652 662648
60717 662648 652148 640642 628694 616761 605287 594638 584784 575341 566144 557401 549122 540887 532608
60704 532608 525099 519311 515319 512559 510704 509591 508616 507083 505209 504020 504100 505038 506186 507360 508631
60689 508631 510068 511925 514562 517908 521419 524815 528436 532740 537890 544038 551467 560154 569598 579451
60675 579451 589921 601249 613171 625304 637754 650893 664721 678848 692919 706668 719677
60664 719677 731544 742342 752575 762554 771951 780091 786718 792484 798582 805679 813189 819824 824837
60651 824837 828363 830481 830512 827685 822241 815361 808034 800351 791857 782167 771136 758828 745621 732261
60637 732261 719587 708154 698058 689008 680551 672454 665011 658811 654010 649969 645900 641832 638605
60624 638605 636819 636237 636351 637140 638830 641306 644336 648153 653107 658812 664457 670083 676750 685045 694213
60609 694213 703273 712340 722169 732943 744271 755974 768014 779838 790654 800270 808984 816645 822529
60596 822529 826066 827038 825057 819722 811464 801564 791019 779882 767875 755111 742024 729140 717117
60583 717117 706476 696977 687715 678167 668758 660165 652419 644934 637083 628637 619976 612016 605440 599849
60569 599849 594130 587926 582253 578390 576621 576319 576744 577352 577755 577968 578505 579848 581903 584186 586356 588376
60553 588376 590417 592738 595348 597686 599152 600170 602153 606037 611349 617234 623926 632480 643346 656021
60539 656021 670149 686349 705731 728954 755906 786133 819565 856950 899399 947178 998993
60528 998993 1052639 1106149 1157982 1206179 1247778 1279291 1297760 1301748 1291892 1270795 1242152 1209638
60516 1209638 1176291 1144404 1115485 1090155 1068323 1049637 1033812 1020544 1009291 999342 990267 982358
60504 982358 976508 973540 973755 977183 984050 994758 1009651 1029186 1054114 1084931 1121206 1162037 1207238
60491 1207238 1257373 1312312 1370266 1428486 1484351 1535512 1579848 1616321 1645947 1671506 1696558
60480 1696558 1725049 1761367 1809755 1873329 1954076 2053836 2174917 2319607 2489392 2684816
60470 2684816 2905782 3151445 3418899 3700844 3983688 4248087 4472324 4636552 4725717 4730942
60460 4730942 4650487 4490512 4264699 3992052 3693355 3387408 3088461 2805801 2544986 2309005
60450 2309005 2098525 1912154 1747638 1603095 1477032 1367705 1273184 1192013 1123132 1065053
60440 1065053 1015664 973131 936600 905707 879670 857175 837099 819011 802907 788571 775482
60429 775482 763408 752828 744315 737483 730960 723626 715523 707351 699539 692290 686176 681975 679933 679634
60415 679634 680590 682459 684694 686550 687679 688387 689082 689798 690428 691099 691984 692966 693802 694533 695462 696740 698243
60398 698243 699939 702204 705555 710126 715563 721463 727730 734361 741062 747380 753195 758820 764560 770309
60384 770309 775542 779478 781281 780522 777621 773575 769076 764103 758506 752673 747336 742952 739493 736656
60370 736656 734100 731708 729843 729098 729557 730574 731561 732690 734489 737093 740386 744588 750016 756229 762046
60355 762046 766691 770520 774429 778878 783698 788559 793183 797139 799773 800632 799950 798533 796994 795146 792420
60340 792420 788851 785321 782674 780945 779738 779071 779365 780727 782726 785041 787987 792100 797331 802823 807573
60325 807573 811236 814191 816851 819084 820437 820741 820171 818864 816893 814647 812725 811260 809763 807919 806107
60310 806107 804864 804200 803833 803716 803875 803982 803604 802712 801558 800143 798291 796150 794172 792550 791040 789317
60294 789317 787230 784784 782202 780012 778731 778425 778824 779920 782161 786004 791424 797966 805192 813114 822189
60279 822189 832737 844350 856109 867464 878559 889606 900398 910814 921397 932879 945341
60268 945341 958291 971431 984925 998997 1013711 1029179 1045647 1063353 1082429 1102877 1124546
60257 1124546 1147394 1171907 1198848 1228339 1259745 1292892 1328913 1369242 1414163 1463063 1515872
60246 1515872 1573469 1636784 1706258 1782157 1864709 1953834 2049257 2150840 2258200 2370039 2484530
60235 2484530 2600365 2716684 2831964 2943782 3049881 3148689 3238558 3317347 3383308 3435884
60225 3435884 3475221 3501440 3514799 3516035 3505972 3485148 3454410 3415727 3371986 3326144 3280813
60214 3280813 3238337 3200673 3169145 3144697 3128502 3122213 3127524 3145530 3176468 3220095 3276330 3345387
60202 3345387 3427124 3520495 3623902 3735865 3854895 3978832 4104745 4229438 4349550 4461216
60192 4461216 4560473 4644419 4711632 4761298 4792362 4803763 4794978 4766014 4717310 4650160 4567108
60181 4567108 4471653 4367626 4258873 4149115 4041794 3940127 3847290 3766128 3698453 3644981
60171 3644981 3606129 3582547 3574751 3582718 3606153 3644691 3697338 3761952 3835625 3915383 3998137 4080245
60159 4080245 4157729 4227140 4286101 4333173 4367573 4389082 4397950 4394665 4379820 4354278 4319576 4278180
60147 4278180 4233165 4187521 4143918 4105263 4075102 4056941 4053167 4064988 4093302 4139259 4204095
60136 4204095 4289086 4395685 4525092 4677529 4852434 5049544 5269305 5512073 5777543 6065077
60126 6065077 6373790 6701728 7045346 7400096 7761088 8122905 8479429 8824397 9151694
60117 9151694 9454835 9726975 9962317 10157234 10309457 10416641 10476445 10487666 10450424 10365509
60107 10365509 10234478 10060349 9847356 9599950 9322958 9022989 8708926 8390423 8076077
60098 8076077 7772879 7486478 7221242 6980399 6766637 6582410 6429354 6307757 6217159 6157436
60088 6157436 6128874 6131102 6162341 6219805 6300376 6400464 6515306 6638811 6764290 6885188
60078 6885188 6995253 7088620 7160426 7207484 7228224 7222094 7189309 7131040 7049337 6946587 6825147
60067 6825147 6687354 6535527 6371922 6199079 6020349 5839758 5661212 5488070 5323392
60058 5323392 5170024 5030255 4905885 4798814 4711020 4643563 4596224 4568630 4561282 4574907 4609183
60047 4609183 4662771 4734392 4823090 4927395 5044777 5171951 5305208 5440362 5572835 5697999
60037 5697999 5811345 5908592 5986231 6042044 6074723 6082925 6065217 6021052 5951419 5858347 5744192
60026 5744192 5611704 5464530 5307294 5145084 4982798 4824681 4674191 4534235 4407414
60017 4407414 4295945 4201471 4125110 4067607 4029161 4009282 4007330 4023374 4058173 4112141 4184678
60006 4184678 4274786 4382083 4506853 4649171 4808258 4982444 5169143 5364403 5562561 5756698
59996 5756698 5939793 6105732 6249668 6367948 6458091 6518840 6549987 6551829 6524614 6468452 6383824
59985 6383824 6272455 6137908 5985344 5820559 5649195 5476749 5308789 5150479 5005655
59976 5005655 4876633 4765012 4672255 4599345 4546338 4512749 4498353 4503414 4528281 4573064 4637470
59965 4637470 4720459 4819831 4932335 5054262 5181994 5312113 5441247 5565894 5682400 5787346
59955 5787346 5878203 5953631 6013088 6056327 6083567 6096009 6095877 6085809 6068456 6046697 6023971 6004181
59943 6004181 5991353 5989516 6002722 6034869 6089310 6168733 6275538 6412238 6581261 6784203 7021413
59932 7021413 7292457 7596850 7934067 8302638 8699132 9117684 9550155 9986523 10415034
59923 10415034 10821894 11190993 11504787 11746744 11904098 11969375 11940560 11820928 11618765 11346388
59913 11346388 11018486 10650673 10258601 9857030 9458758 9074140 8711319 8376423 8073447
59904 8073447 7804584 7571168 7374225 7214176 7090558 7002490 6949248 6930182 6944415 6991009
59894 6991009 7069206 7178087 7315750 7478754 7662104 7859633 8064524 8269460 8466250 8645752
59884 8645752 8798907 8918112 8997412 9031854 9017804 8954383 8843914 8690549 8499019 8274953
59874 8274953 8025243 7756869 7475471 7185641 6892226 6600568 6315677 6041851 5782884
59865 5782884 5541807 5320366 5119433 4940005 4783293 4649793 4538879 4449506 4380872 4332188
59855 4332188 4302164 4288802 4289288 4299654 4314589 4327783 4332854 4324527 4299604 4257233 4198668 4127099
59843 4127099 4047363 3964667 3882695 3802936 3725946 3652627 3583913 3519982 3460782 3407202 3360991
59832 3360991 3323665 3296102 3279023 3273136 3278819 3296179 3325318 3365928 3416750 3475944 3541688 3611416
59820 3611416 3680592 3743344 3795007 3833817 3860388 3876523 3884773 3888102 3888978 3888810 3888330 3888226 3889400
59807 3889400 3893453 3903405 3923466 3957569 4008320 4077420 4166525 4277328 4411399 4570596 4757368
59796 4757368 4974141 5222506 5503388 5817502 6164381 6539582 6931640 7320529 7678584
59787 7678584 7974032 8176857 8265728 8233704 8090005 7856605 7561387 7231721 6891050 6557804
59777 6557804 6244802 5959127 5703604 5479157 5285879 5122609 4986947 4876508 4789717 4725072
59767 4725072 4680272 4652727 4640595 4642838 4658553 4686890 4727542 4780823 4847163 4926740 5019561
59756 5019561 5125781 5246016 5381514 5533919 5704731 5895007 6105481 6336780 6589653
59747 6589653 6865452 7166412 7494869 7851888 8237105 8650236 9092201 9564175 10065564
59738 10065564 10593088 11141180 11702361 12267060 12823691 13359544 13862236 14321427 14730610
59729 14730610 15088362 15398500 15669431 15913284 16144684 16378820 16629524 16908491 17225455
59720 17225455 17587972 18000371 18463081 18973208 19525592 20112870 20724469 21345969 21959868
59711 21959868 22547404 23090308 23572118 23979304 24302369 24536507 24681634 24742282 24727783 24652237
59701 24652237 24533494 24391209 24245010 24113457 24013626 23960828 23968371 24047466 24207302 24455109
59691 24455109 24796098 25233244 25767131 26396044 27116123 27921035 28801025 29741837 30723719
59682 30723719 31720309 32697588 33614199 34424035 35080398 35540574 35770616 35750286 35476618
59673 35476618 34964215 34242343 33350788 32335608 31244317 30120418 28998450 27900672
59665 27900672 26835368 25796974 24769159 23731431 22667483 21571861 20452039 19325344
59657 19325344 18212871 17133829 16102652 15128540 14215862 13364941 12573629 11839153 11158886
59648 11158886 10529916 9948831 9412412 8918234 8464319 8048531 7668548 7322114 7006955
59639 7006955 6720702 6461246 6227110 6017219 5830367 5665029 5519570 5392460 5282355
59630 5282355 5188012 5108056 5040795 4984468 4937590 4898611 4865087 4833569 4800667 4764037 4722143
59619 4722143 4673469 4616552 4550771 4476611 4395011 4306838 4213281 4116529 4019576 3925119 3834661
59608 3834661 3748700 3667570 3591968 3522876 3461293 3407971 3363076 3326048 3296115 3273029 3256923
59597 3256923 3247435 3243561 3244695 3251204 3263418 3280384 3300252 3321573 3343649 3365913 3387868 3409685
59585 3409685 3432163 3455907 3481099 3508206 3538389 3573042 3613345 3660254 3714433 3775978 3844707
59574 3844707 3920897 4005449 4099377 4203576 4319087 4447004 4588048 4742747 4912043 5097137
59564 5097137 5298607 5516247 5749698 5998419 6260812 6534185 6815939 7103989 7395576
59555 7395576 7686419 7971635 8246934 8508444 8752132 8974424 9173223 9347803 9498110
59546 9498110 9624888 9730025 9815537 9881707 9926741 9948840 9949022 9932503 9907924 9885231 9873650
59535 9873650 9880779 9912518 9972900 10063673 10184189 10331434 10499387 10678239 10855050 11015877
59525 11015877 11147349 11236880 11273152 11247818 11156690 10999028 10776439 10493256 10157333 9779280
59515 9779280 9370601 8942623 8506320 8071759 7647273 7239460 6853706 6494085 6162934
59506 6162934 5861255 5589592 5347945 5135025 4948489 4786317 4647555 4531682 4437782 4364662
59496 4364662 4311461 4277858 4263773 4268972 4292925 4335119 4395587 4474925 4573610 4691458 4827884
59485 4827884 4982364 5154326 5342934 5547292 5766436 5998486 6239871 6485734 6730695
59476 6730695 6968559 7191498 7390468 7556868 7683654 7765239 7797252 7776984 7703984 7580279
59466 7580279 7410352 7200845 6959699 6695049 6414598 6125443 5833853 5545158 5264077
59457 5264077 4994850 4740556 4502462 4280620 4075066 3885956 3712793 3554437 3410134
59448 3410134 3279933 3163837 3061170 2971040 2892813 2825652 2768102 2718715 2676894 2642641 2615665
59437 2615665 2595153 2580312 2570716 2566049 2565856 2569666 2577172 2588144 2602130 2618247 2635348 2652563
59425 2652563 2669874 2688133 2708506 2731976 2759362 2791468 2828642 2869881 2912550 2953599 2991663
59414 2991663 3028357 3067580 3113475 3168831 3234991 3312760 3403138 3507204 3625336 3756447 3898137
59403 3898137 4048056 4205701 4373302 4555322 4757069 4983169 5236592 5518880 5831568
59394 5831568 6177306 6559165 6978976 7436950 7932967 8467211 9038690 9643217 10273006
59385 10273006 10917571 11564449 12199761 12809651 13382317 13909317 14385788 14810304 15184515
59376 15184515 15512206 15798070 16046911 16263161 16450018 16608399 16736697 16831494 16888357 16902124
59366 16902124 16867212 16778622 16633564 16432755 16180395 15882844 15547217 15180970 14791803 14386553
59356 14386553 13969434 13541614 13102725 12652582 12191711 11721339 11243796 10762768 10282836
59347 10282836 9808944 9346243 8899469 8471736 8064296 7677894 7313713 6972512 6653750
59338 6653750 6356574 6081177 5828123 5596717 5385180 5192276 5017662 4860629 4719648
59329 4719648 4593422 4481397 4382908 4296735 4221957 4158527 4106419 4064771 4032381 4008684 3993823
59318 3993823 3988037 3991331 4003517 4024291 4053302 4090155 4134093 4183701 4237206 4293084 4350043 4406657
59306 4406657 4461638 4514569 4565700 4614739 4660417 4701648 4738715 4772934 4805469 4836998 4868405
59295 4868405 4901304 4937607 4978678 5025058 5077029 5135246 5200432 5272284 5348915 5427535 5505330
59284 5505330 5579359 5645957 5700896 5740239 5760774 5759850 5735392 5686454 5613829 5520422 5411151
59273 5411151 5291868 5167287 5039345 4907421 4770072 4626807 4479189 4331040 4187342
59264 4187342 4052146 3927425 3813957 3712627 3624159 3548189 3483766 3430768 3389978 3361820
59254 3361820 3345929 3342029 3350363 3371238 3404982 3452497 3515008 3593069 3686675 3796659 3925244
59243 3925244 4074881 4247290 4443942 4666734 4917758 5198936 5512120 5858764 6238832
59234 6238832 6650196 7088987 7549652 8024235 8502120 8970639 9415257 9819280 10165094
59225 10165094 10437276 10624719 10720073 10718840 10620664 10431168 10161437 9825617 9439377 9019685
59215 9019685 8584044 8148677 7727029 7329253 6962064 6628913 6331014 6068652 5841484
59206 5841484 5647911 5484947 5348948 5236194 5142762 5064392 4996810 4936059 4878345 4819936
59196 4819936 4757577 4689148 4613756 4531120 4441019 4343597 4240167 4133262 4025515 3918592
59186 3918592 3813384 3710817 3611876 3517044 3426550 3341249 3262530 3191074 3126292 3067302 3013881
59175 3013881 2966125 2923815 2886718 2855105 2829362 2809295 2794322 2784121 2778695 2778027 2782198 2791674
59163 2791674 2806965 2828021 2854326 2885499 2921366 2961477 3004986 3051053 3099016 3148136 3197584
59152 3197584 3246803 3295528 3343052 3387634 3426998 3459619 3485293 3504246 3515865 3518724 3511983 3496359
59140 3496359 3473416 3444290 3409713 3371057 3330614 3290564 3252135 3216047 3183323 3155281 3132890
59129 3132890 3116546 3106505 3103417 3108436 3122884 3147834 3184059 3232247 3292882 3365606 3449011 3541470
59117 3541470 3642053 3750290 3865335 3985944 4111207 4240730 4374093 4510788 4650778
59108 4650778 4794470 4941687 5090786 5238605 5380671 5511228 5623525 5710508 5765307 5781630
59098 5781630 5754778 5683014 5568045 5414342 5228361 5017987 4791553 4556545 4319198 4085000
59088 4085000 3858773 3643902 3442060 3253949 3079966 2920050 2773540 2639621 2517634
59079 2517634 2406819 2306271 2215362 2133784 2060921 1995588 1936536 1882796 1833460 1787728 1745453
59068 1745453 1707077 1672844 1642541 1616214 1594470 1577754 1565816 1558163 1554420 1553936 1555686 1558994
59056 1558994 1563811 1569698 1574880 1576741 1573145 1563248 1547651 1528189 1507224 1486812 1468586 1454169
59044 1454169 1444888 1440989 1441921 1447617 1458766 1475560 1497145 1522789 1552678 1586786 1623514 1660241
59032 1660241 1694872 1726449 1754860 1780662 1804790 1827825 1849731 1870502 1890506 1909714 1927170
59021 1927170 1941726 1952825 1960219 1963616 1963253 1960298 1956062 1951153 1945742 1939964 1933428 1925013 1913974
59008 1913974 1900818 1886452 1870942 1853761 1834774 1814203 1792115 1768786 1745334 1723140 1702787
58997 1702787 1684109 1667132 1652422 1640710 1632583 1628181 1626790 1627134 1628560 1631510 1636388 1642560 1649101
58984 1649101 1656043 1664155 1673853 1684943 1697080 1709988 1723738 1739322 1758374 1781612 1808103 1836649
58972 1836649 1867244 1900396 1935827 1972909 2011810 2052976 2095754 2138564 2180329 2220857 2260160
58961 2260160 2298380 2336193 2374330 2412770 2451245 2490338 2531331 2575124 2622104 2672793 2727695
58950 2727695 2786704 2849538 2916619 2988633 3065400 3145982 3229663 3315970 3404116 3493669 3585883
58939 3585883 3683472 3789042 3904491 4031635 4172265 4327434 4497641 4683879 4887804 5110896
58929 5110896 5354263 5619211 5907146 6218990 6555577 6918599 7310323 7732411 8185954
58920 8185954 8672527 9194078 9751498 10344047 10970008 11626652 12309158 13010271 13720962
58911 13720962 14430234 15124001 15785181 16395573 16937108 17391538 17740665 17968610 18064509
58902 18064509 18023658 17847447 17543158 17123576 16606056 16011131 15360620 14675193 13972668
58893 13972668 13268175 12575082 11904556 11264083 10657178 10084705 9546087 9039805 8564134
58884 8564134 8118032 7700871 7311375 6947546 6607688 6290835 5996187 5722927 5470597
58875 5470597 5238915 5027192 4834554 4660425 4503876 4362673 4234187 4117187 4011694
58866 4011694 3917057 3831490 3753677 3683520 3620951 3565251 3516074 3473950 3439178 3411150 3389364
58855 3389364 3374107 3365557 3363152 3366588 3376631 3394135 3418903 3450166 3487685 3531797 3582881 3641363
58843 3641363 3707802 3782475 3865281 3956407 4056658 4166850 4287367 4418590 4561316 4716566
58833 4716566 4885490 5069453 5269596 5486202 5719270 5969898 6240427 6533173 6849844
58824 6849844 7192298 7562846 7963499 8395788 8861392 9361781 9896777 10464470 11062769
58815 11062769 11689599 12340740 13008294 13681634 14348402 14993526 15598474 16142945 16607192
58806 16607192 16972695 17222612 17344063 17330720 17183120 16907500 16515293 16022752 15449024
58797 15449024 14813548 14134924 13430852 12717495 12008487 11314854 10645416 10006499 9401706
58788 9401706 8832937 8301629 7808586 7353190 6933891 6549518 6199480 5882823 5597756
58779 5597756 5341946 5112376 4904670 4713064 4531477 4354879 4180312 4007353 3837786
58770 3837786 3674496 3520322 3377377 3246604 3127613 3019373 2921402 2833975 2757152 2690278
58760 2690278 2632765 2584651 2545889 2515641 2492832 2476934 2467665 2464412 2466539 2473809 2485683 2500256
58748 2500256 2514250 2523834 2525211 2515047 2491255 2453632 2403702 2344175 2278560 2210504 2142861 2077425
58736 2077425 2015534 1958196 1905375 1855907 1808777 1763932 1721415 1680447 1640142 1600649 1562814
58725 1562814 1527057 1493389 1462207 1434254 1409772 1388389 1369834 1354228 1341472 1330628 1319976
58714 1319976 1307746 1293102 1276666 1259923 1243927 1228763 1214095 1199603 1184770 1168907 1151753
58703 1151753 1133580 1114476 1094139 1072692 1051101 1030353 1010789 992600 976298 962193 950000
58692 950000 939533 931319 925931 923143 922313 923283 926423 932119 940615 952094 966534 983685 1003192
58679 1003192 1024246 1045146 1064089 1080674 1095891 1110452 1124167 1137323 1151412 1167682 1186027
58668 1186027 1206220 1229202 1255719 1284062 1310128 1329372 1338094 1333910 1316798 1289825 1257747 1224587
58656 1224587 1192826 1164229 1140200 1121279 1107188 1097511 1091775 1089108 1088686 1090579 1095535 1103876 1115143
58643 1115143 1128722 1144353 1162110 1182442 1206121 1233677 1264907 1299378 1337308 1379539 1426797
58632 1426797 1479459 1537968 1603103 1675825 1757041 1847432 1947382 2057284 2178010 2310699 2455918
58621 2455918 2613431 2782834 2963792 3155323 3355340 3561044 3769054 3974708 4171682
58612 4171682 4352582 4509547 4634521 4720321 4762417 4759578 4712988 4625874 4504182 4356026
58602 4356026 4189224 4009858 3823524 3636580 3454870 3281870 3119105 2967653 2828248
58593 2828248 2700557 2583601 2476710 2379391 2290786 2210121 2137261 2072078 2013810 1961774 1916144
58582 1916144 1877212 1844498 1817443 1796404 1782083 1774516 1773551 1779764 1793823 1815169 1841949 1871691
58570 1871691 1901104 1925743 1940847 1942516 1927985 1895994 1847976 1788190 1721571 1651798 1581842
58559 1581842 1515041 1454161 1400045 1352488 1311837 1278469 1251248 1227896 1206522 1185696 1163748
58548 1163748 1139559 1113778 1087976 1062848 1038417 1015436 995081 977481 961933 948389 937334
58537 937334 928371 920319 912661 905600 898735 891061 882427 873814 865972 858769 851983 845748 840109 835021
58523 835021 830782 827742 825720 824440 824165 825073 826433 827356 827989 828950 830119 831105 832401 834829 838291 842469
58507 842469 848353 857563 870299 885376 902194 921376 943559 968896 997570 1029402 1062853 1095638
58495 1095638 1126229 1153637 1176131 1191844 1200715 1204339 1203740 1198497 1188032 1172340 1151508 1126048
58483 1126048 1097951 1069992 1043534 1018143 993493 970372 949539 930751 913281 896483 879748
58472 879748 862906 846736 832105 818625 805158 791487 778423 766452 755452 745580 737133 729655
58460 729655 722447 715835 710674 706806 703449 700942 700544 702498 705832 710146 716064 723746 732453 741840
58446 741840 752347 764065 776384 788800 800766 810757 816920 818784 817145 812455 804795 795304 785878
58433 785878 777318 769281 762115 757047 754427 753411 753604 755399 758553 762144 766268 772107 779986 788932
58419 788932 798486 809343 821819 835264 849362 864353 879482 892693 902364 908101 909742 907225
58407 907225 901727 895259 888679 881530 874005 867380 862115 857250 852186 847525 843768 840686 838416 837685
58393 837685 838513 840063 842067 845013 848815 852762 856761 861075 864836 866536 865864 863303 858288 850025 840077
58378 840077 831659 826179 822808 821540 823933 830212 838354 846888 856327 867099 878421 890101 903145
58365 903145 917683 932436 946991 962389 978773 994817 1010157 1025847 1041514 1054652 1063806 1069956
58353 1069956 1073693 1073760 1069850 1064376 1059849 1056579 1054291 1053765 1055403 1058208 1061635 1066610 1073636 1081911 1091338
58338 1091338 1103167 1117600 1133062 1148922 1166427 1185767 1204779 1221959 1238378 1255311 1272520
58327 1272520 1290157 1309572 1330632 1350843 1368732 1385491 1401768 1415689 1425897 1433708 1440336 1444755
58315 1444755 1446459 1447636 1450386 1454240 1458661 1465361 1475777 1488615 1502277 1517488 1535326 1554911
58303 1554911 1575265 1597222 1621350 1646206 1670744 1696194 1723692 1752530 1782647 1816133 1854153
58292 1854153 1895164 1938245 1985277 2037648 2093952 2153432 2218489 2290881 2368474 2448516 2530961
58281 2530961 2615343 2697350 2771851 2836799 2891214 2932379 2958656 2972789 2979323 2981038 2980441 2981624
58269 2981624 2987309 2996681 3009081 3026971 3052402 3083826 3119536 3160928 3209236 3262584 3319586 3382094
58257 3382094 3450893 3522677 3595223 3671569 3755022 3844068 3936508 4034298 4139535 4249839 4362765
58246 4362765 4480836 4607090 4739781 4876723 5020769 5175397 5338908 5508647 5686874
58237 5686874 5876764 6076890 6285644 6506724 6744101 6996024 7260209 7540126 7839644
58228 7839644 8156739 8489608 8843742 9225581 9634777 10070492 10539265 11048213 11596723
58219 11596723 12184039 12818665 13510523 14260627 15069212 15947477 16910389 17965241 19119544
58210 19119544 20393109 21810044 23387279 25145305 27122617 29366240 31919380 34837069
58202 34837069 38206832 42139356 46751901 52178859 58580592 66113870 74904899 85077576
58194 85077576 96799083 110287135 125819727 143797312 164790259 189502425 218696742
58187 218696742 253006148 292259357 334225431 373705537 403415630 416880909 411518268
58180 411518268 389589399 356524242 318245407 279370168 242779401 209916266 181211579
58173 181211579 156491660 135337882 117298153 101949132 88924438 77946520 68804856
58166 68804856 61294474 55202807 50347994 46587970 43792742 41850566 40708423 40374237
58158 40374237 40883880 42301209 44706579 48034904 51805364 55049613 56662350 55971469
58150 55971469 53062435 48620917 43496915 38356424 33584844 29352194 25696837 22578971
58142 22578971 19922246 17649801 15700281 14024333 12580219 11336345 10270796 9363620
58134 9363620 8592270 7935503 7376196 6897044 6478154 6103040 5763528 5454849 5169232
58125 5169232 4898624 4640877 4398486 4172973 3964314 3773697 3602267 3448219 3308742
58116 3308742 3183673 3073999 2978331 2894051 2820051 2754666 2692623 2628187 2560571 2493136 2428570
58105 2428570 2368088 2313600 2266449 2224370 2182925 2139347 2092415 2040109 1980962 1916926 1851698
58094 1851698 1786876 1722477 1660007 1601700 1547530 1495978 1447023 1401621 1359313 1319239 1282366
58083 1282366 1249664 1219215 1188321 1157421 1128772 1102376 1076640 1051995 1030171 1010553 990969
58072 990969 971645 954769 940424 926552 912767 900587 889777 878133 865366 853851 844818 836877
58060 836877 828973 821829 815612 808879 800839 792325 783816 774737 765338 757025 750101 743257 735980 729498
58046 729498 724651 720745 717145 714316 712624 711597 710915 710900 711771 713681 717338 723235 730413 737445 744294
58031 744294 751604 758712 764342 768911 773995 779672 784521 788173 791753 795739 799556 803472 808835 816138
58017 816138 824723 834586 846609 860926 876987 895302 917018 941545 966603 990864 1014460 1036567
58005 1036567 1054647 1066651 1072026 1070128 1059677 1040651 1015040 985134 952595 919431 887866 858534
57993 858534 830509 803687 779428 758273 738956 720496 703650 689538 678437 670714 667305 668287
57981 668287 672322 678379 686802 697974 711259 726014 742420 760613 780181 801057 823470 846202
57969 846202 866124 880335 887859 888841 883494 872609 857923 841005 822643 803890 786740 773081
57957 773081 763720 758754 757888 760030 763758 768755 775888 785567 797047 809564 822807 835897 847126
57944 847126 855163 859358 858577 851175 836741 816600 792157 764162 734053 704275 676275 649533
57932 649533 623522 599270 577877 558756 540649 523442 507793 493754 480945 469580 460316 453431
57920 453431 448837 446443 445990 447018 449425 453468 458928 465051 471650 479421 488799 499409 510899 523217
57906 523217 535654 546830 556218 564571 572211 578042 581047 581663 580852 578790 575287 570603 565013 558393
57892 558393 550977 543652 536838 529939 522585 515400 508895 502752 497005 492762 490724 490010 489545 489720 491627
57877 491627 495549 501252 508812 517897 527065 535035 542072 548994 555513 560764 564755 567955 569998 570178
57863 570178 568805 566730 563817 559195 552868 545913 539184 532861 527102 522068 517481 513157 509826 508399
57849 508399 508521 508931 509168 509913 511641 513933 516236 518368 520159 521316 521744 521321 519431 515473 509772 503178
57833 503178 495806 487025 476747 465787 454791 443689 432508 421904 412416 403720 395148 386632 378792
57820 378792 372276 367209 363169 359623 356488 354236 353363 353926 355764 358871 363244 368622 374811 382064 390763
57805 390763 400955 412629 426243 442523 461849 484232 509815 538908 571449 606538 642304
57794 642304 676070 705058 727395 742392 749835 749518 741745 727649 708544 685344 659108 631434
57782 631434 603607 575774 547844 520861 496600 475992 458757 444383 432534 422504 413355 404981
57770 404981 398313 394094 391988 391177 391332 392633 395188 398813 403254 408377 414227 420910 428308 435935 443248
57755 443248 450045 456411 462418 468032 473169 477607 481095 483795 486476 489915 494265 499260 504817 511099
57741 511099 518198 526139 535054 545028 555861 567256 579079 591272 603836 617192 632120 648914
57729 648914 666965 685676 705475 727362 751706 778131 806322 836275 867916 901198 936619
57718 936619 975082 1017148 1062971 1112972 1168073 1229241 1297267 1373049 1457608 1551696 1655786
57707 1655786 1770471 1896568 2034825 2185917 2350582 2529202 2721109 2924569 3137345
57698 3137345 3356646 3578247 3795740 4000545 4182474 4330827 4436183 4492230 4496619 4450868
57688 4450868 4360016 4231950 4075967 3901256 3716377 3529396 3347408 3175652 3017568 2875866
57678 2875866 2753049 2650849 2569767 2509733 2471103 2454971 2462775 2495946 2556111 2645578 2766379
57667 2766379 2915925 3080531 3232814 3338585 3371022 3322477 3205791 3045912 2869087 2695880
57657 2695880 2539219 2405521 2296773 2212498 2151277 2111686 2092540 2092650 2110704 2145558 2196579
57646 2196579 2263590 2346583 2445521 2560128 2689633 2832838 2988561 3155588 3331803 3513372
57636 3513372 3694865 3869707 4030115 4167147 4271771 4336442 4356023 4328149 4253825 4137800
57626 4137800 3987704 3812351 3620438 3419771 3216491 3014821 2818100 2629926 2453583
57617 2453583 2290408 2139594 1999928 1871213 1753897 1648034 1553019 1467880 1391429 1322449
57607 1322449 1260028 1203616 1152724 1106843 1065598 1028606 995231 964955 937953 914735 895045
57596 895045 877616 861184 845274 829899 815116 801160 788527 777516 767970 759732 753010 748089
57584 748089 744944 743367 743145 743966 745420 747342 749889 753140 756875 760875 765214 770268 776705 785410 796881
57569 796881 810634 825699 841860 859923 880668 904073 929809 958031 989346 1024452 1064095
57558 1064095 1108989 1159423 1215218 1276305 1343162 1416590 1497448 1586694 1685178 1793145 1910283
57547 1910283 2036370 2171374 2314648 2464480 2618505 2773813 2926199 3069788 3197875
57538 3197875 3303825 3381163 3423904 3428089 3393277 3322419 3220671 3094510 2951125 2797467
57528 2797467 2639450 2481983 2329229 2184275 2048827 1923678 1809326 1705856 1612756 1529480
57518 1529480 1455956 1391991 1336461 1287769 1245022 1208312 1177931 1153758 1135262 1121592 1111768
57507 1111768 1105301 1102560 1104071 1109559 1118147 1129440 1143952 1162465 1185447 1213105 1245624 1283275
57495 1283275 1326591 1376403 1433407 1497772 1569508 1649122 1737509 1835235 1942195 2057940 2181954
57484 2181954 2313581 2451814 2594840 2739306 2880020 3010651 3124616 3215132 3275115 3298333
57474 3298333 3281456 3225160 3133433 3012143 2867945 2707718 2538303 2366333 2197656 2036259
57464 2036259 1883784 1740474 1606633 1482969 1369922 1267345 1174787 1091574 1016683 949136
57454 949136 888587 835012 787761 745453 706903 671642 639493 610253 583953 560735 540131
57443 540131 520977 502491 484985 469145 454977 441983 430087 419752 411102 403357 395410 386888
57431 386888 378472 371054 364672 358573 352360 346645 342170 338658 335153 331327 327697 324576 321578 318447
57417 318447 315700 313999 313351 313305 313533 313830 313920 313725 313637 314089 315034 316123 317202 318260 319045 319120 318329 317062
57399 317062 316107 316241 317676 319706 321163 321492 321221 321270 322024 323255 324645 326057 327510 329154 331133 333212
57383 333212 334811 335682 336327 337369 338732 339880 340782 342179 344760 348386 352235 355622 358603 361862 365988
57368 365988 370819 375588 379725 383312 386743 390309 394335 399321 405422 411929 417763 422574 427081 432325
57354 432325 438850 446571 455078 463916 472797 481666 490499 499055 506970 514098 520611 526805 533015 539702
57340 539702 547329 555971 565200 574526 583975 594134 605618 618520 632419 646840 661593 676635
57328 676635 691830 707107 722795 739567 757981 778238 800319 824034 848914 874466 900809
57317 900809 928776 959165 992035 1026932 1063577 1102018 1142304 1184370 1228254 1274150 1322205
57306 1322205 1372372 1424406 1477906 1532350 1587221 1642087 1696533 1750076 1802052 1851442 1896916
57295 1896916 1937413 1972786 2003570 2030043 2051973 2069461 2083615 2096044 2107957 2120020 2132699
57284 2132699 2146246 2160629 2175923 2192651 2211405 2232369 2255587 2281433 2310249 2341640 2374638
57273 2374638 2408530 2442973 2477349 2510566 2541705 2570507 2597189 2622190 2646244 2670236 2694799
57262 2694799 2720201 2746728 2774883 2805145 2837751 2872735 2909911 2948858 2989318 3031558 3075897
57251 3075897 3121800 3167985 3213604 3258912 3304501 3350425 3396445 3442722 3489696 3537466 3585868
57240 3585868 3635151 3686084 3739271 3794718 3852255 3912071 3974523 4039586 4106753 4175444 4245217
57229 4245217 4315520 4385520 4454450 4522069 4588709 4654927 4721277 4788224 4855897 4923968 4992088
57218 4992088 5060568 5130339 5202158 5276131 5352075 5430001 5510094 5592641 5678205 5767510 5860752
57207 5860752 5957288 6056336 6157675 6261352 6367043 6474197 6582594 6692177 6802454 6912508
57197 6912508 7021462 7128498 7232647 7333376 7431519 7529005 7627306 7726627 7827112 7930533
57187 7930533 8039987 8157165 8279456 8399879 8510587 8607342 8691156 8766089 8836031 8903472
57177 8903472 8970055 9036912 9104320 9171765 9238534 9303889 9366792 9426107 9481278 9532459 9579998
57166 9579998 9624162 9665192 9702938 9736227 9763038 9781601 9791300 9792709 9787179 9776207 9760693 9740752
57154 9740752 9716675 9690029 9663381 9638931 9617757 9600156 9586154 9575726 9568980 9566068 9566410 9568167
57142 9568167 9568997 9567108 9560966 9548474 9527634 9498126 9461271 9418318 9369696 9316144 9259253 9200123
57130 9200123 9138094 9071488 8999263 8921643 8839820 8755827 8672621 8593787 8522756 8461669 8410193
57119 8410193 8365305 8322747 8279055 8232351 8182103 8129264 8076732 8028934 7990785 7967137 7962387
57108 7962387 7979395 8019059 8082092 8171347 8292012 8450652 8655851 8919735 9257501 9685839
57098 9685839 10223300 10891726 11715304 12717881 13921782 15347286 17010103 18919676 21082296
57089 21082296 23504553 26190237 29134151 32318358 35700253 39180452 42573561 45630909
57081 45630909 48124029 49925783 51019486 51443257 51239100 50448555 49129968 47359070
57073 47359070 45214428 42771024 40104490 37290787 34398385 31484355 28597994 25783724
57065 25783724 23079559 20516401 18120481 15914390 13914675 12129587 10559071 9195145
57057 9195145 8022383 7020482 6168204 5445402 4832868 4312797 3870189 3492828 3169847
57048 3169847 2891398 2649691 2439124 2255075 2093341 1950624 1824426 1712282 1611778
57039 1611778 1521208 1439369 1364876 1296543 1234224 1178196 1127758 1081389 1038183 998037 960583
57028 960583 925110 891679 861070 833315 807359 782587 759631 739134 720647 703437 687667
57017 687667 674043 662702 653099 644738 637632 632345 629950 631670 638291 650178 667935 692650 725387
57004 725387 767029 818874 882852 961310 1057799 1178080 1326816 1498172 1667764 1796999
56994 1796999 1851089 1817676 1711226 1561509 1397832 1240472 1100581 982971 888057 813423
56984 813423 755700 711816 678951 654070 633967 615508 595916 573484 548432 522656 498106
56973 498106 475414 454189 434148 415606 399135 385219 374151 365909 360117 356294 354139 353589 354906
56960 354906 358810 366250 377822 393535 412935 434621 455219 469613 473386 465525 448676 427035
56948 427035 404191 382391 362695 345298 330099 317330 307607 301405 298699 299111 302151 307338 314467
56935 314467 323991 336896 354041 375680 401685 431670 464145 495218 518705 528570 522146 501388
56923 501388 471212 436728 401695 368508 338544 312240 289378 269614 252725 238374 225978
56912 225978 214947 205001 196245 189067 183754 180009 177069 174567 173040 173075 174268 175641 176957 178837
56898 178837 181577 184646 187653 191051 195563 201487 208932 218173 229301 241931 255709 270796 287528
56885 287528 305793 324738 342535 356298 363136 362014 354439 343100 330298 317634 306200 296316
56873 296316 287767 281008 277577 278606 283459 290664 299714 311085 324981 341270 360574 384371 413845
56860 413845 449320 490612 536489 582987 623049 649041 656344 645173 619820 586486 551028 517578
56848 517578 488321 464089 445012 431031 422364 419614 423223 432873 447781 467666 493200 525537
56836 525537 565697 614547 672960 741279 817624 895867 965209 1012946 1029502 1012463 967023
56825 967023 903210 832060 762389 699100 643638 596036 556561 525597 502813 487311 478506 476267
56813 476267 480312 490100 505528 527353 556778 594800 641657 695935 753314 806062 844452 860073
56801 860073 849469 815682 766395 709977 652579 597941 548487 505714 469889 440357 416473
56790 416473 398034 384899 376629 372647 372568 376317 384063 396089 412706 434185 460330 489384 517107
56777 517107 537567 545665 539393 520164 491599 458012 423155 389425 358020 329727 305185 284354
56765 284354 266402 250566 236698 224746 214277 204945 196880 190114 184151 178647 174009 170679 168264
56752 168264 166064 164042 162564 161467 160142 158364 156335 154084 151525 149037 147368 146884 147265 147840 147918
56737 147918 147100 145704 144588 144145 143852 143188 142465 142168 142084 141825 141672 141945 142028 141071 139437 138358 138301 138653
56719 138653 138962 139400 139965 140247 140230 140431 141063 141813 142542 143379 144030 143867 142951 142144 141938 141943 141762 141603 141715 141970
56699 141970 142409 143520 145564 148119 150666 153086 155312 157053 158232 159233 160325 161241 161609 161445 160929
56684 160929 160043 158664 156777 154502 152190 150470 149746 149646 149370 148592 147553 146356 144819 143070 141550
56669 141550 140306 138976 137619 136861 136901 137086 136879 136584 136648 136831 136673 136338 136396 136984 137710 138241 138552 138659 138512
56650 138512 138172 137826 137538 137147 136469 135595 134923 134791 135064 135281 135297 135512 136302 137510 138719 139722 140414 140655
56632 140655 140647 141080 142367 143994 145134 145631 145778 145547 144832 144219 144596 145935 147205 147581 147140 146374 145668 145352
56614 145352 145610 146222 146880 147709 148989 150463 151573 152262 152878 153322 153097 152263 151666 152018 153223 154618 155431
56597 155431 155178 154204 153628 154207 155493 156781 158366 160853 163613 165240 165514 165668 166551 167745 168707 169618
56581 169618 170675 171619 172445 173746 175876 178480 181108 183601 185771 187597 189903 193823 199296 205062 210416
56566 210416 216006 222557 229876 237496 245292 252950 259850 266054 272485 279603 286755 293344 299633 305823
56552 305823 311280 315370 318217 319938 319975 317909 314180 309359 303484 296754 290025 283736 277096 269198 260404
56537 260404 251856 244114 236943 229919 222595 214636 206458 199263 193814 189633 185886 182441 179506 176927
56523 176927 174534 172538 170893 168795 165613 161824 158394 155705 153625 152094 150917 149492 147483 145361
56509 145361 143683 142304 140911 139861 139776 140652 141953 143270 144420 145242 145793 146398 147107 147584 147862 148612 150231
56492 150231 152284 154329 156607 159346 162003 163887 165030 165873 166600 167321 168438 170251 172592 175195 177904
56477 177904 180242 181598 182289 183693 186723 190824 194941 198638 201729 203762 204695 205343 206360 207457 208216
56462 208216 208868 209460 209133 207243 204576 202451 201120 199925 198624 197671 197518 198273 199646 200834 201018 200505
56446 200505 200616 201972 203756 205203 206715 208656 210184 210419 209931 209898 210429 210835 210876 210696 210075 208831 207421
56429 207421 206209 204673 202288 199528 197102 194919 192736 191050 190222 189495 188054 186293 184862 183204 180440
56414 180440 177073 174472 173172 172881 173497 174756 175548 175104 174382 174840 176307 177521 178226 179125 180172 180684
56398 180684 180927 181917 183713 185516 187338 189924 192972 195077 195677 195653 195848 196415 197701 200275 203769 207004
56382 207004 209586 212128 214740 216629 217524 218163 219001 219630 219890 220383 221438 222575 223494 224637 226373 228464
56366 228464 230688 233129 235502 237018 237353 237076 236875 236960 237349 238111 239185 240564 242608 245506 248606 251133
56350 251133 253521 257122 262526 268912 275144 280770 285996 291398 297581 304445 310930 316142 320371 324225
56336 324225 327328 329008 329806 330956 332553 333600 333794 333887 334127 333704 332064 329714 327425 325605 324558 324330
56320 324330 324093 322756 320433 318458 317776 318192 319256 320813 322453 323421 323485 323187 323059 323261 324056 325888 328840
56303 328840 332678 337372 342959 349034 355071 361093 367380 373797 380176 386941 394498 402399 410124 418277
56289 418277 427922 439078 450960 463329 476464 490237 504536 520242 538380 558537 579490 601184
56277 601184 624725 650716 679140 710719 746712 787245 831364 878914 931016 988583 1051721
56266 1051721 1120654 1195808 1276810 1362673 1453103 1548402 1648019 1750449 1854456 1959004 2062059
56255 2062059 2160935 2253879 2339967 2417538 2484387 2539642 2583996 2618100 2642300 2657918 2666923
56244 2666923 2669982 2666517 2656858 2642549 2624009 2599619 2567768 2528392 2481960 2428396 2367635 2300038
56232 2300038 2225823 2145190 2059301 1969934 1878063 1784051 1689300 1596180 1506130 1419296 1336188
56221 1336188 1258056 1185400 1117738 1055213 998820 948637 903393 862218 825339 792647 763135
56210 763135 736299 712744 692909 676294 662184 649984 638937 628766 620406 614610 610232 605654
56198 605654 601477 599639 600120 600924 601340 602597 605009 607134 608437 610255 613238 616096 617802 618896 619698
56183 619698 619379 617763 616073 615054 614232 613714 614525 616363 617325 616927 617254 620053 624836 630905 638934 649152
56167 649152 660056 670502 681386 693916 707873 722789 739212 757564 777310 798318 821498
56156 821498 847289 875171 905537 940185 980117 1024818 1074568 1131408 1196852 1270792 1353846
56145 1353846 1448693 1557909 1682433 1823286 1982656 2161823 2359470 2572462 2795656 3019712
56135 3019712 3231777 3420800 3581698 3714799 3824373 3918615 4007144 4094870 4178696 4250750
56125 4250750 4302983 4328921 4325464 4296265 4251152 4199417 4144090 4082597 4009385 3915997 3792340
56114 3792340 3632251 3437858 3217654 2982320 2743418 2512630 2298586 2104963 1932843
56105 1932843 1783020 1654743 1544817 1450170 1369626 1301789 1243675 1193223 1150829 1116549 1088226
56094 1088226 1064154 1044971 1030808 1019182 1007995 998127 990861 985275 980498 977953 978714 981013 982913
56081 982913 985180 989079 993711 998049 1003212 1010136 1017290 1023348 1029823 1038474 1048382 1058142 1068553 1080558
56067 1080558 1092950 1104796 1117618 1132498 1147585 1161271 1175212 1191241 1207981 1223654 1239690
56056 1239690 1258268 1278656 1299198 1320594 1344021 1368333 1392258 1417138 1444493 1473238 1502164
56045 1502164 1532512 1565042 1597395 1627628 1657648 1689869 1723283 1756098 1789309 1824198 1859307
56034 1859307 1893470 1928917 1967780 2008542 2049471 2092281 2138672 2186639 2234185 2283360 2336559
56023 2336559 2392296 2448700 2507607 2570942 2636784 2703430 2773470 2849184 2927869 3006705 3088255
56012 3088255 3175997 3268329 3362386 3459833 3563419 3671680 3782568 3898415 4021775 4150447
56002 4150447 4282084 4419312 4564646 4715237 4868683 5029030 5200705 5381827 5570067
55993 5570067 5769363 5983790 6210775 6448092 6701385 6976646 7271490 7582500 7914686
55984 7914686 8274550 8660607 9070689 9511887 9992932 10513621 11072535 11677924 12339614
55975 12339614 13057765 13831844 14672963 15594954 16602101 17699501 18906710 20247132 21734394
55966 21734394 23385547 25237828 27336779 29721681 32443967 35589932 39267502 43586597
55958 43586597 48674124 54687792 61784075 70087591 79721493 90853167 103692718 118497057
55950 118497057 135640455 155671673 179274959 207196013 240076052 277807764 318286321
55943 318286321 356484768 385315323 398484968 393502794 372563297 340883840 304133935
55936 304133935 266742668 231495060 199797959 172073111 148151176 127619864 110026506
55929 110026506 94943851 82004240 70927575 61496474 53502338 46735616 41013713
55922 41013713 36183079 32096522 28616358 25637742 23085095 20887607 18978082 17310348
55914 17310348 15855176 14579769 13448393 12439381 11543107 10744868 10025462 9375706 8794224
55905 8794224 8272237 7794789 7355106 6954016 6586858 6244025 5923000 5627379 5355090
55896 5355090 5099144 4858670 4637893 4435129 4243441 4061189 3891836 3734322 3583517
55887 3583517 3439367 3306174 3183468 3066437 2954557 2851236 2755728 2663790 2575622 2495086
55877 2495086 2421720 2351151 2282549 2218210 2156836 2094907 2033900 1978648 1929175 1881357 1834916
55866 1834916 1793546 1757667 1724162 1692942 1666928 1645773 1626205 1608326 1595173 1586427 1578884 1572599
55854 1572599 1569804 1567678 1558749 1538995 1509944 1472943 1427669 1376811 1326138 1278663 1233417 1190150
55842 1190150 1150357 1113552 1077678 1043510 1013981 989080 966080 944615 926741 912167 898351
55831 898351 885162 874645 866381 858105 850689 847336 847799 848500 848396 849394 850680 848186 840597 830824 820557
55816 820557 808296 793832 779791 767262 754275 740055 726719 715437 704824 694376 685681 678994
55804 678994 672228 664545 657599 652188 647058 641869 637965 635379 632369 628545 625062 621197 614500 605131
55790 605131 596312 589464 582543 574308 566527 560473 554493 546579 536477 524042 508500 490692 473377
55777 473377 458079 443987 430683 419182 409495 400048 390427 381986 374966 367846 360367 354287 350197
55764 350197 346477 342364 339170 337310 335033 331423 327986 325924 324244 321842 319113 316324 312665 307960
55750 307960 303134 297973 290645 280495 269233 258527 248564 239645 232822 228056 223990 220335 218254
55737 218254 217696 216780 214655 212557 211282 210154 209345 210499 213822 217007 218346 218634 218881 218517 217169 215936
55721 215936 215439 214681 213177 212290 213133 215078 217498 221070 226071 231322 236015 240795 245894 250081 252640
55706 252640 254461 256042 256372 255090 253817 253849 254190 253263 251009 247995 244073 239294 234773 231342 228582
55691 228582 226235 225187 226092 228357 231358 235248 239752 243796 247277 251651 257822 264946 272143 279782
55677 279782 288187 296727 305102 313775 322212 328485 331719 333270 334414 334618 333235 331035 328650 325168
55663 325168 319776 313399 307332 301565 295727 290324 285722 281149 275937 270564 265398 259772 253381 247181
55649 247181 241690 235749 228269 219875 211588 203212 194386 185931 178739 172339 165856 159387 153318 147425
55635 147425 141811 137542 135082 133173 130465 127222 124258 121388 118217 115350 113426 111879 109987 108254
55621 108254 107487 107382 107234 107194 107627 108029 107822 107473 107633 107856 107258 105803 103998 102039 100172 99051 98750
55604 98750 98221 96685 94823 93722 93488 93780 94767 96548 98455 99838 100782 101225 100409 98103 95432 93490
55588 93490 92029 90460 89077 88264 87470 86204 85123 84978 85265 85110 84709 84678 84766 84394 83875 83932 84498 85028
55570 85028 85466 85906 85886 85020 83872 83327 83503 84003 84625 85169 85250 85105 85795 87733 89706 90275 89572 88945 89396
55551 89396 91094 93751 96723 99368 101950 105510 110294 115173 119172 122623 126170 129745 133322 137556
55537 137556 142599 147241 150290 152001 153174 153733 153265 152164 151123 150074 148535 146401 143602 139731 134834
55522 134834 129725 124695 118820 111472 103657 96867 91406 86796 82963 79969 77321 74583 72064 70029
55508 70029 67977 65531 63188 61322 59338 56797 54439 53054 52215 51163 50103 49543 49142 48354 47481 47067
55492 47067 46990 47130 48071 50077 52193 53411 53933 54311 54305 53656 52999 52789 52281 50768 48882 47384 45678 42965
55474 42965 39961 37951 36957 36301 36188 37105 38364 38917 39064 39729 40587 40515 39573 38884 38866 39054 39451 40497
55456 40497 41862 42669 42856 43079 43372 43059 41886 40233 38513 37279 37403 38967 40436 40188 38495 36933
55440 36933 36350 36648 37918 40299 43020 44987 46081 46735 46652 45336 43496 42475 42459 42579 42501 42615 42924
55423 42924 43099 43448 44512 45907 46831 47471 48597 49991 50659 50448 50127 50035 49956 50125 50963 51904 51899 51045 50372
55404 50372 50016 49016 47026 44876 43258 42011 40931 40250 40081 40222 40550 40927 40932 40454 40163 40497 40702 39920
55386 39920 38651 37909 37516 36616 35408 34828 34868 34729 34396 34504 34864 34726 34375 34816 35898 36324 35648 34782
55368 34782 34423 34395 34597 35202 35843 35975 36050 36956 38347 38995 38758 38613 38823 38663 38004 37406 36577 34616 32042
55349 32042 30719 31228 32050 31886 31155 30605 30103 29544 29439 29811 29856 29395 29359 30204 31172 31747 32475 33627 34442
55330 34442 34480 34515 35193 35946 36004 35487 34829 34223 34241 35741 38419 40612 41329 41368 41689 41949 41563 41005 40892 40690
55310 40690 39495 37487 35655 34670 34767 36035 38009 39574 40035 39761 39254 38336 36868 35447 34647 34238 33888
55293 33888 33880 34379 34675 34032 32842 32099 32049 32053 31517 30435 29242 28553 28759 29605 30452 31115 32013 33367 34786
55274 34786 35727 35902 35230 34064 33385 33930 35099 35583 35063 34349 33931 33589 33474 34194 35514 36370 36541 36944
55256 36944 37753 37708 36134 34242 33429 33440 33268 32791 32413 31967 31188 30611 30875 31615 32023 32054 32229 32655 33044
55237 33044 33324 33557 33658 33726 34189 35023 35369 34553 33030 31784 31275 31443 32197 33358 34621 35976 37690
55220 37690 39537 40697 40791 40345 39961 39835 40329 41908 43953 44779 43629 41735 40671 40607 40967 41734 42942
55203 42942 43708 43081 41430 39987 39392 39547 40406 41906 43410 44092 43735 42610 40917 38899 37028 35465
55187 35465 33792 31880 30488 30383 31336 32514 33316 33353 32383 30918 30154 30555 31206 31287 31325 32074 33011 33110 32489
55168 32489 32110 32290 32629 33019 33598 34006 33805 33427 33688 34485 34959 34803 34508 34396 34301 34160 34133 34177 34214 34581
55148 34581 35607 36907 37845 38551 39729 41570 43600 45500 47293 48741 49337 49062 48614 48727 49609 51014
55132 51014 52480 53548 54077 54231 54045 53348 52394 52006 52563 53293 53159 52048 50539 48912 47099 45272 43757
55115 43757 42568 41633 41278 41795 42738 43302 43336 43447 44158 45374 46626 47491 47871 48081 48453 48739 48326 47212
55097 47212 46212 45955 46350 47332 49299 52230 55108 56983 58032 58931 59769 60279 60527 60587 60060 58709 57124
55080 57124 56045 55496 55220 55339 55842 56078 55692 55443 56163 57450 58420 59180 60413 61932 62857 63002 62958 63018
55062 63018 63008 63065 63544 64229 64584 64652 64934 65578 66532 68141 70569 72919 74031 74063 74222 75091 76234 77300
55044 77300 78304 78883 78427 77159 76046 75518 75210 75045 75487 76513 77313 77346 76876 76251 75392 74196 72726
55027 72726 70858 68452 65982 64242 63340 62681 61921 61151 60205 58817 57588 57715 59379 61258 62075 61863
55011 61863 61338 60790 60133 59544 59462 60163 61566 63290 64893 66311 67906 69711 71000 71180 70812 70955 71725
54994 71725 72366 72585 72804 73179 73421 73728 74861 77012 79468 81722 84086 86989 90408 94349 99136 104924
54978 104924 111516 118893 127287 136632 146655 157661 170462 185354 201899 219814 239087 258914
54966 258914 277397 292744 304099 310991 312877 309693 302112 290781 276060 258858 240905 223599
54954 223599 207251 191880 177989 165897 155068 144919 135821 128578 123258 119219 116007 113595 111885
54941 111885 110510 109121 107676 106595 106704 108644 112176 116471 121243 127038 134228 142449 151406 161601
54927 161601 173605 187105 201279 215734 230369 244478 256609 265308 269627 269105 263706 253901 240579
54914 240579 224901 208213 191809 176501 162598 150368 140164 131862 124640 117778 111513 106688
54902 106688 103603 101524 99314 96351 92831 89394 86561 84447 82926 81864 81127 80496 79754 78737 77227
54887 77227 74994 72242 69766 68304 67793 67560 67113 66474 65901 65647 65775 65807 64789 62282 59155 56870 56036
54870 56036 56104 56329 56466 56575 56705 56856 56809 56173 54992 54064 54063 54553 54599 54070 53565 53205 52538 51671 51479 52419
54850 52419 53972 55514 56973 58293 59083 59194 59064 59147 59487 60108 61230 62884 64801 66811 68776 70147
54834 70147 70382 69985 70303 72072 74869 78158 81934 86012 89717 92885 96360 100877 106185 111954 118827
54819 118827 127776 138872 151429 165037 179798 195770 212659 229739 245746 259192 269184 275599
54807 275599 278244 276445 269970 259848 247690 234523 220722 206698 193145 180757 170003 160950
54795 160950 153090 145739 138827 132920 128327 124733 121921 120128 119303 118764 118166 118207 119784 122876 126857
54780 126857 131456 136816 142978 149963 158090 167712 178786 191083 204601 219453 235632 253008 271036
54767 271036 288193 302354 312256 318125 320498 319166 313873 305447 295382 284664 273663 262711 251976
54754 251976 241048 229454 217402 205362 193174 180394 167432 155549 145604 137364 130130 123475
54742 123475 117263 111456 106114 101394 97430 94337 92175 90715 89368 87568 85202 82586 80225 78613
54728 78613 77932 77787 77591 77313 77378 77771 77825 77240 76659 76765 77355 77811 77971 77970 77665 76841 75707 74643 73714 72891
54708 72891 72396 72366 72533 72720 73257 74426 75866 77090 78142 79124 79620 79358 79027 79529 80662 81422 81488 81500
54690 81500 81914 82483 82988 83648 84590 85580 86554 87830 89531 91285 92847 94616 97234 100893 105265 109914
54674 109914 114523 118851 122675 125854 128463 130783 133045 135203 137125 139019 141318 144132 147100 149849
54660 149849 152256 154291 156176 158789 163230 169611 176828 183895 190976 198698 207171 216193 225720 235327
54646 235327 243637 249106 251132 249797 245024 236845 226209 214568 202693 190595 178503 167120 156883
54633 156883 147653 139214 131529 124542 118294 113251 109952 108311 107712 107741 108292 109032 109360 108994 108114 106923
54617 106923 105547 104358 103910 104408 105555 106914 108073 108571 108082 106749 105020 103180 101248 99200 96991
54602 96991 94567 92134 90181 88897 87813 86386 84676 83101 81865 80983 80489 80144 79396 78174 77248 77125
54586 77125 77050 75950 74011 72396 71611 71101 70430 69919 69981 70590 71550 72615 73239 72889 71746 70597 69979 69863
54568 69863 70105 70594 71029 71175 71362 72129 73427 74734 75791 76605 76929 76531 75916 75932 76679 77592 78591 80256
54550 80256 82774 85624 88523 91821 95662 99595 103435 107835 113586 120783 128863 136925 143922 149196
54536 149196 153042 156140 158304 158496 156269 152428 148039 143530 138995 134590 130181 125326 120012 114832
54522 114832 110131 105719 101787 99235 98461 98537 98276 97568 96983 96566 95833 94664 93480 92705 92494 92808 93296
54505 93296 93334 92632 91593 90764 90224 89884 89924 90411 90771 90252 88810 87065 85497 84172 83120 82561 82690 83509
54487 83509 84757 85860 86147 85493 84592 84261 84576 84986 85043 84668 83837 82478 80783 79236 78172 77501 76953
54470 76953 76477 76298 76621 77349 78120 78661 79057 79593 80323 80965 81238 81154 80895 80483 79731 78574 77394 76877 77346
54451 77346 78277 78732 78375 77755 77549 77882 78583 79601 80789 81672 81907 81720 81423 80869 79872 78827 78239 77931
54433 77931 77446 76973 77028 77389 77262 76518 75874 75747 75815 75914 76466 77668 78988 79864 80258 80272 79914 79589 80131 81924
54413 81924 84466 87096 89554 91642 93105 94234 95828 98066 100101 101303 102196 103588 105436 107286 109233
54398 109233 111619 114153 116129 117309 117939 118125 117746 116802 115286 112987 109922 106745 104171 102190 100379
54383 100379 98758 97725 97268 96824 95891 94352 92308 90072 88279 87445 87408 87536 87547 87704 88196 88730 88955
54366 88955 88954 89042 89154 88752 87595 86485 86782 88930 91819 94080 95678 97526 99831 101823 103205 104754
54350 104754 106986 109167 110405 111024 112070 113932 116155 118199 119626 119916 118881 117133 115490 114066 112489
54335 112489 110737 109138 107760 106428 105126 103766 101790 98743 95125 91966 89539 87234 84639 82005
54321 82005 79539 77052 74610 72839 72162 72190 72252 72151 72011 71733 71061 70053 69118 68587 68419 68331 68049 67421
54303 67421 66432 65205 63980 62998 62335 61886 61579 61536 61865 62349 62578 62421 62138 62035 62223 62694 63313 63704 63521
54284 63521 62938 62454 62119 61405 60017 58397 57225 56831 57292 58567 60249 61673 62610 63406 64166 64435 64141
54267 64141 64116 64996 66222 66918 67250 68017 69241 70212 70709 71147 71540 71329 70421 69508 69074 68850 68560 68431 68536
54248 68536 68294 67204 65659 64502 64008 63762 63330 62679 61974 61317 60765 60421 60451 60958 61818 62663 63164 63330
54230 63330 63441 63713 64153 64615 64900 64893 64751 64828 65207 65527 65504 65500 66155 67483 68698 69038 68597 68213 68585 69504
54210 69504 69995 69376 68145 67531 68141 69437 70702 71948 73505 75145 76186 76200 75187 73369 71325 70031
54194 70031 70048 70740 70898 70100 68907 67855 66953 66231 66033 66463 67019 67143 66823 66436 66256 66297 66418 66436 66299
54175 66299 66162 66143 66073 65771 65467 65603 66272 67158 67987 68683 69130 69193 69007 68883 68905 68936 68983 69198 69514 69665 69581
54154 69581 69440 69361 69439 69948 70981 71908 71850 70773 69574 68884 68410 67712 66974 66513 66043 65068 63774 62883 62685
54135 62685 62685 62306 61469 60369 59099 57835 57129 57536 58822 59939 60111 59740 59884 60930 62288 63359 64190
54118 64190 64894 65040 64204 62777 61636 61108 60792 60291 59694 59354 59562 60336 61227 61490 60859 59955 59592 59887
54100 59887 60502 61363 62421 62990 62243 60436 58893 58585 59381 60747 62388 63875 64464 63805 62430 61106
54084 61106 60097 59354 58958 58967 59207 59594 60388 61748 63289 64409 64883 64915 64801 64734 64709 64511 64061 63822 64449
54065 64449 65877 67249 68026 68641 69703 71028 72015 72648 73500 74835 76307 77504 78336 78874 79215 79673 80748
54048 80748 82689 85208 87769 90075 92210 94362 96515 98484 100237 102065 104339 107186 110564 114506
54034 114506 119021 123786 128293 132425 136609 141256 146300 151382 156281 160951 165308 169225 172733 176095
54020 176095 179630 183381 186867 189311 190364 190529 190628 190919 191029 190721 190294 190142 190237 190201 189577 187895 184846
54003 184846 180690 176296 172481 169400 166685 164010 161330 158681 155993 153157 150231 147499 145276 143608
53989 143608 142289 141172 140242 139248 137605 134992 131847 128902 126476 124614 123615 123726 124458 124900 124799 124674
53973 124674 124811 124889 124791 125006 125776 126477 126335 125342 124000 122597 121231 120164 119658 119679 120139 121126 122512 123663
53955 123663 124032 123825 123629 123667 123850 124388 125699 127751 129990 131975 133731 135528 137681 140573 144454 149137
53939 149137 154158 159306 164749 170601 176645 182519 187934 192583 196047 197952 198221 197225 195701 194428 193693
53924 193693 193158 192448 191922 192624 195309 199615 204343 208531 212197 216063 220677 225854 230920 235403 239478
53909 239478 243813 248993 255043 261461 267743 273765 279502 284536 288153 290013 290338 289369 287106 283840 280475
53894 280475 277780 275586 273186 270277 267016 263387 259185 254499 249585 244267 238142 231414 224882 218985
53880 218985 213438 207929 202523 197205 191606 185557 179481 174043 169721 166724 164744 162778 159841 156084
53866 156084 152523 149511 146235 142050 137513 133575 130453 127873 125792 124229 122810 121185 119525 118098
53852 118098 116696 114990 113072 111141 109113 107074 105623 105110 104936 104377 103697 103651 104154 104302 103637 102602
53836 102602 101758 101255 101105 101343 101806 102224 102491 102474 101776 100301 98905 98736 99906 101422 102433 102893 103073
53819 103073 103212 103802 105374 107636 109450 110109 110161 110647 111925 113692 115739 118189 121117 124303 127334 129752
53803 129752 131271 132039 132652 133765 135756 138727 142596 147083 151782 156380 160739 164764 168434 172004 175990
53788 175990 180720 185908 190703 194224 196171 197064 197848 199174 201035 203018 204627 205348 204857 203403 201668
53773 201668 199908 197579 194276 190694 188032 186555 185363 183596 181224 178497 175271 171262 166607 161815
53759 161815 157386 153675 150897 148968 147440 145804 143808 141467 138917 136401 134235 132559 131117 129422
53745 129422 127229 124877 123059 122115 121559 120543 118807 116898 115330 113965 112491 111143 110498 110705 111323
53730 111323 111822 111818 111067 109745 108686 108799 110117 111826 113281 114563 115919 117142 117722 117398 116356 115141
53714 115141 114432 114607 115356 115913 115803 115218 114690 114615 115110 115982 116710 116746 116035 115116 114590 114616 114944 115315 115813 116948
53694 116948 119283 122784 126564 129539 131295 132161 132605 132935 133524 134844 137104 140105 143533 147093 150382
53679 150382 152979 154830 156277 157628 158936 160230 161682 163436 165569 168280 171785 175887 179899 183192
53665 183192 185627 187433 188888 190227 191607 193002 194261 195277 195881 195726 194695 193453 193026 193585 194098
53650 194098 193588 192399 191734 192112 192807 192887 192361 192031 192424 193219 193834 194211 194699 195218 195135 194250 193437 193693 194777
53631 194777 195434 194982 194014 193311 192711 191508 189557 187452 185754 184519 183532 182714 182235 182392 183327 184767 186161
53614 186161 187198 188067 189092 190296 191530 192850 194460 196305 198081 199708 201534 203886 206539 208851
53600 208851 210464 211745 213502 216316 220201 224722 229302 233469 237048 240235 243365 246620 250047 253818
53586 253818 258148 262876 267425 271351 274700 277715 280508 283231 286260 289834 293752 297727 301867 306423
53572 306423 311286 316074 320510 324343 327148 328768 329863 331434 333732 336032 337485 337840 337376 336623 336148
53557 336148 336148 336173 335651 334661 333747 332995 331904 330271 328670 327747 327451 327162 326254 324450 322023 319775 318339
53540 318339 317375 315904 313606 311233 309520 308250 306816 305182 303806 303023 303012 303986 305763 307367 307824 307403
53524 307403 307547 309299 312205 315000 317061 318875 321199 324197 327511 330906 334522 338553 343055 348123
53510 348123 353912 360246 366624 372911 379739 387767 396812 406221 415889 426367 438028 450706 464130
53497 464130 478201 492858 508168 524541 542264 560862 579549 598295 617780 638261 659296
53486 659296 680718 703028 726507 750742 775457 801048 827791 855131 882288 909007 935240
53475 935240 960712 985471 1010401 1036560 1064211 1092869 1121897 1150774 1179320 1208042 1237658
53464 1237658 1267826 1297032 1324257 1349932 1374621 1397693 1418332 1437089 1455147 1472554 1488530
53453 1488530 1503274 1518026 1533294 1548299 1562400 1575906 1589058 1601341 1612255 1621884 1630149 1636276
53441 1636276 1639651 1640602 1639723 1636832 1631135 1622162 1610166 1595919 1580340 1563943 1546306 1526514 1504415
53428 1504415 1481078 1457667 1434217 1409881 1384003 1356505 1327596 1297720 1267809 1239098 1212470
53417 1212470 1187964 1164856 1142187 1119426 1096785 1074903 1054327 1035505 1019027 1005276 993756
53406 993756 983358 973533 964760 957690 952473 949325 949044 952179 958037 965325 973672 983772 996075 1010127
53392 1010127 1025402 1042076 1060564 1080790 1102382 1125262 1149569 1175148 1201571 1228658 1256686
53381 1256686 1286069 1317115 1350075 1385119 1422093 1460525 1500097 1541083 1584225 1630202 1679191
53370 1679191 1730811 1784336 1839062 1894648 1951181 2008807 2067339 2126325 2185509 2245047 2305104
53359 2305104 2365236 2424279 2480891 2534233 2584178 2630986 2674914 2716157 2754913 2791300 2825246
53348 2825246 2856690 2885948 2913537 2939514 2963205 2983812 3000994 3014515 3023550 3026803 3023186 3011900
53336 3011900 2991900 2962054 2922250 2874035 2819833 2761694 2700935 2638472 2574951 2510635 2445640
53325 2445640 2380400 2315714 2252336 2190618 2130560 2072022 2014834 1958680 1902919 1846772 1790003
53314 1790003 1733378 1678128 1624917 1573678 1524444 1477829 1434469 1394459 1357660 1324132 1293818
53303 1293818 1266190 1240739 1217615 1197277 1179600 1163800 1149171 1135512 1122854 1111230 1100732
53292 1100732 1091506 1083573 1076860 1071302 1066753 1062983 1060032 1058370 1058297 1059350 1060651 1061815 1063152 1065227
53278 1065227 1068676 1074297 1082680 1093637 1106390 1120402 1135683 1152339 1170356 1189843 1210951 1233425
53266 1233425 1256710 1280586 1305195 1330397 1355678 1380925 1406631 1433028 1459565 1485638 1511262
53255 1511262 1536456 1560439 1582170 1601503 1619244 1636215 1652766 1669001 1684753 1699222 1711189
53244 1711189 1719878 1725274 1727506 1726315 1721362 1712753 1700918 1686079 1668027 1646364 1620931 1592113
53232 1592113 1560796 1527890 1493835 1458702 1422740 1386574 1350751 1315399 1280664 1247257 1216185
53221 1216185 1187894 1161907 1137265 1113049 1088495 1063075 1036771 1010086 983531 957166 930803
53210 930803 904469 878468 853163 829012 806691 786785 769234 753357 738562 724848 712573
53199 712573 701864 692364 683416 674479 665433 656496 647759 638946 629816 620597 611679 602955 593919 584403
53185 584403 574723 565002 554908 544342 533951 524577 516386 508849 501311 493384 484996 476356 467671
53172 467671 458707 448973 438528 428198 418601 409324 399583 389521 380275 372770 366834 361486 355801
53159 355801 349524 343084 337015 331279 325355 319155 313496 309323 306684 304821 302988 300826 298217 295256
53145 295256 292200 289070 285586 281842 278695 276838 275814 274624 273100 271937 271543 271613 271797 271962 271743 270649
53129 270649 268808 266897 265172 263210 260756 258044 255096 251617 247910 245029 243395 241961 239423 235741
53115 235741 231753 227859 223838 219704 215916 212778 210163 207806 205491 203062 200655 198691 197236 195581
53101 195581 192953 189527 186285 183964 182570 181723 180934 179603 177346 174540 172092 170491 169363 168039 166267
53086 166267 164247 162290 160608 159218 157822 155943 153374 150465 147801 145619 143637 141517 139407 137900
53072 137900 137372 137470 137439 136944 136366 136251 136674 137215 137357 136852 135891 135046 134748 134699 134099 132639 130999 130015 129699
53053 129699 129523 129459 130093 131616 133270 134103 133939 133326 132785 132475 132450 132746 133034 132537 130668 127785 125059 123454
53035 123454 122974 122998 123113 123324 123579 123507 122849 121841 120922 120178 119325 118191 117030 116314 116334 116963 117750 118269 118447
53016 118447 118537 118690 118683 118195 117278 116342 115682 115163 114526 113815 113324 113099 112779 112098 111399 111376 112270 113597 114765
52997 114765 115674 116518 117348 118191 119436 121631 124792 128214 131099 133194 134808 136461 138532 141015 143472
52982 143472 145357 146444 146888 146927 146728 146413 145975 145215 144062 142916 142305 142136 141685 140449 138685 136944 135443
52965 135443 134169 133260 132914 133061 133407 133737 133953 133980 133867 133895 134293 134922 135460 135890 136542 137603 138813 139738
52947 139738 140175 140169 139805 139270 139024 139485 140420 141021 140967 141082 142404 144714 146681 147551 147952 148781 150065 151407
52929 151407 152827 154374 155464 155563 155192 155319 155949 156298 156319 156932 158563 160423 161613 162102 162226 162032 161619
52912 161619 161435 161708 162055 162114 162059 162112 162108 162023 162352 163470 165009 166358 167329 167944 168087 167867 167894 168630 169850 171156
52892 171156 172543 173955 174845 174875 174677 175242 176827 179042 181553 184074 186016 186998 187479 188197 189193 190088 191051
52875 191051 192676 195061 197766 200591 203635 206676 209289 211582 214027 216601 218871 220875 223018 225025
52861 225025 226022 225994 226192 227573 229567 230961 231405 231390 231234 230806 230042 229115 228153 227122 225917 224347 222173
52844 222173 219397 216357 213361 210418 207465 204639 202094 199814 197776 196148 195065 194352 193627 192600 191132
52829 191132 189185 186866 184400 181919 179389 176844 174528 172664 171177 169825 168573 167757 167774 168568 169418
52814 169418 169429 168356 166825 165592 164792 164090 163294 162474 161650 160798 160099 159786 159716 159470 158841 157931 156880 155882
52796 155882 155309 155258 155045 153772 151487 149188 147512 146126 144642 143406 142884 142839 142744 142644 142928 143421 143393 142485
52778 142485 141086 139742 138584 137514 136572 135815 135004 133683 131692 129500 127842 126888 125920 124104 121565
52763 121565 119379 118365 118181 117793 116589 114741 112685 110686 108952 107766 107264 107161 106903 106151 105084 104140
52747 104140 103473 102797 101843 100824 100261 100418 101108 101962 102606 102604 101649 99984 98386 97466 97158 97044 96920 96806
52729 96806 96627 96335 96278 96984 98368 99551 99787 99396 99376 100131 101060 101555 101989 103252 105526 107969 109601 110096
52711 110096 109715 108950 108346 108154 107941 106902 104870 102585 100699 98944 96740 94186 91911 90237 89030
52696 89030 88157 87513 86776 85679 84462 83516 82747 81876 81178 81257 82105 83031 83479 83274 82142 79900 77229 75381
52678 75381 74772 74603 74183 73764 73630 73196 71856 70157 69301 69734 70939 72369 73866 75219 76036 76206 76047
52661 76047 75819 75395 74531 73270 72041 71384 71478 71888 72007 71857 72207 73659 75859 77861 79084 79673 80140
52644 80140 80921 82104 83290 83830 83420 82399 81319 80450 79826 79480 79331 79102 78705 78554 79191 80673 82523
52627 82523 84132 85062 85202 84918 84790 84914 84796 84270 84153 85362 87571 89431 90130 90160 90408 91095 91903 92676
52609 92676 93528 94476 95389 96289 97435 98975 100670 102080 102972 103427 103570 103383 102952 102744 103262 104418 105587
52592 105587 106395 107153 108360 110067 111927 113587 114798 115495 116094 117359 119534 121846 123322 123959 124568 125556
52576 125556 126462 126784 126705 126743 127125 127766 128620 129707 130898 131935 132639 132979 133009 132848 132682 132691 132929 133267 133472
52557 133472 133406 133212 133180 133325 133221 132493 131414 130740 130914 131622 132279 132748 133325 134145 134911 135324 135561 136033 136721
52538 136721 137096 136867 136504 136751 137774 139120 140358 141343 141891 141762 141168 140897 141602 143174 144958 146361 147039
52521 147039 146885 146156 145472 145341 145755 146393 147037 147653 148279 149047 150102 151287 152120 152313 152088 151775 151362 150756
52503 150756 150238 150279 151070 152443 154032 155266 155569 154963 154266 154228 154752 155339 155956 156806 157523 157392 156427 155448
52485 155448 154913 154304 153012 151306 149963 149217 148455 146905 144471 141918 140218 139565 139101 137820 135623 133225
52469 133225 131204 129657 128642 128327 128557 128899 129289 130080 131169 131681 131057 130014 129788 130590 131324 130861 129199
52452 129199 127264 125938 125417 125376 125498 125711 125970 126067 125900 125734 125896 126272 126508 126720 127458 128831 130186 130914
52434 130914 131187 131554 132192 132942 133730 134453 134754 134410 133893 134035 135173 136961 138844 140318 140890 140519 140095
52417 140095 140799 142708 144588 145363 145306 145383 145988 146864 147906 149244 150599 151288 151147 150923 151415 152509 153430
52400 153430 153740 153797 154249 155340 156698 157676 157923 157752 157942 158994 160637 162187 163352 164531 166251 168461
52384 168461 170453 171459 171335 170725 170520 171113 172228 173507 175015 176919 178844 179985 180028 179605 179604 180241 181070
52367 181070 181736 182332 183027 183650 183886 183742 183620 183914 184643 185545 186443 187410 188572 189910 191265 192454 193337
52350 193337 193953 194642 195804 197356 198721 199639 200725 202767 205637 208443 210770 213117 215958 218979 221631
52335 221631 223899 226034 227898 229135 229809 230297 230622 230474 229972 229923 231036 233090 235125 236372 236894 237338
52319 237338 238154 239119 239695 239759 239770 240201 241053 242055 243118 244394 246042 248090 250378 252554 254346 255948
52303 255948 257852 260147 262327 264067 265876 268617 272653 277785 283687 289959 296024 301526 306764 312313
52289 312313 318292 324428 330631 337027 343533 349994 356672 364019 371885 379520 386466 392941 399296 405667
52275 405667 412421 420301 429667 439913 450028 459585 468923 478528 488452 498261 507550 516631 526576 538182
52261 538182 550896 563270 574503 585063 595596 605849 615026 622795 629527 635833 642261 649185 656560
52248 656560 663924 670855 677275 683155 688282 692636 696623 700492 703805 705961 707041 707677 708264 708802 709393
52233 709393 710304 711567 713041 714867 717340 720292 723231 726287 730388 736106 742846 749668 756472 763790
52219 763790 771676 779628 787570 796186 806003 816685 827551 838372 849211 859808 869713 878954 888093
52206 888093 897518 907061 916309 924925 932535 938705 943407 947254 950952 954569 957552 959347 959796 958988 957040
52191 957040 954123 950549 946582 942122 936669 929794 921768 913535 905958 899178 892847 886692 880477 873682
52177 873682 865883 857520 849617 842525 835475 827664 819256 810967 803247 796299 790305 784989 779465 773262
52163 773262 767179 762331 758568 754677 750025 745119 740564 736370 732503 729303 726952 725066 723179 721182
52149 721182 719033 716498 713476 710252 707198 704526 702448 701125 700271 699250 697768 696116 694553 692805
52135 692805 690396 687151 683192 678823 674542 670785 667439 663930 659920 655569 651008 646113 640949 635977
52121 635977 631505 627324 623080 618630 613896 608929 604294 600767 598304 595858 592591 588769 585130 581975
52107 581975 579332 577362 575996 574650 572959 571490 571128 572024 573693 575772 578120 580465 582680 585190 588546
52092 588546 592771 597623 603198 609672 616730 623973 631691 640509 650382 660646 671038 681972 693782
52079 693782 706322 719373 732863 746653 760660 775193 790685 807040 823812 840884 858281
52068 858281 875410 891315 905909 920183 934934 949943 964592 978557 991595 1003387 1014024
52057 1014024 1024012 1033314 1041018 1046466 1050136 1052734 1053984 1053122 1050318 1046710 1043087 1039265 1034790 1029583
52043 1029583 1023728 1017195 1010085 1002768 995507 988106 980105 971177 961370 951174 941392 932590 924563 916567
52029 916567 908234 900084 893048 887674 883949 881587 880165 879139 878119 877256 877169 878440 881287 885608 891010
52014 891010 896693 901760 905976 910048 914788 920099 925147 929459 933373 937329 941219 944765 948050 951218
52000 951218 953806 954928 954155 951827 948441 943980 938001 930139 920432 909253 897007 883820 869467
51987 869467 853672 836371 817577 797181 775188 752155 729083 706661 684741 662621 639726
51976 639726 616028 592004 568369 545723 524261 503783 484024 464984 446935 430074 414201
51965 414201 398787 383549 368961 355952 344954 335436 326591 318250 310791 304385 298882 294390 291315
51952 291315 289433 287444 284029 279249 274370 270344 266919 263381 259689 256448 254020 252181 250685 249638
51938 249638 249045 248320 246722 244208 241466 239035 236724 234032 230836 227422 224092 221013 218276 215795 213203
51923 213203 210176 206874 203791 201112 198455 195387 191988 188679 185609 182502 179210 176211 174242 173401
51909 173401 172816 171424 169007 166313 164197 162861 161898 160847 159613 158506 157974 158105 158354 157897 156418 154397
51893 154397 152586 151344 150532 149817 148988 148155 147765 148176 149078 149587 149143 148137 147433 147430 147824 148086 147902 147267
51875 147267 146456 145931 146040 146751 147757 148794 149742 150601 151474 152471 153515 154374 155075 156068 157693 159613 161039
51858 161039 161544 161490 161666 162550 163937 165249 166235 167260 168665 170012 170442 169817 168976 168673 168768 168784 168756 168994
51840 168994 169386 169480 169040 168157 167094 166444 166990 168776 170617 171303 171125 171439 172786 174286 175010 175129 175340
51823 175340 175784 176091 176078 175932 175813 175664 175386 175014 174678 174457 174267 174069 174224 175399 177773 180538 182618 183801
51805 183801 184783 186128 187690 189081 190338 191884 194063 196826 199811 202774 206016 210120 215092 220158
51791 220158 224807 229642 235603 242675 250085 257560 265438 273463 280421 285351 288416 290183 290623 289286
51777 289286 286134 281786 277175 273111 269907 267248 264685 262227 260187 258519 256929 255593 255076 255375 255737
51762 255737 255681 255588 255912 256497 257044 257690 258579 259335 259488 259104 258630 258461 258913 260108 261487 261974 261188 260066
51744 260066 259766 260296 260819 260930 260981 261369 262128 263094 263985 264414 264259 263857 263463 262753 261351 259633 258453 258159
51726 258159 258302 258166 257140 254820 251378 247771 245019 243198 241537 239452 237050 234722 232764 231350 230314
51711 230314 228948 226558 223369 220437 218532 217495 216711 215724 214280 212326 210273 208827 208282 208301 208594 209355
51695 209355 210615 211596 211407 210320 209778 210920 213490 216353 218758 220720 222506 224358 226844 230883 236866
51680 236866 243784 249611 252629 252355 249378 244748 239513 234360 229398 224432 219483 214846 210661 206872
51666 206872 203706 201735 201050 200617 198895 195142 190049 185188 181862 180213 179299 178141 176735 175747 175295
51651 175295 174591 172981 170794 168728 166862 164808 162534 160481 158965 157907 157086 156322 155461 154485 153571 152840
51635 152840 152256 151970 152392 153554 154692 154982 154499 153949 153636 153249 152600 151968 151584 151242 150591 149527 148201
51618 148201 146928 146135 146148 146943 148231 149690 150980 151739 151843 151528 151025 150339 149636 149479 150207 151361 152326
51601 152326 153322 155061 157547 159981 161944 163981 166753 170215 173920 177649 181391 185072 188636 192192
51587 192192 195843 199529 203108 206367 208912 210421 211085 211470 211827 211890 211528 211209 211558 212687 214184 215571
51571 215571 216599 217311 218002 219048 220706 223135 226503 230678 234883 238097 239979 241140 242349 243807 245299
51556 245299 246662 247790 248391 248028 246440 243792 240713 238021 236068 234313 231848 228438 224770 221598 219042
51541 219042 216869 215082 213912 213387 213181 212798 211820 210166 208209 206486 205222 204320 203802 203890 204541 205257 205585
51524 205585 205565 205496 205528 205668 205943 206323 206651 206866 207189 207953 209368 211414 213776 215863 217226 218036 218847 219789
51506 219789 220432 220544 220549 220950 221722 222555 223284 223747 223677 223235 223304 224635 226881 229037 230716 232440 234688 237313
51488 237313 240012 242874 246179 249943 253817 257273 259897 261810 263804 266704 270502 274484 278271 282294
51474 282294 287026 292257 297461 302490 307347 311579 314523 316168 317175 317932 318088 317223 315490 313239 310447
51459 310447 306963 303026 298988 294700 289771 284385 279280 274823 270663 266483 262539 259148 256190 253561
51445 253561 251689 250948 250842 250350 249050 247398 246042 245288 245163 245398 245302 244179 242052 239604 237289 234841
51429 234841 231753 227874 223396 218586 213726 209055 204683 200743 197593 195439 193680 191136 187159 182292
51415 182292 177621 173840 171111 169418 168638 168342 167860 166582 164256 161198 158236 156111 154818 153756 152565
51400 152565 151412 150369 149043 147176 145207 143824 143170 142851 142495 141946 141087 139885 138563 137414 136458 135530
51384 135530 134658 134095 133923 133829 133307 132056 130249 128413 126956 125816 124750 123902 123749 124415 125370 125980 126098
51367 126098 125963 125845 125952 126355 126822 127052 127288 128293 130449 133203 135674 137486 138676 139325 139766 140743 142672
51350 142672 144980 146773 148016 149386 151060 152372 152769 152487 152070 151729 151362 150802 149775 147931 145223 142056
51334 142056 138969 136313 134220 132521 130627 127888 124340 120879 118452 117184 116399 115347 113817 112181
51320 112181 110970 110373 110198 110333 110979 112144 113140 113070 111881 110411 109323 108434 107338 106212 105604 105699 106154
51303 106154 106513 106483 105956 105078 104305 104064 104354 104839 105304 105885 106805 108057 109346 110349 111048 111780 112779 113665
51285 113665 113642 112381 110512 109047 108504 108773 109479 110057 109707 107950 105415 103590 103474 104717 106235 107271
51269 107271 107615 107198 106076 104678 103572 102924 102605 102737 103666 105219 106511 106809 106252 105448 104694 103971 103430
51252 103430 103352 103708 104219 104878 106013 107773 109868 111869 113487 114548 115109 115678 116920 118851 120657 121577
51236 121577 121734 121761 121836 121518 120517 119283 118668 119185 120652 122438 123915 124754 124966 124826 124720 124904 125320 125756
51218 125756 126306 127481 129630 132348 134734 136176 136641 136289 135292 134127 133574 134091 135366 136737 137903 138969
51202 138969 139950 140539 140484 140053 139926 140498 141353 141670 141242 140672 140303 139459 137334 134324 131596 129492 127333
51185 127333 124958 123337 123045 123070 122002 119895 118063 117372 117518 117768 117646 117027 116236 115995 116672 117651 118056
51168 118056 117924 117981 118346 118299 117457 116372 115690 115369 115087 114876 114915 115056 114933 114287 113014 111236 109531 108685
51150 108685 108878 109431 109628 109443 109180 108770 107921 106731 105689 105152 105178 105806 107088 108801 110436 111521 111761
51133 111761 110934 109070 106791 105068 104323 104027 103515 103024 103481 105258 107588 109471 110717 111756 112671 113042
51117 113042 112715 112197 112107 112611 113609 115037 116699 118125 118948 119288 119556 120094 121155 122828 124678 125904 126323
51100 126323 126894 128673 131462 134024 135496 136004 136064 136119 136705 138293 140620 142657 143602 143622 143449 143545 143897 144318
51082 144318 144736 145259 146059 147081 147985 148567 149024 149395 149069 147527 145453 144252 144353 144751 144499 143801 143179
51065 143179 142408 141048 139442 138281 137530 136636 135609 135025 134950 134687 133841 132917 132564 132767 133203 133931 135137
51048 135137 136431 137031 136698 136076 135868 136021 136059 136046 136760 138798 141791 144782 147117 148806 150187 151596 153239
51031 153239 155042 156613 157643 158349 159247 160546 162081 163718 165373 166717 167493 168203 169837 172608 175560
51016 175560 177893 180048 182880 186204 188980 190836 192583 195176 198788 203086 207792 212664 217288 221331
51002 221331 224904 228538 232917 238670 246043 254530 263080 271025 278754 287261 297118 308146 320000 332701
50988 332701 346465 361328 377251 394471 413485 434688 458246 484285 512897 543875 576786
50977 576786 611543 648719 689029 732598 778885 827137 876616 926549 976244 1025271 1073237
50966 1073237 1119362 1162600 1202162 1237665 1268787 1295138 1316563 1333252 1345394 1352941 1355859 1354475
50954 1354475 1349635 1342666 1334997 1327405 1319701 1311586 1303738 1297461 1293144 1289641 1285335 1279234 1270831 1259673
50940 1259673 1245608 1228897 1209476 1186498 1159206 1127939 1093691 1056954 1017679 976158 933186
50929 933186 889366 845005 800881 758478 719107 683084 649972 619324 591010 565010 541195
50918 541195 519367 499572 482285 468002 456498 446787 438088 430471 424216 418977 414244 410353 408178
50905 408178 407806 408292 408907 409871 411568 413703 415715 417492 419120 420356 420984 421444 422493 424300 426370 428430
50889 428430 430914 434452 439178 444724 450797 457576 465567 475038 485605 496454 507008 517352 528098
50876 528098 540069 554117 570843 590188 611582 634783 660440 689511 722390 759040 799774
50865 799774 845287 895898 951436 1012112 1078908 1152592 1232829 1318812 1410458 1508260 1612098
50854 1612098 1720836 1833129 1947865 2063564 2177932 2288397 2392576 2487834 2571081 2639845
50844 2639845 2693450 2732560 2757763 2769303 2768114 2756355 2736642 2711350 2682872 2653977 2627380
50833 2627380 2605082 2588246 2577308 2571868 2570758 2572436 2575055 2576026 2572035 2560083 2538480 2506702 2464659
50820 2464659 2412364 2349994 2277807 2196237 2106413 2010424 1910634 1808916 1706877 1606572 1510450
50809 1510450 1420541 1337992 1263178 1195962 1135986 1083226 1038085 1000617 970006 945392 926901
50798 926901 915027 909121 907529 909499 915976 927997 944970 965120 986939 1009448 1031538 1052020
50786 1052020 1070359 1086609 1100499 1111124 1117684 1120033 1118332 1112552 1102580 1088544 1070779 1049668
50774 1049668 1025776 1000004 973293 946169 918768 891381 864795 839904 817098 796213 777121
50763 777121 760167 745871 734374 725410 718802 714735 713513 715294 720260 728816 741337 757694 777278
50750 777278 799632 825053 854432 888486 927174 969968 1016726 1068129 1125153 1188138 1256564
50739 1256564 1329711 1407230 1488864 1573681 1659773 1744663 1825854 1901037 1968085 2025138 2070720
50728 2070720 2103651 2122906 2127861 2118858 2097507 2066264 2027819 1984920 1940543 1897711 1858847 1825349
50716 1825349 1797757 1776111 1760078 1748976 1741842 1737409 1734009 1729795 1723167 1712805 1697270 1674993
50704 1674993 1644928 1607032 1561986 1510852 1455285 1397548 1339719 1282971 1228049 1176129 1128634
50693 1128634 1086350 1049321 1017556 991207 970162 954248 943986 940324 943284 951563 964039 981134
50681 981134 1004132 1033486 1068381 1107638 1150385 1195905 1243440 1292266 1341607 1390425 1437640
50670 1437640 1482529 1524600 1563046 1596726 1624769 1646896 1663007 1672775 1675915 1672740 1664227 1651496
50658 1651496 1635192 1615334 1591718 1564636 1535277 1505315 1475998 1447701 1420496 1395022 1372518
50647 1372518 1353920 1339192 1327825 1319904 1316267 1317496 1323148 1332207 1344024 1358362 1374680 1391853
50635 1391853 1408761 1424839 1439972 1454171 1467426 1479600 1490408 1499846 1508723 1518384 1529679 1542584
50623 1542584 1557030 1573664 1593292 1615794 1639979 1664216 1686729 1705573 1719037 1726316 1727383 1722206
50611 1722206 1710625 1693155 1671361 1646988 1620917 1593229 1564003 1533632 1502441 1470333 1436925
50600 1436925 1401874 1365085 1326787 1287406 1247253 1206324 1164562 1122324 1080465 1039848 1000884
50589 1000884 963684 928566 896258 867454 842264 820222 800826 783964 769763 758198 749052
50578 749052 742220 737819 735894 736130 738102 741815 747866 756897 768958 783527 800094 818478 838420
50565 838420 859150 879820 900456 922129 945949 972127 1000407 1031150 1065347 1103363 1144146
50554 1144146 1186069 1228278 1270727 1313047 1354035 1392491 1428158 1461540 1493094 1522967 1551379
50543 1551379 1578853 1606010 1633360 1661220 1689521 1717681 1744994 1771281 1797049 1823039 1849893
50532 1849893 1878224 1908602 1941282 1976173 2013155 2052110 2092542 2133548 2174335 2214306 2252318
50521 2252318 2286339 2314451 2335892 2350622 2358104 2357295 2347764 2330062 2304806 2272071 2232058 2185888
50509 2185888 2135387 2082366 2028388 1974853 1922899 1873415 1827467 1786533 1751951 1724068 1702049
50498 1702049 1684432 1669845 1657488 1647196 1638969 1632315 1626283 1620371 1615270 1612385 1612562 1615259 1618741
50485 1618741 1620787 1619259 1612301 1598310 1576031 1544925 1505439 1458778 1406491 1350411 1292705 1235270
50473 1235270 1178911 1123596 1069801 1019098 972933 931209 892614 856215 822323 791937 765841
50462 765841 744157 726302 711267 698263 687175 678192 671146 665573 661371 658978 658834 660979 665228
50449 665228 671374 679102 687993 697770 708399 719932 732495 746427 762130 779694 798933 819796
50437 819796 842403 866560 891647 917281 943821 971983 1002172 1034498 1069151 1106305 1145573
50426 1145573 1185982 1226722 1267784 1309703 1352761 1396569 1440440 1484024 1527498 1571203 1615227
50415 1615227 1659270 1702690 1744501 1783479 1818532 1849051 1874821 1895632 1911092 1920712 1924023 1920641
50403 1920641 1910398 1893347 1869519 1838746 1801045 1757159 1708387 1655730 1599494 1539899 1477817
50392 1477817 1414665 1351706 1289730 1229459 1172022 1118922 1071439 1029940 993736 961815 933835
50381 933835 910268 891509 877138 866385 859138 856002 857245 862069 869193 877873 888004 899290 910702
50368 910702 920799 928249 931905 930774 924431 913425 898833 881355 861171 838764 815382 792277
50356 792277 769758 747356 724800 702404 680713 660263 641698 625556 611691 599318 587862
50345 587862 577444 568340 560469 553810 548987 546783 547100 548805 550669 552204 553658 555629 558727 563211
50331 563211 568763 574829 581336 588833 597906 608647 620733 633662 646718 659197 671099 683430
50319 683430 697298 712709 728636 744326 760127 776862 794675 812770 830081 845943 860217
50308 860217 873203 885530 897963 911053 924919 939258 953433 966550 977693 986449 993179 998627
50296 998627 1003109 1006253 1007557 1006936 1004426 999439 990763 977477 959714 938437 914811 889981 865030
50283 865030 840593 816541 792512 768804 746355 725738 706649 688541 671382 655511 641142
50272 641142 628352 617194 607398 598211 589043 580198 572450 566020 560438 555394 551065 547464 544017 540166
50258 540166 535992 531929 528186 524822 522078 520236 519250 518840 518847 519173 519506 519551 519557 520292 522329 525497 529108
50241 529108 532546 535652 538704 542127 546193 550905 556156 561857 567789 573469 578415 582564 586289 589989
50227 589989 593810 597669 601338 604415 606422 607150 606912 606379 606147 606371 606689 606457 605125 602481 598629 593918
50211 593918 588943 584461 581019 578626 576888 575543 574745 574854 576052 578215 581095 584590 588850 594102 600287
50196 600287 606929 613461 619665 625680 631550 636963 641484 644886 647159 648286 648215 647062 645178 642923 640371
50181 640371 637305 633499 628988 624068 619026 613966 608897 604008 599751 596591 594635 593469 592370 590696
50167 590696 588222 585227 582320 580061 578628 577800 577248 576742 576064 574963 573504 572361 572350 573543 575164 576583
50151 576583 578088 580362 583476 586844 589997 592977 596004 599220 602780 606764 610988 615278 619906 625260
50137 625260 631004 636124 640018 643060 645942 649030 652652 657282 662843 668326 672822 676706 681239 687256
50123 687256 694836 703960 714714 726946 740552 756179 774937 797242 822638 851002 883329 921000
50111 921000 964868 1015476 1073590 1139856 1214171 1295931 1384706 1480048 1580510 1683154 1784067
50100 1784067 1879195 1965026 2039244 2101310 2152456 2194998 2231590 2264804 2296762 2328462 2359168
50089 2359168 2386429 2406728 2416109 2410565 2386623 2342493 2279028 2199431 2107804 2008018 1903811
50078 1903811 1799241 1698205 1603333 1515636 1435311 1362538 1297436 1239607 1188155 1142220 1101384
50067 1101384 1065588 1034721 1008243 985213 964712 946265 929840 915548 903444 893473 885350 878463
50055 878463 872134 866031 860206 854760 849659 844945 840910 837907 836016 834940 834209 833540 833082 833258 834314
50040 834314 836204 838978 843030 848622 855366 862538 869881 877689 886173 895203 904718 914845 925390 935667
50026 935667 945171 954100 962895 971550 979733 987402 994796 1001935 1008622 1015036 1021854 1029535 1037811 1046311
50012 1046311 1055616 1067134 1081651 1098350 1115694 1133224 1151979 1173099 1196670 1222330 1250547
50001 1250547 1282617 1319620 1362009 1410155 1464673 1526115 1594945 1672086 1759085 1857481 1968269
49990 1968269 2091974 2228579 2376949 2534544 2697818 2862560 3023795 3176159 3315391
49981 3315391 3439776 3550204 3649132 3739521 3824090 3904686 3981981 4055411 4122775 4179545 4219130
49970 4219130 4234652 4220971 4175572 4098696 3993465 3865340 3720247 3562758 3396074 3223225
49960 3223225 3047473 2871706 2698282 2529552 2367806 2214509 2070228 1935517 1811298
49951 1811298 1698164 1595898 1504027 1422265 1349953 1285638 1227816 1175879 1129825 1089249 1053151
49940 1053151 1020562 990906 963765 938760 915699 894444 874620 855710 837439 819750 802496
49929 802496 785557 769255 754168 740354 727128 713845 700600 687989 676459 666080 656575 647269
49917 647269 637396 626885 616604 607311 598614 589630 580569 572828 567231 562947 558652 554233 550601 548096
49903 548096 545926 543330 540685 539115 539251 540695 542549 544277 546035 548325 551410 555116 559180 563652
49889 563652 568970 575776 584667 595813 608659 622267 636246 651156 667834 686629 707671 731601
49877 731601 759495 792135 829816 872768 921328 975778 1036662 1105261 1183134 1270883 1367663
49866 1367663 1471864 1581620 1694482 1807150 1915868 2016776 2106039 2180741 2240524 2288072
49856 2288072 2327501 2362411 2395362 2428017 2460531 2490766 2514681 2527441 2523978 2499386 2450205
49845 2450205 2375896 2278867 2163356 2034778 1899579 1764202 1633347 1509472 1394029 1288519
49835 1288519 1194011 1110291 1036130 970218 911592 859530 813584 773640 739487 710255 684555
49824 684555 661246 639941 620736 603700 588693 575485 563785 553137 543156 534043 526596 521299
49812 521299 517480 513810 509670 505529 501889 498430 494520 490089 485513 481004 476643 472604 468756 464375
49798 464375 459025 453575 449537 447293 445686 443491 440605 437623 434940 432645 430671 428629 425972 422742
49784 422742 419801 417859 416628 415340 413803 412446 411525 410820 410046 409141 408139 407093 406222 405851 406087 406681
49768 406681 407227 407526 407763 408377 409561 410927 411875 412350 412947 414119 415613 416944 418071 419250 420455 421398
49752 421398 422020 422544 423091 423599 424194 425226 426867 428888 430933 432796 434430 435957 437781 440338 443543
49737 443543 446658 448993 450542 451752 452815 453492 453585 453258 452749 452035 450966 449612 448240 447027 445980 445155
49721 445155 444744 444827 445185 445485 445595 445581 445424 444878 443626 441608 439168 436872 435103 433817 432812 432131 431952
49704 431952 432034 431643 430314 428487 427035 426283 425818 425187 424327 423304 422081 420751 419639 418896 418214 417241 416084
49687 416084 415123 414435 413787 413216 413272 414486 416702 419126 421006 422133 422747 423113 423399 423809 424552 425534 426265
49670 426265 426331 425958 425953 427032 429259 432118 434986 437545 439907 442371 445075 447856 450483 452906 455207 457490
49654 457490 459993 463144 467185 471788 476325 480588 484936 489654 494353 498190 500602 501833 502870 504851
49640 504851 508243 512465 516438 519607 522316 525236 528648 532446 536551 541064 546011 551115 555900 560015
49626 560015 563492 566673 569821 572819 575316 577082 578115 578547 578700 579169 580501 582671 585133 587484 589887
49611 589887 592742 596219 600273 604817 609664 614480 619125 623999 629745 636598 644190 652033 659998 668262
49597 668262 676985 686221 696063 706623 717757 729042 740234 751677 763968 777253 791239 805977
49585 805977 822129 840155 859597 879607 899940 920900 942536 964563 987125 1010973 1036640
49574 1036640 1063895 1092341 1122097 1153518 1186412 1219895 1253063 1285765 1318822 1353416 1389962
49563 1389962 1427595 1465066 1502111 1539432 1577303 1614859 1651079 1685977 1720345 1754678 1788801
49552 1788801 1822253 1854516 1884947 1912912 1937968 1959840 1978421 1994072 2007544 2019137 2028135
49541 2028135 2033478 2034863 2032864 2028268 2021754 2014037 2005577 1996135 1985213 1973129 1961218 1950772 1942165
49528 1942165 1935173 1929713 1925882 1923531 1922277 1922059 1923481 1927485 1934557 1944278 1955750 1968506 1982811
49515 1982811 1998901 2016220 2033751 2050992 2068084 2085020 2101295 2116597 2131342 2146062 2160452
49504 2160452 2173472 2184391 2193402 2201037 2207223 2211070 2211620 2208670 2202815 2194645 2183977 2169954 2151959
49491 2151959 2130384 2106345 2080686 2053345 2023834 1992144 1958968 1925037 1890593 1855754 1821135
49480 1821135 1787651 1755695 1724903 1694863 1665680 1637660 1610745 1584636 1559343 1535290 1512904
49469 1512904 1492261 1473107 1455079 1437991 1422025 1407504 1394390 1382190 1370588 1360005 1351200
49458 1351200 1344337 1338703 1333371 1327975 1322920 1318996 1316779 1316152 1316341 1316567 1316590 1316588 1316696 1316947 1317594 1319053 1321468
49441 1321468 1324570 1328138 1332421 1337913 1344708 1352094 1358668 1362966 1364277 1363088 1360758 1358674 1357613 1357762
49427 1357762 1359077 1361554 1365223 1369998 1375575 1381506 1387424 1393230 1399131 1405502 1412643 1420518 1428735 1436973
49413 1436973 1445421 1454598 1464678 1475213 1485682 1496041 1506628 1517712 1529418 1541862 1554978 1568252
49401 1568252 1580926 1592555 1603216 1613207 1622695 1631684 1640066 1647659 1654315 1660080 1665157 1669660 1673447
49388 1673447 1676271 1678172 1679734 1681780 1684700 1688085 1691228 1693865 1696221 1698506 1700765 1703149 1705848 1708676
49374 1708676 1711310 1714079 1717924 1723247 1729406 1735776 1742734 1750971 1760337 1770168 1780435 1791703 1804074
49361 1804074 1816977 1830076 1843674 1858040 1873064 1888772 1905638 1924018 1943728 1964375 1985758
49350 1985758 2007730 2030091 2052880 2076537 2101585 2128381 2157257 2188500 2221998 2257262 2293998
49339 2293998 2332399 2372687 2414670 2458016 2502713 2548947 2596716 2645812 2696089 2747515 2800000
49328 2800000 2853294 2907048 2960890 3014523 3067804 3120638 3172776 3223768 3273109 3320386 3365353
49317 3365353 3407955 3448107 3485328 3518712 3547441 3571199 3589981 3603847 3613104 3618382 3620072 3617925
49305 3617925 3611666 3601695 3588713 3573007 3554892 3535584 3516666 3498559 3480403 3461685 3443258 3426508
49293 3426508 3412317 3401083 3393033 3387947 3385204 3384584 3386645 3392037 3400960 3413544 3429994 3449874 3471957
49280 3471957 3495461 3520853 3548792 3578757 3609451 3640111 3670632 3700647 3729250 3755547 3778890
49269 3778890 3798766 3815005 3827803 3837027 3841838 3841696 3837365 3830051 3819727 3805231 3785951 3762476
49257 3762476 3735540 3705325 3672070 3636443 3598788 3558742 3516187 3471999 3427289 3382303 3336675
49246 3336675 3290447 3244254 3198628 3153719 3109738 3067259 3026872 2988713 2952443 2917609 2884013
49235 2884013 2851835 2821420 2792920 2766091 2740453 2715652 2691840 2669705 2649985 2632852 2617851
49224 2617851 2604477 2592504 2581681 2571507 2561733 2552831 2545529 2540044 2536187 2533934 2533271 2533500 2533484 2532818
49210 2532818 2532196 2532311 2532832 2532815 2531756 2529903 2527772 2525707 2523774 2521872 2520013 2518551 2517820 2517414 2516259 2513675
49194 2513675 2510133 2506645 2503674 2501010 2498447 2496038 2493701 2491090 2488114 2485319 2483496 2482891 2482920 2482646 2481519
49179 2481519 2479687 2477686 2475964 2474748 2474130 2473976 2473830 2473303 2472665 2472681 2473688 2475126 2476303 2477325 2478956 2481690
49163 2481690 2485365 2489573 2494083 2498854 2504054 2510192 2517969 2527760 2539352 2552273 2566188 2580848 2595836
49150 2595836 2610675 2625267 2640079 2655745 2672500 2689968 2707477 2724463 2740635 2755953 2770663
49139 2770663 2785268 2800180 2815283 2829991 2843801 2856670 2868781 2880176 2890812 2900809 2910376 2919460
49127 2919460 2927647 2934391 2939268 2942120 2943089 2942525 2940717 2937742 2933642 2928574 2922538 2915082 2905604 2894084
49113 2894084 2881318 2868376 2855919 2843984 2832118 2819658 2806127 2791595 2776605 2761750 2747403
49102 2747403 2733832 2721286 2709908 2699835 2691410 2684958 2680168 2676085 2671979 2667963 2664494 2661675 2659451
49089 2659451 2658161 2658281 2659729 2662069 2665319 2669902 2675669 2681680 2687271 2692769 2698714 2704835 2710314 2714838
49075 2714838 2718821 2722683 2726260 2728921 2730021 2729317 2727208 2724470 2721531 2718074 2713525 2707831 2701532 2695221
49061 2695221 2689119 2682999 2676309 2668484 2659366 2649177 2637984 2625533 2611787 2597232 2582246 2566568
49049 2566568 2549884 2532438 2514438 2495258 2474144 2451532 2428667 2405884 2382204 2356890 2330460
49038 2330460 2303860 2277513 2251679 2226906 2203409 2180586 2157905 2135855 2115359 2096601 2079113
49027 2079113 2062727 2047707 2034118 2021772 2010769 2001527 1994205 1988533 1984223 1981135 1979075 1977858 1977609
49014 1977609 1978676 1981159 1984763 1989142 1994199 2000137 2007354 2016085 2026036 2036548 2047354 2058780 2070970
49001 2070970 2083405 2095631 2107954 2120736 2133470 2145400 2156822 2168817 2181670 2194519 2206703
48990 2206703 2218588 2230746 2243137 2255491 2267805 2279987 2291653 2302873 2314631 2327845 2342293
48979 2342293 2357128 2372343 2389013 2407997 2428820 2449988 2470155 2488944 2506797 2524209 2541146
48968 2541146 2557258 2572467 2586982 2600698 2613000 2623445 2632381 2640548 2648262 2655256 2661167 2665799
48956 2665799 2668921 2670101 2668847 2664844 2658129 2649266 2639299 2629309 2619880 2610995 2602437 2594181 2586420 2579346
48942 2579346 2573028 2567511 2562976 2559696 2557927 2557970 2560348 2565561 2573441 2583027 2593430 2604793 2618017 2633622
48928 2633622 2651217 2670036 2689591 2709707 2730401 2751928 2774674 2798831 2824379 2851397 2879990
48917 2879990 2909806 2940080 2970479 3001574 3034176 3068458 3103935 3140043 3176412 3212847 3249422
48906 3249422 3286490 3324350 3363060 3402772 3443984 3487118 3532003 3578151 3625422 3674076 3724234
48895 3724234 3775731 3828525 3882991 3939590 3998367 4058769 4119934 4181317 4243208 4306438 4371387
48884 4371387 4437410 4503459 4569022 4634117 4698499 4761378 4822047 4880393 4936632 4990747 5042331
48873 5042331 5090833 5135783 5176957 5214520 5248968 5280743 5309766 5335412 5357090 5374859 5389252
48862 5389252 5400332 5407185 5408713 5404874 5396633 5384597 5368242 5346773 5320312 5289829 5256215 5219906
48850 5219906 5181111 5139920 5096261 5050233 5002415 4953407 4903132 4851016 4796790 4740670 4682819
48839 4682819 4623289 4562689 4502380 4443666 4386922 4331596 4276809 4221948 4167077 4112965 4060474
48828 4060474 4009921 3961397 3915599 3873647 3835859 3801377 3769434 3740460 3715350 3694091 3675823
48817 3675823 3660024 3646948 3636963 3630198 3626913 3627572 3632194 3640094 3650623 3663906 3680528 3700661 3723765
48804 3723765 3749014 3775810 3803967 3833714 3865537 3899865 3936738 3975725 4016145 4057396 4099243
48793 4099243 4141868 4185657 4230859 4277380 4324780 4372465 4420066 4467770 4516088 4565060 4613873
48782 4613873 4661581 4708059 4753798 4798826 4842517 4884645 4925962 4967281 5008510 5049155 5089307
48771 5089307 5129354 5168950 5207169 5243718 5279204 5314015 5347737 5380017 5411276 5441956 5471576
48760 5471576 5499178 5524363 5547261 5567801 5585771 5601530 5615839 5628737 5639209 5646364 5650544 5652889
48748 5652889 5653963 5653249 5650029 5644438 5637343 5629167 5619087 5605710 5588496 5568141 5545423 5520031 5490855
48735 5490855 5457159 5419149 5377667 5333746 5288429 5242584 5196933 5152476 5110629 5072456 5037914
48724 5037914 5006319 4977521 4952152 4930858 4913955 4901795 4894768 4892691 4894829 4900822 4911068 4925875
48712 4925875 4944763 4966945 4992029 5019795 5049757 5081381 5114419 5148564 5183059 5217065 5250185
48701 5250185 5282179 5312429 5340089 5364548 5385391 5402194 5414812 5423548 5428438 5428549 5422702 5410877
48689 5410877 5394345 5374243 5350507 5322440 5289975 5254105 5216198 5177128 5137164 5096674 5056665
48678 5056665 5018188 4981235 4944749 4908045 4871700 4836728 4803401 4771544 4741470 4713742 4688180
48667 4688180 4663984 4640827 4619032 4598631 4579076 4560079 4541931 4524630 4507436 4489796 4472105
48656 4472105 4454972 4438134 4420651 4401915 4381952 4360943 4338985 4316288 4293216 4270057 4246917
48645 4246917 4223745 4200244 4175882 4150244 4123353 4095516 4066922 4037536 4007333 3976397 3944749
48634 3944749 3912104 3877784 3841015 3801564 3760109 3717756 3675162 3632277 3588923 3545263 3501639
48623 3501639 3458425 3416266 3376100 3338543 3303367 3269811 3237263 3205506 3174508 3144296 3114909
$$ [...]
##END NTUPLES=NMR SPECTRUM
##END=
