##TITLE=NES1022_BrazilUW_9265944_LWrop1z5D7
##JCAMPDX= 6.0         $$ Bruker NMR JCAMP-DX V2.0
##DATA TYPE= NMR SPECTRUM
##DATA CLASS= NTUPLES
##ORIGIN= BRUKER
##OWNER= Administrator
$$ 1.72 TOPSPIN		Version 2.1
$$ 2015-07-11 16:14:36.878 -0700  Administrator@X
$$ Compression mode = diff/dup
##.OBSERVE FREQUENCY= 400.02188249412
##.OBSERVE NUCLEUS= ^1H
##.ACQUISITION MODE= SIMULTANEOUS (DQD)
##.ACQUISITION SCHEME= undefined
##.AVERAGES= 8
##.DIGITISER RES= 22
##SPECTROMETER/DATA SYSTEM= spect
##.PULSE SEQUENCE= zg30
##.SOLVENT NAME= COFFEE_meoh
##.SHIFT REFERENCE= INTERNAL, COFFEE_meoh, 1, 14.98509
##AUDIT TRAIL= $$ (NUMBER, WHEN, WHO, WHERE, PROCESS, VERSION, WHAT)
$$ ##TITLE= Audit trail, TOPSPIN		Version 2.1
$$ ##JCAMPDX= 5.01
$$ ##ORIGIN= Bruker BioSpin GmbH
$$ ##OWNER= Administrator
$$ $$ E:\/data/COFFEE/nmr/NES1022_BrazilUW_9265944_LWrop1z5D7/20/pdata/1/auditp.txt
$$ ##AUDIT TRAIL=  $$ (NUMBER, WHEN, WHO, WHERE, PROCESS, VERSION, WHAT)
(   1,<2015-07-11 16:14:28.878 -0700>,<Administrator>,<X>,<go>,<TOPSPIN 2.1>,
      <created by zg
	started at 2015-07-11 16:13:23.160 -0700,
	POWCHK enabled, PULCHK disabled,
       configuration hash MD5:
       21 0F 79 D6 B3 7B B4 F6 88 20 88 DB 03 48 BD 9F
       data hash MD5: 64K
       DC AB F0 03 6F 98 A8 19 A3 AA 06 CB 70 32 3D DE>)
(   2,<2015-07-11 16:14:32.535 -0700>,<Administrator>,<X>,<proc1d>,<TOPSPIN 2.1>,
      <Start of raw data processing
       efp LB = 0 FT_mod = 6 PKNL = 1 PHC0 = 0 PHC1 = 0 SI = 32K 
       data hash MD5: 32K
       C7 66 FE 12 4A 97 C2 8E 9C D7 63 99 BE C8 0F 7E>)
(   3,<2015-07-11 16:14:32.816 -0700>,<Administrator>,<X>,<proc1d>,<TOPSPIN 2.1>,
      <pk PHC0 = 94.22974 PHC1 = 0 
       data hash MD5: 32K
       F6 96 46 EA 3A E3 63 E4 24 05 3D A6 54 3F 87 14>)
(   4,<2015-07-11 16:14:32.941 -0700>,<Administrator>,<X>,<proc1d>,<TOPSPIN 2.1>,
      <abs ABSG = 1 
       data hash MD5: 32K
       52 FE D4 09 CB 45 92 1C E5 AE 1C 62 61 77 68 66>)
(   5,<2015-07-11 16:14:33.003 -0700>,<Administrator>,<X>,<proc1d>,<TOPSPIN 2.1>,
      <abs ABSG = 2 
       data hash MD5: 32K
       57 02 EF 6E 4C 0A 7F C9 28 DB 0D 02 23 F1 91 F6>)
(   6,<2015-07-11 16:14:33.066 -0700>,<Administrator>,<X>,<proc1d>,<TOPSPIN 2.1>,
      <abs ABSG = 3 
       data hash MD5: 32K
       05 AE 61 90 0F 50 45 45 1F 5E CB B5 25 B8 D1 CE>)
(   7,<2015-07-11 16:14:33.144 -0700>,<Administrator>,<X>,<proc1d>,<TOPSPIN 2.1>,
      <abs ABSG = 4 
       data hash MD5: 32K
       78 BE DE 63 33 69 20 94 39 45 84 7C E2 44 99 30>)
(   8,<2015-07-11 16:14:33.191 -0700>,<Administrator>,<X>,<proc1d>,<TOPSPIN 2.1>,
      <abs ABSG = 5 
       data hash MD5: 32K
       D7 18 E1 95 51 88 09 18 EC FC 75 B3 38 51 37 7F>)
$$ ##END=
$$ 
$$ $$ hash MD5
$$ $$ FA 93 EE A8 72 E5 69 3C 98 93 55 BF DD AF A3 50
##$RELAX= 
##$RELAX= 
##$RELAX= 
##$RELAX= 
##$RELAX= 
##$RELAX= 
##$RELAX= 
$$ Bruker specific parameters
$$ --------------------------
##$DU= <E:\>
##$EXPNO= 20
##$NAME= <NES1022_BrazilUW_9265944_LWrop1z5D7>
$$ [...]
##$TP= (0..7)
150 150 150 150 150 150 150 150
##$TP07= 0
##$TPNAME0= <>
##$TPNAME1= <>
##$TPNAME2= <>
##$TPNAME3= <>
##$TPNAME4= <>
##$TPNAME5= <>
##$TPNAME6= <>
##$TPNAME7= <>
##$TPOAL= (0..7)
0.5 0.5 0.5 0.5 0.5 0.5 0.5 0.5
##$TPOFFS= (0..7)
0 0 0 0 0 0 0 0
##$TUNHIN= 0
##$TUNHOUT= 0
##$TUNXOUT= 0
##$USERA1= <user>
##$USERA2= <user>
##$USERA3= <user>
##$USERA4= <user>
##$USERA5= <user>
##$V9= 5
##$VALIST= <valist>
##$VCLIST= <CCCCCCCCCCCCCCC>
##$VD= 0
##$VDLIST= <DDDDDDDDDDDDDDD>
##$VPLIST= <PPPPPPPPPPPPPPP>
##$VTLIST= <TTTTTTTTTTTTTTT>
##$WBST= 2048
##$WBSW= 25
##$XGAIN= (0..3)
0 0 0 0
##$XL= 0
##$YL= 0
##$YMAX_a= 629780
##$YMIN_a= -524935
##$ZGOPTNS= <>
##$ZL1= 120
##$ZL2= 120
##$ZL3= 120
##$ZL4= 120
##$ABSF1= 14.98509
##$ABSF2= -5.573092
##$ABSG= 5
##$ABSL= 3
##$ALPHA= 0
##$AQORDER= 0
##$ASSFAC= 0
##$ASSFACI= 0
##$ASSFACX= 0
##$ASSWID= 0
##$AUNMP= <proc_prof1d_extract_pilot.lims>
##$AXLEFT= 0
##$AXNAME= <>
##$AXNUC= <1H>
##$AXRIGHT= 0
##$AXTYPE= 0
##$AXUNIT= <>
##$AZFE= 0.1
##$AZFW= 0.1
##$BCFW= 0
##$BC_mod= 0
##$BYTORDP= 0
##$COROFFS= 0
##$CY= 15
##$DATMOD= 1
##$DC= 0
##$DFILT= <>
##$DTYPP= 0
##$F1P= 0
##$F2P= 0
##$FCOR= 0.5
##$FTSIZE= 32768
##$FT_mod= 6
##$GAMMA= 0
##$GB= 0
##$INTBC= 1
##$INTSCL= 1
##$ISEN= 128
##$LB= 0
##$LEV0= 0
##$LPBIN= 0
##$MAXI= 10000
##$MC2= 0
##$MEAN= 0
##$ME_mod= 0
##$MI= 0
##$NCOEF= 0
##$NC_proc= -8
##$NLEV= 6
##$NOISF1= 0
##$NOISF2= 0
##$NSP= 0
##$NTH_PI= 0
##$NZP= 0
##$OFFSET= 14.98509
##$PC= 1
##$PHC0= 94.22974
##$PHC1= 0
##$PH_mod= 1
##$PKNL= yes
##$PPARMOD= 0
##$PPDIAG= 0
##$PPIPTYP= 0
##$PPMPNUM= 2147483647
##$PPRESOL= 1
##$PSCAL= 4
##$PSIGN= 0
##$PYNMP= <proc.py>
##$REVERSE= no
##$SF= 400.02
##$SI= 32768
##$SIGF1= 0
##$SIGF2= 0
##$SINO= 400
##$SIOLD= 32768
##$SPECTYP= <>
##$SREGLST= <1H.CDCl3>
##$SSB= 0
##$STSI= 32768
##$STSR= 0
##$SW_p= 8223.68421052631
##$SYMM= 0
##$S_DEV= 0
##$TDeff= 65536
##$TDoff= 0
##$TI= <>
##$TILT= no
##$TM1= 0
##$TM2= 0
##$TOPLEV= 0
##$USERP1= <user>
##$USERP2= <user>
##$USERP3= <user>
##$USERP4= <user>
##$USERP5= <user>
##$WDW= 1
##$XDIM= 32768
##$YMAX_p= 444935685
##$YMIN_p= -669951
##$CURPLOT= <Network HP LaserJet P1505>
##$CURPRIN= <$Network HP LaserJet P1505>
##$DFORMAT= <normdp>
##$LAYOUT= <+/1D_H.xwp>
##$LFORMAT= <normlp>
##$PFORMAT= <normpl>
##$SURQMSG= 1
$$ End of Bruker specific parameters
$$ ---------------------------------
##NTUPLES= NMR SPECTRUM
##VAR_NAME=  FREQUENCY,     SPECTRUM/REAL,   SPECTRUM/IMAG
##SYMBOL=    X,             R,               I
##VAR_TYPE=  INDEPENDENT,   DEPENDENT,       DEPENDENT
##VAR_FORM=  AFFN,          ASDF,            ASDF
##VAR_DIM=   32768,         32768,           32768
##UNITS=     HZ,            ARBITRARY UNITS, ARBITRARY UNITS
##FACTOR=    0.250966925370066, 1,           1
##FIRST=     8223.43324360094, -136944,      9020
##LAST=      0,             19849,           -50565
##MIN=       0,             -669951,         0
##MAX=       8223.43324360094, 444935685,    0
$$ Real data points
##PAGE= N=1
##DATA TABLE= (X++(R..R)), XYDATA
$$ [...]
19433c50714J749f1203j46666Q9076C9837b1969c956A39534c27091J37508H1022
19421c40227d9419A07251b00721j07640J5222g3990j01615A86609i1596r4175
19411a85771p3026i7581D880J7998b41194h1324A38026b31748a01907o6447F6813
19399b23429F1239Q4860C2139a75045D7048i9384A00869b73413d7239B12181p7743
19388A34438F1900k9066J73543b83576E4572e9496B02418a22287F8302b09913
19377b35395b7029l75908A05426f7077K9550n15727b67903a11803r7187j28794
19367c37784d2241p8008l4785J2739l28175a06262C40774b15853n5054g7077n4032
19356a31109p7964g1316j07165A3714i4138K732b9233E8050b72840j8492A72462
$$ plain form
19433 -350714 -348965 -61203 -207869 -118793 39837 -21969 -3956 139534 -327091 -189583 81022
19421 -340227 -49419 107251 -200721 -308361 -293139 -73990 -175605 186609 -91596 -185771
19411 -185771 -258797 -97581 4880 22878 -241194 -81324 138026 -231748 -101907 -168354 66813
19399 -223429 61239 146099 32139 -175045 47048 -99384 100869 -273413 -47239 212181 134438
19388 134438 61900 32834 206377 -283576 54572 -59496 202418 -122287 68302 -209913
19377 -235395 -27029 -402937 105426 -67077 -37527 -553254 -267903 -111803 -208990 -337784
19367 -337784 -42241 -120249 -155034 -142295 -470470 -106262 340774 -215853 -270907 -77077 -131109
19356 -131109 -209073 -71316 -178481 13714 -94138 -91406 -29233 58050 -272840 -291332 172462
19344b4521m9808A84338b03967j07112a7411C89i4515G6340a87176e5681I3041
19332C025R1711d0465m2728A91177c72100A56771E3882P397b56831M1369J04289
19321a11173a0273n1120J9117j77222K4596E7a69246E6868M3982c1179g87j15769
19309a16556M8211k22400P7509l01828a71944A77903d62524h3967r0380r9614
19299b73961a6981l28787f1321l28024A05327a79598K0281o0146i4242A26829
19288A21926D5903g5675C1519a40263p1519R0087K3764d6973l9150o2687D891
19276f5241K1803k04606A15253J76490A42802A7412J41611p708F9692a21494D9055
19264a29707j25166B9035a53252A21654n5976a61896I9990J8608a86089M1496
$$ plain form
19344 -24521 -74329 184338 -203967 -311079 -17411 389 -94515 76340 -187176 -55681 93041
19332 3025 94736 -40465 -83193 191177 -372100 156771 53882 61279 -256831 -215462 -111173
19321 -111173 -10273 -61393 -42276 -219498 -194902 57 -169246 56868 100850 -31179 -787 -116556
19309 -116556 -68345 -290745 -213236 -515064 -171944 177903 -462524 -83967 -174347 -273961
19299 -273961 -16981 -345768 -61321 -389345 105327 -179598 -159317 -219463 -94242 126829
19288 121926 45903 -75675 31519 -140263 -211782 -121695 -97931 -46973 -86123 -148810 4891
19276 -65241 -43438 -248044 115253 291743 142802 17412 159023 151315 69692 -121494 49055
19264 -129707 -254873 29035 -153252 121654 65678 -161896 99990 118598 -186089 -144593
19254a44593I9904e7531j33317B94151a99547L3875A26674a72668I3135J93553
19244B86688a31641f5331A2951J64115c57139A2926c1102O930a1880j98898c8634
19232a19764A30880B5487B629b98425D1365b68847N5673L9090P5995B88364B339
19220A64225G5523O3533i9360l8651k9511D9254f3975j40326k8841K4104j74149
19209c83187a87610O7952L7977A71579f3846k27202E2543b51302G4033o726a99912
19197c1606q0055K3625L5141A39872e8464l12874J79576a7451j12331C3408L2703
19186F6111d678B78978e637m2654j6925j28478e1324n1002A7729O9423K9123D4923
19173a77967L124C2407e46281a91800h7601H8185b08083A15069b16884a4633q9518
$$ plain form
19254 -144593 99904 -57531 -190848 294151 -199547 -165672 126674 -172668 93135 286688
19244 286688 -131641 -65331 12951 177066 -357139 12926 -31102 -24172 -11880 -210778 -38634
19232 -119764 130880 25487 2629 -298425 41365 -268847 -213174 -174084 -98089 288364 2339
19220 164225 75523 139056 -99360 -138011 -167522 49254 -63975 -204301 -233142 -209038 -383187
19209 -383187 -187610 -119658 -81681 171579 -63846 -291048 52543 -251302 74033 67307 -199912
19197 -31606 -111661 -88036 -52895 139872 -58464 -371338 -191762 -17451 -129782 33408 66111
19186 66111 -4678 278978 -5637 -48291 -65216 -193694 -51324 -102326 17729 87152 116275 44923
19173 -177967 -174843 32407 -546281 -191800 -87601 88185 -208083 115069 -216884 -14633 -104151
19162a04151r8435a1186A6561J94051a22961C38002B35P8193d35167B71880a05442
19150b04850C11960D4526a20468A68713o2015h7360q3932c0560q3318L4261E5788
19138A89481b57460K1146c2162p5253G1562a36915B17132a22077n231A01138B5798
19126a41698K1021N9807A30462b52605k2310A20647b18753d8499n4263m2272k34329
19115c79363F5007J22165C8504e03590c5537j84349G3467o532i6704j59424k27508
19104d83636K09370A97680c8436j04085C3737c03658O6574B64874D8634a6998
19093c47802a06611A46893c3226m6439C65621b5634n10087d263F5512D46L32921
19082C33367F0919c38699a21638B1711g3966o9837B80887b03086q1630J29955
$$ plain form
19162 -104151 -202586 -11186 16561 210612 -122961 338002 235 78428 -435167 271880 -105442
19150 -204850 311960 44526 -120468 168713 106698 -87360 -171292 -30560 -113878 -79617 55788
19138 189481 -257460 -236314 -32162 -107415 71562 -136915 217132 -122077 -127308 101138 25798
19126 -141698 -120677 -60870 130462 -252605 -274915 120647 -218753 -48499 -102762 -145034 -379363
19115 -379363 65007 187172 38504 -503590 -35537 -219886 73467 66935 -96704 -256128 -483636
19104 -483636 -274266 197680 -38436 -142521 33737 -303658 -237084 264874 48634 -16998
19093 -347802 -106611 146893 -33226 -79665 365621 -25634 -535721 -4263 65512 446 333367
19082 333367 60919 -338699 -121638 21711 -73966 -143803 280887 -203086 -284716 -154761
19072a54761l1459I9430P2919b65615P5139g0761I5515a79806N5691o6062P8253
19061a11924k46795a40361O8365j38171A02552d44813B19451h3297B4142K52568
19051B76710b71289J08738e8954A54580f8257A41446o0968a01270k4357j6854
19041a42481l6520d2031j94083C27363A20744b36053Q5317l1272C917f08073K93028
19030c15045O6917A98010E8703j4050a99060K2340d5608B77997j17398i823l91984
19019d01807B16193b04990C09575D0095a69656P1558c2966A48531L9890R6004
19009B84425h8314A08946a0884D945O6677f6345j77123G3837c879G6708a70950
18997c89189a05996A84645a52221M7156C4170a46506a7384j77992i1739a028A31641
$$ plain form
19072 -154761 -186220 99430 172349 -265615 -190476 -70761 95515 -179806 -124115 -190177 -111924
19061 -111924 -358719 -140361 -71996 -210167 102552 -444813 219451 -83297 24142 276710
19051 276710 -271289 -162551 -58954 154580 -68257 141446 80478 -101270 -125627 -142481
19041 -142481 -179001 -42031 -236114 327363 120744 -236053 -150736 -182008 3917 -608073 -315045
19030 -315045 -248128 198010 58703 44653 -199060 -176720 -45608 277997 160599 -9823 -401807
19019 -401807 216193 -204990 309575 40095 -169656 -98098 -32966 148531 188421 284425
19009 284425 -88314 108946 -10884 4945 71622 -66345 -243468 73837 -3879 76708 -170950
18997 -389189 -105996 184645 -152221 -105065 34170 -146506 -17384 -195376 -91739 -1028 131641
18985a55960I8979A5082R4176B776d6836k62937b1924p5827h602j13238j58697
18974b80537e4087j4998B89825R9534M90445D04657f22H4223b64486A09419d18639
18962a14689c1677C62650a47626P733d3585B9430a96240E1531d95166B6139c4930
18950i3228D7695l922L4264b09829K958Q7664r3477H7668M9179a02166A93845
18938a82223c0143j71757M7892j31730m1621a30400N9062I0823J8509a37034M5919
18927i1115J9716m1200k08083J45566A44469A9412b14171a04653G3726g4666A14528
18915A47933C9877a58670e3012p17C49070q01H8305J64932K29634K70514l09219
18904D44166o3973q1696d2184m4325C9647d2006p6923j5685j09495H0182b18108
$$ plain form
18985 -155960 98979 15082 109258 2776 -46836 -309773 -21924 -97751 -8602 -121840 -280537
18974 -280537 -54087 -69085 289825 389359 879804 404657 -622 84223 -264486 109419 -418639
18962 -114689 -31677 362650 -147626 -139893 -43585 29430 -196240 51531 -495166 26139 -34930
18950 -93228 47695 43773 78037 -209829 -206871 -119207 -212684 87668 136847 -102166 193845
18938 -182223 -30143 -201900 -154008 -285738 -327359 -130400 -71338 90823 109332 -137034 -91115
18927 -91115 -71399 -112599 -320682 -175116 144469 19412 -214171 -104653 73726 -74666 114528
18915 147933 39877 -158670 -53012 -53729 349070 348269 88305 253237 482871 753385 444166
18904 444166 380193 298497 -42184 -86509 39647 -42006 -118929 -134614 -244109 80182 -218108
18892i6290j88272Q7502b0743j28539j33120J23338p1282E3700a33581A42467
18881a57927B0979J46467L4590a95133f1098B15329b42628R987E9967b15835j02486
18870c18321C704g3103r616j2893l11727J18475D3723j542e0407C97688D9955
18858a05046l08823B77296H1412K45218q9263G6403a92568h5410A95988b50658
18847b22691L6635A20811j0467a55053M4608l39130a17746l77885D4550a6615
18836A66337a77146c9479G3317a95196o5307H1369a56130H8070a89462c7353l99653
18825d37006a7879p1369A25401a80992B34503R279a52359a0570j86851A41739
18814E2664j1615a5579A11083n869B574K47845L886a82222A07669a66649A52387
$$ plain form
18892 -96290 -284562 -197060 -20743 -149282 -282402 -159064 -230346 53700 -133581 142467
18881 -157927 20979 167446 202036 -195133 -61098 215329 -242628 -232641 59967 -215835 -318321
18870 -318321 3704 -73103 -82719 -95612 -407339 -288864 43723 42181 -50407 397688 49955
18858 -105046 -413869 277296 81412 326630 237367 76403 -192568 -85410 195988 -250658
18847 -222691 -186056 120811 110344 -155053 -110445 -449575 -117746 -495631 44550 -16615
18836 166337 -177146 -39479 73317 -195196 -260503 81369 -156130 88070 -189462 -37353 -437006
18825 -437006 -17879 -89248 125401 -180992 234503 243782 -152359 -10570 -197421 141739
18814 52664 41049 -15579 111083 105214 2574 250419 254305 -182222 107669 -166649 152387
18802f6984n5651A23141b54196L4471C5057i0896r6366n5659J01857F1981C0656
18790A64177F7458b73764j16587C7044b21015q0172A34613d1103k25360L0726
18780b35737A21487n546c62341b1198m4404K9956j59689A2727b45109R1768l26378
18769d79719g3000L5880B12944J1840a66061A0374b01508Q6749j41847O9253O6232
18758a21121a4250H1334a05835j46009B68420b0839G4790a64183O2000a0100j86472
18747a96572P1295j94287i608j13468N1055k56195A96040F311J5397a76323C2744
18735B51791a49053A87374G8880a59186B7820c5380G1422a30923k88608J44572
18725b74959c1167A15773J32538q1720a85558m5385A01103a40995e4470D6910
$$ plain form
18802 -66984 -122635 123141 -254196 -219725 35057 -90896 -187262 -242921 -141064 61981 30656
18790 164177 67458 -273764 -390351 37044 -221015 -301187 134613 -41103 -266463 -235737
18780 -235737 121487 115941 -362341 -21198 -65602 -35646 -195335 12727 -245109 -153341 -479719
18769 -479719 -73000 -37120 212944 224784 -166061 10374 -201508 -114759 -256606 -187353 -121121
18758 -121121 -14250 81334 -105835 -251844 268420 -20839 74790 -164183 -102183 -10100 -196572
18747 -196572 -125277 -319564 -9608 -123076 -72021 -328216 196040 6311 21708 -176323 32744
18735 251791 -149053 187374 78880 -159186 27820 -35380 71422 -130923 -419531 -274959
18725 -274959 -31167 115773 248311 166591 -185558 -230943 101103 -140995 -54470 46910
18714A97840A0771d15002g7096K5516a310k73633a13059L5825j7766C60438a61654
18702b70374B24034I5894b25320A34778m3444e7016B6972c6887k55432a8978I9396
18690d8723G4957B6180b94583B38346a67646b9095r9249B67970h0485l225l10236
18679c93946A76870J11099G9553C3388b00973i5078J9676m5212l1799E4410L43158
18668C97568a22594j43467M9200B7806K32578j09419c74955C04699a22443n647
18658a28090D3936b81687a00477j15595j98034i8092k2627J5806B05457D2654
18647a92102P6545e3330k34761C88459I3210f6407b5810n17597J35297h7980j45326
18636b33306L3408L5500A1550K95257E0029B151c54346c9986k25589R6225A22054
$$ plain form
18714 197840 10771 -415002 -77096 -51580 -1310 -274943 -113059 -77234 -95000 360438 -161654
18702 -270374 224034 95894 -225320 134778 91334 -57016 26972 -36887 -292319 -18978 99396
18690 -48723 74957 26180 -294583 238346 -167646 -29095 -128344 267970 -80485 -83710 -393946
18679 -393946 176870 287969 79553 33388 -200973 -95078 -75402 -120614 -152413 54410 397568
18668 397568 -122594 -266061 -216861 27806 260384 150965 -374955 304699 -122443 -128090
18658 -128090 43936 -281687 -100477 -216072 -414106 -98092 -120719 -104913 205457 42654
18647 -192102 -115557 -53330 -288091 388459 93210 -66407 -25810 -543407 -408110 -87980 -233306
18636 -233306 -199898 -164398 11550 306807 50029 2151 -354346 -39986 -265575 -169350 122054
18624h4036j35560K4808A37718J94688g7462A55546c41712i7082A73795C2569
18613h3076o2326j40618B05406b25918a00627k1607B4789a0745A30946D1665K5808
18602F7473Q1417f8706C1860O2367f8233H0348b29138D9311h1430l0346F2160
18590a9059k58185A33558e0781j49425n0344a08414c9012j20125b5398k22180
18580b47578J7226H3155c13423b7766r8497D29208a02261A40580a3547n08770
18570e22317d2383k071j18754q268h4748B4606b6007j15208O5687l3363a8193
18558I6221g2461B01224d90916e1213A62416c02421B2841a42922j84336A31414
18547A88043g5834n9914A01658J02767e5376o6136A95391b0605C37072d3731k10257
$$ plain form
18624 -84036 -219596 -194788 137718 332406 -77462 155546 -341712 -97082 173795 32569
18613 -83076 -145402 -286020 205406 -225918 -100627 -122234 24789 -10745 130946 41665 67473
18602 67473 148890 -68706 31860 94227 -68233 80348 -229138 49311 -81430 -111776 62160
18590 -19059 -277244 133558 -50781 -200206 -250550 -108414 -39012 -159137 -25398 -247578
18580 -247578 -230352 83155 -313423 -27766 -126263 429208 -102261 140580 -13547 -522317
18570 -522317 -42383 -44454 -163208 -171476 -84748 24606 -26007 -141215 -75528 -108891 -18193
18558 96221 -72461 201224 -490916 -51213 162416 -302421 22841 -142922 -327258 131414
18547 188043 -75834 -135748 101658 204425 -55376 -121512 195391 -20605 337072 -43731 -253988
18536b53988a0505n108k90990C8652b69752a32880A38863e6596A0514a46651q451
18525a55102A16608C2744J8233a66772q5545B725K0419a08105j03722e3400m1964
18514i5364C7651M5167b1561C9028i4160j83703M1586l9295L5812a01227N0318
18503e0909r3476A2875h1101D52223D4444f8782l7864A63697c9095l56611C52558
18491a14579j55702A82606a40189o7553A21510Q9628E9377L7478J4584e4244A67582
18479b41653J03198K1534A84952q4178m1335J54737c28431J42627A42751a34799
18468c97368a67092j07274D5873O5741e5488C31355c9043m9054D9103K0355a95489
18456e8490o972l2541c3368F0925c44830h3164m6491A7375J19335b2265r6584
$$ plain form
18536 -253988 -10505 -15613 -306603 38652 -269752 -132880 138863 -56596 10514 -146651 -155102
18525 -155102 116608 32744 50977 -166772 -252317 2725 23144 -108105 -211827 -53400 -95364
18514 -95364 37651 82818 -21561 39028 -94160 -277863 -236277 -275572 -239760 -101227 -50909
18503 -50909 -144385 12875 -81101 452223 44444 -68782 -106646 163697 -39095 -395706 352558
18491 -114579 -270281 182606 -140189 -207742 121510 211138 59377 96855 111439 -54244 167582
18479 -241653 -138455 -116921 184952 100774 59439 214176 -328431 -185804 142751 -134799
18468 -397368 -167092 -274366 45873 111614 -55488 331355 -39043 -88097 49103 69458 -195489
18456 -58490 -65462 -98003 -33368 60925 -344830 -83164 -129655 17375 136710 -22265 -118849
18445a18849l0117j22283b0131j3714B80323d6435j12122n493G5228J34394b44686
18433F1302A3562J7182b39432B98577b58441A0022d77979a12043A27055e6525
18422B735J2914e2666j4895F1393b22011j5801d4336B23384a19244a4116D4261
18410H8756a31391b508E5428G601P4756a34486B00519a87036A83270o1313b03189
18398a78154c1713d742k21777A64955a02760A08751i3517n7715j6479K4283b0451
18386A51628l0577b07859a109k42782H0923a20155B61734c9903j42284h3353A56265
18374a6853E7110g704G4075a17718B03148F6149a71057F2084c1407I7565a06164
18362a93952b4509l1059A67614a98208P4990A91534e5082I3101K04581g795j17824
$$ plain form
18445 -118849 -148966 -271249 -20131 -33845 280323 -46435 -158557 -164050 75228 209622 -244686
18433 61302 13562 30744 -239432 298577 -258441 10022 -477979 -112043 127055 -56525
18422 2735 15649 -52666 -67561 61393 -222011 -237812 -44336 223384 -119244 -14116 44261
18410 88756 -131391 -2508 55428 7601 82357 -134486 200519 -187036 183270 121957 -203189
18398 -178154 -31713 -4742 -226519 164955 -102760 108751 -93517 -151232 -167711 -143428 -20451
18386 151628 121051 -207859 -1109 -243891 80923 -120155 261734 -39903 -182187 -83353 156265
18374 -16853 57110 -7704 74075 -117718 203148 66149 -171057 62084 -31407 97565 -106164
18362 -193952 -24509 -55568 167614 -198208 -123218 191534 -55082 93101 297682 -7795 -125619
18351a25619j73928A3918a10493A60136c50934A31274J22901K5316q0336p2520
18341A26635b61526J3412B26991c20148F9662R920a05935J2437n02j3140k140
18330a09280a2223n6802A90658a18328n3168A6234K57745b56660b9459j24470
18320a53929p3847H5527C8766Q6600B9088b74041R5170A707f9296A95618d6314
18308d8467j14563p9636c737A07778a57032H3891c7364l6995A58294A3361L92854
18297D06215a50598H6270Q0844i5576D7692b1153l05216A25293a74399Q0368J1338
18286h2693d0468n3490B928b54064C7905b68600P3312k45333a67038M7507G8369
18274g9567H9340a26265A45142p0873B5948J40782b1275k78672I1811b44062j78330
$$ plain form
18351 -125619 -299547 13918 -110493 160136 -350934 131274 254175 279491 199155 126635
18341 126635 -261526 -248114 226991 -320148 69662 79582 -105935 -93498 -94000 -107140 -109280
18330 -109280 -12223 -69025 190658 -118328 -171496 16234 273979 -256660 -29459 -153929
18320 -153929 -227776 85527 38766 125366 29088 -274041 -178871 1707 -69296 195618 -46314
18308 -48467 -163030 -242666 -3737 107778 -157032 83891 -37364 -74359 158294 13361 406215
18297 406215 -150598 86270 167114 -95576 47692 -21153 -326369 125293 -174399 -94031 -82693
18286 -82693 -40468 -93958 2928 -254064 37905 -268600 -195288 -440621 -167038 -119531 78369
18274 -79567 89340 -126265 145142 74269 25948 166730 -21275 -299947 91811 -244062 -422392
18263d22392J85757A49562h0750j66999J11097B7665l221M5054B7786d16523A22303
18251A513i0699A64453o4946j2802a57787B1181b82075a24641A11168a56020c9744
18239G5583L9152b2784n6049M557l27253B83784a40566I204R4104J50351A00262
18227a65533g6975a4312j59430A76866i814j75037B27283d85076J52504A64666
18216c95707C32845G447K33370b64626C4647c8875l83959F1783J53976a44634
18205C8954i1682F9159M4057Q5533b73428C8330h5599p3243H5995e2242j7187
18194f9429A86715L5197a81265M8905n4663H9566c6528A75949J15317a24275M16
18183a23859D2227g1939C1535K03863I1274i3980I4335J30222a28987C16467G9652
$$ plain form
18263 -422392 -236635 149562 -80750 -247749 -136652 27665 24444 69498 27786 -416523 122303
18251 1513 -90699 164453 99507 86705 -157787 21181 -282075 -124641 111168 -156020 -39744
18239 75583 114735 -22784 -78833 -74276 -401529 283784 -140566 9204 103308 253659 100262
18227 -165533 -76975 -14312 -173742 176866 -9814 -184851 227283 -485076 -332572 164666
18216 -395707 332845 7447 240817 -264626 34647 -38875 -422834 61783 215759 -144634
18205 38954 -91682 69159 113216 198749 -273428 38330 -85599 -158842 85995 -52242 -69429
18194 -69429 186715 221912 -181265 -132360 -187023 89566 -36528 175949 291266 -124275 -123859
18183 -123859 42227 -71939 31535 235398 91274 -93980 94335 224557 -128987 316467 79652
18171h87I8319b72148J02100I5421a79547A03533k0199b53490c4118I0078k8660
18160F1418J20826g6050h729D6086c4437H1811b05792G057K65568b11021B12485
18148B16359r8602P0437e0670q723j03675K7830e2389l1370C18448a65497B71663
18136H6547N561c4155a0605r3311D8913e1589A06916D825K8244e6379m11716A16160
18123a18573e315I2522g2809A09266a24399e1259J0372B44397o8087a15139l19518
18112d34657A79692e8387A1638h2475C0063b07549O1428M2947k73865d5724j88652
18101b34376b1774B1334N7260a05405C57397a04353B50442A04709Q807k8958M5818
18090A30376c65661J20744A31852N6975d11580A21995b15161C34720a47922D7673
$$ plain form
18171 -887 98319 -272148 -170048 95421 -179547 103533 83334 -253490 -34118 90078 61418
18160 61418 182244 -76050 -8729 46086 -34437 81811 -205792 7057 272625 -211021 212485
18148 216359 117757 188194 -50670 -59393 -163068 -135238 -52389 -83759 318448 -165497 271663
18136 86547 92108 -34155 -10605 -103916 48913 -51589 106916 4825 33069 -56379 -468095 116160
18123 -118573 -5315 92522 -72809 109266 -124399 -51259 -40887 244397 176310 -115139 -434657
18112 -434657 179692 -58387 11638 -82475 30063 -207549 -146121 -103174 -377039 -45724 -234376
18101 -234376 -21774 21334 78594 -105405 357397 -104353 250442 104709 113516 84558 130376
18090 130376 -365661 -244917 131852 188827 -411580 121995 -215161 334720 -147922 47673
18079F3954a07400J5616B74837o1641d9083j9844c422B4637f7375k60781A36432
18067b0964A36317a16424a162j99178C1635b16264i4170M4447F1143a30917R21
18056a29996A5878b93578A18256f6807A59972h9305A07197k2761R8147b0641D8557
18044a77131f2915a1189H7801A0708c2693j67511o0061A92723F9199j6374R1656
18033A44481J2545c937B5839a42223A31792J06174B8017a56185j2740B91028e9838
18021D677h6486a7770q020F46a24327k60471A31684K9631f9108r6795A25d29727
18008c55592a56039A67161b25161G9869a08532A49502g729j40941j2492e2637
17997A87160a91331B37955j18400P6991a88711B39806o0878p6568h3545A31316
$$ plain form
18079 63954 -107400 -91784 274837 213196 -49083 -68927 -3422 24637 -67375 -328156 136432
18067 -20964 136317 -116424 -1162 -200340 31635 -216264 -94170 -49723 61143 -130917 -129996
18056 -129996 15878 -293578 118256 -66807 159972 -89305 107197 84436 182583 -20641 48557
18044 -177131 -62915 -11189 87801 10708 -32693 -200204 -260265 192723 69199 52825 144481
18033 144481 157026 -3937 25839 -142223 131792 237966 28017 -156185 -168925 291028 -59838
18021 4677 -86486 -17770 -25790 646 -124327 -384798 131684 161315 -69108 -165903 125 -429727
18008 -355592 -156039 167161 -225161 79869 -108532 149502 -7729 -148670 -161162 -52637
17997 187160 -191331 237955 119555 196546 -188711 239806 178928 102360 -83545 131316
17986A75396J42566d5119k9963q6638A13991J23081I7410j4423K50809j52444
17976A81352m9099j2126a24716O0853H3591K1106J99941G7561E037i0367C5360
17964f3717F0441J63185c1605g587A63062a10392H1139J95704j20716J6741c15465
17952a986k05718j4165l3233B8352M5985A4832c6719B70149a25588b2563j96745
17941b19308A0306c60775g6102A91054b0580n2081j17135G0005b52373B81497
17930f6997A31810J76626D8483K7486b77544a02232A65604c8989A21023h7016
17919C76238a78j94996F5098K1280L5280a48300B2116J78246c03198d3975a7266
17907f0186C72287c5415H4101L7802A6533R6123i6315A39476F7607L9074M9232
$$ plain form
17986 175396 317962 -45119 -75082 -161720 113991 237072 97410 82987 333796 181352
17976 181352 132253 120127 -124716 -63863 83591 104697 304638 77561 5037 -90367 35360
17964 -63717 60441 223626 -31605 -7587 163062 -110392 81139 276843 156127 172868 -315465
17952 -1986 -207704 -221869 -255102 28352 74337 14832 -36719 270149 -125588 -22563 -219308
17941 -219308 10306 -360775 -76102 191054 -20580 -72661 -189796 70005 -252373 281497
17930 -66997 131810 308436 48483 75969 -277544 -102232 165604 -38989 121023 -87016
17919 376238 -178 -195174 65098 86378 121658 -148300 22116 200362 -303198 -43975 -17266
17907 -60186 372287 -35415 84101 121903 16533 112656 -96315 139476 67607 106681 155913
17896A55913C0376O6142p393i0473M456C88252A33270g6013A07444j7217J98469
17885B88696J48938j61159E5495K87793j8331j08508e7814A6714b99173E0662
17874a64745n8676E98237a8270B72871L1068c06334A85931f2103B36590r9372
17864A37218F2610a83345d5130k94468i5800o7492d570k07775a9142q5975o4665
17853a69782B53151a18371B43946j20799D9003g6805j0880A98550M6251F7466
17842A1791K52506q3409m0005J45251F8322J28167A9816P0063B2419g8201l68336
17831d46537a82717A26J1537g7438F3774J48366E5200M7081J2969c689F5580a70627
17818C03995o8574a70017b6883B14298r0501d5312G9416J98557j33950k5094I995
$$ plain form
17896 155913 30376 96518 89125 -90473 -86017 388252 133270 -76013 107444 90227 288696
17885 288696 437634 276475 55495 343288 324957 216449 -57814 16714 -299173 50662
17874 -164745 -223421 598237 -18270 272871 303939 -306334 185931 -62103 236590 137218
17864 137218 62610 -183345 -45130 -339598 -95800 -163292 -4570 -212345 -19142 -105117 -169782
17853 -169782 253151 -118371 243946 123147 49003 -76805 -87685 198550 244801 67466
17842 11791 264297 180888 140883 286134 68322 196489 19816 89879 22419 -78201 -446537
17831 -446537 -182717 126 11663 -77438 63774 212140 55200 102281 115250 -3689 65580 -170627
17818 303995 235421 -170017 -26883 214298 123797 -45312 79416 277973 144023 118929 9995
17806B4392J11797j205a53213g961A1350e2867B36514H5335b470j04500j03797
17795b10767e6983A04868c18397E22876A83956b4929j07194A55184l3806M4677
17785A66055F3883O4716P7638f4903k96151A62211d1479B2263k790N183J32825
17774A57481D3155J35754a46140A2087J99220c5755R192B17317K7734a36614B8929
17762A64474p60a16607J3336B74331o3541I5119j1875a01203C24351j49084f3145
17750D7834L4826d6581A17719J67080f2530A05243b01030B72753c2945C0744g1696
17738b8612C4742A5594J13276d955j32226A85141a04729B20881M8705k1141k6514
17727B21931j02079l4490l735J41887n4867K743c1130G4867L6845J56810A17826
$$ plain form
17806 24392 136189 134984 -153213 -7961 11350 -52867 236514 85335 -2470 -106970 -210767
17795 -210767 -56983 104868 -318397 522876 183956 -24929 -132123 155184 121378 166055
17785 166055 63883 128599 206237 -64903 -361054 162211 -41479 22263 19473 24656 157481
17774 157481 43155 178909 -146140 12087 211307 -35755 -26563 217317 245051 -136614 28929
17762 164474 163714 -116607 -103271 274331 210790 95119 83244 -101203 324351 175267 -63145
17750 47834 82660 -46581 117719 284799 -62530 105243 -201030 272753 -32945 30744 -71696
17738 -28612 34742 15594 128870 -4955 -137181 185141 -104729 220881 269586 248445 221931
17727 221931 119852 85362 81627 223514 168647 171390 -31130 74867 111712 268522 117826
17715C50057I8501b31559g3015J6021j54209C75010A66734F2773a19369L0726
17705h8643B7084J68451J8612J99101b25712R3641B85825F6011J46460b27837
17694B76171j22855N4078c4256C69855a31494A31759h0570c7906F5314J61724
17684B27038r0247A860a21791N5942A86240J71940c7443A59947J15961c7745p9499
17673a17244A94578q9072l1706Q3055p47L2226B4522a8517A25901c4716H0391
17661b00889F928b9110j77608A15352j1310N8667E7740P1416m9517K14083d3645
17649c5887I5026j1449d9451A86943F4153L2300a3431n4363A27293K29981j9186
17638C38088j67095O0642a9638D5658J06928r084N6988J02886E0811a5710E4889
$$ plain form
17715 350057 98501 -231559 -73015 -56994 -211203 375010 166734 62773 -119369 -88643
17705 -88643 27084 195535 214147 413248 -225712 -132071 285825 66011 212471 -227837
17694 276171 153316 207394 -34256 369855 -131494 131759 -80570 -37906 65314 227038
17684 227038 136791 1860 -121791 -65849 186240 358180 -37443 159947 275908 -37745 -117244
17673 -117244 194578 105506 73800 156855 156108 188334 24522 -18517 125901 -34716 80391
17661 -200889 6928 -29110 -206718 115352 104042 162709 57740 129156 79639 293722 -43645
17649 -35887 95026 83577 -49451 186943 64153 96453 -13431 -67794 127293 357274 338088
17638 338088 170993 231635 -19638 45658 152586 143502 200490 303376 50811 -15710 54889
17626a16095A3140M3596L7165N4235E0680M5113l3498J2139J22257k8913L5893
17615B03671q0160D5424c07922D70847k32429f9148B23683j05297M47858k68060
17605B98184j44916P0927G3258M24634I8555K35506c0906a836A36045J1691E7115
17593A61150Q070b04446a9667l8993H7656b45171F98521l46808j2155H5470g214
17581A79479G2298A5994L17909C7875N3762L6867N3756G511J67223J50260m6629
17570B78365r4322P8038F671Q0948J90548j9269K53308I1261a26262C83632j87794
17559A95838J67276j67207J02398j23556O9242n4681o7970J57830o5105a13281
17548d1508C53611j16220I2244L25080j55811K57377j33323q6518p1775A05519
$$ plain form
17626 -116095 13140 56736 93901 148136 50680 95793 62295 74434 196691 167778 203671
17615 203671 123511 45424 -307922 470847 238418 -69148 223683 118386 566244 298184
17605 298184 153268 224195 73258 497892 98555 334061 -30906 -1836 136045 147736 57115
17593 161150 169220 -204446 -19667 -58660 87656 -245171 698521 351713 339558 85470 -7214
17581 179479 72298 15994 333903 37875 91637 128504 182260 7511 174734 324994 278365
17570 278365 184043 262081 6671 87619 278167 258898 512206 91261 -126262 383632 195838
17559 195838 363114 195907 298305 174749 243991 189310 121340 279170 214065 -113281
17548 -41508 353611 237391 92244 417324 261513 518890 385567 299049 227274 105519
17537d9119A86404J37973r0566r4321M43102C6248K13475j11250F0531P59209
17527H19740k50226K4611K42079j05295K75485k46391J23239k99274j15979M35099
17517I03088m30597A52356L01206k10O5148j35398L48893j26213L47254K09133
17507A162169l39244Q9088k48510j35040K5921A29837g3085A50586K56711p1605
17497C35692H1181K22955A07863J38052M15137k31187j97604k0310q3132O7793
17487A96612J74923J73793A68196D8534M73000j71835A47917k1374R6021J96723
17477D19287J05169c7882B77411m0911N3352j35398J4546J95368N2909j92106
17467B25171k0463J38695p8150b2716C38059j00887F9891K2150K65439N2615h051
$$ plain form
17537 -49119 186404 324377 233811 139490 582592 36248 249723 138473 60531 819740
17527 819740 569514 594125 836204 730909 1006394 760003 883242 583968 467989 903088
17517 903088 472491 152356 453562 453352 518500 383102 731995 605782 953036 1162169
17507 1162169 822925 912013 663503 528463 554384 129837 -73085 150586 407297 335692
17497 335692 81181 304136 107863 245915 661052 429865 232261 211951 128819 196612
17487 196612 371535 545328 168196 48534 521534 349699 147917 126543 222564 419287
17477 419287 524456 -37882 277411 236500 289852 154454 169000 364368 417277 225171
17467 225171 204708 343403 265253 -22716 338059 237172 69891 92041 357480 410095 -8051
17455G7872a45763B26468K43692J6780j79025j24159L94419A80193J73367j0904
17445C42656L37889l32165J47017B39584K26075k32277j6727K11359P7720B42851
17434F61177p1105k2510K21745B62165H8481L50410j97398j06154K19275A35724
17423C95861P8659k33339J88999L437O5086r4366R2244C8995L51992p0537K55555
17412E76005j51293j84446m8327P1250m6577j5138m8891J23196m5917I3191R8678
17401A91869C3180M81916e2421E2708L75418j161m1013j46404J41116j77896K58220
17390D60988j90366Q1434O8556q1098J74948c5060B00915K96077c1255B15072
17379D86201a37286b5649A33213K05317A11160K02577J08746j99324O9219K2411
$$ plain form
17455 77872 -145763 226468 470160 486940 307915 183756 578175 180193 353560 342656
17445 342656 680545 348380 495397 239584 465659 233382 216655 428014 505734 242851
17434 661177 590072 567562 789307 262165 88481 438891 241493 135339 354614 135724
17423 395861 474520 241181 430180 433617 498703 404337 496581 38995 390987 320450 576005
17412 576005 424712 240266 191939 263189 216612 201474 152583 275779 229862 93191 191869
17401 191869 33180 515096 -52421 52708 428126 426965 385952 239548 380664 202768 460988
17390 460988 270622 352056 420612 339514 514462 -35060 200915 496992 -31255 215072
17379 486201 -137286 -25649 133213 338530 111160 313737 422483 223159 292378 314789
17369C14789j34266J9441C5005f4646C18285j1750o5180J16183j36275B0480L92067
17358D12547l1271J7325l2131J34391G0613a26992C27355I8658J47933n2952L00702
17347D94341K5990k50065J92525B03932k2281A1320J43084L06441G9124L33032
17337D12156p1504j28105L8930K95257j56906A13423M51471B72002J7873L5887
17327C25762j17720o8536M84458p307j74141j39667N0529m6724l7001L17512A41467
17315D12518n0928j6030j46391L51916k43387J35089j81055j27174Q5622K57000
17305D77180B28303F9366J83304K60819A24497K80252j84292K08421p7464L31706
17295F83120C17773K9555P508o1519J46292F2899R4865K85038B10258K47800p2150
$$ plain form
17369 314789 180523 199964 35005 -64646 318285 306535 241355 357538 221263 20480 412547
17358 412547 381276 398601 366470 500861 70613 -126992 327355 98658 246591 193639 494341
17347 494341 520331 270266 462791 203932 181651 11320 154404 460845 79124 412156
17337 412156 340652 212547 251477 546734 389828 113423 564894 272002 289875 325762
17327 325762 208042 139506 623964 616657 442516 302849 353378 306654 269653 587165 141467
17315 412518 361590 345560 199169 551085 307698 442787 261732 134558 220180 477180
17305 477180 228303 69366 252670 513489 124497 404749 220457 428878 351414 683120
17295 683120 317773 347328 354836 293317 439609 62899 157764 442802 210258 458058 385908
17284C85908A74405K24033J54416k23885K52447B02709K57864A68702M77675I7280
17273C84143k9177j4912C4209K23859C1855M04113J82868k49141p7000l2513J36300
17262C96482k1387K25092j49821J44027R662A72113N9906Q096L01558J54886j80914
17251E15645A11762O1993J04796r0684M06207B32503A06627K49278j76193K72682
17241D52394o0753l7252j64058M1394J76043j69297K07664n4266j50185J70243
17231D11927K37478B99605K96077j27792o101B19665L02664k02507A16605M03480
17221E20085L4189j22927J52022j20523J20331o5062j31457A70202L36895K23712
17211G30809j86530k33571K21374p9295o3054J21080A92840M06189M3520P9730
$$ plain form
17284 385908 174405 398438 552854 328969 581416 202709 460573 168702 646377 97280
17273 384143 354966 340054 34209 258068 31855 435968 618836 369695 292695 260182 396482
17262 396482 375095 600187 450366 594393 604055 172113 232019 240115 541673 696559 515645
17251 515645 111762 173755 278551 187867 594074 232503 106627 355905 179712 452394
17241 452394 391641 354389 190331 231725 407768 238471 446135 391869 241684 411927
17231 411927 649405 299605 595682 467890 461789 219665 522329 319822 116605 520085
17221 520085 554274 431347 583369 462846 583177 518115 386658 170202 507097 730809
17211 730809 544279 310708 532082 452787 389733 510813 192840 599029 642549 722279
17201G22279k35693J71280K660j57799j18961K20388k15888M4429J35689j41589
17191D26795n3392M5000K18845A86579N86044C34712K81808k18055M43580j35430
17181G06615R5126j82334p3614j52316K01902k46525K89504k47879N8486n1570
17171C97395j2308Q7649K9494K18312j39598p5288K93685R5051l83886l1619P2984
17160E51871J37644B85942J92372K48439l0062j73408q9093j5184L60070B93987
17149D84700L46329A24636N23704K60513k50908l0396j62842J68462C12967M05518
17139G18485q8670K87779k03677o4608k29837K24747J28471k651C50579M6776
17129C97355J81545L31222l36971L55803j29034K9235m9213k69461N49648k19140
$$ plain form
17201 722279 486586 657866 660526 502727 383766 604154 388266 432695 568384 426795
17191 426795 373403 418403 637248 186579 772623 334712 616520 398465 842045 706615
17181 706615 801741 619407 545793 393477 595379 348854 638358 390479 448965 397395
17171 397395 385087 472736 502230 720542 580944 505656 799341 894392 510506 478887 551871
17160 551871 689515 285942 478314 726753 696691 523283 434190 419006 779076 293987
17149 484700 831029 124636 648340 908853 657945 627549 464707 633169 312967 718485
17139 718485 629815 917594 713917 649309 419472 644219 772690 770039 350579 397355
17129 397355 578900 910122 573151 928954 799920 829155 779942 510481 1060129 840989
17119H40989k05061K52649j30040k7858j03093K16511n7567L89626j68286k68351
17109G39519L41722k77606L3388J33889j75633L9802k88793j4061K10164j68486
17099E73905J93292J0955K533o2357K12780k55160J61666q0824j39796l6875P3983
17088F54102K79095l47594M73204j95464j32146j83929L28802q8474J31454J07239
17078A026289j70732J12342m77104L00644j01007L46542k00888J54277o7417M4722
17068I67668O4267j06237q2247K36801j67686J97226n1012j87021l4376M8006
17058H85389J56915l02830M00650k7580j96804j27606L93039k75071L02682m7818
17048A160966j75556R1491K8804l29517N15355m01778J61404R106j25233M9711
$$ plain form
17119 840989 635928 888577 758537 730679 627586 844097 786530 1176156 1007870 739519
17109 739519 1081241 803635 837023 970912 795279 835081 546288 532227 742391 573905
17099 573905 767197 778152 780685 718328 931108 675948 837614 756790 616994 580119 654102
17088 654102 933197 585603 1058807 863343 731197 547268 876070 787596 919050 1026289
17078 1026289 855557 967899 490795 791439 690432 1036974 836086 990363 922946 967668
17068 967668 1031935 925698 843451 1080252 912566 1109792 1058780 871759 837383 885389
17058 885389 1042304 739474 1140124 1112544 915740 788134 1181173 906102 1208784 1160966
17048 1160966 985410 1076901 1105705 776188 1291543 889765 1051169 1060275 935042 984753
17038I84753J29549K39927n27740J30731L41891k83933J70086J83743l01765Q4245
17028A151487K51022k03544l10960K56394q9280M98645l43570N4796J82337J13285
17018A560612j6050n70018M48350N4592p891p0344n26671O34255j85502K20769
17008A542102O6045l95679M61946k88404J68760q2657Q8902k09932P1623J49093
16998A571799k21579K1239j07282L54496K16946l58724L1325J73453j76414L7058
16988A542317K9237N8529j05727j118l1777o4363N07432L7591k11522N788K83224
16977B049611l22956m9094J90964o7799k15272O5691M50562k90742Q3122j53545
16967A740542J46890P9911J21016m67524L08075J35824K44341k65571O8655J16916
$$ plain form
17038 984753 1114302 1354229 826489 957220 1299111 1015178 1185264 1369007 1067242 1151487
17028 1151487 1402509 1198965 888005 1144399 1055119 1553764 1210194 1264990 1447327 1560612
17018 1560612 1544562 974544 1422894 1477486 1469595 1399251 872580 1506835 1321333 1542102
17008 1542102 1608147 1212468 1674414 1386010 1554770 1472113 1561015 1351083 1422706 1571799
16998 1571799 1350220 1371459 1264177 1618673 1835619 1476895 1508220 1681673 1505259 1542317
16988 1542317 1571554 1630083 1524356 1523238 1491461 1427098 1934530 1972121 1760599 1766387 2049611
16977 2049611 1726655 1677561 1868525 1800726 1585454 1651145 2101707 1810965 1894087 1740542
16967 1740542 1887432 1967343 2088359 1620835 1928910 2064734 2309075 2043504 2112159 2229075
16957B229075n9669k67778K97883r6911k94176L28576r6319N01553m73824L79394
16947B447804k28004N1309L52959j67815K0280j68289J55597j66037m6181K31536
16937B483159M646L4763j50978m8988Q1905J91738n3684K03642n5355l21927O57530
16926C026451l27957N7020M06013l70491M5938j0435K28140k20724O66124n13054
16916B987025L4422k0985L28429m02769J45330Q8321L84983j47881k57302J60699
16906C300272J91250J5295L102O5125J19495j45145J77179J13401J27160l00170
16896C666964N0064J65436J56344J85896J5804j22006j12488M0276K57298J25849
16886D429437J22135J1731O0063k4918L9532o3895j50293M05379n8186L39942
$$ plain form
16957 2229075 2169406 1901628 2199511 2102600 1808424 2137000 2040681 2542234 2068410 2447804
16947 2447804 2219800 2271109 2624068 2456253 2476533 2308244 2463841 2297804 2251623 2483159
16937 2483159 2487805 2522568 2371590 2322602 2404507 2596245 2542561 2746203 2690848 2368921 3026451
16926 3026451 2698494 2755514 3161527 2791036 2836974 2826539 3054679 2833955 3500079 2987025
16916 2987025 3021447 3000462 3328891 2926122 3071452 3159773 3544756 3396875 3139573 3300272
16906 3300272 3491522 3506817 3509919 3575044 3694539 3549394 3726573 3839974 3967134 3666964
16896 3666964 3717028 3882464 4038808 4224704 4240508 4118502 4006014 4046290 4303588 4429437
16886 4429437 4551572 4563303 4623366 4598448 4637980 4574085 4423792 4829171 4770985 5110927
16876E110927j65577J04796k93216N30322j44501K26120j67456N6536J88623m0633
16866E405941J46753L06619j87932L49743k05747o8787M45665J06303J72301J89909
16856F660768k20754p8847M11890k07009K33530J3080O31756k38976J24129K78588
16846G608155L29701k31194l0166J85026K42109L33936l84500K56490N22077k93216
16836H538418K11082J50276M61610q3451J93591J26367J2155J95881O67207R4220
16826A0567356j66809K61980L40854O47519l91805K73597L01001o0014M00730
16817A2174409K37748J90361N37816k7484L31875K92888N50608j546k86107J009822
16807A5010390n7733N34108K45745L28820N71261P3129O12320M26973j21402R33937
$$ plain form
16876 5110927 4945350 5050146 4756930 5287252 5142751 5368871 5201415 5257951 5446574 5405941
16866 5405941 5552694 5859313 5671381 6021124 5815377 5746590 6192255 6298558 6470859 6660768
16856 6660768 6440014 6361167 6773057 6566048 6799578 6812658 7444414 7205438 7329567 7608155
16846 7608155 7937856 7706662 7676496 7861522 8103631 8437567 8053067 8309557 8831634 8538418
16836 8538418 8749500 8899776 9361386 9277935 9471526 9597893 9610048 9805929 10473136 10567356
16826 10567356 10400547 10662527 11003381 11650900 11259095 11532692 11833693 11773679 12174409
16817 12174409 12412157 12602518 13140334 13112850 13444725 13737613 14288221 14286675 14000568 15010390
16807 15010390 14952657 15486765 15732510 16061330 16632591 16705720 17318040 17745013 17623611 18557548
16797A8557548L59855M33089K83207L65824O82621L75580P88187K15540K53614
16788B2315065O18901R50664L77284P53438N41030K31506L90992J156004N45864
16779B7880748P97963P31431O48490J174079M74692J254191O06934O99298J046574
16770C5314400Q94546O00526J235286R35096J607048O54633Q55464J305526J294294
16761D4696819J331591J051024J214115J418039J404500Q37885J497709J511818
16753E4963500J426310J611289J202815J377890J462078J910021J163747J971503
16745F7089153J530497Q72621J749927J522095J430319J196151J532635J574702
16737G8498100P62981J579684P39546J385081Q51334R40888Q60884M20322N42234
$$ plain form
16797 18557548 18917403 19350492 19633699 19999523 20682144 21057724 21845911 22061451 22315065
16788 22315065 22933966 23884630 24261914 25015352 25556382 25787888 26178880 27334884 27880748
16779 27880748 28678711 29410142 30058632 31232711 31707403 32961594 33568528 34267826 35314400
16770 35314400 36208946 36809472 38044758 38979854 40586902 41241535 42096999 43402525 44696819
16761 44696819 46028410 47079434 48293549 49711588 51116088 51953973 53451682 54963500
16753 54963500 56389810 58001099 59203914 60581804 62043882 63953903 65117650 67089153
16745 67089153 68619650 69492271 71242198 72764293 74194612 75390763 76923398 78498100
16737 78498100 79261081 80840765 81580311 82965392 83816726 84757614 85618498 86038820 86581054
16728H6581054L65044O17315M28113n07012K66117m80986Q0606l47507o31100
16719H6371644m50581o44994r54320q32447o11268j361150j133853r76610j291769
16710G8114652j404066j424196j166010j461960j092839j732043j405170j526382
16702F6901986j498796j237496j430059j533008j631143j270422j133751j577513
16694E5589798j496375j297054q47956j537609j353426j274443j181254j007600
16686D5594081j238723r88710j598350r45126q89776o66588j379400j088142o29557
16677C6169709p94075j220755n69238j151866o87700n71179o02782j311196l42768
16668B8918150o11071p44049p35109l15833n34640r70171o18439j86132r80867
$$ plain form
16728 86581054 86946098 87563413 87991526 87484514 87750631 87269645 87350251 87002744 86371644
16719 86371644 85921063 85276069 84321749 83489302 82878034 81516884 80383031 79406421 78114652
16710 78114652 76710586 75286390 74120380 72658420 71565581 69833538 68428368 66901986
16702 66901986 65403190 64165694 62735635 61202627 59571484 58301062 57167311 55589798
16694 55589798 54093423 52796369 51948413 50410804 49057378 47782935 46601681 45594081
16686 45594081 44355358 43366648 41768298 40823172 39933396 39266808 37887408 36799266 36169709
16677 36169709 35375634 34154879 33585641 32433775 31746075 31174896 30572114 29260918 28918150
16668 28918150 28307079 27563030 26827921 26512088 25977448 25007277 24388838 24202706 23221839
16659B3221839K4196q52327j50861p45409p90415R8909o11105m30559j62073n10145
16649A9092050l68069l48709o29360j14433q28326L0084j13831l31227n79660
16640A5808519l85738p0970m55752k1228k00092m10818o03783K8039k40241r7508
16630A3350428l43795k05625l20458k79485J24418J81865n69009q02708K04287
16621A1339918j80596j48580p5469n06357m6935n9892m3477k38761n29832N8896
16611I568915M4193k78552k3918j83099K27787m80112N4052m09214l46282m7171
16601H126599l2472J12955j63110k67572N8551j39355j8437l73999j22098j08557
16591G072505j07770k64736L25412l20523L05211l62827q6623J93218n16711J87943
$$ plain form
16659 23221839 23246035 22393708 22242847 21497438 20707023 20805932 20194827 19764268 19602195 19092050
16649 19092050 18723981 18375272 17745912 17631479 16803153 16833237 16719406 16388179 15808519
16640 15808519 15422781 15351811 14896059 14874831 14674739 14263921 13660138 13688177 13447936 13350428
16630 13350428 13006633 12801008 12480550 12201065 12325483 12507348 11938339 11135631 11339918
16621 11339918 11159322 11010742 10935273 10428916 10381981 10322089 10278612 10039851 9510019 9568915
16611 9568915 9613108 9334556 9310638 9127539 9355326 8875214 8929266 8520052 8173770 8126599
16601 8126599 8094127 8207082 8043972 7776400 7834951 7695596 7677159 7303160 7181062 7072505
16591 7072505 6964735 6699999 7025411 6704888 7010099 6647272 6560649 6753867 6237156 6425099
16581F425099k81103K54588Q5514n28069L10653j45650L9364m86394K46157m7899
16571E872260l60199L8773j40478l41488L42996k90752L37390j58084l73692J52293
16561E079019j61611J05676K9974j24349j72018R5846k70593r0406L31738k96731
16551D526545r8817j21977p2573l2235J18116P7929n6084j00089j75245O6680
16541D132250q1021p8058j81471J01091M811L03169l86626k80675K42055K58923
16531D034448k94170J40610l39395M8288o3308j58853J80022j3555j61715K37921
16521C610293o4366j88246k5078o8522J51340j62519m39883M8746L63419K7971
16511C253155j78306k71734L4809R8329r188K1024k13322J75274J29933K51440
$$ plain form
16581 6425099 6143996 6398584 6484098 5956029 6266682 6121032 6160396 5674002 5920159 5872260
16571 5872260 5512061 5550834 5410356 5068868 5411864 5121112 5458502 5300418 4926726 5079019
16561 5079019 4917408 5023084 5053058 4928709 4756691 4852537 4581944 4491538 4823276 4526545
16551 4526545 4427728 4305751 4233178 4200943 4319059 4396988 4340904 4240815 4065570 4132250
16541 4132250 4051229 3973171 3791700 3892791 3897602 4200771 3814145 3533470 3775525 4034448
16531 4034448 3740278 3880888 3541493 3589781 3526473 3367620 3547642 3534087 3372372 3610293
16521 3610293 3545927 3357681 3332603 3264081 3415421 3252902 2813019 2861765 3225184 3253155
16511 3253155 3074849 2803115 2837924 2936253 2927065 2948089 2734767 2910041 3039974 3291414
16501C291414l54888K4806j69055k22412L09998Q7376j94476J38296l03762K8953
16491B636250J68081j89301J20045o2051K0553k74772K16203M8364j03569P5189
16481B654992j48193j35729j01141k5658R9562J78384j94988k1694l62868K00983
16471B143650L58014l30724M01823p15411L08088J9441k67590K14085j69775K72622
16461B234223r4976j64439L77202k43512k47154J53893k77197K34390J0648j22750
16451A860328K59524j94748N7857O5646l56280J86762j0394K37861j69798j93742
16441A743016J17383J51343k58024L39256n31201Q1757N5761J99702L6355Q3499
16431B018847l51311l37625K73974L6116M9764K3769L15632m05140j16889K45223
$$ plain form
16501 3291414 2936526 2961332 2792277 2569865 2879863 2967239 2772763 2911059 2607297 2636250
16491 2636250 2804331 2615030 2735075 2673024 2693577 2418805 2635008 2683372 2579803 2654992
16481 2654992 2506799 2371070 2269929 2244271 2343833 2522217 2327229 2305535 1942667 2143650
16471 2143650 2501664 2170940 2572763 1857352 2165440 2184881 1917291 2131376 1961601 2234223
16461 2234223 2139247 1974808 2352010 2108498 1861344 2015237 1738040 1972430 1983078 1860328
16451 1860328 2119852 1925104 1982961 2048607 1692327 1879089 1868695 2106556 1936758 1743016
16441 1743016 1860399 2011742 1753718 2092974 1561773 1643530 1699291 1898993 1935348 2018847
16431 2018847 1667536 1329911 1603885 1640001 1689765 1713534 2029166 1624026 1507137 1752360
16421A752360l9507j91873J04258K48693l27021J41559J17525k71811J92538j31905
16411A594816k74857J49898L33531l31659R2409k05470J85253q9245N6836j50870
16401A360642J13224j31206l29066M63221k06097L44710j21785l34996J79440
16392A338087j99607L71351j76855J51682k75391n806j9869J06235m34109O41193
16382A496911j45287j5930K91548l82189l03713O18620J49334n49873j04372K0443
16372A075492L42256j3571m32942J84906L8407r5885o3326J04091J99142k45152
16362A093418j04637K76030N62N2768k44584J94842j03897l97645M30565j34623
16352A062799j46862O2314J2703j965l077J5345J26427k58452J06176J38930l9729
$$ plain form
16421 1752360 1712853 1520980 1625238 1873931 1546910 1688469 1805994 1534183 1726721 1594816
16411 1594816 1319959 1469857 1803388 1471729 1564138 1358668 1543921 1454676 1511512 1360642
16401 1360642 1473866 1342660 1013594 1476815 1270718 1615428 1493643 1158647 1338087
16392 1338087 1138480 1509831 1332976 1484658 1209267 1203461 1183592 1289827 855718 1496911
16382 1496911 1351624 1335694 1627242 1245053 941340 1559960 1709294 1159421 1055049 1075492
16372 1075492 1417748 1404177 971235 1156141 1194548 1098663 1035337 1139428 1338570 1093418
16362 1093418 988781 1264811 1265373 1318141 1073557 1268399 1164502 766857 1197422 1062799
16352 1062799 915937 978251 990954 988989 985912 1001257 1127684 869232 975408 1114338 1074609
16341A074609j41712P5090N2161j0977L54707k74272J35349q5136j34483o3739
16331I81597J08909j58066P9241m91228M51752K57547m84466M89593k40298K9183
16321A023764j61656M0343K95707m64020N9196k96906J54850K01140N95J39649
16311I92662q4135r8957L7431m1647M86599m37293m1947L25846m72590J59405
16301H25374J23286P560k7204k6549k39015j16896L51618j24725M6081J42411
16291I61941J3824r3966j26728J29490m5470Q3634r8138k62643K27834k47881
16281E41897N2165L71538K02500E18488M02652m23605N2432Q7741j32088M92472
16271I98092k10182J74109n1592k09397p5554P295O059J14680j68529N7392o4099
$$ plain form
16341 1074609 932897 1007987 1060148 1049171 1403878 1129606 1264955 1179819 1045336 981597
16331 981597 1090506 932440 1011681 520453 972205 1229752 745286 1234879 994581 1023764
16321 1023764 862108 902451 1198158 734138 793334 496428 651278 852418 853013 992662
16311 992662 908527 809570 847001 805354 1291953 854660 812713 1138559 665969 825374
16301 825374 948660 956220 929016 902467 663452 546556 898174 773449 819530 961941
16291 961941 975765 881799 755071 884561 839091 922725 824587 561944 789778 541897
16281 541897 594062 965600 1168100 518488 921140 497535 549967 637708 505620 998092
16271 998092 787910 962019 910427 701030 625476 632771 638830 753510 584981 642373 578274
16260E78274o0949j06441K6016M77476k27018M2229J86039k94064J0J61024l36266
16249D46330M20416n1945k45906J47731m3531r5603k7381K76988k92467Q5737
16239F20369j46516L03381K00544k62739j36163R7834j85435R6727p1341L7288
16229E53949l7304o5455K65201J82258j82949C08707M93297k54968K70517l04067
16219E13486L906j63367M30594j70050j55778j35454A53283L38389j1888J6888
16209D96672K2743J98576m5548k09729I3145K71835J14557K06073C11744J94092
16199E05836J64717C07235R1564M56605k34267j15967L016j99479L08618j75700
16189D41625K66435k26619J36984q1434B26781K73118j48090K99086j37942B44755
$$ plain form
16260 578274 517325 410884 436900 914376 687358 729587 915626 621562 621572 782596 446330
16249 446330 866746 814801 568895 716626 673095 577492 550111 827099 534632 620369
16239 620369 473853 777234 977778 715039 578876 676710 491275 588002 516661 553949
16229 553949 516645 451190 716391 898649 715700 308707 802004 547036 817553 513486
16219 513486 517392 354025 784619 614569 458791 323337 153283 491672 479784 496672
16209 496672 519415 717991 672443 462714 93145 364980 479537 685610 311744 505836
16199 505836 670553 307235 398799 855404 621137 505170 508186 308707 617325 441625
16189 441625 708060 481441 618425 536991 226781 499899 351809 650895 512953 244755
16178A66444M08036k60263J66014j2004L58588l33791k11863N8236J45126B16463
16167B85956J45379A88351J63732A75950J40851j30513m5031A5139K53194N2108
16157C20441K48998j93641L00727p7373B10302J49700M6006L6922j64468G0842
16146B30986K29258j15253J51937j79482K7364A56615J2637J06458o6371J51283
16136C60622j29628K73887j94192B759M17373j40229q8265N0007J30956j58520
16126B14081K61358K8981M5982j80796L3151l1695J67289r3858A80658K45198
16116D25856j55263J04976j03658A5477M24860J23491k36105R9719j50791n2428
16106B24223L34338A36021K30924n5205J47178j78698c8665J4910B59656l9023
$$ plain form
16178 166444 574480 314217 480231 468227 826815 493024 281161 339397 484523 216463
16167 285956 431335 188351 352083 175950 316801 186288 141257 15139 268333 320441
16157 320441 569439 375798 676525 599152 210302 360002 406008 442930 278462 70842
16146 230986 460244 344991 496928 317446 344810 156615 169252 275710 209339 360622
16136 360622 230994 504881 310689 2759 420132 279903 191638 241645 372601 214081
16126 214081 475439 504420 550402 369606 402757 371062 538351 444493 180658 425856
16116 425856 270593 375569 271911 15477 440337 563828 327723 427442 276651 224223
16106 224223 558561 136021 366945 311740 458918 280220 -38665 -23755 259656 220633
16096B20633K8715J15803A21934L47369F6121L3779M47876P2138j33387F7669
16085C18910j4812a1620F73460b4202n2395D55995A28359J99025A14909L1417
16075A46326J21959h7999B84966J3961j21014R0297n604J01142j09368N248B5616
16063B01382o39K32434A15033J06896C8086P3008L18107j66287O6602m7367j28607
16052A53542k1771k6011D39K32950J36337j29026d4325D93225j58153h7298E5343
16040B5551J94545l277J47639j56075n6524o9440K3044M2757h591B58232n7375
16029B00857J28635j25642K82726B6518L28948G3765d2781A87119J95385q1118
16019C01386d5942A86359O4557P528A12778B0863L55793a50654A60345E7209Q9426
$$ plain form
16096 220633 249348 365151 121934 469303 66121 99900 547776 619914 486527 67669
16085 318910 304098 -11620 673460 -24202 -76597 455995 128359 327384 114909 146326
16075 146326 268285 -87999 284966 298927 177913 268210 262606 363748 254380 259628 25616
16063 201382 200743 433177 115033 221929 38086 111094 429201 262914 329516 282149 153542
16052 153542 131771 105760 439 233389 369726 240700 -44325 493225 335072 -87298 55343
16040 25551 220096 216819 364458 208383 151859 82419 105463 148220 -8591 258232 200857
16029 200857 329492 203850 486576 26518 355466 73765 -42781 187119 382504 301386
16019 301386 -45942 186359 250916 258444 112778 20863 376656 -150654 160345 57209 146635
16008A46635L0443m1402J59441N5824A39115J66609C6896M3965a05954D01883
15997D19084A56809J52715a14836A49460R6206M5989q9178K75404r0108L56286
15987G44059L89814M4730m2216j81607j25419k16303B65600M6512p0593K36087
15977D77606H4556M6103n4930J02773l0620a00647d758O20A48436e6572B74670
15965a4431B51712A04611b53801B12297F9596h5322B1763M10155E420J31024J03038
15954B39482g3287B87818a65465b6370B29438K68729H3134j3105L04714o3710
15944C11033b57015G5577c0732A73059c55115B8504a07808m321n5237N7150q091
15933a18307A9188K22015a28244B21999D1730J66801a63596A8893b2563B79241
$$ plain form
16008 146635 177078 135676 295117 350941 139115 305724 36896 80861 -105954 401883
15997 419084 156809 309524 -114836 149460 245666 291655 202477 477881 387773 744059
15987 744059 1133873 1178603 1136387 954780 829361 613058 265600 312112 241519 477606
15977 477606 84556 130659 75729 178502 147882 -100647 -4758 -4138 148436 -56572 274670
15965 -14431 251712 104611 -253801 212297 69596 -85322 21763 431918 5420 136444 239482
15954 239482 -73287 287818 -165465 -26370 229438 498167 83134 70029 374743 311033
15944 311033 -257015 75577 -30732 173059 -355115 28504 -107808 -112129 -167366 -110216 -118307
15933 -118307 19188 241203 -128244 221999 41730 208531 -163596 18893 -22563 279241
15922G1121a17517B45294b27909F8949e1239A64382F4684J11647a32530B79870
15911b25244C7254J15938o9275J33697a35602B36060b52266r8813a36496F1446
15900A03076J80473a137A3128k649P8481p795L33341a42554E5235L17428a32109
15888B98550i4755b7711r0207e288F0977a16383A91784Q8070H1754k2204k0917
15877C8633K25817A8668J5382b9837C13549j08505b06249A75751C5327K66722
15867C02049f3498G7690J11541A4347R1855K41621F1169M3689R3372B7327K08107
15856B35434M6133n6454m1826a60862c9826a1023B9676a45758A89699J9180L3699
15845B42578a02265A84858j4584q754a631l4917A63140J39212q8739e577j26646
$$ plain form
15922 71121 -117517 245294 -227909 68949 -51239 164382 64684 176331 -132530 279870
15911 -225244 37254 153192 83917 217614 -135602 236060 -252266 -351079 -136496 61446
15900 103076 283549 -1137 13128 10479 88960 81165 414506 -142554 55235 372663 -132109
15888 298550 -94755 -27711 -117918 -5288 60977 -116383 191784 279854 81754 59550 38633
15877 38633 264450 18668 34050 -29837 313549 205044 -206249 175751 35327 302049
15867 302049 -63498 77690 189231 14347 106202 347823 61169 104858 198230 27327 235434
15856 235434 281567 225113 183287 -160862 -39826 -11023 29676 -145758 189699 208879 242578
15845 242578 -102265 184858 170274 161520 -1631 -36548 163140 302352 213613 -5577 -132223
15834a32223j40568h7865C64874b58115E5196i2550j49546n687C7317a21097E2765
15822a64217C6907O6450C3174i2113B38505e53j72942F9110c5078p3793A0258
15810A3403J18220h6533F9758a51148j16840d4667m8097C6413J72479M7259h724
15798I0819b48567G5294b66231a03597l7176C35516A11572a9980E4613J1131a75729
15786b36672j84488a00136I5858g6573A51259D3654J82364d3972j52938M6471
15776a50439A52640b1881H8612b66796G4899k5803a10685b9749l9483B39017A18471
15764a81266A05311Q1829K0564Q1060a47949B82516m7216h4183B5459J26085n7778
15753I3766a34143C32864a3819B04017N7428c137m8143B64058B5551a41915e9441
$$ plain form
15834 -132223 -272791 -87865 364874 -258115 55196 -92550 -242096 -247783 37317 -121097 52765
15822 -164217 36907 103357 33174 -92113 238505 -553 -173495 69110 -35078 -108871 10258
15810 13403 131623 -86533 69758 -151148 -267988 -44667 -92764 36413 208892 256151 -8724
15798 90819 -248567 75294 -266231 -103597 -140773 335516 111572 -19980 54613 65744 -175729
15786 -236672 -421160 -100136 95858 -76573 151259 43654 226018 -43972 -196910 -150439
15776 -150439 152640 -21881 88612 -266796 74899 49096 -110685 -29749 -69232 239017 118471
15764 -181266 105311 187140 207704 288764 -147949 282516 235300 -84183 25459 151544 93766
15753 93766 -134143 332864 -13819 204017 261445 -3137 -51280 264058 25551 -141915 -59441
15741B1696a28217A83426a21112A1189b92674A28412l4642a12472A20306B7837
15730b80361i3469E2479i0502G4709d8354H2615K1966a85162E8724c15234f7653
15718D5365o440I291M3284J68063i353D41c04924A0173b99866P8961B76376b77394
15705f7583j97800K2344o3498E7640J23857f7687j6800A2211f6545A77185g5782
15693d7413k49400C1078N7777l5109b13602J02226A35227a61895c4255B03973
15682a85046Q4651A28321d7633p1793E6653a55050A25572a05023G8820i0451l2423
15671a22874O11B6330c2208B1174N524a35128A22481n9173a94602p2451N1729
15660b15324C62735b4241G4158a74546m5458A24105k5890m9089j7096K09374n8276
$$ plain form
15741 21696 -128217 183426 -121112 11189 -292674 128412 93770 -112472 120306 27837
15730 -280361 -93469 52479 -90502 74709 -48354 82615 104581 -185162 58724 -315234 -67653
15718 45365 38925 9291 52575 220638 -9353 441 -304924 10173 -299866 -220905 276376 -277394
15705 -67583 -265383 -243039 -306537 57640 181497 -67687 -84487 12211 -66545 177185 -75782
15693 -47413 -296813 31078 88855 53746 -213602 -111376 135227 -161895 -34255 203973
15682 -185046 -100395 128321 -47633 -119426 56653 -155050 125572 -105023 78820 -90451 -122874
15671 -122874 -122263 26330 -32208 21174 26698 -135128 122481 63308 -194602 -267053 -215324
15660 -215324 362735 -24241 74158 -174546 -220004 124105 98215 49126 32030 241404 183128
15649A83128c74758a82008k4885A09955f4370D39123F8767M33569d0765j15486
15639a56251l3125f5627e287A26415a3249k3964A45588r473a3893B63800H8257
15627I5206J25476i0346J0487A66685M81H542a18999C0399a11905j7413l41600
15616d70918A13084b91235e4891A02434m1086i1588n1092r5514B5737a21204m2686
15605a63890P1653J1315B05253a07310C958i2524B57675a35834F818c821j62290
15594a66111D6645A0346c72458D0590P0293L4623B393c74567a34075j9337A22621
15582C4313d9887G3333b11823E7987B4922c4076D1649e8422j9268E2135L9459
15571I1594K6507n6028a6993E053M4272b35181F7667J84674d9464n8867j4661
$$ plain form
15649 183128 -374758 -182008 -206893 109955 -64370 439123 68767 502336 -40765 -156251
15639 -156251 -189376 -65627 -5287 126415 -13249 -37213 145588 136115 -13893 263800 88257
15627 95206 220682 -90346 -79859 166685 167166 8542 -118999 30399 -111905 -129318 -470918
15616 -470918 113084 -291235 -54891 102434 61348 -91588 -142680 -238194 25737 -121204 -163890
15605 -163890 -92237 -80922 205253 -107310 3958 -92524 257675 -135834 6818 -3821 -166111
15594 -166111 46645 10346 -372458 40590 110883 145506 2393 -374567 -134075 -153412 122621
15582 34313 -49887 73333 -211823 57987 24922 -34076 41649 -58422 -77690 52135 91594
15571 91594 118101 62073 -16993 5053 49325 -235181 67667 252341 -49464 -108331 -122992
15560a22992A7769L9255a49293B60741g1731E6221j3847g5538m3315C16636G3991
15548a16522A47433a09035A33247a4841k457B18012i790B11597c04291C0538J93760
15537B24298L4567a26377B02444H8280K01750B3759K46456E0180O2090P3017k2044
15526A63243l2737k5745K06844K8036a06254A52295J2103J03723A15695C4354
15515A33142M5581g9278H142L6958L64658A57281k6538A5069a76406E7538a51991
15503A52572a35328F6918N0103B411K95K04886A6962D686i4019A24914a66559
15491B44585A20543i6210A20408J5222j3346k2831g8897a7322k8967j31013A5381
15479A44723J67614J58256m6R3374O4451A40326L10514A76791c5170i97I3687
$$ plain form
15560 -122992 17769 57024 -149293 260741 -71731 56221 42374 -75538 -118853 316636 73991
15548 -116522 147433 -109035 133247 -14841 -17298 218012 -9790 211597 -304291 30538 224298
15537 224298 258865 -126377 202444 88280 290030 23759 270215 50180 112270 185287 163243
15526 163243 130506 104761 311605 339641 -106254 152295 164398 268121 115695 34354
15515 133142 178723 -79278 8142 45100 409758 157281 130743 15069 -176406 57538 -151991
15503 152572 -135328 66918 117021 2411 2706 207592 16962 4686 -94019 124914 -166559
15491 244585 120543 -96210 120408 135630 122284 99453 -78897 -17322 -46289 -177302 15381
15479 144723 312337 470593 470547 563921 628372 140326 450840 176791 -35170 -997 93687
15467d9902A43424J3719Q5315o4287O484C5840K20497b00814O2768L1148m6823
15456a53721B24662R1360c4377G8992J64853a4275G6152B4006d2827B73950M44228
15445G18178R4400j36138M12531l04253C68673L3501K5195a7576B59405j24837
15435A34568C1342a38118G8068a04737B12000c4198B34037I267a618o6463J7278
15424e0803F8876a49816j56799c9584m318j86000a14503o8212g4210p6648G3896
15412a99116G9259f8642A25775C1115f2559B9067J04595b29597A12818J7626l5522
15401I4922L80718c08222P4985c2063a4284K349q638c050p4694K586J0559A95654
15388a06798j16982B13421d488l2957A46574K65268B2316e2169C05280a15382
$$ plain form
15467 -49902 143424 157143 242458 178171 184655 35840 256337 -200814 -138046 -106898 -153721
15456 -153721 224662 316022 -34377 78992 243845 -14275 76152 24006 -42827 273950 718178
15445 718178 812578 676440 1088971 784718 368673 402174 427369 -17576 259405 134568
15435 134568 31342 -138118 78068 -104737 212000 -34198 234037 9267 -1618 -68081 -50803
15424 -50803 68876 -149816 -306615 -39584 -43902 -229902 -114503 -182715 -74210 -150858 73896
15412 -199116 79259 -68642 125775 31115 -62559 29067 133662 -229597 112818 130444 94922
15401 94922 475640 -308222 -233237 -32063 -14284 -11935 -20573 -3050 -77744 -75158 -64599 195654
15388 -106798 -223780 213421 -4488 -37445 146574 411842 22316 -52169 305280 -115382
15377g4720I6060d5737A23230k5162L39499A0207M00297j66630J54859e0920B01668
15365a02106D24519f9664L1568a337B8081R1028J26854o3977J15012a13709H9868
15353D9010L4572J66388h0297B54212q1567E4063L02784a00093A13484P3091D0355
15341C66290K96513a51817C48797A2819J78614H2989J8875m4990q433M61920a65150
15329a65314E67523B16160i8503a5007B98009a3283j27777i621B41961r949b18286
15317B86633d3100A4059L97857B03649E2387f1607A74391J46589j54403B9621
15306C49444j40724b59479P9426Q2127A45733a39238j07026F3795J4481b43776
15295A31405i1315A03814E0990B313b53579K9839B02068R1166i9316B23928J92552
$$ plain form
15377 -74720 96060 -45737 123230 98068 437567 10207 410504 243874 398733 -50920 201668
15365 -102106 424519 -69664 -38096 -1337 28081 119109 245963 181986 296998 -113709 89868
15353 49010 83582 249970 -80297 254212 172645 54063 356847 -100093 113484 186575 40355
15341 366290 662803 -151817 348797 12819 191433 82989 101864 56874 48441 510361 -165150
15329 -165314 567523 216160 -98503 -15007 298009 -13283 -141060 -9621 241961 232012 -218286
15317 286633 -43100 14059 411916 203649 52387 -61607 174391 320980 166577 29621
15306 349444 208720 -259479 -180053 -97926 145733 -139238 -246264 63795 78276 -243776
15295 131405 -91315 103814 50990 2313 -253579 -223740 202068 293234 -99316 223928 416480
15284D16480A08236M1724a40545A20442L88859j49383h4711j8614D22955e16845
15273e7187E0271a34761d1044A57242a57182F568N8158k5678e6314A50274k9447
15262A20827e7116K1213A29908k9734k6495P4061a21772A81973H9712K67615A75972
15250a17548E2446g5453H0147f6883A98441L56777Q3276N11819O88138m76615
15240A361836K36870j23096n27798C64970A81713H6342J05251Q9256j21690C2318
15229F4250K52178j35667a71040C51621c23394I0776a29650A72277R4390q9553
15219A77114B7285b8353C0939a03383A64989h9422B7429c0658j26676E8798J46767
15208B05565q7193M9415J51094A3974h1869l5677l43646g5956G295c0719F5840
$$ plain form
15284 416480 108236 149960 -140545 120442 509301 359918 -84711 -103325 422955 -516845
15273 -57187 50271 -134761 -41044 157242 -157182 6568 64726 39048 -56314 150274 120827
15262 120827 -57116 -35903 129908 100174 73679 147740 -121772 181973 89712 357327 175972
15250 -117548 52446 -75453 80147 -66883 198441 555218 638494 1150313 1838451 1361836
15240 1361836 1598706 1475610 947812 364970 181713 86342 191593 280849 159159 32318
15229 64250 316428 180761 -171040 351621 -323394 90776 -129650 172277 266667 177114
15219 177114 27285 -28353 30939 -103383 164989 -89422 27429 -30658 -157334 58798 205565
15208 205565 118372 167787 318881 13974 -81869 -117546 -461192 -75956 7295 -30719 65840
15196B46837h3477b4034J64P937j482k70914D29066A59465Q2646f6365B29788
15184a48988f5871i801l1525A28267e028k52880B41763f7132O76C0570K65882
15173B96452A26377O9802j9876E2595a543C01896g3501B63384j10322c67840G7959
15161A33284h1254p251A45001P94g5490P91A12456d6014A7515M5027L09135J3207
15149C84884p8001A51156C1567c42542A55113b6743B09449L5775a6789A26056
15138B82571K2861A13M2047a04470B41262G1341Q223J17343a36313D64206k16044
15127B48162j16539b28491G8817J46963I4569d8951B49184A05156P9119p810J41249
15116C17714j05446K7800J24301o3950C2228a08491A46550K0391b4227B0190L24205
$$ plain form
15196 246837 -83477 -24034 -23870 -15933 -17415 -288329 429066 159465 242111 -66365 229788
15184 -148988 -65871 -9801 -41326 128267 -5028 -257908 241763 -67132 -66456 30570 296452
15173 296452 126377 196179 176303 52595 -1543 301896 -73501 263384 153062 -367840 77959
15161 133284 -81254 -88505 145001 145795 -75490 -74699 112456 -46014 17515 62542 371677 384884
15149 384884 306883 151156 31567 -342542 155113 -26743 209449 245224 -16789 126056
15138 282571 305432 113 42160 -104470 241262 71341 79564 196907 -136313 464206 248162
15127 248162 131623 -228491 78817 225780 94569 -48951 249184 105156 184275 176465 317714
15116 317714 212268 240068 364369 300419 32228 -108491 146550 166941 -24227 20190 344395
15105C44395a61810d5450E186J28609K33237f5922C7482J29124b4396D6606L96497
15094D43103E6132a5048C0392K66609A36940i4205E5836C386J37280a31769C91028
15082D4086J85347a75262B08478p0646j1599J26784a18881A38040B2390a19809
15071D2259J95585a9769B21893M5500m55A32986b7687C48984A49645b5534C46426
15059b7253A4856K44865a15897A01939M56073B77568j24388l4401K77265A51226
15048E58308A90064M05754p4157k26219N8501i9987D38265j58710b31173E26079
15037A47864J96471R6514A77044d0211C02193A33583K38496m0504L37071m7942
15027F20704r7151k14677K51229J24436k31954M4952B48536M59727j05989q4365
$$ plain form
15105 344395 -161810 -45450 5186 133795 367032 -65922 37482 166606 -24396 46606 443103
15094 443103 56132 -15048 30392 297001 136940 -94205 55836 3386 140666 -131769 391028
15082 44086 229433 -175262 208478 137832 126233 253017 -118881 138040 22390 -119809
15071 42259 237844 -19769 221893 267393 266938 132986 -27687 348984 149645 -25534 346426
15059 -27253 14856 259721 -115897 101939 558012 277568 153180 118779 396044 151226
15048 558308 190064 595818 521661 295442 353943 -99987 438265 279555 -231173 526079
15037 147864 344335 440849 177044 -40211 302193 133583 372079 331575 668646 620704
15027 620704 523553 308876 560105 684541 452587 497539 248536 708263 602274 517909
15017E17909o5548n6118K75291C30509I2423K52903J12408M4885A86051L35366
15007E21417P6278j53109k22146M05434A87439F2518M25150p5601n7909p0563
14997B83595L00510k69476A44603K84215A89133K12450R1119p3517K21201A72441
14986B96218J82146k01524K66369p9234K14657p19J23680q0396J9469Q90k3861
14975G17695j87146J4818R4115j7913Q1061p0753M9782A82499L28430j06262A68964
14963B15633Q8818j23738r190J05161J94926A60638K91030D1546L17275J73960
14953E32781j31783O0132A91777N38220k39194a9236H17660p7875r5590j56866
14943D87329n0842h321E90220k44707R6421l0753J4274o284M65830k85672M98779
$$ plain form
15017 517909 452361 396243 671534 330509 92423 345326 457734 502619 186051 521417
15007 521417 597695 444586 222440 627874 187439 62518 487668 412067 354158 283595
14997 283595 584105 314629 144603 428818 189133 401583 492702 419185 640386 172441
14986 296218 478364 276840 543209 463975 678632 677913 801593 721197 740666 741556 717695
14975 717695 530549 545367 639482 621569 702630 631877 681659 182499 510929 404667 168964
14963 215633 304451 180713 171523 276684 471610 160638 451668 41546 358821 532781
14953 532781 400998 461130 191777 729997 490803 -19236 817660 739785 644195 487329
14943 487329 436487 -8321 590220 345513 441934 411181 425455 419171 885001 599329 1098108
14932A098108j3260n5554R2729l72681M01672J89675J91531p9421P0252r9682
14922A423369J46450q8844M32905K03297k0846l59824m04978L06804m53373n70944
14912F14016J15194k76344K00323k83551P2179A53103L5868K27077I8977N66877
14902F65854B67077M23740k57651j19916N853j11251J66658L59856q1122j50047
14892E03197K9767Q1097j91586j46452O05764p5283j05219q1425K62615o5469
14882H17006j58261J13596o3368K60164k4347B43306L7407K37250K12883B12490
14871D96078M9931k16682K53995j29519J68045k20529j43016K12372n2360K03227
14861F21542B50811M18291k47843J27948B63738K95257j16205P3492K05288C54788
$$ plain form
14932 1098108 1084848 1029294 1122023 749342 1151014 1340689 1532220 1452799 1523051 1423369
14922 1423369 1569819 1480975 1913880 2117177 2096331 1736507 1331529 1638333 1184960 614016
14912 614016 729210 452866 653189 369638 441817 153103 188971 416048 98977 665854
14902 665854 267077 690817 433166 313250 319103 207852 374510 734366 653244 503197
14892 503197 532964 614061 422475 276023 881787 806504 701285 619860 882475 817006
14882 817006 658745 772341 708973 969137 944790 243306 280713 517963 730846 212490
14871 496078 546009 329327 583322 453803 621848 401319 258303 470675 418315 621542
14861 621542 250811 669102 421259 549207 263738 558995 442790 516282 721570 354788
14850F02449k05722q436R8214A81592P18251p7977J18777O5174J27413j07057
14840A026173J85641l07489K869r0018m02633K88504B40256J38811K29064j28507
14830D79624j92824J07021L12115l08529J02778Q8770M7925j41915J20360J73871
14820G89196J77456B82301L37280l8248J24916j88953J1664J83658l4541j23030
14810E55047k5093r9502O26277m0523k69489J87076j48741n6479L8456M8459m05797
14799D09691l1530N44263j84154j59380K27473l38895j1530N48685l31680k30457
14789D42486J52242j90285K93845m282j09126M48938C43727K95499k57570N01693
14779H83349l43372L8879o9386L82710J79063k42471J4774N4573j67095P8712
$$ plain form
14850 602449 396727 388291 486505 181592 899843 821866 940643 1005817 1133230 1026173
14840 1026173 1211814 904325 907194 817176 414543 703047 240256 379067 608131 479624
14830 479624 286800 393821 705936 397407 500185 588955 636880 494965 615325 789196
14820 789196 966652 282301 619581 581333 706249 517296 528960 712618 678077 555047
14810 555047 529954 430452 1056729 1016206 746717 933793 785052 728573 767029 815488 409691
14799 409691 378161 922424 738270 578890 806363 467468 455938 1004623 672943 442486
14789 442486 594728 404443 698288 694006 584880 1033818 343727 639226 381656 883349
14779 883349 539977 578856 509470 892180 1071243 828772 843546 898119 731024 809736
14769H09736C20498L94467C01217Q1825R207J71476j7412B68234J33249J54033
14759E55516J33699N2529j97957k07803P0222M40991C62073N34884m13915J58309
14749F41351j56959j84945K16764L02789m2260l83567Q3189K56085p8880M8118
14739G01685k07053N20090m71581K24942j61422J65349J16025k08145K66458Q5259
14729A031607j78258N71667K20605K28949j25565l3149j92895n52656j94778q1939
14719F93588J75269m2339r0741M15008l70799L26901l77345K02314l14292J81915
14709G99479P2955k15543J18074K08523j90092L49507L59982J66905O07333o92402
14699A584721j48834l6858l92420M93875m53397R7054m12799J41112M31075m73788
$$ plain form
14769 809736 320498 714965 301217 383042 392249 563725 546313 268234 401483 555516
14759 555516 689215 741744 543787 335984 406206 847197 362073 896957 483042 641351
14749 641351 484392 299447 516211 819000 776740 393173 476362 732447 653567 701685
14739 701685 494632 1014722 543141 768083 606661 772010 888035 679890 946348 1031607
14729 1031607 853349 1425016 1645621 1874570 1749005 1715856 1522961 970305 775527 693588
14719 693588 868857 826518 735777 1150785 779986 1106887 729542 931856 617564 799479
14709 799479 872434 656891 774965 983488 793396 1142903 1502885 1669790 2277123 1584721
14699 1584721 1435887 1399029 1006609 1500484 1047087 1144141 731342 872454 1303529 829741
14689H29741j97162L43548j6627o1313j14251J73425j32727m5938K09209j48993
14679H38912P8879j24047k2342L34813m66756J07277M09179k95739j3484j259
14669H45433M151J28860r9147Q2452j2497j2012J59860p2934O4599L85312k44434
14658A229643k76497J51208l20917M35417l68357N70414o71244P34570l80608
14649A103629m5245j73534L12385n49817P04878j27444j98087P0804P9890j98535
14639I78924K87305J76976m19084K67140K1923j22989L00751l91697J65499L61792
14629A626540l15504m19187L94835j44992K40877k02047L0652o2960l21170P76624
14619A603668n21121K27537K34134m40737K11173j70911J06361N2697J09246m4469
$$ plain form
14689 829741 632579 976127 959500 898187 783936 957361 824634 778696 987905 838912
14679 838912 917791 793744 771402 1106215 639459 746736 1155915 860176 846692 845433
14669 845433 849584 978444 879297 961749 949252 937240 1097100 1024166 1088765 1474077 1229643
14658 1229643 953146 1104354 783437 1218854 850497 1420911 749667 1484237 1103629
14649 1103629 1058384 884850 1197235 647418 1352296 1224852 1026765 1097569 1177459 978924
14639 978924 1266229 1443205 1024121 1291261 1313184 1190195 1490946 1099249 1264748 1626540
14629 1626540 1311036 891849 1286684 1141692 1382569 1180522 1211174 1148214 827044 1603668
14619 1603668 1082547 1310084 1544218 1103481 1314654 1143743 1250104 1302801 1412047 1367578
14609A367578k0078j68064j00614J15333J46926L86096k54637k8321m03395L89382
14599A430206j90501K18942k1002j34242K85846k39789L3272K99898K6276r5461
14589A613445L95634m63798J92418j66050L60215k75552L4381j06654J96203J32999
14579A913241j77312M8795k6769k39900K94364J74215l1388k23612J60958p485
14569A885107K32414j26359j5528J31815P2325K49735M7696j9493r8729Q1687
14559B440670j39559J82378J34021O93278k33470J62136L39075K52271O55952
14550D486752Q15632K631121L564710Q758206J6730061q31718j7802504q871249
14542I481011m176208j452226n01129N41336J418677j322109j303835m61464j69227
$$ plain form
14609 1367578 1347500 1179436 1078822 1194155 1341081 1727177 1472540 1444219 1040824 1430206
14599 1430206 1239705 1458647 1437645 1303403 1589249 1349460 1382732 1682630 1708906 1613445
14589 1613445 2009079 1545281 1737699 1571649 1931864 1656312 1690693 1584039 1780242 1913241
14579 1913241 1735929 1784724 1757955 1518055 1812419 1986634 1955246 1731634 1892592 1885107
14569 1885107 2117521 1991162 1975634 2107449 2179774 2429509 2477205 2457712 2358983 2440670
14559 2440670 2301111 2483489 2617510 3310788 3077318 3239454 3578529 3830800 4486752
14550 4486752 5302384 7933505 11498215 20256421 36986482 36154764 18352260 9481011
14542 9481011 5304803 3852577 3351448 3892784 5311461 3989352 2685517 2224053 2054826
14533B054826l39300M68550k18375q0532Q0504K67013J77640j52913M7060j77415
14523B127058J64473l3919k87081K24000J06420J95012j01606K70938l31129M97164
14513B831330l55501m3057J28930K30792k30174k34418O23607o1527m70028j21553
14503B298401M77445M41804m50262m4647L09587j617Q3446k03579K00323k36100
14493B874801J45597J17885L87505j28260k30095J73544m9126j29497K37507r7928
14483C301933P5155j49855J52108L13409q4354j33002M58273l41782L28524O4134
14473C984543j24631P1147q1911l4296J78386r2136L27859j80813L2543J24206
14463D204897J8415j38349N30750m72043M14244J36374l51304L33022J40116Q6225
$$ plain form
14533 2054826 1715526 2184076 1965701 1885169 1965673 2232686 2410326 2257413 2304473 2127058
14523 2127058 2291531 2257612 1970531 2194531 2300951 2495963 2394357 2665295 2334166 2831330
14513 2831330 2475829 2432772 2561702 2792494 2562320 2327902 2951509 2889982 2419954 2298401
14503 2298401 2775846 3217650 2767388 2722741 3032328 3030711 3114157 2910578 3110901 2874801
14493 2874801 3020398 3138283 3525788 3397528 3167433 3340977 3291851 3162354 3399861 3301933
14483 3301933 3377088 3227233 3379341 3692750 3608396 3475394 3933667 3591885 3920409 3984543
14473 3984543 3859912 3931059 3849148 3814852 3993238 3901102 4228961 4048148 4080691 4204897
14463 4204897 4223312 4084963 4615713 4143670 4557914 4694288 4342984 4676006 4816122 4902347
14453D902347j30818r3792J01776O0505M77996j85177P9382m1235r395J48026
14443E309615K7714L18544j15398J88075O3755k98550L21210L77052j37376M0011
14433F094652P0471l62676M03453K65182R7068K2102J31337K94332P6021p7950
14423G013992L40365O2233Q0272J96905P1859j0029J99722j18280Q8418J88624
14413H114081K93665m72093N23629J90401n1424M20490L79162l89764J22183J74354
14403I304684K95003q7133J62227K21056J47132K33086J08932j16053N51288j2201
14393A0808021k0844O59600p7960K63198j08823M89441K13614L54741n8009L94213
14383A2917192K22538N13945m29685N75057J62126M14147r9659M61085K25450
$$ plain form
14453 4902347 4771529 4677737 4779513 4840018 5318014 5132837 5212219 5170984 5161589 5309615
14443 5309615 5337329 5655873 5540475 5728550 5792305 5493755 5814965 6192017 6054641 6094652
14433 6094652 6165123 5802447 6205900 6471082 6568150 6590252 6721589 7015921 7091942 7013992
14423 7013992 7354357 7416590 7496862 7693767 7765626 7755597 7955319 7837039 7925457 8114081
14413 8114081 8407746 7935653 8459282 8649683 8598259 9018749 9397911 9008147 9130330 9304684
14403 9304684 9599687 9512554 9674781 9895837 10042969 10276055 10384987 10268934 10820222 10808021
14393 10808021 10787177 11446777 11368817 11632015 11523192 12012633 12226247 12580988 12522979 12917192
14383 12917192 13139730 13653675 13223990 13799047 13961173 14375320 14275661 14736746 14962196
14374A4962196M8012N85446O31568j31522N53784N91440L98605K1528N90744K63381
14364A8515182o1099O28397L48078j39029J053176M07420L88034M98721K12183
14355B1851063M26581Q44830N66359O72739L86167O50033O71876P55292O79552
14346B7504492O30532Q43900L08430J136384P71245N70012J141608Q01725J273495
14337C4981823N46603R98622J152541J181028Q56638J365143J274780J357375
14329D3714553J675631Q28176J709736J265052K107229J409332J908431J827821
14321E6445961J806946J605317K468682K375069J872317K785506K514187K603501
14313G4477486L106130L245213L337172L206564L347896M191542M282194L954052
$$ plain form
14374 14962196 15010208 15595654 16227222 16095700 16649484 17240924 17639529 17661057 18251801 18515182
14364 18515182 18454083 19082480 19430558 19291529 20344705 20752125 21140159 21638880 21851063
14355 21851063 22277644 23122474 23688833 24361572 24747739 25397772 26069648 26824940 27504492
14346 27504492 28135024 28978924 29287354 30423738 31194983 31764995 32906603 33708328 34981823
14337 34981823 35528426 36527048 37679589 38860617 39717255 41082398 42357178 43714553
14329 43714553 45390184 46218360 47928096 49193148 51300377 52709709 54618140 56445961
14321 56445961 58252907 59858224 62326906 64701975 66574292 69359798 71873985 74477486
14313 74477486 77583616 80828829 84166001 87372565 90720461 94912003 99194197 103148249
14305A03148249M638292M942057N050472N264686O074241O496953O474920O500449
14297A48590319P523623Q038034P997243Q623257R701923R803426J0428517J1323270
14289B22029612J1551415J1864621J2773599J3164821J3808922J4413758J4394231
14282C14000979J4995842J5179184J4969699J4686739J4298653J3681372J2835206
14275D14647674J1266848Q589576M204299K340227J901944J985117j209890l241392
14267D40484403l322625m698897o628173q203101r620407j1194060j2250560j3601744
14259C70964836j4776435j5426111j5579848j5515061j5011187j4442521j4081383
14252B66132290j3307253j3119281j1873679j1442590r464872j0055562j0435004
$$ plain form
14305 103148249 107786541 112728598 117779070 123043756 129117997 135614950 142089870 148590319
14297 148590319 156113942 164151976 172149219 180772476 190474399 200277825 210706342 222029612
14289 222029612 233581027 245445648 258219247 271384068 285192990 299606748 314000979
14282 314000979 328996821 344176005 359145704 373832443 388131096 401812468 414647674
14275 414647674 425914522 434504098 438708397 441048624 442950568 444935685 443725795 440484403
14267 440484403 437161778 432462881 425834708 417631607 408011200 396817140 384566580 370964836
14259 370964836 356188401 340762290 325182442 309667381 294656194 280213673 266132290
14252 266132290 252825037 239705756 227832077 216389487 206924615 196869053 186434049
14245A86434049q561666q847478q199637p643403p448576o635421o426231n764670
14237A26906967n749051n362367m870761n042894m789383l844969l732183l720255
14229H9795104l706489l387051l462951k893920k709332k939023k657905k436879
14221F5601554k588217j744054k157269k135088j847667j777558j912617j833486
14213D9605598j401762j163697j572936j611860j205264j226446n20363j388423
14205C9514847j410439j079019p69050j190849q55521m53639j288199j030274
14197C1437857q03047r95204l12401q27268r15547k95501n99539q99569m95512
14188B5294269m88382p13608q33295k39302n55644p21915l18087m57080o92023
$$ plain form
14245 186434049 177872383 169024905 160825268 153181865 145733289 139097868 132671637 126906967
14237 126906967 121157916 115795549 110924788 105881894 101092511 97247542 93515359 89795104
14229 89795104 86088615 82701564 79238613 76344693 73635361 70696338 68038433 65601554
14221 65601554 63013337 61269283 59112014 56976926 55129259 53351701 51439084 49605598
14213 49605598 48203836 47040139 45467203 43855343 42650079 41423633 40903270 39514847
14205 39514847 38104408 37025389 36256339 35065490 34209969 33756330 32468131 31437857
14197 31437857 30634810 29639606 29327205 28499937 27584390 27288889 26689350 25789781 25294269
14188 25294269 24805887 24092279 23258984 23019682 22464038 21742123 21424036 20966956 20274933
14179B0274933k80670k09073r27893j15659k96154k15152q30651j90997o5622
14170A7143062l40141m21246n02955K52780p97393j71163k34571l01985l88344
14161A4238044L24372n18696l14978n18437J01886k42881m15866J2050l17795
14152A2347699o67810J43933J30303o14119J04924p6682m39958J432k44395j37167
14142A0548160k44070l46177P4665L0140j99213m86993p4842K29579k60493m27555
14132H843201j2835k76068K76145l46299k84957l276j07171j19687P8796k68437
14122G779412j27383K1298J36115k97261l79803J02288R7386l37305O8224j94868
14112F868103J51992o95910K12783k86606L67104n42304J32383L01669j71105
$$ plain form
14179 20274933 19994263 19785190 18857297 18741638 18445484 18230332 17399681 17208684 17143062
14170 17143062 16802921 16381675 15878720 16131500 15334107 15162944 14928373 14626388 14238044
14161 14238044 14562416 14043720 13728742 13210305 13312191 13069310 12653444 12665494 12347699
14152 12347699 11679889 11823822 11954125 11340006 11444930 11368248 10928290 10929722 10685327 10548160
14142 10548160 10304090 9957913 10032578 10062718 9863505 9376512 9301670 9531249 9270756 8843201
14132 8843201 8830366 8554298 8830443 8484144 8199187 8195911 8088740 7969053 8047849 7779412
14122 7779412 7652029 7673327 7809442 7512181 7132378 7234666 7332052 6994747 7062971 6868103
14112 6868103 7020095 6324185 6536968 6250362 6617466 6075162 6207545 6509214 6338109
14103F338109m24602L45278j86634k97113j64824K367J18736l55955J01998J45081
14093E622441k34601l08871J43944n9782K0795J45963k10605l25154K2990l98744
14083D418376O00853m77123j75184K21721l19770M44913n99279O32373j96801
14074D550079k07523J40442j35072l94239J427N1138J2705O0915q0725j22958
14064C876189K07927L50806m76925o1316J33163k94065K09591k57547o212j29475
14054C552136N0244j44159K2372O1145p7106j27646J88383j98920k15911L61170
14044C471708j53218j18626J45139k50090k73646L26659j23823L2663L6268j68674
14034B924360L47817m3375q9748J28122k30854l9154K399k87982j2661p4825N3623
$$ plain form
14103 6338109 5913507 6258785 6072151 5775038 5610214 5612581 5731317 5375362 5477360 5622441
14093 5622441 5387840 5078969 5222913 5163131 5183926 5329889 5119284 4794130 4817120 4418376
14083 4418376 5019229 4542106 4366922 4588643 4268873 4713786 4114507 4746880 4550079
14074 4550079 4342556 4482998 4347926 3953687 3955114 4006252 4018957 4079872 3999147 3876189
14064 3876189 4084116 4434922 3957997 3896681 4029844 3735779 3945370 3687823 3681611 3552136
14054 3552136 3602380 3458221 3480593 3541738 3464632 3336986 3525369 3326449 3110538 3471708
14044 3471708 3318490 3199864 3345003 3094913 2821267 3147926 3024103 3056766 3093034 2924360
14034 2924360 3272177 3228802 3139054 3267176 3036322 2997168 2999567 2711585 2698924 2624099 2677722
14023B677722R5536l68745J39025J59606l77596N02455k35980r6027L5651m05154
14013B126493L37962j06555L12655o28560J1116K14796r2480J60574L8837R988
14003B384826m12110o3659O48546p78635N30692p07681L68764K49858J94999m09947
13993B005653K34810j39948J99301N59303R00066K722968O124740J5165646J3128869
13984D0901408j4437538j0727189o212166k686320j673944n70987p74068m48283
13976C370913m20231l57780L25380l83426K90985j64979j61668j15692p3630l3676
13966B276196n3670m34857M61283P4456j30537j89696J90981j20904K21702n36584
13956A758370L23319P7758k53875J95003J24327m55271O23822n50532l65330J94793
$$ plain form
14023 2677722 2773258 2404513 2543538 2703144 2325548 2828003 2592023 2495996 2531647 2126493
14013 2126493 2464455 2357900 2670555 2041995 2053111 2267907 2175427 2336001 2374838 2384826
14003 2384826 1972716 1909057 2557603 1778968 2309660 1601979 1970743 2220601 2415600 2005653
13993 2005653 2240463 2100515 2299816 2859119 3759185 6482153 12606893 27772539 40901408
13984 40901408 26463870 15736681 9524515 6838195 5164251 4593264 3819196 3370913
13976 3370913 2950682 2592902 2918282 2534856 2825841 2660862 2499194 2383502 2309872 2276196
13966 2276196 2222526 1787669 2248952 2323408 2192871 2003175 2194156 2073252 2294954 1758370
13956 1758370 2081689 2159447 1905572 2100575 2224902 1769631 2393453 1842921 1477591 1672384
13946A672384O8416j78216K26527N8077K11571l60198K1970j27131q9479l1434
13936A472487M56218k5270l99951N5570j40238m6163L66297J12062n76517L60156
13926A634651m42298J50225L27264j62463K53249k84023J8546J39078l12482L42259
13916A664006k72734p4519J91645k88282L56948j69994L5846k91410K65899r6855
13906A320550O6526J3638j46316j18734L78556l72983J99399J9249k07863N78399
13896A730421l96950O3039k64275K89940l83552K36538Q3383O9256k00276p2561
13886A154963j97849Q5388L7621M305l13460L08693J35255j71498N824J55413
13876A204655j18394M16790m48005L2408J8237J36752k8848p4459r3521L84645
$$ plain form
13946 1672384 1740800 1562584 1789111 1847188 2058759 1698561 1720531 1593400 1503921 1472487
13936 1472487 1928705 1903435 1503484 1559054 1418816 1372653 1738950 1851012 1274495 1634651
13926 1634651 1192353 1342578 1669842 1507379 1760628 1476605 1495151 1634229 1321747 1664006
13916 1664006 1391272 1316753 1508398 1220116 1577064 1407070 1442916 1151506 1417405 1320550
13906 1320550 1387076 1400714 1254398 1135664 1514220 1141237 1340636 1359885 1152022 1730421
13896 1730421 1333471 1396510 1132235 1422175 1038623 1275161 1358544 1427800 1227524 1154963
13886 1154963 957114 1042502 1080123 1084428 770968 1079661 1214916 1043418 1049242 1204655
13876 1204655 1086261 1503051 1055046 1087454 1105691 1242443 1213595 1139136 1045615 1430260
13866A430260q9368m45082K40704j36412J31714p5050k01057J96340J16466j20902
13856A047613j50963K79584l4405J14941k33609l62093N30697j85483J65930m45417
13846G26795K76388r0672K67118m19847P0027O7011j07435R6528J44131K19717
13836A249761k49453J34348j85025k37032M83383P1377n57032r9512L8355Q6248
13826G35418L09831k54362K73573l38395J13279q8567J5456P5199o207J27054
13816I62279o9619j7258R4842j04384m19035P4820L23285k61050J16864L0878
13806G31622j34172L46290k48849j99610J87365K78650j84971k0166M6595l72147
13796D30607K70549k3245j57550K79067O3739C95710N57796k77390J42750j00152
$$ plain form
13866 1430260 1340892 895810 1136514 1000102 1131816 1056766 855709 1052049 1168515 1047613
13856 1047613 896650 1176234 1141829 1256770 1023161 661068 1191765 1006282 1172212 726795
13846 726795 1003183 912511 1179629 759782 829809 896820 789385 885913 1030044 1249761
13836 1249761 1000308 1134656 949631 712599 1195982 1267359 710327 610815 649170 735418
13826 735418 1045249 790887 1064460 726065 839344 750777 766233 841432 835225 962279
13816 962279 892660 875402 970244 865860 446825 521645 844930 583880 700744 731622
13806 731622 597450 943740 694891 495281 682646 961296 776325 756159 802754 430607
13796 430607 701156 677911 520361 799428 863167 395710 953506 676116 818866 718714
13786G18714r0626r0172Q6887J15104K10287k05673k24503K14475P4218j48840
13776F59871L14608j88390O589O2952j54592O0726k86901L04261n9642M7095C46509
13764H75125l56141Q7451B86658K55680P9018j00564J92915J43619j99068j80163
13754D78095N17573m34940R1936j5390j09025l9973N842j22073M98401k65442
13744F05004P9134A73912M02047j79019R965J3706K69425K0172j51700J2276j03330
13733D67454J36798N6038J10554j41647J4510j81743N8091K24950n2520R9098
13723G91583l07407m9193m6239Q6477j40622q730K52443J92230j11682j52801
13713E06059J01097C00542P8503J23328M8171R0013j19303p0632K19531j71335
$$ plain form
13786 718714 628088 537916 624803 739907 950194 744521 520018 734493 808711 659871
13776 659871 974479 786089 792678 855630 701038 761764 474863 779124 719482 766577 346509
13764 875125 518984 606435 286658 542338 621356 520792 713707 857326 658258 478095
13754 478095 995668 560728 652664 637274 528249 488276 494118 372045 870446 605004
13744 605004 684138 173912 575959 396940 406905 420611 690036 710208 558508 570784 467454
13733 467454 604252 660290 770844 629197 643707 461964 520055 745005 692485 791583
13723 791583 484176 434983 388744 475221 334599 325869 578312 770542 658860 506059
13713 506059 607156 300542 379045 502373 550544 640557 521254 450622 670153 498818
13703D98818n9091M38472k80062j43339N3613j44020M00115j88918A74564N89142
13693G63706A65545M02288k70918J45749J16657K92457l25540M569k40850o7771
13683B22186L21519Q279r0230J65110A9692M31221j05211J99504j55360j40j16896
13672B72810H9832K03607m4943M86924C18582Q2345q6455N4734J78140K24436
13662G71782k04459M6087j79687B02936O14634B84334q8365M26874k34514O8903
13652D57232O7122k32036Q1720j05274J57240n1658Q0588k5372m2545P2699A24027
13640D91750j88064J20943K46765l32700J47790j36340K59679j86367M03893C81374
13629B32484K25020K96226l50791r7942j4351N6968j51834N6015L8727M5911r0888
$$ plain form
13703 498818 439727 878199 598137 454798 508411 364391 764506 575588 174564 763706
13693 763706 165545 567833 296915 442664 559321 851778 526238 530807 289957 222186
13683 222186 543705 551984 461754 626864 19692 450913 345702 545206 389846 389706 272810
13672 272810 89832 293439 248496 735420 318582 400927 314472 369206 547346 771782
13662 771782 567323 613410 433723 202936 817570 284334 195969 622843 388329 457232
13652 457232 524354 292318 374038 268764 426004 374346 454934 429562 387017 459716 124027
13640 491750 303686 424629 671394 338694 486484 350144 609823 423456 827349 381374
13629 232484 457504 753730 402939 304997 290646 347614 195780 251795 290522 336433 245545
13618B45545J09104J11021k02288E584M75081A27587J01991J07369j48027j9803
13608A69117M39892a11302B41773J62313Q9593m7295J89027k87068B4387L79454
13598D03841J54342j73420j03266J05969g153D65360A86164J73460p1553A34053
13587C40784J02138j35764M01269b5161C77124l4254K8611c6129B54994J16506
13577C71500A43719J64180R6649j04213K31243A79037j3782d7497C12701L19374
13567F32075F6809K79082j49011q9432L79973n4274j94955J35767A44732M06292
13557E51024m4813D6872N04445k73015I056a38071D46704p8369n824A61697J35527
13546B97224J43213E1006K88645R5853F6120k7600N15337k53844E1336f7528D57954
$$ plain form
13618 245545 354649 465670 263382 5584 480665 127587 229578 336947 188920 169117
13608 169117 609009 -111302 241773 404086 493679 446384 635411 348343 24387 403841
13598 403841 558183 384763 281497 387466 -7153 465360 186164 359624 288071 134053
13587 340784 442922 307158 708427 -25161 377124 342870 371481 -36129 254994 371500
13577 371500 143719 307899 404548 300335 531578 179037 165255 -47497 312701 632075
13567 632075 66809 345891 196880 107448 487421 433147 238192 373959 144732 551024
13557 551024 506211 46872 551317 278302 9056 -138071 446704 368335 362511 161697 297224
13546 297224 440437 51006 339651 435504 66120 38520 553857 300013 51336 -67528 457954
13534A97808k0183L1821J37244A46287o3251j3502a74920I7982R950J85341M7118
13523C40391o908A40185L51962j35633A16726J59988l0787J64280j25953J35834
13513D20088q7308l8116J07226a94727A80029p7890j749O9208J61057k2253j51300
13502A57102K19869A74443J58127A37607M3904J33801r9604J36561L557A10456
13491C07295B0705J15230J20198L85995E2359R9438K41793N4500j92369K43695
13481D99416j87930J65817O3340A43709D460K48651K33429I4047J19769j00951
13471A12865K15187p4890B9426L48286j18198J88049G2322K38663F676L07860
13461C14536J1444R0524B5643J41197r783F5698K86650o1797D951M59478e1935
$$ plain form
13534 197808 177625 209446 346690 146287 83036 69534 -174920 97982 107932 293273 340391
13523 340391 333483 140185 492147 356514 116726 276714 245927 410207 284254 420088
13513 420088 332780 294664 401890 -194727 180029 102139 100390 169598 330655 308402 157102
13502 157102 376971 174443 332570 137607 181511 315312 215708 352269 355826 110456
13491 307295 20705 135935 256133 642128 52359 151797 393590 448090 255721 499416
13481 499416 311486 477303 540643 143709 4460 253111 486540 94047 213816 112865
13471 112865 328052 253162 29426 377712 259514 447563 72322 310985 6676 314536
13461 314536 325980 416504 25643 166840 157057 65698 352348 290551 4951 464429 -51935
13449A64212H1692K30165A01337Q798a6316B38800D3703J97103J38585a01174
13438C38319j32673q0156M1330J9725O0038A08120J48390d3907C61141g3677D26171
13426B32441O9170A23849K9615j4612J54275J72363B06677B3181K41068d6508
13415B92611D5250K34017b0548A89128A6331L86611A40768R0818P653A03268a0018
13403C28235A34983M173N58E228g4703a5166B88921p5978F1780L02960I7840M6719
13391A44559a42625A43884M8014c03439B93582j38355J36954J4116C8729L14964
13381C53693n4355A29597O4492K23232f6182C27168k8175B9992K74855J2185r383
13370C07649m1352G788J75526K86036F2963K5323R7515a5234A98467J09995l0149
$$ plain form
13449 164212 81692 311857 101337 110135 -16316 238800 43703 240806 379391 -101174
13438 338319 205646 125490 166820 186545 246583 108120 256510 -43907 361141 -73677 426171
13426 232441 301611 123849 153464 138852 293127 465490 206677 23181 264249 -46508
13415 292611 45250 279267 -20548 189128 16331 402942 140768 231586 239239 103268 -10018
13403 328235 134983 139156 139714 5228 -74703 -15166 288921 212943 61780 364740 97840 144559
13391 144559 -142625 143884 191898 -303439 293582 155227 292181 306297 38729 353693
13381 353693 299338 129597 194089 417321 -66182 327168 298993 29992 304847 317032 307649
13370 307649 266297 7788 183314 469350 62963 88286 185801 -15234 198467 308462 278313
13359B78313J48823B02038j7246c7010B51476N327a36754A43415m8832q40a01111
13347i0419A74271L4900e1447A7500J73468j4044J38883k9760j11810K19512j50598
13336B43151J44069A47012J88470m8515J51097k9679q5049A08662O639L21811
13326D37112A31739O6828R2471D1323j9859L64397G8646N0682N4944L40358k37211
13315B87419M270h6504E89049h4424C55417D9606J17507k0213b24426B75225K83228
13304E58453A17223L3762m4586K8189J62544A08897M1363J25253d34711a15370
13293A09150J18786L8281E6324N7877O1993c6513n8028C48471j70355L8914E9645
13281c8754C38066j53346E1346j1523R6960b7307B66854A26741J0435J80904J9785
$$ plain form
13359 278313 427136 202038 184792 -37010 251476 256803 -136754 143415 94583 93743 -101111
13347 -90419 174271 209171 -51447 17500 190968 176924 315807 286047 174237 393749 243151
13336 243151 387220 147012 335482 286967 438064 408385 323336 108662 115301 437112
13326 437112 131739 198567 291038 41323 21464 385861 78646 129328 184272 524630 287419
13315 287419 291689 -86504 589049 -84424 355417 49606 167113 146900 -224426 275225 558453
13304 558453 117223 150985 106399 134588 297132 108897 150260 275513 -434711 -115370
13293 109150 227936 266217 56324 114201 176194 -36513 -94541 348471 178116 217030 59645
13281 -38754 338066 184720 51346 39823 136783 -27307 266854 126741 137176 318080 337865
13270C37865D0726e5810b1580B04967b99127I0190J34685n6464L2987f5732D0949
13258a32418E9574P2423a09610r4332E1696n480e2063E8973c5439B27366r5J35294
13246C62565M3617A87560a6523G2335J60935A02767b3301A6910a98434A12736
13235C8649M31788j42072j50852M4509A00588i5843B81493B7339M79038h3054
13224F98530G3691d1623F4121a49968A68771l5738J2649l3331a32166A59137Q0879
13213B40016A18057n2406J78765d8613k0365D84306c14312C02514K0565A28675
13202F1219Q3732a33471e897H360B530R5386R5819e1494H3112k3604g05A24231
13189d0167C30948I7279Q0939L30144a77061H0746k9765J10064F0156K37451a69738
$$ plain form
13270 337865 40726 -55810 -21580 204967 -299127 90190 224875 168411 201398 -65732 40949
13258 -132418 59574 131997 -109610 -203942 51696 46216 -52063 58973 -35439 227366 227271 362565
13246 362565 406182 187560 -16523 72335 233270 102767 -23301 16910 -198434 112736
13235 38649 470437 328365 177513 222022 100588 -95843 281493 27339 506377 -83054
13224 698530 73691 -41623 64121 -149968 168771 133033 145682 112351 -132166 159137 240016
13213 240016 118057 65651 244416 -48613 -68978 484306 -314312 302514 323079 128675
13202 61219 144951 -133471 -5897 8360 2530 97916 193735 -51494 83112 59508 -705 124231
13189 -40167 330948 97279 178218 508362 -177061 80746 50981 161045 60156 297607 -169738
13177e9241D31596H6474A8406Q9824d1433B96346K6472r6499E4686J21740q7220
13166H9206J65076I2200K0222L14659A2713L9728J64217h8108B3831a87102D56869
13154A02090i0065B9582M0828J17765a61202b8758e557C6459M09657c53524I3076
13142A66050J32146H0098h7558C73421F9649B4649J27753Q913P5621a06743B65426
13130d1606A5888K52509d94667A04937a87588m4670F6709a17664d7793A75693
13119E29950K9324c6341A94154L9698I1171J88104a01824B17892F6329a72707
13108a50395B17953B6728d3878G1547J96149n4217d8591B27939b692E7065J12053
13097A69118m3011C7331a53833e6285A01007a18260m0249b1232n364A37367j5237
$$ plain form
13177 -59241 431596 86474 18406 108230 -41433 296346 322818 226319 54686 176426 89206
13166 89206 254282 92200 112422 427081 12713 52441 216658 -88108 23831 -187102 456869
13154 102090 -90065 29582 70410 188175 -161202 -28758 -5557 36459 446116 -353524 93076
13142 166050 298196 80098 -87558 373421 69649 24649 152402 161315 236936 -106743 265426
13130 -41606 15888 268397 -494667 104937 -187588 -232258 66709 -117664 -47793 175693
13119 529950 559274 -36341 194154 233852 91171 279275 -101824 217892 66329 -172707
13108 -150395 217953 26728 -43878 71547 267696 213479 -48591 227939 -2692 57065 169118
13097 169118 126107 37331 -153833 -56285 101007 -118260 -158509 -21232 -26596 137367 122130
13086A22130k8591J5960J07473c4087A04329J64168b42421A75365H6608K6903
13076A13511K29986j8534E9939b619n4690C2643J35245N2748r2088m6556c6115
13064A05412D9563g6595L4904p8013D1230J531b11600H116a7378E0496i7116l8158
13052a35274M3953I1531J27857n9482F7473J6137a82057A08318b00370A14130
13041B38398C4581d9126B31618J56619A6544a66068G2858j9229L2247B5759a13625
13029a39934d2285C05014A24846Q1027J80581a2133l31256D1381J50741k0325
13019A71797N942Q9315a33309C80451b05930k6135E0758J54456e7238A11817a1570
13007A44636b4931C12470m9259K7258D4981K5491B434L22680j54021B316a29278
$$ plain form
13086 122130 93539 109499 216972 -34087 104329 268497 -242421 175365 86608 113511
13076 113511 343497 324963 59939 -2619 -57309 32643 167888 220636 128548 81992 -36115
13064 105412 49563 -76595 -41691 -119704 41230 42761 -211600 8116 -17378 50496 -97116 -135274
13052 -135274 -91321 91531 219388 159906 67473 83610 -182057 108318 -200370 114130
13041 238398 34581 -49126 231618 388237 16544 -166068 72858 53629 85876 25759 -113625
13029 -139934 -42285 305014 124846 205873 386454 -12133 -343389 41381 192122 171797
13019 171797 177739 267054 -133309 380451 -205930 -232065 50758 205214 -57238 111817 -11570
13007 144636 -24931 312470 263211 290469 44981 70472 2434 325114 171093 2316 -129278
12995b7955A3507L60544O4663b4175j09647A73088j0982K3285a25087L0455j16760
12984b11392A0124J90965a9413G6634J95772f0456A40627J15058k2593J61254
12974C94346A29751E1145M618a51863D8044J92280a18486A92456a02475B49993
12963D7600Q2752L0688L6073I5749J41582I5920J28188O4886A02392J05114f3644
12951E7227a89573B24684c4404A00720b61246A16915L2779a08231A66219d6236
12940a43846l646f671A04150a00760A29323a76796H9365K59808H1595M2001L5530
12929A59126n1263a05908J6182l5372j19906j43444I5482a41330F7268P0052i822
12917e2301A28417b42785A2468K16555b59652B85464l6233b5764A48887c9764
$$ plain form
12995 -27955 13507 374051 438714 -24175 -133822 173088 162106 185391 -125087 -94632 -211392
12984 -211392 10124 201089 -19413 76634 272406 -60456 140627 255685 233092 394346
12974 394346 129751 51145 55763 -151863 48044 240324 -118486 192456 -102475 249993
12963 47600 130352 161040 197113 95749 237331 95920 224108 288994 102392 207506 -63644
12951 57227 -189573 224684 -34404 100720 -261246 116915 149694 -108231 166219 -46236
12940 -143846 -147492 -6671 104150 -100760 129323 -176796 89365 349173 81595 123596 159126
12929 159126 107863 -105908 -89726 -125098 -245004 -388448 95482 -141330 67268 137320 -9822
12917 -52301 128417 -242785 12468 229023 -259652 285464 249231 -25764 148887 -39764
12906c2901k19037A14417b36808g2242j45622M3617l55B06490a52907E0375k556
12895D7819K75861A36805g9634K9010k71787A0839g230C41240d2128k481q448
12884e3057A57752R1057a42169G3009a24182B48234a52553j64445M6351A09901
12873G0253f3593j29146c9393F2597d7529k7674B26185b04727o53o217A57964
12861A4632L31095h3555a3335A39637J51259o8113m7634a13443c8365l1268C6322
12849a64987l4180A18769h0995A44486K6634b81194A64584d3413j12583M1907
12839a14089I1850A2342K131b1868r3887K5880M4136i75D4968J73858b0418A22689
12826c8860j27721B9785P517e00700d6602A30267B645g1615l1010A2760c03909
$$ plain form
12906 -32901 -251938 114417 -236808 -72242 -217864 -174247 -174602 206490 -152907 50375 47819
12895 47819 323680 136805 -79634 -50624 -322411 10839 -7230 341240 -42128 -44609 -53057
12884 -53057 157752 248809 -142169 73009 -124182 248234 -152553 -316998 -270647 109901
12873 70253 -63593 -192739 -39393 62597 -47529 -75203 226185 -204727 -205380 -211597 157964
12861 14632 345727 -83555 -13335 139637 290896 222783 175149 -113443 -38365 -69633 36322
12849 -164987 -199167 118769 -80995 144486 171120 -281194 164584 -43413 -155996 -114089
12839 -114089 91850 12342 14473 -21868 -115755 -89875 -45739 -975 44968 218826 -20418 122689
12826 -38860 -166581 29785 37302 -500700 -46602 130267 2645 -71615 -102625 12760 -303909
12814d3152D342P5885c46188J6035A098b34100B56472a1493k04871m7111G8720
12802B12844A056K74735b18788A35342C4921g2811A65466J568a07346B19967J3382
12791B33349K9180b66297H9278b10236j49372B46078g5548p3487a4261D6820b19091
12779b9783p8642n913k29591K8340A27601M6731M8783a06521E0356b37700B0270
12767A6213K60c22366g2045H0008a439D0539K512e6916D16786a1145k30667H8701
12754B30394F1145a39263o2392A99874g9303B07716n940h7219B38228D4481L2092
12743G6573a40088A59814c29353J14193B47606a06462g904b241I6826b50292B60462
12731H8463J25639H9015j7664l2986L3455h3585r4872f801j03368B3967M5173
$$ plain form
12814 -43152 4342 80227 -346188 -330153 1098 -234100 256472 -11493 -216364 -263475 78720
12802 212844 1056 275791 -218788 135342 34921 -72811 165466 167034 -107346 219967 233349
12791 233349 262529 -266297 89278 -210236 -359608 246078 -75548 -149035 -14261 46820 -219091
12779 -29783 -108425 -114338 -343929 -315589 127601 174332 223115 -106521 50356 -237700 20270
12767 16213 16473 -322366 -72045 80008 -1439 40539 43051 -56916 416786 -11145 -241812 88701
12754 230394 61145 -139263 -201655 199874 -79303 207716 201776 -87219 238228 44481 76573
12743 76573 -140088 159814 -329353 -215160 247606 -106462 -7904 -2241 96826 -250292 260462
12731 88463 214102 89015 71351 38365 71820 -83585 -178457 -6801 -110169 23967 69140
12720F9140J62160a27141A39769c9637C04419H0447C1410N7897h3592J0554m8698
12709a21736A08043M9413j9499J75228r9148q2485K70962G2256h0262j1591d0674
12697B44576a96449a5366A92810j1130l1690G4238b31j45008A38801a7062m5605
12686f2667D6299k952N5553A5015K06996F362R7669r836M61194c04483a28947
12674B28019l0914b7538j29928j56469i1765A02736C8718K75990a29020B96304
12663B470a92970B19232I4056Q6495c09246A08279b36228B50524a20949d6403
12652C23515O1317b8824A42471a13118j45549A74136B7512M9158a75674g9031
12641f755j56993C44032g4369j2614A31557a93761A8106K49586F35J32104K27711
$$ plain form
12720 69140 231300 -127141 139769 -39637 304419 80447 31410 89307 -83592 -73038 -121736
12709 -121736 108043 157456 137957 313185 214037 131552 402514 72256 -80262 -91853 -40674
12697 244576 -196449 -15366 192810 181680 149990 74238 -231 -145239 138801 -17062 -62667
12686 -62667 46299 43347 98900 15015 222011 6362 104031 94195 555389 -304483 -128947
12674 228019 197105 -27538 -157466 -313935 -91765 102736 38718 314708 -129020 296304
12663 2470 -192970 219232 94056 180551 -309246 108279 -236228 250524 -120949 -46403
12652 323515 384832 -28824 142471 -113118 -258667 174136 27512 76670 -175674 -79031
12641 -6755 -163748 344032 -74369 -86983 131557 -193761 18106 267692 635 132739 360450
12630C60450c087k23915R7832A40802a0844C45658i4252B29224a69863C65731
12619A42184J71547A20395l0542K53430b30809e2041B10638G5912b69471i4461
12608B79324c11093i9458B11118b2013D5272j3715R3987L8526f3532B61527j04638
12597A56889C0822O1511c1967l50324a7518k30756B67342h0432G3648B0084E293
12585A7179a72347D7990a02405j0065a7590r5491b9401j1052j3005a1950l8818
12574e0768C6130J3980K50530a7875C0354q110b8554A62435a8821n6664A69846
12562b61707P6942B9037K58064b14732R9157B3832E793b46634J22875D6205a01421
12550d4058j8744B04433J33610a45476G3569a5955A04769E049d1937j30996A45976
$$ plain form
12630 360450 -3087 -227002 -129170 140802 -10844 345658 -94252 229224 -169863 365731
12619 142184 313731 120395 89853 343283 -230809 -52041 210638 75912 -269471 -94461
12608 279324 -311093 -99458 211118 -22013 45272 31557 125544 164070 -63532 261527 156889
12597 156889 30822 92333 -31967 -382291 -17518 -248274 267342 -80432 73648 20084 5293
12585 17179 -172347 47990 -102405 -112470 -17590 -113081 -29401 -40453 -53458 -11950 -50768
12574 -50768 36130 50110 300640 -17875 30354 22244 -28554 162435 -18821 -75485 169846
12562 -261707 -184765 29037 287101 -214732 -115575 23832 5793 -246634 -123759 46205 -101421
12550 -44058 -62802 204433 338043 -145476 73569 -15955 104769 5049 -41937 -172933 145976
12538A4931a87052P1455e3683A20982l6332h6535K4658b1303F8509a23715N3221
12527g0494j34092B88922e4146b079C90535j31263a36659c9304k03186A73721
12516a463A0813J0482a92567L5455D8624C868J14695e562q5287F7900k0084K6801
12504G4617i5493C36387e2032j13785E8557N0679j3559J38651B299K07123I4135
12492A50311l0998K19161p3140j00162l6220a93296g2730A1016J2540J63723I2862
12480C2474a02290G9530C5304J19339a10014I705Q0429k6703K32540b88812i0755
12468a58499A17833J47008a08958B00824g2395F29291k46483c52551A92454b24123
12457E4862d26909C12012A35847A9218a03430A45488f2242J7600j25031g831d25
$$ plain form
12538 14931 -187052 -115597 -53683 120982 84650 -86535 -61877 -21303 68509 -123715 -70494
12527 -70494 -204586 288922 -54146 -2079 390535 259272 -136659 -39304 -242490 173721
12516 -1463 10813 21295 -192567 -157112 48624 3868 118563 -5562 -90849 67900 47816 74617
12504 74617 -95493 336387 -52032 -165817 58557 109236 95677 234328 2299 209422 94135
12492 150311 119313 338474 265334 165172 128952 -193296 -72730 11016 23556 187279 92862
12480 32474 -102290 79530 35304 154643 -110014 9705 90134 63431 295971 -288812 -90755
12468 -158499 117833 264841 -108958 200824 -72395 629291 382808 -352551 192454 -224123
12457 54862 -426909 312012 135847 19218 -103430 145488 -62242 -44642 -169673 -7831 -425
12445e9879b532r4890o4493A36316F1323A8091c2233a5965j78738E7790K43287
12434C01077P759E1497R7781c96525J95492c6276H8131b42180B2787a02547j56252
12423b58799R5942k11981A12116J67211I1871d9658l01906C36981I6037m219a32373
12411C05022c00923c7012G9916P3080h9788k41425A75096h5511I9703J788a46152
12399A28233L72615H0395b7762C93547e6643j79976L2187E61310b70289A77216
12388A76148D2629b65979A49220J84132c3687j48142E1665K4898A3206a02137
12377e5822n200K3356E133L2470K7305a99845C0957H066N4399P1936D5565J5123
12365F0688c14609F783J9398L1775a69290P7812j33494M6782C1421f5517A73329
$$ plain form
12445 -59879 -2532 -97422 -161915 136316 61323 18091 -32233 -15965 -194703 57790 301077
12434 301077 308836 51497 149278 -396525 -201033 -36276 88131 -242180 22787 -102547 -258799
12423 -258799 -162857 -374838 112116 279327 91871 -49658 -351564 336981 96037 91818 -132373
12411 305022 -300923 -37012 79916 152996 -89788 -331213 175096 -85511 99703 101491 -146152
12399 128233 500848 80395 -27762 393547 -56643 -236619 -204432 561310 -270289 177216
12388 176148 42629 -265979 149220 333352 -33687 -181829 51665 76563 13206 -102137
12377 -55822 -61022 -37666 5133 37603 64908 -199845 30957 8066 62465 134401 45565 60688
12365 60688 -314609 6783 26181 57956 -169290 -91478 -224972 -178190 31421 -65517 173329
12353f6827J9653D4880J08948B1096b1912I5326m2232J2068h5456c928A35543
12341B77774d0100B55330j01110j3528C9993i6351j62304A75981A0806N7651j5843
12330E2614M21585B17179O7238C128g154A19693n7152J72768p876J24762m4004
12319C08191C0866J28114O7812J21108j21469E2422J79156K2109A6558P0193J09075
12308A95826a5726B29813D1949a52364B35437H4725L865a08584j2191j03709c4773
12296d5160j3247h728A36384j9156n4353L30348A70797o0466k9261N4473a25989
12284f7302l09448C03050g2657B72550G6504b44196B4131h309k32621B09284l9983
12273A69301J33285a24181A75548c6152e360B35791K60442a14982C24469l3249
$$ plain form
12353 -66827 -47174 44880 153828 21096 -21912 95326 53094 65162 -85456 -3928 135543
12341 277774 -40100 255330 154220 140692 39993 -96351 -258655 175981 10806 68457 52614
12330 52614 474199 217179 284417 3128 -7154 119693 62541 235309 227433 352195 308191
12319 308191 30866 158980 226792 347900 226431 52422 231578 253687 16558 86751 195826
12308 195826 -15726 229813 41949 -152364 235437 84725 88590 -108584 -120775 -224484 -34773
12296 -45160 -58407 -8728 136384 117228 62875 393223 170797 110331 81070 135543 -125989
12284 -67302 -376750 303050 -72657 272550 76504 -244196 24131 -8309 -240930 209284 169301
12273 169301 302586 -124181 175548 -36152 -5360 235791 496233 -114982 324469 291220
12263B91220F0003J37627p540J27279B8763K92460e9730C31167b52163f388k41987
12252b48375G6715O0451n7500M5508L7170a95008A05651A1284J97203a19401c6747
12240C06143A8106a39676a0371G1157J73498b8209A51116a54695e6557a1222j49979
12229a61201F9848B5916K6732L97949k14218r7251L39112B03046j920P2952f9632
12217E0209K40657p1948K82734k16210j1814N8579d9665A37601P5963l2931j2190
12206A68443j0790N6734J03009c74B24198B9210N4408R2878F074P6285L63841
12195D46200p5088H5015J73401r9559K56612a9976E39346C4594J36492o5481K86895
12184C92500M2399D5171a26479H5110L10762F1670L86576j26791j53003A7748
$$ plain form
12263 291220 60003 197630 190090 317369 28763 321223 -59730 331167 -252163 -6388 -248375
12252 -248375 76715 137166 79666 125174 162344 -195008 105651 11284 208487 -119401 -36747
12240 306143 18106 -139676 -10371 71157 244655 -28209 151116 -154695 -56557 -11222 -161201
12229 -161201 69848 25916 52648 450597 236379 139128 478240 203046 201126 274078 -69632
12217 50209 290866 218918 501652 285442 273628 332207 -49665 137601 213564 180633 168443
12206 168443 157653 214387 317396 -374 224198 29210 83618 176496 6074 82359 446200
12195 446200 371112 85015 258416 158857 415469 -19976 539346 34594 171086 105605 392500
12184 392500 434899 45171 -126479 85110 395872 61670 448246 321455 168452 17748
12173A50829J65031d6839C02753E3034R1850B6362b6244E7736J16395a1574D46722
12161C77633A41482R3117K31631B04414r6915E1124M3018a88243m0797N4623c7482
12149H9047d6596F4693b28200L2473B26993b62150G9417K44491j05191b8016E7432
12137a11897A77004K5682M56854G6985l5026N8925K95587Q5248j77257B2313L03705
12126C26018a16204F251P3940L26973j26278j4460j14580A1403J21244K0299K1953
12115A74899K74830A25292L26062k20246O0501j08173P8146n4743n3756p2336
12105H0747L23126c6145C5645c0257B97491i9478d220D35482b8442A63015b46154
12093A4807a23812C96J55052j5838E1688J61N5722k2151f8029C2017g0123j4906
$$ plain form
12173 150829 315860 -46839 302753 53034 144884 26362 -26244 57736 174131 -11574 446722
12161 377633 141482 234599 466230 204414 107499 51124 94142 -188243 -229040 -174417 -37482
12149 89047 -46596 64693 -228200 -195727 226993 -262150 79417 323908 218717 -28016 57432
12137 -111897 177004 202686 659540 76985 41959 100884 396471 481719 304462 22313 326018
12126 326018 -116204 6251 80191 407164 280886 266426 151846 11403 132647 152946 174899
12115 174899 449729 125292 451354 231108 291609 183436 261582 206839 153083 80747
12105 80747 403873 -36145 35645 -30257 297491 -99478 -4220 435482 -28442 163015 -246154
12093 14807 -123812 396 155448 139610 51688 51849 107571 85420 -68029 32017 -70123 -85029
12081h5029A98129n4350J70028a66659a3655B6010n884h7272q707E345h754B00705
12068A28919l8092c28638a28548B79435a38152b5457F4724L0437M0744A1934h12
12056e3284R682I6418a28396B06648b2774B44946l1372b12778b8861B10693F7297
12044e950A08372l7348N1023L5591a25122D8492R6284m4474J16013A6466R7184
12033A13650M5861R2531F2329b43451a15215j07176R3191A48459a87128G8461
12022E145J66852E7376J09690a102j78628A5280P8112K72971A792b86175A65973
12010a61848A57268J03003A03655J65916b0374o0940I9039J73407p9353l7371
12000A55722E3074j7951c62187i7263B00999e4155A4377J13006a78868f3688l5751
$$ plain form
12081 -85029 198129 143779 313807 -166659 -13655 26010 20126 -87272 -95979 5345 -8754 200705
12068 128919 90827 -328638 -128548 279435 -138152 -25457 64724 95161 135905 11934 -812
12056 -53284 -43602 96418 -128396 206648 -22774 244946 213574 -212778 -28861 210693 67297
12044 -5950 108372 71024 122047 157638 -125122 48492 144776 100302 216315 16466 113650
12033 113650 159511 252042 62329 -243451 -115215 -222391 -129200 148459 -187128 78461
12022 5145 171997 57376 167066 -1102 -179730 15280 93392 366363 1792 -286175 165973
12010 -161848 157268 260271 103655 269571 -20374 -81314 99039 272446 193093 155722
12000 155722 53074 35123 -362187 -97263 200999 -54155 14377 127383 -178868 -63688 -99439
11989i9439B28785H7415A3824d4304o298J2140j62168k46055C3435c28747A10237
11977b7345o6754C0558J9469L45784B2105J15341d8321A07884d2606A30898a45790
11965a31725m5238I9135f1863l77386J13502J01336N6246b2902F7384b58636A66400
11953a86588B00891a78546c6177r2403D651b49376D0143a44093r8747I7466k8001
11942F9465b52538d0282j36188O522K4637B67522I5241C0733K792a68610b2595
11930G6188d28754a05587K9123A1041a99851J8439A5995c73178b7993A46263O1070
11919B07333D5825d3624j02944B26023g1205B04239M4318h6079k1408d4883m6545
11908i1428j84999N0116a1522A75382a01667H0219D006R1691b76791h0838L8646
$$ plain form
11989 -99439 228785 87415 13824 -44304 -50602 -38462 -200630 -446685 33435 -328747 110237
11977 -27345 -94099 30558 50027 395811 22105 137446 -48321 107884 -42606 130898 -145790
11965 -131725 -176963 99135 -61863 -439249 -325747 -224411 -168165 -22902 67384 -258636 166400
11953 -186588 200891 -178546 -36177 -128580 4651 -249376 40143 -144093 -242840 97466 69465
11942 69465 -252538 -40282 -176470 -169948 -145311 267522 95241 30733 33525 -168610 -22595
11930 76188 -428754 -105587 -76464 11041 -199851 -181412 15995 -373178 -27993 146263 207333
11919 207333 45825 -43624 -146568 226023 -71205 204239 248557 -86079 -107487 -44883 -91428
11908 -91428 -276427 -226311 -11522 175382 -101667 80219 4006 95697 -276791 -80838 -42192
11897d2192D5826a99290A0524a81442Q2956c6680j39226c145j28096A4021b37003
11885b08560R0752m3689p6149k4945A78970e116A02365A5218b82727f0060j2208
11874g2268B75033b42148A84951m4175B7701a03782q3952r401B06012Q8592p9857
11863B14747j9767H3590c5257b539C4341a28491F7478b05910i1659j59440a21293
11851A66285b13632J05765F7451l3154Q9399b3079j07807j12538E9447a1791A54069
11839a51788F3274o901L431Q5557a39852F41a33505H3092J45994H9965f0713A45540
11826a94935i5709B57038q7969i4654A99716j4515b9715A63416B355L6826A0126
11814a2986n7398m6952A8044e7451B93743a5520r8875A23560a06897J6438k72675
$$ plain form
11897 -42192 45826 -199290 10524 -181442 -98486 -36680 -175906 -3145 -131241 14021 -237003
11885 -208560 -117808 -161497 -237646 -262591 178970 -5116 102365 15218 -282727 -60060 -72268
11874 -72268 275033 -242148 184951 140776 27701 -103782 -187734 -197135 206012 294604 214747
11863 214747 194980 83590 -35257 -2539 34341 -128491 67478 -205910 -91659 -251099 -121293
11851 166285 -213632 -107867 67451 34297 123696 -23079 -130886 -243424 59447 -11791 154069
11839 -151788 63274 56373 59804 145361 -139852 641 -133505 83092 229086 89965 -60713 145540
11826 -194935 -95709 257038 169069 -94654 199716 185201 -29715 163416 2355 39181 10126
11814 -12986 -70384 -117336 18044 -57451 293743 -15520 -114395 123560 -106897 -90459 -363134
11803c63134A49356a47698B09539b76256e1005l5043B38047B4772K77854c29169
11792a90867A21135D3440b41461k524A04313d30805H3345j0374N0828A4955K3446
11781C8401c2484k31386A4244i4589B02037m1823g8441K7653I4765b38935f4953
11769b76377B15961a94323a1783n7690H7720N6241b67535A36965l2927N2651a04809
11757d07732B11136a05213I9248m2209e896A52309c5951j01043D20888A0331N8124
11746F8455O764J25894g5522A47838b6864G5365c7003k3036A25303B1241O4907
11735H6148c8224H7592k2892J44394a35198d5117B7728J86596m7079h4963j11325
11724a96288k0395B18348b25878a08694n0128J2030H8361h0779j51666R7994A04196
$$ plain form
11803 -363134 149356 -147698 209539 -276256 -51005 -86048 238047 24772 302626 -329169
11792 -190867 121135 43440 -241461 -243985 104313 -430805 83345 72971 123799 14955 38401
11781 38401 -32484 -263870 14244 -94589 202037 160214 -78441 -50788 94765 -238935 -64953
11769 -276377 215961 -194323 -11783 -69473 87720 143961 -267535 136965 104038 156689 -104809
11757 -407732 211136 -105213 99248 57039 -5896 152309 -35951 -136994 420888 10331 68455
11746 68455 75219 201113 -75522 147838 -26864 75365 -37003 -60039 125303 21241 86148
11735 86148 -38224 87592 64700 209094 -135198 -45117 27728 214324 167245 -84963 -196288
11724 -196288 -216683 218348 -225878 -108694 -158822 -146792 88361 -80779 -232445 -134451 104196
11712a83416F463b20900g1319j09727G4119P189K31089I2039R7509b57110A07178
11700B66063b43040A23603D7428J05246a25237c6462B1470J35619k9951K3205
11690A50343J67745F1222a03176H9064B886M4988M35824A25178D6973J8665J3287
11679G8925M2594a09714K4771a5544j23963f898j3341B95030A17590J31604L3428
11668B82622E2575a37776E9946g5254A39511J69649b66503i6305q3035f8461B10072
11656G7335l7241p006R7049D2845b76453R9239C21790c04469D6714K6283e7352
11644B85407j12736a12869k30010A2391J53585a09854l1782c5729A167K285J3946
11633A7398f3370k85818d6856B01119a8138j33490j9843d9676l2387q0464c0168
$$ plain form
11712 -183416 6463 -220900 -71319 -181046 74119 81308 312397 92039 189548 -257110 107178
11700 266063 -243040 123603 47428 152674 -125237 -36462 21470 157089 127138 150343
11690 150343 318088 61222 -103176 89064 2886 47874 483698 125178 46973 65638 78925
11679 78925 121519 -109714 -84943 -15544 -139507 -6898 -20239 295030 117590 249194 282622
11668 282622 52575 -137776 59946 -75254 139511 309160 -266503 -96305 -179340 -68461 210072
11656 77335 40094 33088 130137 42845 -276453 -177214 321790 -304469 46714 72997 -57352
11644 285407 172671 -112869 -342879 12391 165976 -109854 -141636 -35729 1167 3452 17398
11633 17398 -63370 -349188 -46856 201119 -18138 -151628 -171471 -49676 -82063 -162527 -30168
11621A69572G9290i0871B0693c0719B44995q4083O0798e6258b3152A53363a70009
11609B5328g6531k60620A1176L4994R9530j9869a87663a9249k30863I3295b947
11597B13409F1918J72210m3119b9868B03697d80504A57351e5924J7138A78376
11586a3710B66577A5891K84046D0265c96989B9279J86073d7983F5877Q4780g0624
11574D9955a20095A29987a51571C07461a52021A79446L1963J7792a54462b2085
11563f0685C74309B1266F806J15434B7514q10b20371P5773I4311O5110D8096g2883
11550b06099A81072C3847P8859a44788A62248f6228B47541r9172J52195A10997
11539H6745K10583D2179M0004b51005A29930E7304R4794k8663a07456k4884f401
$$ plain form
11621 169572 79290 -90871 20693 -30719 244995 160912 221710 -56258 -23152 153363 -170009
11609 25328 -76531 -337151 11176 46170 145700 125831 -187663 -19249 -250112 93295 -2947
11597 213409 61918 234128 191009 -29868 203697 -480504 157351 -55924 -38786 178376
11586 -13710 266577 15891 299937 40265 -396989 29279 215352 -47983 65877 150657 -70624
11574 49955 -120095 129987 -151571 307461 -152021 179446 211409 229201 -154462 -22085
11563 -60685 374309 21266 6806 122240 27514 26704 -220371 -144598 94311 159421 48096 -72883
11550 -206099 181072 33847 112706 -144788 162248 -66228 247541 148369 300564 110997
11539 86745 297328 42179 82183 -251005 129930 57304 152098 123435 -107456 -132340 -6401
11527D812J84306l0667b8693H0825a50115A4010K22535i1643m2015A06870j0421
11516I6449L25708A15846J41743a33652A70285c6246p2983F0979L42956A58077
11505A84285c4723A03652K6354e1219j76529F6729a43046A03900b08158a3569
11494H8867R618e2356J6752I3338J05257N0553h3489G1469J65744k7100j3820
11483A96293c8240B13492C3339J99683e9757D5344k0209K07862j06404n2605a6497
11471A51782m2118J98702j1108b21457A89184a40492k4864A81077q3663C8513
11460b5514n1469D6840O10179a8225A0167a46152A95849O5707l9052b90538c4360
11448b7908b515G8422K8804L7421l3599l8642a17734C05688G1914c15013A2484
$$ plain form
11527 4812 189118 158451 -28693 80825 -150115 14010 236545 -91643 -133658 106870 96449
11516 96449 422157 115846 257589 -133652 170285 -36246 -109229 60979 403935 158077
11505 184285 -34723 103652 130006 -51219 -227748 66729 -143046 103900 -208158 -13569
11494 88867 98485 -52356 -35604 93338 198595 249148 -83489 71469 237213 210113 196293
11483 196293 -38240 213492 33339 233022 -59757 45344 25135 232997 126593 73988 -16497
11471 151782 109664 308366 297258 -221457 189184 -140492 -165356 181077 97414 38513
11460 -25514 -76983 46840 657019 -18225 10167 -146152 195849 261556 222504 -290538 -34360
11448 -27908 -2515 78422 107226 144647 111048 72406 -117734 305688 71914 -315013 12484
11436A51665J84338A28170K72714f0554j03404C01483a4094k55931B22093E3224
11425A58031D4658J59869a25434B10515B1909f3038G9480a6648j55413d625r2538
11414i7163o9317j46387I6330a83070J1629C0230c310A84324F2382J40860B9753
11402B4840M42448A35697l0889a14806A0839K51849A6127a17628e2806j4142H531
11390D49118A89048a12247j30885J16656f0393H4028g938o7283C0123a51822q775
11379a60597A2119i6731C1934R0202J24226b16670c5518A53339d1051A61419c2965
11367G0993J5695c43458g5698D33781a02456E6370A0915b45628B21300b85062
11356E4415a26258C6578c16208I0764j6289J01360c9239d413l453j56933F8255
$$ plain form
11436 151665 336003 128170 400884 -60554 -163958 301483 -14094 -270025 222093 53224
11425 158031 44658 204527 -125434 210515 21909 -63038 79480 -16648 -172061 -4625 -97163
11414 -97163 -166480 -312867 96330 -183070 -171441 30230 -3310 184324 62382 203242 29753
11402 24840 467288 135697 104808 -114806 10839 262688 16127 -117628 -52806 -66948 8531
11390 449118 189048 -112247 -243132 -126476 -60393 84028 -7938 -75221 30123 -151822 -160597
11379 -160597 12119 -96731 31934 122136 246362 -216670 -35518 153339 -41051 161419 -32965
11367 70993 86688 -343458 -75698 433781 -102456 56370 10915 -245628 221300 -285062
11356 54415 -126258 36578 -316208 90764 74475 175835 -39239 -4413 -7866 -164799 68255
11344a16894q0145e7687m8700k7119e4969j25606A38002b0554A04098b66197h8730
11332B47405c92934E1238a43833l59143b06199A07959b37078j7048A48246b73573
11321d8873C20681e4315R734j06345F333i8492B4505c90986A33760a21077j70249
11310b91326A38490b23798j8366J0940A13466d8473A48332h184G0007M3173r93
11299A12187a888n3170k4056F453e48065A21811f8063D8985J5597b0044j99310
11288b19354F3698F537K69943A09228m4379L7676J80196d0981k04892G2169J35530
11277B07699n3752b88837a12242B88782E4297a77377g0394k12902I534a35450
11266G8453i0701A11762c39424e6076q655a1630A12139D3521a69401A52806a24969
$$ plain form
11344 -116894 -197039 -57687 -106387 -133506 -54969 -180575 138002 -20554 104098 -266197 -88730
11332 247405 -392934 51238 -143833 -502976 -206199 107959 -237078 -254126 148246 -273573
11321 -48873 320681 -54315 -44581 -150926 6333 -98492 24505 -390986 133760 -121077 -291326
11310 -291326 138490 -223798 -242164 -231224 113466 -48473 148332 -8184 70007 113180 112187
11299 112187 -1888 -55058 -79114 6453 -548065 121811 -68063 48985 64582 -20044 -219354
11288 -219354 63698 6537 276480 109228 64849 102525 282721 -40981 -245873 72169 207699
11277 207699 153947 -288837 -112242 288782 54297 -177377 -70394 -283296 9534 -135450
11266 78453 -90701 111762 -339424 -56076 -64731 -11630 112139 43521 -169401 152806 -124969
11254H499B349b54389J15980A36209J64430a64470C037a79463A62713a3903m41698
11243d55601G9770L3852b37338N0879E5480a92761j26027B9623a64897O5151L4662
11232f5084N936G9408d3386k66746Q6354m2118m2101L3114f1993j48901E8333
11220b65709B05581d4567H9279i7309A04201a77974d884r2314l0040q683A07624
11208d4791p3726j9711j08035F7697A3586a03077l33540A30477m0756b76682e0611
11196g0590E9685a65411N455L8616b5120B23294a60481A12442C5262b8730l4355
11185f3085a4009j72122D094j978a77114H9238P3292a81073g5222H3417d4594
11173g7625A19198a46290A28328i4373A69706C466P4209Q0838a12991A13216j5139
$$ plain form
11254 8499 2349 -254389 -138409 136209 300639 -164470 3037 -179463 162713 -13903 -455601
11243 -455601 79770 113622 -237338 -186459 55480 -192761 -318788 29623 -164897 -99746 -65084
11232 -65084 -59148 79408 -43386 -310132 -223778 -265896 -307997 -274883 -61993 -210894 58333
11220 -265709 205581 -44567 89279 -97309 104201 -177974 -4884 -97198 -127238 -135921 107624
11208 -44791 -118517 -138228 -246263 67697 13586 -103077 -436617 130477 89721 -276682 -50611
11196 -70590 59685 -165411 -159956 -121340 -25120 223294 -160481 112442 35262 -28730 -63085
11185 -63085 -14009 -186131 4094 2116 -177114 89238 162530 -181073 -75222 83417 -44594
11173 -77625 119198 -146290 128328 -94373 169706 3466 77675 158513 -112991 113216 98077
11162I8077b14536A9007b31909K3720b0971k8006F7603a94400O4780k86131A42111
11150a14231c2127B6277L45786b65653D1777c352I4997J71936C3721Q2931a03484
11138b94988M5813B19896b86135L3453e8877A89551i689H1490B2577K01111h4638
11126C86875A59272b46907A1131b10384G9914c58214a16589D4823a62617A27276
11115A5848g3606H8581a4960C21462h4351H8485K753b15338J6182B34191a87318
11103A34135k7563j578a14147A07785f5332A60085b00356A18721k8311e9744A05091
11091b7294B5100c185B93267A30525K46113n6044A36107J22380B944L75140A21813
11079A17090L8996O1748P9819q9909M3321J57042j51645M483r6919k0215L4656
$$ plain form
11162 98077 -214536 19007 -231909 -208189 -20971 -48977 67603 -194400 -129620 -415751 142111
11150 -114231 -32127 26277 372063 -265653 41777 -3352 94997 266933 33721 116652 -103484
11138 -294988 -249175 219896 -286135 -252682 -58877 189551 -9689 81490 22577 223688 -84638
11126 386875 159272 -246907 11131 -210384 79914 -358214 -116589 44823 -162617 127276
11115 15848 -73606 88581 -14960 321462 -84351 88485 91238 -215338 -199156 234191 -187318
11103 134135 106572 104994 -114147 107785 -65332 160085 -200356 118721 90410 -59744 105091
11091 -27294 25100 -3185 293267 130525 376638 320594 136107 258487 2944 378084 121813
11079 117090 156086 217834 297653 207744 251065 408107 256462 260945 164026 143811 178467
11068A78467K3070K12276j28005J97595j47238q2680L37514n9687K1304J3302
11058E65918A96069J41852j45581L18987A70800K78806p362J27474j56016O04592
11048A018294k12635C77341M28316r2897l7356K72565C29955N03469l28129K36503
11038G41798J6320j24577J04544J50118k95917J55203p5290N7093J7129j37072
11028F09349L44126l10204L59170j13111j39692P3142k87732N74850E43797L06886
11018H50683j75062J48933r3821j57031J66183l49874J14774j5500J18343j3453
11008E94175K939j30135J95140B81054O39161j98599j15841j19994K83914k52686
10998E17009j16026M15914j61512J10204k57861J43479J4853m1202K15882k36672
$$ plain form
11068 178467 201537 413813 285808 483403 336165 253485 590999 531312 552616 565918
11058 565918 196069 337921 192340 511327 170800 449606 442244 569718 413702 1018294
11048 1018294 805659 377341 805657 712760 675404 947969 329955 833424 505295 741798
11038 741798 758118 633541 738085 888203 592286 747489 672199 729292 746421 609349
11028 609349 953475 643271 1002441 889330 749638 822780 535048 1109898 543797 850683
11018 850683 675621 824554 730733 573702 739885 390011 504785 489285 607628 594175
11008 594175 597114 466979 662119 281054 920215 721616 605775 485781 769695 517009
10998 517009 400983 816897 655385 765589 507728 651207 666060 624858 840740 604068
10988F04068J97100k94103m2738j53779L13074J73490O5569J9057r4695J13874
10978I00917j7457K53975j31567j58790L93134q5117l14500P78111K58982l33781
10968A543907P53004K72659m65022M59506N60067m30970J41143P6830m2500o70168
10958B198456j95515J8885n06561m8833k32143K32109N9728j11748O6465J15087
10948A595930k48625k09195j16337K01086n26970J93187l62214G3324K12928J4588
10938C00840m4166o7060K81705l7848A63124A8521K0364L8167J34159R563b466
10926E7872K22286j06121Q5987B113K51688b0462q758k11813J05204J5470E5269
10914A45131b17257b1828l7882B17318e4669B88812h3119q3554G1395a27505b0254
$$ plain form
10988 604068 801168 507065 464327 310548 623622 797112 862681 881738 787043 900917
10978 900917 883460 1137435 1005868 847078 1240212 1155095 840595 1618706 1877688 1543907
10968 1543907 2296911 2569570 2104548 2564054 3124121 2693151 2834294 2911124 2868624 2198456
10958 2198456 2002941 2021826 1515265 1466432 1234289 1466398 1526126 1414378 1480843 1595930
10948 1595930 1347305 1138110 1021773 1222859 695889 889076 526862 73324 286252 300840
10938 300840 256674 189614 471319 433471 163124 18521 38885 77052 211211 220774 -2466
10926 57872 280158 174037 260024 2113 253801 -20462 -29220 -241033 -135829 -120359 55269
10914 145131 -217257 -21828 -59710 217318 -54669 288812 -83119 -166673 71395 -127505 -20254
10902D1562c90223a75300f0473O67a2744A04895L3413a18586a4117n3874B96440
10890A41825L2012a6537k16547A8316a66330f8322q389A20177a46362o4986A735
10878a27800e8589l1185j33410e220E1440a06498l51655J60749B74246a88085
10867G1333f3966A97310H9444a16258A18677b69404k19973B55144H8239b50521
10856B3311i6411j6150C61794A33365c51525i6843C19318b10384A31149c08714
10845b01874m0939O1103j01929d6934B05100a42101B25914b866B1445Q1664b6733
10833a40027M0683G9673b05640j77653C31668b76786a06500J4111B48405f3008
10822B2104a36579a2272H4592J99406c6574k45866F4154M386j6522K26171a90177
$$ plain form
10902 41562 -390223 -175300 -60473 -59806 -12744 104895 138308 -118586 -14117 -67991 296440
10890 141825 173837 -16537 -233084 18316 -166330 -68322 -76711 120177 -146362 -211348 1735
10878 -127800 -58589 -89774 -223184 -5220 51440 -106498 -458153 -297404 274246 -188085
10867 71333 -63966 197310 89444 -116258 118677 -269404 -489377 255144 88239 -250521
10856 23311 -96411 -112561 361794 133365 -351525 -96843 319318 -210384 131149 -308714
10845 -201874 -242813 -181710 -283639 -46934 205100 -142101 225914 -2866 21445 103109 -26733
10833 -140027 -99344 79673 -205640 -383293 331668 -276786 -106500 -92389 248405 -63008
10822 22104 -136579 -12272 84592 283998 -36574 -282440 64154 68540 52018 278189 -190177
10810b38353A56360r663H871P6731R3114k2795b11913j85842c8759l0645j30929
10799b00333k10245H2935a06715j868p6390A02537d5027A34953e2054k55528C38471
10787b46641A4999a57796B17641a84835A04864a40358N31B9315h7583H9698c65623
10775b35461b3032l22474K9416b3830n9276b1100A88660H6575c11136a30637j30440
10764b61077n134A08556B2246a66988j31548J31318j0535A45509a65705A47302
10753c80542f8124k95682J39972c5264k61147B7670L52942b33721o2788B35117
10742H8791a88900A47119j7828a67518n1375K7542f9840C46681a16840G3429J3113
10731H6542a9317A8228h6755C49731b91669g7801B45945a08740N1218o2805D3718
$$ plain form
10810 -238353 156360 146697 8871 85602 178716 155921 -211913 -397755 -38759 -69404 -200333
10799 -200333 -410578 82935 -106715 -108583 -184973 102537 -45027 134953 -52054 -307582 338471
10787 -246641 14999 -157796 217641 -184835 104864 -140358 -139827 29315 -87583 89698 -365623
10775 -235461 -23032 -345506 -316090 -23830 -83106 -21100 188660 86575 -311136 -130637 -261077
10764 -261077 -266211 108556 22246 -166988 -298536 -167218 -177753 145509 -165705 147302
10753 -380542 -68124 -363806 -223834 -35264 -296411 27670 380612 -233721 -296509 235117
10742 88791 -188900 147119 129291 -167518 -218893 -191351 -69840 346681 -116840 73429 86542
10731 86542 -19317 18228 -86755 349731 -291669 -77801 245945 -108740 -57522 -120327 43718
10719C37203C8770K5489a52081m1004g9843K082k00721i260k67545j59173a21387
10707a8954F4817J28197A3828c76238F5729a44200A79162b39846f5814G2409a77653
10695a10602k546D4725c7398j14440a1255D7242d09595C5489h5175B29348b4780
10683d36960a95342l3814k9243b8017B52014a1814l5935A05692b23879D13c23589
10671b06188d0258E2108a41365c6648a4596A100J57107N7923L7536j5219A01804
10659a64839A20127D8838J24333i9973k35647R7140P7142O908f2399E8725N9006
10648A17731b26799H2433b82045A61687l3118b12204L6458j00240J04048B3636
10637a37514k37453O6793f7468j49270C8666b7188j33176B23491F5350O931K66006
$$ plain form
10719 337203 38770 64259 -152081 -193085 -79843 -77761 -278482 -9260 -276805 -435978 -121387
10707 -18954 64817 193014 13828 -376238 65729 -144200 179162 -239846 -65814 72409 -177653
10695 -110602 -113148 44725 -37398 -151838 -11255 47242 -409595 35489 -85175 229348 -24780
10683 -436960 -195342 -229156 -258399 -28017 252014 -11814 -47749 105692 -223879 413 -323589
10671 -206188 -40258 52108 -141365 -36648 -14596 1100 158207 216130 253666 238447 101804
10659 -164839 120127 48838 173171 -99973 -335620 -238480 -161338 -154430 -62399 58725 117731
10648 117731 -226799 82433 -282045 161687 128569 -212204 -175746 -275986 -171938 23636
10637 -137514 -374967 -308174 -67468 -216738 38666 -27188 -160364 223491 65350 72281 338287
10626C38287j62042F8008h8820d1869J1562l38242A21073M9349H2686A9855J73813
10615A93668n5630c4861A04102a9576j61170q926p2627j94261c5634B6133J8689
10604D4822J7203n743N3462a143k4331J0979A41923B3486c35109Q7432a08045
10592a69897A27694e1303m0759j96421A76042b34849Q0530F1084O9874b66764
10581f000H9068j3731d5664k17000A91555d6807F181l84g6616E7206K32617b99348
10568A64718D3371a1110n8886o4251A48762j5465m1573J89640g7804E0542O2331
10557A12873N4704a09318B90341g6071j28766b9106a804B8429a60150B1923J55009
10546A76932o3320E2422a93240r0942A21990i6499F5125a23714l3103b4561A25716
$$ plain form
10626 338287 176245 68008 -88820 -41869 -30307 -368549 121073 170422 82686 19855 193668
10615 193668 138038 -34861 104102 -19576 -180746 -189672 -262299 -456560 -35634 26133 44822
10604 44822 62025 56282 109744 -1143 -25474 -14495 141923 23486 -335109 -247677 -108045
10592 -169897 127694 -51303 -92062 -288483 176042 -234849 -154319 61084 130958 -266764
10581 -6000 89068 75337 -45664 -262664 191555 -46807 6181 5797 -76616 57206 289823 -299348
10568 164718 43371 -11110 -69996 -134247 148762 133297 91724 281364 -77804 50542 112873
10557 112873 167577 -109318 290341 -76071 -204837 -29106 -1804 28429 -160150 21923 176932
10546 176932 113612 52422 -193240 -284182 121990 -96499 65125 -123714 -156817 -24561 125716
10534E1923c3885k7856J6439k14033C1160K9765a0265k35429P2030j79020M1748
10523c10936a39284K614E1584O8252d5752l9977j3867C4723a57511a678I1232
10511a06981N1930j1084A27214a6085G9606h980j07340Q644H1702b22577R5370
10500a27207d1070A11772M7122a72422G7680J62198A7463a99073b4965l7791p037
10489f9793H1036b11861N5021k03123J34119J09928D2760c4084B55211a75908
10478e1545k4198D091J06829d5274C12432J71420j92410A32944J11410C0798K03808
10467B34606l2907b35610j18128A39987h9851B3129e7064C11628p9978M1288B448
10455i1798l2529C40175l0274A0429L45415c1556l8574k12800q4306E3895A0853
$$ plain form
10534 51923 -33885 -61741 -45302 -259335 31160 60925 -10265 -245694 -173664 -352684 -310936
10523 -310936 -139284 -136670 51584 119836 -45752 -85729 -99596 34723 -157511 -1678 91232
10511 -106981 -55051 -66135 127214 -16085 79606 -8980 -116320 -107676 81702 -222577 -127207
10500 -127207 -41070 111772 158894 -172422 77680 239878 17463 -199073 -24965 -62756 -69793
10489 -69793 81036 -211861 -156840 -359963 -225844 -115916 42760 -34084 255211 -175908
10478 -51545 -75743 4091 110920 -45274 312432 483852 291442 132944 244354 30798 234606
10467 234606 201699 -235610 -353738 139987 -89851 23129 -57064 311628 231650 272938 2448
10455 -91798 -124327 340175 309901 10429 355844 -31556 -70130 -282930 -367236 53895 10853
10443A3772J84922C0058K0771E020K11550a19660B1836d7020A0579N8969B1238
10431A59586d7128I6915B5973M3238P9770a42216j8196O4927b8177F9626P8718
10420A48344J2300b7519A1856a35694N0164k6115b6002j69303g9724c5630i48
10408I6131h0207K8765E4142f1751G4599b82101J27845O049K3352A23432o1212
10397F2220b96899A00531j3657c51708a14964E1306P687a01819D19673a52925
10386A79526H4580J69827j09687a9542B60350r8861l1537d5443B14234g1598j3372
10375h4970E1341K84160J14843A40017o5318N06882E8037J84308A797K29207j07027
10364A23977J08995J26396J1977Q6455A20053L91765B01278K56803r5506b8919
$$ plain form
10443 13772 198694 30058 50829 5020 216570 -119660 21836 -47020 10579 69548 21238
10431 159586 -47128 96915 25973 69211 148981 -142216 -160412 -95485 -28177 69626 148344
10420 148344 160644 -27519 11856 -135694 -85530 -111645 -26002 -195305 -79724 -35630 -948
10408 96131 -80207 -51442 54142 -61751 74599 -282101 -154256 -148207 -124855 123432 62220
10397 62220 -296899 100531 86874 -351708 -114964 51306 58993 -101819 419673 -152925
10386 179526 84580 254407 144720 -19542 260350 161489 129952 -45443 214234 -71598 -84970
10375 -84970 51341 335501 450344 140017 74699 581581 58037 242345 1797 231004 123977
10364 123977 232972 359368 371345 457800 120053 511818 201278 458081 362575 -28919
10353a15708A17398K64067A05987f5277a0336B16939K6054L67423j97984A74902
10342B45030K8289K77193A98340L02428r8556a0430C27005A43727a54324A06482
10331E31792A55022N1184H9173P2476e6999l00572b642B44122G07J58349d5767
10319B4467G354d1641B97212p7759n4553K03110j42736I6840m0104d9445A37209
10307A62594a60402e2412j71353K5387F7442b82914J22018b5705j70868A23650
10296b85752j3011N3027r3375B7214c24559i2309j9065c5046p2550m9158J1398
10285a45356J7996L171q9634a05319k58723I5476a90531d4874B74274h966k57284
10274b66250J02166E4082P0047b32691K8893i680m75161K35682A66959a7007j09887
$$ plain form
10353 -115708 117398 381465 105987 -65277 -10336 216939 242993 610416 412432 174902
10342 245030 273319 550512 198340 500768 402212 -10430 327005 143727 -154324 106482
10331 531792 155022 206206 89173 161649 -56999 -357571 -2642 244122 707 159056 -45767
10319 24467 7354 -41641 297212 219453 164900 368010 225274 96840 56736 -49445 137209
10307 162594 -160402 -52412 -223765 -198378 67442 -282914 -160896 -25705 -196573 123650
10296 -285752 -298763 -245736 -339111 27214 -324559 -92309 -111374 -35046 -107596 -156754 -145356
10285 -145356 -127360 -124189 -213823 -105319 -364042 95476 -190531 -44874 274274 -8966 -266250
10274 -266250 -164084 54082 124129 -232691 -203798 -9680 -484841 -249159 166959 -17007 -126894
10263a26894j30093i5436p6233A82224d224l4100B55633h096j1435m901H3197
10251E2470J78566R804J12444l1737m3767G9303C2441J67033J13310D7275R2495
10240A39770j0509m1366k9157c96844h8856A62728h0745D57330k16029a48229
10229a03142B45862n1105h5388F8797O7319A6788J16195b74954A30720O4858f9552
10217f4899b0019A1960R4537J98424G0780J06063g166E7598b65984e2360B46027
10205a84264k69593A2010R1826b95789a17286j16619k23527J69660J26678A340
10194a84344H7120K8764a37247D9968d2380B21324J6207E5002b51074g2434k03037
10183b75471j67606a33402A51426B8469a86083A63097d7052l8282K5223j09851
$$ plain form
10263 -126894 -256987 -95436 -171669 182224 -4224 -38324 255633 -8096 -19531 -24432 83197
10251 52470 231036 240840 353284 321547 277780 79303 32441 199474 312784 47275 139770
10240 139770 129261 87895 58738 -396844 -88856 162728 -80745 457330 241301 -148229
10229 -103142 245862 194757 -85388 68797 136116 16788 132983 -274954 130720 195578 -69552
10217 -64899 -20019 11960 106497 304921 70780 176843 -7166 57598 -265984 -52360 246027
10205 -184264 -453857 12010 103836 -295789 -117286 -233905 -457432 -287772 -161094 1340
10194 -184344 87120 115884 -137247 49968 -42380 221324 237531 55002 -251074 -72434 -275471
10183 -275471 -443077 -133402 151426 28469 -186083 163097 -47052 -85334 -60111 -169962
10173a69962I984K92765g3829j05100M1975A28636b6262m11309i96j13748m7611
10162a62355f7954K7532D6152f1354n1673k27309B18173j6078a40764M0658p8205
10151a78311N0793a6357A39142a988j08699c7236j9821j68840G803J00563d6733
10139B9735N7408b22870A10867f5071k18473a01317D2110N0350a30449L7446a5604
10127b54476A85747q8056b20565e5926j11079N682A71452G4259J18776F1837a22566
10115b29269B8898f6970C1138c24764i1726M3869o8167M1137k03442a37405B7072
10103a054A12741b06813P004p4710L9203b6691j23026A8653R8117C9720K48284
10092B88004b79196J25689O4787L8125f160I1416h5509A5138b96637J04571a6714
$$ plain form
10173 -169962 9984 302749 -73829 -178929 -136954 128636 -26262 -437571 -996 -114744 -162355
10162 -162355 -67954 -40422 46152 -61354 -113027 -340336 218173 202095 -140764 -100106 -178311
10151 -178311 -127518 -16357 139142 -1988 -110687 -37236 -57057 -225897 7803 108366 -46733
10139 29735 87143 -222870 110867 -65071 -283544 -101317 42110 92460 -130449 -93003 -15604
10127 -254476 185747 97691 -220565 -55926 -167005 -161323 171452 74259 193035 61837 -122566
10115 -229269 28898 -66970 31138 -324764 -91726 -47857 -116024 -74887 -278329 -137405 27072
10103 -1054 112741 -206813 -199809 -274519 -235316 -26691 -149717 18653 116770 39720 288004
10092 288004 -279196 -153507 -88720 -50595 -6160 91416 -85509 15138 -296637 -192066 -16714
10080a27723f2578A2918a81708k4488D3039f3883m8094B10410b36006l4658b1847
10068b80637G5594L7915E1152a76983B20339c91732F6116e5331A02536m0182a02028
10056c4227m8384c4495j73043q3068G0989M2915a49699p4594c0318D7010b5629
10044B32834f6182C9133A453a70573k9740P8115K9150j77236n3457a47634c3071
10032b53760e0941h677A28499j1163h0460j66112O8169A1429J82208E9503a53108
10020f0497j60361J07197k1738L9468A38042c72932C6792N7937a65271a7164j04324
10009a21488L1843j66666o2963I6419Q2160c6517E1797a07486p8491N1868k1308
9998a55417F2540d4846k24580F9183a67702R268l4281a4496j1387k16767j89041
$$ plain form
10080 -127723 -62578 12918 -181708 -206196 43039 -63883 -111977 210410 -236006 -270664 -21847
10068 -280637 75594 113509 51152 -176983 220339 -391732 66116 -55331 102536 62354 -102028
10056 -34227 -82611 -34495 -207538 -290606 70989 113904 -149699 -224293 -30318 47010 -25629
10044 232834 -66182 39133 1453 -170573 -200313 -122198 -93048 -270284 -323741 -147634 -33071
10032 -253760 -50941 -8677 128499 117336 -80460 -246572 -178403 11429 193637 59503 -153108
10020 -60497 -220858 -113661 -135399 -95931 138042 -372932 36792 94729 -165271 -17164 -121488
10009 -121488 -89645 -256311 -319274 96419 178579 -36517 51797 -107486 -185977 -134109 -155417
9998 -155417 62540 -44846 -269426 69183 -167702 -158434 -192715 -14496 -25883 -242650 -431691
9987d31691a48948j37964Q3111L9731m8058h1932n4176r8919A59800A537J52119
9976A53656J3666b78867A6831b05370A21356d49866c8758j47719B73900l4721
9966B39179A3015c13346D1531A1501J56430c81457f3768A54510b9373q737m1106
9955g9216j64165C9949A6912e7392l1303d0518m4351B07363c67303a28359C451
9943G0665d1569e946B2746a00544b7932G5087J17310a62547N2460B49032b513
9931h5832j71827a17293k5381B70981a4045B12202P836J13839d7249a5014j18530
9920a33544K0455k56734i2483C626c53253A24964J36291b21633L1069A39439h6704
9908g4529r0958E156N3326i1264I2398e2266l49806A35073J09380F0740J50268
$$ plain form
9987 -431691 -148948 -286912 -203801 -164070 -212128 -81932 -136108 -235027 159800 1537 153656
9976 153656 167322 -278867 16831 -205370 121356 -449866 -38758 -186477 273900 239179
9966 239179 13015 -313346 41531 11501 167931 -381457 -63768 154510 -29373 -38110 -79216
9955 -79216 -243381 39949 16912 -57392 -88695 -40518 -84869 207363 -367303 -128359 3451
9943 70665 -41569 -5946 22746 -100544 -27932 75087 192397 -162547 -110087 249032 -2513
9931 -85832 -257659 -117293 -142674 270981 -14045 212202 220038 333877 -47249 -15014 -133544
9920 -133544 -113089 -369823 -92483 3626 -353253 124964 261255 -221633 -190564 139439 -86704
9908 -74529 -165487 5156 58482 -91264 92398 -52266 -402072 135073 244453 60740 211008
9897B11008K8739f3386k23035K4708Q5128Q6842k44605Q6479A7479c16357a4492
9885G4730b8935q5108M6058B52755a95171d4555k59800C52449a48489E2734a19038
9873i7396B4824a21088K1206B32627c36563a45801k10090J16627N0116l9340j72693
9862d01181a33137f6507k25226b8351j4252j11219p5461o4607J22289B05348a12062
9850d2782C6766a1276l2315k79810e7615B2349M7926L0275a49169e6544p3270
9839a29814A53345a02908j35046h2106l25559a56934A29276P170J65191a38046
9828h1283J2634J4123b1729j21562j7283B9759a34754o4289m7258A32762a7409
9816a68154j95069J68796A95484c10367O5510O1240l9851F0504d7916k51954A90877
$$ plain form
9897 211008 239747 -63386 -286421 -261713 -176585 -89743 -334348 -247869 17479 -316357 -14492
9885 74730 -28935 -114043 -67985 252755 -195171 -44555 -304355 352449 -148489 52734 -119038
9873 -97396 24824 -121088 -99882 232627 -336563 -145801 -355891 -239264 -189148 -228488 -401181
9862 -401181 -133137 -66507 -291733 -28351 -42603 -153822 -229283 -293890 -171601 205348 -112062
9850 -42782 36766 -11276 -43591 -323401 -57615 22349 70275 100550 -149169 -56544 -129814
9839 -129814 153345 -102908 -237954 -82106 -407665 -156934 129276 136446 301637 -138046
9828 -81283 -68649 -54526 -21729 -143291 -160574 29759 -134754 -199043 -246301 132762 -17409
9816 -168154 -363223 -194427 195484 -310367 -244857 -183617 -223468 60504 -47916 -299870 190877
9804A2700n303J30267c0598l50760A85995a84551H7956C0636b29555K6699A33477
9792a24660j8840F1203O5718C0828J35826c8246B1506i86m7443j00402D9582b16324
9779E8749a30859A07408a89242A11789K4987i5050I6477M5044P3679c43626a30018
9767a36482j40467C05385H6075b47290j1620a26567A92441b04136h3652j236a0288
9755B22964k0205e2150A98446a64857Q0442B1670D363b2838E9271a28083c8068
9743A2454b64155g5319B82d0135l81233K03357A17223p665a17903A54520I213
9731a01582k3799B89728b60699b6328F2046a48117a3500k44560A31530g3506A62970
9719A03228c8535j5069p7238j11990D5270i6037C49254f3644G0655H972N957K01733
$$ plain form
9804 12700 7397 137664 -30598 -381358 185995 -184551 87956 30636 -229555 -202856 133477
9792 -124660 -143500 61203 126921 30828 166654 -38246 21506 -986 -48429 -148831 49582 -216324
9779 58749 -130859 107408 -189242 111789 136776 -95050 96477 141521 215200 -343626 -130018
9767 -136482 -276949 305385 86075 -247290 -258910 -126567 192441 -204136 -83652 -84888 -10288
9755 222964 202759 -52150 198446 -164857 -84415 21670 4363 -22838 59271 -128083 -38068
9743 12454 -264155 -75319 282 -40135 -421368 -218011 117223 109558 -117903 154520 9213
9731 -101582 -125381 289728 -260699 -26328 62046 -148117 -13500 -258060 131530 -73506 162970
9719 103228 -38535 -53604 -130842 -242832 45270 -96037 349254 -63644 70655 8972 14929 216662
9707B16662P928D8748a49901O8981c6923j0971l1307j896k53682F8503c43440
9695B3816a84761E4857J49922c05189a23981d448l30464a08259b791k92447A68441
9683A5565J33426g8321L0960J4428j14083B54862g7767o5729j59740B46687a61743
9671A90558a09037o7294B06626c4830n27896e1522A19320e2639k59036A60254
9660a36749p3509H6895b09198R4770k68410J69043H7147b85389F2147c52342B02646
9648a07444B7290b29817E8811b15305K9614G6465a14567K5223K9448B42087a12325
9636f3520k0170B3460J78935a16477A0650K15503a83394c0932k88765I7738a54463
9624A41423n6517C5345a91367C3807J81648a16942M0756l16935f2204A01513b61518
$$ plain form
9707 216662 224590 48748 -149901 -80920 -36923 -47894 -79201 -81097 -334779 68503 -343440
9695 23816 -184761 54857 204779 -305189 -123981 -4448 -334912 -108259 -2791 -295238 168441
9683 15565 148991 -78321 -47361 -32933 -147016 254862 -77767 -143496 -303236 246687 -161743
9671 190558 -109037 -176331 206626 -34830 -562726 -51522 119320 -52639 -311675 160254
9660 -136749 -210258 86895 -209198 -114428 -382838 -213795 87147 -285389 62147 -352342 202646
9648 -107444 27290 -229817 58811 -215305 -185691 76465 -114567 -89344 -59896 242087 -112325
9636 -63520 -83690 23460 202395 -116477 10650 226153 -183394 -30932 -319697 97738 -154463
9624 141423 84906 35345 -191367 33807 215455 -116942 -76186 -393121 -62204 101513 -261518
9612h8132j05304f6030B7820b58327j79879A14368a80949j04103a02467E7150
9601b62146J00446L8274j5178b3265A3509b23325P7749F1646J19140a76689Q0195
9590i6494A09902a32732C05075D8488b27505a13372a1363H8902a9681j40893I3067
9578c59193I6279a58371f4366B11660a71456e0659m33763D3120J17453a92868
9567B11297b38891A24757E1131b10068K9640A37052a8381A35688b2130j42299
9557a64429E7880f6387K1019j46205B60829A08434J56962b01016I8309P8819a40920
9545a13954m9781k531A3083a95830B09230K2847B8228a47825m2579Q459M6488
9534a35457L5630j81870J17298b4667A22675e4880k26523J12352n343a2176H5236
$$ plain form
9612 -88132 -193436 -66030 27820 -258327 -438206 114368 -180949 -285052 -102467 57150
9601 -262146 -161700 -123426 -138604 -23265 13509 -223325 -145576 61646 180786 -176689 -96494
9590 -96494 109902 -132732 305075 48488 -227505 -113372 -11363 88902 -19681 -160574 93067
9578 -359193 96279 -158371 -64366 211660 -171456 -50659 -484422 43120 160573 -192868
9567 211297 -238891 124757 51131 -210068 -180428 137052 -18381 135688 -22130 -164429
9557 -164429 57880 -66387 -45368 -191573 260829 108434 265396 -201016 98309 177128 -140920
9545 -113954 -163735 -166266 13083 -195830 209230 232077 28228 -147825 -190404 -181945 -135457
9534 -135457 -99827 -281697 -164399 -24667 122675 -54880 -281403 -169051 -174394 -12176 85236
9522f2427k3334k4008I3841A6297J35848i7234k35615J59124A0197b4616j05638
9511a30254A01738c72672H8820b88947e9512j65907i491l00371a02889B11968
9500b30856f7124j17984N2147H67M3053J1458b57268j0377J15125g251B8040c7931
9487b36267C3003J86122e753l00807g8060A4431a76213P5624j02914c3366E5898
9475b39364a01454A16719c06081a01506d8116n1266k87273d3661j00200N3380
9465i0481p1577A02927g1892k9426r6274A36429a25706d5566q5294G9032J00436
9454A79468H640e6031K1427j68336d2040C2141a27798B51438B8457J72423b2889
9442a04428D8419a63716E25514C3240a84171G3263d9396A88955a11540G970J28935
$$ plain form
9522 -62427 -85761 -109769 93841 16297 152145 -97234 -332849 -173725 10197 -24616 -130254
9511 -130254 101738 -372672 88820 -288947 -59512 -225419 -9491 -309862 -102889 211968
9500 -230856 -67124 -185108 -132961 867 43920 55378 -257268 -267645 -152520 -7251 28040 -37931
9487 -236267 33003 219125 -5753 -306560 -78060 14431 -176213 -100589 -203503 -33366 55898
9475 -239364 -101454 116719 -306081 -101506 -48116 -99382 -386655 -43661 -143861 -90481
9465 -90481 -162058 102927 -71892 -101318 -197592 136429 -125706 -45566 -130860 79032 179468
9454 179468 8640 -56031 -34604 -202940 -42040 32141 -127798 251438 28457 200880 -22889
9442 -104428 48419 -163716 525514 33240 -184171 73263 -49396 188955 -111540 7970 136905
9431A36905N9222f7610D3590O6591b79932F6923a70071q3983A16759f1773k6746
9420h8519j67196i9741K3021C76877j53034b05444F8316i046A39733l665d7525
9408a10516E038J56593i4427o4558N9155A48434b06420b9052j91415A50538n3173
9397I7365m4223a60770j95741a1854k49973J4302J2636A0488a16526k47518J66639
9386a97405j19905A96981e106D5370j5839a43839m093b6734k48480G4166K6551
9375A00717A1010a30156A09991g5477E1387a2124j75466h620r3012Q549l09864
9364d02947J54113A60907H96i9211o6122I7735a81467K9620q9984a13672e1753
9352B5266d30425i0940b2876j49147A33463a03452q1774M2866l6968l8621E0146
$$ plain form
9431 136905 196127 -67610 43590 110181 -279932 66923 -170071 -254054 116759 -61773 -88519
9420 -88519 -255715 -99741 -76720 376877 223843 -205444 68316 -9046 139733 136068 -47525
9408 -110516 5038 161631 -94427 -158985 -99830 148434 -206420 -29052 -220467 150538 97365
9397 97365 53142 -160770 -356511 -11854 -261827 -247525 -234889 10488 -116526 -364044 -197405
9386 -197405 -317310 196981 -5106 45370 29531 -143839 -147932 -26734 -275214 74166 100717
9375 100717 11010 -130156 109991 -75477 51387 -12124 -187590 -8620 -101632 -93083 -402947
9364 -402947 -248834 160907 896 -99211 -165333 97735 -181467 -151847 -241831 -113672 -51753
9352 25266 -430425 -90940 -22876 -172023 133463 -103452 -185226 -142360 -179328 -217949 50146
9340c5586k10300B43281d31984f2778A36376b32425P6890j48405A6343J36215
9330A52558c45325a3577A47060h1545l21999J69401b2855L996j02757r00A61346
9318c11808A5272L4789A7857e75016b2408k66928C13592a03007j5139A02716a84672
9306A7176a90808B08958a52505k74728A12647C7883f248A48030b81713i9599k15828
9295c15427P4971M7357F0516a51048J189n0502G4089a7574p0821R003A84023g1748
9282c45003C966J48939b50789K8695C5135A6308a72269g4916m90j65347A5912
9270F3591b3420j03833A67288a2498A36723E0898f1707l45777h5696H9373Q6069
9259A75442e2662A70406B0886J14556d1602m8091j082G7014A3969a6047q2867
$$ plain form
9340 -35586 -245886 243281 -431984 -62778 136376 -232425 -155535 -303940 16343 152558
9330 152558 -345325 -13577 147060 -81545 -403544 -234143 -22855 -18859 -121616 -122516 161346
9318 -311808 15272 50061 17857 -575016 -22408 -289336 313592 -103007 -118146 102716 -184672
9306 17176 -190808 208958 -152505 -427233 112647 37883 -6248 148030 -281713 -99599 -315427
9295 -315427 -240456 -193099 60516 -151048 -149859 -200361 74089 -17574 -88395 -79392 184023 -71748
9282 -345003 3966 152905 -250789 -222094 35135 16308 -172269 -74916 -75406 -240753 15912
9270 63591 -23420 -127253 167288 -12498 136723 50898 -61707 -407484 -85696 89373 175442
9259 175442 -52662 170406 20886 135442 -41602 -89693 -90775 77014 13969 -16047 -98914
9248i8914B56530f2823L183p0595k74240G149R6971d12304J90062F8726a35368
9236B33716b19283C80335b9283H4738c1357m1619K3283a1333k35012a13284n5624
9225a68908D2920f8277j3248j13584A88214b33907K8818k05502J60103B79327
9214A25716M995J6362F0164a04982F7881h7465A90463c11724h3727j32488p066
9203b23281f3928k29589A15110b606B27736r4127b42602Q350a549B20020a2623
9191D8256d1216l5071l5277A06690f684D0299c40047A90498h2545j11385P5554
9180a18376C0736a51929J2938A11244k3515l451C7340b20511B36151R858b05396
9168A04103c94992a81202P9045A4395J79228I6762b49833A81443F1085b59483
$$ plain form
9248 -98914 256530 -62823 -59640 -130235 -404475 7149 104120 -412304 -222242 68726 -135368
9236 233716 -219283 380335 -29283 84738 -31357 -72976 -49693 -11333 -246345 -113284 -168908
9225 -168908 42920 -68277 -81525 -195109 188214 -233907 -205089 -410591 -250488 279327
9214 125716 130711 147073 60164 -104982 67881 -87465 190463 -311724 -83727 -216215 -223281
9203 -223281 -63928 -293517 115110 -2606 227736 133609 -242602 -234252 -1549 220020 -12623
9191 48256 -41216 -76287 -111564 106690 -6684 40299 -340047 190498 -82545 -193930 -118376
9180 -118376 30736 -151929 -138991 111244 87729 84278 37340 -220511 236151 246009 -205396
9168 104103 -394992 -181202 -102157 14395 193623 96762 -249833 181443 61085 -259483
9157A54290b19246a2037H044a7432l02299E0263a22480f0257A56160b71990j54037
9146d26027i6932c0879l55242a39776j82925R9972L4420C5988d882j07015c0177
9134I2545a581k36772b0511r5378d6450A45353J37005C5230h805B89417a28880
9122a4967c202f70n9587j98911r2827J51843G992a78936M8952l6892q0732A91355
9109b6513B0074J09140B6793a26289K6688r904j17202p5158d363H0475H71b83462
9096b03271A43985a27298c1231A23453a4526B264d0667A56362P1871K8060c87450
9084e3660E4971b86324i8169a5957D1405L2832c64041J44488i9094c7694k15512
9073b53206F9304R518h3430j5101k83844B21670c07623a18722r9664A64691j551
$$ plain form
9157 154290 -219246 -12037 8044 -17432 -319731 50263 -122480 -60257 156160 -271990 -426027
9146 -426027 -96932 -30879 -386121 -139776 -322701 -222729 -188309 35988 -4882 -111897 -30177
9134 92545 -1581 -238353 -20511 -115889 -46450 145353 282358 35230 -8805 289417 -128880
9122 -14967 -3202 -670 -60257 -259168 -351995 -200152 7992 -178936 -129984 -166876 -247608 191355
9109 -26513 20074 129214 26793 -126289 -99601 -109505 -226707 -301865 -4363 80475 871 -283462
9096 -203271 143985 -127298 -31231 123453 -14526 2264 -40667 156362 228233 256293 -387450
9084 -53660 54971 -286324 -98169 -15957 41405 74237 -364041 -219553 -99094 -37694 -253206
9073 -253206 69304 78822 -83430 -98531 -382375 221670 -307623 -118722 -218386 164691 163140
9062A63140a43228B0878R4493b79354B3500C584d29357I946h5772K2685q0098
9051a43185C0970K2412A2532f4235K4155R31A09504B4649K29587K4436b17311
9039a34056j72454A09821h8538j03104A16329a22259k10682d2630q222D4046a97977
9027a11361b4257B40827F0690c9128k22903f4008k35819I532J10822a81929K0373
9016a61556d6321k0295j04025P3255l78102B13324g7409A16311A1305M9459d3101
9004C4113b69874G1368b92794H1997J0438A4278M130J99525H4208e757o8660l23847
8992c98264I5387a06882H8815J95403j41073f9281j2460B11020I891a1269H2903
8980F2989J17638A1471b74587g6273k7380d7026j3217F8863c53129E6582c82767
$$ plain form
9062 163140 -143228 20878 115371 -279354 23500 3584 -429357 9946 -85772 -63087 -143185
9051 -143185 30970 53382 12532 -64235 -40080 -39149 109504 24649 254236 278672 -217311
9039 -134056 -306510 109821 -88538 -191642 116329 -122259 -332941 -42630 -50852 44046 -197977
9027 -111361 -24257 240827 60690 -39128 -262031 -64008 -299827 9532 120354 -181929 -161556
9016 -161556 -46321 -66616 -170641 -97386 -475488 213324 -77409 116311 11305 60764 -43101
9004 34113 -269874 71368 -292794 81997 92435 14278 18408 217933 84208 -5757 -74417 -398264
8992 -398264 95387 -106882 88815 284218 143145 -69281 -81741 211020 9891 -11269 82903
8980 62989 180627 11471 -274587 -76273 -103653 -47026 -60243 68863 -353129 56582 -382767
8968E1792a46606P2536l2974J4573B2572J75388G820J33316a06212k6498B18780
8956A09688K7966K6539a33455A02550D9489b59661A61603o9472a28409C67789
8945b2833r3457k21571a36663A61138G1705a2399A81015i744B9036a51568E5017
8933i3244D3132f3110B3182b85094A49111J17601A12743C7751a79162G2663b39978
8921b30183H143J82143D4960Q4604L22935k04642A22698D2390c29128F2568e6480
8909F4254a30592G8830l2304a25929B20412D3397b06244r9181c2005l22009A07718
8897a64514f682j64669A01037g3239j94647B93495N516a6214o3528k27684B0423
8885E0858h7468E443Q1044b60400J0397A91539B3050h6875k67804e0971n79k21492
$$ plain form
8968 51792 -146606 -74070 -107044 -92471 22572 197960 7820 141136 -106212 -132710 218780
8956 109688 137654 164193 -133455 102550 49489 -259661 161603 92131 -128409 367789
8945 -22833 -116290 -337861 -136663 161138 71705 -12399 181015 -9744 29036 -151568 55017
8933 -93244 43132 -63110 23182 -285094 149111 266712 112743 37751 -179162 72663 -239978
8921 -230183 8143 190286 44960 129564 452499 247857 122698 42390 -329128 62568 -56480
8909 64254 -130592 78830 46526 -125929 220412 43397 -206244 -305425 -32005 -354014 107718
8897 -164514 -6682 -171351 101037 -73239 -267886 293495 299011 -16214 -79742 -307426 20423
8885 50858 -87468 5443 86487 -260400 -250003 191539 23050 -86875 -354679 -50971 -51550 -273042
8873b73042H4269O6926a52848N0291o0454F5362c10431q3738a53481j43548c1642
8861B10019a84663Q4931A08565a63472B02889e9268A90847c12728J36684I7178
8850f3432p4917j1482j8906k36372c0604C32932e5720k4747L6146k23855q0047
8839c48223o1684K00821E3903c7114j1841j18110a2281k13738M8323j38185B78694
$$ plain form
8873 -273042 84269 151195 -152848 -102557 -163011 65362 -310431 -394169 -153481 -297029 -31642
8861 210019 -184663 -99732 108565 -163472 202889 -59268 190847 -312728 -176044 97178
8850 -63432 -138349 -149831 -168737 -405109 -30604 332932 -55720 -80467 -44321 -268176 -348223
8839 -348223 -409907 -209086 53903 -37114 -48955 -167065 -12281 -226019 -177696 -315881 278694
$$ [...]
##END NTUPLES=NMR SPECTRUM
##END=
