##TITLE=NES1022_BrazilUW_9265944_LWrop1z5D7
##JCAMPDX= 6.0         $$ Bruker NMR JCAMP-DX V2.0
##DATA TYPE= NMR SPECTRUM
##DATA CLASS= NTUPLES
##ORIGIN= BRUKER
##OWNER= Administrator
$$ 1.72 TOPSPIN		Version 2.1
$$ 2015-07-11 16:27:43.285 -0700  Administrator@X
$$ Compression mode = diff/dup
##.OBSERVE FREQUENCY= 400.02188249412
##.OBSERVE NUCLEUS= ^1H
##.ACQUISITION MODE= SIMULTANEOUS (DQD)
##.ACQUISITION SCHEME= undefined
##.AVERAGES= 64
##.DIGITISER RES= 22
##SPECTROMETER/DATA SYSTEM= spect
##.PULSE SEQUENCE= noesygpps1d.comp
##.SOLVENT NAME= COFFEE_meoh
##.SHIFT REFERENCE= INTERNAL, COFFEE_meoh, 1, 14.96354
##AUDIT TRAIL= $$ (NUMBER, WHEN, WHO, WHERE, PROCESS, VERSION, WHAT)
$$ ##TITLE= Audit trail, TOPSPIN		Version 2.1
$$ ##JCAMPDX= 5.01
$$ ##ORIGIN= Bruker BioSpin GmbH
$$ ##OWNER= Administrator
$$ $$ E:\/data/COFFEE/nmr/NES1022_BrazilUW_9265944_LWrop1z5D7/22/pdata/1/auditp.txt
$$ ##AUDIT TRAIL=  $$ (NUMBER, WHEN, WHO, WHERE, PROCESS, VERSION, WHAT)
(   1,<2015-07-11 16:27:35.691 -0700>,<Administrator>,<X>,<go>,<TOPSPIN 2.1>,
      <created by zg
	started at 2015-07-11 16:16:06.191 -0700,
	POWCHK enabled, PULCHK disabled,
       configuration hash MD5:
       21 0F 79 D6 B3 7B B4 F6 88 20 88 DB 03 48 BD 9F
       data hash MD5: 64K
       A5 5C 67 2F B5 B4 9D 12 91 72 B6 39 22 3D B3 42>)
(   2,<2015-07-11 16:27:39.394 -0700>,<Administrator>,<X>,<proc1d>,<TOPSPIN 2.1>,
      <Start of raw data processing
       efp LB = 0.3 FT_mod = 6 PKNL = 1 PHC0 = 0 PHC1 = 0 SI = 128K 
       data hash MD5: 128K
       EC 9A 9B 03 2D 4A EF 03 74 6B 58 A3 F3 18 36 C2>)
(   3,<2015-07-11 16:27:40.519 -0700>,<Administrator>,<X>,<proc1d>,<TOPSPIN 2.1>,
      <pk PHC0 = -83.21594 PHC1 = 0 
       data hash MD5: 128K
       FA CC 8B 9E 13 11 E5 EE 0A 81 B4 4B E3 6C 96 1E>)
(   4,<2015-07-11 16:27:41.503 -0700>,<Administrator>,<X>,<proc1d>,<TOPSPIN 2.1>,
      <abs ABSG = 1 
       data hash MD5: 128K
       EB CD 8C 83 3C CB AA 75 94 27 72 C0 D4 4F EB E6>)
(   5,<2015-07-11 16:27:41.925 -0700>,<Administrator>,<X>,<proc1d>,<TOPSPIN 2.1>,
      <abs ABSG = 2 
       data hash MD5: 128K
       EA 69 9C 61 32 D9 15 B8 94 8A 7F D9 F2 F9 29 69>)
(   6,<2015-07-11 16:27:42.019 -0700>,<Administrator>,<X>,<proc1d>,<TOPSPIN 2.1>,
      <abs ABSG = 3 
       data hash MD5: 128K
       57 E2 69 68 91 81 28 37 0D DD 77 B1 DB 6A C4 02>)
(   7,<2015-07-11 16:27:42.363 -0700>,<Administrator>,<X>,<proc1d>,<TOPSPIN 2.1>,
      <abs ABSG = 4 
       data hash MD5: 128K
       AA 51 AC 87 26 15 71 FA 71 FD D0 DD E5 F3 FB 6A>)
(   8,<2015-07-11 16:27:42.472 -0700>,<Administrator>,<X>,<proc1d>,<TOPSPIN 2.1>,
      <abs ABSG = 5 
       data hash MD5: 128K
       03 9B A2 19 D1 62 18 F0 12 70 4E 53 DD 4D 45 C0>)
$$ ##END=
$$ 
$$ $$ hash MD5
$$ $$ 21 4D 06 2D 4E E1 C5 C8 F9 DF 92 90 9E B1 8F 03
##$RELAX= 
##$RELAX= 
##$RELAX= 
##$RELAX= 
##$RELAX= 
##$RELAX= 
##$RELAX= 
##$RELAX= 
$$ Bruker specific parameters
$$ --------------------------
##$DU= <E:\>
##$EXPNO= 22
$$ [...]
##$TP07= 0
##$TPNAME0= <>
##$TPNAME1= <>
##$TPNAME2= <>
##$TPNAME3= <>
##$TPNAME4= <>
##$TPNAME5= <>
##$TPNAME6= <>
##$TPNAME7= <>
##$TPOAL= (0..7)
0.5 0.5 0.5 0.5 0.5 0.5 0.5 0.5
##$TPOFFS= (0..7)
0 0 0 0 0 0 0 0
##$TUNHIN= 0
##$TUNHOUT= 0
##$TUNXOUT= 0
##$USERA1= <user>
##$USERA2= <user>
##$USERA3= <user>
##$USERA4= <user>
##$USERA5= <user>
##$V9= 5
##$VALIST= <valist>
##$VCLIST= <CCCCCCCCCCCCCCC>
##$VD= 0
##$VDLIST= <DDDDDDDDDDDDDDD>
##$VPLIST= <PPPPPPPPPPPPPPP>
##$VTLIST= <TTTTTTTTTTTTTTT>
##$WBST= 2048
##$WBSW= 25
##$XGAIN= (0..3)
0 0 0 0
##$XL= 0
##$YL= 0
##$YMAX_a= 7903779
##$YMIN_a= -16628524
##$ZGOPTNS= <>
##$ZL1= 120
##$ZL2= 120
##$ZL3= 120
##$ZL4= 120
##$ABSF1= 14.96354
##$ABSF2= -5.594642
##$ABSG= 5
##$ABSL= 3
##$ALPHA= 0
##$AQORDER= 0
##$ASSFAC= 0
##$ASSFACI= 0
##$ASSFACX= 0
##$ASSWID= 0
##$AUNMP= <proc_prof1d_extract.lims>
##$AXLEFT= 0
##$AXNAME= <>
##$AXNUC= <1H>
##$AXRIGHT= 0
##$AXTYPE= 0
##$AXUNIT= <>
##$AZFE= 0.1
##$AZFW= 0.1
##$BCFW= 0
##$BC_mod= 0
##$BYTORDP= 0
##$COROFFS= 0
##$CY= 15
##$DATMOD= 1
##$DC= 0
##$DFILT= <>
##$DTYPP= 0
##$F1P= 0
##$F2P= 0
##$FCOR= 0.5
##$FTSIZE= 131072
##$FT_mod= 6
##$GAMMA= 0
##$GB= 0
##$INTBC= 1
##$INTSCL= 1
##$ISEN= 128
##$LB= 0.3
##$LEV0= 0
##$LPBIN= 0
##$MAXI= 10000
##$MC2= 0
##$MEAN= 0
##$ME_mod= 0
##$MI= 0
##$NCOEF= 0
##$NC_proc= -2
##$NLEV= 6
##$NOISF1= 0
##$NOISF2= 0
##$NSP= 0
##$NTH_PI= 0
##$NZP= 0
##$OFFSET= 14.96354
##$PC= 1
##$PHC0= -83.21594
##$PHC1= 0
##$PH_mod= 1
##$PKNL= yes
##$PPARMOD= 0
##$PPDIAG= 0
##$PPIPTYP= 0
##$PPMPNUM= 2147483647
##$PPRESOL= 1
##$PSCAL= 4
##$PSIGN= 0
##$PYNMP= <proc.py>
##$REVERSE= no
##$SF= 400.020008620612
##$SI= 131072
##$SIGF1= 0
##$SIGF2= 0
##$SINO= 400
##$SIOLD= 131072
##$SPECTYP= <>
##$SREGLST= <1H.CDCl3>
##$SSB= 0
##$STSI= 131072
##$STSR= 0
##$SW_p= 8223.68421052631
##$SYMM= 0
##$S_DEV= 0
##$TDeff= 65536
##$TDoff= 0
##$TI= <>
##$TILT= no
##$TM1= 0
##$TM2= 0
##$TOPLEV= 0
##$USERP1= <user>
##$USERP2= <user>
##$USERP3= <user>
##$USERP4= <user>
##$USERP5= <user>
##$WDW= 1
##$XDIM= 131072
##$YMAX_p= 404705533
##$YMIN_p= -13812
##$CURPLOT= <Network HP LaserJet P1505>
##$CURPRIN= <$Network HP LaserJet P1505>
##$DFORMAT= <normdp>
##$LAYOUT= <+/1D_H.xwp>
##$LFORMAT= <normlp>
##$PFORMAT= <normpl>
##$SURQMSG= 1
$$ End of Bruker specific parameters
$$ ---------------------------------
##NTUPLES= NMR SPECTRUM
##VAR_NAME=  FREQUENCY,     SPECTRUM/REAL,   SPECTRUM/IMAG
##SYMBOL=    X,             R,               I
##VAR_TYPE=  INDEPENDENT,   DEPENDENT,       DEPENDENT
##VAR_FORM=  AFFN,          ASDF,            ASDF
##VAR_DIM=   131072,        131072,          131072
##UNITS=     HZ,            ARBITRARY UNITS, ARBITRARY UNITS
##FACTOR=    0.0627417313425164, 1,          1
##FIRST=     8223.62146879497, -763,         -56110
##LAST=      0,             1576,            -56329
##MIN=       0,             -13812,          0
##MAX=       8223.62146879497, 404705533,    0
$$ Real data points
##PAGE= N=1
##DATA TABLE= (X++(R..R)), XYDATA
$$ [...]
60973A7990225K897231L047904K887650K362819J565897P13509M0549l08799l18856
60964C0878129p2252K90952N94631O56052L53088l00868j143828j942724k509818
60955B6803362k775100k778235k610608k360278k086826j821076j574847j351170
60947I445222j150901r74629q22012o91627n81980m91792m19178l61285l15056
60938C636762k77860k47331k21267j98171j77504j59052j42269j26614j12097
60929A974597r9045q7468p7221o8708o2784n9614n7994n6175n3168m9030m4264
60918A259126l9427l5116l1698k8888k6161k3618k1869k0969k0171j9055j8185
60907I73969j8088j8247j7914j7375j7395j7706j7221j5736j4308j3627j3127
$$ plain form
60973 17990225 20887456 23935360 26823010 29185829 30751726 31465235 31505784 31196985 30878129
60964 30878129 30805877 31096829 31691460 32347512 32700600 32399732 31255904 29313180 26803362
60955 26803362 24028262 21250027 18639419 16279141 14192315 12371239 10796392 9445222
60947 9445222 8294321 7319692 6497680 5806053 5224073 4732281 4313103 3951818 3636762
60938 3636762 3358902 3111571 2890304 2692133 2514629 2355577 2213308 2086694 1974597
60929 1974597 1875552 1788084 1710863 1642155 1579371 1519757 1461763 1405588 1352420 1303390 1259126
60918 1259126 1219699 1184583 1152885 1123997 1097836 1074218 1052349 1031380 1011209 992154 973969
60907 973969 955881 937634 919720 902345 884950 867244 850023 834287 819979 806352 793225
60896G93225j2196j1329j1223j1384j0637q827p124o582o897o922o001m592l680
60883F85831l676m025l924l277k637k249j604j40J892L601M400M573M953O073
60869F89791P599Q674Q922Q872R090R211Q495P203O561P147Q132Q520Q380Q274
60855H04871Q138P535O656O210O448O927P229P301P078O345N154L869K648J173
60841H87582r19l530o172q341r785j0497j0602j0200r416q557q047q069q447q930
60827G76070r407r699r480q583p233n716m146k669j577q94j90Q00J661J849J552
60812G22338J509K027K628K606J741M35n80p94m15j53l26m67j08N11R70J471K439
60795G35832L555M103M132M451N362O232O541O582O673O489N690M733M367M615
$$ plain form
60896 793225 781029 769700 758477 747093 736456 727629 720505 713923 707026 700104 694103 689511 685831
60883 685831 682155 678130 674206 670929 668292 666043 664439 664299 666191 669792 674192 678765 683718 689791
60869 689791 697390 706064 714986 723858 732948 742159 750654 757857 764418 771565 779697 788217 796597 804871
60855 804871 813009 820544 827200 833410 839858 846785 854014 861315 868393 874738 879892 883761 886409 887582
60841 887582 886663 883133 876961 868620 858835 848338 837736 827536 818120 809563 801516 793447 785000 776070
60827 776070 766663 756964 747484 738901 731668 725952 721806 719137 717560 716666 716476 717276 718937 720786 722338
60812 722338 723847 725874 728502 731108 732849 733284 732704 731910 731495 731342 731016 730549 730441 730952 731922 733393 735832
60795 735832 739387 743490 747622 752073 757435 763667 770208 776790 783463 789952 795642 800375 804742 809357
60781H09357M853M699M338M085M071M350M840N187N037M515M085L875L433K313
60767H69038O16j222k974m613o000o929p489q051q690r029q876q682q931r273
60753G78895q877p669o642o679p584q544r170r594r873r800r228q179o709m980
60739F65367l360k165j368p37q2P84J977L086L291K412J508J722K716L074K181
60724F80406Q85J62o1m49j343k685m365o165p711q829r708j0482j0967j1029j0849
60709E96810j0570j0100r440q841q282p301n725m203l548l752m101m066l607k861
60695E10413j991j265q48n20k3M49M43k8l73q4P70J756K579L197L746M442N384
60678E28047O395P066P113O702O520P370R429J1796J3146J3047J2414J2419J3150
$$ plain form
60781 809357 814210 818909 823247 827332 831403 835753 840593 845780 850817 855332 859417 863292 866725 869038
60767 869038 869654 868432 865458 860845 854845 847916 840427 832376 823686 814657 805781 797099 788168 778895
60753 778895 770018 762349 755707 749028 741444 732900 723730 714136 704263 694463 685235 677056 670347 665367
60739 665367 662007 659842 658474 657737 657655 658439 660416 663502 666793 669205 670713 672435 675151 678225 680406
60724 680406 681291 681453 681392 680943 679600 676915 672550 666385 658674 649845 640137 629655 618688 607659 596810
60709 596810 586240 576140 566700 557859 549577 542276 536551 532348 528800 525048 520947 516881 513274 510413
60695 510413 508422 507157 506309 505789 505766 506215 506658 506630 506257 506173 506943 508699 511278 514475 518221 522663 528047
60678 528047 534442 541508 548621 555323 561843 569213 578642 590438 603584 616631 629045 641464 654614
60665F54614J3710J3436J2542J1624J0999J0615J0319R911R261Q525Q170Q478
60653G82204R032Q833P122M104Q35j698l332m495n446o116o592p276q293r216
60639G59666r686r980j0570j1349j1761j1547j0847r788q465p254o580o303n852
60626F39684n036m214l560k768j675o19J36Q48J777K660L150L451M004M822N634
60611F48294O476P590Q894J0093J1263J2652J3917J4267J3589J2738J2349J1864
60599G83986J0347P866N435L679K165J32k626n796q966j1651j3213j3269j2231
60586G45858j1107j0601j0491j0091r173q287q071q552r189r520r502r271q924
60573F23079q613q540q595q240p074n428m055l242k617j885j315j286j561j399
$$ plain form
60665 654614 668324 681760 694302 705926 716925 727540 737859 747770 757031 765556 773726 782204
60653 782204 791236 800069 807191 811295 812130 810432 807100 802605 797159 791043 784451 777175 768882 759666
60639 759666 749980 740000 729430 718081 706320 694773 683926 674138 665673 658419 651839 645536 639684
60626 639684 634648 630434 626874 624106 622431 621812 621948 622796 624573 627233 630383 633834 637838 642660 648294
60611 648294 654770 662360 671254 681347 692610 705262 719179 733446 747035 759773 772122 783986
60599 783986 794333 802199 807634 811313 813478 813610 810984 805188 796222 784571 771358 758089 745858
60586 745858 734751 724150 713659 703568 694395 686108 678037 669485 660296 650776 641274 632003 623079
60573 623079 614466 605926 597331 589091 582017 576589 572534 569292 566675 564790 563475 562189 560628 559229
60559E59229l19J403K993L785L669L072K473J942J268N86N26J508L075M321M922
60544E94453N423O530Q377J0590J2753J4676J6418J8293K0769K4210K8647L3761
60532G94900L9012M3828M7802N0749N2425N2272M9517M3678L4882K3846J1652
60521A244563m89j1506k0623k7217l0743l1063k8914k5675k2497j9700j7069j4489
60509I94578j2171j0377r157q264p241n641l276k79L085O576J0057J3616J7582
60496I89088K2259K7620L3410L9460M5581N1115N5051N6768N6366N4131N0047
60485A480896M4255L7835L2663L0425L1892L7042M5647N7663P3178R2082J13893
60474B077471J38089J64556J93203K22829K50465K71938K82895K79236K57566
$$ plain form
60559 559229 558910 560313 563306 567091 570760 573832 576305 578247 579515 580101 580627 582135 585210 589531 594453
60544 594453 599876 606406 614783 625373 638126 652802 669220 687513 708282 732492 761139 794900
60532 794900 833912 877740 925542 976291 1028716 1080988 1130505 1174183 1209065 1232911 1244563
60521 1244563 1244074 1232568 1211945 1184728 1153985 1122922 1094008 1068333 1045836 1026136 1009067 994578
60509 994578 982407 972030 962873 954609 947368 941727 938451 938172 941257 947833 957890 971506 989088
60496 989088 1011347 1038967 1072377 1111837 1157418 1208533 1263584 1320352 1376718 1430849 1480896
60485 1480896 1525151 1562986 1595649 1626074 1657966 1695008 1740655 1798318 1871496 1963578 2077471
60474 2077471 2215560 2380116 2573319 2796148 3046613 3318551 3601446 3880682 4138248
60465D138248K16361J57095Q4074L349p8054j52604k13581k57033k82502k91838
60455C323515k87716k73315k52490k29119k05845j83685j62732j42993j24595
60446A461025j07754r2792q0033o9363o0000n1090m2639l5594l0710k7511k4709
60435H38830k1582j8494j6018j4171j2782j2002j1824j1523j0319q537p308p058
60423F87212p102o811o437o283n825m394k333o66J73O69J290J856J945J484P51
60408F55529J66J80J007K241L000K681J652J004J628L428N311O065N409M179L461
60393F96941L591M179M796N282N498N307M871M594M485M037K911J493M02l61j389
60378G46637l013m784n900n972n305m525l977l487k736j815j254j318j512j019
$$ plain form
60465 4138248 4354609 4511704 4595778 4599127 4521073 4368469 4154888 3897855 3615353 3323515
60455 3323515 3035799 2762484 2509994 2280875 2075030 1891345 1728613 1585620 1461025
60446 1461025 1353271 1260479 1180446 1111083 1051083 999993 957354 921760 891050 863539 838830
60435 838830 817248 798754 782736 768565 755783 743781 731957 720434 710115 701578 694270 687212
60423 687212 680110 673299 666862 660579 654754 650360 648027 647361 647534 648203 649493 651349 653294 654778 655529
60408 655529 655695 655875 656882 659123 662123 664804 666456 667460 669088 672516 677827 683892 689301 693480 696941
60393 696941 700532 704711 709507 714789 720287 725594 730465 735059 739544 743581 746492 747985 748387 748026 746637
60378 746637 743624 738840 732940 726968 721663 717138 713161 709674 706938 705123 703869 702551 701039 700020
60364G00020L68K033L236L795L965L904L543K958K541K667L261L874M142M064
60350G44371L798L397K839K197J589J015M43K7j0J36j69j292k699l336k674j165
60334G48467L22J342K039K699L320L661L565L176K793K595K490K293J905J300
60320G81967M78m31j099j192p05qM61N00J88k31n53q02j215j875k430k402j829
60303G68822j346j428j787j823j482j315j711k406k919l100l062k805k278j666
60289G39694j238q54o5J173K242K674K921L842N560P320Q482R167R725J0123J0219
60274H10985J0195J0301J0377J0141R815R940J0616J1345J1673J1610J1435J1502
60262I39935J2206J3723J5644J7309J8561J9729K0839K1565K2199K3907K7422
$$ plain form
60364 700020 700388 702421 705657 709452 713417 717321 720864 723822 726363 729030 732291 736165 740307 744371
60350 744371 748169 751566 754405 756602 758191 759206 759649 759676 759666 759802 759633 758341 755642 752306 749632 748467
60334 748467 748789 750131 752170 754869 758189 761850 765415 768591 771384 773979 776469 778762 780667 781967
60320 781967 782445 782014 780915 779723 779018 779010 779471 779971 780159 779928 779375 778573 777358 775483 773053 770651 768822
60303 768822 767476 766048 764261 762438 760956 759641 757930 755524 752605 749505 746443 743638 741360 739694
60289 739694 738456 737602 737537 738710 740952 743626 746547 750389 755949 763269 771751 780918 790643 800766 810985
60274 810985 821180 831481 841858 851999 861814 871754 882370 893715 905388 916998 928433 939935
60262 939935 952141 965864 981508 998817 1017378 1037107 1057946 1079511 1101710 1125617 1153039
60251A153039L1941L6044L9345M2634M6641N1402N6704O2426O8314P4076P9910
60240A742476Q6351R3409J00251J05888J09921J12429J13544J13305J11627J08219
60230B797420J02755R5209Q5827P4857O2620M9761L6905K4070J0967k047j3921
60219C324423k3990l2336l8878m2939m4274m3727m2036l8614l2426k3715j3811
60208B947677l463P577J9406L1455M3408N5612O8199Q0609R2319J03218J12743
60197C558760J19514J22617J22611J20427J15779J07651R5996Q1869O5937M7913
60187D559074K7811O805j3660l2970n1019o7362q1319r2560j00929j05865j06653
60176C941353j03289r6653q7723p6933o4384n0312l5197j9646m211J0862K5695
$$ plain form
60251 1153039 1184980 1221024 1260369 1303003 1349644 1401046 1457750 1520176 1588490 1662566 1742476
60240 1742476 1828827 1922236 2022487 2128375 2238296 2350725 2464269 2577574 2689201 2797420
60230 2797420 2900175 2995384 3081211 3156068 3218688 3268449 3305354 3329424 3340391 3338344 3324423
60219 3324423 3300433 3268097 3229219 3186280 3142006 3098279 3056243 3017629 2985203 2961488 2947677
60208 2947677 2944214 2951791 2971197 3002652 3046060 3101672 3169871 3250480 3342799 3446017 3558760
60197 3558760 3678274 3800891 3923502 4043929 4159708 4267359 4363355 4445224 4511161 4559074
60187 4559074 4586885 4593690 4580030 4547060 4496041 4428679 4347360 4254800 4153871 4048006 3941353
60176 3941353 3838064 3741411 3653688 3576755 3512371 3462059 3426862 3407216 3403005 3413867 3439562
60165C439562M0249N3693O4700P2517P7346P9354P7874P2116O2517N0750L8395
60154D129073K6049J3840K092q854j9044k8609l7114m3604m7272m7771m4959l8755
60142C855072k9366j7422l544J2028K9291M8010O7709Q8124J09460J31972J55400
60131D446734J79094K02728K26573K50774K74556K96567L15985L32805L46853
60122F872669L56978L61696L60293L52792L39008L18414K91152K58488K21747
60113I733237J81166J36445Q8204L8259j1680o0893j08982j54823j96749k33492
60103I410692k64346k88443l04594l12097l11422l03643k89561k69791k45490
60094F821305k18420j90009j60664j30202r8773o7187l6453p209K0415M6410P0245
$$ plain form
60165 3439562 3479811 3533504 3598204 3670721 3748067 3827421 3905295 3977411 4039928 4090678 4129073
60154 4129073 4155122 4168962 4171054 4162200 4143156 4114547 4077433 4033829 3986557 3938786 3893827 3855072
60142 3855072 3825706 3808284 3804740 3816768 3846059 3894069 3961778 4049902 4159362 4291334 4446734
60131 4446734 4625828 4828556 5055129 5305903 5580459 5877026 6193011 6525816 6872669
60122 6872669 7229647 7591343 7951636 8304428 8643436 8961850 9253002 9511490 9733237
60113 9733237 9914403 10050848 10139052 10177311 10165631 10104738 9995756 9840933 9644184 9410692
60103 9410692 9146346 8857903 8553309 8241212 7929790 7626147 7336586 7066795 6821305
60094 6821305 6602885 6412876 6252212 6122010 6023237 5956050 5919597 5912388 5932803 5979213 6049458
60083F049458R0599J05803J14737J17303J14002J05279R1388P2772N0356K5462
60073F937159l95k5782m9681p1710r1912j10306j26749j41114j53377j63322j70349
60062E832462j73795j73461j69772j63377j54670j43671j30285j14610r7060p8255
60052D433506n8834l9235j9650q1J9465L8845N7684P5427R1506J05535J17257
60041D821425J26271J31805J33002J29474J21467J09420R3576P4212N2038K8053
60031E820743L102k2205m7166p1017r3258j13549j31087j44513j52803j56026
60021D892221j55050j50629j43107j32722j19860j05028q8867p2071n4942l7201
60011C832744j8643J59J8248L5456N2641P0676Q9516J08473J26919J44436J60479
$$ plain form
60083 6049458 6140057 6245860 6360597 6477900 6591902 6697181 6788569 6861341 6911697 6937159
60073 6937159 6936764 6910982 6861301 6789591 6697679 6587373 6460624 6319510 6166133 6002811 5832462
60062 5832462 5658667 5485206 5315434 5152057 4997387 4853716 4723431 4608821 4511761 4433506
60052 4433506 4374672 4335437 4315787 4315706 4335171 4374016 4431700 4507127 4598633 4704168 4821425
60041 4821425 4947696 5079501 5212503 5341977 5463444 5572864 5666440 5740652 5792690 5820743
60031 5820743 5823845 5801640 5754474 5683457 5590199 5476650 5345563 5201050 5048247 4892221
60021 4892221 4737171 4586542 4443435 4310713 4190853 4085825 3996958 3924887 3869945 3832744
60011 3832744 3814101 3814260 3832508 3867964 3920605 3991281 4080797 4189270 4316189 4460625 4621104
60000D621104J74235J84687J90695J91233J85768J74363J57422J35670J10423
59991F125600Q3258N5093K5942m084l3960o2437q9038j13640j35210j51913j62504
59980E537107j67035j66112j60352j50704j38413j24058j07311q8281o8405m9186
59970D317250l0483j1043R486K9971M9206O6893Q2985R7024J08557J17574J23902
59959D961322J26663J24974J18907J09381R7362Q3599O8821N3634L8391K3574
59949E806628J0080j291j0410j7346k1447k1542j7011q060M941K1825M2176O5270
59937E853813R0759J18961J50071J83519K18357K53911K89580L24323L56712L85316
59927H225322M08564M24328M29978M22985M01397L64053L10808K42835J62807
$$ plain form
60000 4621104 4795339 4980026 5170721 5361954 5547722 5722085 5879507 6015177 6125600
59991 6125600 6208858 6263951 6289893 6285809 6251849 6189412 6100374 5986734 5851524 5699611 5537107
59980 5537107 5370072 5203960 5043608 4892904 4754491 4630433 4523122 4434841 4366436 4317250
59970 4317250 4286767 4275724 4285210 4315181 4364387 4431280 4514265 4611289 4719846 4837420 4961322
59959 4961322 5087985 5212959 5331866 5441247 5538609 5622208 5691029 5744663 5783054 5806628
59949 5806628 5816708 5815417 5805007 5787661 5766214 5744672 5727661 5719601 5724542 5746367 5788543 5853813
59937 5853813 5944572 6063533 6213604 6397123 6615480 6869391 7158971 7483294 7840006 8225322
59927 8225322 8633886 9058214 9488192 9911177 10312574 10676627 10987435 11230270 11393077
59918A1393077P4936j5334j02318j81461k49843l05521l46870l73055l84836l84320
59908I124455l73817l55218l30252l00734k68287k34021j98673j62879j27264
59899F773310r2369n8535k5805O037L7145O7427R6729J24873J51183J74047J91390
59888G445432K01626K03969J97859J82616J57889J24274Q3494L8024r442n6557
59878H569184j01578j43051j79446k09394k32343k48711k59402k65319k67272
59869F662668k65914k61552k54283k44378k32277k18170k01935j83673j63975
59860D636511j43508j22577j01401q0486o0507m1966k5274j0951M61Q455J2249
59849D071006J0711L198r376k4604l9873n3449o4423p2169p6305p7152p5820p3506
$$ plain form
59918 11393077 11468013 11452679 11350361 11168900 10919057 10613536 10266666 9893611 9508775 9124455
59908 9124455 8750638 8395420 8065168 7764434 7496147 7262126 7063453 6900574 6773310
59899 6773310 6680941 6622406 6596601 6602638 6639783 6707210 6803939 6928812 7079995 7254042 7445432
59888 7445432 7647058 7851027 8048886 8231502 8389391 8513665 8597159 8635183 8625741 8569184
59878 8569184 8467606 8324555 8145109 7935715 7703372 7454661 7195259 6929940 6662668
59869 6662668 6396754 6135202 5880919 5636541 5404264 5186094 4984159 4800486 4636511
59860 4636511 4493003 4370426 4269025 4188539 4128032 4086066 4060792 4049841 4050302 4058757 4071006
59849 4071006 4081717 4084915 4075539 4050935 4011062 3957613 3893190 3821021 3744716 3667564 3591744 3518238
59837C518238p0720o7297o3052n8125n2573m5985l7855k8322j8056p499L426J4764
59825C086944K6145L7079M7154N5525O0703O1481N8068N1940M4603L6862K9079
59814C595583K1580J4616Q262K539k524o935j0411j1895r840l268P435K0943L6035
59801C662120N2276O9901Q9326J10699J33931J59204J87308K19050K54190K91108
59791E229113L27349L59684L83191L90904L75453L31926K59944J64333N4875n5309
59781G821463j53262k30138k82732l12051l21215l14545k97001k72929k45107
59772E392483k15342j85506j57289j31244j07013q4591o4560m6965l0919j5735
59762D353319j768J0505K1691L3029M5065N7496P0207Q3694R8298J13708J29529
$$ plain form
59837 3518238 3447518 3380221 3317169 3259044 3206471 3160486 3122631 3094309 3076253 3068754 3072180 3086944
59825 3086944 3113089 3150168 3197322 3252847 3313550 3375031 3433099 3485039 3529642 3566504 3595583
59814 3595583 3617163 3631779 3640041 3642580 3640056 3633121 3622710 3610815 3600975 3597707 3605142 3626085 3662120
59801 3662120 3714396 3784297 3873623 3984322 4118253 4277457 4464765 4683815 4938005 5229113
59791 5229113 5556462 5916146 6299337 6690241 7065694 7397620 7657564 7821897 7876772 7821463
59781 7821463 7668201 7438063 7155331 6843280 6522065 6207520 5910519 5637590 5392483
59772 5392483 5177141 4991635 4834346 4703102 4596089 4511498 4446938 4399973 4369054 4353319
59762 4353319 4351551 4362056 4383747 4416776 4461841 4519337 4589544 4673238 4771536 4885244 5014773
59751E014773J45933J63377J82019K01761K22797K45637K70478K96818L23966
59742G067559L51854L81040M11748M43148M73728N02082N26795N45600N55383
59733A1258937N53586N39418N13680M77993M34753L87603L41214L00346K69065
59724A5076595K50351K45654K54761K76370L08682L49249L94717M41505M86734
59715A8084618N27861N61539N83773N91463N83112N57902N15182M55642L82475
59706B2843567L00604K14922J29755M9440k1572p9448j21490j46052j52430j40856
59696B2876440j12329o8415j1182N6990J33984K18138L07761M00866M95766N91339
59686B4889358O85813P75478Q55223R20126R65508R85308R71686R17250Q17854
$$ plain form
59751 5014773 5160706 5324083 5506102 5707863 5930660 6176297 6446775 6743593 7067559
59742 7067559 7419413 7800453 8212201 8655349 9129077 9631159 10157954 10703554 11258937
59733 11258937 11812523 12351941 12865621 13343614 13778367 14165970 14507184 14807530 15076595
59724 15076595 15326946 15572600 15827361 16103731 16412413 16761662 17156379 17597884 18084618
59715 18084618 18612479 19174018 19757791 20349254 20932366 21490268 22005450 22461092 22843567
59706 22843567 23144171 23359093 23488848 23538288 23516716 23437268 23315778 23169726 23017296 22876440
59696 22876440 22764111 22695696 22684514 22741504 22875488 23093626 23401387 23802253 24298019 24889358
59686 24889358 25575171 26350649 27205872 28125998 29091506 30076814 31048500 31965750 32783604
59677C2783604O73608M88683K71405L4390k06762m36087o39654q06962r31710
59668C1230515j012265j051528j056280j036441j004174r72242r51495r48334
59660B3197756r63080r89897j018721j038930j043259j029670j000335r59162
59652A5154702r09973q56082q00424p45373o92362o41859n93746n47790n03963
59643H863130m62525m23795l87835l54403l23235k94153k66843k40796k15791
59634E893754j92248j70737j51166j32930j15753r9902q5502p2275o0301n0431
59624D762509m3443l9116l6720l6170l7992m2314m8510n5941o4292p2924q0539
59613D204548q6078q9640r2032r3495r3340r0879q6318q0584p4435o7980o1019
$$ plain form
59677 32783604 33457212 33945895 34217300 34251690 34044928 33608841 32969187 32162225 31230515
59668 31230515 30218250 29166722 28110442 27074001 26069827 25097585 24146090 23197756
59660 23197756 22234676 21244779 20226058 19187128 18143869 17114199 16113864 15154702
59652 15154702 14244729 13388647 12588223 11842850 11150488 10508629 9914883 9367093 8863130
59643 8863130 8400605 7976810 7588975 7234572 6911337 6617184 6350341 6109545 5893754
59634 5893754 5701506 5530769 5379603 5246673 5130920 5031018 4945516 4873241 4812940 4762509
59624 4762509 4719066 4679950 4643230 4607060 4569068 4526754 4478244 4422303 4358011 4285087 4204548
59613 4204548 4118470 4028830 3936798 3843303 3749963 3659084 3572766 3492182 3417747 3349767 3288748
59602C288748n3646m6348l9479l2862k6067j9004j2054n642O6N046R305J2986
59590C081049J6320J9263K1357K2182K1928K1294K0937K1113K1836K3140K5187
59579C315606K8251L2598L8261M4886N1942N9172O6755P5061Q4324R4635J06045
59568C997536J18527J31876J45861J60471J75810J91671K07425K22444K36562
59559E588183K49824K61844K71580K77867K80016K77887K71568K61208K47112
59550G987089K29858K10222J88917J66470J43401J20483R8452P7208N5652L2927
59540I310679J0062j0021k4246l0873k9379j9725k383K1394M9940Q1691J14697
59529I471836J45840J71278J87855J93656J87316J67605J34178Q8359L2795k9396
$$ plain form
59602 3288748 3235102 3188754 3149275 3116413 3090346 3071342 3059288 3053646 3053712 3058758 3068063 3081049
59590 3081049 3097369 3116632 3137989 3160171 3182099 3203393 3224330 3245443 3267279 3290419 3315606
59579 3315606 3343857 3376455 3414716 3459602 3511544 3570716 3637471 3712532 3796856 3891491 3997536
59568 3997536 4116063 4247939 4393800 4554271 4730081 4921752 5129177 5351621 5588183
59559 5588183 5838007 6099851 6371431 6649298 6929314 7207201 7478769 7739977 7987089
59550 7987089 8216947 8427169 8616086 8782556 8925957 9046440 9144892 9222100 9277752 9310679
59540 9310679 9320741 9310720 9286474 9255601 9226222 9206497 9204114 9225508 9275448 9357139 9471836
59529 9471836 9617676 9788954 9976809 10170465 10357781 10525386 10659564 10747923 10780718 10751322
59519A0751322r4993j60759k23682k81134l30693l70172l98244m14854m20811
59510H055980m17180m05333l87149l64601l39038l11273k82249k53211k25150
59501E070796j98388j72799j48271j24888j02870q2304o2845m3806k4754n835
59491D104036J2751L1366N0569P0235Q9584J08165J26280J44339J62392J80345
59481E080062J97995K14414K27847K36794K40806K39733K32591K17872J94785
59472G082899J63622J25111Q0363L1416j8931o8255j15021j57929j95453k26340
59462F701482k50072k66489k75519k77695k74432k67264k57132k44740k31087
59453D357052k16935k02131j86251j69791j54014j39649j26401j13791j01841
$$ plain form
59519 10751322 10656329 10495570 10271888 9990754 9660061 9289889 8891645 8476791 8055980
59510 8055980 7638800 7233467 6846318 6481717 6142679 5831406 5549157 5295946 5070796
59501 5070796 4872408 4699609 4551338 4426450 4323580 4241276 4178431 4134625 4109871 4104036
59491 4104036 4116787 4148153 4198722 4268957 4358541 4466706 4592986 4737325 4899717 5080062
59481 5080062 5278057 5492471 5720318 5957112 6197918 6437651 6670242 6888114 7082899
59472 7082899 7246521 7371632 7451995 7483411 7464480 7396225 7281204 7123275 6927822 6701482
59462 6701482 6451410 6184921 5909402 5631707 5357275 5090011 4832879 4588139 4357052
59453 4357052 4140117 3937986 3751735 3581944 3427930 3288281 3161880 3048089 2946248
59444B946248r0771q0586p1155o2378n4083m6148l8696l1815k5223j8684j2752
59433B413957q244m974j753J992N383P419Q409R504J1251J3387J5704J8409K1673
59420B512117K5326K8958L1844L2964L1723K8841K6240K5958K9109L5518M4017
59409B852615N3378O3311P4386Q6619R8537J08227J15232J21039J27921J37786
59399C839051J51756J70035J91856K16102K42251K70559L01453L35036L71085
59390F089184M09083M48260M87776N26571N62636N92811O13977O24296O22816
59381A0977410O08577N81405N43669M99874M54032M08120L63313L21331K83677
59372A5041408K50315K20041J91550J63299J32947R8259N8549J4459l3567q5543
$$ plain form
59444 2946248 2855477 2774891 2703736 2641358 2587275 2541127 2502431 2470616 2445393 2426709 2413957
59433 2413957 2405713 2400739 2398986 2400978 2406361 2413780 2422189 2431693 2442944 2456331 2472035 2490444 2512117
59420 2512117 2537443 2566401 2598245 2631209 2662932 2691773 2718013 2743971 2773080 2808598 2852615
59409 2852615 2905993 2969304 3043690 3130309 3228846 3337073 3452305 3573344 3701265 3839051
59399 3839051 3990807 4160842 4352698 4568800 4811051 5081610 5383063 5718099 6089184
59390 6089184 6498267 6946527 7434303 7960874 8523510 9116321 9730298 10354594 10977410
59381 10977410 11585987 12167392 12711061 13210935 13664967 14073087 14436400 14757731 15041408
59372 15041408 15291723 15511764 15703314 15866613 15999560 16097819 16156368 16170827 16137260 16051717
59362A6051717j40430j95238k46178k90470l27004l55997l78587l96513m11468
59353A3309832m24455m35638m44757m51456m55304m55702m52121m44634m34074
59344I311691m21471m07237l91235l73569l55017l36429l17973k99225k79872
59335F129663k60126k40621k22052k04733j88327j72226j56339j41290j27598
59326D416351j15000j02897r1122p9855o8973n8164m7566l7725k8731j9895j0582
59315C755841j014Q057J6241K3796L1138L8277M4816N0353N4814N8375O1111O2850
59303D204655O3475O3214O2489O1554O0437N9160N7844N6609N5649N5307N5914
59292D856307N7468N9733O2608O6149P0134P3838P6374P7001P5063O9823O0686
$$ plain form
59362 16051717 15911287 15716049 15469871 15179401 14852397 14496400 14117813 13721300 13309832
59353 13309832 12885377 12449739 12004982 11553526 11098222 10642520 10190399 9745765 9311691
59344 9311691 8890220 8482983 8091748 7718179 7363162 7026733 6708760 6409535 6129663
59335 6129663 5869537 5628916 5406864 5202131 5013804 4841578 4685239 4543949 4416351
59326 4416351 4301351 4198454 4107332 4027477 3958504 3900340 3852774 3815049 3786318 3766423 3755841
59315 3755841 3754827 3762884 3779125 3802921 3834059 3872336 3917152 3967505 4022319 4080694 4141805 4204655
59303 4204655 4268130 4331344 4393833 4455387 4515824 4574984 4632828 4689437 4745086 4800393 4856307
59292 4856307 4913775 4973508 5036116 5102265 5172399 5246237 5322611 5399612 5474675 5544498 5605184
59281E605184M7567L0890J1346j0184l2536n4349p4411r1917j06468j18128j27597
59270E079397j36101j44574j52616j58377j59798j56223j48734j39134j28698
59261C755142j17824j06425r4439q2110p0030n8718m8056l7320k5998j4421l207
59250C096594P660J8864L0937M3876N7616P2361Q8245J05188J23347J43479J66308
59239C954475J91785K19353K48743K79968L12580L45481L77551M07887M35000
59230F772823M56148M67961M67608M53179M23373L77580L16466K42152J57715
59221A0135005O6825k6281j17045k01169k74846l34630l77905m04014m14566m12133
59211G639241l98805l76343l47194l14509k80869k47444k14527j82500j52143
$$ plain form
59281 5605184 5652751 5683641 5694987 5684803 5652267 5597918 5523507 5431590 5325122 5206994 5079397
59270 5079397 4943296 4798722 4646106 4487729 4327931 4171708 4022974 3883840 3755142
59261 3755142 3637318 3530893 3436454 3354344 3284314 3225596 3177540 3140220 3114222 3099801 3096594
59250 3096594 3104254 3123118 3154055 3197931 3255547 3327908 3416153 3521341 3644688 3788167 3954475
59239 3954475 4146260 4365613 4614356 4894324 5206904 5552385 5929936 6337823 6772823
59230 6772823 7228971 7696932 8164540 8617719 9041092 9418672 9735138 9977290 10135005
59221 10135005 10201830 10175549 10058504 9857335 9582489 9247859 8869954 8465940 8051374 7639241
59211 7639241 7240436 6864093 6516899 6202390 5921521 5674077 5459550 5277050 5124907
59202E124907j24371r9998p9627o3621n2151m5274m2799m4062m7989n3392n9301
59191D412322o5156p0890p6658q2266q6988r0202r2014r2944r3137r2309r0336
59180C479422q7441q3860p9702p5165p0441o5468o0129n4726m9751m5212m0660
59169B766867l5828l0731k5208j9141j3134q153m143J23N487J1405J6898K1797
59157B686239K6416L0739L4667L8512M2500M6113M8662N0135N0799N0453M8828
59146C154063M6389M3784M0723L6309L0344K3437J5874P508j163q834j4804j9666
59134C353964k4068k7521k8982k8153k5589k1930j7511j2448o590N46R350J9610
59122C190678L0569M1418N1665O1255P0516P9717Q8501R5989J01660J06011J10146
$$ plain form
59202 5124907 5000536 4900538 4820911 4757290 4705139 4659865 4617066 4573004 4525015 4471623 4412322
59191 4412322 4347166 4276276 4199618 4117352 4030364 3940162 3848148 3755204 3662067 3569758 3479422
59180 3479422 3391981 3308121 3228419 3153254 3082813 3017345 2957216 2902490 2852739 2807527 2766867
59169 2766867 2731039 2700308 2675100 2655959 2642825 2634672 2630529 2630652 2636139 2647544 2664442 2686239
59157 2686239 2712655 2743394 2778061 2816573 2859073 2905186 2953848 3003983 3054782 3105235 3154063
59146 3154063 3200452 3244236 3284959 3321268 3351612 3375049 3390923 3398431 3397268 3388434 3373630 3353964
59134 3353964 3329896 3302375 3273393 3245240 3219651 3197721 3180210 3167762 3161172 3161718 3171068 3190678
59122 3190678 3221247 3262665 3314330 3375585 3446101 3525818 3614319 3710308 3811968 3917979 4028125
59111D028125J14875J20308J26068J31645J36624J40662J43182J42976J38360
59102E222825J27830J10536Q6151N4775J7371k3888o6027j06161j42063j72227
59092E109122j95758k12287k21845k24859k22299k15637k06403j95647j83880
59083C230507j71405j58618j45998j33973j22784j12438j02800r3775q5405p7762
59073B025549p0774o4296n8326n3116m8834m5119m1178l6575l1776k7580k4056
59062A523919k0470j6369j2263q885o243l886j826o05n32j449l192n692q521j0854
59048A423132j2138j2426j1824j0075o995k948J452N896J0338J4726J9064K3571
59036A441773K8191L2107L4279L4568L3862L2867L1312K8725K5617K3183K1973
$$ plain form
59111 4028125 4143000 4263308 4389376 4521021 4657645 4798307 4941489 5084465 5222825
59102 5222825 5350655 5461191 5547342 5602117 5619488 5595600 5529573 5423412 5281349 5109122
59092 5109122 4913364 4701077 4479232 4254373 4032074 3816437 3610034 3414387 3230507
59083 3230507 3059102 2900484 2754486 2620513 2497729 2385291 2282491 2188716 2103311 2025549
59073 2025549 1954775 1890479 1832153 1779037 1730203 1685084 1643906 1607331 1575555 1547975 1523919
59062 1523919 1503449 1487080 1474817 1465932 1459689 1455803 1453977 1453372 1452840 1451391 1448199 1442507 1433986 1423132
59048 1423132 1410994 1398568 1386744 1376669 1369674 1366726 1368178 1374074 1384412 1399138 1418202 1441773
59036 1441773 1469964 1502071 1536350 1570918 1604780 1637647 1668959 1697684 1723301 1746484 1768457
59025A768457K1507K1330K1597K2095K1477J8463J3598Q854N450K964P69q91j814
59012A923856k876n053p964j0448j2318j4519j7558k0738k3121k4431k4855k4618
59000A735357k4072k3596k3097k2086k0487j8817j7316j5386j2423q846n853m177
58988A539201l384k402o23J492K954L460L840N045O972Q779J0170J1702J3877
58975A601083J6603J9613K2745K5659K7943K9785L1872L4335L6380L7310L7291
58964A920619L6789L5883L4663L3654L3225L3070L2906L3147L4268L5977L7825
58953B302026M0197M3747M8019N1758N4634N7758O2075O7045P1384P4575P7060
58942B950278P9316Q1441Q3686Q6847R1768R8578J06775J16168J27365J40968
$$ plain form
59025 1768457 1789964 1811294 1832891 1854986 1876463 1894926 1908524 1917378 1922828 1925792 1926561 1925670 1923856
59012 1923856 1920980 1915927 1907963 1897515 1885197 1870678 1853120 1832382 1809261 1784830 1759975 1735357
59000 1735357 1711285 1687689 1664592 1642506 1622019 1603202 1585886 1570500 1558077 1549231 1543378 1539201
58988 1539201 1535817 1533415 1532792 1534284 1537238 1540698 1544538 1549583 1556555 1565334 1575504 1587206 1601083
58975 1601083 1617686 1637299 1660044 1685703 1713646 1743431 1775303 1809638 1846018 1883328 1920619
58964 1920619 1957408 1993291 2027954 2061608 2094833 2127903 2160809 2193956 2228224 2264201 2302026
58953 2302026 2342223 2385970 2433989 2485747 2540381 2598139 2660214 2727259 2798643 2873218 2950278
58942 2950278 3029594 3111035 3194721 3281568 3373336 3471914 3578689 3694857 3822222 3963190
58932C963190J56477J72628J88986K06505K26135K47468K69447K92045L16353
58923F039234L43020L71527M01225M32338M65446N00343N35976N71254O05379
58914A0265742O37310O65186O86443O98349O98352O84142O53672O05378N38487
58905A6133061M53255L51137K34965J09026k1237j49876k71104l79872m72422
58896A5986933n46676o02085o39105o58877o63358o55313o37859o13848n85634
58887A0384178n55126n23856m92923m62827m33457m04564l76603l50816l27943
58878F456063l07053k86363k65238k44650k25476k07324j89569j72634j57355
58869D400401j43619j30647j18303j07157r7314q8200p9589p1896o5239n8979
$$ plain form
58932 3963190 4119667 4292295 4481281 4687786 4913921 5161389 5430836 5722881 6039234
58923 6039234 6382254 6753781 7155006 7587344 8052790 8553133 9089109 9660363 10265742
58914 10265742 10903052 11568238 12254681 12953030 13651382 14335524 14989196 15594574 16133061
58905 16133061 16586316 16937453 17172418 17281444 17260207 17110331 16839227 16459355 15986933
58896 15986933 15440257 14838172 14199067 13540190 12876832 12221519 11583660 10969812 10384178
58887 10384178 9829052 9305196 8812273 8349446 7915989 7511425 7134822 6784006 6456063
58878 6456063 6149010 5862647 5597409 5352759 5127283 4919959 4730390 4557756 4400401
58869 4400401 4256782 4126135 4007832 3900675 3803361 3715161 3635572 3563676 3498437 3439458
58859C439458n2575m6244m0315l4530k8513k2435j6642j0895m626K158Q817J5003
58847C208661K1176K8010L5509M3055N0239N7350O4940P3081Q1286Q9280R7494
58836C850081J06676J17098J28512J40693J53712J67612J82199J97337K13263
58827E257183K30444K49245K69886K92564L17545L45112L75404M08120M42393
58818H187896M77199N11902N46186N79336O09814O35520O54130O62947O58917
58809A3523847O39275O02285N47048M73000L80329K71149J49935K2542j05120
58800A6504290k27546l39706m37571n18771n82420o28346o56891o69437o68543
58791A1775059o57143o37709o12232n82556n50266n16315m81168m45343m09695
$$ plain form
58859 3439458 3386883 3340639 3300324 3265794 3237281 3214846 3198204 3187309 3182683 3184841 3193658 3208661
58847 3208661 3229837 3257847 3293356 3336411 3386650 3444000 3508940 3582021 3663307 3752587 3850081
58836 3850081 3956757 4073855 4202367 4343060 4496772 4664384 4846583 5043920 5257183
58827 5257183 5487627 5736872 6006758 6299322 6616867 6961979 7337383 7745503 8187896
58818 8187896 8665095 9176997 9723183 10302519 10912333 11547853 12201983 12864930 13523847
58809 13523847 14163122 14765407 15312455 15785455 16165784 16436933 16586868 16609410 16504290
58800 16504290 16276744 15937038 15499467 14980696 14398276 13769930 13113039 12443602 11775059
58791 11775059 11117916 10480207 9867975 9285419 8735153 8218838 7737670 7292327 6882632
58782F882632l75249l42862l12909k85227k59668k36901k18406k05194j96612
58773D449604j90552j84693j77419j68111j57246j46090j35659j25843j15887
58764C048104j05571r5382q5638p6193o7065n8675n1149m3995l6803k9806k3459
58753B374368j7774j2431p237k368J605L773L304n9o107j4591k4877l5291m3657
58740B218658m8900n1573n2644n2430n1077m9203m7429m5764m4006m2344m1036
58729A692252l9894l8611l7189l5632l3734l1610k9895k8792k7453k4981k1642
58718A342819j8437j5936j4151j3165j3019j3311j3640j4190j5198j6139j6212
58707A179421j5360j4099j2720j1514j1367j2973j5589j7622j8529j9119j9878
$$ plain form
58782 6882632 6507383 6164521 5851612 5566385 5306717 5069816 4851410 4646216 4449604
58773 4449604 4259052 4074359 3896940 3728829 3571583 3425493 3289834 3163991 3048104
58764 3048104 2942533 2847151 2761513 2685320 2618255 2559580 2508431 2464436 2427633 2397827 2374368
58753 2374368 2356594 2344163 2336926 2334558 2336163 2339936 2343240 2343181 2337074 2322483 2297606 2262315 2218658
58740 2218658 2169758 2118185 2065541 2013111 1962034 1912831 1865402 1819638 1775632 1733288 1692252
58729 1692252 1652358 1613747 1576558 1540926 1507192 1475582 1445687 1416895 1389442 1364461 1342819
58718 1342819 1324382 1308446 1294295 1281130 1268111 1254800 1241160 1226970 1211772 1195633 1179421
58707 1179421 1164061 1149962 1137242 1125728 1114361 1101388 1085799 1068177 1049648 1030529 1010651
58696A010651k0050j8756j6176j3262j0862r380q678q004o542m277j867K79K227
58683H95303L907N129O274Q016J0141J1493J1460J0762J0332J0213J0060J0129
58671A003219J1057J3062J5811J8760K1235K2467K1882J9180J4103O700k044j0339
58659A155093j6726k0687k2134k1044j7946j4123j0715p904n335k844m51J911
58647A017095M201O187P877R644J1591J3321J4700J6323J8722K1599K4407K7245
58635A192912L0584L4488L8727M3404M8773N4620O0554O6806P4107Q2747R2315
58624A820037J02408J13082J24478J36384J48431J60397J72126J83239J92914
58615C153496J99875K02653K00022J91271J75919J53491J23868Q7936M7732N850
$$ plain form
58696 1010651 990601 971845 955669 942407 931545 922165 913487 905483 898941 894664 892797 893076 895303
58683 895303 899210 904339 910613 918629 928770 940263 951723 962485 972817 983030 993090 1003219
58671 1003219 1014276 1027338 1043149 1061909 1083144 1105611 1127493 1146673 1160776 1167476 1165432 1155093
58659 1155093 1138367 1117680 1095546 1074502 1056556 1042433 1031718 1023814 1018479 1015635 1015184 1017095
58647 1017095 1021296 1027483 1035360 1045004 1056595 1069916 1084616 1100939 1119661 1141260 1165667 1192912
58635 1192912 1223496 1257984 1296711 1340115 1388888 1443508 1504062 1570868 1644975 1727722 1820037
58624 1820037 1922445 2035527 2160005 2296389 2444820 2605217 2777343 2960582 3153496
58615 3153496 3353371 3556024 3756046 3947317 4123236 4276727 4400595 4488531 4536263 4542113
58605D542113l5208p3273j06463j33373j53456j67118j75107j77776j75234j68287
58595C176818j58693j48051j36769j24670j12243j00611r0373q1324p3319o6606
58585B084159o1091n6153n1434m7169m3387l9475l5019l0357k5777k0880j5254
58574A658163r267l538J782O439R281Q942N124j433r995k0036l0514l9795m6523
58561A528630n0158n0740m8741m5094m0797l6276l1538k6906k3127k0653j9243
58550A135357j8442j8050j8037j8269j8566j8795j8835j8499j7597j5987j3726
58539I40554j1264r268q014p205o538o162o208o235n755n071m942n405n637n080
58525H47770m109l297k607j764r66o82q16o83R1R15P80n80k242k923k269j175
$$ plain form
58605 4542113 4506905 4433632 4327169 4193796 4040340 3873222 3698115 3520339 3345105 3176818
58595 3176818 3018125 2870074 2733305 2608635 2496392 2395781 2305408 2224084 2150765 2084159
58585 2084159 2023068 1966915 1915481 1868312 1824925 1785450 1750431 1720074 1694297 1673417 1658163
58574 1658163 1648896 1645358 1647140 1653579 1662860 1671802 1676926 1675493 1665498 1645462 1614948 1575153 1528630
58561 1528630 1478472 1427732 1378991 1333897 1293100 1256824 1225286 1198380 1175253 1154600 1135357
58550 1135357 1116915 1098865 1080828 1062559 1043993 1025198 1006363 987864 970267 954280 940554
58539 940554 929290 920022 912008 904803 898265 892103 885895 879660 873905 868834 863892 858487 852850 847770
58525 847770 843661 840364 837757 835993 835027 834345 833529 832846 832937 833852 834632 834052 831810 828887 826618 825443
58509H25443p12r00p35O06K962N596Q142J0766J3567J6220J8283J9611K0305K0451
58495I59605K0019J8883J6815J3609R513N307J683j358m182o841r161j1324j3535
58482I99033j5154j5111j3541j1997j1518j1417j0768j0116j0505j1569j2063
58471H65274j1911j2133j2878j3140j2689j2624j3453j4094j3592j2586j2069
58460G24105j1771j0869r471q238p157n820m430l441k538j041Q60K392L617N537
58446F71735Q658J2227J5116J6740J6968J5720J2999R039M299l85l855n340n196
58433G68725m541m071l557k482p47J327L337M940N881O128O019O211P301R227
58419H03698J1114J2085J2248J2520J3302J3882J3354J1638R256O514L446K44
$$ plain form
58509 825443 824731 823831 823096 823702 826664 832260 840402 851168 864735 880955 899238 918849 939154 959605
58495 959605 979624 998507 1015322 1028931 1038444 1043751 1045434 1044076 1039894 1033053 1023892 1012568 999033
58482 999033 983879 968768 955227 943230 931712 920295 909527 899411 888906 877337 865274
58471 865274 853363 841230 828352 815212 802523 789899 776446 762352 748760 736174 724105
58460 724105 712334 701465 691994 683756 676599 670779 666349 662908 660370 659329 660189 662581 666198 671735
58446 671735 680393 692620 707736 724476 741444 757164 770163 779202 783501 783116 779261 773921 768725
58433 768725 764184 760113 756556 754074 753327 754654 757991 762931 768812 774940 780959 787170 794471 803698
58419 803698 814812 826897 839145 851665 864967 878849 892203 903841 913097 919611 923057 923301
58407I23301k778n447p557q622q302p013n705m995m787m650m306l759l127k480
58393H49773j789j049l13M98J616L019M203M820N245N966O667O631N966N483N430
58378I02166N329N159N562O523O966O273N266M968N291N648O062O817P690Q370
58364I88090R152J0442J1966J3225J4193J4933J4999J3944J2044R891P556M789
58352A125224J658j402l910n336n368m440l453k664j520J60J777L079M645O739
58338A115189Q713J0171J1619J3316J4649J5383J6284J7564J8070J7150J6110
58327A274218J6465J7857J9027J9770K0410K0323J8634J5694J2418Q896N022J701
58315A450435j71j088j855j955o17J433L018M474O670Q926J0065J0834J2969J6248
$$ plain form
58407 923301 920523 915076 907519 898897 890595 883582 877877 872882 868095 863445 859139 855380 852253 849773
58393 849773 847984 846935 846622 847120 848736 851755 855958 860778 866023 871989 878656 885287 891253 896736 902166
58378 902166 907495 912654 918216 924739 931705 937978 943244 948212 953503 959151 965213 972030 979720 988090
58364 988090 997242 1007684 1019650 1032875 1047068 1062001 1077000 1090944 1102988 1112879 1120435 1125224
58352 1125224 1126882 1125480 1121570 1116234 1110866 1106426 1102973 1100309 1098789 1098949 1100726 1103805 1108450 1115189
58338 1115189 1123902 1134073 1145692 1159008 1173657 1189040 1205324 1222888 1240958 1258108 1274218
58327 1274218 1290683 1308540 1327567 1347337 1367747 1388070 1406704 1422398 1434816 1443712 1448734 1450435
58315 1450435 1450264 1449176 1447321 1445366 1444749 1446182 1449200 1453674 1460344 1469270 1479335 1490169 1503138 1519386
58301A519386J8736J9764K0488K1559K2434K3058K4171K5788K7253K8879L1596
58290A783112L4912L7255L8569M0602M4317M8857N3255N7290O0352O1344O0113
58279B319978N7398N3195M6845L8897L0918K3384J5746Q828M989N225P928J1192
58267B624523J4603J8319K2005K5460K8950L2514L6004L9843M4482M9279N3394
58256B989376N7342O1966O6422O9262P0987P3378P6695P9927Q3275Q7760R2828
58245C809218R7135J01390J07426J14765J21254J26931J33927J42569J51122J59411
58235E065148J68993J79672J89665J99541K11902K26775K41539K55996K73029
58226G012260K93408L14560L35600L58993L86000M15201M46800M83473N25582
$$ plain form
58301 1519386 1538122 1557886 1578374 1599933 1622367 1645425 1669596 1695384 1722637 1751516 1783112
58290 1783112 1818024 1855279 1893848 1934450 1978767 2027624 2080879 2138169 2198521 2259865 2319978
58279 2319978 2377376 2430571 2477416 2516313 2547231 2570615 2586361 2595189 2600178 2605403 2613331 2624523
58267 2624523 2639126 2657445 2679450 2704910 2733860 2766374 2802378 2842221 2886703 2935982 2989376
58256 2989376 3046718 3108684 3175106 3244368 3315355 3388733 3465428 3545355 3628630 3716390 3809218
58245 3809218 3906353 4007743 4115169 4229934 4351188 4478119 4612046 4754615 4905737 5065148
58235 5065148 5234141 5413813 5603478 5803019 6014921 6241696 6483235 6739231 7012260
58226 7012260 7305668 7620228 7955828 8314821 8700821 9116022 9562822 10046295 10571877
58217A0571877N70677O19284O75779P42036Q15966Q98194R94064J107100J237302
58208A8232279J388432J570255J791178K056615K377774K773356L257655L834166
58200C7281710M504610N276330O159064P167630Q336421R726490J1420681J3525229
58192A03398165J6168279J9460488K3432105K7991592L2850044L7292179L9910598
58185C00503450L8761295L2254252K0346765N044474j0368429k2866488l0875688
58178C32799631l4450149l4650540l2772485k9863622k6584513k3280178k0117854
58171A31080290j7190266j4551865j2221905j0194086q449991o960006n681411
58164E5830760m567868l578254k671171j799854r22954j5990R29082J886817K739665
$$ plain form
58217 10571877 11142554 11761838 12437617 13179653 13995619 14893813 15887877 16994977 18232279
58208 18232279 19620711 21190966 22982144 25038759 27416533 30189889 33447544 37281710
58200 37281710 41786320 47062650 53221714 60389344 68725765 78452255 89872936 103398165
58192 103398165 119566444 139026932 162459037 190450629 223300673 260592852 300503450
58185 300503450 339264745 371518997 391865762 396910236 386541807 363675319 332799631
58178 332799631 298349482 263698942 230926457 201062835 174478322 151198144 131080290
58171 131080290 113890024 99338159 87116254 76922168 68472177 61512171 55830760
58164 55830760 51262892 47684638 45013467 43213613 42290659 42274669 43203751 45090568 47830233
58155D7830233L235337L062153K048673L39679j622377l320139m417037m861848
58147D2294674m809825m472443m015441l535305l076626k654700k273372j935751
58139A5521211j644715j398407j190526j015243q68724p46531o43818n58499m90641
58130F964107m37978l95339l59208l29649l06728k88035k70917k54459k37990
58121D083804k20162k00880j82039j64918j48623j32149j16210j02037r0072q0878
58111B645836p5551p4124p4846p5753p5735p3794o9182o2972n7712n4649n2801
58100A898717n1343n0988n2165n3660n4211n4043n3760n3118n1714m9717m7139
58089A326859m3682l9892l7041l5281l3394l1041k9485k9321k9276k8291k7112
$$ plain form
58155 47830233 51065570 54127723 56176396 56516075 54893698 51573559 47156522 42294674
58147 42294674 37484849 33012406 28996965 25461660 22385034 19730334 17456962 15521211
58139 15521211 13876496 12478089 11287563 10272320 9403596 8657065 8013247 7454748 6964107
58130 6964107 6526129 6130790 5771582 5441933 5135205 4847170 4576253 4321794 4083804
58121 4083804 3863642 3662762 3480723 3315805 3167182 3035033 2918823 2816786 2726714 2645836
58111 2645836 2570285 2496161 2421315 2345562 2269827 2196033 2126851 2063879 2006167 1951518 1898717
58100 1898717 1847374 1796386 1744221 1690561 1636350 1582307 1528547 1475429 1423715 1373998 1326859
58089 1326859 1283177 1243285 1206244 1170963 1137569 1106528 1077043 1047722 1018446 990155 963043
58078I63043k6548k5711k3512k0642j8593j7592j6787j5665j4183j2293j0401
58067G61116r480r792j0184r575q293p195o346n533n142n532o276o907p675q743
58053F54443r435r248q803q863r045q458p018n327l836k823k550k673k179p30
58039E73455O30R13O21R01J957L180M247N141N568N312M816M666M784M798M780
58024F25769M909M898M391L652L223L268L740M711O062P315Q326R620J1534J3567
58010G14985J5071J6050J6740J6940J6238J4407J1187O314K50n802j1097j5918
57998G95365k0477k4107k6176k7000k7144k6540k4903k2284j8565j3316o942j111
57986E56800K902N471P364Q251P707O866P470R601J1667J2653J3136J4063J5550
$$ plain form
58078 963043 936495 910784 887272 866630 848037 830445 813658 797993 783810 771517 761116
58067 761116 751636 741844 731660 722085 713792 706597 700251 694718 689576 684044 677768 670861 663186 654443
58053 654443 645008 635760 626957 618094 609049 600591 593573 588246 584410 581587 579037 576364 574185 573455
58039 573455 574085 574998 575619 576520 578477 581657 585904 591045 596613 601925 606741 611407 616191 620989 625769
58024 625769 630678 635576 639967 643619 646842 650110 653850 658561 664623 671938 680264 689884 701418 714985
58010 714985 730056 746106 762846 779786 796024 810431 821618 827932 828182 822380 811283 795365
57998 795365 774888 750781 724605 697605 670461 643921 619018 596734 578169 564853 557911 556800
57986 556800 559702 565173 572537 580788 588495 595361 602831 612432 624099 636752 649888 663951 679501
57973F79501J7042J7952J8031J7488J6575J4719J0693M276k860q703j2755j5518
57961G56441j6891j6369j4423j2270j0262p688m271p69K136M654P214R643J1376
57948G08521J2106J2046J1755J1521J0784Q567M786M80l714q474j4268j9748k2995
57935G11367k3946k4248k4826k4936k3741k1489j8793j5797j2615r752p615o162
57923D97447n326n244n745o171n984n166l883k226m29J089K133K925L819N067
57909D72306O717Q392R289Q814P153M893K329m51l116n241o747p655p731o968
57895D81984o107n976o473o881o898o694o211n265m195l560l274k799k082j444
57881D14125p61L56J708K744L619M923O401P046O631O077N998N978N615N240N110
$$ plain form
57973 679501 696543 714495 732526 750014 766589 781308 792001 796277 793417 784714 771959 756441
57961 756441 739550 723181 708758 696488 686226 678538 674267 673498 675634 680288 687502 697145 708521
57948 708521 720627 732673 744428 755949 766733 775300 780086 780566 776852 768378 754110 734362 711367
57935 711367 687421 663173 638347 613411 589670 568181 549388 533591 520976 511224 503609 497447
57923 497447 492121 486877 481132 474961 468977 463811 459928 457702 457273 458362 460495 463420 467239 472306
57909 472306 479023 487415 496704 505518 512671 517564 519893 519442 516326 511085 504338 496683 488952 481984
57895 481984 475877 469901 463428 456547 449649 442955 436744 431479 427284 423724 420450 417651 415569 414125
57881 414125 413364 413720 415428 418172 421791 426714 433115 440161 446792 452869 458867 464845 470460 475700 480810
57866D80810M782L878K672J420j42k037l537m051l941l901m023m062m075m202
57852D59591m215l878l345k762j802j73J717L089L625L577L261K744J989R70k50
57837D64138j500k676l895n237o445p245p856q609r251r321r101r378j0123j0385
57823C63116r793r151r097q986p891n915l867k218j056n09m28j18Q62J978K543
57808C09470K872L916N986Q609J1423J4410J7400K0127K2798K5867K9184L1910
57796E03972L3365L3374L1753K8169K2726J6197R387K582m098j0228j5342j9387
57784F32470k2563k4779k5692k5344k4459k3790k3312k2298k0292j7718j5420
57773C86803j3817j2683j1457r569o739l474j023k40n20m07P75K391L537M036
$$ plain form
57866 480810 485592 489470 492142 493562 493420 491383 487846 483795 479854 475953 471930 467868 463793 459591
57852 459591 455376 451498 448153 445391 443589 443416 445133 448222 451847 455424 458685 461429 463418 464388 464138
57837 464138 462638 459962 456067 450830 444385 437140 429284 420675 411424 402103 393002 383624 373501 363116
57823 363116 353323 344172 335075 326089 318198 312283 308416 306198 305142 304633 304205 304087 304949 306927 309470
57808 309470 312342 316258 322244 330853 342276 356686 374086 394213 417011 442878 472062 503972
57796 503972 537337 570711 602464 630633 653359 669556 678943 681525 677427 667199 651857 632470
57784 632470 609907 585128 559436 534092 509633 485843 462531 440233 419941 402223 386803
57773 386803 372986 360303 348846 339277 332538 329064 328041 327801 327281 326874 327649 330040 333577 337613
57759C37613M234M490M981N525N552M761L867L858M459M338L148K264K884M350
57745C96324N224N175M852M558M192M064M649N647O317O610P066P717Q100Q305
57731D78800R043J0516J2105J3398J4654J6024J7172J8024J9162K0944K2954K4784
57719F77580K6799K9448L2322L4619L6417L8813M2803M8347N4651O1008O7345
57708A150152P4223Q2390R2190J03300J15025J26930J39162J52084J65696J79357
57698B380509J92116K02994K10784K13681K09619J97258J76448J47676J11538
57689D042623O9171K3047k3196o5825j02002j30082j49503j60493j63752j60374
57679C179614j51971j40341j26549j10460r1498o9667m5523j9410Q810L9196P0906
$$ plain form
57759 337613 341847 346337 351318 356843 362395 367156 371023 374881 379340 383678 386826 389090 391974 396324
57745 396324 401548 406723 411575 416133 420325 424389 429038 434685 441002 447612 454678 462395 470495 478800
57731 478800 487843 498359 510464 523862 538516 554540 571712 589736 608898 629842 652796 677580
57719 677580 704379 733827 766149 800768 837185 875998 918801 967148 1021799 1082807 1150152
57708 1150152 1224375 1306765 1398955 1502255 1617280 1744210 1883372 2035456 2201152 2380509
57698 2380509 2572625 2775619 2986403 3200084 3409703 3606961 3783409 3931085 4042623
57689 4042623 4111794 4134841 4111645 4045820 3943818 3813736 3664233 3503740 3339988 3179614
57679 3179614 3027643 2887302 2760753 2650293 2558795 2489128 2443605 2424195 2433005 2472201 2543107
57668B543107J01170J24235J31801J16330P5867J6735m8230j04925j43616j61853
57658B650621j63324j53885j38255j19443r9626q0213o1364m2651k4330p250Q490
57647A768770K3740L8914N3357O6622P9511R3140J07545J21854J35476J48357
57637B637286J60231J70144J76628J77986J72617J59522J38583J10234P5230L5091
57627D013552p468m9098q6959j19324j45399j64888j77702j83907j84079j79671
57617B715057j72629j64359j55222j45159j34381j23218j11877j00827r0992q2965
57607A433428p6245o9878o3592n7766n2493m7482m2806l8897l5579l1969k7738
57596H88983k3820k1321k0177j9418j8389j7129j5803j4401j3026j1869j0756
$$ plain form
57668 2543107 2644277 2768512 2900313 3016643 3092510 3109245 3061015 2956090 2812474 2650621
57658 2650621 2487297 2333412 2195157 2075714 1976088 1895875 1834511 1791860 1767530 1760280 1768770
57647 1768770 1792510 1831424 1884781 1951403 2030914 2124054 2231599 2353453 2488929 2637286
57637 2637286 2797517 2967661 3144289 3322275 3494892 3654414 3792997 3903231 3978461 4013552
57627 4013552 4006084 3956986 3870027 3750703 3605304 3440416 3262714 3078807 2894728 2715057
57617 2715057 2542428 2378069 2222847 2077688 1943307 1820089 1708212 1607385 1516393 1433428
57607 1433428 1357183 1287305 1223713 1165947 1113454 1065972 1023166 984269 948690 916721 888983
57596 888983 865163 843842 823665 804247 785858 768729 752926 738525 725499 713630 702874
57585G02874r305p596o306n879n986o026n796n263m096k007N34K542L543L988
57571F55221M562N586P132R158J1225J2645J3315J4019J5451J7426J9541K2148
57559H07429K5824L0202L4287L7900M1910M6890N2482N8426O5222P3163Q1496
57548A355231Q9329R6909J05176J14391J23873J32844J40669J46430J48946J47283
57538B601081J40678J28138J08857Q3174N2595J8879j6233n0384q0649j04830
57528B881306j22370j33792j39712j40804j38102j32783j25761j17781j09473
57519A720728j00954r1786q1939p2393o4228n7340n0780m4122l7772l1991k6588
57508A060835k1687j7828j4865j1634p433l147m9K106M808Q742J3053J6775K0181
$$ plain form
57585 702874 693569 685973 679667 673788 667802 661776 655980 650717 646621 644614 645148 647690 651233 655221
57571 655221 659783 665369 672501 681659 692884 705529 718844 732863 748314 765740 785281 807429
57559 807429 833253 863455 897742 935642 977552 1024442 1076924 1135350 1200572 1273735 1355231
57548 1355231 1444560 1541469 1646645 1761036 1884909 2017753 2158422 2304852 2453798 2601081
57538 2601081 2741759 2869897 2978754 3061928 3114523 3133402 3117169 3066785 2986136 2881306
57528 2881306 2758936 2625144 2485432 2344628 2206526 2073743 1947982 1830201 1720728
57519 1720728 1619774 1527988 1446049 1373656 1309428 1252088 1201308 1157186 1119414 1087423 1060835
57508 1060835 1039148 1021320 1006455 994821 987388 984241 984192 986298 991106 999848 1012901 1029676 1049857
57495A049857K4254K9412L5249M1280M7497N4296O2066P0736P9670Q8248R6551
57484A679116J05163J14194J22890J30290J35696J38190J36262J28420J13949
57475B804170R2807O5494L3522m57l3862o5295r3854j17773j34948j44901j49204
57464B255699j49671j46926j41108j32995j23791j14301j04972r6282q8395q0802
57454A076456p2932o5042n7959n2094m7207m2996l9365l6142l2980k9739k6633
57443E73367k3945k1778k0093j8736j7451j6092j4821j3839j2988j1864j0361
57432C91399q890p950p677p770p739p203o181n139m671m932n435n495m893m105
57418C03319l728l691l285k124q20k70m51n27j82r2p84j646j709r69k11J05J77
$$ plain form
57495 1049857 1074111 1103523 1138772 1180052 1227549 1281845 1343911 1414647 1494317 1582565 1679116
57484 1679116 1784279 1898473 2021363 2151653 2287349 2425539 2561801 2690221 2804170
57475 2804170 2896977 2962471 2995993 2995536 2961674 2896379 2802525 2684752 2549804 2404903 2255699
57464 2255699 2106028 1959102 1817994 1684999 1561208 1446907 1341935 1245653 1157258 1076456
57454 1076456 1003524 938482 880523 828429 781222 738226 698861 662719 629739 600000 573367
57443 573367 549422 527644 507551 488815 471364 455272 440451 426612 413624 401760 391399
57432 391399 382509 374559 366882 359112 351373 344170 337989 332850 328179 323247 317812 312317 307424 303319
57418 303319 299591 295900 292615 290491 289671 289401 288950 288423 288241 288149 287365 285719 284010 283041 282830 282935 283112
57401B83112J29k25q06j122r24n90n72q21j005r89q21m88J5M96O89N79M48N18
57383B77623O86O87N19N29R54J536J842J901K089K389K266J562R40J007J443J513
57367B99486J089N00k49j363k447k757k256j727j660j709j510j242j093p96j39
57352B82127N37Q12P87P42O13K26k04l11r3J62L27M64O26Q98J435K189K795L059
57334B97191L268L701M180M515N108O444Q098R007Q846Q541R140J0648J2230J3240
57320D04157J3626J3631J3584J3895J4829J6102J7020J7226J7254J7987J9635
57309E78946K1446K2603K3158K3842K5053K6441K7466K8018K8224K7983K7036
57298H60216K5320K3005K0129J6466J1794O201J47n713j0818j5001j8479k1466
$$ plain form
57401 283112 283241 283016 282210 281088 280164 279574 279002 278181 277176 276187 275366 274878 274893 275389 276078 276657 277105 277623
57383 277623 278309 278996 279515 280044 280998 282534 284376 286277 288366 290755 293021 294583 295523 296530 297973 299486
57367 299486 300575 301075 300826 299463 297016 294259 292003 290276 288616 286907 285397 284155 283062 282266 282127
57352 282127 282664 283476 284263 285005 285618 285844 285640 285329 285236 285398 285725 286189 286815 287713 289148 291337 294132 297191
57334 297191 300459 304160 308340 312855 317963 324407 332505 341512 350358 358899 368039 378687 390917 404157
57320 404157 417783 431414 444998 458893 473722 489824 506844 524070 541324 559311 578946
57309 578946 600392 622995 646153 669995 695048 721489 748955 776973 805197 833180 860216
57298 860216 885536 908541 928670 945136 956930 963131 963278 957565 946747 931746 913267 891801
57286H91801k3910k5595k6430k6470k5756k4315k2268j9835j7240j4698j2452
57275F52832j0656r209p816o256m625l249k343j703q63L25J347J646J466J760
57261F12656K976M440N255N461N820O550P069P049P100P898R054R465Q766P765
57247G07324P393P657Q013Q261Q544Q701Q366P679P337P642Q114Q379Q849J0021
57233H22280J1484J2408J2740J3214J4160J5064J5431J5488J5777J6538J7623
57222I82207J8652J9124J8812J8170J7934J8239J8623J8948J9565K0480K1120
57211A191874K1365K1910K3065K3944K3647K2662K2156K2301K2375K2245K2591
57200A440135K3544K4164K3763K2969K2907K3845K5143K6223K7069K7925K8902
$$ plain form
57286 891801 867891 842296 815866 789396 763640 739325 717057 697222 679982 665284 652832
57275 652832 642176 632967 625151 618895 614270 611021 608678 606975 606112 606437 607784 609430 610896 612656
57261 612656 615632 620072 625327 630788 636608 643158 650227 657276 664376 672274 681328 690793 699559 707324
57247 707324 714717 722374 730387 738648 747192 755893 764259 771938 779275 786917 795031 803410 812259 822280
57233 822280 833764 846172 858912 872126 886286 901350 916781 932269 948046 964584 982207
57222 982207 1000859 1019983 1038795 1056965 1074899 1093138 1111761 1130709 1150274 1170754 1191874
57211 1191874 1213239 1235149 1258214 1282158 1305805 1328467 1350623 1372924 1395299 1417544 1440135
57200 1440135 1463679 1487843 1511606 1534575 1557482 1581327 1606470 1632693 1659762 1687687 1716589
57189A716589K9930L0908L1813L2689L3541L4291L4902L5469L6082L6669L7050
57178B089933L7039L6453L5171L3418L1708L0362K9284K8355K7800K7812K8088
57167B435423K8164K7991K7832K7788K7852K8253K9192L0344L1132L1587L2347
57156B757905L3712L5161L6113L6712L7528L8684L9700M0176M0337M0746M1547
57145C178321M2256M2455M2447M2859M3682M4193M3876M2895M1473L9422L6610
57134C640489L3400L0188K7067K4397K3080K3668K5681K8487L2321L7701M4364
57123C970843N1732N9953O9366P9252Q8268R6078J03522J11237J19239J27948
57113D877438J38504J51764J67887J87116K10109K37310K68904L05770L49793
$$ plain form
57189 1716589 1746519 1777427 1809240 1841929 1875470 1909761 1944663 1980132 2016214 2052883 2089933
57178 2089933 2126972 2163425 2198596 2232014 2263722 2294084 2323368 2351723 2379523 2407335 2435423
57167 2435423 2463587 2491578 2519410 2547198 2575050 2603303 2632495 2662839 2693971 2725558 2757905
57156 2757905 2791617 2826778 2862891 2899603 2937131 2975815 3015515 3055691 3096028 3136774 3178321
57145 3178321 3220577 3263032 3305479 3348338 3392020 3436213 3480089 3522984 3564457 3603879 3640489
57134 3640489 3673889 3704077 3731144 3755541 3778621 3802289 3827970 3856457 3888778 3926479 3970843
57123 3970843 4022575 4082528 4151894 4231146 4319414 4415492 4519014 4630251 4749490 4877438
57113 4877438 5015942 5167706 5335593 5522709 5732818 5970128 6239032 6544802 6894595
57104F894595M03217M68410N48277O46073P64841R07814J078918J281576J517126
57095A4510847J785523K087055K421805K788046L182762L602119M037566M471572
57087C8887295M880435N238660N510703N634848N528345N128892M441996L546970
57079G8798144K554331J554932N99153k94412j123031j887940k585048l200472
57071G4415657l715842m118644m406336m581870m649155m614100m487464m284666
57063C9557580m023419l721974l397941l066841k741178k430685k142463j880557
57055A6152522j646223j439274j258888j103011r68146q50909p49809o64890n95749
57046F875623n40317m95358m57490m23788l92084l61319l31393l02421k74346
$$ plain form
57104 6894595 7297812 7766222 8314499 8960572 9725413 10633227 11712145 12993721 14510847
57095 14510847 16296370 18383425 20805230 23593276 26776038 30378157 34415723 38887295
57087 38887295 43767730 49006390 54517093 60151941 65680286 70809178 75251174 78798144
57079 78798144 81352475 82907407 83506560 83212148 82089117 80201177 77616129 74415657
57071 74415657 70699815 66581171 62174835 57592965 52943810 48329710 43842246 39557580
57063 39557580 35534161 31812187 28414246 25347405 22606227 20175542 18033079 16152522
57055 16152522 14506299 13067025 11808137 10705126 9736980 8886071 8136262 7471372 6875623
57046 6875623 6335306 5839948 5382458 4958670 4566586 4205267 3873874 3571453 3297107
57037C297107k47313k22047j99245j78772j59986j42737j27541j14579j03253
57028A801634r2986q3851p5932o8701o1706n5455n0679m7037m3401l9375l5578
57017A146933l2377k9287k5902k2455j9034j5062j0116m581J194P819J6270K6806
57005A040208L9204N3726P1038R1484J15152J42058J70198J92307J95725J68338
56995B279438J07326K3585o2526j31385j72818j87713j83319j67545j46329j23723
56985A234991j02223q2795o5531n0920m0170l4082l1960l2001l2637l3232l3597
56974F95843l3366l2143l0100k7983k6338k4872k2826j9897j6501j3160r900o419
56962D32338k613J285N098R003J3326J7881K1488K2314J9011J1686J834q529j7538
$$ plain form
57037 3297107 3049794 2827747 2628502 2449730 2289744 2147007 2019466 1904887 1801634
57028 1801634 1708648 1624797 1548865 1480164 1418458 1363003 1312324 1265287 1221886 1182511 1146933
57017 1146933 1114556 1085269 1059367 1036912 1017878 1002816 992700 988119 989313 997132 1013402 1040208
57005 1040208 1079412 1133138 1204176 1295660 1410812 1552870 1723068 1915375 2111100 2279438
56995 2279438 2386764 2410349 2347823 2216438 2043620 1855907 1672588 1505043 1358714 1234991
56985 1234991 1132768 1049973 984442 933522 893352 859270 827310 795309 762672 729440 695843
56974 695843 662477 630334 600234 572251 545913 521041 498215 478318 461817 448657 438757 432338
56962 432338 429725 431010 436108 445111 458437 476318 497806 520120 539131 550817 552651 544122 526584
56949E26584k3749k6450k6011k3625k0499j7367j4642j2487j0542q050m660q18
56937C37684K868O481J0633J5651K1208K6584L0949L3377L2900K8675K0265Q125
56925E75400n898j8906k8391l3576l5316l4879l3099l0433k7235k3749k0134j6696
56913B67088j3910j2027j0804r792q761p762o853n961n086m352l762k995j693
56900A73330j4J361J923J880J881K407L634N617Q134J0474J1997J2984J4467J6919
56886B66994J9505K0836K0142J7410J2863O865J96n944j0493j2888j3202j2080
56874C10204j0380q576o474l723m39K860N820Q566J1528J5125J9580K4847L0764
56861C99702L7197M3752M9124N1008M7120L6606K0747K675j3753k5598l2127l4536
$$ plain form
56949 526584 502835 476385 450374 426749 406250 388883 374241 361754 351212 343162 338502 337684
56937 337684 340552 347033 357666 373317 394525 421109 452058 485435 518335 547010 567275 575400
56925 575400 569502 550596 522205 488629 453313 418434 385335 354902 327667 303918 283784 267088
56913 267088 253178 241151 230347 220555 211794 204032 197179 191218 186132 181780 178018 175023 173330
56900 173330 173316 174677 176600 178480 180361 182768 186402 192019 200153 210627 222624 235608 250075 266994
56886 266994 286499 307335 327477 344887 357750 364615 364811 358867 348374 335486 322284 310204
56874 310204 299824 291248 284774 281051 280612 283472 289292 297858 309386 324511 344091 368938 399702
56861 399702 436899 480651 529775 580783 627903 664509 685256 687931 674178 648580 616453 581917
56849E81917l4258l1788k7292k1670j6220j1365o399n46O170J3267K0565K8348
56837E00729L6976M6561N6879O7257P6124Q0507P6454O1149L5453M285k5872m9991
56825I66511o5597p2387p1892o6946o0203n2790m4798l6642k9025k1733j3712
56814D30786m625M565J3048K1294L0184L9625M8601N5890N9820N7773M7243K8090
56802H32294L628k0834m0706n3916o0714o2249n9585n3822m6461l8922l1777k4956
56790C41980j8564j2885p580j788M670J0901J6188K1049K6343L1737L5552L5805
56778D83408L1131K1337P898o242j8201k6593l1446l3196l2417l0118k7395k4707
56766C13459k1987j9367j7083j4886j2314r678p913p263o855n916m757m062l723
$$ plain form
56849 581917 547659 515871 488579 466909 450689 439324 432925 432379 438549 451816 472381 500729
56837 500729 537705 584266 641145 708402 784526 865033 941487 1002636 1038089 1042374 1016502 966511
56825 966511 900914 828527 756635 689689 629486 576696 531898 495256 466231 444498 430786
56814 430786 426161 430726 443774 465068 495252 534877 583478 639368 699188 756961 804204 832294
56802 832294 835922 815088 774382 720466 659752 597503 537918 484096 437635 398713 366936 341980
56790 341980 323416 310531 302951 301163 305833 316734 332922 353971 380314 412051 447603 483408
56778 483408 514539 535876 543774 537532 519331 492738 461292 428096 395679 365561 338166 313459
56766 313459 291472 272105 255022 240136 227822 218144 210231 202968 196113 190197 185440 181378 177655
56753A77655l096k046j154r14j205j598j874k102k404k745k929k788k319j573
56739A48908o11K75N49K4o34n58J07K66n84j512j340k29O12N17q3o43j192j813
56721A42059k053j413j31J065J821K323K602K257J161O5p2P19J358J033J39l60
56705A52573j30L77O99P69O30K96k4j1L17O22P72R51J104Q62K63nM67J084J002
56686A62618K69l86n78n36m47k77j67m35j036j555j810j999k170k085j729j499
56670A46178j587j673j440j062q42p60o52n31m71m12l37m01o06o19k19L43O84
56653A35593P93Q31O78J27o35j098r95m57L26J281K200K668K378J485N16o0k10
56636A45421k95n88q81p95l82l2J91O50J347J597R46m6m32kP60J508K195K574
$$ plain form
56753 177655 174559 172513 171359 170445 169240 167642 165768 163666 161262 158517 155588 152800 150481 148908
56739 148908 148297 148572 149121 149145 148511 147953 148060 148326 147742 146230 144890 144661 145273 145790 145707 145064 143872 142059
56721 142059 140006 138593 138462 139527 141348 143671 146273 148530 149691 149756 149684 150403 151761 152794 152933 152573
56705 152573 152443 152820 153519 154288 154918 155214 155190 155179 155496 156118 156890 157841 158945 159807 160070 160065 160532 161616 162618
56686 162618 162887 162501 161923 161387 160940 160663 160496 160061 159025 157470 155660 153661 151491 149406 147677 146178
56670 146178 144591 142918 141478 140416 139574 138814 138162 137631 137160 136748 136411 136010 135404 134785 134566 134909 135593
56653 135593 136386 137217 137895 138022 137387 136289 135294 134837 135163 136444 138644 141312 143690 145175 145691 145631 145421
56636 145421 145126 144538 143657 142862 142480 142448 142639 143289 144636 146233 147179 147133 146701 146699 147459 148967 151162 153736
56618A53736K299J565J029R55R66P79N57M05N8n65r75o90M0M89L15n4O8Q07J452
56599A63236J108j70j189r57Q0O58M48L24Q47J436J417J113J194J559J642J404
56583A74150J316J513J716J880K293K926L285L030K353J650J185J118J533K307
56569B02255L188M030M795N400N825O327P126P928Q165P748P264P193P343P200
56555B91787O656O044N624N203M357K910J216j85j170k188l603n092n999o183
56541B99377o137o288o586o942p499q243q646q220p224o404o094n904n399m660
56527B05131m022l545l088k731k775l243l572l092j794m93j42r58k208k894k603
56512A67971j745r99o16l79p4K53N39Q78J258J324P82l9l80J39J080J699J634
$$ plain form
56618 153736 156035 157600 158629 159584 160550 161329 161886 162291 162349 161784 160809 160119 160159 160648 160963 160909 160977 161784 163236
56599 163236 164344 164174 162985 162028 162108 162766 163214 163538 164385 165821 167238 168351 169545 171104 172746 174150
56583 174150 175466 176979 178695 180575 182868 185794 189079 192109 194462 196112 197297 198415 199948 202255
56569 202255 205443 209473 214268 219668 225493 231820 238946 246874 255039 262787 270051 277244 284587 291787
56555 291787 298443 304487 310111 315314 319671 322581 323797 323612 322442 320254 316651 311559 305560 299377
56541 299377 293240 286952 280366 273424 265925 257682 249036 240816 233592 227188 221094 215190 209791 205131
56527 205131 201109 197564 194476 191745 188970 185727 182155 179063 177269 176776 176634 175676 173468 170574 167971
56512 167971 166226 165227 164611 164232 164158 164411 164950 165828 167086 168410 169192 169153 168773 168912 169992 171691 173325
56495A73325J103O07N48R09J284J338J241J400J744J703J048L41L20J074K107
56480A90092K905L175K804K016J362J192J260J201J155J476J994K184J984J850
56466B16650J869J580R69Q92J862K901K437K99j906k588j780p51m84r25j433j497
56450B18095r93j60N91R79J045R83Q81Q02Q94J193J315Q35n6o03l94J46L90K42
56432B26185j7k90o79j124j493j824k142k237k021j846j985k009j356m48l51j272
56416B05091k150k127j596j335j179l75J097K264K267J261J43k92R1P86J148R43
56400B06037M18o7k88n1P25J716K294K164J695J415J444J559J569J415J093O82
56384B23820K93qj19K21J075J939K196J954J922K321K627K456K087J835J618J499
$$ plain form
56495 173325 174428 175035 175583 176492 177776 179114 180355 181755 183499 185202 186250 186591 186911 187985 190092
56480 190092 192997 196172 198976 200992 202354 203546 204806 206007 207162 208638 210632 212816 214800 216650
56466 216650 218519 220099 221068 221960 223822 226723 229160 229459 227553 224965 223185 222434 221950 221025 219592 218095
56450 218095 217102 216942 217533 218512 219557 220540 221421 222223 223117 224310 225625 226460 226404 225801 225407 225553 225943 226185
56432 226185 226168 225878 225199 224075 222582 220758 218616 216379 214358 212512 210527 208518 207162 206714 206363 205091
56416 205091 202941 200814 199218 197883 196704 196329 197426 199690 201957 203218 203361 203069 203160 203946 205094 206037
56400 206037 206455 206388 206100 206049 206774 208490 210784 212948 214643 216058 217502 219061 220630 222045 223138 223820
56384 223820 224113 224105 223986 224207 225282 227221 229417 231371 233293 235614 238241 240697 242784 244619 246237 247736
56368B47736J845K533K745K156J536J579J841J638J228J158J065L00o92p93J62
56353B66037J268J927K299K521K517K657L520M812N508N272M842M798M905M921
56339C17804N053N177M566L057J618J125J152P68K5j77N41J597K292K438K135
56324C49171J429M86k40l18J29M18k4j000j681j500p16L8M87P69J046J351J667
56307C51512J877J858J821K185K800K898K270J952K931M637N710N909O178O926
56293D01464P490P460P400P795Q314Q644R221J0496J2098J3345J4136J4813J5568
56280E38244J6482J7805J9682K1932K4336K7007L0098L3518L7159M1121M5494
56269H52878N0181N5162O0604O6541P2711P8916Q5233R1667R7832J03113J06984
$$ plain form
56368 247736 249581 252114 254859 257015 258551 260130 261971 263609 264837 265995 267060 267360 266668 265875 266037
56353 266037 267305 269232 271531 274052 276569 279226 282746 287558 293066 298338 303180 307978 312883 317804
56339 317804 322857 328034 332600 335657 337275 338400 339552 340320 340345 340168 340709 342306 344598 347036 349171
56324 349171 350600 351086 350846 350528 350657 351075 351051 350051 348370 346870 346154 346192 346679 347448 348494 349845 351512
56307 351512 353389 355247 357068 359253 362053 364951 367221 369173 372104 376741 382451 388360 394538 401464
56293 401464 408954 416414 423814 431609 439923 448567 457788 468284 480382 493727 507863 522676 538244
56280 538244 554726 572531 592213 614145 638481 665488 695586 729104 766263 807384 852878
56269 852878 903059 958221 1018825 1085366 1158077 1236993 1322226 1413893 1511725 1614838 1721822
56258A721822J09150J09692J08977J07151J03690R7930Q9918Q0390P0034N9224
56248B657978M8397L8061K8431J9514J1516M672j250o721j1938j7106k2962l0127
56236B718465l8073m5707n2947o0750o9452p8090q5489r1186r5126r7494r9070
56225A905081j00754j02293j02238r9590r4729q8630q2038p5581o9614o3675n7082
56214I68857n0328m4846m1050l7790l4096l0238k6528k2493j7938j3679j0335
56203F39536p493m835k965k252j896j167m90l60k21N54J552K315L399N167O571
56188F37415O520N634N130M759L430J339j90p19r80j330j386j196j342j716j378
56173F53990R7K012L496M274M476M477M881O055P668R243J0796J2430J3743J4508
$$ plain form
56258 1721822 1830972 1940664 2049641 2156792 2260482 2358412 2448330 2528720 2598754 2657978
56248 2657978 2706375 2744436 2772867 2792381 2803897 2808569 2807319 2800598 2788660 2771554 2748592 2718465
56236 2718465 2680392 2634685 2581738 2520988 2451536 2373446 2287957 2196771 2101645 2004151 1905081
56225 1905081 1804327 1702034 1599796 1500206 1405477 1316847 1234809 1159228 1089614 1025939 968857
56214 968857 918529 873683 832633 794843 760747 730509 703981 681488 663550 649871 639536
56203 639536 632043 627208 624243 621991 620095 618928 618438 618078 617857 618411 619963 622278 625677 630844 637415
56188 637415 643935 649569 654699 659458 662888 664227 664037 663318 662338 661008 659622 658426 657084 655368 653990
56173 653990 654087 656099 659595 663869 668345 672822 677703 683758 691426 700669 711465 723895 737638 752146
56159G52146J5386J7100J9364K1556K3949K7191L1046L4832L8835M4059N0805
56148A076269N8733O8087P9643R3494J09186J26879J47086J69161J91226K11497
56138B331261K28268K38426K37926K24998K02286J75232J48988J26989J11029
56129D025403J01012R4447Q7060P4744N5744L1721O893j4341k9667l9513m6523
56118D346980n4755o8509r0480j20255j54387j87699k14776k31534k36630k31521
56108B756434k18923k01423j81448j61306j42241j24142j06842r1133p7741o6258
56098A384977n5988m7094l9889l3781k8133k3450k0394j8226j5572j2364r645
56087A080441p824o396n145m279l529k325q17L57J122J914K851L876N210O727
$$ plain form
56159 752146 767532 784632 803996 825552 849501 876692 907738 942570 981405 1025464 1076269
56148 1076269 1135002 1203089 1282732 1376226 1485412 1612291 1759377 1928538 2119764 2331261
56138 2331261 2559529 2797955 3035881 3260879 3463165 3638397 3787385 3914374 4025403
56129 4025403 4126415 4220862 4307922 4382666 4438410 4470131 4477024 4462683 4433016 4393503 4346980
56118 4346980 4292225 4223716 4133236 4012981 3858594 3670895 3456119 3224585 2987955 2756434
56108 2756434 2537511 2336088 2154640 1993334 1851093 1726951 1620109 1528976 1451235 1384977
56098 1384977 1328989 1281895 1242006 1208225 1180092 1156642 1136248 1118022 1102450 1090086 1080441
56087 1080441 1072617 1066221 1061076 1056797 1053268 1050943 1050126 1050483 1051605 1053519 1056370 1060246 1065456 1072183
56073A072183P532P271P147Q320J0032J0788J0690J0912J1502J1522J1064J1257
56061A190220J2355J3518J4374J5268J6094J6449J6797J7922J9438K0326K0741
56050A373502K1638K2936K3755K4174K5014K6048K6323K6072K6449K7514K8326
56039A651751K8910L0181L1968L3058L3209L3263L3273L2518L1325L0946L1587
56028B001989L2461L3598L5686L8305M0423M2376M5200M8309N0244N1480N3903
56017B473974N7654O1092O3810O6956P0568P3505P6011P9533Q3790Q7047Q9430
56006C283370R2847R7437J01396J04691J09452J16078J22427J27622J33194J39638
55996D428152J45409J50392J56936J66201J76703J87513J99665K13469K27807
$$ plain form
56073 1072183 1079715 1086986 1094133 1102453 1112485 1123273 1133963 1144875 1156377 1167899 1178963 1190220
56061 1190220 1202575 1216093 1230467 1245735 1261829 1278278 1295075 1312997 1332435 1352761 1373502
56050 1373502 1395140 1418076 1441831 1466005 1491019 1517067 1543390 1569462 1595911 1623425 1651751
56039 1651751 1680661 1710842 1742810 1775868 1809077 1842340 1875613 1908131 1939456 1970402 2001989
56028 2001989 2034450 2068048 2103734 2142039 2182462 2224838 2270038 2318347 2368591 2420071 2473974
56017 2473974 2531628 2592720 2656530 2723486 2794054 2867559 2943570 3023103 3106893 3193940 3283370
56006 3283370 3376217 3473654 3575050 3679741 3789193 3905271 4027698 4155320 4288514 4428152
55996 4428152 4573561 4723953 4880889 5047090 5223793 5411306 5610971 5824440 6052247
55987F052247K42993K60906K81533L02898L25024L50104L78343M07936M39632
55978I041616M76714N19852N66982O18786O78751P47249Q21738R03877R99865
55969A5375430J112624J241089J389081J567251J784354K045371K361302K751580
55961B9628082L232257L809181M485801N269505O169437P201290Q401394R830703
55953G8027650J1569543J3723266J6423857J9789950K3865065K8578130L3655022
55946B25632483L8356035M1186065M0077224L3354194K0990848N108684j0855101
55939C93850432k3755502l1970644l5577308l5700683l3704439l0681009k7309948
55932A75150899k3941865k0744824j7808197j5180747j2879054j0898141r220815
$$ plain form
55987 6052247 6295240 6556146 6837679 7140577 7465601 7815705 8194048 8601984 9041616
55978 9041616 9518330 10038182 10605164 11223950 11902701 12649950 13471688 14375565 15375430
55969 15375430 16488054 17729143 19118224 20685475 22469829 24515200 26876502 29628082
55961 29628082 32860339 36669520 41155321 46424826 52594263 59795553 68196947 78027650
55953 78027650 89597193 103320459 119744316 139534266 163399331 191977461 225632483
55946 225632483 263988518 305174583 345251807 378606001 399596849 404705533 393850432
55939 393850432 370094930 338124286 302546978 266846295 233141856 202460847 175150899
55932 175150899 151209034 130464210 112656013 97475266 84596212 73698071 64477256
55925F4477256p817664o648802n674755m864098m189589l624326l146173k741092
55917B5770757k398295k106209j855606j641831j460562j304961j169285j051404
55909A2782604r49368q58991p76939p02882o36661n76578n21986m74160m32893
55900F852146l95495l60641l29956l04156k81052k59062k39521k23522k09425
55891D249316j95414j81939j69841j58547j47825j38832j31779j24801j16784
55882B883554j09068j02859r7178r0917q4808p9791p5421p1362o8483o6969o5246
55871A971452o2208n8736n5677n2297m8102m4214m1350l8242l3762k8966k5297
55860A482601k2118j7797j2155o250q85L165M302J048o512j6892k8015l7502m3514
$$ plain form
55925 64477256 56659592 50010790 44336035 39471937 35282348 31658022 28511849 25770757
55917 25770757 23372462 21266253 19410647 17768816 16308254 15003293 13834008 12782604
55909 12782604 11833236 10974245 10197306 9494424 8857763 8281185 7759199 7285039 6852146
55900 6852146 6456651 6096010 5766054 5461898 5180846 4921784 4682263 4458741 4249316
55891 4249316 4053902 3871963 3702122 3543575 3395750 3256918 3125139 3000338 2883554
55882 2883554 2774486 2671627 2574449 2483532 2398724 2318933 2243512 2172150 2103667 2036698 1971452
55871 1971452 1909244 1850508 1794831 1742534 1694432 1650218 1608868 1570626 1536864 1507898 1482601
55860 1482601 1460483 1442686 1430531 1424281 1423396 1426561 1430863 1431911 1425399 1408507 1380492 1342990 1299476
55847A299476m6284m7652m8490m7841m5194m1870l9065l6211l2601k9133k6857
55836H58278k5045k2380j9164j6698j5139j3523j1474r510p823n999l883j829
55824G05811j87Q87J186N66q67k881n139p018q034q534r331j0631j1931j2944
55810F30953j3631j3514j2162j0407r631r729r217p639o191n460m324k110j47
55797E26791j2j391k934m167n410o674p737q627r152q702p227n637m611m077m411
55782D46022o801j1293j5734j7973j8216j7959j7619j6542j4673j2737j1133r826
55770B75516q953q528p997p044o309o362o575o071n188m867n047m912m371m093
55756A89199m238m309m252m597n479o306o448n584l535m78K711M972N934N814
$$ plain form
55847 1299476 1253192 1205540 1157050 1109209 1064015 1022145 983080 946869 914268 885135 858278
55836 858278 833233 810853 791689 774991 759852 746329 734855 725345 717522 711523 707640 705811
55824 705811 705624 706511 707697 708263 707396 704515 699376 692358 684324 675790 666459 655828 643897 630953
55810 630953 617322 603808 591646 581239 571608 561879 552662 545023 538832 533372 529048 526938 526791
55797 526791 526779 525388 522454 518287 512877 506203 498466 489839 480687 471985 464758 459121 454510 450433 446022
55782 446022 439221 427928 412194 394221 376005 358046 340427 323885 309212 296475 285342 275516
55770 275516 266563 258035 250038 242994 236685 230323 223748 217677 212489 207622 202575 197663 193292 189199
55756 189199 184961 180652 176400 171803 166324 160018 153570 147986 144451 143973 146684 151656 157590 163404
55742A63404M815L145J394J87m14p56j002j158j288j325r86l22Q6o2l14k35j67
55725A65002n67j219j681k030k401k367j544m06K83N39R00J519K175K807L451
55710A64461L964M409N184O136O245N009L388K456J800M67j081j504p99m28j094
55695A98613j800j492m55N30J456K858M833O877Q500R644J0613J1619J2290J1893
55681B75979J0237Q025N992M227K792K271K808L279K536J099M14O03M11o59j614
55666C18400j812k138l620n950q212j0236j2295j3950j4306j3232j1593j0237
55654B10819r299q460p512o491n594n023m814m807m850n004n504o440p480p938
55640A21603p380o208n404n478n940n958n289m255l175k274j870k144k697k833
$$ plain form
55742 163404 168219 171364 172758 172945 172531 171775 170773 169615 168327 167002 166016 165694 165780 165718 165404 165169 165002
55725 165002 164435 163216 161535 159505 157104 154737 153193 152787 153070 153609 154509 156028 158203 161010 164461
55710 164461 168425 172834 178018 184154 190399 195408 198796 201252 203052 203519 202438 200934 200135 199707 198613
55695 198613 196813 195321 194866 195396 196852 199710 204543 211420 219920 229564 240177 251796 264086 275979
55681 275979 286216 294241 300233 304460 307252 309523 312331 315610 318146 319245 319659 320262 320673 320014 318400
55666 318400 316588 314450 310830 304880 296668 286432 274137 260187 245881 232649 221056 210819
55654 210819 201520 193060 185548 179057 173463 168440 163626 158819 153969 148965 143461 137021 129541 121603
55640 121603 114223 108015 102611 97133 91193 85235 79946 75691 72516 70242 68372 66228 63531 60698
55626F0698k294j432p36m48n52p53o43k10kl78q46o84J4M91M35K06Km73j286j860
55606D9249j659q69p9L97N33L10k57q76j119q40l90k93o77j013o67K47Q49N39
55588D3385k39n93k87J80L39J59k21o73j007j045p84k12P87K077L044L274L213
55571E1397L582M278M523M090L620L577L606L264K751K482K367K018J412Q72M89
55556I4328o5j059k232k945k810k108j520j330j158o08L3K27J05M26J540K841
55540H3665L436L119K425K012K155K637K991K858K267J481O99o0q04j526k259
55525A05096k976l476l594l512l574l868m209m521m955n522n888n627m631l253
55511D5490k150j889k505l383l771l423k715k281k472l068l363k788j573n56j46
$$ plain form
55626 60698 58404 56972 56236 55788 55236 54483 53840 53630 53628 53250 52404 51720 51734 52225 52660 52866 52868 52395 51109 49249
55606 49249 47590 46721 46642 47039 47572 47882 47625 46749 45630 44790 44400 44107 43430 42417 41750 41997 42846 43385
55588 43385 43146 42553 42266 42446 42785 42944 42723 42050 41043 39998 39214 39002 39789 41866 44910 48184 51397
55571 51397 54979 59257 63780 67870 71490 75067 78673 81937 84688 87170 89537 91555 92967 93839 94328
55556 94328 94263 93204 90972 88027 85217 83109 81589 80259 79101 78493 78526 78753 78858 79284 80824 83665
55540 83665 87101 90220 92645 94657 96812 99449 102440 105298 107565 109046 109745 109685 108881 107355 105096
55525 105096 102120 98644 95050 91538 87964 84096 79887 75366 70411 64889 59001 53374 48743 45490
55511 45490 43340 41451 38946 35563 31792 28369 25654 23373 20901 17833 14470 11682 10109 9553 9407
55496I407J70R19J645J394Q4j170j306m22N18P75M46J40J82K75j5n41o64k39L9
55477A1637l92j036r40p8N47J63q91j707j813j436j036q21n98o4P02J221J181
55460D639Q43O61O86O80N69M76M04K77J59J32O7j43l37m19o67j271j784j602q48
55441B522k23m3j3J09K43M20Q49J381J485R88L73J38K39L93N24O80P72P00N03
55422A2040K52p8m75p78p60l00M54J005Q41J06l28K18J369K152K131J599Q81K5
55404B0354q14j276j260j057r40r42j070j336j523j256m06P36J645J806J071L2
55388A3764l86p2Lp58j510j173k12j0p47j195o77O6K31pk26m10m09K17J170J246
55368H905k2j435j611p20R1K66j9o13j309j445o34L83N39q2m49j34K01p3p18F6
$$ plain form
55496 9407 9577 10496 12141 13535 13619 12449 11143 10721 11239 12014 12460 12600 12782 13057 13042 12501 11837 11598 11637
55477 11637 11245 10209 9269 9191 9738 9901 9010 7303 5490 4054 3018 2197 1599 1535 2237 3458 4639
55460 4639 5482 6143 6829 7509 8078 8554 8958 9235 9394 9526 9593 9450 9113 8694 8027 6756 4972 3370 2522
55441 2522 2299 2256 2243 2352 2595 3015 3864 5245 6730 7718 8091 8229 8468 8861 9385 10065 10837 11537 12040
55422 12040 12292 12214 11739 10961 10201 9901 10355 11360 12201 12307 11979 12197 13566 15718 17849 19448 20329 20354
55404 20354 19540 18264 17004 15947 15007 14065 12995 11659 10136 8880 8474 9210 10855 12661 13732 13764
55388 13764 13378 13306 13309 12551 11041 9868 9656 9646 8899 7704 7027 7093 7324 7317 7091 6681 6272 6489 7659 8905
55368 8905 8883 7448 5837 5117 5208 5474 5455 4842 3533 2088 1454 1837 2376 2294 1845 1711 1912 1839 1121 66
55347f23K52H43J536J133P10Q37J092P14j47o57o08n97q21o78K5M74Q0m10R3J298
55327D917J852J217L48J80L66M6p21j088p28k11k2j9o2m62j205j383k28J567K390
55308F754J599J22q66j173j210j120p57j92L11O46Q32P34J31r22j939G40e90b84
55289A321J641N17q03A233C8c41E6N28k9F1h6E12O97k7n89k53N97J268J631J762
55269E598J459P01M6k8K59M41M49L57K7m98p17l72Q2J78J23K17J12n69j393j669
55249D803j477j303I83k76O44Q69L60n4J3K3m06p71n25J35O56R10J087J241J247
55230F136J061O76J41k59q5P18J554J669R08j46o81l63L10M60k28j072j191n87
55212I021o5j29l85j82N24J164J190N40l54r14q37l29J39L27M02N80P50N14l07
$$ plain form
55347 -623 -371 843 2379 3512 4222 5059 6151 6865 6718 6061 5453 4856 4035 3357 3382 3856 3936 3526 3619 4917
55327 4917 6769 7986 8334 8514 8880 8926 8205 7117 6389 6178 6156 6137 6075 5613 4408 3025 2797 4364 6754
55308 6754 8353 8475 7609 6436 5226 4106 3349 3157 3468 4114 4946 5680 5811 4889 2950 740 -590 -284
55289 1321 2962 3479 2676 1233 38 -341 56 584 555 61 -86 512 1209 1182 593 340 937 2205 3836 5598
55269 5598 7057 7758 7804 7776 8035 8476 8925 9282 9309 8811 8094 7722 7804 7982 8105 8322 8434 7865 6472 4803
55249 4803 3326 2023 983 707 1351 2220 2580 2526 2539 2562 2156 1385 860 995 1651 2561 3648 4889 6136
55230 6136 7197 7873 8014 7755 7670 8388 9942 11611 12519 12373 11692 11329 11639 12099 11871 10799 9608 9021
55212 9021 8956 8827 8442 8260 8784 9948 11138 11678 11324 10410 9573 9244 9383 9710 10112 10692 11442 11956 11649
55193A1649j273j593j012j79Q1j73k29J06K05k75p21m70J36L18N9ML28M80J33
55174G574k74j32N83J302J398O86l48r07p35l73l02j99M47J243J228K39p94j092
55156I544q59o45m68RP98J516J780J492Q80M32N33J006J236Q36P2m88m70J42J114
55137A8460K053K556K480J984J404J052J034J035N04o55j763k015j369m46K54
55122B6568O38O38J36o69j313j586j648j567j180n41p3p2l11l30J00Q53J520J662
55104B2825J208O50N32P73Q56N35M5l88o61n27J97J065J263O78J49M08J196J762
55086C2566J738J253N67pj67lkl91p49o11j61J06J55L96R23J222P57l07j144j057
55066C5084k10N68P58P09R21J150Q05O5j69L84Q69M26o63j398j177j17J294K501
$$ plain form
55193 11649 10376 8783 7771 7592 7673 7500 7271 7377 7582 7307 6586 6116 6252 6570 6629 6633 6961 7441 7574
55174 7574 7300 7168 7751 9053 10451 11137 10789 9882 9147 8774 8472 8273 8720 9963 11191 11430 10636 9544
55156 9544 8685 8040 7572 7581 8379 9895 11675 13167 14047 14479 15012 16018 17254 18090 18162 17674 17204 17346 18460
55137 18460 20513 23069 25549 27533 28937 29989 31023 32058 32562 31907 30144 28129 26760 26314 26568
55122 26568 27206 27844 27980 27311 25998 24412 22764 21197 20017 19476 19403 19331 19020 18690 18790 19643 21163 22825
55104 22825 24033 24683 25215 25988 26844 27379 27424 27036 26375 25848 26045 27110 28373 29051 29200 29608 30804 32566
55086 32566 34304 35557 36124 36117 35950 35947 35945 35554 34805 34194 34033 34139 34294 34690 35613 36835 37592 37285 36141 35084
55066 35084 34874 35442 36200 36909 37830 38980 39785 39850 39681 40065 40934 41360 40697 39299 38122 38005 39299 41800
55048D1800L104L167K987K396Q63j355k855k501q42N95J023Q03N02L64N33R97
55032E1581J326J116O48N04N96L38k92o68n40l83n23o93q00j200j870k048j316
55015D5776m13k60p21j020r83j016j139r22l30J73L83N60P59O68K51q7j78l29
54997D1172o77q75p39o02o27l88L72J044Q96J74j92K40J152K133K982L489L623
54980E3177L882M721N712O034N841O230P654R268J0340J1344J2975J4835J6012
54967A68025J6525J7133J7901J7771J5786J1997P139J905l216p841j1691j4532
54955B36902j6164j6582j6106j5078j3614j1879j0390r489q786p613o002m679
54943A00520m080l876l540k898k014r93n5N36Q28J179J831K719L764M998O393
$$ plain form
55048 41800 44904 48071 51058 53454 54317 52962 50107 47606 46764 47359 48382 49185 49687 50051 50584 51581
55032 51581 52907 54023 54671 55175 55771 56109 55817 55149 54609 54226 53703 53010 52210 51010 49140 47092 45776
55015 45776 45363 45103 44382 43362 42379 41363 40224 39302 38972 39145 39528 40088 40847 41515 41766 41679 41501 41172
54997 41172 40495 39620 38881 38279 37652 37264 37636 38680 39576 39750 39558 39798 40950 43083 46065 49554 53177
54980 53177 57059 61780 67492 73526 79367 85597 93251 102519 112859 124203 137178 152013 168025
54967 168025 184550 201683 219584 237355 253141 265138 272277 274182 270966 263125 251434 236902
54955 236902 220738 204156 188050 172972 159358 147479 137089 127600 118814 111201 105199 100520
54943 100520 96440 92564 89024 86126 84112 83119 83064 83600 84428 85607 87438 90157 93921 98919 105312
54928A05312P856R443J1225J2950J4208J4969J5505J5707J4979J2920R738N855
54916B50667J529k973p191j0790j3678j5708j6620j6440j5597j4383j2731j0692
54904A15393q741p312o313n439m642m024l485k828k085j455j076r76j116j309
54890F4592j266q86l51J28M29M00r0q55j487j866k232k703l018k890k285j264
54874D4356m7O90K23j206k323k201j301p18q41j241j493j455r46J27J336J963
54858C4923J788J324J186J453J711J541Q91O5o36j172j536j480q12O8M61K91J43
54841D0209K91L18K1r7K71N05K7n73l00P22J437J442J436J973K705L138L437M038
54823F1000M907N582N739N532N520O339Q083J0050J1364J1981J2702J4103J5750
$$ plain form
54928 105312 113168 122611 133836 146786 160994 175963 191468 207175 222154 235074 244812 250667
54916 250667 252196 249223 242032 231242 217564 201856 185236 168796 153199 138816 126085 115393
54904 115393 106652 99340 93027 87588 82946 78922 75437 72609 70524 69069 67993 67017 65901 64592
54890 64592 63326 62440 62089 62217 62646 63046 62956 62101 60614 58748 56516 53813 50795 47905 45620 44356
54874 44356 44309 44999 45222 44016 41693 39492 38191 37473 36632 35391 33898 32443 31497 31624 32960 34923
54858 34923 36711 38035 39221 40674 42385 43926 44817 44882 44246 43074 41538 40058 39246 39314 39775 40066 40209
54841 40209 40500 40818 40839 40742 41013 41518 41545 40972 40672 41394 42831 44273 45709 47682 50387 53525 56962 61000
54823 61000 65907 71489 77228 82760 88280 94619 102702 112752 124116 136097 148799 162902 178652
54810A78652J6595J5919J3790J0821P597M187K22m289q443j1083j2031j2200j2373
54797A87364j2341j1533j0136q993q494q004o785n086l943l774l727k788j263
54784A00497m09o78j023l04J379L101M354N164N529N557N978P610J0303J2991
54770A60049J4843J5891J6500J6893J7113J6847J5248J1658O708K022j423m040
54758B88309o559q963j0852j2231j3289j3860j3731j3225j2880j2721j2330j1528
54746A46140j0514r467q399p389o581n950n339m775m403m125l652k989k556k653
54732F7348k949k773j891p99j90k50n10m49p7J38j24o14p75l29L77O62J72o95
54714E6272j137o99K93J107J246O92j77p74o29J72R60J185R75P58N53M9o68j040
$$ plain form
54810 178652 195247 211166 224956 235777 243374 247561 247783 243494 235051 223968 211937 199737 187364
54797 187364 175023 163490 153354 144361 135867 127863 121078 115992 112049 108275 104548 101760 100497
54784 100497 100088 99410 98387 98083 99462 102563 106917 112081 117610 123167 129145 136755 147058 160049
54770 160049 174892 190783 207283 224176 241289 258136 273384 285042 291750 293772 292349 288309
54758 288309 281750 272787 261935 249704 236415 222555 208824 195599 182719 169998 157668 146140
54746 146140 135626 126159 117760 110371 103790 97840 92501 87726 83323 79198 75546 72557 70001 67348
54732 67348 64399 61626 59735 58936 58746 58496 57986 57537 57460 57598 57474 56860 56085 55756 56133 56795 56967 56272
54714 56272 55135 54436 54729 55836 57082 57774 57597 56823 56194 56366 57326 58511 59486 60244 60797 60846 60178 59138
54696E9138p51p8N81J087J356J208P44M65O18P44K30p37j233n51J095K821L792
54679G0529L719K949K188J988K372K918L188L085K845K758K880L027L026K943
54665A10415K941L003K932K678K471K564K905L246L473L773M405N340O232O808
54651A63186P191P722Q443Q981Q957Q275O872M479J030k874o240q495r783j0534
54637A87210j0963j1047j0689r877q774p685o830o212n785n495n044l945k258
54624I2606q77n54q75q28l14j83p42j113n30N15J048R30O97M86k1p65j196j159
54606H7125j182j683k369k682k522k180j855j573j434j597j952k089j704r36k01
54591F1166J86J99l4l72p36j111j472j586j113j23O00K69q54j570j161k34K29
$$ plain form
54696 59138 58387 58309 58890 59977 61333 62541 63285 63750 64368 65112 65342 64605 63372 62821 63916 66737 70529
54679 70529 74248 77197 79385 81373 83745 86663 89851 92936 95781 98539 101419 104446 107472 110415
54665 110415 113356 116359 119291 121969 124440 127004 129909 133155 136628 140401 144806 150146 156378 163186
54651 163186 170377 178099 186542 195523 204480 212755 219627 224106 225136 222262 216022 207527 197744 187210
54637 187210 176247 165200 154511 144634 135860 128175 121345 115133 109348 103853 98809 94864 92606
54624 92606 91729 91175 90300 89472 89158 88975 88233 87120 86590 87105 88153 89083 89780 90266 90245 89480 88284 87125
54606 87125 85943 84260 81891 79209 76687 74507 72652 71079 69645 68048 66096 64007 62303 61367 61166
54591 61166 61352 61551 61517 61145 60409 59298 57826 56240 55127 55004 55604 55873 55019 53449 52288 52054 52283
54574E2283J27L4P8j33o17p91l78J48L23L63P50J484K090K189J805J323J208J520
54556F3806J679J052r1o75o6J210K269K897L410L849L933L645L376L425L664L773
54540A01156L637L461L630M310N129N317M409K654O84j080k566l790m695n177
54526A17079n183m827m416m176l962l486k821k357k205k022j600j217j106j013
54512G6688o23j15J26J35L07P79J250J296O91m04j326j303k98P31Q40J81l26k00
54494G8429K55O48R11R14L64o53j409j295o36l83r65j763j794p72O01J377J205
54477G5034M65k22m35j20L68M29k84j440k326k596k400j891j077k62l2m59q51
54460F1901o45j31R3Nj4J01J28O7R1J05o4j86J29P43J067Q19K84j50l54l20j44
$$ plain form
54574 52283 52410 52444 52522 52389 51772 50981 50603 50751 51074 51437 52187 53671 55761 57950 59755 61078 62286 63806
54556 63806 65485 66537 66446 65771 65705 66915 69184 72081 75491 79340 83273 86918 90294 93719 97383 101156
54540 101156 104793 108254 111884 116194 121323 126640 131049 133703 134387 133307 130741 126951 122256 117079
54526 117079 111896 107069 102653 98477 94515 91029 88208 85851 83646 81624 80024 78807 77701 76688
54512 76688 76065 75950 76076 76211 76518 77297 78547 79843 80534 80130 78804 77501 77203 77934 78774 78955 78629 78429
54494 78429 78684 79332 80243 81157 81521 80868 79459 78164 77528 77145 76180 74417 72623 71851 72452 73829 75034
54477 75034 75499 75277 74842 74722 75090 75519 75235 73795 71469 68873 66473 64582 63505 63243 63211 62752 61901
54460 61901 61256 61125 61218 61223 61209 61310 61438 61505 61596 61701 61637 61451 61580 62323 63390 64209 64493 64343 63989 63669 63525
54439F3525j17m03o38k95N43J246J485J508J501J205M38l96o94l35K34N02L31
54422F9640N5J27O04J032J015P14M94L32nk88L7J040K087K620K657K437K085J777
54404H8460J792K123K385K329K121J905J482P37N5q7J90K43l71j386k092k091
54388I7795j727j709k137k299j648o65k97p41j465k142k794l041k247o72M56M09
54372G5076j98n24n62n95m14J16M12N5l20P3Q32R96O68P51J317J503J116J026
54354H1328J580J877J284O79J235K681L713L727L253K842K363J520M05o65j481
54339A06341j986k229k369k500k454k018j310p51o60j040j745k601l324l548l126
54324G4680k364j795j668j686j331n36J64K70n9l31m99r06j427j351m60L82K29
$$ plain form
54439 63525 63408 63005 62367 62072 62615 63861 65346 66854 68355 69560 69998 69602 68908 68573 68807 69309 69640
54422 69640 69695 69822 70426 71458 72473 73187 73681 74013 74008 73720 73757 74797 76884 79504 82161 84598 86683 88460
54404 88460 90252 92375 94760 97089 99210 101115 102597 103334 103389 103302 103492 103735 103364 101978 99886 97795
54388 97795 96068 94359 92222 89923 88275 87610 87313 86572 85107 82965 80171 77130 74883 74211 74667 75076
54372 75076 74878 74354 73792 73197 72783 72899 73311 73366 73046 73119 73951 74947 75615 76366 77683 79186 80302 81328
54354 81328 82908 84785 86069 86748 87983 90664 94377 98104 101357 104199 106562 108082 108487 107822 106341
54339 106341 104355 102126 99757 97257 94803 92785 91475 90724 90064 89024 87279 84678 81354 77806 74680
54324 74680 72316 70521 68853 67167 65836 65300 65464 65734 65675 65344 64845 63939 62512 61161 60701 61083 61312
54307F1312o52j236j108p45m94k19k9m40j366j738q38M96P88j48r94o48N15J280
54289E3736R91Qq88j237j127q95o83l31K13N70K95m89j184j416j370j297j079
54272D3817m60M94J370J746J455P67K76M28J003J326J128Q51R34J166J054O35
54256E7990M06N49O89M90J32K1K17L81J77l75r44j237j269j288j461j699j768
54239E1011j496q38K0O67P80N67O23J122J429Q98j73p79l99M49Q93O58J75l9Q7
54220E5655K09M1k65l21r4j5l11n15o1P86J111N70r2l6N88R17N63N1M7N07Q24
54199F0159O18R3l62o79j003j267j201p72l26j53j79k49m31p93j120j135q41l86
54181D9973K06Q62J236J105Q10Q33J030Q09J02m24k71K78O11M59o2o93j055q72
$$ plain form
54307 61312 60660 59424 58316 57571 57077 56858 56829 56389 55023 53285 52447 52943 53731 53583 52589 51941 52456 53736
54289 53736 54727 54735 53847 52610 51483 50588 49905 49574 49787 50357 50652 50163 48979 47563 46193 44896 43817
54272 43817 43357 43851 45221 46967 48422 49189 49465 49893 50896 52222 53350 54201 55135 56301 57355 57990
54256 57990 58396 58945 59634 60124 60256 60277 60494 60875 61052 60677 59733 58496 57227 55939 54478 52779 51011
54239 51011 49515 48677 48697 49364 50144 50711 51334 52456 53885 54783 54610 53831 53432 53881 54774 55432 55607 55568 55655
54220 55655 55864 55905 55640 55319 55225 55210 54899 54384 54323 55109 56220 56790 56698 56662 57250 58167 58730 58781 58828 59335 60159
54199 60159 60777 60870 60508 59829 58826 57559 56358 55586 55260 55107 54928 54679 54248 53455 52335 51200 50359 49973
54181 49973 50179 51041 52277 53382 54192 55025 56055 56864 56966 56542 56271 56549 57160 57619 57557 56864 55809 54937
54163E4937l83k04m69n49P0R22J072K95o69r91n10L44J029J214Q80K51l58o70
54145E6211m82J48P50P38O5o43q13o12o11r48j171q79k47K14K49Q6R3K60J90l39
54125E2259r30r75n09j77k93l41K40J133J449Q67m2n56n59l71k61k11p0K32N72
54106E1457O66L17l53r04r55n50j87l24p77p98J4J058J350P52R8J4J69j2l96m79
54086E0160k61j99l47k69J95N79M18j22m87l14M16J463K341K432J522J99n48l03
54068E6875L49N95L89M16J004J562J411Q10N91R32J155Q42M72O43J179J499J439
54051G2163J224R78P42P17R99J209R52N04N44J240K097K615K727K540K198K003
54035I5452K227K747L122L228L436M094N089N948O182N638M740M213M299M406
$$ plain form
54163 54937 54554 54350 53881 53332 53402 54324 55396 55691 55022 54031 53521 53865 54894 56108 56988 57239 56881 56211
54145 56211 55729 55877 56627 57365 57430 56787 55974 55362 54751 53803 52632 51753 51506 51720 51969 52055 52148 52408 52598 52259
54125 52259 51329 50354 49845 49668 49375 49034 49274 50407 51856 52723 52681 52125 51566 51195 50934 50723 50653 50885 51457
54106 51457 52123 52440 52087 51183 50228 49678 49491 49167 48390 47592 47606 48664 50014 50766 50864 50878 51047 51035 50639 50160
54086 50160 49899 49700 49353 49084 49279 49858 50276 50154 49667 49353 49769 51232 53573 56005 57527 57726 57178 56875
54068 56875 57224 57819 58208 58624 59628 61190 62601 63411 64002 64934 66089 66931 67403 68046 69225 70724 72163
54051 72163 73387 74365 75107 75824 76823 78032 78984 79488 80032 81272 83369 85984 88711 91251 93449 95452
54035 95452 97679 100426 103548 106776 110212 114306 119395 125343 131525 137163 141903 146116 150415 154821
54021A54821L966L339L303L811M002L459K688K243K016J689J236P64K74j53m66
54006A86992j027k225l525l784k819j871j952k541k714k697l258m113m208l429
53992A46829k782k806k868k369j683j433j583j766j972k335k656k644k431k320
53978A15181k263j953j348o95j29M09Q13P60J24p04j072o69J50O89N55Qm02l84
53960A09070n3L32N26L14l30j019j182o54J54P91J202J518J718J732J702J918
53944A17739K451L130L782M376M937N492O013O383O414O028N355M583L728K687
53930A83098J423N7j190k073k383k047j211j64P93J480J969K572L461M355M776
53915A94916M683M554M683M752M460M217M731N970P030P193O717O339O259N870
$$ plain form
54021 154821 158787 162126 165429 169240 173242 176701 179389 181632 183648 185337 186573 187337 187611 187458 186992
54006 186992 185965 183740 180215 176431 173612 171741 169789 167248 164534 161837 158579 154466 150258 146829
53992 146829 144047 141241 138373 136004 134321 132888 131305 129539 127567 125232 122576 119932 117501 115181
53978 115181 112918 110965 109617 108922 108793 109202 110015 110775 110899 110195 109123 108454 108604 109293 109848 109856 109454 109070
53960 109070 109017 109349 109875 110189 109859 108840 107658 107004 107158 107949 109151 110669 112387 114119 115821 117739
53944 117739 120190 123320 127102 131478 136415 141907 147920 154303 160717 166745 172100 176683 180411 183098
53930 183098 184521 184578 183388 181315 178932 176885 175674 175510 176303 177783 179752 182324 185785 190140 194916
53915 194916 199599 204153 208836 213588 218048 222265 226996 232966 239996 247189 253906 260245 266504 272374
53901B72374M516K341L22o29o18n98j170j840j848j406j514k544l767m457m842
53886B54320n472o209o470o217o025o192o416o416o414o705p093p012o137m711
53872A66831l379k698k700k902k861k671k742l139l466l420l228l273l516l552
53858A23284l233k922l015l308l125k132r15m07q90j752k308k391k087j342k86
53843I3171M43K47o11j235j173p70m69k48O9L84M92M07K93K04O0j75m08l57K50
53824I0574J304K211K442K060J481R28N49P44J627K327J785L29m34L32J678K341
53808A12278K346K411K579K445K182K278K515K205J451J230K118L585M675M824
53794A49122M061L022K694L503M657N023M558M129L956L309J964R48J229K364
$$ plain form
53901 272374 276890 279231 279553 278924 278306 277708 276538 274698 272850 271444 269930 267386 263619 259162 254320
53886 254320 248848 242639 236169 229952 223927 217735 211319 204903 198489 191784 184691 177679 171542 166831
53872 166831 163452 160754 158054 155152 152291 149620 146878 143739 140273 136853 133625 130352 126836 123284
53858 123284 120051 117129 114114 110806 107681 105549 104634 104227 103337 101585 99277 96886 94799 93457 93171
53843 93171 93614 93861 93250 92015 90842 90072 89603 89355 89424 89808 90300 90707 91000 91204 91264 91089 90681 90324 90574
53824 90574 91878 94089 96531 98591 100072 101000 101549 102293 103920 106247 108032 108361 107927 108259 109937 112278
53808 112278 114624 117035 119614 122059 124241 126519 129034 131239 132690 133920 136038 139623 144298 149122
53794 149122 153183 156205 158899 162402 167059 172082 176640 180769 184725 188034 189998 190946 192175 194539
53780A94539L139K998K236J216J25p72j232j428j764k375l045l587l990m282m462
53765A77316m520m420m130l742l373k988k539k260k393k642k491k147k414l343
53751A33914l795k961j661j264j805k186j929j698j886j867j089j13R2n62j294
53736A09896j461j036k90L95N57M1n90n18K66Q35N11k40m96j45J76K35N21J253
53718A09910J795J501O66J6l27p25j123j116q45r53j454j463m57Q33J320R06L68
53701A08852K74N11P77R96J232J484J626J518J257J255J809K609L070L127L149
53686A33546L028K153N97m91k83O30J216J423J827K394K631K601K776L001K696
53671A59745K011J777K148K336J966J703K108K689K731K326K014J899J681J236
$$ plain form
53780 194539 197678 200676 202912 204128 204253 203481 202249 200821 199057 196682 193637 190050 186060 181778 177316
53765 177316 172796 168376 164246 160504 157131 154143 151604 149344 146951 144309 141818 139671 137257 133914
53751 133914 130119 127158 125497 124233 122428 120242 118313 116615 114729 112862 111773 111660 111752 111190 109896
53736 109896 108435 107399 107109 107504 108061 108102 107512 106994 107260 108095 108606 108366 107870 107725 107901 108136 108657 109910
53718 109910 111705 113206 113872 113888 113561 112836 111713 110597 109752 108799 107345 105882 105425 106258 107578 108484 108852
53701 108852 109126 109637 110414 111410 112642 114126 115752 117270 118527 119782 121591 124200 127270 130397 133546
53686 133546 136574 138727 139324 138833 138550 139180 140396 141819 143646 146040 148671 151272 154048 157049 159745
53671 159745 161756 163533 165681 168017 169983 171686 173794 176483 179214 181540 183554 185453 187134 188370
53657A88370O33j16q41j111p95m04m62p33n82J10P94R61N92Lm39n35m47n71r75
53638A83452j158o95M7K78j89p14p22l90k25k34P9Q81J515J153j49j357j552q92
53620A79128k26qk2L9J71L69P63J254J412R89L30K7L54J123J868K135J848J527
53602A93081J784K546L155L293L373L797M333M544M395M071L660L412L783M752
53588B43979N469N219M414M008M211M419M282M031L847L592L318L341L627L682
53574C01439L319L003L128L417L399L132K972K909K570J860J143Q17Q47Q95P15
53559C35565L18j32n07p67r12j002j153j449j842k217k525k696k539j934j099
53544C15109l91R5M24L77l29j339j805j511j233j599k168k214j787j359r05j72
$$ plain form
53657 188370 189003 188887 188046 186935 186140 185736 185274 184541 183959 184069 184863 185824 186416 186419 185980 185445 184998 184427 183452
53638 183452 182294 181599 181646 181924 181735 181021 180299 179909 179684 179450 179529 180410 181925 183078 182929 181572 180020 179128
53620 179128 178902 178894 178872 178911 179082 179451 180214 181468 182880 183869 184199 184226 184580 185703 187571 189706 191554 193081
53602 193081 194865 197411 200566 203859 207232 211029 215362 219906 224301 228372 232032 235444 239227 243979
53588 243979 249448 254667 259081 263089 267300 271719 276001 280032 283879 287471 290789 294130 297757 301439
53574 301439 304758 307761 310889 314306 317705 320837 323809 326718 329288 331148 332291 333108 333955 334850 335565
53559 335565 335883 335751 335244 334477 333565 332563 331410 329961 328119 325902 323377 320681 318142 316208 315109
53544 315109 314718 314813 315237 315614 315285 313946 312141 310630 309397 307798 305630 303416 301629 300270 299365 299193
53528B99193M68M33QO7Q23J664K230K688K978K746K238K260K937L467L481L700
53512C31381M705N922O556O769P186P853Q450R055R869J0567J0746J0742J1270
53499D41071J2454J3866J5205J6358J7015J7049J7119J8089J9877K1500K2314
53488F31917K2570K2794K3252K4025K5088K6108K6701K6974K7361K7934K8298
53477I13022K8230K7900K7509K7191K7271K8014K9081K9788L0009L0271L0821
53466A229107L1200L0956L0176K9084K7714K6231K5021K4061K2775K0896J8966
53455A516187J7592J6644J5811J5346J5596J6131J6086J5312J4358J3375J1774
53444A684212R214O273L698J458r92l814o636r221j1755j4340j6677j8465j9876
$$ plain form
53528 299193 299661 300094 300102 300169 300992 302656 304886 307574 310552 313298 315536 317796 320733 324200 327681 331381
53512 331381 336086 342008 348564 355333 362519 370372 378822 387877 397746 408313 419059 429801 441071
53499 441071 453525 467391 482596 498954 515969 533018 550137 568226 588103 609603 631917
53488 631917 654487 677281 700533 724558 749646 775754 802455 829429 856790 884724 913022
53477 913022 941252 969152 996661 1023852 1051123 1079137 1108218 1138006 1168015 1198286 1229107
53466 1229107 1260307 1291263 1321439 1350523 1378237 1404468 1429489 1453550 1476325 1497221 1516187
53455 1516187 1533779 1550423 1566234 1581580 1597176 1613307 1629393 1644705 1659063 1672438 1684212
53444 1684212 1693426 1699699 1703397 1704855 1703863 1700049 1693413 1684192 1672437 1658097 1641420 1622955 1603079
53431A603079k1241k2481k3254k3659k4256k5300k6393k7142k7694k8252k8544
53420A324863k8293k7880k7827k7871k7292k6132k5117k4343k2910k0352j7577
53409A049269j5804j5012j4166j2602j0546q448o442m464k405p2K682N732Q706
53396I76428J1235J3134J4518J5814J7369J8982K0143K0907K2014K3873K5934
53385A180351K7504K8704L0060L1528L2654L3543L4855L6861L9132M1250M3331
53374A559773M5727M8580N1692N4544N6541N7671N8762O0587O2792O4310O4744
53363B185723O4661O4525O4091O3091O1736O0167N8059N5223N2057M8957M5719
53352B824009M2155L8799L6358L4693L3002L0915K8731K6552K3826K0024J5385
$$ plain form
53431 1603079 1581838 1559357 1536103 1512444 1488188 1462888 1436495 1409353 1381659 1353407 1324863
53420 1324863 1296570 1268690 1240863 1212992 1185700 1159568 1134451 1110108 1087198 1066846 1049269
53409 1049269 1033465 1018453 1004287 991685 981139 972691 966249 961785 959380 959308 961990 967722 976428
53396 976428 987663 1000797 1015315 1031129 1048498 1067480 1087623 1108530 1130544 1154417 1180351
53385 1180351 1207855 1236559 1266619 1298147 1330801 1364344 1399199 1436060 1475192 1516442 1559773
53374 1559773 1605500 1654080 1705772 1760316 1816857 1874528 1933290 1993877 2056669 2120979 2185723
53363 2185723 2250384 2314909 2379000 2442091 2503827 2563994 2622053 2677276 2729333 2778290 2824009
53352 2824009 2866164 2904963 2941321 2976014 3009016 3039931 3068662 3095214 3119040 3139064 3154449
53341C154449J0572N754K91o727j5660k6027l6731m6488n4228n9488o2702o4936
53329B798079o6973o8618o9166o8470o7226o6084o4939o3441o1832o0860o0916
53318B079554o1581o2058o1833o0939n9708n8350n6703n4417n1371m7798m4063
53307A460733m0502l7370l4624l1726k8085k3933k0358j8195j7179j6434j5483
53296A176844j4324j2924j1244r614q493p804p027o016n167m600l766k181k00
53283A083484J425K442L227M098N053O121P499R164J0786J2253J3976J6302J8791
53270A194621K0619K1679K2765K4437K6135K6918K6788K6679K7168K7818K7976
53259A473603K7692K7448K7353K7022K6110K4620K2864K1357K0557K0359J9920
$$ plain form
53341 3154449 3165021 3170775 3171066 3164339 3148679 3122652 3085921 3039433 2985205 2925717 2863015 2798079
53329 2798079 2731106 2662488 2593322 2524852 2457626 2391542 2326603 2263162 2201330 2140470 2079554
53318 2079554 2017973 1955915 1894082 1833143 1773435 1715085 1658382 1603965 1552594 1504796 1460733
53307 1460733 1420231 1382861 1348237 1316511 1288426 1264493 1244135 1225940 1208761 1192327 1176844
53296 1176844 1162520 1149596 1138352 1128738 1120245 1112441 1105414 1099398 1094231 1089631 1085865 1083684 1083484
53283 1083484 1084909 1087351 1090578 1094676 1099729 1105850 1113349 1122513 1133299 1145552 1159528 1175830 1194621
53270 1194621 1215240 1236919 1259684 1284121 1310256 1337174 1363962 1390641 1417809 1445627 1473603
53259 1473603 1501295 1528743 1556096 1583118 1609228 1633848 1656712 1678069 1698626 1718985 1738905
53248A738905J8397J5786J2748R700O527L141j70l209o261r773j3862j8324k2876
53235A730729k7125l0514l2668l3765l4369l4897l5434l5952l6442l6756l6557
53224A356250l5575l3807l1489k9093k7340k6880k7631k8617k8869k8459k8279
53213A030211k8760k9263k9027k8206k7476k6888k5722k3504k0581j7561j4753
53202G58470j2373j0807j0216j0224j0301j0274j0155r827r348r194r715j0538
53190F35498j1010j1049j0999j0870j0398r811r691r942r750q921q422q982r837
53177E05816r749q772q137q477r151r409r325r269r223r070r030r258r381r024
53163C78541q487q298q277p732o555n528n345n820o292o357n988n358m848m776
$$ plain form
53248 1738905 1757302 1773088 1785836 1795536 1802063 1805204 1805034 1801825 1795564 1785791 1771929 1753605 1730729
53235 1730729 1703604 1673090 1640422 1606657 1572288 1537391 1501957 1466005 1429563 1392807 1356250
53224 1356250 1320675 1286868 1255379 1226286 1198946 1172066 1144435 1115818 1086949 1058490 1030211
53213 1030211 1001451 972188 943161 914955 887479 860591 834869 811365 790784 773223 758470
53202 758470 746097 735290 725074 714850 704549 694275 684120 674293 664945 655751 646036 635498
53190 635498 624488 613439 602440 591570 581172 571361 561670 551728 541978 533057 524635 515653 505816
53177 505816 496067 487295 479158 470681 461530 452121 442796 433527 424304 415234 406204 396946 387565 378541
53163 378541 370054 361756 353479 345747 339192 333664 328319 322499 316207 309850 303862 298504 293656 288880
53149B88880m855m306k967j824j877k828l545l596l402l079k155o80L58K99k34
53134B54189k87J22L61L75N93Q92O12l34j118j077n58l35o96j359k010k515k803
53117B44052k815k595k299k149k370l008l774m245m309m171l946l441k481j281
53103B01168l92k80r99k053k680k471j870j742k380l123l176k541j868j555j420
53088A72618j311j574k548l785m267l558k344j597j470j447j318j401j746j803
53074A42449j228n50n23j107j576j495j148r85j046r81m99K46O65L07n03r75q80
53057A30171q11j166j505j318q66n58j57N69R24J58j047j245l33K50l14j167j248
53040A20337o86j15L24N70K08p16j292r79n15p30j153q45lL83J12k08m13q72j400
$$ plain form
53149 288880 284025 279719 276752 274928 273051 270223 266678 263082 259680 256601 254446 253766 254124 254423 254189
53134 254189 253902 254024 254385 254760 255353 256245 256857 256523 255405 254328 253770 253435 252739 251380 249370 246855 244052
53117 244052 241237 238642 236343 234194 231824 228816 225042 220797 216488 212317 208371 204930 202449 201168
53103 201168 200776 200496 199497 197444 194764 192293 190423 188681 186301 183178 180002 177461 175593 174038 172618
53088 172618 171307 169733 167185 163400 159133 155575 153231 151634 150164 148717 147399 145998 144252 142449
53074 142449 141221 140671 140148 139041 137465 135970 134822 133837 132791 131810 131311 131557 132222 132529 132026 131051 130171
53057 130171 129360 128194 126689 125371 124505 123947 123790 124359 125283 125441 124394 123149 122816 123066 122752 121585 120337
53040 120337 119651 119536 119860 120430 120638 119922 118630 117651 117136 116406 115253 114408 114405 114788 114900 114692 114279 113407 112007
53021A12007j244l24M90O16L92K48M1m08q13r07q78j039j350j603j732j810j889
53004I9797j976j822r83N45J870K007J126L48L32O61P48O29O47R47J503K140K423
52987A10942K120J831K437L713M328L586K353J778J918K171K357K539K343J394
52973A45810Q6q50j328j723k005j805j219p96o92n23j31J33p5o04j026j060q05
52956A31387p54j312k074j985p05O13O40l58r53n21K12N22O04P70Q00N71N93J222
52938A29272J954K095J759J526J473J229P83N74Q12J155J198Q68L75J4k0J55R3
52921A45315m89j200j263l82Q66J595J423P48K47K23M15M72M26N52Q25R20P87
52904A51480Q40J343J874J802J101L91K23N94J100J351J245R94Q82R94J185J310
$$ plain form
53021 112007 110763 110439 110929 111545 111937 112185 112226 111818 111005 110098 109220 108181 106831 105228 103496 101686 99797
53004 99797 97821 95999 95016 95561 97431 99438 100564 100912 101244 101905 102653 103282 103929 104876 106379 108519 110942
52987 110942 113062 114893 117330 121043 125371 128957 131310 133088 135006 137177 139534 142073 144416 145810
52973 145810 145896 145046 143718 141995 139990 138185 136966 136170 135478 134955 134824 134957 134882 134278 133252 132192 131387
52956 131387 130633 129321 127247 125262 124557 125170 125810 125452 124499 123978 124190 124712 125316 126086 126886 127457 128050 129272
52938 129272 131226 133321 135080 136606 138079 139308 140091 140665 141477 142632 143830 144698 145073 145087 145067 145222 145315
52921 145315 144826 143626 142363 141981 142847 144442 145865 146613 146860 147083 147498 147970 148396 148948 149773 150693 151480
52904 151480 152320 153663 155537 157339 158440 158831 159054 159648 160748 162099 163344 164338 165220 166214 167399 168709
52888A68709J281R73M18Q6N31J517K068J740J291J534K021J687N73j13L11J112
52872A85739J314R07M88K77J22Q1L66Q89J342J661J998K348K550K653K848L051
52856B08634K915K385J905J883K109J944J081r9j024j587k126k776l190l053k589
52841B06412k268k191k129k071k226k541k656k456k259k283k317k078j589r81
52827A76367l40P1j09p55j217j162j056j341j651j427r29q79j333j597j307q28
52811A60507n63n32p68j482k539l253k983j775k24Q97J013J29r58j324q83l03
52795A44959K3K69L91j21j283k142j922j118p41r54j152j139j240j461j354q77
52779A30138n74p11q48o22l82o30j292j896k180k114j661j002o60r40j377j201
$$ plain form
52888 168709 169990 170963 171381 171467 171998 173515 175583 177323 178614 180148 182169 183856 184429 184316 184627 185739
52872 185739 187053 187960 188448 188725 188847 188928 189294 190183 191525 193186 195184 197532 200082 202735 205583 208634
52856 208634 211549 213934 215839 217722 219831 221775 222856 222757 221733 220146 218020 215244 212054 209001 206412
52841 206412 204144 201953 199824 197753 195527 192986 190330 187874 185615 183332 181015 178937 177348 176367
52827 176367 176027 176098 175989 175234 174017 172855 171799 170458 168807 167380 166451 165572 164239 162642 161335 160507
52811 160507 159944 159412 158644 157162 154623 151370 148387 146612 146388 147285 148298 148427 147469 146145 145262 144959
52795 144959 144982 145251 145642 145521 144238 142096 140174 139056 138315 137361 136209 135070 133830 132369 131015 130138
52779 130138 129564 128853 128005 127383 127001 126371 125079 123183 121003 118889 117228 116226 115566 114626 113249 112048
52763A12048m05J93L2n22q08q14j050j660k108j889j259r89j443k114k223j591
52747I3398p88l76l27k72r9kj1Q0K42O1o53j424j577j053m12j06j09j87k06j09
52727H6070Q2J55n1l36k98O3L42L63M14O43P73O70P01J112J485J326Q24M74K63
52708I5075m4j55L74J151J150J13j020j366j111r38j004r76o70l18k93p80j514
52691H7674j838j423p98p50j171j250q04n61q21q46j46M95J45p96j221r35o46
52674G4308o44n58l54m84r16r39k67M55N82K97J01N0q7l01m18l96k30K16Q77J238
52654G2530Q28o8n72j94N24N94k59j243j462j015o98p35m64M73J276J006K6l99
52636G0148J46P40M84l24p25k74O11J210J140O69M57Q26J258J015J84l89k22K64
$$ plain form
52763 112048 111643 111836 111868 111346 110538 109724 108674 107014 104906 103017 101758 100769 99326 97212 94989 93398
52747 93398 92610 92234 91907 91635 91536 91534 91523 91603 91845 91906 91253 89829 88252 87199 86787 86681 86572 86385 86179 86070
52727 86070 86152 86307 86256 85920 85622 85685 86027 86390 86804 87447 88220 88890 89591 90703 92188 93514 94338 94812 95075
52708 95075 95031 94876 95250 96401 97551 97664 96644 95278 94167 93229 92225 91249 90579 90261 89968 89188 87674
52691 87674 85836 84413 83615 82865 81694 80444 79640 79079 78258 77412 77266 77761 77906 77110 75889 74954 74308
52674 74308 73664 73106 72752 72268 71352 70413 70146 70601 71183 71480 71581 71631 71544 71243 70825 70429 70199 70415 71292 72530
52654 72530 73358 73290 72718 72524 73048 73642 73383 72140 70678 69663 68965 68230 67766 68239 69515 70521 70547 70148
52636 70148 70294 71034 71518 71194 70469 70195 70806 72016 73156 73825 74282 75108 76366 77381 77565 77176 76954 77218
52618G7218N01N25O64R37J138J166R99N54o1m26k18M09J049J493J755J850J771
52601I1324J554J232Q65O40P45J057J213J043O99L72J79L15Q05J115O28l06m61
52584A03019P59K392L023K345J187L74J25K93O22Q35Q05O41L82o9m68j97Q98J995
52566A18961K205J644J053P34N41N43R12J297J169P45P09J032R15J26n38m79j63
52549A31406k60o09o51l88k45l05l04k30l22n49n91k81K49Q29J343J567J311P07
52531A32677J58p7m6O9J05l2k62l44j30K26M95P03R71J147R32L35k62n68o10m60
52511A35027n1O07J220J461J299R71O92N24M18L38L35N41R55J254J073N15J23
52494A47302K40N38M67m8o09r18j024j046j007r36q23n02J76Q76R56K55o02r62
$$ plain form
52618 77218 77719 78244 78908 79845 80983 82149 83148 83702 83641 83215 82997 83406 84455 85948 87703 89553 91324
52601 91324 92878 94110 94975 95615 96360 97417 98630 99673 100372 100744 100923 101238 102043 103158 103786 103480 103019
52584 103019 103778 106170 109193 111538 112725 113099 113224 113517 114139 114974 115779 116420 116802 116733 116265 116068 116966 118961
52566 118961 121166 122810 123863 124597 125138 125681 126593 127890 129059 129804 130513 131545 132460 132586 132048 131569 131406
52549 131406 131146 130537 129886 129498 129253 128948 128644 128414 128092 127543 126952 126671 126920 127749 129092 130659 131970 132677
52531 132677 132835 132758 132712 132781 132886 132854 132592 132248 132118 132344 132839 133542 134513 135660 136592 136927 136665 136097 135487 135027
52511 135027 134976 135583 136803 138264 139563 140534 141226 141750 142168 142506 142841 143382 144337 145591 146664 147179 147302
52494 147302 147542 148080 148547 148499 147890 146972 145948 144902 143895 142959 142136 141634 141810 142686 143642 143897 143295 142333
52476A42333r11r97j442j997k430k728k852k651k076j257l58L91O31J68o64j233
52460A21927j260r48o02m08n10q38r12k96O18Q99L01l64l28J98O22R19J322J555
52442A21895J123K34k95r2L98O26N45L77K55K57M55P62R31Q62O72M48J86OP3K92
52422A30010L86L88N87R51R78M32j75j94L25P55P41N28N32Q19J174J413J506J433
52404A42589J079M08k45k97M42J358J617J142O67P29J067J186J126J222J452J445
52388A56987J098P34O31P28P78N78N9n47p05n7J022J705J595J016M56J00L6M10
52370A66624J096J616J705J657J708J477N77n59j039o27J24Q48J665K424K377
52355A81673J202k44p42p1R16J392J338J266J572K161K511K223J563J247J583
$$ plain form
52476 142333 141422 140425 138983 136986 134556 131828 128976 126325 124249 122992 122634 123025 123656 123824 123160 121927
52460 121927 120667 119719 119117 118709 118199 117361 116449 116153 116771 117670 117971 117607 117279 117477 118099 119018 120340 121895
52442 121895 123018 123252 122957 122865 123263 123889 124434 124811 125066 125323 125778 126540 127471 128333 129005 129453 129639 129645 129718 130010
52422 130010 130396 130784 131371 132322 133300 133732 133557 133363 133688 134443 135184 135712 136244 137063 138237 139650 141156 142589
52404 142589 143668 144076 143831 143534 143976 145334 146951 148093 148760 149489 150556 151742 152868 154090 155542 156987
52388 156987 158085 158819 159450 160178 160956 161534 161593 161046 160341 160284 161306 163011 164606 165622 166078 166178 166214 166624
52370 166624 167720 169336 171041 172698 174406 175883 176460 175901 174862 174235 174359 175207 176872 179296 181673
52355 181673 182875 182631 181889 181818 182734 184126 185464 186730 188302 190463 192974 195197 196760 198007 199590
52340A99590K173K615K930L013K353R37j53O2J104J804K018K432K920K548J373
52325B27719P56J345K027J726R56O60N96J15k99K54J319J531P42K25P70J713K212
52308B44367K277K202J947J578J523J853K106K208K836M274N613N803N031M365
52294B87983M348M643M840M942N086N306N701O436P458Q407Q864Q602P741O827
52280C77184O554P159Q109Q625Q454Q014P843Q129Q656R095R355R661J0216J0808
52266D97862J1012J0754J0390J0141R852R467R315R619J0018J0013R640R315R159
52253F26557Q875Q293P630P150O869O623O222N511M527L569K872K301J603R46
52239F99548P75J040J032L52l47q6J083K087K278K338L225M700N622N609N526
$$ plain form
52340 199590 201763 204378 207308 210321 212674 213611 213458 213520 214624 216428 218446 220878 223798 226346 227719
52325 227719 228475 229820 231847 233573 234529 235189 235785 235900 235601 235855 237174 238705 239447 239672 240442 242155 244367
52308 244367 246644 248846 250793 252371 253894 255747 257853 260061 262897 267171 272784 278587 283618 287983
52294 287983 292331 296974 301814 306756 311842 317148 322849 329285 336743 345150 354014 362616 370357 377184
52280 377184 383738 390897 399006 407631 416085 424099 431942 440071 448727 457822 467177 476838 487054 497862
52266 497862 508874 519628 530018 540159 550011 559478 568793 578412 588430 598443 608083 617398 626557
52253 626557 635432 643725 651355 658505 665374 671997 678219 683730 688257 691826 694698 696999 698602 699548
52239 699548 700323 701363 702395 702747 702400 702314 703397 705484 707762 710100 713325 718025 723647 729256 734782
52224G34782O067O674O523N992O206P428Q826R885J0973J2287J3133J2927J2178
52211H53881J1754J1617J1114J0210R592R528R430Q756P761O993O443N562M015
52198I66656K142O99J54J55k46j667l687n294n967o101o310o654o761o525o369
52183I14225o808p869q955r375q954q163p582p374p305p180p051p052p205p469
52169H05883p739p835p567o876n861m672l530k776k644k969l258l224l041l035
52155G40856l254l484l563l498l319l022k641k234j773j245q57r51j550k149k247
52140G05069k006k063k645l214l216k935l158m111n094n333m836m287m219m583
52126F53369m976n138n128n137n201n138m812m330l917l673l614l784m126m325
$$ plain form
52224 734782 740849 747523 754046 760038 766244 773672 782498 792383 803356 815643 828776 841703 853881
52211 853881 865635 877252 888366 898576 908168 917696 927126 935882 943643 950636 957079 962641 966656
52198 966656 968798 969497 969651 969806 969560 967893 964206 958912 952945 946844 940534 933880 927119 920594 914225
52183 914225 907417 899548 890593 881218 872264 864101 856519 849145 841840 834660 827609 820557 813352 805883
52169 805883 798144 790309 782742 775866 770005 765333 761803 759027 756383 753414 750156 746932 743891 740856
52155 740856 737602 734118 730555 727057 723738 720716 718075 715841 714068 712823 711966 711015 709465 707316 705069
52140 705069 703063 701000 698355 695141 691925 688990 685832 681721 676627 671294 666458 662171 657952 653369
52126 653369 648393 643255 638127 632990 627789 622651 617839 613509 609592 605919 602305 598521 594395 590070
52112E90070m094l607l321l308l045k122q45J11M04J86k71p85j074p67L19J925
52096E69776L509M669N369N785N943N777N531N818O960Q452R494R942J0264J0719
52082F68008J1124J1559J2518J4077J5489J6067J5978J5764J5544J5296J5403
52071H26827J6180J7102J7347J6934J6568J6423J5896J4658J3175J1933J0912
52060I93955J0101R785R853R420P854N740M179L383K649J553M05n05j428k612
52046A054332l794m668n464o602p938q836q952q595q225p986p858p945q329q784
52032I50356q952q747q289p555o408n031l954l504l440l205k452j157M84K090
52018H90236L244L762L836L798L862M125M579M998N079M848M718M922N132M881
$$ plain form
52112 590070 585976 582369 579048 575740 572695 570573 569728 569839 570243 570429 570158 569373 568299 567532 567851 569776
52096 569776 573285 577954 583323 589108 595051 600828 606359 612177 619137 627589 637083 647025 657289 668008
52082 668008 679132 690691 703209 717286 732775 748842 764820 780584 796128 811424 826827
52071 826827 843007 860109 877456 894390 910958 927381 943277 957935 971110 983043 993955
52060 993955 1004056 1013841 1023694 1033114 1040968 1046708 1050887 1054270 1056919 1058472 1058877 1058372 1056944 1054332
52046 1054332 1050538 1045870 1040406 1033804 1025866 1017030 1008078 999483 991258 983272 975414 967469 959140 950356
52032 950356 941404 932657 924368 916813 910405 905374 901420 897916 894476 891271 888819 887662 888146 890236
52018 890236 893480 897242 901078 904876 908738 912863 917442 922440 927519 932367 937085 942007 947139 952020
52004I52020M099L071K082J385J146J040K02j887m602o827q265r518j0921j2058
51990I10967j2666j3387j5079j7701k0298k1957k2519k2506k2665k3435k4569
51979F94185k5292k4988k3821k2529k1658k1107k0407j9363j8331j7820j7821
51968D61048j7689j6864j5550j4486j4007j3654j2807j1455j0108r121q335p449
51956C09523o499n779n332m790l856k815k269k384k738k953l040l012k578j682
51942B59796r29r62j643k321k757l200l598l502k843k313k542l321l871l730l156
51927B19108k766k900l264l276k809k363k303k283j885j517j869k685k977k533
51913A83678k323k998l906m057l394k434j350j91M61j3j234k069j923j222o80
$$ plain form
52004 952020 956119 959190 961272 962657 963803 964843 965045 963158 958556 951729 943464 933946 923025 910967
51990 910967 898301 884914 869835 852134 831836 809879 787360 764854 742189 718754 694185
51979 694185 668893 643905 620084 597555 575897 554790 534383 515020 496689 478869 461048
51968 461048 443359 426495 410945 396459 382452 368798 355991 344536 334428 325307 316972 309523
51956 309523 303024 297245 291913 287123 283267 280452 278183 275799 273061 270108 267068 264056 261478 259796
51942 259796 258867 257905 256262 253941 251184 247984 244386 240884 238041 235728 233186 229865 225994 222264 219108
51927 219108 216342 213442 210178 206902 204093 201730 199427 197144 195259 193742 191873 189188 186211 183678
51913 183678 181355 178357 174451 170394 167000 164566 163216 163025 163486 163473 162239 160170 158247 157025 156345
51898A56345n81q26j135j121o01N7K45j69p15r79j005j054j183j202q78j82N40
51881A45556P82M33m9k80m62r06j288j018j80M55M52K18K68N90R26J209J442J480
51863A49628J326J313J641J914J588P47J23K88J119J990K305J873R65J35j65R9
51847A66889N99R75J044P44R0p50j430j654j442j065o97k11N38J295J507R35J0
51830A67377n59m71m3J79o5n53q29o48k12J43L53N75P99Q06O44P42J303J894J948
51811A73383J480R73P78R14J273J619J617J268J186J845K768L010K440J926K115
51796A98595K735L271L666M025M196M136M234M760N406N791O068O456O523N658
51782B65520M033K461J295J09j459l080m143m394l981l255k616k231j873j246
$$ plain form
51898 156345 155764 154938 153803 152682 152081 152138 152383 152214 151499 150520 149515 148461 147278 146076 145198 145016 145556
51881 145556 146338 146771 146722 146442 145980 145074 143786 142768 142588 143043 143495 143713 143981 144571 145497 146706 148148 149628
51863 149628 150954 152267 153908 155822 157410 158157 158280 158568 159687 161677 163982 165855 166820 166955 166790 166889
51847 166889 167488 168463 169507 170251 170341 169591 168161 166507 165065 164000 163303 163092 163630 164925 166432 167367 167377
51830 167377 166818 166347 166304 166483 166418 165865 165036 164388 164176 164319 164672 165247 166046 166852 167496 168238 169541 171435 173383
51811 173383 174863 175836 176614 177528 178801 180420 182037 183305 184491 186336 189104 192114 194554 196480 198595
51796 198595 201330 204601 208267 212292 216488 220624 224858 229618 235024 240815 246883 253339 259862 265520
51782 265520 269553 272014 273309 273418 271959 268879 264736 260342 256361 253106 250490 248259 246386 245140
51768B45140n40k62m87p08n10NO21J263J741J668J062N91P44J090Q26j82j280
51751B50782j846j740j097j75O27J007J105J279J519J424Q11k5o52q37m96K60
51735B51946Q89P21k50j180j281p08l28p59j863k947l267k549j326o61j143k240
51719B33054k842k434j520q78p62r43j200j481j669j542j099p60r15j376j512
51704B12121j082n93o31j082j348j168q12n69m93n74p02m77L65J303J507J063
51688B06828J047J989L095L561L866M872O193O468N158L003Q34j229l234m917
51674B37534o023o537o354n342l888k776k319k155k080k422l327m281m701m447
51660A80882l561k130p58l59r59j413r58l24n39j255j371q89r14j854k807k945
$$ plain form
51768 245140 244600 244338 243851 243143 242633 242638 243259 244522 246263 247931 248993 249584 250328 251418 252244 252062 250782
51751 250782 248936 247196 246099 245924 246551 247558 248663 249942 251461 252885 253696 253671 253019 252182 251686 251946
51735 251946 252835 253556 253306 252126 250845 250137 249809 249050 247187 244240 240973 238424 237098 236437 235294 233054
51719 233054 230212 227778 226258 225380 224618 223675 222475 220994 219325 217783 216684 215924 215009 213633 212121
51704 212121 211039 210446 209815 208733 207385 206217 205405 204836 204343 203769 203067 202590 202955 204258 205765 206828
51688 206828 207875 209864 212959 216520 220386 225258 231451 237919 243077 246080 246914 245685 242451 237534
51674 237534 231511 224974 218620 213278 209390 206614 204295 202140 200060 197638 194311 190030 185329 180882
51660 180882 177321 175191 174433 174074 173115 171702 170744 170420 169881 168626 167255 166366 165452 163598 160791 157846
51644A57846k567k299k099j583p98r9L32M28L9p16j199q57l8L27j54q50q98j99
51626A44616N41O44J54l24l65j08J9j43m06m98l08J20N43O50L70L5qJ55J93J13
51606A45993K25O16J009J280J624K100K386K306K163K239K406K575L204M596O029
51591A80751O308N299M106L515L102K311J618J756K288J962M82j079j757j764
51577B08898j635j228j93J040J650J572J489J756K011J951J889K300L182M046
51563B28728M293L578K196J104J087J780J961R53o65j970k735l205l340k923k183
51548B28659j726j807k112k290k345k399k359k015j418j010j284k190k988k916
51534A99800j986r07k08J77M32M51J69p2J03N99J050J301J403J349J155J072J269
$$ plain form
51644 157846 155279 152980 150881 149298 148500 148401 148733 149161 149200 148484 147285 146428 146390 146717 146563 145713 144815 144616
51626 144616 145157 145801 145955 145631 145266 145158 145177 145034 144628 144130 143822 143942 144485 145135 145505 145540 145532 145687 145880 145993
51606 145993 146218 146834 147843 149123 150747 152847 155233 157539 159702 161941 164347 166922 170126 174722 180751
51591 180751 187059 192358 196464 199979 203081 205392 207010 208766 211054 213016 213498 212419 210662 208898
51577 208898 207263 206035 205842 206882 208532 210104 211593 213349 215360 217311 219200 221500 224682 228728
51563 228728 233021 236599 238795 239899 240986 242766 244727 245680 245015 243045 240310 237105 233765 230842 228659
51548 228659 226933 225126 223014 220724 218379 215980 213621 211606 210188 209178 207894 205704 202716 199800
51534 199800 197814 196907 196699 196876 197308 197759 197928 197856 197959 198558 199608 200909 202312 203661 204816 205888 207157
51517B07157J501J336O54k89j126j458r60K52J493K141K170J905J523J159J134
51502B18592J522J776J390P26M69N27K72k49k48N07J270J513J697K317K954K968
51486B38003K548K317K317K175K041K499L555M524N042N498O138O409N704M355
51472B93125L362L314L997M827N133M252K009o66k336k549k358k883l930m489
51458C00808m235l773l666l969m589n332n582m846l793l704m582m808l384j511
51444B43034r86j773k313j829j007m85KO80R64K34j185k340k627k245j856j997
51428B24271k617l182l409l644m217m733m589l988l672l765l656l149k829l062
51414A73759l419l412l170k915k394j372k73J59k60j001j403j285j042j195j709
$$ plain form
51517 207157 208658 209994 210648 210359 209233 207775 206815 207067 208560 210701 212871 214776 216299 217458 218592
51502 218592 220114 221890 223280 224006 224475 225002 225274 225025 224777 225284 226554 228067 229764 232081 235035 238003
51486 238003 240551 242868 245185 247360 249401 251900 255455 259979 265021 270519 276657 283066 288770 293125
51472 293125 296487 299801 303798 308625 313758 318010 320019 319353 317017 314468 312110 309227 305297 300808
51458 300808 296573 292800 289134 285165 280576 275244 269662 264816 261023 257319 252737 247929 244545 243034
51444 243034 242048 240275 237962 236133 235126 234641 234643 235323 236287 236521 235336 232996 230369 228124 226268 224271
51428 224271 221654 218472 215063 211419 207202 202469 197880 193892 190220 186455 182799 179650 176821 173759
51414 173759 170340 166928 163758 160843 158449 157077 156804 156963 156703 155702 154299 153014 151972 150777 149068
51399A49068j909j380o64n30q26q04m34m28r13j153q95r38j788k657k570j737
51383A29442j098j055j408j975k493k320j061O46J697J681R81J07n10m57K34Q19
51367A23230O06j06n54n38l38R3J005K056K505K246J910J865J845J633J420J306
51351A40184J100Q62J056J828K592K659J950R03o5p67j225j641k189k688k736
51336A41823k307j945k179k918l537l537k972k371k247k654l141l129k401j237
51322A05248k26J77P7R3N90J059O69m73j314j195o28l27k21kK6m94j032p22L34
51303A01639J177J306J002M67l77j139j086k98J68k42p27l06Q04J622J760J593
51287A07363J419J159Q58Q25J072J035K15j099k012j984j366q72o70l79J48M92
$$ plain form
51399 149068 147159 145779 145115 144585 143759 142955 142521 142093 141180 140027 139132 138194 136406 133749 131179 129442
51383 129442 128344 127289 125881 123906 121413 119093 118032 118678 120375 122056 123037 123144 122634 122177 122411 123230
51367 123230 123836 123730 123176 122638 122300 122393 123398 125454 127959 130205 132115 133980 135825 137458 138878 140184
51351 140184 141284 142146 143202 145030 147622 150281 152231 153134 153069 152302 151077 149436 147247 144559 141823
51336 141823 139516 137571 135392 132474 128937 125400 122428 120057 117810 115156 112015 108886 106485 105248
51322 105248 105022 105199 105276 105369 105959 107018 107687 107214 105900 104705 104077 103750 103529 103527 103553 103059 102027 101305 101639
51303 101639 102816 104122 105124 105591 105214 104075 102989 102691 102859 102617 101890 101584 102388 104010 105770 107363
51287 107363 108782 109941 110799 111624 112696 113731 113946 112847 110835 108851 107485 106613 105943 105564 105712 106204
51271A06204L41Kj05j18m27r94j464j698j699j278l73N06P27L60n0k83l87p4R28
51252A00118K038K259J569R21P80N94O3k72m7K84M01P39J446J685Q98n7j08L13
51234A13624k8j085j522p81R1K6o52q95k98O85J475J879K027K135K275K278J983
51217A23217J552J285J247J252J185J039P38K75r3r7J38L26M92P96R99P37K95
51200A35383M41J254J784J271J52n86o05k83L8J96r8r61j805j821j131q04j399
51183A31026k159k119j502j302j776k096j642q31m11m51m99l71k65k42r9K33M74
51166A15968L30j40n74o74m85l77o30j021j034n81j68j65k75j20lm44j237j586
51148A06784j213o05j18M08R44R20J11p31p65j96P6k44n79m34l2J00k04o94j014
$$ plain form
51271 106204 106545 106547 106442 106324 105897 104903 103439 101741 100042 98764 98391 98897 99624 99984 99934 99651 99264 99190 100118
51252 100118 102156 104415 105984 106905 107685 108279 108342 108070 108023 108307 108708 109447 110893 112578 113476 113419 113311 113624
51234 113624 113596 112511 110989 110208 110299 110325 109673 108778 108480 109165 110640 112519 114546 116681 118956 121234 123217
51217 123217 124769 126054 127301 128553 129738 130777 131515 131790 131697 131600 131738 132064 132556 133352 134351 135088 135383
51200 135383 135824 137078 138862 140133 140285 139699 139094 138811 138849 139045 138947 137986 136181 134360 133229 132425 131026
51183 131026 128867 126748 125246 123944 122168 120072 118430 117599 117188 116737 116238 115867 115602 115360 115261 115494 115968
51166 115968 116298 116158 115584 114910 114425 114048 113418 112397 111363 110782 110614 110449 110174 110054 110051 109607 108370 106784
51148 106784 105571 104966 104848 105256 106200 107120 107231 106500 105735 105539 105615 105371 104792 104358 104326 104426 104222 103528 102514
51129A02514r78p02m70l81j53M65J194J453J137P58O87O03K5p40p65K73J447J596
51111A07963Q02L37J038K285K883K523J851J385J037P33P80J368K106K451K315
51096A31857K005J780J641J458J100N93K11J88L77M45L91N26Q88J175J292J465
51080A47392J612J173rj151j430j031p56q59q75m48J67M33m0j286k741l379k624
51063A34148j112q9J1j13K17P27O93k0q01j016o17m8K35J23j79l67k23L28J096
51044A32993J596J437Q37M55M99M36j62p76n56M88J481J900K078K372K463J977
51028A49518J371J506K350K740J815L22j02J048K418K487J453Q35J414K384K684
51013A74243K294J845J688J905K681L889M719M507L744L444L706L727L266L150
$$ plain form
51129 102514 101536 100834 100364 99983 99830 100295 101489 102942 104079 104837 105524 106127 106152 105412 104647 104920 106367 107963
51111 107963 108765 109102 110140 112425 115308 117831 119682 121067 122104 122837 123617 124985 127091 129542 131857
51096 131857 133862 135642 137283 138741 139841 140434 140645 140833 141210 141655 142046 142572 143460 144635 145927 147392
51080 147392 149004 150177 150168 149017 147587 146556 145800 144941 144066 143618 143785 144218 144178 142892 140151 136772 134148
51063 134148 133036 132947 132958 132845 133062 133789 134482 134462 133661 132645 132028 131980 132215 132338 132159 131792 131569 131897 132993
51044 132993 134589 136026 136863 137318 137817 138253 138091 137315 136759 137247 138728 140628 142706 145078 147541 149518
51028 149518 150889 152395 154745 157485 159300 159622 159520 160568 162986 165473 166926 167761 169175 171559 174243
51013 174243 176537 178382 180070 181975 184656 188545 193264 197771 201515 204959 208665 212392 215658 218808
50999B18808M053N552O832P708Q451R081R416R613J0082J0885J1641J2096J2555
50986C36773J3635J5614J8088K0327K2037K3622K5644K8165L0892L3713L6676
50975F05186L9556M1987M4074M6359M8992N1409N2991N3631N3334N1727M8493
50964A137739M4074L9465L5258L1154K6483K1036J5348J0221N982K291j183m132
50952A363736n964o733p149p554p501o647n568n089n210n408n805p264j0157j3748
50938A263939j7199k0581k4407k8503l2070l4814l7307m0026m2508m3945m4292
50927H98287m4151m3729m2493m0145l7281l4673l2271k9449k6089k2845k0324
50916E24837j8429j6604j4460j1966r408p284n919n104m229k985j666p41l50l35
$$ plain form
50999 218808 222861 228413 235245 242953 251404 260485 269901 279514 289596 300481 312122 324218 336773
50986 336773 350408 366022 384110 404437 426474 450096 475740 503905 534797 568510 605186
50975 605186 644742 686729 730803 777162 826154 877563 930554 984185 1037519 1089246 1137739
50964 1137739 1181813 1221278 1256536 1287690 1314173 1335209 1350557 1360778 1366760 1369051 1367868 1363736
50952 1363736 1357772 1351039 1343890 1336336 1328835 1322188 1316620 1311531 1306321 1300913 1295108 1287844 1277687 1263939
50938 1263939 1246740 1226159 1201752 1173249 1141179 1106365 1069058 1029032 986524 942579 898287
50927 898287 854136 810407 767914 727769 690488 655815 623544 594095 568006 545161 524837
50916 524837 506408 489804 475344 463378 453970 446686 440767 435663 431434 428449 426783 426042 425692 425357
50902D25357m73n33l12J75O37Q45Q32P25N84N06O91J123J494J615J770K341L264
50885D40641M133M774N386O162P070Q087R294J0659J1885J2711J3312J4176J5670
50872E63960J7780K0281K2978K5764K8629L1777L5591M0269M5511N0894N6523
50861I39957O2953P0275P7676Q4303R0272R6363J02848J09109J14358J18218J20482
50850A986814J20788J18726J13935J06014R4791Q0907O5785N0693L6131K2133
50840B796717Q824l481j4222k2334k6664k7158k5212k2266j8477j3394p553k440
50828B622340R85K774K838L79n102j2941k2140l2478m4101n6324o7681p7209q5089
50815B226251r1901r7663j01772j03548j02717r9577r4838q9147q2652p5225o7020
$$ plain form
50902 425357 424884 424351 424039 424214 424851 425696 426528 427253 427837 428343 429034 430157 431651 433266 435036 437377 440641
50885 440641 444774 449548 454934 461096 468166 476253 485547 496206 508091 520802 534114 548290 563960
50872 563960 581740 602021 624999 650763 679392 711169 746760 787029 832540 883434 939957
50861 939957 1002910 1073185 1150861 1235164 1325436 1421799 1524647 1633756 1748114 1866332 1986814
50850 1986814 2107602 2226328 2340263 2446277 2541068 2621975 2687760 2738453 2774584 2796717
50840 2796717 2805541 2802060 2787838 2765504 2738840 2711682 2686470 2664204 2645727 2632333 2624780 2622340
50828 2622340 2623325 2626099 2628937 2629316 2624214 2611273 2589133 2556655 2512554 2456230 2388549 2311340 2226251
50815 2226251 2134350 2036687 1934915 1831367 1728650 1629073 1534235 1445088 1362436 1287211 1220191
50804A220191n8602n0408m2468l4763k7524k0928j4803q915l399J543O177J0969
50792I77070J5729J9499K1504K2020K2003K2070K1962K0864J8144J3936R095M495
50780A188391L07l830q072j2141j5891j9510k2930k5499k6756k7208k7788k8653
50768I70420k9156k8832k7846k6413k4413k1827j9124j6832j4898j2736r838o213
50756G32292k341J233M381P493J1001J4838J8563K1981K5437K9447L4227L9573
50744I38125M4976N0018N4858O0138O6165P2355P7857Q2481Q6424Q9170Q9489
50733A712056Q6765Q1693P5204O7237N7029M4331K9896J4972N91j2657k4387l4001
50721B098729m0605m3695m3764m1863l8495l3569k7424k1176j5728j1091p143
$$ plain form
50804 1220191 1161589 1111181 1068713 1033950 1006426 985498 970695 961780 958381 959924 966101 977070
50792 977070 992799 1012298 1033802 1055822 1077825 1099895 1121857 1142721 1160865 1174801 1183896 1188391
50780 1188391 1188698 1184868 1176796 1164655 1148764 1129254 1106324 1080825 1054069 1026861 999073 970420
50768 970420 941264 912432 884586 858173 833760 811933 792809 775977 761079 748343 738505 732292
50756 732292 729951 731184 735565 743058 754059 768897 787460 809441 834878 864325 898552 938125
50744 938125 983101 1033119 1087977 1148115 1214280 1286635 1364492 1446973 1533397 1622567 1712056
50733 1712056 1798821 1880514 1955718 2022955 2079984 2124315 2154211 2169183 2169774 2157117 2132730 2098729
50721 2098729 2058124 2014429 1970665 1928802 1890307 1856738 1829314 1808138 1792410 1781319 1774176
50710A774176m429l632m750p429j1696j7697k4982l2706m0314m7390n3151n6809
50698A469191n8349n8354n7088n4445n0656m6332m1757l6696l1035k5076j9138
50687I90265j3286p544j901L868R889J5779K1109K6221L1858L7930M3384M7519
50675A205091N0639N3129N4643N4689N3419N1207M7949M3445L8117L2683K7203
50664A712214K1137J4288P318J089m120q721j3265j7843k2058k5532k8309l0510
50652A605688l1795l1669l0366k8714k6934k4250k0160j5436j1129p092k440K820
50640A378523P592J1108J3697J5866J7414J7838J7104J5622J3889J2389J1465
50629A532507J0936J0312R612R546J0564J2260J4182J6692K0196K3865K6033K5949
$$ plain form
50710 1774176 1769747 1766115 1761365 1753936 1742240 1724543 1699561 1666855 1626541 1579151 1526000 1469191
50698 1469191 1410842 1352488 1295400 1240955 1190299 1143967 1102210 1065514 1034479 1009403 990265
50687 990265 976979 969435 967534 971402 981291 997070 1018179 1044400 1076258 1114188 1157572 1205091
50675 1205091 1255730 1308859 1363502 1418191 1471610 1522817 1570766 1614211 1652328 1685011 1712214
50664 1712214 1733351 1747639 1754957 1756046 1751926 1743205 1729940 1712097 1690039 1664507 1636198 1605688
50652 1605688 1573893 1542224 1511858 1483144 1456210 1431960 1411800 1396364 1385235 1378143 1375703 1378523
50640 1378523 1386115 1397223 1410920 1426786 1444200 1462038 1479142 1494764 1508653 1521042 1532507
50629 1532507 1543443 1553755 1563367 1572913 1583477 1595737 1609919 1626611 1646807 1670672 1696705 1722654
50617A722654K4263K1655J7802J2208N418j294p201j2462j7384k1881k5713k8732
50605A689333l0777l1741l1987l2375l3572l5502l7702m0008m2520m4927m6379
50594A281843m6331m5282m4278m3662m2751m0853l8185l5504l3102l0650k7906
50583H53339k5045k2189j9165j5891j2609r482o419l510j187N03K306M896P866
50570G53413J0287J1998J3689J5734J7777J9522K1214K3063K4841K6413K8108
50559I66059L0248L2694L5210L7815M0477M2844M4571M5557M5597M4345M2004
50548A407421L9564L7772L6278L4359L2144L0459K9701K9517K9452K9275K8707
50537A764649K7566K6281K5729K6378K7979L0104L2564L5179L7637L9775M1691
$$ plain form
50617 1722654 1746917 1768572 1786374 1798582 1804000 1802706 1795505 1783043 1765659 1743778 1718065 1689333
50605 1689333 1658556 1626815 1594828 1562453 1528881 1493379 1455677 1415669 1373149 1328222 1281843
50594 1281843 1235512 1190230 1145952 1102290 1059539 1018686 980501 944997 911895 881245 853339
50583 853339 828294 806105 786940 771049 758440 748958 742539 739029 737842 738345 740651 745547 753413
50570 753413 763700 775698 789387 805121 822898 842420 863634 886697 911538 937951 966059
50559 966059 996307 1029001 1064211 1102026 1142503 1185347 1229918 1275475 1321072 1365417 1407421
50548 1407421 1446985 1484757 1521035 1555394 1587538 1617997 1647698 1677215 1706667 1735942 1764649
50537 1764649 1792215 1818496 1844225 1870603 1898582 1928686 1961250 1996429 2034066 2073841 2115532
50526B115532M3450M4839M5492M4996M2910L8970L3441K6918J9828J2305M490
50515B473171l486j1743k0480k9329l7383m4021m9426n3945n7220n8331n6829
50504B050978n3332m8966m4254l8844l2488k6028k0900j7651j5445j3311j1181
50493A728578r306p237m258o04K562M307M519L428J187k104o654j3183k2090l2288
50479A646857m1674m8956n4393n8639o1632o2946o2535o0687n7740n4229n0747
50468A032679m7410m3831l9939l6237l2981k9725k6062k2280j8838j5787j3079
50457G06510j0953r472q179o653m971l260j309Q41K674M093N896Q562J1196J2618
50443G07593J3051J3769J5290J6996J8425J9880K1666K3585K5456K7382K9317
$$ plain form
50526 2115532 2158982 2203821 2249313 2294309 2337219 2376189 2409630 2436548 2456376 2468681 2473171
50515 2473171 2469685 2457942 2437462 2408133 2370750 2326729 2277303 2223358 2166138 2107807 2050978
50504 2050978 1997646 1948680 1904426 1865582 1833094 1807066 1786166 1768515 1753070 1739759 1728578
50493 1728578 1719272 1712035 1707777 1707173 1709735 1714042 1718561 1721989 1723176 1721072 1714418 1701235 1679145 1646857
50479 1646857 1605183 1556227 1501834 1443195 1381563 1318617 1256082 1195395 1137655 1083426 1032679
50468 1032679 985269 941438 901499 865262 832281 802556 776494 754214 735376 719589 706510
50457 706510 695557 686085 677906 671253 666282 663022 661713 662554 665228 669321 675217 683779 694975 707593
50443 707593 720644 734413 749703 766699 785124 805004 826670 850255 875711 903093 932410
50432I32410L0927L2119L3214L4472L5880L7437L9176M0828M2001M2729M3446
50421A344639M4359M5301M6160M6985M7645M7885M7750M7412M6644M4941M2111
50410A851832L8233L3165K6819J9818J3134O968P14n885j2406j8727k5378l2556
50398A895731l9623m6028n1882n7139o1098o3403o4780o5927o6252o4702o1390
50387A253507n7457n3498m9111m3934l8306l2728k7421k2528j8144j3967r493
50376H86920m765m70K960N897Q880J1706J3469J3428J1585Q481M617J31m880r874
50362I48085j4050j7125j9651k2204k4544k5942k6200k5801k5148k4133k2639
50351G00648k0974j9527j8287j6922j5208j3205j1157r368p993o875n718m480
$$ plain form
50432 932410 963337 995456 1028670 1063142 1099022 1136459 1175635 1216463 1258464 1301193 1344639
50421 1344639 1388998 1434299 1480459 1527444 1575089 1622974 1670724 1718136 1764780 1809721 1851832
50410 1851832 1890065 1923230 1950049 1969867 1983001 1989969 1990683 1984798 1972392 1953665 1928287 1895731
50398 1895731 1856108 1810080 1758198 1701059 1639961 1576558 1511778 1445851 1379599 1314897 1253507
50387 1253507 1196050 1142552 1093441 1049507 1011201 978473 951052 928524 910380 896413 886920
50376 886920 882155 881685 884645 890542 899422 911128 924597 938025 949610 958091 962708 962839 957959 948085
50362 948085 934035 916910 897259 875055 850511 824569 798369 772568 747420 723287 700648
50351 700648 679674 660147 641860 624938 609730 596525 585368 576000 568007 561132 555414 550934
50339E50934l397k514j465J2J561K591L095L710M820N952O447O506P054Q476J0007
50324F03789J0746J0918J1565J3085J4762J5804J6225J6405J6396J6165J6143
50313G62003J6777J7693J7952J7251J6302J5891J5934J5783J5181J4580J4574
50302I39921J5118J5335J4206J1573Q415N982M641L758K540O75j794m782q192
50289A007396j1830j5512j9115k2430k5089k6744k7240k6683k5436k4023k2711
50278G60583k1308j9605j7939j6924j6574j6135j4975j3231j1422r784q353p318
50266E87015o817o606o312n987n965o221o228n604m621l899l746l831l554k647
50252E14977j449n34j19P0L34O66R84J420K140K997L709M250M833N471N848N748
$$ plain form
50339 550934 547537 545023 543558 543570 545131 547722 550817 554527 559347 565299 571746 578252 585306 593782 603789
50324 603789 614535 625453 637018 650103 664865 680669 696894 713299 729695 745860 762003
50313 762003 778780 796473 814425 831676 847978 863869 879803 895586 910767 925347 939921
50302 939921 955039 970374 984580 996153 1004568 1010550 1015191 1018949 1021489 1022164 1020370 1015588 1007396
50289 1007396 995566 980054 960939 938509 913420 886676 859436 832753 807317 783294 760583
50278 760583 739275 719670 701731 684807 668233 652098 637123 623892 612470 602686 594333 587015
50266 587015 580198 573592 567280 561293 555328 549107 542879 537275 532654 528755 525009 521178 517624 514977
50252 514977 513528 512994 512875 512945 513279 513945 514929 516349 518489 521486 525195 529445 534278 539749 545597 551345
50236E51345N360N059M962M881M672M442M306M000L141J870J040J245J899J786
50222F00008N98o94j261j503k205l175l592l428l616m624n643n590m350k676j218
50207E57031j49N45R04J141J675K808M412N937O861P162P321P658P899P645P003
50192F25853O331N476L909J734j02r51j279j927k983l892m359m606m862n101n274
50177F07967n415n502n423n149m680l995l182k483k008j645j420j672k492l310
50163E59591l451k950k345j848j269n94l7M47J153K002K505K532K572K985L445
50148E64738L479L208L114L285L286K766K015J819K664M087M990M814M217M184
50134F12666M763N175N074M909M962M846M281L774L937M676N488O144O765P574
$$ plain form
50236 551345 556705 561764 566726 571607 576279 580721 585027 589027 592168 594038 595078 596323 598222 600008
50222 600008 600606 599912 598651 597148 594943 591768 588176 584748 581132 576508 570865 565275 560925 558249 557031
50207 557031 556882 557427 558331 559472 561147 563955 568367 574304 581165 588327 595648 603306 611205 618850 625853
50192 625853 632184 637660 641569 643303 643201 642250 640971 639044 636061 632169 627810 623204 618342 613241 607967
50177 607967 602552 597050 591627 586478 581798 577803 574621 572138 570130 568485 567065 565393 562901 559591
50163 559591 556140 553190 550845 548997 547728 547134 547097 547544 548697 550699 553204 555736 558308 561293 564738
50148 564738 568217 571425 574539 577824 581110 583876 585891 587710 590374 594461 599451 604265 608482 612666
50134 612666 617429 622604 627678 632587 637549 642395 646676 650450 654387 659063 664551 670695 677460 685034
50120F85034R033J1660J5216J8605K1232K3994K8124L3488L9005M4499N1005N9096
50108A039991O7977P6618Q4885R2945J00209J05536J08002J06993J01985R3034
50098A978175Q1406O9217N8318M9703M3705M0120L8150L6628L4473L0740K4294
50087B484929J3948p01j8705l8286n7804p6051r1664j02868j08374j08480j04933
50076A791011r9551r3204q6138p8733p1436o4356n7464n1078m5548m0613l5684
50065A067206l0788k6597k3377k0595j7805j5258j3317j1812j0491r554r182q935
50053H69495q273p310o493n766m766l626k820k300j582o13J47O00J234K270L320
50038H33517M161N130O331P222P463P626Q405R580J0425J0704J0601J0007Q767
$$ plain form
50120 685034 694067 705727 720943 739548 760780 784774 812898 846386 885391 929890 980895 1039991
50108 1039991 1107968 1184586 1269471 1362416 1462625 1568161 1676163 1783156 1885141 1978175
50098 1978175 2059581 2128798 2187116 2236819 2280524 2320644 2358794 2395422 2429895 2460635 2484929
50087 2484929 2498877 2498176 2479471 2441185 2383381 2307330 2215666 2112798 2004424 1895944 1791011
50076 1791011 1691460 1598256 1512118 1433385 1361949 1297593 1240129 1189051 1143503 1102890 1067206
50065 1067206 1036418 1009821 986444 965849 948044 932786 919469 907657 897166 887612 878430 869495
50053 869495 861222 853912 847419 841653 836887 833261 830441 828141 826559 825946 826093 826693 827927 830197 833517
50038 833517 837678 842808 849139 856361 863824 871450 879855 889435 899860 910564 921165 931172 939939
50025I39939P425O817O803O340N056L975M210N544O834P429P606P908Q574R563
50011A034023J0698J1753J2703J3861J5581J7908K0672K3769K7102L0465L3849
50000A252384L7774M2776M8672N4791O1115O8641P8254Q9651J01810J14291J27477
49989B077636J41446J55010J66112J72963J74649J71003J62429J50043J35701
49980C506992J21550J09391J00285R4429R1058Q8465Q4440P7061O5143M8088K5592
49969D412494k080l3492o5922r6275j22347j43425j59743j71585j79029j82434
49959C256162j82684j80639j76532j70296j62331j53456j44030j33709j22392
49950A830093j10938j00439r1134q2476p4088o6099n8775n2308m6951m2704l8926
$$ plain form
50025 939939 947364 954181 960984 967324 972380 976355 980565 986109 992943 1000372 1007978 1015886 1024460 1034023
50011 1034023 1044721 1056474 1069177 1083038 1098619 1116527 1137199 1160968 1188070 1218535 1252384
50000 1252384 1290158 1332934 1381606 1436397 1497512 1566153 1644407 1734058 1835868 1950159 2077636
49989 2077636 2219082 2374092 2540204 2713167 2887816 3058819 3221248 3371291 3506992
49980 3506992 3628542 3737933 3838218 3932647 4023705 4112170 4196610 4273671 4338814 4386902 4412494
49969 4412494 4410414 4376922 4311000 4214725 4092378 3948953 3789210 3617625 3438596 3256162
49959 3256162 3073478 2892839 2716307 2546011 2383680 2230224 2086194 1952485 1830093
49950 1830093 1719155 1618716 1527582 1445106 1371018 1304919 1246144 1193836 1146885 1104181 1065255
49939A065255l4813l0479k6916k4725k3429k2305k1310k0718k0367j9825j9015
49928H01353j8133j7137j5812j4256j2868j1884j1313j1174j1458j1891j2104
49917F53323j2032j1824j1466j0789r849q958q386q215q363q424p743o071m080
49904E37123k702k101j692j118n30N7R73K197L147L507L638L895M071M043M341
49889E58849N431O869P912Q685R951J1827J3580J4825J6149J8259K1049K3983
49877G17369K6987L0507L4929M0320M6632N3860O1949P0754Q0100Q9756R9384
49866A352547J08453J16117J21057J21762J17316J08065R5511Q1632O8274N6860
49856B347594M8232M2599L9594L8363L7541L5280K9612J9037K924j8335m3240
$$ plain form
49939 1065255 1030442 999963 973047 948322 924893 902588 881278 860560 840193 820368 801353
49928 801353 783220 766083 750271 736015 723147 711263 699950 688776 677318 665427 653323
49917 653323 641291 629467 618001 607212 597363 588405 580019 571804 563441 555017 547274 541203 537123
49904 537123 534421 532320 530628 529510 528980 529037 530010 532207 535354 538861 542499 546394 550465 554508 558849
49889 558849 564280 571149 579061 587746 597697 609524 623104 637929 654078 672337 693386 717369
49877 717369 744356 774863 809792 850112 896744 950604 1012553 1083307 1163407 1253163 1352547
49866 1352547 1461000 1577117 1698174 1819936 1937252 2045317 2140828 2222460 2290734 2347594
49856 2347594 2395826 2438425 2478019 2516382 2553923 2589203 2618815 2637852 2640776 2622441 2579201
49845B579201o9324r3748j14171j29174j38087j40823j38157j31793j23612j14602
49835A385710j04804r4296q3860p4349o5772n7562m9694m2984l8040l4382l0934
49824G09033k7185k3454k0230j7726j5973j4846j3862j2439j0556q856p821p200
49812E28885o538n855n393n025m504m133m483n420o059n937n621n789o174o013
49798D51941n165m249l698l318k770k174j944k273k894l272l041k322j609j268
49784D11944j251j293j251j132j013j153j766k518k537j386J81R70O72J9k77j16
49768C98093L11P67Q69L50l62m51K42R34R46M74R4L9K31O06R93J128J057J142
49750D07463J411J430J148J235K044K837K643J604P85Q49J524K167K337J997J539
$$ plain form
49845 2579201 2509877 2416129 2301958 2172784 2034697 1893874 1755717 1623924 1500312 1385710
49835 1385710 1280906 1186610 1102750 1028401 962629 905067 855373 812389 774349 739967 709033
49824 709033 681848 658394 638164 620438 604465 589619 575757 563318 552762 543906 536085 528885
49812 528885 522347 516492 511099 506074 501570 497437 492954 487534 481475 475538 469917 464128 457954 451941
49798 451941 446776 442527 438829 435511 432741 430567 428623 426350 423456 420184 417143 414821 413212 411944
49784 411944 410693 409400 408149 407017 406004 404851 403085 400567 398030 396644 396825 397795 398467 398486 398209 398093
49768 398093 398404 399171 400040 400390 400028 399577 399819 400753 401699 402173 402267 402306 402537 403143 404136 405264 406321 407463
49750 407463 408874 410304 411452 412687 414731 417568 420211 421815 422600 423449 424973 427140 429477 431474 433013
49735D33013J462J699J614R89N28P68J094O29l30o94j89M11N11K58j41p08j126
49718D39788q38K0N39J17q55j667k019j966j715j642j935k168j741q68l54l96
49702D22300m15k11l17r32j401j261j011j246j707j810j544j239r23m94r7J40
49686D07832M06Q12J077R69O29J97l67p70m24O05J344J117L84j27l71n25l42K88
49668D12734Q47J002J266K031K714K732K591K924L147K386J215J006J876K683
49654D41154K951L267L750L648K836K326K690L203L068K544K187J988J858K062
49640D79532K511K460J679J216K120L940N259N410M903M453M281M287M317M178
49626E30546L764L142K405J698J365J659K171K053J137L11L26Q20R82P75Q45J510
$$ plain form
49735 433013 434475 436174 437788 438777 439305 440073 441167 441796 441466 440772 440583 440994 441505 441763 441622 440914 439788
49718 439788 438950 438970 439509 439626 438771 437104 435085 433119 431404 429762 427827 425659 423918 423050 422696 422300
49702 422300 421885 421674 421357 420425 419024 417763 416752 415506 413799 411989 410445 409206 408283 407789 407692 407832
49686 407832 408238 409050 410127 411096 411725 411922 411555 410785 410361 410966 412310 413427 413811 413684 413313 412788 412446 412734
49668 412734 413581 414583 415849 417880 420594 423326 425917 428841 431988 434374 435589 436595 438471 441154
49654 441154 444105 447372 451122 454770 457606 459932 462622 465825 468893 471437 473624 475612 477470 479532
49640 479532 482043 484503 486182 487398 489518 493458 498717 504127 509030 513483 517764 522051 526368 530546
49626 530546 534310 537452 539857 541555 542920 544579 546750 548803 549940 550251 550577 551397 552379 553154 553999 555509
49610E55509K477L424M245M753M689M210L983M612O032P551Q415Q466Q263Q458
49596F35087R059R530R633R743J0264J1106J1961J2691J3197J3342J3344J3839
49584G72796J5144J6783J8100J9068K0075K1176K2124K2934K3958K5346K6820
49573A004324K7999K8741K9251K9963L1222L2793L3969L4417L4651L5352L6429
49562A359111L7168L7200L6838L6542L6493L6674L6976L7130L6787L5805L4344
$$ plain form
49610 555509 557986 561410 565655 570408 575097 579307 583290 587902 593934 601485 609900 618366 626629 635087
49596 635087 644146 653676 663309 673052 683316 694422 706383 719074 732271 745613 758957 772796
49584 772796 787940 804723 822823 841891 861966 883142 905266 928200 952158 977504 1004324
49573 1004324 1032323 1061064 1090315 1120278 1151500 1184293 1218262 1252679 1287330 1322682 1359111
49562 1359111 1396279 1433479 1470317 1506859 1543352 1580026 1617002 1654132 1690919 1726724 1761068
$$ [...]
##END NTUPLES=NMR SPECTRUM
##END=
