##TITLE=NES1023_BrazilUW_9266427_k17JsIc4xV
##JCAMPDX= 6.0         $$ Bruker NMR JCAMP-DX V2.0
##DATA TYPE= NMR SPECTRUM
##DATA CLASS= NTUPLES
##ORIGIN= BRUKER
##OWNER= Administrator
$$ 1.72 TOPSPIN		Version 2.1
$$ 2015-07-09 19:46:14.269 -0700  Administrator@X
$$ Compression mode = diff/dup
##.OBSERVE FREQUENCY= 400.02188249412
##.OBSERVE NUCLEUS= ^1H
##.ACQUISITION MODE= SIMULTANEOUS (DQD)
##.ACQUISITION SCHEME= undefined
##.AVERAGES= 8
##.DIGITISER RES= 22
##SPECTROMETER/DATA SYSTEM= spect
##.PULSE SEQUENCE= zg30
##.SOLVENT NAME= COFFEE_meoh
##.SHIFT REFERENCE= INTERNAL, COFFEE_meoh, 1, 14.98509
##AUDIT TRAIL= $$ (NUMBER, WHEN, WHO, WHERE, PROCESS, VERSION, WHAT)
$$ ##TITLE= Audit trail, TOPSPIN		Version 2.1
$$ ##JCAMPDX= 5.01
$$ ##ORIGIN= Bruker BioSpin GmbH
$$ ##OWNER= Administrator
$$ $$ E:\/data/COFFEE/nmr/NES1023_BrazilUW_9266427_k17JsIc4xV/10/pdata/1/auditp.txt
$$ ##AUDIT TRAIL=  $$ (NUMBER, WHEN, WHO, WHERE, PROCESS, VERSION, WHAT)
(   1,<2015-07-09 19:46:07.035 -0700>,<Administrator>,<X>,<go>,<TOPSPIN 2.1>,
      <created by zg
	started at 2015-07-09 19:45:01.238 -0700,
	POWCHK enabled, PULCHK disabled,
       configuration hash MD5:
       21 0F 79 D6 B3 7B B4 F6 88 20 88 DB 03 48 BD 9F
       data hash MD5: 64K
       B2 55 CD DB ED D5 5B 63 9A 99 81 DC 1F 2B 89 AD>)
(   2,<2015-07-09 19:46:10.144 -0700>,<Administrator>,<X>,<proc1d>,<TOPSPIN 2.1>,
      <Start of raw data processing
       efp LB = 0 FT_mod = 6 PKNL = 1 PHC0 = 0 PHC1 = 0 SI = 32K 
       data hash MD5: 32K
       9D 31 3F 14 32 EC AC D8 49 E8 C0 BC 99 FF 80 E8>)
(   3,<2015-07-09 19:46:10.425 -0700>,<Administrator>,<X>,<proc1d>,<TOPSPIN 2.1>,
      <pk PHC0 = 90.67566 PHC1 = 0 
       data hash MD5: 32K
       0D 5F 86 93 92 7F B1 2A A0 B5 DA 39 E5 3C 4B 71>)
(   4,<2015-07-09 19:46:10.550 -0700>,<Administrator>,<X>,<proc1d>,<TOPSPIN 2.1>,
      <abs ABSG = 1 
       data hash MD5: 32K
       1C A3 80 1C 99 60 25 01 DA 60 FE 58 38 BF 7B 4E>)
(   5,<2015-07-09 19:46:10.613 -0700>,<Administrator>,<X>,<proc1d>,<TOPSPIN 2.1>,
      <abs ABSG = 2 
       data hash MD5: 32K
       1C B1 6C CC FE 2A 80 1E B3 7F 71 F0 B5 7E 5B 12>)
(   6,<2015-07-09 19:46:10.675 -0700>,<Administrator>,<X>,<proc1d>,<TOPSPIN 2.1>,
      <abs ABSG = 3 
       data hash MD5: 32K
       98 16 2E FB 6E 53 F6 D2 E4 E4 B9 F5 97 92 8F 63>)
(   7,<2015-07-09 19:46:10.738 -0700>,<Administrator>,<X>,<proc1d>,<TOPSPIN 2.1>,
      <abs ABSG = 4 
       data hash MD5: 32K
       50 8D 92 2A 92 58 C1 E0 E7 3C E2 CB F4 93 26 1C>)
(   8,<2015-07-09 19:46:10.800 -0700>,<Administrator>,<X>,<proc1d>,<TOPSPIN 2.1>,
      <abs ABSG = 5 
       data hash MD5: 32K
       F2 E0 7C F6 99 4C FB 85 0F 1D 30 AE BA 40 C0 07>)
$$ ##END=
$$ 
$$ $$ hash MD5
$$ $$ F8 79 F5 D9 E7 DC E8 61 A9 C7 EE B2 CC 1E 39 EF
##$RELAX= 
##$RELAX= 
##$RELAX= 
##$RELAX= 
##$RELAX= 
##$RELAX= 
##$RELAX= 
$$ Bruker specific parameters
$$ --------------------------
##$DU= <E:\>
##$EXPNO= 10
##$NAME= <NES1023_BrazilUW_9266427_k17JsIc4xV>
$$ [...]
150 150 150 150 150 150 150 150
##$TP07= 0
##$TPNAME0= <>
##$TPNAME1= <>
##$TPNAME2= <>
##$TPNAME3= <>
##$TPNAME4= <>
##$TPNAME5= <>
##$TPNAME6= <>
##$TPNAME7= <>
##$TPOAL= (0..7)
0.5 0.5 0.5 0.5 0.5 0.5 0.5 0.5
##$TPOFFS= (0..7)
0 0 0 0 0 0 0 0
##$TUNHIN= 0
##$TUNHOUT= 0
##$TUNXOUT= 0
##$USERA1= <user>
##$USERA2= <user>
##$USERA3= <user>
##$USERA4= <user>
##$USERA5= <user>
##$V9= 5
##$VALIST= <valist>
##$VCLIST= <CCCCCCCCCCCCCCC>
##$VD= 0
##$VDLIST= <DDDDDDDDDDDDDDD>
##$VPLIST= <PPPPPPPPPPPPPPP>
##$VTLIST= <TTTTTTTTTTTTTTT>
##$WBST= 2048
##$WBSW= 25
##$XGAIN= (0..3)
0 0 0 0
##$XL= 0
##$YL= 0
##$YMAX_a= 630111
##$YMIN_a= -519650
##$ZGOPTNS= <>
##$ZL1= 120
##$ZL2= 120
##$ZL3= 120
##$ZL4= 120
##$ABSF1= 14.98509
##$ABSF2= -5.573092
##$ABSG= 5
##$ABSL= 3
##$ALPHA= 0
##$AQORDER= 0
##$ASSFAC= 0
##$ASSFACI= 0
##$ASSFACX= 0
##$ASSWID= 0
##$AUNMP= <proc_prof1d_extract_pilot.lims>
##$AXLEFT= 0
##$AXNAME= <>
##$AXNUC= <1H>
##$AXRIGHT= 0
##$AXTYPE= 0
##$AXUNIT= <>
##$AZFE= 0.1
##$AZFW= 0.1
##$BCFW= 0
##$BC_mod= 0
##$BYTORDP= 0
##$COROFFS= 0
##$CY= 15
##$DATMOD= 1
##$DC= 0
##$DFILT= <>
##$DTYPP= 0
##$F1P= 0
##$F2P= 0
##$FCOR= 0.5
##$FTSIZE= 32768
##$FT_mod= 6
##$GAMMA= 0
##$GB= 0
##$INTBC= 1
##$INTSCL= 1
##$ISEN= 128
##$LB= 0
##$LEV0= 0
##$LPBIN= 0
##$MAXI= 10000
##$MC2= 0
##$MEAN= 0
##$ME_mod= 0
##$MI= 0
##$NCOEF= 0
##$NC_proc= -8
##$NLEV= 6
##$NOISF1= 0
##$NOISF2= 0
##$NSP= 0
##$NTH_PI= 0
##$NZP= 0
##$OFFSET= 14.98509
##$PC= 1
##$PHC0= 90.67566
##$PHC1= 0
##$PH_mod= 1
##$PKNL= yes
##$PPARMOD= 0
##$PPDIAG= 0
##$PPIPTYP= 0
##$PPMPNUM= 2147483647
##$PPRESOL= 1
##$PSCAL= 4
##$PSIGN= 0
##$PYNMP= <proc.py>
##$REVERSE= no
##$SF= 400.02
##$SI= 32768
##$SIGF1= 0
##$SIGF2= 0
##$SINO= 400
##$SIOLD= 32768
##$SPECTYP= <>
##$SREGLST= <1H.CDCl3>
##$SSB= 0
##$STSI= 32768
##$STSR= 0
##$SW_p= 8223.68421052631
##$SYMM= 0
##$S_DEV= 0
##$TDeff= 65536
##$TDoff= 0
##$TI= <>
##$TILT= no
##$TM1= 0
##$TM2= 0
##$TOPLEV= 0
##$USERP1= <user>
##$USERP2= <user>
##$USERP3= <user>
##$USERP4= <user>
##$USERP5= <user>
##$WDW= 1
##$XDIM= 32768
##$YMAX_p= 450558544
##$YMIN_p= -835953
##$CURPLOT= <Network HP LaserJet P1505>
##$CURPRIN= <$Network HP LaserJet P1505>
##$DFORMAT= <normdp>
##$LAYOUT= <+/1D_H.xwp>
##$LFORMAT= <normlp>
##$PFORMAT= <normpl>
##$SURQMSG= 1
$$ End of Bruker specific parameters
$$ ---------------------------------
##NTUPLES= NMR SPECTRUM
##VAR_NAME=  FREQUENCY,     SPECTRUM/REAL,   SPECTRUM/IMAG
##SYMBOL=    X,             R,               I
##VAR_TYPE=  INDEPENDENT,   DEPENDENT,       DEPENDENT
##VAR_FORM=  AFFN,          ASDF,            ASDF
##VAR_DIM=   32768,         32768,           32768
##UNITS=     HZ,            ARBITRARY UNITS, ARBITRARY UNITS
##FACTOR=    0.250966925370066, 1,           1
##FIRST=     8223.43324360094, -285920,      -262608
##LAST=      0,             -50529,          -61756
##MIN=       0,             -835953,         0
##MAX=       8223.43324360094, 450558544,    0
$$ Real data points
##PAGE= N=1
##DATA TABLE= (X++(R..R)), XYDATA
$$ [...]
19462b63483A71210C1443J10670B0556a8707j78040b8894C22661A40406b30330
19451B95219b54163c7413r9677k7781N2047D771b24276i0835j06874b7073j15187
19440a42260B4028c4638H011O6260e7063n110K9362A6266a29540j94991a02693
19428A2749c3610J5869j02862o3808c5351C0462d43407a06996k60951j80527A07417
19416h6761K8149k13162L8089h2931o3866m499F5901K84603c07474a7023B29965
19404A70731n909a47368B6550c68772f6739l3202o4276H0200J51955a12114H3335
19392H272h0319b4698A31325K0594c06736J18641g913k79787E7409c55002A10594
19380D099J09211c5954j47978k7751B667a0592G0842E140b66479A24749g3587
$$ plain form
19462 -263483 171210 31443 142113 20556 -18707 -196747 -28894 322661 140406 -230330
19451 295219 -254163 -37413 -137090 -164871 -112824 4771 -224276 -90835 -197709 -27073 -142260
19440 -142260 24028 -34638 8011 74271 -57063 -62173 -32811 16266 -129540 -324531 -102693
19428 12749 -33610 -17741 -120603 -184411 -35351 30462 -443407 -106996 -367947 -548474 107417
19416 -86761 -58612 -271774 -233685 -82931 -146797 -151296 65901 350504 -307474 -17023 229965
19404 170731 164822 -147368 26550 -368772 -66739 -99941 -164217 80200 232155 -112114 83335
19392 8272 -80319 -24698 131325 151919 -306736 -188095 -7913 -287700 57409 -355002 110594
19380 4099 113310 -35954 -183932 -211683 2667 -10592 70842 5140 -266479 124749 -73587
19368d8081o7605F1071K43617I614c07932c452B31917I0490a50626B0041L9552
19357E9593j096a70726K2220m5658b5054N843n0325j59897d6850c969j54949B99800
19344H4532i0564l6432C5190J20818a8180l50159J79627j52564A8762c69687M0527
19333c29160b0470l22049l7817A51701E833a74144r1555c241k23625F5081a73316
19321E3745f5474o1679B47067b011D8623J09409a72539k44068G1261n087c41321
19309b14573A90815e2780K6320o1087F753f86815B55509b23817h0635B02805d4114
19297b00624d8240b0793k19734f761B3650i156C40794a94339A92071n8085H679
19285a16502j43049a22A32928J05430e6112C14283a5597k75434l13118f8615H9210
$$ plain form
19368 -48081 -115686 61071 304688 9614 -307932 -3452 231917 90490 -150626 20041 59593
19357 59593 58497 -170726 -148506 -194164 -25054 -19211 -69536 -229433 -46850 -3969 -158918 299800
19344 84532 -90564 -126996 35190 156008 -18180 -368339 -188712 -341276 18762 -369687 -329160
19333 -329160 -20470 -342519 -380336 151701 5833 -174144 -265699 -3241 -226866 65081 -173316
19321 53745 -65474 -127153 247067 -2011 48623 158032 -172539 -416607 71261 66174 -341321
19309 -214573 190815 -52780 -26460 -87547 6753 -686815 255509 -223817 -80635 202805 -44114
19297 -200624 -48240 -20793 -240527 -6761 23650 -9156 340794 -194339 192071 133986 8679
19285 -116502 -259551 -122 132928 238358 -56112 314283 -15597 -291031 -604149 -68615 89210
19273c07021A46585J30354a13378j20073O6715j586D4141J32313a32513b9057
19262G7225a12236G0530a43381r6314B348a26261j39341N577j09049J00158P1715
19251a97201B16552a17171F5892K1863d17373a80544d7251r8789A75328M4057
19241B19385e48168a92624b0051j15727H9723b27727O0698k9567h3930A22141
19230C5601b72366a26164c9202p9318G0703Q4807k6767N10b78908B18404c7962
19218C3849J83707a92070f4403k6568j38529B7139b34112B9608c39501a05059
19207A30142a45186g2374m7548j34607g4490k2986H965c08511a12122r0273B52339
19195d8600k7947j72492n7709B01368a61473B23033p9220b4500k87515A67279
$$ plain form
19273 -307021 146585 276939 -113378 -233451 -166736 -168322 44141 176454 -132513 -29057
19262 77225 -112236 70530 -143381 -239695 2348 -126261 -265602 -260025 -369074 -268916 -197201
19251 -197201 216552 -117171 65892 87755 -417373 -180544 -47251 -146040 175328 219385
19241 219385 -548168 -192624 -20051 -135778 89723 -227727 -167029 -196596 -83930 122141
19230 35601 -272366 -126164 -39202 -118520 70703 155510 128743 129253 -278908 218404 -37962
19218 33849 217556 -192070 -64403 -90971 -229500 27139 -234112 29608 -339501 -105059
19207 130142 -145186 -72374 -119922 -254529 -74490 -97476 8965 -308511 -112122 -202395 252339
19195 -48600 -76547 -249039 -306748 201368 -161473 223033 143813 -24500 -312015 167279
19184H3246R2058a8067N784J595k48328a20904L3946k33436J43464B59697G4159
19172a30944d6825A74608q1453c63772I7212a21579l6100O3878M3483j0217B70173
19160B69091a02635E6711b75476J12265d941E7488c5976o0882j69554f9941E2985
19148g2353L2019a7851G9321J0687b05796j37914C25730a66368o8630A38822a57409
19136c59507G0283c06010a46221n0043C3768J9341c90410J23048H5039e9973a0314
19124a38489A3006J64916a82004k01150c2350o416H3215b1222j72711j2882I4130
19112b31110Q9219B1829e7385j54162C81735I1335B0047J05746i8567B68668g6437
19100A283L26584A29396J64090A13532a85711J243P9493K9128A22412i0493k52604
$$ plain form
19184 83246 175304 -18067 -12283 -10688 -259016 -120904 -86958 -320394 -176930 259697 74159
19172 -130944 -46825 174608 93155 -363772 97212 -121579 -157679 -93801 -50318 -60535 270173
19160 269091 -102635 56711 -275476 -163211 -4941 57488 -35976 -96858 -266412 -69941 52985
19148 -72353 -40334 -17851 79321 90008 -205796 -343710 325730 -166368 -234998 138822 -157409
19136 -359507 70283 -306010 -146221 -196264 33768 53109 -390410 -267362 85039 -59973 -10314
19124 -138489 13006 177922 -182004 -383154 -32350 -38766 83215 -21222 -193933 -206815 94130
19112 -231110 -141891 21829 -57385 -211547 381735 91335 20047 125793 -98567 268668 -76437
19100 1283 327867 129396 293486 113532 -185711 -184468 -104975 -75847 122412 -90493 -343097
19089c43097C2637j0216a13889J2603A4683a42125B41904k3275b49965A35070
19078b26913P2488D655c3074A13326J09490c1079j5627I0398K31807J54932c5521
19066d8437B3906P7239b51504B32998a48099A00895K48069d7122b0044b363A28618
19054H8196b87290h2033B73222J2018B7948f7826l2153k29645A5833a04228o2058
19043a66286k3988f7535j4843G7531N7703b85593K7809A33855c15233A03045e9512
19031B03506N2410a9257m2349J1025q0370j07959I694c80076A58580b36404a06340
19019b46029A57044p0276K21888a8924k12152j84199a45757d1374j55425B42467
19008A48455c3957C61558a62821D0095J82316B7965M8568c465m0401r6246D6853
$$ plain form
19089 -343097 32637 22421 -113889 -101286 14683 -142125 241904 218629 -249965 135070
19078 -226913 -154425 4655 -33074 113326 222816 -31079 -46706 90398 322205 477137 -35521
19066 -48437 23906 101145 -251504 232998 -148099 100895 348964 -47122 -20044 -2363 128618
19054 88196 -287290 -82033 273222 285240 27948 -67826 -99979 -329624 15833 -104228 -166286
19043 -166286 -190274 -67535 -82378 77531 135234 -285593 -257784 133855 -315233 103045 -59512
19031 203506 255916 -19257 -61606 -50581 -130951 -238910 9694 -380076 158580 -236404 -106340
19019 -246029 157044 86768 308656 -18924 -231076 -415275 -145757 -41374 -196799 242467
19008 148455 -33957 361558 -162821 40095 222411 27965 76533 -3465 -43866 -140112 46853
18996g5883A78605p4993D7021a330q2470B77617b53280a3246l45781J10002a9655
18984d8586A27280b88088h7627P504o0466o739C0755J61763a7361G8470J15898
18973A94368e8375A50615a12244b8743G95522p8198A84187h7900A1738b05782
18962b18154G6512L0884D14J76289n5702J9639h8069n1008C6839i1837B2022a52396
18949a57382B0942b57844J04803f8776k23836b7501l76692b5361j80994B95035
18938c22623d6467E0427a2066F8894b32085h1333k34988a12586C30564h4783B28312
18926b09268P9548k79626J95088A9260b36346a12884A21170a76577K9130c7769
18915a30134p597A33057g1826j28574a3067B81549a00530A44485g78C41855j64361
$$ plain form
18996 -75883 178605 103612 47021 -1330 -83800 277617 -253280 -13246 -359027 -249025 -19655
18984 -48586 127280 -288088 -87627 -80123 -140589 -147328 30755 192518 -17361 78470 194368
18973 194368 -58375 150615 -112244 -28743 795522 717324 184187 -87900 11738 -205782
18962 -218154 76512 107396 414 176703 121001 140640 -88069 -139077 36839 -91837 22022 -152396
18949 -157382 20942 -257844 -153041 -68776 -292612 -27501 -404193 -25361 -206355 295035
18938 -322623 -46467 50427 -12066 68894 -232085 -81333 -316321 -112586 330564 -84783 228312
18926 -209268 -129720 -409346 -214258 19260 -236346 -112884 121170 -176577 -147447 -37769
18915 -130134 -137731 133057 -71826 -200400 -13067 281549 -100530 144485 -778 341855 177494
18904A77494B2606K80464a56734q0723b1819B2886J21414p0245a51112A23061
18893E0944A4941c65188J38195N4172F1240c1685j48207j00851a39905H706a4243
18881c4486j5214B5054P2379a66819B37779b54396I8751d3664j26290A01076a11232
18869b34091g4455j46552r666N3511B2457c10546A87988A5447g8937A36437J9149
18858A55586K356p0665c24996C21648e685j40554B07285a11163K9680G9881a58280
18846a57861f5971J2382C5514e7775j69269B6469c0040K893C5095c35240d2585
18834A93766b6140C08552a53351A73095o781J64612f8117A67151f9581j02734
18824a72315E7714d2068j52983B2378I843J4590a22937C16227a83415A09587i1435
$$ plain form
18904 177494 22606 303070 -156734 -237457 -21819 22886 144300 74055 -151112 123061
18893 50944 14941 -365188 -226993 -172821 61240 -31685 -179892 -280743 -139905 8706 -14243
18881 -34486 -49700 25054 97433 -166819 237779 -254396 98751 -43664 -169954 101076 -111232
18869 -234091 -74455 -221007 -230673 -177162 22457 -310546 187988 15447 -78937 136437 155586
18858 155586 157942 87277 -324996 321648 -5685 -146239 207285 -111163 -81483 79881 -158280
18846 -157861 -65971 -53589 35514 -57775 -227044 26469 -30040 -27147 35095 -335240 -42585
18834 193766 -26140 308552 -153351 173095 166314 330926 -68117 167151 -69581 -172315
18824 -172315 57714 -42068 -195051 22378 9843 24433 -122937 316227 -183415 109587 -91435
18812g3914A25644E1024J6298a52014C32589F6311D571K43180I0860K44249A38235
18800H6882b01080B25017c92888E357a89719h5271j27423M2274C2687f9936k15358
18789b85294H759b80435h1176J4310j91792b1316n5812l18790B38768f1195B52019
18777B11594a60870A22851k0341g0016j27097J6323k59358a47640b8478m3906
18767g2384l9284A71367o0385c0603o4476j61329a19769d5595o6763a8823j3494
18756c2317j63777F5218b12843H1242a18950r020k4991G4492J63065a52276I5497
18744C2984g6533A11471J01482a7864j21702B3640N3961k7237c1029p7053B7664
18732c9781A23902a54676R289k25352a01866r7764R5599q6987h4977n1916K3985
$$ plain form
18812 -73914 125644 51024 67322 -152014 332589 66311 4571 247751 90860 335109 138235
18800 86882 -201080 225017 -392888 5357 -189719 -85271 -212694 -170420 32687 -69936 -285294
18789 -285294 8759 -280435 -81176 -66866 -258658 -21316 -77128 -395918 238768 -61195 252019
18777 211594 -160870 122851 102510 -70016 -197113 -180790 -440148 -147640 -28478 -72384
18767 -72384 -111668 171367 110982 -30603 -95079 -256408 -119769 -45595 -112358 -18823 -32317
18756 -32317 -196094 65218 -212843 81242 -118950 -127970 -152961 74492 237557 -152276 95497
18744 32984 -76533 111471 212953 -17864 -139566 23640 77601 50364 -31029 -108082 27664
18732 -39781 123902 -154676 -145387 -370739 -101866 -199630 -104031 -191018 -84977 -136893 -112908
18721a12908B082N5855j4187d5215a5108A61800b52160P1580m1121P4166j14927
18710b62462r8882I0577R1387c02461G3866b8247J0094A67199J6988G7403f0663
18698a10776G6506a43640K4172A89089a09594j71886d2460j90853D5287K1760
18688F7047b01386f0428R860B62436h0212C13746i6039j64639h6614E8160k5745
18677C2415g9576K4827j57886B1267K1662h1745k5329j47834A4762b29976C7306
18665A09575a24095k45018h0548r1030A08967c06102c3404B42163D7887h8751
18654a81770A7967a61502b5302B8583L7729R7327e8408L021C502h1318G047a00527
18641D02984I2703a85932A35014c06593a21135F1088i1328a7058m47484J27735
$$ plain form
18721 -112908 2082 57937 43750 -45215 -15108 161800 -252160 -180580 -221701 -147535 -262462
18710 -262462 -361344 90577 181964 -302461 73866 -28247 -18153 167199 184187 77403 -60663
18698 -110776 76506 -143640 -119468 189089 -109594 -281480 -42460 -233313 45287 67047
18688 67047 -201386 -60428 -50568 262436 -80212 313746 -96039 -260678 -86614 58160 32415
18677 32415 -79576 -54749 -212635 21267 42929 -81745 -107074 -254908 14762 -229976 37306
18665 109575 -124095 -369113 -80548 -171578 108967 -306102 -33404 242163 47887 -88751
18654 -181770 17967 -161502 -25302 28583 66312 163639 -58408 -55387 3502 -81318 7047 -100527
18641 402984 92703 -185932 135014 -306593 -121135 61088 -91328 -17058 -464542 -336807
18631c36807b8929j16810k24750J50667O9372A29304a53167g3786o0976N1516
18621h3246H1972a4024j10763A11875P0549c8351A39608a59100G572J04392R5036
18610B07000e479n8950k76915f9606j3068F2202a64699k0245J1877a2669r3677
18599a06346K5360H581e0324j34674c227C4035a53660A40453a75882d3111q9407
18588a32518A01999a48080B02436c64170I3963b32551j3946Q5668B73906a58433
18577b37520P504A12697c4497F3489J57378D0807d9374C50311b00683A99749i0629
18565A07930f7877R461k09262b7153G6476A9330a48807J8016m6812e8984k38458
18554b97442J24471A36444i5610l9194c8116a5077r5600k60320c9765m809k13108
$$ plain form
18631 -336807 -28929 -145739 -370489 -219822 -150450 129304 -153167 -73786 -134762 -83246
18621 -83246 81972 -14024 -124787 111875 182424 -38351 139608 -159100 7572 111964 207000
18610 207000 -5479 -64429 -341344 -69606 -82674 62202 -164699 -184944 -173067 -12669 -106346
18599 -106346 -80986 8581 -50324 -184998 -3227 34035 -153660 140453 -175882 -43111 -132518
18588 -132518 101999 -148080 202436 -364170 93963 -232551 -246497 -160829 273906 -158433
18577 -237520 -230016 112697 -34497 63489 220867 40807 -49374 350311 -200683 199749 -90629
18565 107930 -67877 -58416 -267678 -27153 76476 19330 -148807 -130791 -177603 -58984 -297442
18554 -297442 -172971 136444 -95610 -134804 -38116 -15077 -110677 -370997 -39765 -44574 -257682
18543b57682A62868J16203b0787G3682i8120j5836j14185h9427B66163e5625j17181
18532a72806K7416C6209b9230l586E6547a35978n3120N6414O950E4058b76349
18520a90631I8570K30960d20737B155N4462a65363P745C960c29278C91451b56786
18508a28042o6635q8311P6339a5679A77338d9139A03815g387B18169a87338H7994
18496a48921B3655Q9323g4036B39501b42481A9075J76716O3167j17901l4682a19412
18484A43792b58261b1612A397a24959A16429b83763j03425a17277b3579j00903
18474a24482j0544A41961c31698A67244c31171g0440A46443n373a62154k13228
18464c75382h8096a0632j78007B93248A14001L7626b660p1496j88159B54210a88970
$$ plain form
18543 -257682 162868 279071 -20787 73682 -98120 -113956 -228141 -89427 266163 -55625 -172806
18532 -172806 -145390 36209 -29230 -32816 56547 -135978 -189098 -132684 -125734 54058 -276349
18520 -190631 98570 329530 -420737 2155 56617 -165363 -157618 3960 -329278 391451 -256786
18508 -128042 -194677 -282988 -206649 -15679 177338 -49139 103815 -7387 218169 -187338 87994
18496 -148921 23655 112978 -74036 239501 -242481 19075 195791 258958 141057 106375 -119412
18484 143792 -258261 -21612 1397 -124959 116429 -283763 -387188 -117277 -23579 -124482
18474 -124482 -135026 141961 -331698 167244 -331171 -70440 146443 141070 -162154 -375382
18464 -375382 -88096 -10632 -188639 293248 114001 151627 -2660 -74156 -262315 254210 -188970
18452A75532m8546a94892E8413h1668L5545D8469b70062C2950d9231B19776i2538
18440A92458J19778a53752a9318I0490G993e2059G3183J49888c7009p5330k46468
18429c58807C7975L70023a7350l9158A52333a09970p8059J1430h0653l14388k0706
18418d15747B925c06473a15858j19537C1773g1414M503j3679J0006n43G6594J85337
18406B61931e6761A51432C1122a67750E9123K49555b06509A89230A3849d2752
18395H2860J88466q8126a84209A82322J15167d5122B89699b10273K1529h0095
18384a51477j05875A29079B1042Q3659d01164a1808m2349E9596a91027A35516
18373E7757a4895q4916j8556B58984b09112c3067C2629c80815i5144j66411h6584
$$ plain form
18452 175532 126986 -194892 58413 -81668 -46123 48469 -270062 32950 -49231 219776 -92538
18440 192458 312236 -153752 -19318 90490 7993 -52059 73183 223071 -37009 -112339 -358807
18429 -358807 37975 407998 -17350 -56508 152333 -109970 -188029 -176599 -80653 -395041 -415747
18418 -415747 2925 -306473 -115858 -235395 31773 -71414 -66911 -80590 -70584 -71127 76594 261931
18406 261931 -56761 151432 31122 -167750 59123 308678 -206509 189230 13849 -42752
18395 82860 271326 183200 -184209 182322 297489 -45122 289699 -210273 -188744 -80095
18384 -151477 -257352 129079 21042 104701 -401164 -11808 -54157 59596 -191027 135516
18373 57757 -14895 -99811 -118367 258984 -209112 -33067 32629 -380815 -95144 -261555 -86584
18361A60772G3860J72881q4836b6341A62228l3860j9319b86134B0164a35181k09093
18350c44274a04122q6918A49432K31096A6955O0743f05897K57990J59559g4351
18339A06384Q8465A5544b47219j31316A71969e3506J4671B54294a81760D42602
18328a17334H0261b76321m1342J1139b6739j76679d5191B57241f9001I1108b5331
18316c68508A6439J03112b990k83476F1588a39117O202D3628c16432g2610b9330
18304B48764c49827A70524c27745A09032C452a85159j60737a18850N5869j4794
18294g7775j01578A64406c1430C8173b9560o5364D4526J15041R26c5789l7405
18283g3194B8890a211k40262R1983m3730Q0034d022j26063A39850j982O2782b27955
$$ plain form
18361 160772 73860 246741 161905 -26341 162228 128368 109049 -286134 20164 -135181 -344274
18350 -344274 -104122 -191040 149432 380528 16955 77698 -605897 -347907 -188348 -74351
18339 106384 194849 15544 -247219 -378535 171969 -53506 -38835 254294 -181760 442602
18328 -117334 80261 -276321 -317663 -306524 -26739 -203418 -45191 257241 -69001 91108 -25331
18316 -368508 16439 119551 -2990 -286466 61588 -139117 -132915 43628 -316432 -72610 -29330
18304 248764 -349827 170524 -327745 109032 3452 -185159 -345896 -118850 -62981 -77775
18294 -77775 -179353 164406 -31430 38173 -29560 -94924 44526 159567 160493 -35789 -73194
18283 -73194 28890 -1211 -241473 -149490 -193220 -113186 -4022 -130085 139850 137868 200650 -227955
18270a83789d5213r5262k41264B25398b28127f7991k57614G9954a84652A28523
18259A25452F2531d0994k2270D19631c54598a73124B0249I556h3019B91495f4603
18247c12904D8273a91748A09763a28904F6309b86641L2622Q0587e7164l25061
18237c82225c3709A04569c27037a25745c1750o5741b8173l77300f6964B2069P4880
18226I6949N770R546O7810c79369B6905n655a45170K8581H2834J85185a79628
18214b20891B62026a11182M4101k42042j36714a48244A05749M3576N3076d2474
18203F6579c56307F871a38785G8827O1735a64864B78888H8688a25613A59140c07062
18191A98019b5492B31872b42452A48123c7511j5733C08482b09110E2262F631Q1672
$$ plain form
18270 -183789 -45213 -140475 -381739 225398 -228127 -67991 -325605 79954 -184652 128523
18259 125452 62531 -40994 -63264 419631 -354598 -173124 20249 9556 -83019 291495 -64603
18247 -312904 48273 -191748 109763 -128904 66309 -286641 -254019 -173432 -57164 -382225
18237 -382225 -33709 104569 -327037 -125745 -31750 -97491 -28173 -405473 -66964 22069 96949
18226 96949 102719 112265 180075 -379369 26905 21250 -145170 -116589 82834 268019 -179628
18214 -220891 262026 -111182 -67081 -309123 -445837 -148244 105749 149325 202401 -42474
18203 66579 -356307 6871 -138785 78827 140562 -164864 278888 88688 -125613 159140 -307062
18191 198019 -25492 231872 -242452 148123 -37511 -53244 308482 -209110 52262 6631 88303
18180H8303b41832J15261b3559A3810a97489C0516a2116H7131L6275k8636l1646
18169F3124a70831e2074j19264e7026I1939l2484c28958A31619a08353K3038I060
18157B04478c00458A58596J5105H1868c1301j36622N5550q165J9134C7698a49720
18145a92726E3225k594K09871i4772n7939e1393A18562f7597k51413A33939d0384
18133a49201k8765P870l772M7207K7126b7066n5650j87610P7369d4135A8984a45494
18120A62350G2581L9174C2018h0357B15406j07228k6100K07878a52669P4985B67411
18108b53213Q8955A67447a25458C09607H8032b76456e1230j2581D7358Q0534f5916
18096A17766a40804M3756k7851j76233f7002B54103h35953A52936a8510j26913
$$ plain form
18180 88303 -241832 -126571 -23559 13810 -197489 30516 -12116 87131 123406 94770 63124
18169 63124 -170831 -52074 -171338 -57026 91939 59455 -328958 131619 -108353 -85315 9060
18157 204478 -300458 158596 173701 81868 -31301 -167923 -112373 -120538 -101404 37698 -149720
18145 -192726 53225 50631 260502 -94772 -152711 -51393 118562 -67597 -319010 133939 -40384
18133 -149201 -177966 -170096 -173868 -126661 -99535 -27066 -82716 -270326 -192957 -44135 18984 -145494
18120 162350 72581 111755 32018 -80357 215406 108178 82078 289956 -152669 -77684 267411
18108 -253213 -164258 167447 -125458 309607 88032 -276456 -51230 -63811 47358 127892 -65916
18096 117766 -140804 -97048 -124899 -301132 -67002 254103 -835953 152936 -18510 -145423
18086a45423J2904O2851A55181K3991C3783K42150a75651G4215C2364a72084g7399
18074b95395e6917m9191A29226K2382a39287B16387E0512i0332B2026P6914f2309
18062c12275I3951f0480k8553G8856K43049H6752k3114A4450k955d0949l83708
18051d24657i0642A73768b15649B10423j4058j713a37696G1c1494F999a80005
18039f4312P422b5757B07235D1931a53420A87799A6598d7853j19173G2379Q7631
18028A60010a52615B11803a23986e7302q8939C5404a82821C23363p0363D2141
18017A61293a5706A82234b8287l4862o2402B20066a81491B68785b3138B6731b05914
18005B03585c55994A39734B9889K15426a5605E9841a0909m47457B88319i0411
$$ plain form
18086 -145423 -132519 -69668 155181 179172 33783 275933 -175651 74215 32364 -172084 -77399
18074 -295395 -56917 -106108 129226 151608 -139287 216387 50512 -90332 22026 98940 -62309
18062 -312275 93951 -60480 -89033 78856 321905 86752 63638 14450 11495 -40949 -424657
18051 -424657 -90642 173768 -215649 210423 196365 194652 -137696 71 -31494 6999 -180005
18039 -64312 -56890 -25757 207235 41931 -153420 187799 16598 -47853 -167026 72379 160010
18028 160010 -152615 211803 -123986 -57302 -146241 35404 -182821 323363 253000 42141
18017 161293 -15706 182234 -28287 -63149 -125551 220066 -181491 268785 -23138 26731 -205914
18005 203585 -355994 139734 29889 245315 -15605 59841 -10909 -458366 288319 -90411
17994f7915C11301a53868k04957E1645P5352R265e4429A52818k9232i8650B35791
17982g4322N415H2673J25031F7888N8985D0600a3009A71983O5383c63001J51675
17971b11326P2696p3704D1743c75240c4249p0416A20811a6420B84218b18932r657
17960b28589b6639H3299a16645A87382Q0455M5205H6569K2710N1342G9701r205
17949G0496a50723E7728B90Q8977a50355k317P1631j2372a1463B05745r3804P2642
17937A84583m6150g0593L2578j20221j48806P1629K886B88684A32253a6204k66889
17926b83093B00855I6642M2690k8161h4672A43382J58053a06172B12514b81228
17915a28211A00538d808A71401Q7590q9088g8359n8190j30833E7829J83603r2792
$$ plain form
17994 -67915 311301 -153868 -358825 51645 126997 136262 -54429 152818 123586 -98650 235791
17982 -74322 -68907 82673 207704 67888 126873 40600 -13009 171983 237366 -363001 -211326
17971 -211326 -138630 -212334 41743 -375240 -34249 -104665 120811 -16420 284218 -218932 -228589
17960 -228589 -26639 83299 -116645 187382 267837 313042 86569 109279 160621 79701 70496
17949 70496 -150723 57728 290 89267 -150355 -152672 -81041 -93413 -11463 205745 111941 184583
17937 184583 138433 -70593 -38015 -158236 -307042 -235413 -232527 288684 132253 -16204 -283093
17926 -283093 200855 96642 139332 111171 -84672 143382 301435 -106172 212514 -281228
17915 -128211 100538 -4808 171401 258991 169903 -78359 -136549 -267382 57829 241432 148640
17904A48640O4120a09336A70626J1588R3548G0341O8497b02790D6702a97019a7451
17892A37846d4549j88820A42725g3922B50402d5911D01528a02709J3587J9496
17882f9626C79857C456b37296f5017C65319G627J39938a70159C51009b1084A20447
17870g1819A25868n0943N594J77029E7568b19504C7629P3435P322a7751H3108
17858F9558C0355l356a6722j8170m0308I7961K75684C5965a41967e4771D4768
17846I2219B0653a70291p4865A20763K7692P5264J1095l793L4664r8881a126B17716
17833i8799A14060B1318K90974J11865B2681M7829A5870h3557A0807a31043D8658
17821A00238M7834E4109A601M09965h189B86978E4317J97357c6995C35114I6506
$$ plain form
17904 148640 212760 -109336 170626 182214 275762 70341 138838 -202790 46702 -197019 -17451
17892 137846 -44549 -233369 142725 -73922 250402 -45911 401528 -102709 -89122 -69626
17882 -69626 379857 3456 -237296 -65017 365319 7627 147565 -170159 351009 -21084 120447
17870 -71819 125868 74925 80519 257548 57568 -219504 37629 111064 118386 -17751 83108
17858 69558 30355 26999 -16722 -34892 -75200 97961 373645 35965 -141967 -54771 44768
17846 92219 20653 -170291 -245156 120763 148455 223719 234814 231021 265685 166804 -1126 217716
17833 -98799 114060 21318 312292 424157 22681 70510 15870 -83557 10807 -131043 48658
17821 100238 148072 54109 1601 411566 -8189 286978 54317 251674 -36995 335114 96506
17809b61225N4120A29177J20902b16116a7832l8432B8779J83027e7813B94808
17798a26716m3530A17849e7811A45769h3658m5167G145K05941j04761m2363i7769
17786A84740K8075b78143A53566M5374I2339N3982n8855J24414b95336B60534
17775b311r6377A10843A5750J48987M2725a15166C0407a29182M4280o54o2740
17764a48296P2816m4691k8368A92522d35244E59534B47585e40926F3987a30127
17753A4100K80740n1780a52565G8237n82N31561A12489B3344N6270f681j02965
17742a09646B23620J59507A38662K29215a45656N579H8026R9192g0753C21200
17731A35414L2556a20569j35048A81913H1324J2936b56138f3874j45469b1032
$$ plain form
17809 -261225 -207105 129177 250079 -216116 -17832 -56264 28779 211806 -57813 294808
17798 -126716 -170246 117849 -57811 145769 -83658 -128825 7145 213086 108325 65962 -97769
17786 184740 212815 -278143 153566 198940 92339 146321 87466 211880 -295336 260534
17775 -2311 -98688 110843 15750 164737 207462 -115166 30407 -129182 -84902 -85556 -148296
17764 -148296 -75480 -120171 -148539 192522 -435244 559534 247585 -540926 63987 -130127
17753 14100 294840 243060 -152565 78237 77655 609216 112489 23344 79614 -6681 -109646
17742 -109646 223620 383127 138662 367877 -145656 -140077 88026 187218 -70753 321200
17731 135414 167970 -120569 -255617 181913 81324 94260 -256138 -63874 -209343 -21032
17720A55904a44887A49928M0505h5661B94220A13436J21185I0525b3903I5723
17709H1340J67777K809a12888C50473I495J94893J23009A5652d5789I5634J97849
17698B93483b946E4744r876c316l4904A78275K15672A84856D8050M7481J13637
17687B09168F0719b8320E1002b71551d5329H4902J33821B6745I384L2860J47908
17676A90152a02027j49579A77747K29246A54742a18771C63289j24325A03174q216
17666I4958L0579h6635A88695J71384G7386L00679j45483E849a78471A51569J11352
17655B62921K0583j26422Q6759b4768B74378i0265F8080L14544A65927B0277J85981
17644B06258J81792e7026F4508L42575E1596J78310h4009B07623K996m7106a0034
$$ plain form
17720 155904 -144887 149928 190433 -85661 294220 113436 234621 90525 -23903 95723
17709 81340 249117 251926 -112888 350473 9495 204388 327397 15652 -45789 95634 293483
17698 293483 -2946 54744 44868 -3316 -38220 178275 393947 184856 48050 95531 209168
17687 209168 60719 -28320 51002 -271551 -45329 84902 218723 26745 9384 42244 190152
17676 190152 -102027 -251606 177747 406993 154742 -118771 363289 238964 103174 94958
17666 94958 125537 -86635 188695 360079 77386 378065 232582 5849 -178471 151569 262921
17655 262921 283504 157082 243841 -24768 274378 -90265 68080 382624 165927 20277 206258
17644 206258 388050 -57026 64508 407083 51596 229906 -84009 207623 210619 163513 -10034
17632A66210D0079K98815I8157J79056K5960J08060j28040A00112K04595a55107
17621G5782K1324C6294a66244j9070B05992B8158e2562C67291A09639a74746I8159
17609A84673a71077e7304A91666O0799D8688a58127B6815a5387B64110j10987
17599A53123a3437C19843K0376a79777A10796N7972m483J91771b75565B08198
17588B28283K8912A01943M44845A69341F4164c1032A72673q5333K00983O8217
17578C56540k4493O9358A65231p0129J57288e0285B02358k5556D0779a82955A86380
17566d8463C58056j63458J60686J36143A40591Q5311K4570F7756L04903a56782
17555F0799a9368D38288A61397M2662R5626n5393J88491j31441j8238j39787l8964
$$ plain form
17632 166210 40079 338894 98157 277213 303173 411233 283193 100112 304707 -155107
17621 75782 97106 36294 -166244 -185314 205992 28158 -52562 367291 109639 -174746 98159
17609 184673 -171077 -57304 191666 252465 48688 -158127 26815 -15387 264110 153123
17599 153123 -13437 319843 340219 -179777 110796 168768 164285 356056 -275565 208198
17588 228283 257195 101943 546788 169341 64164 -31032 172673 87340 288323 356540
17578 356540 332047 401405 165231 95102 252390 -50285 202358 176802 40779 -182955 186380
17566 -48463 358056 194598 355284 491427 140591 225902 250472 67756 372659 -156782
17555 60799 -19368 438288 161397 204059 299685 244292 432783 301342 283104 143317 104353
17544A04353J11940n7579J93557I0068B5360Q7993J94829j02471Q6470j42339
17534A49842L89012j81219P1689m5158l2642A03492P2270J5199K7696L61334j34055
17523D45936K30938l9808L16290k23176P2325C45648L51818g967C30507J6340
17513C46847H8073K41857K6981L16936k6350j40855K81851L9933r9826j79882
17503E48718m3347A57192j6812o9541L5765l2518L58042d3999B98774H8418M30551
17492E18969F8894i6242D24396J72591A03830J79159F2325K83239A19414K80890
17482D00304j70279K7281M4680l8091I2637Q9448H0884M84636A03951R8111M14801
17471F16863a99790F40294A35873C2278J31534J78110j6343J92663k46636J89440
$$ plain form
17544 104353 216293 158714 352271 90068 25360 113353 308182 205711 292181 149842
17534 149842 538854 357635 429324 384166 351524 103492 175762 190961 218657 579991 445936
17523 445936 676874 637066 953356 730180 802505 345648 697466 -7967 330507 346847
17513 346847 88073 329930 356911 673847 647497 506642 788493 828426 728600 548718
17503 548718 505371 157192 140380 70839 106604 74086 432128 -43999 298774 88418 518969
17492 518969 68894 -96242 424396 596987 103830 282989 62325 345564 119414 400304
17482 400304 230025 257306 301986 263895 92637 182085 80884 565520 103951 202062 616863
17471 616863 -199790 640294 135873 32278 163812 341922 325579 518242 271606 461046
17461D61046B01521J53451j52546p4483K5846A501K92199j8544A33992K22934
17451C56926j51985L43836k66957L3041n9653N46528B59828M45049n7482j71602
17441D75793P2997j29576C6800K38389o4319J54650O4340j95070L31306A04502
17430C33048C4265L46600J8909j85433L67816r2316k03742E7773J78459J19772
17420C56004j6098J48024k21378K10542j98255J0980O2966J21786J45811j55532
17410D64850q5600K69118l20484j00479q3966J67616Q4188A6382M67601A51019
17399a11898A65290P1461n5071m0074n2283P6501L25823j1607k20167r9022a4394
17387D64776p3615l4315A12713M18488a905F9284L84840g614C28502L9580A49216
$$ plain form
17461 461046 201521 354972 202426 127943 153789 1501 293700 275156 133992 356926
17451 356926 204941 548777 281820 314861 255208 801736 259828 704877 647395 475793
17441 475793 548790 419214 36800 275189 210870 365520 429860 234790 566096 104502
17430 333048 34265 380865 399774 214341 582157 489841 286099 57773 236232 356004
17420 356004 339906 487930 266552 477094 278839 289819 352785 474571 620382 464850
17410 464850 379250 648368 327884 227405 143439 311055 395243 16382 483983 151019
17399 -111898 165290 236751 181680 141606 89323 165824 491647 480040 259873 160851 -14394
17387 464776 391161 356846 112713 531201 -1905 69284 454124 -7614 328502 368082 149216
17375E10189e373B55609K31338l3341J87079B93176j9777M48730B14371K20941
17365D35312J25299B76784j06957J02986K06761j34952j56751P3876C3900L1442
17355F5342J16784C5912K88662j9946J59314B05989K22384R2762L1854k66291
17345B86698J5902J34129j68241A12156L38299A41704N53107k42475j08046m1836
17335C02454j17656L7777I5814K32781N7620r6431K47355B48862J69598A78136
17324C92418M9451c1179B90228J87987j76291L03656C4969L13615j750m0039j4239
17313B92556K52882p0818A23522l6001M77700L0709A06352J04333Q2731N7476
17303C50892K37935A39215J62767A38085J03521J11135K1058j11590J00484K3989
$$ plain form
17375 510189 -5373 255609 486947 453606 640685 293176 273399 722129 214371 435312
17365 435312 560611 276784 169827 272813 479574 344622 187871 261747 33900 65342
17355 65342 182126 35912 324574 304628 463942 205989 428373 521135 552989 286698
17345 286698 302600 436729 268488 112156 450455 141704 694811 452336 344290 302454
17335 302454 184798 222575 95814 328595 386215 289784 537139 248862 418460 178136
17324 392418 441869 -31179 290228 478215 301924 605580 34969 348584 346834 306795 292556
17313 292556 545438 474620 123522 87521 565221 595930 106352 210685 293416 350892
17303 350892 588827 139215 301982 138085 241606 352741 373799 262209 362693 386682
17293C86682m7111L1690K31786j86509n9868K7478a0175B29286J81262j70525
17283B40023N5798A47908L87825A49659K12185R5144j99196J11944j34448J79038
17273D14326l1772J38399J65605l37218Q8906j63063J10624J06625B35636L15967
17263E51603k11972j65766K57489K2899C1181L06627K18162N1572R800B73736
17252B15150L77786k16628j63459K51651A1924L80277A51772L87326a5153C28047
17241A05416L28579K39512j03266B32615K22994k21576K80917J94076k33253k9516
17231D46257j20027q5386K91500n6764A63249L26232r3492J46157A28681O33881
17221G62562j21769o5150B70465N9260L49359A48120L20818k920q7836a7532D84145
$$ plain form
17293 386682 339571 371261 603047 416538 356670 384148 -10175 229286 410548 240023
17283 240023 295821 147908 535733 149659 361844 456988 257792 369736 235288 414326
17273 414326 382554 520953 686558 349340 438246 275183 385807 492432 235636 551603
17263 551603 339631 173865 431354 454253 31181 337808 555970 607542 617342 273736
17252 215150 592936 376308 212849 464500 11924 392201 151772 539098 -15153 328047
17241 105416 433995 673507 570241 232615 455609 234033 514950 709026 475773 446257
17231 446257 326230 240844 532344 475580 163249 489481 395989 542146 128681 762562
17221 762562 640793 575643 270465 329725 679084 148120 468938 466018 378182 -17532 484145
17209E31528P3308j28858R0945B65991j30521K98607K55391l43132J64376m5085
17199D65627M05879j77403k68493L27430l54635K85133k81920M76364l68708K19127
17189G28401j35220k40679M03886j19949n0453k15214L83704k48795J98239o4616
17179F39304k25416j13923K68830J6967O9834M90378l05190B92964K60803m2685
17169E11082L66505C27539J59431j64096M49785l80328m0171l8603M58584j30071
17159F42070n4443p4742J59341C28456J84181J09857k61952J28574r0862J38515
17149E36769J69110r3764K07575j06543j25340J74723R8656r4992j79221J16041
17139G03014m8501R0935k0508o4388J57679k67096J70301n6753K83559k96627
$$ plain form
17209 531528 604836 475978 566923 265991 135470 434077 689468 346336 510712 465627
17199 465627 871506 694103 425610 753040 398405 683538 401618 877982 509274 728401
17189 728401 593181 352502 756388 636439 585986 370772 754476 505681 703920 639304
17179 639304 413888 299965 568795 585762 655596 1145974 840784 292964 553767 511082
17169 511082 877587 327539 486970 322874 772659 392331 352160 313557 772141 642070
17159 642070 587627 512885 672226 328456 512637 622494 360542 489116 398254 536769
17149 536769 705879 612115 819690 713147 587807 762530 861186 766194 586973 703014
17139 703014 654513 745448 724940 660552 818231 551135 721436 664683 948242 651615
17129F51615J71463k17779L56199l87509M9130L18796l4342k13023j27147N20418
17119A087821k39881j56386J47849l9598m054l28353L32414j00857K6322j65515
17109E59762K01757l27339L52830k14085J22271L3351O9510J66099n7307k79439
17099F27410L68084j68310M3782L70124l33740R9086l82672K20035J42419J6352
17089A002570k02871J2630q3620J23224L08912m4572Q8257m31585J85862L1012
17079I89819O3399L15376m68120j43373J10877J6827L85220m34703L24594p5444
17069A084472M93422p43042J86318L2842L34254l64914m791J04254P3974j54157
17059A042632K76001k41480l8997L9156k84579Q7158N47495k45738j46945p4941
$$ plain form
17129 651615 823078 605299 961498 573989 623119 941915 907573 694550 567403 1087821
17119 1087821 847940 691554 839403 799805 795751 467398 799812 698955 725277 559762
17109 559762 761519 434180 787010 572925 695196 728547 798057 964156 906849 627410
17099 627410 995494 827184 870966 1241090 907350 1006436 623764 843799 986218 1002570
17089 1002570 799699 812329 728709 851933 1160845 1116273 1204530 772945 958807 989819
17079 989819 1053218 1368594 900474 757101 867978 884805 1270025 835322 1159916 1084472
17069 1084472 1577894 834852 1021170 1054012 1388266 1023352 1018561 1122815 1196789 1042632
17059 1042632 1318633 1077153 1038156 1077312 792733 879891 1427386 1181648 1034703 959762
17049I59762o7855L10328j42325L55031l59806J15493K89441k08067n21192Q02533
17039A533343l21082l43322O09742k60704J42374k10371j2363K57067J50227m27495
17029A117416M50359k67564m6554m2704L5242j13482L76686K0502l16954K13525
17019A426472q4853o0503p1002L05638j93819L20721j98158j44815N80934m14372
17009A466243K65413m06467O80024m36358j50028n7147L18685J2993j36157j6784
16999A540417J24629M73303k84480K0843k3761l0620J83673l2455k66707K15640
16989A920482K00115l46547K91283l51538L17702o1316m4510L2653m2454J67670
16979B083540j64182R4183k88597J72504K49608K54875m28904J36524L43930n04466
$$ plain form
17049 959762 891907 1202235 1059910 1414941 1055135 1170628 1460069 1252002 730810 1533343
17039 1533343 1212261 868939 1478681 1217977 1360351 1149980 1137617 1394684 1544911 1117416
17029 1117416 1567775 1300211 1253657 1210953 1246195 1132713 1509399 1529901 1212947 1426472
17019 1426472 1341619 1281116 1210114 1515752 1321933 1642654 1444496 1299681 1880615 1466243
17009 1466243 1731656 1325189 2005213 1568855 1418827 1361680 1680365 1693358 1557201 1540417
16999 1540417 1665046 2138349 1853869 1874712 1850951 1820331 2004004 1971549 1704842 1920482
16989 1920482 2120597 1774050 2065333 1713795 2031497 1970181 1925671 1958324 1915870 2083540
16979 2083540 1919358 2013541 1724944 1897448 2147056 2401931 1973027 2109551 2453481 1949015
16969A949015Q4098L1266L0357N3326J66572J514P0703J87318j90241n23547R35228
16958B795609l49927j25429K39877m20598K98144M57664l10714L02773k07934
16949B679465j50182J67652j19221p2953P49228m38633J47220j12221J40432j70204
16939B820583r5032K17662L8677m42411J99713J18787N34949l95341M56011n21452
16929B932146L04498K91210j00420K30754k98127l31572m2202N58294M9927K21236
16919C815744m745m62792J14402K4973L94325j30191J35894J1139J57937j73813
16909C882873R8248J35526J9330K70779k00028K51921m20248M39987l68662N48736
16899D658462k78889J13634j36632j94870N63700l14149P9417L39874K87494k17175
$$ plain form
16969 1949015 2033113 2064379 2094736 2148062 2314634 2316148 2386851 2574169 2383928 1860381 2795609
16958 2795609 2445682 2320253 2560130 2139532 2437676 2895340 2584626 2887399 2679465
16949 2679465 2529283 2696935 2577714 2504761 3253989 2815356 2962576 2850355 2990787 2820583
16939 2820583 2725551 2943213 2981890 2539479 2739192 2857979 3392928 2997587 3453598 2932146
16929 2932146 3236644 3527854 3427434 3658188 3360061 3028489 2986287 3544581 3594508 3815744
16919 3815744 3810999 3348207 3462609 3487582 3881907 3751716 3887610 3898749 4056686 3882873
16909 3882873 3981121 4116647 4135977 4406756 4206728 4458649 4038401 4478388 4109726 4658462
16899 4658462 4379573 4493207 4356575 4161705 4725405 4411256 4490673 4830547 5118041 4900866
16889D900866L6898K4545J10184j62850K93395J31649J62715J34974j54474J79640
16879E657542l07347M35315J75565j16121K18517O3111K98830m16632L46439K68629
16869F623848J85339k74028P9462L85280k22625J16595K91017l49257K54318N6217
16859G146166L5572K77467K68011J08293j00364M70206j29309J17105K97553j4821
16849H475879L48123o9326K71977P3760K52494l4778L48290J50486k55888J35526
16839I696543K61164M62028k82015P38425K4513J92078j35482M47894J86827K16354
16829A1808329J90834L34738k02494P72218k66310M82829p7839O73912J58595
16820A3874812J60842l4468O78450M01539j52300M78568N37009o2804O39758N7319
$$ plain form
16889 4900866 4937764 4962309 5072493 4909643 5203038 5334687 5497402 5632376 5477902 5657542
16879 5657542 5350195 5785510 5961075 5844954 6063471 6126582 6425412 6008780 6355219 6623848
16869 6623848 6809187 6535159 6614621 6999901 6777276 6893871 7184888 6835631 7089949 7146166
16859 7146166 7181738 7459205 7727216 7835509 7735145 8205351 8076042 8193147 8490700 8475879
16849 8475879 8824002 8754676 9026653 9100413 9352907 9318129 9666419 9816905 9561017 9696543
16839 9696543 9957707 10419735 10137720 10876145 10900658 11092736 10957254 11405148 11591975 11808329
16829 11808329 11999163 12333901 12131407 12903625 12637315 13120144 13042305 13716217 13874812
16820 13874812 14035654 14001186 14679636 15081175 14928875 15407443 15944452 15881648 16521406 16578725
16810A6578725P14967j16345M06570K88979L16849N85825K77028N76321M03158
16801B0032077K46209N52275K34721M38227O78203L30274M30017O08987L07605
16792B3858595O07800L93034O62879O65476N50004M46692P71281L96452P52289
16783B9104502N50687O91608J061612M99511M84708P84975Q91285N44948J300344
16774C5914180N90609P59372Q05926O04877J220814Q71347Q46990Q39889J299509
16765D3753513N74740J393558R11172P00140J049144R96032J282035J127889P51356
16756E2539579J258371P67528J365908R78477R14779J690910M87766J289808Q82530
16747F2175656J305769J075391R79259Q30566R80892P97888J171205M73105R45262
$$ plain form
16810 16578725 17293692 17177347 17583917 17872896 18189745 18775570 19052598 19628919 20032077
16801 20032077 20278286 20830561 21065282 21503509 22181712 22511986 22942003 23550990 23858595
16792 23858595 24466395 24859429 25522308 26187784 26737788 27184480 27955761 28352213 29104502
16783 29104502 29655189 30346797 31408409 31907920 32392628 33177603 34068888 34613836 35914180
16774 35914180 36504789 37264161 38070087 38674964 39895778 40767125 41614115 42454004 43753513
16765 43753513 44328253 45721811 46632983 47333123 48382267 49378299 50660334 51788223 52539579
16756 52539579 53797950 54565478 55931386 56909863 57824642 59515552 60003318 61293126 62175656
16747 62175656 63481425 64556816 65536075 66366641 67347533 68145421 69316626 69789731 70734993
16738G0734993N31615Q87256O29331J043834K43894O44930K98307L19337M3794
16729G5377291L21437J15904Q43012o96414P0561j74134k08378l69866K15319
16720G5494732r00779l74177l75610k17808q18556o60837q31938q40432p62997
16711F9711598q87494o12250j042846p91843j093919j261946p49284q85095j027818
16702F1359103j105430q30163j408803q78268j158317o75446j206108j159939
16694E2936629n09790j307293n87723j459419o46156j144139p72568r13466j070076
16685D4525999p67737j008122j096179q35113m28029j102670n36311r73387m46240
16676C7332211j219594n72972m36325q51580o54815p99817n00181q26174o82168
$$ plain form
16738 70734993 71266608 72153864 72783195 73827029 74070923 74715853 75014160 75333497 75377291
16729 75377291 75698728 75814632 76657644 75961230 76031791 75857657 75649279 75279413 75494732
16720 75494732 74593953 74219776 73844166 73626358 72807802 72146965 71315027 70474595 69711598
16711 69711598 68824104 68211854 67169008 66377165 65283246 64021300 63272016 62386921 61359103
16702 61359103 60253673 59423510 58014707 57136439 55978122 55302676 54096568 52936629
16694 52936629 52426839 51119546 50531823 49072404 48426248 47282109 46509541 45596075 44525999
16685 44525999 43758262 42750140 41653961 40818848 40390819 39288149 38751838 37778451 37332211
16676 37332211 36112617 35539645 35103320 34251740 33596925 32797108 32296927 31470753 30788585
16667C0788585m21255r43533j44907p83325n15808m63320n23533m95518m17766
16658B6079620n03662o75953k67689n63702m18669n76985j12766p19411o8528
16649B2172255l09690o85306J7959o20597o85008k59410J02585o83927k29900
16640A8818961o67161o9025j91015j75915p74678J21170j66945m86264k11487
16631A6197641q1980m52420N167n61603O0080j96077p35835j0286k59973k73928
16621A3690786n3506j30621J78084k42732m99294j15439j94735J18873n30247
16612A2221169J18660j13892o06196J09209l98884l89641K99278j89919k56033
16603A0793751K5025l48899o2839k78892j09136j97698J26153n40204M33857k26678
$$ plain form
16667 30788585 30367330 29423797 29278890 28495565 27979757 27516437 26992904 26497386 26079620
16658 26079620 25575958 24900005 24632316 24068614 23649945 23072960 22960194 22240783 22172255
16649 22172255 21862565 21177259 21195218 20574621 19889613 19630203 19732788 19048861 18818961
16640 18818961 18151800 18082775 17891760 17715845 16941167 17062337 16895392 16409128 16197641
16631 16197641 16115661 15663241 15668408 15106805 15166885 14970808 14234973 14224687 13964714 13690786
16621 13690786 13637280 13506659 13684743 13442011 12942717 12827278 12632543 12751416 12221169
16612 12221169 12339829 12225937 11619741 11728950 11330066 10940425 11239703 11049784 10793751
16603 10793751 10818776 10469877 10407038 10128146 10019010 9821312 9947465 9407261 9841118 9614440
16593I614440o89j79508j76217k08435k33658O4016o5719j92196l33071k10290
16583H078673k169K25726j5023j29093m12567o7532M8183p9157m1704K62030k82986
16572G584381k15338q2888M061m03198l6557K22749m24101L46157l64088J05654
16562F736832k6662j49678K81466m20001j71090J02907K64716m60462j57954J04813
16552F104887K34753k90576K0210k97686j66015L56763m60209R5377J42989k05610
16542E534883k02264j8974N1370P7089k61738L46636m12270l7403J16080r8902
16532E094507j98765J10230K1511j11097j1123o1632k50312L33941k19851k62877
16522D444532K92936m81254L25450p39q3362N2511l24965K80903j28388l39505
$$ plain form
16593 9614440 9613751 9434243 9258026 9049591 8815933 8879949 8814230 8622034 8288963 8078673
16583 8078673 8076504 8302230 8287207 8158114 7745547 7678015 7726198 7647041 7605337 7867367 7584381
16572 7584381 7369043 7286155 7290216 6887018 6850461 7073210 6649109 6995266 6631178 6736832
16562 6736832 6710170 6560492 6841958 6421957 6250867 6353774 6618490 6158028 6000074 6104887
16552 6104887 6339640 6049064 6069274 5771588 5605573 5962336 5502127 5597504 5740493 5534883
16542 5534883 5332619 5313645 5365015 5442104 5180366 5527002 5114732 5077329 5193409 5094507
16532 5094507 4895742 5005972 5027483 4916386 4905263 4843631 4593319 4927260 4707409 4444532
16522 4444532 4737468 4256214 4581664 4580925 4497563 4550074 4225109 4506012 4377624 4038119
16512D038119K61634l222k05299J36076p5599j7390n1763j56984K74840o5455
16502D134957J1220P3509l98146J18255Q8110l82440K13767l39211m1710M88905
16492C967216J08933n88834n0005K99522m4255k80067K98428k01140k28814J51548
16482C432532m6904N838K02557j2102m55729L71153q489R5138k34004n25162J70861
16471B995689j15354J78449K07835l78127K20902L83271m14353M8922L5371j26995
16461C035610J9497J5781l68705K82423k21359j85936K50617p1507q4006L08706
16451B981121j14511j4107j68941j85105K13848k95369K63151j0081O7335j21445
16441B615896K89723p5007m23474q5654J82110K78792j52614J3280j5394m50188
$$ plain form
16512 4038119 4299753 4296531 4091232 4227308 4151709 4134319 4082556 3925572 4200412 4134957
16502 4134957 4146177 4219686 3821540 3939795 4027905 3645465 3859232 3520021 3478311 3967216
16492 3967216 4076149 3487315 3437310 3736832 3692577 3412510 3710938 3509798 3280984 3432532
16482 3432532 3385628 3391466 3594023 3581921 3126192 3497345 3488856 3583994 3349990 2824828 2995689
16471 2995689 2880335 3058784 3266619 2888492 3109394 3492665 3078312 3127234 3162605 3035610
16461 3035610 3055107 3070888 2702183 2984606 2763247 2577311 2827928 2756421 2672415 2981121
16451 2981121 2866610 2852503 2683562 2498457 2712305 2416936 2680087 2670006 2737341 2615896
16441 2615896 2905619 2830612 2407138 2321484 2503594 2782386 2629772 2643052 2627658 2177470
16431B177470M04205k3762L9694j94385k03946J29580j2192M0930j3992K16414
16421B560016l09297J25102j54153j2059K64266m90329M5799M02054l47745L38773
16411B422427l13175n1017R4944L696J22965k87415J21110J38583k73669L19166
16401B297615j23903l42385M03084q7220L0351O5851n14462L02109J86363q7214
16391B130189j9913l69263j07907L19870m735m5148J69480o56914N52608q6163
16381A882104J38125l88705M65247j20528K119l35077m8784P0878K42525j35703
16371A772201j00738M33012m91945q2142L67508l02301M5134m0031O3822K49788
16361A914308m37209J92252j37123J61397l00061L01992J12269l35888J26592
$$ plain form
16431 2177470 2581675 2557913 2597607 2403222 2199276 2328856 2316664 2357594 2343602 2560016
16421 2560016 2250719 2375821 2221668 2209609 2473875 1983546 2029345 2431399 2083654 2422427
16411 2422427 2109252 2058235 2153179 2156875 2279840 1992425 2113535 2252118 1978449 2297615
16401 2297615 2173712 1831327 2234411 2147191 2177542 2243393 1728931 2031040 2217403 2130189
16391 2130189 2110276 1741013 1633106 1952976 1948241 1903093 2072573 1415659 1968267 1882104
16381 1882104 2020229 1631524 2096771 1976243 1978362 1643285 1594501 1665379 1907904 1772201
16371 1772201 1671463 2104475 1612530 1530388 1897896 1595595 1640729 1600698 1664520 1914308
16361 1914308 1477099 1669351 1532228 1693625 1393564 1695556 1807825 1471937 1598529
16352A598529N1318J29348K54439o21915J49673K14816l53157K84560j72629L2086
16342A567068k40824J66503j8136k31351L28591o6054K12117m51354j38021L10657
16332A439196K12515k8281k62302m5978J75687j28710P1490j01881K86275p3740
16322A544271j98762O0724j96875J93370m9129m6499K3116J91489j54303q2667
16312A284735K29335m97155N84000m40946J39138j52148M88417n56106K50732
16303A330002J19536l18613m5129K68626k8115j52177O4564J04510o6222k66920
16293A010062J19363j73273L97393r3377n3648l34028L21571q0175k03792O868
16283I16964L47929q4610r7056J36319l59065o5836N34446o4318L45646k35622
$$ plain form
16352 1598529 1649847 1779195 2033634 1411719 1561392 1776208 1423051 1707611 1534982 1567068
16342 1567068 1326244 1492747 1474611 1243260 1571851 1505797 1717914 1266560 1128539 1439196
16332 1439196 1651711 1623430 1361128 1315150 1490837 1362127 1433617 1331736 1618011 1544271
16322 1544271 1345509 1406233 1209358 1402728 1353599 1307100 1330216 1521705 1367402 1284735
16312 1284735 1514070 1016915 1600915 1159969 1299107 1146959 1635376 1079270 1330002
16303 1330002 1449538 1130925 1085796 1354422 1326307 1174130 1238694 1343204 1276982 1010062
16293 1010062 1129425 956152 1353545 1260168 1206520 872492 1194063 1113888 910096 916964
16283 916964 1264893 1180283 1083227 1219546 860481 794645 1329091 1264773 1610419 1374797
16273A374797l1183r1630k42389K9191M2511K71727l33057K0827J12252k06929
16263I46117J78659O5353m07299K27932l0766k7339j39804J58160j37743M94231
16253A327501r4466l74681O5592J47119J28298l60056j03482L13001J57980k63991
16243I42815K6941R6015m60591J60435J40306Q8429o4592j77030J66612M0784
16233I60124n878o2826O05j22024J17185m7727m6707K3487Q1839K33808k54017
16222H77869L40454l97316k77488J80193j62218L67560l47657j24755J37066j64796
16212D28912M27061L6219j02238m1495J01499k12637K58186j01049k06100Q9390
16202F77748r6967K01272q0297m2354Q2859k541J29937k24336p5671J64030j03957
$$ plain form
16273 1374797 1343614 1251984 1009595 1038786 1081297 1353024 1019967 1040794 1153046 946117
16263 946117 1124776 1190129 782830 1010762 979996 952657 812853 971013 833270 1327501
16253 1327501 1233035 858354 923946 1071065 1199363 839307 735825 1048826 1206806 942815
16243 942815 969756 1065771 605180 765615 905921 994350 929758 752728 919340 960124
16233 960124 954246 891420 892025 770001 887186 839459 792752 816239 898078 1131886 877869
16222 877869 1218323 821007 543519 723712 561494 929054 581397 456642 593708 428912
16212 428912 855973 892192 789954 748459 849958 637321 895507 794458 588358 677748
16202 677748 580781 782053 701756 659402 742261 739720 869657 645321 569650 733680 629723
16191F29723j42362N30120k90305J65696D34252L53567J42940N1274j72935P7519
16181H86617l73904K40205k11507k11019K70510k95549K99492L14738J281k86481
16171F34383Q854k24736K3304J51263j77607L1590K93179n5497L8036k66387l9304
16160D17078J978J36801k6187L54243l45160K99469L7964C09116O93889D56325
16149E19590o6951K55585j04992L0125j50302O8647j52077J69825R1060A96269
16138G04593j14337m5806n7966B32076N49812l70651J82290B60174L53530k98392
16128C15312J27190L22875C75925L4348R1503p5543J53296p7893B00070K33900
16118D33970M2379j39685J59747P8933k64738J57533A38501L91405M9802L0978
$$ plain form
16191 629723 487361 1017481 727176 892872 434252 787819 930759 982033 809098 886617
16181 886617 512713 752918 541411 330392 600902 305353 604845 919583 920864 634383
16171 634383 643237 418501 441805 593068 415461 447051 740230 684733 722769 456382 417078
16160 417078 419056 555857 529670 883913 538753 838222 876186 309116 1003005 456325
16149 519590 452639 708224 603232 633357 483055 551702 399625 569450 660510 196269
16138 704593 590256 544450 486484 232076 781888 411237 593527 260174 613704 315312
16128 315312 442502 765377 375925 410273 501776 426233 579529 501636 200070 433970
16118 433970 476349 336664 496411 575344 310606 468139 138501 529906 579708 610686
16108F10686k44801K53012A17646K03593k9492P4537K20970Q3565k02432K32996
16098G01383j79353Q8493J5079k57815L22386k46081M0242l8154k15505O1468
16088B92143J65775k12249j7822J5523J9051L83312l17019R30P6536N1058j77395
16077B79843L04997k71355K92181B34313K06673K08199m0972j02283o2699j00282
16067C42949K9311Q7508B03757r5760N16456j45219k0086J05958A11875N3610
16057A65485L04692i9260D55735q2795m8391L7201J16508B19601L0740R8004P0114
16046D18459J38150k12509J23641j2931j88012a0571A24940k642m7041J33049
16036B08306r3860L10002r5011R6506A22339L11121A05388K4401A7830J63087
$$ plain form
16108 610686 365885 618897 117646 321239 291747 366284 587254 670819 468387 701383
16098 701383 522030 610523 625602 367787 690173 444092 484334 446180 230675 292143
16088 292143 457918 245669 227847 243370 262421 645733 328714 329644 406180 457238 279843
16077 279843 584840 313485 605666 234313 440986 649185 608213 505930 443231 342949
16067 342949 372260 459768 203757 107997 624453 479234 459148 565106 111875 165485
16057 165485 470177 -99260 455735 372940 324549 361750 478258 219601 250341 348345 418459
16046 418459 556609 344100 467741 454810 266798 -10571 124940 122298 75257 208306
16036 208306 114446 424448 329437 425943 122339 433460 105388 129789 17830 180917
16026A80917H1621M28421A37534L38968j15261E1180L28141k7327p024A46425
16015C01776J37055J07925A87601G0165N25230j45420J5342A14205J05284O7431
16005B86920Q9141A15183m3864J32183B0173L51954R301A72927i6548H2399K92663
15994C75062J69352B21129O35495o669L32620j55330N19959n61833l01300r863
15984F74208k03724k05268q8030N7874K1640J26646J04924A7568O2710K53757
15974C34035A39755j9711K62089A90792J23167n3617E4790J97639p9118Q3417
15964B56728j15594L22533A94037c4855o3286J8736C48858a28321A46740E6260
15953A1493a21523A79227H8785J8370e2026E0634e3357F50040i143D81960B9454
$$ plain form
16026 180917 81621 510042 137534 476502 361241 51180 379321 351994 344970 146425
16015 301776 438831 546756 187601 70165 595395 449975 465317 114205 219489 286920
16005 286920 376061 115183 71319 203502 20173 372127 381428 172927 -96548 82399 375062
15994 375062 544414 221129 856624 849955 1182575 1027245 1547204 985371 684071 674208
15984 674208 470484 265216 177186 235060 256700 383346 488270 17568 80278 334035
15974 334035 139755 120044 382133 190792 313959 260342 54790 252429 173311 256728
15964 256728 141134 463667 194037 -34855 -98141 -79405 348858 -128321 146740 56260
15953 11493 -121523 179227 88785 107155 -52026 50634 -53357 650040 -9143 481960 29454
15941A05468J74307J1839g4686B07775G5246J62446D5133M5864k7079d8151C2129
15929b52960D29500b2898G5877a42398I8170m6769J50222e0550I6148j9835l0664
15918D5649J63212a22835B88181j41131L22716j40849B2889J60307A5919i4942
15907d2565A95388q1441R781J76716r2169n4688L34368b23184A55421J61067f9004
15895b7267A70323l6625b0469j07091A69031b1696A00392L6384n790c2893k15235
15884b48128A52370N4534b4934A22634a98506B54033a72826m9972c6382j23627
15874a60009B33702J7344L9756A34800P2072a22512B38131r8989l8342b07773
15863B6551L65055a730j69335H5734D1132O1485n023J37629k6542b10813C6657
$$ plain form
15941 105468 279775 291614 -74686 207775 75246 237692 45133 90997 63918 -48151 32129
15929 -252960 429500 -22898 75877 -142398 98170 51401 201623 -50550 96148 76313 45649
15918 45649 208861 -122835 288181 147050 469766 328917 22889 183196 15919 -94942
15907 -42565 195388 113947 123728 300444 208275 153587 487955 -223184 155421 316488 -69004
15895 -27267 170323 133698 -20469 -127560 169031 -21696 100392 136776 130986 -32893 -248128
15884 -248128 152370 206904 -24934 122634 -198506 254033 -172826 -222798 -36382 -160009
15874 -160009 233702 251046 290802 134800 206872 -122512 238131 139142 100800 -207773
15863 26551 391606 -1730 -171065 85734 41132 102617 97594 235223 208681 -210813 36657
15851a02231A30855P2289B2091J52232j500D5429J02355K07475A75459L5628j1737
15840A99350n9371J20372E6660a74136C32843p7216p9896A7243a41077A8610a23043
15828a40830E7916k7610a74283E2436a90334J8811A10050O8703a07014b8566A6002
15816A43097i590A40381n4788J39136e4331A63754Q0213a89329J4443A11648d3673
15804D53043f4689F0865b59555D6746K5287d1991D1883f3200A68470b06211R6484
15793a09727A36628B4007O5696J04742B1974P4465N506c836A27151b56822a24732
15781A75851p1146M854K43945E1007J43046L800F5240J42239K85534E7105N001
15770F2106b4947j46406L1849d7187B23978h527A07339J96612b12937I0390J54838
$$ plain form
15851 -102231 130855 203144 22091 174323 172823 45429 147784 355259 175459 211087 199350
15840 199350 139979 260351 56660 -174136 332843 255627 175731 17243 -141077 18610 -123043
15828 -140830 57916 30306 -174283 52436 -190334 -171523 110050 178753 -107014 -28566 16002
15816 143097 -9590 140381 85593 224729 -54331 163754 243967 -189329 -174886 111648 -43673
15804 453043 -64689 60865 -259555 46746 72033 -41991 41883 -63200 168470 -206211 -109727
15793 -109727 136628 24007 89703 194445 21974 96439 101945 -3836 127151 -256822 -124732
15781 175851 104705 109559 353504 51007 194053 197853 65240 207479 493013 57105 62106
15770 62106 -24947 -171353 -139504 -47187 223978 -8527 107339 303951 -212937 90390 245228
15759B45228J15040A02935Q5368a23918B21485b26986g043B16496F9598P5293
15749A44891M7070a7470j16294E7118O6373D3621b9626B55268F044c1784D9624
15737G5972N3230l0205J44323p5846J94855d02122B32418f3848A0821J76721J67416
15726C54958c447j3497k9382B3699K08391A7385K34727a97342m1239A31802c16302
15714E6756N68684g3836j16029Q5391k29217G6413a98486e83E6968h7316E7065
15702f0532K6372A96287a82753M7312e8066k9174p3794g3526A79551G120a77145
15690C41954F1655J16824m1959h624A6007J37386o3762m0245a931l94849C3104
15678B42886a84864O5678I4365a75623A97256f5471a3092l5112H0123K95399a20858
$$ plain form
15759 245228 360268 102935 188303 -123918 221485 -226986 -7043 216496 69598 144891
15749 144891 191961 -17470 -133764 57118 123491 43621 -29626 255268 6044 -31784 49624
15737 75972 129202 98997 243320 167474 362329 -402122 232418 -63848 10821 187542 354958
15726 354958 -3447 -16944 -46326 23699 232090 17385 252112 -197342 -238581 131802 -316302
15714 56756 625440 -73836 -189865 -104474 -333691 76413 -198486 -583 56968 -87316 57065
15702 -60532 -34160 196287 -182753 -135441 -58066 -87240 -161034 -73526 179551 7120 -177145
15690 341954 61655 178479 136520 -8624 16007 153393 89631 49386 -1931 -396780 33104
15678 242886 -184864 -119186 94365 -175623 197256 -65471 -13092 -48204 80123 375522 -120858
15666a21205j45281C02952j46137A1357K05980b24393A6127d157A95754a25067
15655B13738h9850j12534J7933A53828b13544B7673J35415a247p0702J3430C5569
15643A45255b99971A42822e3923o6459G3938J37350b62766a01239A09798b16156
15632a53215j3191A89362h8517H4864B1260O43J3600h0539D6283f4874F4437a56408
15619A19689F259K43711o8204f2357l3599o0344L3898d848l41941b6037o2384
15608h8421j12119j9640A04228d8338l1315A34694a13344M6990j59722B45153
15597a52281D8752L5160b64184J15165j68607B56205G0615a35805a7752G7582
15586h829p5462l5602L9429k1942m7190H7125a87267B39980a09797j61945J18949
$$ plain form
15666 -121205 -266486 302952 156815 11357 217337 -224393 16127 -4157 195754 -125067
15655 213738 -89850 -202384 -184451 153828 -213544 27673 163088 -1247 -71949 -58519 35569
15643 145255 -299971 142822 -53923 -120382 73938 211288 -262766 -101239 109798 -216156
15632 -153215 -166406 189362 -88517 84864 21260 21903 35503 -80539 46283 -64874 64437 -156408
15619 119689 6259 249970 181766 -62357 -95956 -156300 -122402 -4848 -346789 -26037 -88421
15608 -88421 -200540 -220180 104228 -48338 -79653 134694 -113344 -66354 -226076 245153
15597 -152281 48752 83912 -264184 -149019 -317626 256205 70615 -135805 -17752 77582
15586 -8829 -84291 -119893 -80464 -102406 -149596 87125 -187267 239980 -109797 -271742 -152793
15575a52793A43439b54755c474C2482a2061l20858C31237I7792b33579C52719
15564h5906A23985D0058f299C458e58j15014A30605h570q8003r7947B07475b29738
15551b39164n444A58874J05391q3391b46306A59585C2807a60281o909C85109b17572
15539a22343A39835c1537k6544q010A2792K243C628Q4856M7108E3783J51106G3699
15526e4258a2312C95013d27378C58060a18850G0512L582J31209J0801p4051D6344
15514D30260A591b93952e7668a3403I691c9649j70067Q9029E3078K64546b201
15502c069p8636n0085A46012J69840A00547a10654B59845G9495b45227B18200
15491b28812C892a09593o08M9412E6734P033d7461B29748g2437B35181o8991K48625
$$ plain form
15575 -152793 143439 -254755 -3474 32482 -12061 -332919 331237 97792 -233579 352719
15564 -85906 123985 40058 -6299 3458 -558 -115572 130605 -8570 -96573 -194520 207475 -229738
15551 -239164 -244608 158874 264265 180874 -246306 159585 32807 -160281 -167190 385109 -217572
15539 -122343 139835 -31537 -58081 -66091 12792 15035 3628 88484 135592 53783 204889 73699
15526 -54258 -12312 395013 -427378 358060 -118850 70512 74094 205303 216104 142053 46344
15514 430260 1591 -293952 -57668 -13403 9691 -39649 -209716 -120687 53078 317624 -2201
15502 -3069 -81705 -131790 146012 315852 100547 -110654 259845 79495 -245227 218200
15491 -228812 3892 -109593 -110201 -60789 56734 63767 -47461 229748 -72437 235181 166190 414815
15479D14815o2003J21407j95283J59048k10150l8105a2210r3116l3570A3887L23542
15468C37429H3770b25645H7835g4761B10059i0440B758J41298a76958c0723C4640
15456A53502b58749C26804j39890d06803C11701m864m9001l3312J4002M92035
15446G30561J51746r8725k35141k53307K5878j11576b72548A78191i7618D1273
15435a10107C18607I3501R43m4934e2915A60871j8873b54443F3633J28212c08537
15423a68766L1071C12204f8793k187D9672N9475P4734i1079A38066a28922I0155
15411G0925a96333B92257i6632C40577K467c76898B15730D6119a13275A0497c22158
15399c04798n2909a07697a773C38696j08451e1444B11599N3105j32221l9113N55
$$ plain form
15479 414815 352812 474219 278936 437984 227834 189729 -12210 -105326 -138896 13887 337429
15468 337429 83770 -225645 87835 -74761 210059 -90440 2758 144056 -176958 -30723 34640
15456 153502 -258749 326804 186914 -406803 311701 306837 257836 224524 238526 730561
15446 730561 882307 783582 548441 295134 321012 209436 -272548 178191 -97618 41273
15435 -110107 318607 93501 94444 49510 -52915 160871 141998 -254443 63633 191845 -308537
15423 -168766 -137695 312204 -68793 -70980 49672 109147 183881 -91079 138066 -128922 90155
15411 70925 -196333 292257 -96632 340577 343044 -376898 215730 46119 -113275 10497 -322158
15399 -304798 -357707 -107697 -1773 338696 230245 -51444 211599 264704 132483 93370 93925
15388I3925g0212J9775A00518R9036B3820K27615a98387C0750b20252E985g7029
15376A68786K39126j92094c1318r0870J3981A66335m0346K63797O6693B19657
15365e0133B70836F3408a81894B61657k0532I1558g9641H2870Q3307a94017B42675
15353C32258h795k30586A74026a61909B2017M12657q1624C6297a1025A2694K11298
15342B23992G0276J67568o7742J29373H5219J14829n8418M262F282g8112B95551
15330B04821a78444b6902B18164K7577O412E3219P7526l6261R3688i4432B44803
15318f1648l0878k1795F5993L3665C5627J20849b3973D7140K12604p8541p3447
15307A07756k9474K17973j15193p9598b09205h6088j49070B4424i0626B74856
$$ plain form
15388 93925 -70212 -50437 100518 199554 23820 251435 -198387 30750 -220252 5985 -77029
15376 168786 407912 215818 -31318 -122188 -108207 166335 125989 389786 456479 219657
15365 -50133 270836 63408 -181894 261657 241125 91558 -79641 82870 166177 -194017 242675
15353 332258 -8795 -239381 174026 -161909 22017 434674 353050 36297 -11025 12694 223992
15342 223992 70276 237844 170102 299475 85219 200048 141630 145892 6282 -78112 295551
15330 204821 -178444 -26902 218164 245741 252153 53219 130745 94484 188172 -94432 244803
15318 -61648 -92526 -114321 65993 99658 35627 156476 -23973 47140 259744 181203 107756
15307 107756 78282 296255 181062 101464 -209205 -86088 -235158 24424 -90626 274856
15296G691c5797E1433J82185q9718b715A93917b9500n1401K4059G1175b24148
15284B39388g4695k721n160n1191A33218o0176e4936p0867A37688c04547A83443
15272B44469c5527B73771c3810o4467N034B05496K6293a54965C7117j6319h6670
15260d94490D5690J64089J15852B7504g9498B32204b1453B29226J20563A42614
15249A72027j2560J221586J158907p14740O16109k70198H00552l09784A36568
15239B45316K23451e2842l06649A48697c1228A21030L0749b97602B48494F5466
15228h8911j26890E04706a84214d4338G9724L5451g981C17978j19711j0466b77216
15216H3503a27713p5596L2853A43107c0181B17158d43865i018C85194b993A61868
$$ plain form
15296 7691 -35797 51433 233618 143900 -2715 193917 -29500 -80901 -56842 71175 -224148
15284 239388 -74695 -77416 -82576 -133767 133218 73042 -54936 -125803 137688 -304547 183443
15272 244469 -35527 273771 -33810 -98277 -93243 205496 231789 -154965 37117 20798 -86670
15260 -494490 45690 209779 325631 27504 -79498 232204 -21453 229226 349789 142614
15249 172027 159467 1381053 2539960 1825220 2441329 2171131 800552 490768 136568
15239 245316 468767 -52842 -359491 148697 -31228 121030 151779 -297602 248494 65466
15228 -88911 -215801 504706 -184214 -44338 79724 115175 -7981 317978 198267 187801 -277216
15216 83503 -127713 -203309 -170456 143107 -30181 217158 -443865 -9018 385194 -2993 161868
15204b46535H1475N0406B0242K26802Q680b18324a01989A64236J81882a75628
15193A53362b778B1607K29243O0470G5127g9795J3374j04264O6522F8392J76149
15182B44541K9642b48351G7283k1250r29M2598A1287K51573B5944L1473j6813
15171D0604K50688c6847E5130a43730P0043C01297a82329B21910g9963A60480
15160A57562l2176h1330B74431D7119J61850a35763A5452K69658b47176E9990
15149d7718A04095M1382k5122m3223P4658K016Q766E9670c2414E6515K308A2415
15136A14743N1497B7068J31674K28834A48252o91e3979A11465L2555M9056a38138
15124b05435E9533k2519a25861B42465F6154L1150E023L06632J87693b9049r4255
$$ plain form
15204 -246535 81475 131881 20242 247044 255724 -218324 -101989 164236 346118 -175628
15193 153362 -2778 21607 250850 311320 75127 -79795 -66421 -170685 -104163 68392 244541
15182 244541 274183 -248351 77283 56033 55104 97702 11287 262860 25944 57417 40604
15171 40604 291292 -36847 55130 -143730 -73687 301297 -182329 221910 -79963 160480
15160 157562 125386 -81330 274431 47119 208969 -135763 15452 285110 -247176 59990
15149 -47718 104095 145477 120355 77132 151790 153806 162572 59670 -32414 56515 58823 12415
15136 114743 166240 27068 158742 387576 148252 147561 -53979 111465 144020 193076 -138138
15124 -205435 59533 37014 -125861 242465 66154 97304 5023 311655 499348 -29049 -123304
15113a23304A42294F5834K2941a79167a4677B74350i1185A4876L95035j69541
15103B40370C3705K15344d1486A70254b44195C64767a33901B33800J59145j42459
15093B50486j18371K5243L147D6546Q7742b9174A12237M93876a90067A70745k2449
15082A48296L4191O1486g0826B75584c1565C42257m8127a22718G6327g8246I2697
15070I4231J65442A13963B2537b6114B4627N1904M68340A81060J37165A32477
15059D2945K62562J84345b78329B16388L3518l9178a36896A18729K10948B565
15048A14166m7744L48687J29050j64255k0895J35011A81625J88103F7779J9073
15038H6852L88229j90296p5303H7209O5175C5022K49941q6896M21202C00889L85782
$$ plain form
15113 -123304 142294 65834 88775 -179167 -14677 274350 -91185 14876 409911 240370
15103 240370 33705 249049 -41486 170254 -244195 364767 -133901 233800 392945 250486
15093 250486 132115 157358 160505 46546 134288 -29174 112237 606113 -190067 170745 148296
15082 148296 182487 243973 -70826 275584 -31565 342257 294130 -122718 76327 -78246 92697
15070 94231 259673 113963 22537 -26114 24627 76531 544871 181060 318225 132477
15059 42945 305507 489852 -278329 216388 249906 210728 -136896 118729 329677 2565
15048 114166 66422 415109 544159 379904 359009 494020 181625 369728 67779 86852
15038 86852 475081 284785 209482 87209 152384 35022 284963 198067 619269 300889 686671
15027F86671B31031N23858k86699J39022B25780J10868A19903K34084K04353B78779
15016B19864M39393l02249E0634P38246B68008j5493K92665A18696N453B1615
15005B53156L60761B15734K61294n8312j09906o1254J00963j16761L54354r4529
14995D91583L1425k43665J07659K90170l14754J27727A45560e9922A25546L3590
14985A59136J92577K6207j33453M89294A11985C2235P64808B49076K15472K01849
14975F66397J6761C34412K65799B99756M78841k70553O0000J16818j59581j04854
14965D20427J06181j91239L37873j57979k38293J1964j13726K53032P7925E7421
14954E65175A22341M51180k039A66659K28420q6675J56736J32875j83915j45441
$$ plain form
15027 686671 231031 754889 468190 607212 225780 336648 119903 353987 558340 278779
15016 219864 659257 357008 50634 788880 268008 252515 545180 118696 124149 21615
15005 253156 613917 215734 477028 418716 308810 247556 348519 231758 586112 491583
14995 491583 523008 279343 387002 677172 362418 490145 145560 -59922 125546 159136
14985 159136 351713 377920 244467 733761 111985 32235 797043 249076 464548 666397
14975 666397 683158 334412 600211 299756 778597 508044 568044 684862 525281 420427
14965 420427 526608 335369 673242 515263 276970 288934 175208 428240 506165 57421
14954 565175 122341 573521 571482 166659 395079 308404 465140 598015 414100 268659
14944B68659M4100L36326k58084r030A67754K61867J63312n6883n2583N89805
14934A073272m62976K81045j84219L99412j84933J18014k95174M95630k39902
14925A000169p671j33370K71883J44865L65124r1952O8296n6150m30596j21707
14915A008891j47207k56700k59289P384J88882A62416N68938B22319K89374j94005
14905C17688M7293j80384R2996g111B09862K27417j62412K5284R3965D96J82131
14894A82627L85257N9368r8227B61827J29274k7472L25146R5042k40010R3998
14884F37805j70628J43982J89946L3964j36225o012p0119k19285L9540j42832
14874C00136j24822L81338J51635K21306D24956L81474l1374o0356k59752j52043
$$ plain form
14944 268659 312759 649085 391001 381971 167754 429621 592933 536050 483467 1073272
14934 1073272 610296 891341 707122 1106534 921601 1039615 744441 1240071 1000169
14925 1000169 992498 859128 1131011 1275876 1641000 1549048 1617344 1561194 1130598 1008891
14915 1008891 861684 604984 345695 353079 541961 162416 731354 222319 511693 317688
14905 317688 364981 184597 277593 -7111 209862 437279 274867 300151 394116 496 182627
14894 182627 567884 627252 529025 261827 391101 363629 688775 783817 543807 637805
14884 637805 467177 611159 801105 835069 698844 692832 622713 403428 442968 300136
14874 300136 175314 556652 708287 929593 424956 806430 775056 714700 454948 302905
14864C02905K44308j69057J23527p2244j37028j2681n4441K29451K26224k92699
14854C88265J82699p6860A89960J83505N061K86426N5547C30642N59304n782P7965
14843I62129k66650J64652J45243l1225l07410O1558L3119k51406n0696B06079
14832D66847K65848k97766m0178J62103o1316R5914j47155m0451O3666O3425j30474
14821D00463N14361l18987N0744p2192J74830k76053q9719k2351n1989j6097J22897
14810D15907j06315R8753J47416Q9214J45801J79407m83804L15061o5619j29999
14800F05822J39425k57745K29823k28914L16945k44131J63750k08899K23978l53409
14790C86645M09784k18096j56321J50003j24002Q9474k57021K32359Q6381B96279
$$ plain form
14864 302905 547213 378156 501683 429439 292411 279730 225289 454740 680964 388265
14854 388265 570964 494104 189960 373465 378526 664952 720499 330642 889946 884164 962129
14843 962129 695479 860131 1005374 974149 666739 728297 761416 510010 459314 206079
14832 466847 732695 434929 394751 556854 495538 591452 444297 403846 467512 530937 400463
14821 400463 914824 595837 646581 574389 749219 473166 383447 361096 309107 293010 415907
14810 415907 309592 408345 555761 644975 790776 970183 486379 801440 735821 605822
14800 605822 745247 487502 717325 488411 805356 561225 724975 516076 740054 386645
14790 386645 796429 578333 422012 572015 448013 537487 280466 512825 599206 296279
14779E14225k05175J58702K56342p4699J24308k33808O9241J98262m8459j52096
14769F06843Q5990J58018j85446m9825M40469D56963o3859K06413K67454j51926
14759G15045k04953p2979j7814M3669Q7524k50611K72290J90861j93012J80732
14749G50752k23034L69841k53275l5374J67001j95361J80184j86734M1626J10369
14739G25995q9455L18811k47287j90414L90587j328n787K50607n44265J97515
14729H04979j34784N65970k93717N7837J05503K55154L42894j42801l39404j74143
14719A047488P0989k87663j1079N1985R7389l17533K88399k23484j48125K24378
14709G92744N854M7607q1168M18808J9761l10100K37902q1180R9377L04413J04698
$$ plain form
14779 514225 309050 467752 724094 649395 773703 539895 609136 807398 758939 606843
14769 606843 692833 850851 665405 615580 1056049 456963 393104 599517 866971 715045
14759 715045 510092 437113 419299 462968 550492 299881 572171 763032 570020 750752
14749 750752 527718 897559 644284 608910 775911 580550 760734 574000 615626 725995
14739 725995 636540 955351 708064 517650 908237 906909 901122 1151729 607464 804979
14729 804979 670195 1236165 942448 1000285 1105788 1360942 1703836 1561035 1221631 1047488
14719 1047488 1118477 830814 819735 871720 969109 651576 939975 716491 568366 792744
14709 792744 798598 846205 765037 1183845 1203606 893506 1131408 1050228 1149605 1454018 1558716
14698A558716J7264k23522l04087j23226l779l0077k51264J4897k7238m5263L50712
14687I33133K4846j1598j87627K9535M17453E85071M67138k08379P778m6903J07350
14676I12055K0812j16917j12231J35952J62519M9782l07896J80676P4803J76347
14666A175902r9242j40422J31659l571j97007L54323o4290k71918j5226P6154
14656I46362j33477l2341J55311M36463j40327Q212k2214R5688Q7627k16304O2678
14645A247678k9924j0908l3520n430K2444J55521j23728j86815M499o9466N07747
14634A478098n8926k82652m8013J08478j54700K52503j89990N17173k56867j20548
14624A244556L9355q4903P1017J64729l78465l7917M11387j57350M52442k35885
$$ plain form
14698 1558716 1575980 1352458 1048371 925145 921366 891289 640025 654922 627684 582421 933133
14687 933133 957979 946381 758754 788289 1205742 585071 1052209 843830 851608 804705 912055
14676 912055 932867 815950 703719 839671 1002190 1051972 744076 924752 999555 1175902
14666 1175902 1076660 936238 1067897 1064326 867319 1221642 1157352 885434 870208 946362
14656 946362 812885 780544 935855 1372318 1231991 1240203 1217989 1313677 1401304 1185000 1247678
14645 1247678 1217754 1206846 1173326 1167896 1190340 1345861 1222133 1035318 1039817 970351 1478098
14634 1478098 1419172 1136520 1088507 1196985 1042285 1294788 1104798 1621971 1365104 1244556
14624 1244556 1283911 1199008 1270025 1434754 1056289 1018372 1429759 1272409 1724851 1488966
14614A488966j03557k34728L35734j23471M4673q417n2913p7407L17742P7257
14604A663879j86343m6217J27741k70290L69904j77085Q9886j39198J52642O3234
14594A648153k90240K5048K18528J2472j86199q1903L13971J79779k21541L14770
14584A932838k38562P5415K192m9084l2107O9388J2006M09552m27151R0970r572
14573A835885j42925J69826K24323L18669l07365L09414j03548k75634K00800
14564B229445K05350k78091P1085J16488J9498P7811K49292K65034k2062J40872
14554C074722L32174L25079L90619K07212J182604J423302M146589Q768471K0095906
14545C9946678J645816A9559469p644708m381701C616245j238042m61167l88085
$$ plain form
14614 1488966 1385409 1150681 1486415 1362944 1407617 1399200 1346287 1268880 1586622 1663879
14604 1663879 1477536 1431319 1559060 1288770 1658674 1481589 1571475 1432277 1584919 1648153
14594 1648153 1357913 1382961 1601489 1613961 1427762 1345859 1659830 1839609 1618068 1932838
14584 1932838 1694276 1769691 1771883 1722799 1690692 1760080 1772086 2181638 1754487 1845457 1835885
14573 1835885 1692960 1862786 2087109 2405778 2098413 2407827 2304279 2028645 2229445
14564 2229445 2434795 2156704 2227789 2344277 2363775 2441586 2690878 2955912 2933850 3074722
14554 3074722 3406896 3731975 4122594 4329806 5512410 6935712 11082301 19850772 39946678
14545 39946678 41592494 19559469 11914761 7533060 3616245 2378203 1917036 1528951
14537A528951p2707K9274J03304K8717J10188J00020o4490Q5558K3635K46791
14527B119241Q8183j580j54871J41966O8745k96498R3531M70071l9395j60063
14517B329330l14966K72067K84510j21090l97395J29534K82290L1057J53632n27663
14507B121306O91624j86999L78338l62379P9839P8823J80360m48909M60076J1419
14497C003498J76663p6411j06147J95808J3649j61183K99196j33218k24793L41905
14487C328967N3133L38238k57139O1558L7678J87223m23294M71349j37829K01162
14477C861046L7545o8619Q5825l37133J60156J12278J72717K40002j01868J50099
14467D312048k14063L1363J8696K70344q967M0706K74331k51839n196L92128j78740
$$ plain form
14537 1528951 1456244 1485518 1588822 1617539 1727727 1827747 1763257 1848815 1872450 2119241
14527 2119241 2207424 2205844 2050973 2192939 2261684 1965186 2058717 2528788 2489393 2329330
14517 2329330 2014364 2286431 2570941 2449851 2052456 2181990 2464280 2495337 2648969 2121306
14507 2121306 2812930 2625931 3004269 2641890 2721729 2800552 2980912 2532003 2992079 3003498
14497 3003498 3180161 3103750 2997603 3193411 3207060 3045877 3345073 3211855 2987062 3328967
14487 3328967 3382100 3720338 3463199 3524757 3562435 3749658 3326364 3797713 3659884 3861046
14477 3861046 3898591 3829972 3915797 3578664 3738820 3851098 4023815 4263817 4161949 4312048
14467 4312048 4097985 4129348 4148044 4418388 4409421 4450127 4724458 4472619 4467423 4859551 4680811
14456D680811r1454O1201K89796k98001K95281K27926n635m00443N46329j46825
14446E158986O0880Q5240m3719K67999J74539n26803L54625L67881m21543M02398
14436E880483L70869j67051m5786L55277j80047K89194J49199L0675N5083J63374
14426F901270o5664N14245j55790J30035P4099k10754K92727L91691J9940J39154
14416H030953M0787P8477p0614j99551N53964q1110N18553J63686r5719j5000
14406H924426K37908J12029r9557Q7615J59426J08243K05737J90064M53003j45791
14396A0233103m0185N48622N57595l78478K00014L98430J25880J97090K31269
14387A2073340m7021N34788J52332L95197J41123J2774R1552M23136J13299M22640
$$ plain form
14456 4680811 4589357 4650558 4940354 4642353 4937634 5165560 5159925 4759482 5305811 5158986
14446 5158986 5219866 5305106 5261387 5529386 5703925 5177122 5531747 5899628 5478085 5880483
14436 5880483 6251352 6084301 6038515 6393792 6213745 6502939 6652138 6682813 6737896 6901270
14426 6901270 6835606 7349851 7194061 7324096 7398195 7187441 7480168 7871859 7891799 8030953
14416 8030953 8071740 8150217 8079603 7880052 8434016 8352906 8871459 9035145 8939426 8924426
14406 8924426 9162334 9274363 9174806 9262421 9421847 9530090 9735827 9925891 10378894 10233103
14396 10233103 10192918 10741540 11299135 10920657 11120671 11519101 11644981 11842071 12073340
14387 12073340 12026319 12561107 12713439 13108636 13249759 13262533 13354085 13777221 13890520 14313160
14377A4313160L57832K46030K01489M14008M2142N77608L65696K88417J34486
14368A6940868L49613N52714N366O22688L76234L10150N33886N32036N6497Q40564
14358B1120616M73082K46895P75970M62863L99946O74270P55601M55594K42637
14349B5607474J074006N46421M95775N99163J474705J68217Q40053R92316J437620
14340C3235750K62401O54806R34616J409310Q44625J173315J248097J391266R57527
14331D2111713J324417J415569J253698J613750J333244J677667J705035K241528
14323E4676621J247622K111454K128356K246487K503137K570306K580518K333227
14315G2397728L176538K923180L141585L223339L740476L711915M142523L892430
$$ plain form
14377 14313160 14670992 14917022 15118511 15532519 15574661 16152269 16517965 16806382 16940868
14368 16940868 17290481 17843195 17848561 18471249 18847483 19157633 19691519 20223555 20280052 21120616
14358 21120616 21593698 21840593 22616563 23079426 23479372 24153642 24909243 25364837 25607474
14349 25607474 26681480 27227901 27723676 28322839 29797544 29965761 30805814 31798130 33235750
14340 33235750 33498151 34152957 35087573 36496883 37341508 38514823 39762920 41154186 42111713
14331 42111713 43436130 44851699 46105397 47719147 49052391 50730058 52435093 54676621
14323 54676621 55924243 58035697 60164053 62410540 64913677 67483983 70064501 72397728
14315 72397728 75574266 78497446 81639031 84862370 88602846 92314761 96457284 100349714
14307A00349714M202586M717400N031737M865822N289729O007335O049603O618587
14299A43132513O512537P611041P841768Q260878Q713139R336547R590006J0311585
14291B11310014J0757083J1157940J1930301J2473543J2764836J3179763J3269356
14284B96842836J4372704J4493498J4749425J4837655J4606527J4166063J3651551
14277C97720259J3049797J1963466J0293677Q705814O542983K282548j59179r6276
14269D50303089k398742n220040l848071m740361r077602j1423725j2938541j3738474
14261C86917533j4632115j5581615j5772982j5566447j5283610j5204079j4748039
14254B80128646j4093099j3185022j1070228j2487495j1414453j1308374j0760730
$$ plain form
14307 100349714 104552300 109269700 114301437 119167259 124456988 130464323 136513926 143132513
14299 143132513 149645050 157256091 165097859 173358737 182071876 191408423 200998429 211310014
14291 211310014 222067097 233225037 245155338 257628881 270393717 283573480 296842836
14284 296842836 311215540 325709038 340458463 355296118 369902645 384068708 397720259
14277 397720259 410770056 422733522 433027199 441733013 448275996 450558544 450399365 450303089
14269 450303089 447904347 442684307 438836236 434095875 425018273 413594548 400656007 386917533
14261 386917533 372285418 356703803 340930821 325364374 310080764 294876685 280128646
14254 280128646 266035547 252850525 241780297 229292802 217878349 206569975 195809245
14247A95809245r658848r224793q330081q075525p411190p339224p125786o370282
14239A32273516o285296n100852n097052n188545m499774m863189l894614m018475
14231I3325719l591472l639759l631932k824218l256323k773731k823476k071924
14223F8712884k539713k920864j875350j905269j971317k155684j729962j717594
14215E1897131j678682j292428j064698k137510j183137j569897j039158j228836
14207D0702785q13718j087977j273697j056145j213854p13281q11124o07349j206305
14198C1919335p92491j106557o70905r28644j75175p21176q88689n32881n63193
14189B5539624r52826m67823m19237m37918o34466n47597n60326k28397q22601
$$ plain form
14247 195809245 186150397 176925604 168595523 160519998 153108808 145769584 138643798 132273516
14239 132273516 125988220 120887368 115790316 110601771 106101997 101238808 97344194 93325719
14231 93325719 89734247 86094488 82462556 79638338 76382015 73608284 70784808 68712884
14223 68712884 66173171 63252307 61376957 59471688 57500371 55344687 53614725 51897131
14215 51897131 50218449 48926021 47861323 45723813 44540676 42970779 41931621 40702785
14207 40702785 39889067 38801090 37527393 36471248 35257394 34544113 33732989 33125640 31919335
14198 31919335 31126844 30020287 29349382 28420738 28245563 27524387 26635698 26102817 25539624
14189 25539624 24586798 24118975 23699738 23261820 22627354 22079757 21519431 21291034 20468433
14180B0468433J21832q89910m03061l57172k53489m33554l36178n93699K460l83604
14170A6942058k83556l07997m51429l45369j45271l88089m58558J25534o86145
14161A4001178L65503l62976m48424k24659n33928L30294n86819j52380O9389
14152A2457178n39718j60396Q3128n10352j72968J74053m56185M1920j17858k59914
14142A0538888o0610m55537j53137L2262k87303N0437K9285k03813k94209k50092
14132H946171J02919m23409K98190o28704k4510n1192k03943R7389l63049l62433
14122G387429L57713P8870m0367m64517J00151j26145j19965j61704P0220j02477
14112F979208n00652K02538J00405m66662J49509J22184l64763O0494k07627J38791
$$ plain form
14180 20468433 20590265 19700355 19297294 18940122 18686633 18253079 17916901 17323202 17325662 16942058
14170 16942058 16658502 16350505 15899076 15553707 15408436 15020347 14561789 14687323 14001178
14161 14001178 14366681 14003705 13555281 13330622 12796694 13126988 12540169 12387789 12457178
14152 12457178 11917460 11757064 11840192 11329840 11156872 11330925 10874740 10916660 10798802 10538888
14142 10538888 10478278 10022741 9869604 9901866 9614563 9665000 9694285 9490472 9196263 8946171
14132 8946171 9049090 8625681 8923871 8295167 8270657 8219465 8015522 8112911 7749862 7387429
14122 7387429 7745142 7824012 7783645 7319128 7419279 7293134 7173169 7011465 7081685 6979208
14112 6979208 6478556 6681094 6781499 6314837 6464346 6586530 6221767 6282261 6074634 6213425
14102F213425k02970k54331R6360O6240l25311K38489k87772k46080J62168j02465
14092E357753k58295J75602k04630K0204J30455p2015K4458j5106m57444j43232
14082D557750j23660J16589J12250M4224r0279L84498n75058P7605m05871J12404
14072D210452J67988k99398K67191n38013P9896K44541j26989J7251J25486l58190
14062C790215J04195k45452j86449N06878k42724l65733J50196L37924n9084l85428
14052C404538R7718m2778k4590k06451M33055l37543k32863J59699O1107L02308
14042C614200o37179K12164O7680l48977L80788l9807M9097K0887K62581q5255
14032C496179J10517m11268N769j69671N0830l60345L74791l26603j61042j55059
$$ plain form
14102 6213425 6010455 5756124 5852484 5918724 5593413 5831902 5544130 5298050 5460218 5357753
14092 5357753 5099458 5275060 5070430 5090634 5221089 5149074 5173532 5158426 4700982 4557750
14082 4557750 4434090 4550679 4662929 4707153 4616874 5001372 4426314 4503919 4098048 4210452
14072 4210452 4378440 4079042 4346233 3808220 3888116 4132657 4005668 4022919 4148405 3790215
14062 3790215 3894410 3648958 3462509 3969387 3726663 3360930 3511126 3849050 3789966 3404538
14052 3404538 3502256 3459478 3434888 3228437 3661492 3323949 3091086 3250785 3311892 3614200
14042 3614200 2977021 3189185 3256865 2907888 3288676 3248869 3297966 3318853 3581434 3496179
14032 3496179 3606696 3195428 3201197 3031526 3082356 2722011 3096802 2770199 2609157 2454098
14022B454098K30061L94131o03382O3172J89328k71543J05118j22577k59586R8983
14012B277803K45617l68702K55273K9537k65141K09280K81565l95140q3973J59318
14002B345437l37380L50383k70817p1290L89231l15324O995k94485J40932l059
13992A940623K92240L51628L9252O92060J409626N558336J4927661K0154701j4925764
13983C0440363j5124072o427936l146119j152234l82744o57242k40138J86906
13975C496784q61891K10493j88798K7015j72866j22025P6492l6258j06286K70869
13965B593529o32118M32799j46463J68183j90087k75848K29244o4024j89671Q6552
13955B012096J08774k46595P9473j31501J25933j53963j14123J08678M5213m9467
$$ plain form
14022 2454098 2684159 3078290 2474908 2538080 2727408 2455865 2560983 2438406 2178820 2277803
14012 2277803 2523420 2154718 2409991 2439528 2174387 2383667 2665232 2270092 2186119 2345437
14002 2345437 2008057 2358440 2087623 2016333 2405564 2090240 2097235 1802750 1943682 1940623
13992 1940623 2232863 2584491 2623743 3315803 4725429 10283765 25211426 45366127 30440363
13983 30440363 15316291 8888355 5742236 4590002 4207258 3550016 3309878 3496784
13975 3496784 2634893 2845386 2656588 2683603 2510737 2388712 2465204 2428946 2322660 2593529
13965 2593529 1961411 2394210 2247747 2415930 2225843 1949995 2179239 2115215 1925544 2012096
13955 2012096 2120870 1874275 1953748 1822247 1948180 1794217 1680094 1788772 1833985 1784518
13945A784518j7111L31068j81418k68519K33867k26390j8255J77305M0317L35221
13935B190603p38443J53737J17995l04275K03900k65049J83381P1717K07285l06715
13925A514136j16390J09968j13336J61560J04424j11284p385K9434j64537j19592
13915A286998J70888L75330l69415l55198L96236j14372K3802Q6046j69492n8948
13905A271875j51136M69874j02689j74243K04098k67608K99281K80088n75599
13896A253941l00092K59606J08222j27105J24438K33793n7228o43440L16845K64628
13886A433608m93220J64459K27394k73271J26904L6543K55399p09948K96248N4203
13876A118319R9868N8334k72891Q3723j68606K01695Q0463j37870m1973N6248
$$ plain form
13945 1784518 1767407 2098475 1917057 1648538 1882405 1656015 1637760 1815065 1855382 2190603
13935 2190603 1452160 1605897 1723892 1419617 1623517 1358468 1541849 1613566 1820851 1514136
13925 1514136 1397746 1507714 1394378 1555938 1660362 1549078 1541693 1571127 1406590 1286998
13915 1286998 1457886 1833216 1463801 1108603 1504839 1390467 1414269 1500315 1330823 1271875
13905 1271875 1120739 1590613 1487924 1313681 1517779 1250171 1549452 1829540 1253941
13896 1253941 953849 1213455 1321677 1194572 1319010 1552803 1495575 852135 1168980 1433608
13886 1433608 940388 1104847 1332241 1058970 1185874 1222417 1477816 767868 1064116 1118319
13876 1118319 1218187 1276521 1003630 1087353 918747 1120442 1200905 1063035 1021062 1077310
13866A077310p8303J15628K1373q0778J47458j0796l9224J93572m63518q860j97601
13855F76261N38658p1817k57971J79246p7816n6688o3444q615J32488r3901K3910
13844I20311J84467K8108q1038o2514l4769q0459K59125j73989N3638k11022R8872
13833I00730K33752R391j13044j44069J55138k94735J88257p4394j06782j61416
13823E92828L17424q1331L00667m07805J85551k47425j16230M50425j97215M2583
13813H39472j28485L89223j45327m21255L97779N0761k95409N39687n95175J67378
13803G98649k37016K82427K3124j66013p036M7677j41579K81167j80542K22101
13793I22959l57708M16192k35185K20895j49313K99911E44181L08701p6353k50251
$$ plain form
13866 1077310 999007 1114635 1136008 1055230 1202688 1191892 1152668 1346240 882722 873862 676261
13855 676261 1214919 1143102 885131 1064377 986561 929873 866429 857814 990302 896401 920311
13844 920311 1104778 1132886 1051848 989334 954565 874106 1133231 959242 1012880 801858 900730
13833 900730 1134482 1143873 1030829 886760 1041898 747163 935420 861026 754244 592828
13823 592828 910252 828921 1129588 721783 907334 659909 543679 994104 796889 839472
13813 839472 710987 1100210 954883 533628 931407 982168 686759 1226446 631271 798649
13803 798649 561633 844060 867184 701171 694135 741812 600233 881400 700858 922959
13793 922959 565251 981443 746258 967153 817840 1117751 544181 852882 776529 526278
13783E26278J12303n2764J337L06710l77223J37842k41633O9327k4012Q3279r8178
13772D43266L50267k8684L3438J3449J7013j55033k14220L42718N1872l63970
13762D90116L8061J86751P347l09599K56755M04685D69233K20385j33035j45292
13752D11291L63172j4768k9836q4892J9416q2162k06343K82658j88601K17447
13742F87382k37643K18229j20151J90002j46139j42631j15926O44797k32549j51986
13732E93385L34030l10586Q8373B32299M12954K41296m39743L12984C20662L19218
13722F39880m1139p8970K5679m6620j16643R1236k25299L32743J1625r4385j82114
13711C15993L19507P375B38782J49894q0154J32150R776J12421m403m7336O7188
$$ plain form
13783 526278 638581 585817 587154 893864 516641 654483 412850 482177 458165 541444 443266
13772 443266 793533 764849 798287 811736 828749 673716 459496 802214 854086 490116
13762 490116 528177 714928 722275 412676 669431 1074116 469233 689618 556583 411291
13752 411291 774463 759695 729859 644967 664383 582221 375878 658536 469935 687382
13742 687382 449739 667968 547817 737819 591680 449049 333123 977920 745371 593385
13732 593385 927415 616829 705202 232299 645253 886549 446806 759790 320662 639880
13722 639880 598741 519771 545450 498830 382187 473423 248124 580867 592492 498107 315993
13711 315993 635500 642875 238782 388676 308522 440672 450448 562869 558466 511130 578318
13700E78318k44948L37807k9016k12193K22249r6734k24310J48622L44881l59450
13690D65226K25788k41050N4961K54866l10724K47380C27661c0038A88425K46800
13680D35225k3533O7697n9275l7972L12299B24246K56390j92285M58249r4547
13670F52053j97636J34292m9659j54977J83170B53748m3953R7156L42581j93427
13660D56105M1468p2319j38393J37714j54267L41071j66865K24593j05202j59501
13650D04404O6389j49311K17445M8558K57166l34229r1736j0770A90312J98713
13640C89025p3449J04477j9966L14964k53700J95362j06200L9346j89281n11M565
13629D04632l6734J79058B30265K83315n3232j86062J06402L40029B68435L06210
$$ plain form
13700 578318 333370 671177 642161 429968 652217 555483 331173 479795 824676 465226
13690 465226 691014 449964 504925 759791 449067 696447 327661 -30038 188425 435225
13680 435225 411692 479389 420114 382142 694441 224246 480636 288351 746600 652053
13670 652053 454417 588709 539050 384073 567243 253748 209795 306951 649532 456105
13660 456105 497573 425254 286861 424575 270308 611379 444514 669107 563905 404404
13650 404404 470793 321482 538927 587485 844651 510422 418686 407916 190312 389025
13640 389025 315576 420053 400087 715051 461351 656713 550513 589859 400578 400067 404632
13629 404632 367898 546956 230265 513580 460348 274286 380688 720717 268435 574645
13619E74645k59051J22009k02639L57259B46645J00290j54202K77047B08113c0868
13608C49243J30357l6409j1465q232A33868J76821K04950m4257j8549O8583o3954
13597D57462L62739B93565R2400A55268M05799k80235J45765j17050K24776j89600
13587C44723J53065m1352q6075J09014A35075K71616A79739K31472A85730l493
13577A82237J83432N0639j94979F4573N04181k31161n5090K40144j43850O310
13567C85107J54807j18924B08127L45204k46608m1076m9829K56114k15549c3248
13556D72683R4557C2649L73537j5813j46231L9619K60519j84545p1847o9483L89720
13545F08125l01862O9013j10184M2676a13503D90955j78927K59245j67939I6196
$$ plain form
13619 574645 315594 437603 234964 592223 246645 346935 192733 469780 208113 -30868
13608 349243 479600 443191 431726 423494 133868 310689 515639 471382 452833 521416 457462
13597 457462 820201 293565 385965 155268 561067 280832 426597 309547 534323 344723
13587 344723 497788 456436 370361 479375 135075 406691 179739 411211 185730 182237
13577 182237 365669 416308 221329 64573 568754 337593 282503 522647 378797 385107
13567 385107 539914 420990 208127 553331 306723 265647 215818 471932 256383 -33248
13556 472683 567240 32649 406186 390373 244142 283761 544280 359735 287888 218405 608125
13545 608125 306263 375276 265092 307768 -113503 490955 312028 571273 403334 96196
13534I3082J48348r0910L62759o4982D8007M83729A58470G0618K23740J85161
13524D79519k06782G0641L03182i8064G5091L17508j95767c2483B20217J30247
13514C50464A39709O51098A35316j8768P9762K26687D4283M91246A77973K53962
13504D31935N1596a01079A39343J01229a8707A99437I2387K72426J90835A4628
13493a4126A25685K39752j41405K0853J89678I9905K59880L2450A95279A8050
13482C35666n1132R2968j15245R5724q4139J93302A78982J26398M5707j55186
13472A95901A5786M45179C0897L61279A52321G1860k4363K03637p1047J61947
13462C42034C5127b09134E01431B14191H9695J8515P7034j0168R9507A36520K07169
$$ plain form
13534 93082 241430 150520 513279 448297 48007 531736 158470 70618 294358 479519
13524 479519 272737 70641 373823 -98064 75091 392599 196832 -32483 220217 350464
13514 350464 139709 790807 135316 116548 196310 422997 44283 535529 177973 431935
13504 431935 483531 -101079 139343 240572 -18707 199437 92387 364813 555648 14628
13493 -14126 125685 365437 224032 244885 434563 99905 359785 392235 195279 18050
13482 335666 284534 377502 262257 357981 273842 467144 178982 305380 351087 195901
13472 195901 15786 460965 30897 392176 152321 71860 47497 251134 180087 342034
13462 342034 35127 -209134 501431 214191 89695 108210 185244 175076 274583 136520 343689
13451C43689M8267J07640k14275A34713L57691C3242M86725j34763E1605K91225
13441C42830J77025A75770j7044O4023J01272F8065n972P5730L35232b1664C40862
13429B32955j10540l7080K02993J21691A26161j3863J94241j2461n6080A16759
13418D12598j97358J70349l7691j67830H5257C2976L27254o2180f6131e826B94830
13406a520B12851J14787Q4762A19981L623m8366b4317A34326P0887M0043R9296
13395C44552j10461I0981R7858o7103K81708A97354J81834R8243j51035L841A30017
13383E0065K32825o7284r4072N8449J37756a14502A63351b32038A02244B5667
13372A44211L9662q097L25031A01469K47771q0053r9555K42380J8611C6766j6881
$$ plain form
13451 343689 391956 499596 285321 134713 492404 33242 519967 385204 51605 342830
13441 342830 519855 175770 158726 222749 324021 68065 62093 137823 473055 -21664 340862
13429 232955 122415 85335 288328 410019 126161 112298 306539 294078 237998 116759
13418 412598 215240 385589 347898 180068 85257 32976 360230 298050 -66131 -5826 294830
13406 -1520 212851 327638 412400 119981 123604 75238 -24317 134326 205213 245256 344552
13395 344552 234091 90981 188839 121736 403444 197354 379188 477431 326396 330237 130017
13383 50065 282890 215606 121534 179983 317739 -114502 163351 -232038 102244 25667
13372 144211 183873 175776 500807 101469 349240 269187 169632 412012 430623 36766 19885
13361A9885K29933L34480k00468a82658B81243L49700E6474J52482D5014N33282
13351E78296B18859l5438a82600A73816J54349o4513A26487f68B91786J55800
13341D47586A14848J58602k0475J7508A9549L91494F7176J11692L31715A24256
13330B59304L55097B94688E8740J05802k0852N1247J18101e3058I2457K28270
13320C20727L04282k18565q9215J16287j59769E2573K75081j22540J61778j49030
13310B17862K10239B0876b25354A79975a72088B55443a21557C04609m3823i6557
13299B70540q1371D0407L88918q0276G514a59459B72878a00795A50271p296l5884
13288A07091K52896H1094J23729j5737b60205A22635J74205L3352j04366J3415
$$ plain form
13361 19885 249818 584298 383830 -182658 281243 630943 56474 208956 45014 578296
13351 578296 218859 183421 -182600 173816 328165 263652 126487 -668 291786 447586
13341 447586 114848 273450 252975 270483 19549 411043 67176 178868 510583 124256
13330 259304 614401 294688 58740 164542 143690 194937 313038 -53058 92457 320727
13320 320727 625009 406444 317229 433516 273747 52573 327654 205114 366892 217862
13310 217862 428101 20876 -225354 179975 -172088 255443 -121557 304609 260786 -96557
13299 270540 189169 40407 429325 349049 7514 -159459 272878 -100795 150271 142975 107091
13288 107091 359987 81094 204823 189086 -260205 122635 296840 330192 225826 239241
13278B39241Q3325I9902R3932C3140J6059J56263o4167K07604a4832j74416B43347
13266b30096a1781I6977a23004D1765B493L7260N9167Q6344l0423P9511J9173
13255B53525B8725L89969G06R5796O8621D1715a18468B95204A4609b69205C26744
13243B08420I1976j100a2157C00305c3076A68276C1924R7075K68919A2145K2110
13232C4255p139J14320a26165G1647a32716A62369a34346A10422l6557a05040
13221H4198J30044A01631a10390A81112q9399C5982N4844R0509C0168F682J58870
13210A65552n0264K79436b44800C5507E873O9186a42151m0020k7792C15621j6780
13199B98841a229m0106A95259k6095F8479J5609N9902F8550b6561G7264L61358
$$ plain form
13278 239241 322566 99902 193834 33140 49199 205462 141295 348899 -14832 -189248 243347
13266 -230096 -11781 96977 -123004 41765 2493 39753 98920 185264 154841 234352 253525
13255 253525 28725 418694 706 96502 165123 41715 -118468 295204 14609 -269205 326744
13243 208420 91976 90876 -12157 300305 -33076 168276 31924 128999 397918 12145 34255
13232 34255 27116 141436 -126165 71647 -132716 162369 -134346 110422 73865 -105040
13221 84198 214242 101631 -110390 181112 91713 35982 90826 181335 30168 6682 165552
13210 165552 115288 394724 -244800 35507 5873 75059 -142151 -182171 -209963 315621 298841
13199 298841 -1229 -41335 195259 169164 68479 84088 143990 68550 -26561 77264 438622
13188D38622h5217A42332Q0893A09170a56883A94029l3369m9016N5975l4044K16558
13177C50133j16031J0256J44844A0122a5398C4537J88157a58488B86401b1655
13166C9091J67173J9268g4362p5579b0373r8148B50316I8328P8665J29783O9480
13155C76256b8064A04109L4013J42602H5638a04665A42566R2953b5749B52158
13144B65248j03499a07090I2004a46741C34502h8793r7475A27389D6939a47616
13133c9955j03828A14823J53072a59974A8270f0076A4065a18585B6714b8090B84808
13121a44995e6879k20631C41867j61471G826P3873h2997G8076P9619d6012b262
13109A57645c160B82286a40189A84225j0464O5482e267C18577a3522A97950O1488
$$ plain form
13188 438622 -85217 142332 223225 109170 -156883 194029 160660 111644 167619 133575 350133
13177 350133 234102 244358 389202 10122 -15398 34537 222694 -158488 286401 -21655
13166 39091 206264 225532 -74362 -149941 -20373 -118521 250316 98328 176993 306776 376256
13155 376256 -28064 104109 138122 280724 85638 -104665 142566 235519 -25749 252158
13144 265248 161749 -107090 92004 -146741 334502 -88793 -186268 127389 46939 -147616
13133 -39955 -143783 114823 267895 -159974 18270 -60076 14065 -118585 26714 -28090 284808
13121 -144995 -56879 -277510 341867 180396 7826 81699 -82997 78076 157695 -46012 -2262
13109 157645 -3160 282286 -140189 184225 173761 239243 -5267 318577 -13522 197950 259438
13098B59438A12469a72019A14219N6635H962J12091g7067B34671j03474q232Q594
13087A31559a3536k44706A28451d28I5775J61179a79365B35835a08244i583o4856
13076g4439j07951C4488a00500C58737K3060b10298F597h5388j02307D29647E1347
13064A41864l3643K9807N4115l3178a60925r325q6102A93499n9813a1988I8344
13052A99693h9163A35090K27590C3880N2822J38945j5780I1025J02583G3497e5739
13040C62125i3011C761J00544i2849a2070a897A07083K00213H000K84612b80106
13028A49004n7863P5622D9193M3816j62J02663A092K29677F09O3957J96178L3038
13016B93782j20507H1711J31077j9270D4394a21880D4931K6417c24020B97443
$$ plain form
13098 259438 112469 -172019 114219 170854 8962 121053 -77067 234671 131197 122965 131559
13087 131559 -13536 -258242 128451 -428 95775 256954 -179365 235835 -108244 -9583 -74439
13076 -74439 -182390 34488 -100500 358737 381797 -210298 6597 -85388 -187695 429647 51347
13064 141864 108221 138028 192143 158965 -160925 -170250 -256352 193499 133686 -11988 98344
13052 199693 -89163 135090 362680 33880 86702 225647 209867 91025 193608 73497 -55739
13040 362125 -93011 3761 104305 -92849 -12070 -1897 107083 307296 8000 292612 -280106
13028 149004 91141 166763 49193 93009 92847 195510 1092 230769 609 64566 260744 293782
13016 293782 173275 81711 212788 193518 44394 -121880 44931 71348 -324020 297443
13005c37089A02035k5100J745J27835n6472d3995B06917M8883F1755k5424a9339
12993A18500g3402B21086r1664J15172J8464c25638f2004C5853a79627A79612
12982A52354J61588c87520A4810Q6961b19497P436F2095a67328D3443J6740g6242
12970b02240C5694K16343b76271B60165g7280e284k9611D7024b26545f7405p5399
12959a42804A15569i7361D8539d73980A00585f0085C8896J22061J2714J28221
12949C01892b90404c7179A63307f3903F9282a01559F409P5044c02613A24280O7043
12938A91323c78974N2261a58524A17662d38736H3332b31689A07499a86957c1047
12927C97268g9910C66758a01411D36933G4431J6471i8639E1919b55138A92030
$$ plain form
13005 -337089 102035 76935 78680 206515 150043 -43995 206917 255800 61755 36331 -19339
12993 118500 -73402 221086 129422 244594 263058 -325638 -62004 35853 -179627 179612
12982 152354 313942 -387520 14810 101771 -219497 -212061 62095 -167328 43443 60183 -76242
12970 -202240 35694 252037 -276271 260165 -77280 -5284 -34895 47024 -226545 -67405 -142804
12959 -142804 115569 -97361 48539 -473980 100585 -60085 38896 160957 173671 301892
12949 301892 -290404 -37179 163307 -63903 69282 -101559 6409 81453 -302613 124280 191323
12938 191323 -378974 -326713 -158524 117662 -438736 83332 -231689 107499 -186957 -31047
12927 397268 -79910 366758 -101411 436933 74431 90902 -98639 51919 -255138 192030
12916b0937B31452c86181e1983r3843A08538e924j1951k49479E8167a28322C06261
12904C67517A78430g5078b3705B84420Q081j32182d9625C15828C6050i8254J3440
12893h4814k14616A62903j7974F170b15751a04787A2739e78111B50993A14380
12882B72157O3535G1087E330J9907M09882a07201A53579R8572i7111j4439B4885
12870B26774a60807g7271I5430b05018C54287g9653j98856C27350c9407r040K1462
12859b6985J2559a663B8847a72271B99155j26355f3742k52709a27207A29109R033
12848A38142L5395a56810O5752p9401G2009a73072C9616P187b04069A28199B5948
12836A68039b57819i0093p587A19932j0060a18704C24321A45062a35825A62333
$$ plain form
12916 -20937 231452 -386181 -51983 -145826 108538 -5924 -17875 -267354 58167 -128322 306261
12904 367517 178430 -75078 -23705 284420 292501 160319 -49625 315828 36050 -98254 -84814
12893 -84814 -299430 162903 144929 6170 -215751 -104787 12739 -578111 250993 114380
12882 272157 335692 71087 5330 25237 435119 -107201 153579 252151 -97111 -111550 24885
12870 226774 -160807 -77271 95430 -205018 354287 -79653 -278509 327350 -39407 -48447 -26985
12859 -26985 -14426 -1663 28847 -172271 299155 172800 -63742 -316451 -127207 129109 138142
12848 138142 173537 -156810 -91058 -170459 72009 -173072 39616 46803 -204069 128199 25948
12836 168039 -257819 -90093 -97680 119932 109872 -118704 324321 145062 -135825 162333
12825a43303M477A05102b64266H4243d8724a8714j5790F3954a21090B20807I6485
12813A845K02869e5692D0787a15706C04035o1877k7502c7832j61291c5052r1204
12802a26256J7109m41073C55469m9021G7856K5847b12967R8116A3588f0784e177
12790a05877N1505A9894N0861J73549a00212G1335K13619j16732f5112a2789j15482
12779a28271A11238a06212b0856r6698C2748a52545b7311j14887o8896f5519m2411
12768a07930B26161a72002A04699B4069f06593A46968L9707D3443a14734d8073
12757A19965a45246C6666N51390b18750A48027R3716c4504C6612d6059n3439A30550
12745A18215k6178m2065a3425C07254l1569a31250B00378J26511j04459a26989
$$ plain form
12825 -143303 -138826 105102 -264266 84243 -48724 -18714 -34504 63954 -121090 220807 96485
12813 1845 204714 -55692 40787 -115706 304035 242158 214656 -37832 -199123 -35052 -126256
12802 -126256 -109147 -550220 355469 306448 77856 103703 -212967 -114851 13588 -60784 -5177
12790 -105877 -54372 19894 70755 244304 -100212 71335 284954 168222 -65112 -12789 -128271
12779 -128271 111238 -106212 -20856 -117554 32748 -152545 -27311 -142198 -211094 -65519 -107930
12768 -107930 226161 -172002 104699 24069 -606593 146968 186675 43443 -114734 -48073
12757 119965 -145246 36666 588056 -218750 148027 241743 -34504 36612 -46059 -99498 130550
12745 118215 92037 49972 -13425 307254 275685 -131250 200378 326889 222430 -126989
12734A50636G4200b03660F3051a88674B749a86573A51026J66125c9907B66126
12723C4446J1676c53105a1500A26642M0062J385h4977b4395r9262D29476a43605
12711A70144d9075A21301G440J63923D1526Q6717R5379h6745G060L10002g4685
12699h398E1066R8907m8176a81471A38603L8536k9125o1380e7466A66326A7289
12687A3471O5157K40469A40197J10136B5454K93713B3507J2791O5796d9590E0149
12675H3016J31934a07064C17600F5605f7001B20824p4328l5322J37608K6762i5271
12663h7013k01568j00733i6046k98100O6760C0567N7418b44439A52066g7565E9252
12651c2878A86166i4189H4763b04510d2411D2830a66939D33258b04421B72072
$$ plain form
12734 150636 74200 -203660 63051 -188674 2749 -186573 151026 317151 -39907 266126
12723 34446 46122 -353105 -11500 126642 166704 168089 -84977 -24395 -123657 429476 -143605
12711 170144 -49075 121301 7440 171363 41526 128243 223622 -86745 7060 317062 -74685
12699 -8398 51066 149973 101797 -181471 138603 177139 148014 86634 -57466 166326 17289
12687 13471 78628 319097 140197 250333 25454 319167 23507 36298 102094 -49590 50149
12675 83016 214950 -107064 317600 65605 -67001 220824 146496 111174 248782 275544 -95271
12663 -87013 -288581 -389314 -96046 -394146 -327386 30567 87985 -244439 152066 -77565 59252
12651 -32878 186166 -94189 84763 -204510 -42411 42830 -166939 433258 -204421 272072
12640A90215E5403d5793l17694g1636j4442E4944a23574k6461C22360k4338b34249
12628A82220a95346a6562C51835c7067l7882A95293r0099m3497c5652o7114o3962
12617a66728D1968g3063A47790a10611d8140A80345D5579K3360k3025J58698E1751
12605A37045J23576I9318b09625B23585J22870c20558d9053A34269a47088B62046
12594g5326J6103D2305J27549b6585A12672j0685K6574D6152B1767b44788J14037
12583a30751A67745B6164N1739J05145c81078A39390R2857l9538J37563c531C70229
12571b83050a22565B1714J47741J16789A33784h4667m136C59900a89596R155G3487
12559e1598A03826a94951B6850c63039a60659a2115B64821j29940a8251j27872
$$ plain form
12640 190215 55403 -45793 -363487 -71636 -86078 54944 -123574 -150035 322360 298022 -234249
12628 182220 -195346 -16562 351835 -37067 -74949 195293 105194 61697 -35652 -102766 -166728
12617 -166728 41968 -73063 147790 -110611 -48140 180345 45579 68939 45914 204612 51751
12605 137045 260621 99318 -209625 223585 346455 -320558 -49053 134269 -147088 262046
12594 -75326 -59223 42305 169854 -26585 112672 101987 128561 46152 21767 -244788 -130751
12583 -130751 167745 26164 77903 183048 -381078 139390 232247 192709 330272 -3531 370229
12571 -283050 -122565 21714 169455 286244 133784 -84667 -88803 359900 -189596 -180441 73487
12559 -51598 103826 -194951 26850 -363039 -160659 -12115 264821 134881 -18251 -146123
12549a46123K1556D19232j40647D3524K22919h6607j74959A05611A8825J18788
12539A37613a44593B41517P2302A06219a49847q3175C12545M5498d9377f294A02666
12527C67768b65982m6042E2196c21044F2612h8393B2405K95184i2835k31973a851
12515b7467K872A00950a36323o373B01905q8509l1863K73833A43389L61024J61164
12504F65577j06193E6540J63311a47458A61382c0105A27940c65931A32762j2345
12494A20417L7596a55512k69794J84081C94911c8730A83304L7791a5946I3251
12483c35122h9753C34170b45431C01065A34600l3001C7214L79416A63873c2643
12472d2199m9103J9338I8958Q2719p0863k3754a60423A52528b79117Q6978g8006
$$ plain form
12549 -146123 -124567 419232 278585 43524 266443 -86607 -261566 105611 18825 137613
12539 137613 -144593 241517 313819 106219 -149847 -233022 312545 358043 -49377 -6294 102666
12527 367768 -265982 -312024 52196 -321044 62612 -88393 22405 317589 -92835 -324808 -1851
12515 -27467 -24595 100950 -136323 -142696 201905 113396 81533 355366 143389 504413 665577
12504 665577 559384 56540 219851 -147458 161382 -30105 127940 -365931 132762 120417
12494 120417 158013 -155512 -425306 -241225 394911 -38730 183304 221095 -15946 93251
12483 -335122 -89753 334170 -245431 301065 134600 101599 37214 416630 163873 -32643
12472 -42199 -91302 -71964 98958 181677 110814 87060 -160423 152528 -279117 -192139 -78006
12460C9714b94786g4565m5192B715a91583M8344B16673q2892c1894G2258J97151
12449B69409i137B56066j07411a29160K7682A54676g555B08554a15462l901F4303
12437A19215k7967H824b66427b5969a0183B37846b18046i1179j01933m7023i4904
12425B74827J66341a15310l0185r1403D5599J18467c26065g2996b7850A50078
12414C2065j5540a29484A4339Q1744K4750e965A78558G8388M3506B3877R9479
12403A23356J44833j33149b29652h7523G1820J6287a93953g8825k2283B24627
12392C05348a3806B63328K6850A02618c7883B78977D240c37715A8980J16426a8893
12380A90171b58989A81914L26082a23528M6318F3232K7277f202D0269J23592e1395
$$ plain form
12460 39714 -294786 -74565 -119757 2715 -191583 -143239 216673 133781 -31894 72258 269409
12449 269409 -9137 256066 148655 -129160 -101478 154676 -7555 208554 -115462 -119363 64303
12437 119215 91248 8824 -266427 -25969 -10183 237846 -218046 -91179 -193112 -240135 -94904
12425 274827 441168 -115310 -145495 -236898 45599 164066 -326065 -72996 -27850 150078
12414 32065 16525 -129484 14339 96083 120833 -5965 178558 78388 121894 23877 123356
12403 123356 268189 135040 -229652 -87523 71820 88107 -193953 -78825 -101108 224627
12392 305348 -13806 263328 290178 102618 -37883 278977 4240 -337715 18980 135406 -18893
12380 190171 -258989 181914 507996 -123528 -77210 63232 90509 -6202 40269 163861 -51395
12368f5180A3355d99479g4187j15140A15030A2951g6210B860J50143J22504a4452
12356H5212e7143H8896K72383g299F2443i1034R725d0278j39180B2644a78900
12344a82877j95307C4255d7289H577Q8534a19145A5413J39350b708p1278q3265
12333a57251C11071c0322E1132a93973C28885J5838j50178p5245E5074d9013A49100
12321B39482c7600B65638K281j10340K0282F9493a95321E5974A4021J36740A5142
12309D3429b3647A41151i1709A27059K3089j2401E2356a18745A66160P1076a32814
12297i2439j27532A12114c9893J1094n3912B08116E2254B2902l685J48396F230
12285B97201a52448D633a69884B12089g6900D3706M5827d6552o9189A26902B9265
$$ plain form
12368 -65180 13355 -499479 -74187 -189327 115030 12951 -76210 2860 153003 275507 -14452
12356 85212 -57143 88896 361279 -7299 62443 -91034 -81309 -40278 -179458 22644 -178900
12344 -182877 -378184 34255 -47289 8577 97111 -119145 15413 154763 -2708 -73986 -157251
12333 -157251 311071 -30322 51132 -193973 328885 344723 194545 119300 55074 -49013 149100
12321 239482 -37600 265638 267919 157579 177861 69493 -195321 55974 14021 150761 15142
12309 43429 -23647 141151 -91709 127059 150148 137747 52356 -118745 166160 237236 -132814
12297 -92439 -219971 112114 -39893 -28799 -82711 208116 52254 22902 19217 167613 6230
12285 297201 -152448 4633 -169884 212089 -76900 43706 89533 -46552 -115741 126902 29265
12273G4662J9722a35924B77417C9092K8328g128F6796K36132b27526C92812A51823
12261B3424M7017b00113d8266o472I5866a44968A57835d7278A06535J1344a84885
12249D36015i7762l2403F989J78293J12589A21808g3955D8148L3026a01780d1473
12237a4409J628B7818Q1089D0992M028M6895C9953J67884j01293a00034D26501
12225A71693O2265P2513r9150Q1086a99610C43111n8534A00383N2761a4017A80439
12213c0768D68507N9302B07396M7302A19303L83181A90380m8614K54744d2923
12202A9212a87983M5936D1746J7189n65R8666c3919k09062A66743J56182A57685
12190C65824A21100J29390l3855A9531K58913o1423P9084A32335L808M13376c0803
$$ plain form
12273 74662 94384 -135924 277417 39092 67420 -7128 66796 302928 -227526 392812 151823
12261 23424 70441 -200113 -48266 -54738 95866 -144968 157835 -47278 106535 117879 -184885
12249 436015 -97762 -130165 6989 185282 297871 121808 -73955 48148 81174 -101780 -41473
12237 -14409 -12781 27818 108907 40992 45020 91915 39953 207837 106544 -100034 426501
12225 171693 233958 306471 207321 288407 -199610 343111 284577 100383 153144 -14017 180439
12213 -30768 468507 527809 207396 254698 119303 502484 190380 141766 396510 -42923
12202 19212 -187983 -142047 41746 58935 58370 157036 -33919 -242981 166743 322925 157685
12190 365824 121100 250490 216635 19531 278444 217021 296105 132335 136143 549519 -30803
12178A79865J68066J47994B08862B4139a17760l6687A75525P2705n7267o6237
12168A24726L2795B9035K24588F9681K88109a7262G3694K64006D1265K76969c8857
12156B42353b01490P8649I4505J21631J10768C6593M1848c4147j46140A23663
12145E8580h158j34935K9591d5817A06162g7576A69453E9133f5551p2628E0711
12133B43348k3049J25252D4295A1147L281a36482D06053C8748a3001B22748Q9772
12122C12520b55974E8198K8666a37962A51353c8161A62380a77909D6740a46604
12111D56528A87063f5934o3498B39259a8713D9510b66141b5545q8065b0734D1963
12099d9999k797J1323A63900J31161b12551a7811C13402A20032k1406E298a18327
$$ plain form
12178 179865 347931 495925 208862 24139 -117760 -154447 175525 248230 190963 124726
12168 124726 157521 29035 253623 69681 357790 -17262 73694 337700 41265 318234 -38857
12156 242353 -201490 -122841 94505 216136 326904 36593 78441 -34147 -180287 123663
12145 58580 -8158 -143093 -113502 -45817 106162 -77576 169453 59133 -65551 -138179 50711
12133 243348 220299 345551 44295 11147 14428 -136482 406053 38748 -13001 222748 312520
12122 312520 -255974 58198 86864 -137962 151353 -38161 162380 -177909 46740 -146604
12111 456528 187063 -65934 -129432 239259 -18713 49510 -266141 -25545 -113610 -20734 41963
12099 -49999 -52796 -41473 163900 295061 -212551 -17811 313402 120032 98626 5298 -118327
12087f4334C8567d85j02401K8938H9246m952l1717J26787e6229l7047A84082o9178
12075A14904N5433m2208a70009e2665C90075A33395M8303q2481d4330B2592J31415
12064A54007J41318b0158C95961d0301D4195P5121f4088j96923A9546J49761b26010
12052g7763B6269J70876N3143B8093Q4263j5480a60371d3994j98998f2391j36193
12041a98584a74q3883o93B19983C3725J05110a93536d7286A82388H9981K22931
12030C12912I642b4940H0129J10929K06339a8617A58152c8745C49115c17588A13949
12018a86296G8259i9672d2361a1760l47171H3181E08M3755a22989B79767q6088
12007A93679a49399C4189N70J39364o3181a30424A80506a11172A6366K36784k7915
$$ plain form
12087 -64334 38567 -485 -102886 -73948 89246 84294 52577 179364 -56229 -93276 184082 114904
12075 114904 170337 128129 -170009 -52665 390075 133395 181698 99217 -44330 22592 154007
12064 154007 295325 -20158 395961 -40301 44195 119316 -64088 -261011 19546 169307 -226010
12052 -77763 26269 197145 250288 28093 112356 96876 -160371 -43994 -242992 -62391 -198584
12041 -198584 -174 -84057 -84750 219983 33725 138835 -193536 -47286 182388 89981 312912
12030 312912 9642 -24940 80129 191058 397397 -18617 158152 -38745 349115 -317588 113949
12018 -186296 78259 -99672 -42361 -11760 -358931 83181 508 44263 -122989 279767 193679
12007 193679 -149399 34189 34759 174123 110942 -130424 180506 -111172 16366 253150 225235
11996B25235o7868a40618C19552A32841k0506R9684H17N5999g1293o0063G9763
11984F4731c32653d8676D506g0934A25301a64848B30098h7339j4019c0946A41172
11972G684R9746a77619P9069F4267K426b11644B6031a39333C10376D9643b18797
11960i9917L8093B42955e4654l3303a0238m08079A83976b18450R3933A65616o2352
11949A03264C3a70318N8717D1424a74071k36585J82513B02600f5136K2763k7962
11938g0335k55353B56438A13076B4242b15344e7457A13717a72087e1623A59448
11927A8117K34784j16278c9436i591j7508j0831k65732c8489E8322N2465a83354
11915B15844H6878c88398D8290K41452b99788i5450r9910I5583b32062g5185e522
$$ plain form
11996 225235 157367 -140618 319552 132841 112335 212019 817 56816 -71293 -131356 79763
11984 64731 -332653 -48676 4506 -70934 125301 -164848 230098 -87339 -101358 -30946 141172
11972 7684 107430 -177619 -98550 64267 66693 -211644 26031 -139333 310376 49643 -218797
11960 -99917 -61824 242955 -54654 -87957 -10238 -418317 183976 -218450 -124517 165616 103264
11949 103264 33 -170318 -111601 41424 -174071 -410656 -228143 202600 -65136 -42373 -70335
11938 -70335 -325688 256438 113076 24242 -215344 -57457 113717 -172087 -51623 159448
11927 18117 252901 136623 -39436 -9591 -27099 -37930 -303662 -38489 58322 110787 -183354
11915 215844 86878 -388398 48290 289742 -299788 -95450 -195360 95583 -232062 -75185 -5522
11903C72855a17872j66777B28180F0544J33174O7007a63794B30181c20473A08640
11892A56147K1436h4870a670G1390b99339A03390d1017k06608A60078E3794c9121
11880b72679n1461R7766H6816h3615n4354L0287B3502J06149F055b78667j29616
11869d08283J13571M3123J06318M8101e273q3062A5620h165l13475q143a25266
11857A27460J37755a69717A06748C7990a14256B06993n5897c80973A55647a17526
11846B19093r6941e9795A47930c3576E447a64745F4059J11889f0519J4018F9201
11834A13365J9708A1089a27982D4740e4861j08392n1008A53131C1050c17319i0550
11822c55068A09421K8259m2119g886D9912b45799A06815a05803c3370I0196l0458
$$ plain form
11903 372855 -117872 -284649 228180 60544 193718 260725 -163794 230181 -320473 108640
11892 156147 177583 -84870 -1670 71390 -299339 103390 -41017 -247625 160078 53794 -39121
11880 -272679 -324140 -226374 86816 -83615 -137969 -107682 23502 129651 6055 -278667 -408283
11869 -408283 -294712 -251589 -145271 -97170 -5273 -88335 15620 -8165 -321640 -329783 -125266
11857 127460 265215 -169717 106748 37990 -114256 206993 151096 -380973 155647 -117526
11846 219093 122152 -59795 147930 -33576 5447 -164745 64059 175948 -60519 -46501 69201
11834 113365 133073 11089 -127982 44740 -54861 -163253 -214261 153131 31050 -317319 -90550
11822 -355068 109421 137680 95561 -7886 49912 -245799 106815 -105803 -33370 90196 59738
11811E9738K90122r8751b43870a04867A26329K6470B0760b9277n632B1235a4651
11799h6308L059A53015j2655a18750A1748P5308a29629n4624A52111b95664N0345
11788b45319A43423a74973p9168a12426C8065m304K62534a73326B53348a77219
11777a72687C24657a49898E6660M2971a85102B93500g6914F7378a11123N2672
11767e8451F594a16j14673I6510d8253J0156j29784j60913A22105J25435D7404
11755B5953J19376a51632k3016r7000Q6944L924P89j7180e4644j49107h3419A89948
11742g6305H1950b0000j07932j4029k17746C3433b41519A782a04832j64962F9994
11730a8819F0340H906a81599p0488A73110p6061K8113k0573b800j87317A40848
$$ plain form
11811 59738 349860 251109 -243870 -104867 126329 152799 20760 -29277 -34909 21235 -14651
11799 -86308 -83249 153015 140360 -118750 11748 87056 -129629 -184253 152111 -295664 -245319
11788 -245319 143423 -174973 -254141 -112426 38065 33761 296295 -173326 253348 -177219
11777 -172687 324657 -149898 56660 99631 -185102 293500 -76914 67378 -111123 -58451
11767 -58451 6594 -116 -114789 96510 -48253 -38097 -167881 -328794 122105 247540 47404
11755 25953 145329 -151632 -174648 -271648 -184704 -180780 -179991 -197171 -54644 -203751 -83419 189948
11742 -76305 81950 -20000 -127932 -141961 -359707 33433 -241519 1782 -104832 -269794 69994
11730 -18819 60340 8906 -181599 -252087 173110 97049 125162 104589 -2800 -190117 140848
11718F4451a22147l44514a24434F5680D28R1857B0838L43649C3021a72098M1192
11707a30906J7053r2480F0326d2978j12360H9203Q662f8221k36821a05318H2569
11695c54581A8110i5960D7518d8222J1157j00322B44264h760A13106D9503d8918
11683B25428H0348j8604e2320H3782N0145L4985a10432c7992B24406A8252a39335
11671A38329c8939F1829R2852i8780a0872q8300D9462b993o7647B60752a99188
11659i2724C61567B1042J0510a82411C11019j07965a11012c3759B34340j04967
11649A29373l6252j7521a45763D9525J38691H2043b92551d8652C12285I0955a88969
11637g2212j97842D8721L1107D16P2895G485e3366A21679A1124J74025o4157A6862
$$ plain form
11718 64451 -122147 -466661 -124434 65680 428 92285 20838 364487 33021 -172098 -130906
11707 -130906 -113853 -206333 60326 -42978 -155338 89203 97865 -68221 -305042 -105318 82569
11695 -354581 18110 -95960 47518 -48222 -37065 -137387 244264 -8760 113106 49503 -48918
11683 225428 80348 61744 -52320 83782 133927 168912 -110432 -37992 224406 18252 -139335
11671 138329 -38939 61829 154681 -98780 -10872 -99172 49462 -2993 -70640 260752 -199188
11659 -92724 361567 21042 31552 -182411 311019 203054 -111012 -33759 234340 129373
11649 129373 93121 75600 -145763 49525 188216 82043 -292551 -48652 312285 90955 -188969
11637 -72212 -270054 48721 79828 416 73311 7485 -53366 121679 11124 185149 120992 16862
11624a22377B33386a87570d2400j66540j61182A34876e0158n9205E6422D847a5827
11612b8194k64495a3721D2517R8637b31374j31401J79367k1709c6351G499d22143
11600f195o7101H5040J46762a46061C6321J34769G827K74237a72480Q2173B87220
11588b11322e4947F3417R8595i8376D7696j9682J21727P5563D1619H549L49669
11577C58218j56039n939e0799B7638Q1393P823a48849B45300b589B77458a00556
11565A27388a39054B7866P5751a42621J2514C1051L7137e6242l5431b1698B81922
11553A22560a1973k72169E9430a29672d7349C53409C1117a41141q456J8062D13946
11541A84988J8300b42821B63494a9359B88442b52122A34484E8964c349B19424
$$ plain form
11624 -122377 233386 -187570 -42400 -208940 -370122 134876 -50158 -109363 56422 4847 -15827
11612 -28194 -292689 -13721 42517 141154 -231374 -362775 -183408 -205117 -36351 7499 -422143
11600 -6195 -73296 85040 231802 -146061 36321 171090 7827 282064 -172480 -90307 287220
11588 -211322 -54947 63417 162012 -98376 47696 28014 149741 225304 41619 8549 358218
11577 358218 202179 196240 -50799 27638 109031 116854 -148849 245300 -2589 277458 -100556
11565 127388 -139054 27866 103617 -142621 -130107 31051 68188 -56242 -91673 -21698 281922
11553 122560 -11973 -284142 59430 -129672 -47349 353409 31117 -141141 -149597 -131535 413946
11541 184988 203288 -242821 263494 -19359 288442 -252122 134484 58964 -3349 219424
11530A91281p6196L1944F8494h2037D02679d270A06127e451A89294j5531L41918
11519E15681H0921K39618B5031J02009K24782H4728h498B58940D254K20395L0353
11508B55002c3955D4889P8124n3362a42102C097m56K15890j8840B8442f0457A09999
11495a70785D52003A67666B8464a29060I6524j1896J15145j7429K79155a5594
11484B04069d4484I8258K9560b1317o6568E0044O1867a6768C21919b5798E975
11472B69978a28004C94070j05489k8241b04280k0089H1569K67991g7926n2308
11462a30234B47562h3999B21416D0243e7187A58105J7194A4090a02162B39327
11451B3188d1523C2115O3263K6663j658o220Q4578f4249B11344A8778f1934A21712
$$ plain form
11530 191281 115085 147029 68494 -82037 402679 -4270 106127 -5451 189294 173763 515681
11519 515681 80921 320539 25031 127040 351822 84728 -8498 258940 4254 224649 255002
11508 255002 -33955 44889 123013 69651 -142102 3097 2641 218531 199691 28442 -60457 109999
11495 -170785 452003 167666 28464 -129060 96524 84628 199773 182344 461499 -15594
11484 204069 -44484 98258 127818 -21317 -87885 50044 111911 -16768 321919 -25798 5975
11472 269978 -128004 394070 288581 260340 -204280 -224369 81569 349560 -77926 -130234
11462 -130234 247562 -83999 221416 40243 -57187 158105 175299 14090 -102162 239327
11451 23188 -41523 32115 95378 122041 120383 114163 198741 -64249 211344 18778 -61934 121712
11438a0334B61465p9413K7201R3342O2674h7605D35332A10966d9440A71593A2149
11426C25827H6797J38171j11762b72785A61141c39924E5295b7298H8441g2065
11415A42358e130j88701A99460a45891D31106A4268O6673J36151a9905j02856
11405a22761A71266P8551o2508p2550g2723A96468l1429H1715b39423J13380f726
11393g1106B28135A2173O9259J1383e5409A55850g331l6227j12366A83215b39782
11381a92283M9413A33237C7998a15849d8273A62373n8226b07021E6046c1540A48816
11369a64199G2703d6906A03505i3120j2457j59522g8248p2330I9330b28870J271
11358b27599A38298c59267H5795d0984j26170P1862A14661a60433b9750B9724
$$ plain form
11438 -10334 261465 182052 209253 302595 365269 -87605 435332 110966 -49440 171593 12149
11426 325827 86797 224968 113206 -272785 161141 -339924 55295 -27298 88441 -72065
11415 142358 -5130 -193831 199460 -145891 431106 14268 80941 217092 -19905 -122761
11405 -122761 171266 249817 187309 114759 -72723 196468 165039 81715 -239423 -126043 -6726
11393 -71106 228135 12173 81432 92815 -55409 155850 -7331 -43558 -155924 183215 -239782
11381 -192283 -142870 133237 37998 -115849 -48273 162373 104147 -207021 56046 -31540 148816
11369 -164199 72703 -46906 103505 -93120 -105577 -265099 -78248 -150578 99330 -228870 -227599
11358 -227599 138298 -359267 85795 -40984 -167154 -95292 114661 -160433 -29750 29724
11347D545g978j07930j71298J17606k24043D6072J32251j6925a6798H7924K81941
11336C69865a72517O0102j04708k7350g4760a1428j10612G7953h4031C50824c71711
11324B82091d0295B3872f8221A32553a51562D4777a6431o2108k16596H6315a05713
11312A80466H3748K4750a73598Q0265k7699B70844b43491J1637H2971a79654o8167
11301b47821J19303A4143M8360m828d9033p1961A54005A8771Q3819l8201b11971
11289b16789N3282O295P5099A10701K04261A43567c7306m626l83538A34195L2188
11278A66383b5789k04172A66890c89886a74483k7380O8773I2134F265M1640b4824
11266i2573Q768k80226J38926h7364B45267q1517a04404A71394o5452a79966p4297
$$ plain form
11347 4545 -7978 -115908 -287206 -169600 -393643 46072 178323 161398 -16798 87924 369865
11336 369865 -172517 -112415 -217123 -244473 -74760 -11428 -122040 77953 -84031 350824 -371711
11324 282091 -40295 23872 -68221 132553 -151562 44777 -16431 -78539 -295135 86315 -105713
11312 180466 83748 108498 -173598 -93333 -121032 270844 -243491 -231854 82971 -179654 -247821
11301 -247821 -128518 14143 62503 57675 -49033 -120994 154005 18771 102590 64389 -211971
11289 -216789 -163507 -157212 -82113 110701 314962 143567 -37306 -41932 -425470 134195 166383
11278 166383 -25789 -229961 166890 -389886 -174483 -201863 -133090 92134 6265 47905 -24824
11266 -92573 -83805 -364031 -225105 -87364 245267 163750 -104404 171394 105942 -179966 -254263
11255b54263i2626A25375C9866a04409j35253h7744m19795K08996d9395J0469
11245c8926C47404a22116A11855a36112e1601j33523A04406c2134k77907A24478
11234a42724B5029d9142o3303I838c64659a9104E3331i2070B48157d5838A74255
11222b8698j19885P679q6044K1175I8308N68153b79338R7797r8972B7045p388
11211A9657b73998g8055j50478e8391l90q0368A50262L2498E326a35333j53991
11200b89324N030j35621I2791P462K29113g5568k54785k6278b8218C5980a96094
11188A4432N0807c5087j69389a02050j8821A19220K4289Q0485d1301c397j81780
11177a85177B20611f0431B66815E8971b73864B22102a91152O6877n6735e8901
$$ plain form
11255 -254263 -92626 125375 39866 -104409 -239662 -87744 -507539 -298543 -49395 -38926
11245 -38926 347404 -122116 111855 -136112 -51601 -185124 104406 -32134 -310041 124478
11234 -142724 25029 -49142 -112445 9838 -364659 -19104 53331 -92070 248157 -45838 174255
11222 -28698 -148583 -140904 -226948 -205773 98308 666461 -279338 -181541 -280513 27045 19657
11211 19657 -273998 -78055 -228533 -58391 -58781 -139149 150262 182760 5326 -135333 -289324
11200 -289324 -284294 -419915 92791 100253 329366 -75568 -330353 -356631 -28218 35980 -196094
11188 14432 65239 -35087 -204476 -102050 -120871 119220 143509 223994 -41301 -3397 -185177
11177 -185177 220611 -60431 266815 58971 -273864 222102 -191152 -124275 -181010 -58901
11166i6980k15517h0350J3816B7861a5008I5859Q6801c58249a8655j09163C8640
11154A77975a44715j48744i4441l4272B97079B9541J408J8258P9559j021A5230
11142a27283C68349a14902j79871i1282p0547A10703b4326F2147b12199k156A6024
11130A21057P4871a08416A12896b58778B14147h840j46446N7B74372D9419e2519
11118B28073D9661j8869A431J62119C8587L28651G9270J83693f6661C31901F2192
11106A46842C9132e8723B16845D1203F772K39133j1602O843k6253h1920H4295
11094A34260N0743b339A87187n665l0212k8756J22799e8751B20266c7950A40664
11082B91037A03882a325B24109b07921F5840m186L78795G891K48644A10612M674
$$ plain form
11166 -96980 -312497 -80350 -66534 27861 -15008 95859 182660 -358249 -18655 -127818 38640
11154 177975 -144715 -293459 -94441 -128713 297079 29541 30949 49207 128766 127745 15230
11142 -127283 368349 -114902 -294773 -91282 -161829 110703 -24326 62147 -212199 -214355 16024
11130 121057 195928 -108416 112896 -258778 214147 -8840 -155286 -155229 274372 49419 -52519
11118 228073 49661 30792 1431 163550 38587 367238 79270 262963 -66661 331901 62192
11106 146842 39132 -58723 216845 41203 6772 245905 234303 241146 214893 -81920 84295
11094 134260 185003 -2339 187187 181522 151310 122554 245353 -58751 220266 -37950 140664
11082 291037 103882 -1325 224109 -207921 65840 61654 440449 7891 256535 110612 115286
11071A15286h117A37918e6527A88078P7673Q0828J86682A38051J63557A47860
11060D29024m5073j06648J15598N2312J15465j06217r5344R3023L60121C55876
11049F43729J7808K27942J1189k67205p7224k4547M05366k30239j09482M02677
11039A000014j56057P4117k57839L17070j65243L0015j51710j88144J13579L22934
11029I38736n6964q3749l92772L41440j99577L25073j23770j56127K34623r8493
11019G28420n1202l295K08073j28874k4573J7001L0686G3915M99376Q6053o4277
11008E95067j73475A26571M33252j57905K53450O3792k10127K7035J82678p7498
10998F41248B80185J45651O7484l7990K4883J9629J88487j92681K93219K9457
$$ plain form
11071 115286 -8117 137918 -56527 188078 265751 346579 533261 138051 301608 147860
11060 429024 383951 277303 392901 445213 560678 454461 359117 452140 812261 355876
11049 643729 661537 889479 900668 633463 556239 531692 937058 706819 597337 1000014
11039 1000014 843957 918074 660235 977305 812062 842077 690367 502223 615802 938736
11029 938736 881772 798023 405251 746691 547114 872187 748417 592290 826913 728420
11019 728420 677218 673923 881996 753122 728549 745550 776236 73915 573291 659344 595067
11008 595067 421592 126571 559823 401918 655368 719160 509033 536068 718746 641248
10998 641248 280185 425836 493320 455330 480213 499842 688329 495648 788867 818324
10988H18324k36949J98795j51356o4076o7041L4600K49837k78669M18896r1557
10978H30804L802j03846K77826J16854N8051J45016l94948L32089J92560J52290
10968A610498R9505Q6902L29014J46165L32061M09813m0883P56701k23135l13544
10958C193097m96994q50491j30624q4789k79889l8018J58826q7946p0854j62723
10948A149595K3668J53368L7011l14565j35439r9678k33956L4891k50900K72233
10938F36228k81562k8787A13291K14922Q4207a99062B55708c674A84571l7872
10928A46699b72607B14611I5289D195R7672J02174K4541C9968B775a37310O555
10917a30755a3061k44295A69495D110a71001g2197B71684B4101b48865B09566
$$ plain form
10988 818324 581375 780170 628814 564738 497697 532297 782134 503465 922361 830804
10978 830804 834606 730760 1008586 1125440 1183491 1328507 933559 1265648 1458208 1610498
10968 1610498 1710003 1796905 2125919 2272084 2604145 3013958 2973075 3729776 3506641 3193097
10958 3193097 2696103 1845612 1714988 1630199 1350310 1312292 1471118 1383172 1312318 1149595
10948 1149595 1173263 1326631 1363642 1049077 913638 813960 580004 614895 363995 636228
10938 636228 354666 325879 113291 328213 412420 -199062 255708 -3674 184571 146699
10928 146699 -272607 214611 95289 4195 101867 204041 228582 39968 2775 -137310 -130755
10917 -130755 -13061 -257356 169495 4110 -171001 -72197 271684 24101 -248865 209566
10906A07779R0023k9053a82546j62148A89606a9353D1653J03847L09714k01379
10896B53835D6982c5188C9039a02302L7512k65433B8903J77920D9269K76266h9661
10884A7536d4435F5484b74184B08835o0490E5413k0090a29561J3132C7297e8416
10872G1074I872J97356C2747J00781n3013a16819b0594I0597m3688J06742F1194
10860a49022C7343j0110b46965A20034J13810n5197b31220K1396C15827A34045
10849F1463K00799C3368c1269j0840A7320a9901B22954A1081e4327n5683b9287
10837c76665C27502h2270A10011b5602l13657b7701q840C50250h8617B01477o2090
10826A39387a08427n052C5541a76761A33119h6628c0322A61539b1945j05389L8246
$$ plain form
10906 107779 197802 168749 -182546 -344694 189606 -19353 41653 145500 455214 253835
10896 253835 46982 -35188 39039 -102302 -64790 -330223 28903 206823 49269 325535 -89661
10884 17536 -44435 65484 -274184 208835 148345 55413 35323 -129561 -116429 37297 -58416
10872 71074 9872 207228 32747 133528 80515 -116819 -20594 90597 46909 153651 61194
10860 -149022 37343 27233 -246965 120034 233844 178647 -231220 -209824 315827 134045
10849 61463 262262 33368 -31269 -42109 17320 -19901 222954 11081 -54327 -110010 -29287
10837 -376665 327502 -82270 110011 -25602 -339259 -27701 -36541 350250 -88617 201477 139387
10826 139387 -108427 -113479 35541 -176761 133119 -86628 -30322 161539 -21945 -127334 -89088
10815h9088k19746O8553B73095g9309l23381G4904a1821l46792J76785B5882a38280
10803b23542l4696I0506d6202q2444E2867i499C98744a18672A8251e4376A5256
10791B0465J55431N9941H6974a89392E0564d7876A63662G3148i0330p8222b1879
10779A1280K2966c17479i5197A82589a00694D5100d7563j91192H1143k8129O3154
10768A16168g4538p7557m2389o5075c5174r4443M4372j2578E9703c7144l3067
10757g0211q9187D2536i0398H3521f0911k31578J16482A63799a67435d0093C0297
10745d6350k6412q2342k2680B56697a33217j15250B23032c76672b3689f145o7288
10734g3433A58206c84650b1997B31805c00650a30363E551L71426n8236g1151I0917
$$ plain form
10815 -89088 -308834 -240281 273095 -79309 -402690 74904 -11821 -358613 -181828 25882 -138280
10803 -223542 -258238 90506 -46202 -128646 52867 -9499 398744 -118672 18251 -54376 15256
10791 20465 175896 235837 86974 -189392 50564 -47876 163662 73148 -90330 -168552 -21879
10779 11280 34246 -317479 -95197 182589 -100694 45100 -47563 -238755 81143 53014 116168
10768 116168 -74538 -152095 -194484 -259559 -35174 -129617 -85245 -97823 59703 -37144 -70211
10757 -70211 -159398 42536 -90398 83521 -60911 -292489 -176007 163799 -167435 -40093 30297
10745 -46350 -72762 -155104 -177784 256697 -133217 -248467 223032 -376672 -23689 -6145 -73433
10734 -73433 158206 -384650 -21997 231805 -300650 -130363 5551 376977 318741 -71151 90917
10722f6664G1311a51317J074B69294a90104f2559A54852E1270R4228B9658g1445
10710a71767j90073C236J09755c40617q6834B66480h8708k87798J37967A12370
10699a1684l32258B17739a01533k28734A13743A1422f5283J1679f498C02890O1945
10688C64835A40848c45418A24866g8534o446d258k68590J25894d3754l0878B03637
10676h8002A18434d4658n0392M0715E3938e2262j14643l4286q9859C19848B4632
10664B09535a4858N10B42815A16817a79215m5366i039p8759L2417K1482p8619
10653a12518e0430G989c66094A58663M6453A8276b17883k87865B88969k793D6122
10641A25767a29411l359d4538B3212b48852I5248b07507e8223o9851e8267A73072
$$ plain form
10722 -66664 71311 -151317 -150243 269294 -190104 -62559 154852 51270 145498 29658 -71445
10710 -171767 -361840 3236 112991 -340617 -427451 266480 -88708 -376506 -238539 112370
10699 -11684 -343942 217739 -101533 -330267 113743 11422 -65283 -53604 -6498 302890 364835
10688 364835 140848 -345418 124866 -78534 -84980 -4258 -272848 -146954 -43754 -74632 203637
10676 -88002 118434 -44658 -95050 -54335 53938 -52262 -166905 -201191 -291050 319848 24632
10664 209535 -14858 -14348 242815 116817 -179215 -224581 -9039 -87798 -55381 -33899 -112518
10653 -112518 -50430 7989 -366094 158663 205116 18276 -217883 -505748 288969 286176 46122
10641 125767 -129411 -132770 -44538 23212 -248852 95248 -207507 -58223 -128074 -58267 173072
10629a81083q054i0285A14488b90400K8559J16232A27644b34875f1934A07482
10618B20001j00028b32821i2420c6531a236m8892l0603r2929j7313N8277j71769
10607c04465e4014r0977A09458f1350j73827E986M6287b71064J16013j4043M292
10596a64802o1588f5576C5913M887j8798a3916l6402j14723k9324A00216j650
10585I8566b36855a1398j47533c0465j00969A94568c293p896j51035C9974O449
10574D6423L5047c1025B3515I593K11941A9020J50643h8250B2212c53010R1214
10563b61796A3224b17876j1403i118A74595c55754j04383a00556j47578D2109
10552A40896D4300a4025C38453a68350C48862b23804G098J05600a12340l2652
$$ plain form
10629 -181083 -189137 -90285 114488 -290400 -261841 -145609 127644 -234875 -61934 107482
10618 220001 119973 -232821 -92420 -36531 -1236 -50128 -80731 -173660 -190973 -132696 -304465
10607 -304465 -54014 -144991 109458 -61350 -235177 5986 52273 -271064 -155051 -169094 -164802
10596 -164802 -226390 -65576 35913 40800 22002 -13916 -50318 -165041 -194365 100216 98566
10585 98566 -236855 -11398 -158931 -30465 -131434 194568 -3293 -11189 -162224 39974 46423
10574 46423 81470 -31025 23515 9593 221534 19020 169663 -88250 22212 -353010 -261796
10563 -261796 13224 -217876 -229279 -9118 174595 -355754 -460137 -100556 -248134 42109
10552 140896 44300 -14025 338453 -168350 348862 -223804 7098 112698 -112340 -144992
10542a44992B94839A29553M0170c44409b0693m0338j91776a20895D6064a01412
10531f125j90219e6673j51196b8476a0555k09011C0484K14060a29361l14507J06740
10520c37128a19221D7121g5389C536b82779D7014d65911a55116m2206c23G3502
10508a01307j1509N1371A22359e4274j58145a478l07440J03973h7946j81486m2532
10497c11964e4144j63883q733P7211D5890b46578A34381i3761m6229j3543A79409
10485g7042k59289J33447E6091c9217F7646K20905p8627a29243I7782f3872j3892
10474g7764n0796D51175j83043J0725G3172J69971j0968E56K07294a62175A76109
10462i8661A10388a06484j00913A46065J9127d46470A40289M7551G8437j2290
$$ plain form
10542 -144992 294839 129553 169723 -344409 -20693 -61031 -252807 -120895 46064 -101412
10531 -6125 -196344 -56673 -207869 -28476 -10555 -219566 30484 244544 -129361 -443868 -337128
10520 -337128 -119221 47121 -75389 3536 -282779 47014 -465911 -155116 -197322 -323 73502
10508 -101307 -112816 -61445 122359 -54274 -212419 -1478 -308918 -204945 -87946 -269432 -311964
10497 -311964 -54144 -218027 -226760 -149549 45890 -246578 134381 -93761 -139990 -153533 179409
10485 -77042 -336331 -202884 56091 -39217 67646 288551 209924 -129243 97782 -63872 -77764
10474 -77764 -128560 451175 268132 278857 73172 243143 232175 556 207850 -162175 176109
10462 -98661 110388 -106484 -207397 146065 165192 -446470 140289 187840 78437 66147
10452F6147b00298k00578a8423A16284E1022c0718n7440B62111r6890d32646a33550
10440F1745f0973A43534b59514q5369A58530p4843a49879D8330b31727B9707b12946
10428a94558R6974k87093d3874b0945k47768a05388n2132j8596a874p9336j86
10417h1396A12026D1646a86352a1681r1489J0965B78332K0618d79791c8762J6814
10406b1948H8169C2078J78730d6766j32044B46862G3621Q5418a76659A23681E0424
10394a48857A96335a92347B11728g4991r2343O7179A18133e2505b2280B14962
10383C64032A35749K36848a70338A01562k7269b8176I7988P6229q0917J3867J54709
10372B61876P0912O963c7492A2264P2919a20757A06238J26095J29249f7675B62547
$$ plain form
10452 66147 -200298 -400876 -18423 116284 51022 -30718 -88158 262111 165221 -432646 -133550
10440 61745 -60973 143534 -259514 -344883 158530 83687 -149879 48330 -231727 29707 -212946
10428 -194558 -97584 -384677 -43874 -20945 -268713 -105388 -157520 -176116 -1874 -81210 -81396
10417 -81396 112026 41646 -186352 -11681 -103170 -92205 278332 298950 -479791 -38762 -21948
10406 -21948 88169 32078 210808 -46766 -178810 246862 73621 159039 -176659 123681 50424
10394 -148857 196335 -192347 211728 -74991 -167334 -100155 118133 -52505 -22280 214962
10383 364032 135749 372597 -170338 101562 74293 -28176 97988 174217 93300 107167 261876
10372 261876 332788 339751 -37492 12264 85183 -120757 106238 232333 361582 -67675 262547
10360D99300j73916J26616M59223C24211Q5008j41378b13247D42152A41255a00038
10349b7123A1007O446P2823K83916J73787j9796K57659B67365J03735Q7461H2450
10337B41292J99824p51J18458e5684B2134a12017D31217Q9806n3308B31456p00
10326B30756a20482C20303g9032H7948K19317F1075K30158l4691Q5259A00047
10315G7144L88439A46216N6605m2866E6375a36184A79777H5541a53925b5160p169
10304c2329m083a5796B2426b06091Q2073F7772c35305b2082A02055D6847Q9087
10293A35934a491B00226n4338N5787b331j3378k71169a31064k13455f1869B9765
10281c3765J007k97024R3557j7489a17283a3214C5368J1502a04972j32576P1239
$$ plain form
10360 499300 325384 452000 911223 324211 409219 267841 -213247 442152 141255 -100038
10349 -27123 11007 17453 90276 374192 547979 528183 785842 267365 371100 458561 82450
10337 241292 441116 440365 558823 -55684 22134 -112017 431217 521023 467715 231456 230756
10326 230756 -120482 320303 -79032 87948 307265 61075 291233 256542 341801 100047
10315 77144 465583 146216 202821 159955 56375 -136184 179777 85541 -153925 -25160 -32329
10304 -32329 -36412 -15796 22426 -206091 -124018 67772 -335305 -22082 102055 46847 135934
10293 135934 -1491 200226 145888 201675 -2331 -15709 -286878 -131064 -344519 -61869 29765
10281 -33765 -32758 -329782 -236225 -253714 -117283 -13214 35368 46870 -104972 -237548 -166309
10270a66309A89812e48212b23998F5428Q4177a00314r3624O5519i512D6179a94883
10258b14506D5624a83843n1817C25709b99189C04627A3685L23340Q73E9620L80429
10247D40049q4493q0594o3438a35580C23159c92941C84021A58552b96768A8238
10236f3999a228I1067c27441B31893C9504b45088P7865p8330n7932a40529J8369
10225a22160a8818I8839B2789a06036C13643A30303R5369b21306n8866m8026a24877
10213A92269k4777a07632m7425M3719D30473b14832E6066a58315A23591l4788
10203H8803K19218q2523c374j37448L4592j19780g3846m537q6520q5960a11778
10191g624k80851A14679d06230f5425k6038D5505K48561a23520B5105d9179A109
$$ plain form
10270 -166309 189812 -548212 -223998 65428 149605 -100314 -193938 -128419 -9512 46179 -194883
10258 -214506 45624 -183843 -235660 325709 -299189 304627 13685 337025 337898 59620 440049
10247 440049 355556 274962 211524 -135580 323159 -392941 384021 158552 -296768 18238
10236 -63999 -1228 91067 -327441 231893 39504 -245088 -167223 -245553 -303485 -140529 -122160
10225 -122160 -18818 98839 22789 -106036 313643 130303 225672 -221306 -280172 -328198 -124877
10213 192269 167492 -107632 -155057 -111338 430473 -214832 56066 -158315 123591 88803
10203 88803 308021 225498 -3374 -140822 -106230 -226010 -73846 -78383 -164903 -250863 -111778
10191 -7624 -288475 114679 -406230 -65425 -91463 45505 294066 -123520 25105 -49179 1109
10179b21922d3589J1943F5385B6995b67587Q5023m9565n6737Q0590b6514R446
10168a7068k6201j91878F2713b61266j213B08878a38606m0413e0328m5969l4909
10157a31206p8074a6511j30774j44342i2215C04589A04397L4548a56407a4105
10146a97921E8847J22566f2937j21154K4295j08374Q6243C0792A676a55087k5880
10135a80967d8160k59232n0591J46936a9284k50871J02866j15996B2879N2048
10125G4927a92542j02864f2933B82990i1751A32533b39338M7343Q417q6572A19165
10113E4818a17704F4777C2040Q8285e20513H363f6172q3235B33624a53363D9511
10101a31377b9411o3539G5111i7456E1553J18641O0016i0071G9904a83318c6400
$$ plain form
10179 -221922 -43589 -31646 65385 26995 -267587 -182564 -232129 -288866 -208276 -26514 -17068
10168 -17068 -43269 -235147 62713 -261266 -262479 208878 -138606 -179019 -50328 -96297 -131206
10157 -131206 -209280 -16511 -147285 -291627 -92215 304589 104397 138945 -156407 -14105
10146 -197921 58847 181413 -62937 -184091 -159796 -268170 -181927 30792 1676 -155087 -180967
10135 -180967 -48160 -307392 -357983 -211047 -19284 -270155 -167289 -283285 22879 74927
10125 74927 -192542 -295406 -62933 282990 -91751 132533 -239338 -191995 -183578 -270150 119165
10113 54818 -117704 64777 32040 120325 -520513 8363 -66172 -149407 233624 -153363 49511
10101 -131377 -29411 -92950 75111 -97456 51553 170194 230210 -90071 79904 -183318 -36400
10089b21673L4014J0250B1257J29499a00706A55556L60025A30750b88347j42373
10079d30720J79391A70264m1091i0601A99287k1964p516g0609F0102a20028k44610
10068c64638J11712M5748h6059A38076a76456D8486L03609h3336j27713B6001
10057c09967D864a98141B51882b37324k9680f8386j830H3655b58173A21539R5948
10046B17487b0762j07941e0214j16637L598k61151A73804G479K3000a39473A69655
10034A83280f1303H7380a98762A28546C7262b61423H4598Q817H096Q9295c11861
10022D7536J50399a31952c4040k83432A68229c71029f8921D79038a86393A63344
10011G1283a23637B68913c1465j8078B02524a66884B9903M7273J82465a7191E5616
$$ plain form
10089 -221673 -187659 -177409 21257 150756 -100706 155556 515581 130750 -288347 -430720
10079 -430720 -251329 170264 129173 -90601 199287 177323 169807 -70609 60102 -120028 -364638
10068 -364638 -252926 -207178 -86059 138076 -176456 48486 352095 -83336 -211049 26001
10057 -309967 4864 -198141 251882 -237324 -267004 -68386 -70216 83655 -258173 121539 217487
10046 217487 -20762 -128703 -50214 -166851 -163253 -424404 173804 7479 30479 -139473 169655
10034 183280 -61303 87380 -198762 128546 37262 -261423 84598 93415 8096 97391 -311861
10022 47536 197935 -131952 -34040 -317472 168229 -371029 -68921 479038 -186393 163344
10011 71283 -123637 268913 -31465 -49543 202524 -166884 29903 77176 259641 -17191 55616
9999a21475B4569K70189a17951G1072A098e04157A28063e0132j51496B01177q6047
9988A15130b23424O8121F0932a77106g9990j05609j47274j39080a75969A33126
9977A35378g0413p5053k7785B65279g5999o5789I096c41379K0839a15209l9975
9966a55184j65787e9632m1972E103b27727P5551a9873k00622H8220a35221B3009
9954d80699a92545F9007a08950C99983a28911j14130I4560a53312O7005n1594
9944a37901A42953b26150h8847j11199O0399A90288b32800a02169a7439m04846
9934d22285b09592n4385m0593J04054B72561c2984B576a63502F3213K70827a25126
9922a04638i883m3559m1913F7616K92469a78190p078n1905j0767A04295a55795
$$ plain form
9999 -121475 24569 294758 -117951 71072 1098 -504157 128063 -50132 -201628 201177 115130
9988 115130 -223424 -155303 60932 -177106 -79990 -185599 -332873 -471953 -175969 133126
9977 135378 -70413 -145466 -173251 265279 -75999 -141788 9096 -341379 -320540 -115209 -155184
9966 -155184 -320971 -59632 -101604 5103 -227727 -152176 -19873 -220495 88220 -135221 23009
9954 -480699 -192545 69007 -108950 399983 -128911 -243041 94560 -153312 -86307 -137901
9944 -137901 142953 -226150 -88847 -200046 -139647 190288 -232800 -102169 -17439 -422285
9934 -422285 -209592 -263977 -304570 -200516 272561 -32984 2576 -163502 63213 334040 -125126
9922 -104638 -9883 -53442 -95355 67616 360085 -178190 -185268 -237173 -247940 104295 -155795
9910a15409j6537e3297A44350b32787a15133k9603j30536e4239k36605f8315l87887
9899d56202D3652a3673F2690J52080a5579A44307a00278p795j72898C7862b5426
9887c5414j85700C02357a92540P5195k4923a0549d63m6690n3151E5631a59434
9875b57769h7077I72b13843A59168a80205b3605j1321A62223B0278d00342g3342
9863d33924H3681b86657R2048G8009h2092a9745E3830O7638c5460l15457B95209
9851C57716d21234F3766b90798L861b470o0980p7928B36284e6661A24575b98268
9839b89220B2685b27764o7186B98013a09564c8389j90535j2597o5743a44182j13697
9828b57879b2302p4372j00272b1359j16191c3575A62144e32708h5514H5938b14920
$$ plain form
9910 -115409 -131946 -53297 144350 -232787 -115133 -144736 -275272 -54239 -290844 -68315 -456202
9899 -456202 43652 -13673 62690 214770 -15579 144307 -100278 -108073 -280971 37862 -25426
9887 -35414 -221114 302357 -192540 -117345 -142268 -10549 -463 -47153 -100304 55631 -159434
9875 -257769 -87077 972 -213843 159168 -180205 -23605 -34926 162223 20278 -400342 -73342
9863 -433924 83681 -286657 -194609 78009 -82092 -19745 53830 121468 -35460 -350917 295209
9851 357716 -421234 63766 -290798 -286937 -2470 -63450 -141378 236284 -56661 124575 -298268
9839 -289220 22685 -227764 -294950 298013 -109564 -38389 -228924 -241521 -307264 -144182 -257879
9828 -257879 -22302 -96674 -196946 -21359 -137550 -33575 162144 -532708 -85514 85938 -214920
9816b07495B9316b06246b7691I4279a5309d085j76821B65080B201J7031a20666
9804B11963i4652A89214b75251i7564r5025R1464P916k0340B8781b3383A12022
9792b05428j30053L5346C521J42893a81779A88879e1895k41875a28868M3246n0679
9781a36301A79101D9558O3938h5943j82544A16327A4925a47379M7865C3629J43055
9770A76684A7238a36312P975j0260A7365J77340a15659A15635K2283e5620j26890
9759a82510m8765q9653a49609j6939C3240a09639p4597g0133H8352a85201a485
9747B98343a47199o1147h1880A43370f8129b8287B57125a75862b9008A31909R8279
9736B30188M9350j25889b71612E5337e3293M298B29282B005a15801E0781a10645
$$ plain form
9816 -207495 29316 -206246 -27691 94279 -15309 -4085 -180906 265080 2201 19232 -120666
9804 211963 -94652 189214 -275251 -97564 -192589 -101125 -93209 -113549 28781 -23383 112022
9792 -205428 -335481 -300135 3521 146414 -181779 188879 -51895 -293770 -128868 -85622 -136301
9781 -136301 179101 49558 113496 -85943 -268487 116327 14925 -147379 -99514 33629 176684
9770 176684 17238 -136312 -128337 -138597 17365 194705 -115659 115635 137918 -55620 -182510
9759 -182510 -231275 -320928 -149609 -166548 33240 -109639 -184236 -70133 88352 -185201 -1485
9747 298343 -147199 -208346 -81880 143370 -68129 -28287 257125 -175862 -29008 131909 230188
9736 230188 279538 153649 -271612 55337 -53293 -48995 229282 2005 -115801 50781 -110645
9724d3902j44926R2231B58008b21365O4885A24582a44389e0208C4421e8173B9111
9712C78166a23072K7661l8067q8596N4635p8669j31923b9041k6812j02028A71428
9700h6610J5095j37959L1716Q5688c0382l21745A85530b66060i493j4058l69820
9689c93371B0882a66380l534I9025c25122K5030a0051r5771L048A60792a82998
9677a70101B7208Q2653f9662G0659a2235j5258B10731b95841B15589a5757D412
9665a98127r0786Q6770A3965b5481j93109b6921E1892b1499m37121b141k2561
9654b4702k41171i4567n3206A6431L1082b62673A74819g4445K9154j03387B856
9642C5792Q9069a15109k21853f2207o0772j01991H7545a27849j5194b3873j12336
$$ plain form
9724 -43902 -188828 -96597 258008 -221365 -156480 124582 -144389 -50208 34421 -58173 29111
9712 378166 -123072 -95411 -133478 -222074 -167439 -246108 -378031 -29041 -55853 -157881 171428
9700 -86610 -71515 -209474 -177758 -92070 -30382 -352127 185530 -266060 -9493 -23551 -393371
9689 -393371 20882 -166380 -169914 99025 -325122 -300092 -10051 -105822 -102774 160792 -182998
9677 -170101 27208 109861 -69662 70659 -12235 -27493 210731 -295841 215589 -15757 4412
9665 -198127 -288913 -202143 13965 -25481 -218590 -26921 51892 -21499 -458620 -2141 -24702
9654 -24702 -265873 -94567 -147773 16431 47513 -262673 174819 -74445 -45291 -148678 2856
9642 35792 124861 -115109 -336962 -62207 -122979 -224970 87545 -127849 -143043 -23873 -136209
9631a36209K4901c5744j00793A26123j8201d58284G6982a36212A88788A892e1657
9619F5031J25930d726A51255L1975D5433b84809F1624c10798a9213p4980A12546
9607C5171J43543J47893c69450J17977n7170J47865H5554f4474A57390b61814
9596e1663j67784L7923L6324q7393J8415J03295a7551H84b8351C11293a5452C0500
9583D46396B13574c90806E735J69936c6471p4728j87668a00264k53359J66689
9573a86934M9325b7616j1306n7889A7674K5841J58796G0859J17993a58996j79480
9562c38476J5667A18395B0189a99646j16551E6859f7559F9963b02B01339g987
9550D2710J8340B5964e297j2379A41547a69287A8729a56567g3842D0016R6796
$$ plain form
9631 -136209 -111308 -35744 -136537 126123 107922 -458284 76982 -136212 188788 1892 -51657
9619 65031 190961 -4726 151255 183230 45433 -284809 61624 -310798 -19213 -94193 112546
9607 35171 178714 326607 -369450 -251473 -308643 -160778 85554 -64474 157390 -261814
9596 -51663 -219447 -181524 -145200 -232593 -214178 -110883 -17551 884 -28351 311293 -15452 30500
9583 446396 213574 -390806 5735 175671 -36471 -111199 -298867 -100264 -353623 -186934
9573 -186934 -137609 -27616 -38922 -96811 17674 43515 202311 70859 188852 -158996 -338476
9562 -338476 -322809 118395 20189 -199646 -316197 56859 -67559 69963 -202 201339 -7987
9550 42710 61050 25964 -5297 -17676 141547 -169287 18729 -156567 -73842 40016 136812
9539A36812q664d65428D5061I15b70844B83725b36397G8100a13857j24715f7851
9527d04311L2523a65644L0490d5559l15016A9013a15560A58420a57556N3139k2063
9516a26480A06M5869a25069B0599f9719H9277M04181c3488H0092a05198j58248
9505b63446b9456G2290b42976f0921p7184M2240A28227b17551K7514O1690A73148
9493c56488C0040c18318A6394Q5970r078a51882d6995j94354K6826D1343a39424
9481A64246a25875m3788k39283A3332i4388k16521D3067J17518g2719C44839E5614
9469b50219J10901B88154b05428B2916f9268j59141B9476a52114p7973R697B10367
9457g917D8640b73575B2401a42733B09850O0203A34565l9656d11604B83484a37963
$$ plain form
9539 136812 128148 -465428 45061 915 -270844 283725 -236397 78100 -113857 -238572 -67851
9527 -404311 -371788 -165644 -135154 -45559 -360575 19013 -115560 158420 -157556 -104417 -126480
9516 -126480 106 45975 -125069 20599 -69719 89277 493458 -33488 80092 -105198 -263446
9505 -263446 -29456 72290 -242976 -60921 -138105 -95865 128227 -217551 -190037 -128347 173148
9493 -356488 30040 -318318 16394 102364 93286 -151882 -46995 -241349 -214523 41343 -139424
9481 164246 -125875 -169663 -408946 13332 -94388 -310909 43067 160585 -72719 344839 55614
9469 -250219 -139318 288154 -205428 22916 -69268 -228409 29476 -152114 -230087 -220390 210367
9457 -7917 48640 -273575 22401 -142733 209850 270053 134565 94909 -411604 283484 -137963
9445a06298l15762B73748j4902a07195B77154C6833e2804o8015Q64k43008i6814
9433i3852l74381K01816A62997a02837a2588A29305C6279O6844g4569n1354Q475
9422a17448c1432A66833C8458g7361B14322h6004H445a39947O6175I758i040j29616
9410a38656n6419k61308P0773a2331A20271n5309Q431c8267A0832P0871a00280
9398A76582a02754B8319K0198e3440o0682k16109j09034a64888j3325l7466g7123
9386A75354E7785a43311J137N2120C91424a5025B69845b63670f1310b7182j91874
9375b19056A48862e8678j31633e3780F0307a22656M0393n1073N8422L3772F67
9363b94391b6405j6005B93480i9678A57061a46483e6958a4253B01941h3706j58532
$$ plain form
9445 -106298 -422060 273748 258846 -107195 277154 36833 -52804 -120819 -119955 -362963 -96814
9433 -93852 -468233 -266417 162997 -102837 -12588 129305 36279 103123 -74569 -125923 -117448
9422 -117448 -31432 166833 38458 -77361 214322 -86004 8445 -139947 -73772 9758 -9040 -138656
9410 -138656 -195075 -456383 -385610 -12331 120271 64962 73393 -38267 10832 81703 -100280
9398 176582 -102754 28319 48517 -53440 -114122 -330231 -439265 -164888 -178213 -215679 -77123
9386 175354 57785 -143311 -142174 -90054 391424 -15025 269845 -263670 -61310 -27182 -219056
9375 -219056 148862 -58678 -190311 -53780 60307 -122656 -82263 -133336 -74914 -41142 667
9363 -294391 -26405 -42410 293480 -99678 157061 -146483 -56958 -14253 201941 -83706 -242238
9352b42238B20099I3818b0529q7836j04798e5783A05653a07532r3274a2263m9661
9341f1924j00982j7040A25136J1542n1393k1148a02522A2874e756A11933d10199
9329E16201k51131C896a15641K3251b2992I610L0027j1859b69533c7857k12453
9318b50310I5074e7717A27549M4846a89279j1201j24901a33783K0644j89527q41
9307c03507e3105b3590m46265a27794I8129a95876m7036g2792j21938R5403b0486
9295c85048E8028a87502A47503C2601g5103o0211O0683o2290K5983C75520A34748
9283G296L0289a52315D4627b11140A43507a15998m703M8464J3067l29221F5424
9271e4979A73732b08235G7555M9755b75560D8821B3407a77229Q139a0626k09523
$$ plain form
9352 -242238 220099 93818 -20529 -108365 -213163 -55783 105653 -107532 -200806 -12263 -61924
9341 -61924 -162906 -179946 125136 136678 85285 64137 -102522 12874 -5756 111933 -410199
9329 516201 265070 3896 -115641 -92390 -22992 9610 39637 27778 -269533 -37857 -250310
9318 -250310 95074 -57717 127549 172395 -189279 -200480 -325381 -133783 -113139 -302666 -303507
9307 -303507 -53105 -23590 -469855 -127794 98129 -195876 -242912 -72792 -194730 -99327 -20486
9295 -385048 58028 -187502 147503 32601 -75103 -135314 -74631 -136921 -110938 375520 134748
9283 7296 37585 -152315 44627 -211140 143507 -115998 -120701 -72237 -59170 -388391 65424
9271 -54979 173732 -208235 77555 127310 -275560 48821 23407 -177229 -169090 -10626 -220149
9260b20149E0953J56583c8367A87182b70082j26640D5416a16811L0241A34816
9249A97507O8091b36719Q8540o1063j57964Q5105a35304O2413F5219b42983A88445
9237c56791B65927b2708C79483A52116a34111j51870a0894k36460F4222a54945
9226i4151B25609h7433B19555a60062j14800J33071j31715c6206n8030B19374
9215b82162e0165J9222j26490b2529p4814K5134n0233b8411k91803a07607j60199
9204b67806A9005a29944f968q1410K9489p5997A40657D7454b71184a20346N4588
9193f5758A69323p1170a32245n8482A78048D6872N9948a13377M7585m84932e1032
9181c07405K8045h7607j67614q8325J48407C18120A50483b11935n4226A55560
$$ plain form
9260 -220149 50953 207536 -38367 187182 -270082 -396722 45416 -116811 -86570 134816
9249 197507 265598 -236719 -148179 -209242 -367206 -282101 -135304 -72891 65219 -242983 188445
9237 -356791 265927 -22708 379483 152116 -134111 -285981 -10894 -247354 64222 -154945
9226 -94151 225609 -87433 219555 -160062 -274862 -141791 -273506 -36206 -94236 219374
9215 -282162 -50165 -30943 -157433 -22529 -97343 -72209 -122442 -28411 -320214 -107607 -267806
9204 -267806 19005 -129944 -6968 -88378 -58889 -134886 140657 47454 -271184 -120346 -65758
9193 -65758 169323 98153 -132245 -190727 178048 46872 106820 -113377 -65792 -550724 -51032
9181 -307405 -279360 -87607 -255221 -343546 -195139 318120 150483 -211935 -266161 155560
9170b37526D6735e986A2484k474J3952a37756A4219a33631B9173e5661p5794b2129
9157a84547H0296K8673F457g3070p8835H9845D4730B432J55460A5924Q6642a85275
9144b01266D84302C6845N7764a680k02703C33154K34193h1287J8624J6759b0736
9132g896L156j56993A22974C8875K9457L920M7614f3162j46271e3162K463k18529
9120b69228k1007a13883d552k63494J02996n0516h8831A68034A2270a383j15812
9109a17195k63193J56881L6217j44046I9967l4254d83136b02413h4732A71486
9098A02991C0186R1928a96369A49809f8846B25244K0825L9234g1836N888A87517
9086d10960a48138f4310C5093d4087l50379b6927k03734C3111Q1402G489c09765
$$ plain form
9170 -237526 46735 -5986 12484 10010 23962 -137756 14219 -133631 29173 -55661 -131455 -22129
9157 -184547 80296 108969 6457 -73070 -151905 89845 44730 2432 157892 15924 102566 -185275
9144 -201266 484302 36845 94609 -1680 -204383 333154 567347 -81287 -62663 -45904 -20736
9132 -7896 -4740 -161733 122974 38875 68332 72252 119866 -63162 -209433 -53162 -50699 -269228
9120 -269228 -290235 -113883 -4552 -268046 -165050 -215566 -88831 168034 12270 -1383 -117195
9109 -117195 -380388 -223507 -187290 -331336 99967 65713 -483136 -202413 -84732 171486
9098 102991 30186 122114 -196369 149809 -68846 225244 246069 285303 -71836 -65948 187517
9086 -410960 -148138 -64310 35093 -44087 -394466 -26927 -230661 33111 114513 7489 -309765
9074H7170a11413k01485A74169c68469C28421c56322A21963a14183B10605D255
9063a39354q5106a05446m9173f3618k22708D1308c29895A77721Q8420A12123a35351
9051a51741e7450F7061c51325N177F3002K85005a80108I1557b26026i1553q1769
9040a73322n9121b4710k82996J49573M9131o5085B37455h2749J355L482j46639
9029b24551A74399F3322c07163A80870a23824L8708k1345j4289g221r2653k59132
9018c59006a17923e2260n6553G8879b4534l08233D0894a06856j45302A70250f0932
9006B51310a90851d1453o0916D38626G8281O5073J36969c97583G9611b4944o9103
8995i4047B11447A6263a5669l3461H7944b86786j24447g6982M75E8958a38344
$$ plain form
9074 87170 -111413 -312898 174169 -368469 328421 -356322 121963 -114183 210605 4255
9063 -139354 -224460 -105446 -154619 -63618 -286326 41308 -329895 177721 266141 112123 -135351
9051 -151741 -57450 67061 -351325 -346148 63002 348007 -180108 91557 -226026 -91553 -173322
9040 -173322 -232443 -24710 -307706 -158133 -109002 -174087 237455 -82749 -81394 -77912 -224551
9029 -224551 174399 63322 -307163 180870 -123824 -85116 -106461 -120750 -7221 -99874 -359006
9018 -359006 -117923 -52260 -108813 78879 -24534 -332767 40894 -106856 -252158 170250 -60932
9006 251310 -190851 -41453 -102369 438626 78281 143354 280323 -397583 79611 -24944 -94047
8995 -94047 211447 16263 -15669 -49130 87944 -286786 -411233 -76982 -76507 58958 -138344
8983A42910J332d4595K836j83804f0219A33878a7930m05175A42353b66745R3411
8972a73334p911k2704h8403G3441B9256R0683a360k49952J11817f4069j13460
8961a77529A69873a10308F0795a43499p2423c2410k24253H3300B604J73334j8709
8950A57229g2300E2774b86250G1012J22308C2030a68155F1959J06217D6383O8762
8939A15145c3822m252j77615A24345N9081a67820G3033K06511F338a15588H3839
8927A5886c41424L7378B7524b48140c8448F6022b2171j09695d0777j20953E98715
8915C28554A56566a1342B21566p2945f3215A55493K4053c97116A79213D8343L76980
8904D25323b38000p0952i2145c1057j09282H1586g2282m8360j93227O4944J936
$$ plain form
8983 142910 144242 -44595 -41759 -225563 -60219 133878 -17930 -423105 142353 -266745 -173334
8972 -173334 -181245 -203949 -88403 73441 29256 119939 -1360 -251312 -139495 -64069 -177529
8961 -177529 169873 -110308 60795 -143499 -215922 -32410 -256663 83300 2604 175938 157229
8950 157229 -72300 52774 -286250 71012 193320 32030 -168155 61959 168176 46383 115145
8939 115145 -33822 -38074 -215689 124345 183426 -167820 73033 279544 6338 -115588 83839
8927 15886 -341424 -304046 27524 -248140 -38448 66022 -22171 -131866 -40777 -161730 598715
8915 328554 156566 -11342 221566 148621 -63215 155493 179546 -397116 179213 48343 425323
8904 425323 -238000 -308952 -92145 -31057 -140339 81586 -72282 -120642 -313869 -248925 -246989
8893b46989A21183a00998j05921F0740N6857P7369f2274H3456N7157e6374H6244
8881h2839A59301c22773O962D8976c88817J67019J03079A76376c6076p7893M2772
8870g1197j70844g9514k65276a23974O0751m6711r7982j559h2039A99316b43387
8858b17306e9056p9416A93741a89047d6491l58864L5392b9736r70j33039A14667
$$ plain form
8893 -246989 121183 -100998 -206919 60740 117597 194966 -62274 83456 140613 -56374 86244
8881 -82839 159301 -322773 -315811 48976 -388817 -221798 -118719 176376 -36076 -113969 -71197
8870 -71197 -242041 -79514 -344790 -123974 -63223 -109934 -207916 -209475 -82039 199316 -243387
8858 -217306 -59056 -138472 193741 -189047 -46491 -405355 -369963 -29736 -30706 -163745 114667
$$ [...]
##END NTUPLES=NMR SPECTRUM
##END=
