##TITLE=NES1023_BrazilUW_9266427_k17JsIc4xV
##JCAMPDX= 6.0         $$ Bruker NMR JCAMP-DX V2.0
##DATA TYPE= NMR SPECTRUM
##DATA CLASS= NTUPLES
##ORIGIN= BRUKER
##OWNER= Administrator
$$ 1.72 TOPSPIN		Version 2.1
$$ 2015-07-09 19:59:17.988 -0700  Administrator@X
$$ Compression mode = diff/dup
##.OBSERVE FREQUENCY= 400.02188249412
##.OBSERVE NUCLEUS= ^1H
##.ACQUISITION MODE= SIMULTANEOUS (DQD)
##.ACQUISITION SCHEME= undefined
##.AVERAGES= 64
##.DIGITISER RES= 22
##SPECTROMETER/DATA SYSTEM= spect
##.PULSE SEQUENCE= noesygpps1d.comp
##.SOLVENT NAME= COFFEE_meoh
##.SHIFT REFERENCE= INTERNAL, COFFEE_meoh, 1, 14.96407
##AUDIT TRAIL= $$ (NUMBER, WHEN, WHO, WHERE, PROCESS, VERSION, WHAT)
$$ ##TITLE= Audit trail, TOPSPIN		Version 2.1
$$ ##JCAMPDX= 5.01
$$ ##ORIGIN= Bruker BioSpin GmbH
$$ ##OWNER= Administrator
$$ $$ E:\/data/COFFEE/nmr/NES1023_BrazilUW_9266427_k17JsIc4xV/12/pdata/1/auditp.txt
$$ ##AUDIT TRAIL=  $$ (NUMBER, WHEN, WHO, WHERE, PROCESS, VERSION, WHAT)
(   1,<2015-07-09 19:59:12.675 -0700>,<Administrator>,<X>,<go>,<TOPSPIN 2.1>,
      <created by zg
	started at 2015-07-09 19:47:42.831 -0700,
	POWCHK enabled, PULCHK disabled,
       configuration hash MD5:
       21 0F 79 D6 B3 7B B4 F6 88 20 88 DB 03 48 BD 9F
       data hash MD5: 64K
       7F 6D 9D 04 EA F7 DA 4E 6B B5 F0 83 6D 86 63 C1>)
(   2,<2015-07-09 19:59:15.831 -0700>,<Administrator>,<X>,<proc1d>,<TOPSPIN 2.1>,
      <Start of raw data processing
       efp LB = 0.3 FT_mod = 6 PKNL = 1 PHC0 = 0 PHC1 = 0 SI = 128K 
       data hash MD5: 128K
       94 80 82 60 E5 84 34 86 3A A1 F1 31 7A FF 92 8B>)
(   3,<2015-07-09 19:59:16.738 -0700>,<Administrator>,<X>,<proc1d>,<TOPSPIN 2.1>,
      <pk PHC0 = -87.40173 PHC1 = 0 
       data hash MD5: 128K
       05 1E 49 FE B6 F4 AB 78 63 6C 1E 6C 9F 15 9F 20>)
(   4,<2015-07-09 19:59:17.144 -0700>,<Administrator>,<X>,<proc1d>,<TOPSPIN 2.1>,
      <abs ABSG = 1 
       data hash MD5: 128K
       59 0E A0 C8 A2 97 3E B7 C8 4D FF 1C 8A 3F 61 1A>)
(   5,<2015-07-09 19:59:17.238 -0700>,<Administrator>,<X>,<proc1d>,<TOPSPIN 2.1>,
      <abs ABSG = 2 
       data hash MD5: 128K
       E7 82 C8 2C 29 06 B7 25 60 07 74 FD 2D EE 30 3C>)
(   6,<2015-07-09 19:59:17.331 -0700>,<Administrator>,<X>,<proc1d>,<TOPSPIN 2.1>,
      <abs ABSG = 3 
       data hash MD5: 128K
       60 EE 27 C0 94 1C 42 1E 89 C2 C8 68 C2 D7 D9 1F>)
(   7,<2015-07-09 19:59:17.425 -0700>,<Administrator>,<X>,<proc1d>,<TOPSPIN 2.1>,
      <abs ABSG = 4 
       data hash MD5: 128K
       FF C9 79 51 01 B7 47 28 6A 6C CD BB 4A 49 52 B7>)
(   8,<2015-07-09 19:59:17.550 -0700>,<Administrator>,<X>,<proc1d>,<TOPSPIN 2.1>,
      <abs ABSG = 5 
       data hash MD5: 128K
       50 B0 A6 0C 31 C7 BF A9 11 7C 10 71 66 89 9F A1>)
$$ ##END=
$$ 
$$ $$ hash MD5
$$ $$ FA 54 4D 2F 01 0B A5 B7 2B 90 F8 A3 A9 C3 15 B3
##$RELAX= 
##$RELAX= 
##$RELAX= 
##$RELAX= 
##$RELAX= 
##$RELAX= 
##$RELAX= 
##$RELAX= 
$$ Bruker specific parameters
$$ --------------------------
##$DU= <E:\>
##$EXPNO= 12
$$ [...]
##$TP07= 0
##$TPNAME0= <>
##$TPNAME1= <>
##$TPNAME2= <>
##$TPNAME3= <>
##$TPNAME4= <>
##$TPNAME5= <>
##$TPNAME6= <>
##$TPNAME7= <>
##$TPOAL= (0..7)
0.5 0.5 0.5 0.5 0.5 0.5 0.5 0.5
##$TPOFFS= (0..7)
0 0 0 0 0 0 0 0
##$TUNHIN= 0
##$TUNHOUT= 0
##$TUNXOUT= 0
##$USERA1= <user>
##$USERA2= <user>
##$USERA3= <user>
##$USERA4= <user>
##$USERA5= <user>
##$V9= 5
##$VALIST= <valist>
##$VCLIST= <CCCCCCCCCCCCCCC>
##$VD= 0
##$VDLIST= <DDDDDDDDDDDDDDD>
##$VPLIST= <PPPPPPPPPPPPPPP>
##$VTLIST= <TTTTTTTTTTTTTTT>
##$WBST= 2048
##$WBSW= 25
##$XGAIN= (0..3)
0 0 0 0
##$XL= 0
##$YL= 0
##$YMAX_a= 8080328
##$YMIN_a= -14966340
##$ZGOPTNS= <>
##$ZL1= 120
##$ZL2= 120
##$ZL3= 120
##$ZL4= 120
##$ABSF1= 14.96407
##$ABSF2= -5.594111
##$ABSG= 5
##$ABSL= 3
##$ALPHA= 0
##$AQORDER= 0
##$ASSFAC= 0
##$ASSFACI= 0
##$ASSFACX= 0
##$ASSWID= 0
##$AUNMP= <proc_prof1d_extract.lims>
##$AXLEFT= 0
##$AXNAME= <>
##$AXNUC= <1H>
##$AXRIGHT= 0
##$AXTYPE= 0
##$AXUNIT= <>
##$AZFE= 0.1
##$AZFW= 0.1
##$BCFW= 0
##$BC_mod= 0
##$BYTORDP= 0
##$COROFFS= 0
##$CY= 15
##$DATMOD= 1
##$DC= 0
##$DFILT= <>
##$DTYPP= 0
##$F1P= 0
##$F2P= 0
##$FCOR= 0.5
##$FTSIZE= 131072
##$FT_mod= 6
##$GAMMA= 0
##$GB= 0
##$INTBC= 1
##$INTSCL= 1
##$ISEN= 128
##$LB= 0.3
##$LEV0= 0
##$LPBIN= 0
##$MAXI= 10000
##$MC2= 0
##$MEAN= 0
##$ME_mod= 0
##$MI= 0
##$NCOEF= 0
##$NC_proc= -2
##$NLEV= 6
##$NOISF1= 0
##$NOISF2= 0
##$NSP= 0
##$NTH_PI= 0
##$NZP= 0
##$OFFSET= 14.96407
##$PC= 1
##$PHC0= -87.40173
##$PHC1= 0
##$PH_mod= 1
##$PKNL= yes
##$PPARMOD= 0
##$PPDIAG= 0
##$PPIPTYP= 0
##$PPMPNUM= 2147483647
##$PPRESOL= 1
##$PSCAL= 4
##$PSIGN= 0
##$PYNMP= <proc.py>
##$REVERSE= no
##$SF= 400.020008410329
##$SI= 131072
##$SIGF1= 0
##$SIGF2= 0
##$SINO= 400
##$SIOLD= 131072
##$SPECTYP= <>
##$SREGLST= <1H.CDCl3>
##$SSB= 0
##$STSI= 131072
##$STSR= 0
##$SW_p= 8223.68421052631
##$SYMM= 0
##$S_DEV= 0
##$TDeff= 65536
##$TDoff= 0
##$TI= <>
##$TILT= no
##$TM1= 0
##$TM2= 0
##$TOPLEV= 0
##$USERP1= <user>
##$USERP2= <user>
##$USERP3= <user>
##$USERP4= <user>
##$USERP5= <user>
##$WDW= 1
##$XDIM= 131072
##$YMAX_p= 429176097
##$YMIN_p= -12401
##$CURPLOT= <Network HP LaserJet P1505>
##$CURPRIN= <$Network HP LaserJet P1505>
##$DFORMAT= <normdp>
##$LAYOUT= <+/1D_H.xwp>
##$LFORMAT= <normlp>
##$PFORMAT= <normpl>
##$SURQMSG= 1
$$ End of Bruker specific parameters
$$ ---------------------------------
##NTUPLES= NMR SPECTRUM
##VAR_NAME=  FREQUENCY,     SPECTRUM/REAL,   SPECTRUM/IMAG
##SYMBOL=    X,             R,               I
##VAR_TYPE=  INDEPENDENT,   DEPENDENT,       DEPENDENT
##VAR_FORM=  AFFN,          ASDF,            ASDF
##VAR_DIM=   131072,        131072,          131072
##UNITS=     HZ,            ARBITRARY UNITS, ARBITRARY UNITS
##FACTOR=    0.0627417313425164, 1,          1
##FIRST=     8223.62146879497, -650,         -54522
##LAST=      0,             1363,            -55397
##MIN=       0,             -12401,          0
##MAX=       8223.62146879497, 429176097,    0
$$ Real data points
##PAGE= N=1
##DATA TABLE= (X++(R..R)), XYDATA
$$ [...]
63313B47181l00q27j459k429l244l191k380j707j775k223k317j844j270j130j412
63298B19673j554j057p5P32Q87M46k68r23j134o77P1L97K45L85J233K066K023
63281B22470J337Q38O31J80m81o89l43j82o03r78o75J1L66L28L68P16J128J350
63263B25772J371J227Q74K95k85l82L94J771K772K684J967J708K158K512K243
63248B47081J919K202K738K815K640L055M177N165N498N674O323P300Q149R009
63234C13745J0415J2346J3996J4658J4489J4253J4484J5048J5378J5068J4332
63223D68212J3848J4058J4544J4384J3265J2055J1930J3044J4453J5294J5653
63212F20740J6016J6292J5803J4098J1385Q151M679J003k921p081j1245j4861
$$ plain form
63313 247181 246881 246054 244595 242166 238922 235731 233351 231644 229869 227646 225329 223485 222215 221085 219673
63298 219673 218119 217062 216987 217719 218606 219052 218784 217861 216727 216050 216121 216518 216763 217148 218381 220447 222470
63281 222470 223807 224645 225276 225456 224975 224286 223943 223761 223158 222180 221505 221516 221882 222210 222578 223294 224422 225772
63263 225772 227143 228370 229244 229539 229254 228872 229266 231037 233809 236493 238460 240168 242326 244838 247081
63248 247081 249000 251202 253940 256755 259395 262450 266627 271792 277290 282964 289287 296587 304736 313745
63234 313745 324160 336506 350502 365160 379649 393902 408386 423434 438812 453880 468212
63223 468212 482060 496118 510662 525046 538311 550366 562296 575340 589793 605087 620740
63212 620740 636756 653048 668851 682949 694334 702485 707164 708167 705246 698165 686920 672059
63200F72059j7346j8698j9600k0640k1497k1200j9316j6638j4418j3009j1598
63189D78099r371o539l931j873j7J829L392M600N991P886R692J0572J0729J1270
63175E22329J2753J4423J5162J4775J4005J3526J3310J2988J2463J1952J1565
63164F69251J1065J0157Q887P569O336M896K851K8l446p179j0572j3175j5171
63151F71497j7219j9527k1350k1810k0966j9676j8552j7526j6376j5106j3735
63140D69654j2182j0554r188q155p113n774m311l074k216j782j822k165k328j985
63126C97005j332p82m79m25p88j667k628l016k783k536k628k649k120j349j091
63111C70732j464j748j282k74N62Q60Q88J083J617K374L141L747M121M318M425
$$ plain form
63200 672059 654713 636015 616415 595775 574278 553078 533762 517124 502706 489697 478099
63189 478099 468728 462189 458258 456385 456368 458197 461589 466189 472180 480066 489758 500330 511059 522329
63175 522329 535082 549505 564667 579442 593447 606973 620283 633271 645734 657686 669251
63164 669251 680316 690473 699360 706929 713265 718161 721012 721040 717594 710415 699843 686668 671497
63151 671497 654278 634751 613401 591591 570625 550949 532397 514871 498495 483389 469654
63140 469654 457472 446918 437730 429575 422462 416688 412377 409303 407087 405305 403483 401318 398990 397005
63126 397005 395673 394891 394412 393987 393199 391532 388904 385888 383105 380569 377941 375292 373172 371823 370732
63111 370732 369268 367520 366238 365964 366526 367386 368274 369357 370974 373348 376489 380236 384357 388675 393100
63096C93100M498M590M717M689M163L071J868J134J017J250J632K113K493K523
63082D32858K365K488K896K909K063R88Q83K183M029N100M849L897L352L717M526
63067D79103N056N251N620O391P230P889Q568R443J0372J1383J2910J5091J7232
63054F01539J8620J9567K0991K3147K5395K7188K8667L0129L1510L2625L3510
63043H92888L4236L4594L4206L2979L1304K9923K9430K9829L0549L1053L1254
63032A242245L1385L1591L1884L2109L1767L0116K6821K2230J6731J0128K139
63021A509146o750j5534k3628l0989l7446m2530m6061m8306m9425m9244m7744
63010A111489m5310m2253l8483l3911k8885k3971j9420j5032j0528n931j641K011
$$ plain form
63096 393100 397598 402188 406905 411594 415757 418828 420696 421830 422847 424097 425729 427842 430335 432858
63082 432858 435223 437711 440607 443516 445579 446567 447450 449633 453662 458762 463611 467508 470860 474577 479103
63067 479103 484159 489410 495030 501421 508651 516540 525108 534551 544923 556306 569216 584307 601539
63054 601539 620159 639726 660717 683864 709259 736447 765114 795243 826753 859378 892888
63043 892888 927124 961718 995924 1028903 1060207 1090130 1119560 1149389 1179938 1210991 1242245
63032 1242245 1273630 1305221 1337105 1369214 1400981 1431097 1457918 1480148 1496879 1507007 1509146
63021 1509146 1502396 1486862 1463234 1432245 1394799 1352269 1306208 1257902 1208477 1159233 1111489
63010 1111489 1066179 1023926 985443 951532 922647 898676 879256 864224 853696 847765 846124 848135
62998H48135N238Q552J1953J4767J6619J8039J9639K1125K1887K2165K2686K3315
62986A054120K3109K1937K0966K1110K1789K1769K0631J8810J6592J3610R258
62975A263701L282l888j1218j7765k3431k8842l4437l9995m4921m8569n0329n0046
62963I13542m8481m6701m4949m2664l9648l6380l3074k9462k5853k3362k2345
62952E20623k1557j9775j7466j5861j4969j3753j1968j0470r696q992p805o666
62940C61645o395o913p320o965o048n257m975m853m275l220k375k163k158j826
62926B96902j419j473j743j476o67j86n05j057j187r97q88q50p96j078k007l129
62910B77444l641l464l254l344l318k824k230k047k092j827j302j125j488j876
$$ plain form
62998 848135 853373 861925 873878 888645 905264 923303 942942 964067 985954 1008119 1030805 1054120
62986 1054120 1077229 1099166 1120132 1141242 1163031 1184800 1205431 1224241 1240833 1254443 1263701
62975 1263701 1266983 1263095 1251877 1234112 1210681 1181839 1147402 1107407 1062486 1013917 963588 913542
62963 913542 865061 818360 773411 730747 691099 654719 621645 592183 566330 542968 520623
62952 520623 499066 479291 461825 445964 430995 417242 405274 394804 385108 376116 368311 361645
62940 361645 355250 348337 341017 334052 328004 322747 317772 312919 308644 305424 303049 300886 298728 296902
62926 296902 295483 294010 292267 290791 290124 289938 289433 288376 287189 286192 285304 284454 283658 282580 280573 277444
62910 277444 273803 270339 267085 263741 260423 257599 255369 253322 251230 249403 248101 246976 245488 243612
62896B43612j964k175k851l428l094k034j262j179j107m04N84J015N45m71j422
62881B24365j770j321m20L16P10J021J202P57l05j049p71n5N5m19n63o1L98L38
62863B22428K04N12R67R28L79j26k11RK88N23P29R26J149J378J528J603J810K327
62845B37351K924L024K400J650J663K487L149K827J989J792K578L514L786L481
62831B74615L002K320J357O22P04J280J368O87J65Q05K429L892M336L931L397
62816C04910L098K865K539K396K657K976K834K457K710L920N327O085O277O469
62802C57520O776P122P967R886J2423J4292J4990J5403J6501J8090J9482K0816
62790E21268K2909K5899K8879L1054L2774L4959L7851M0834M3417M5936M8972
$$ plain form
62896 243612 241648 239473 236622 233194 230100 228066 226804 225625 224518 224114 224698 225713 226258 225787 224365
62881 224365 222595 221274 220854 221170 221880 222901 224103 224860 224555 223506 222735 222680 222735 222316 221753 221692 222090 222428
62863 222428 222632 223144 224111 225039 225418 225292 225081 225090 225378 225901 226630 227556 228705 230083 231611 233214 235024 237351
62845 237351 240275 243299 245699 247349 249012 251499 254648 257475 259464 261256 263834 267348 271134 274615
62831 274615 277617 279937 281294 281916 282620 283900 285268 285955 286120 286925 289354 293246 297582 301513 304910
62816 304910 308008 310873 313412 315808 318465 321441 324275 326732 329442 333362 338689 344774 351051 357520
62802 357520 364296 371418 379385 389271 401694 415986 430976 446379 462880 480970 500452 521268
62790 521268 544177 570076 598955 630009 662783 697742 735593 776427 819844 865780 914752
62779I14752N2344N5108N6557N6814N6243N4564N0988M5180L7718K9524K1078
62768A430870J2369L361n777j4884k3830l2287l9706m5751n0548n4239n6501n6925
62756A066152n5806n4095n2447n0798m8986m7158m5234m2550l8662l4167l0148
62745E66101k7004k4431k2194k0250j8310j6092j3940j2425j1356j0053q501p368
62733C74177o728n847m527l609l617l811l301k260j335n35M74J581K503L415M525
62718C51105N445N791O071P146R057J1089J2764J4134J5376J6804J9005K2148
62706D95935K5429K7959L0067L2856L6609M0501M3838M6673M9059N0565N0868
62695I30359N0119M8416M5402M0717L4457K6987J8662R874J007p771j6374k4454
$$ plain form
62779 914752 967096 1022204 1078761 1135575 1191818 1246382 1297370 1342550 1380268 1409792 1430870
62768 1430870 1443239 1446600 1440823 1425939 1402109 1369822 1330116 1284365 1233817 1179578 1123077 1066152
62756 1066152 1010346 956251 903804 853006 804020 756862 711628 669078 630416 596249 566101
62745 566101 539097 514666 492472 472222 453912 437820 423880 411455 400099 390046 381545 374177
62733 374177 367449 361602 357075 353466 349849 346038 342737 340477 339142 338607 339081 340662 343165 346580 351105
62718 351105 356550 362341 368412 375558 384615 395704 408468 422602 437978 454782 473787 495935
62706 495935 521364 549323 579390 612246 648855 689356 733194 779867 828926 879491 930359
62695 930359 980478 1028894 1074296 1115013 1149470 1176457 1195119 1204993 1206000 1198229 1181855 1157401
62683A157401l1494l7321m2145m6072m8817m9980m9431m7542m5169m3164m1596
62672F74670l9762l7224l4412l1869k9411k6660k3882k1548j9570j7693j6211
62661C76428j5321j4233j2106r587q132p913p695o863o136n989n808n174m660
62648B66811m608m317l334k562k978m030m421l940l437l343l226k700j945j344
62634B20626j116j215j218n65N95J241P01l29o79k00L72P34J274K015K335J942
62618B26513J424J447J916K376K795L527M639N700O310O601P072P979R039R915
62604B97253J0793J2215J4285J6442J8159J9557K1134K3128K5389K7611K9430
62593E15396L0517L0801L0439K9277K6728K2551J7522J2817Q762M662j20n316
$$ plain form
62683 1157401 1125907 1088586 1046441 1000369 951552 901572 852141 804599 759430 716266 674670
62672 674670 634908 597684 563272 531403 501992 475332 451450 429902 410332 392639 376428
62661 376428 361107 346874 334768 325181 317049 309136 301441 294578 288442 282453 276645 271471 266811
62648 266811 262203 257886 254552 251990 249012 244982 240561 236621 233184 229841 226615 223915 221970 220626
62634 220626 219510 218295 217077 216512 217107 218348 219049 218720 218041 217841 218213 218947 220221 222236 224571 226513
62618 226513 227937 229384 231300 233676 236471 239998 244637 250337 256647 263248 270320 278299 287338 297253
62604 297253 308046 320261 334546 350988 369147 388704 409838 432966 458355 485966 515396
62593 515396 545913 576714 607153 636430 663158 685709 703231 716048 724810 729472 729352 724036
62581G24036j0178j4342j7996k1294k3953k5567k6173k6309k6388k6206k5289
62570D80341k3636k1876k0541j9532j8391j6936j5375j3972j2811j1883j1152
62559B94236j0470r533q138o530n350m962m847m055k435j013p58j333j655j371
62545B31786j100j154r05K32J795K771K798K434K392K830L396L737L945M445N411
62530B64813O474P206P711Q333Q989R357R626J0413J1895J3649J5502J7782K0464
62517D12214K2705K3810K4159K4691K5762K6868K7185K6073K3399J9717J5864
62506F72447J2049P744K676k541p155j1161j4859j7996k0035k1099k1927k2812
62494E55331k3191k2411k0632j8718j7365j6420j5152j3274j1521j0840j1132
$$ plain form
62581 724036 713858 699516 681520 660226 636273 610706 584533 558224 531836 505630 480341
62570 480341 456705 434829 414288 394756 376365 359429 344054 330082 317271 305388 294236
62559 294236 283766 274233 266095 259565 254215 249253 244406 240351 237916 236903 236145 234812 233157 231786
62545 231786 230686 229532 228627 228859 230654 233425 236223 238657 241049 243879 247275 251012 254957 259402 264813
62530 264813 271287 278493 286204 294537 303526 312883 322509 332922 344817 358466 373968 391750 412214
62517 412214 434919 458729 482888 507579 533341 560209 587394 613467 636866 656583 672447
62506 672447 684496 692240 694916 692375 685220 674059 659200 641204 621169 600070 578143 555331
62494 555331 532140 509729 489097 470379 453014 436594 421442 408168 396647 385807 374675
62483C74675j1312j0720r831r306r037q601q040p589p018n968m696l887l761l922
62469B70987l938l691l238k750k511k568k573k246j770j394r21k03K28l46j676
62454B41390k580k261j145l17m10j128j563r86M32J748K269K253K352K616K602
62439B45272K301K341L157M435N544O222O654P100P638Q216Q893R877J1167J2200
62425C41017J2273J1468J0656J0311R803Q397O470N061M425L823K607Q46j166
62412D25991l231m894n501m992m184l862l927l812l391l086l150l294l075k387
62398C73205j409k02J435L605O004Q175R999J1691J3321J4675J5768J7069J9023
62385D92359K1519K4107K6461K8444K9873L0621L0820L0696L0284K9399K7734
$$ plain form
62483 374675 363363 352643 342812 333506 324469 315868 307828 300239 293221 287253 282557 278670 274909 270987
62469 270987 267049 263358 260120 257370 254859 252291 249718 247472 245702 244308 243387 243184 243412 243066 241390
62454 241390 238810 236549 235404 235087 234677 233549 231986 231000 231432 233180 235449 237702 240054 242670 245272
62439 245272 247573 249914 253071 257506 263050 269272 275926 283026 290664 298880 307773 317650 328817 341017
62425 341017 353290 364758 375414 385725 395528 403925 410395 415456 419881 423704 426311 427157 425991
62412 425991 422760 417866 412365 407373 403189 399327 395400 391588 388197 385111 381961 378667 375592 373205
62398 373205 371796 371594 373029 376634 382638 390813 400812 412503 425824 440499 456267 473336 492359
62385 492359 513878 537985 564446 592890 622763 653384 684204 714900 745184 774583 802317
62374H02317K5006K1255J7091J3124R096M176j593o867j0492j2846j4917j6776
62362H28574j7819j8124j8494j9146j9450j9076j8542j8321j8117j7380j6091
62351F28014j4659j3452j2608j2074j1557j0657r155p067m621k395j140r49q60
62338E26820Q5J497K194J972J974K948M017L698J631j165l446m652n016n237o011
62323E21309p502r163j0190j0177r449q821q882r304r068p692n919m815m463m147
62309D11717l560l025k594j832o78K77O88Q57R89Q20L63K19N86P60K92m2O65K003
62291D08505K854L103L567M446N052N295O153Q170J0369J1538J1839J2381J3587
62278E06859J4956J6230J7762J9618K1161K1936K2280K2600K2588K1769K0334
$$ plain form
62374 802317 827323 848578 865669 878793 887889 892065 890472 883605 873113 860267 845350 828574
62362 828574 810755 792631 774137 754991 735541 716465 697923 679602 661485 644105 628014
62351 628014 613355 599903 587295 575221 563664 553007 543852 536785 532164 529769 528629 527680 526820
62338 526820 526905 528402 530596 532568 534542 537490 541507 545205 546836 545671 542225 537573 532557 527320 521309
62323 521309 513807 504644 494454 484277 474828 466007 457125 447821 438753 431061 425142 420327 415864 411717
62309 411717 408157 405132 402538 400706 400028 400305 400993 401850 402839 403659 404022 404241 404827 405587 405879 405837 406502 408505
62291 408505 411359 414462 418029 422475 427527 432822 438975 447145 457514 469052 480891 493272 506859
62278 506859 521815 538045 555807 575425 596586 618522 640802 663402 685990 707759 728093
62267G28093J8779J7011J4555J1532Q613N998L201o2l396o397r042j1165j2292
62254G65428j2426j2278j2237j1794j0525q994p837o655m733k478j026o31m42
62241F73372J55R50J691K479L237L616L698L996M557M827M662M716N390O188O573
62226G30107O828P466Q264Q608Q460Q424Q916R769J0619J1316J1966J2737J3657
62213H57137J4611J5602J6928J8821K0997K2988K4861K7127K9846L2386L4255
62202A115559L5645L6804L7354L6621L4281L0297K4652J7721J0617M546j37l798
62190A380162o532p841p494o157m723l211q23K817O920J0285J2459J3723J4226
62177A403811J3817J2752J1814J1332J0814R925R250R421J0043J0177R536Q404
$$ plain form
62267 728093 746872 763883 778438 789970 798583 804581 807782 807720 804324 797927 788885 777720 765428
62254 765428 753002 740724 728487 716693 706168 697174 689337 682682 677949 675471 674445 673814 673372
62241 673372 673527 674477 676168 678647 681884 685500 689198 693194 697751 702578 707240 711956 717346 723534 730107
62226 730107 736935 744401 752665 761273 769733 778157 787073 796842 807461 818777 830743 843480 857137
62213 857137 871748 887350 904278 923099 944096 967084 991945 1019072 1048918 1081304 1115559
62202 1115559 1151204 1188008 1225362 1261983 1296264 1326561 1351213 1368934 1379551 1384097 1383960 1380162
62190 1380162 1373630 1365789 1358295 1352138 1347415 1344204 1343381 1346198 1353118 1363403 1375862 1389585 1403811
62177 1403811 1417628 1430380 1442194 1453526 1464340 1474265 1483515 1492936 1502979 1513156 1522692 1531096
62165A531096O805M706K846K294L087M177M793N084N399N802O528P942R749J0998
62151A611306J1196J0822J0473J0274J0321J0856J1653J1962J1519J0910J0590
62140A731882J0281R729R288R226R251R203R498J0226J0589R920Q656P620O898
62127A852267O275O050O541P187P143O583O529P519R171J1004J2918J4903J6849
62114A970939J8682K0124K0392J8635J4776R801N268K687K842N225Q400J1280
62102B109051J3656J5241J4958J2072P660M058K905M253P211J0572J2986J3476
62090B228099J2084R528O248K302j919n594q287j0436j2884j6185k0269k4471
62078B158216k8014l0787l3432l6288l8618l9413l8679l7266l5729l4068l2414
$$ plain form
62165 1531096 1537901 1542607 1545453 1547747 1550834 1555011 1559804 1564888 1570287 1576089 1582617 1590559 1600308 1611306
62151 1611306 1622502 1633324 1643797 1654071 1664392 1675248 1686901 1698863 1710382 1721292 1731882
62140 1731882 1742163 1751892 1761180 1770406 1779657 1788860 1798358 1808584 1819173 1829093 1837749 1845369 1852267
62127 1852267 1858542 1864592 1871133 1878320 1885463 1892046 1898575 1906094 1915265 1926269 1939187 1954090 1970939
62114 1970939 1989621 2009745 2030137 2048772 2063548 2073349 2078617 2081304 2084146 2089371 2097771 2109051
62102 2109051 2122707 2137948 2152906 2164978 2172638 2176696 2179601 2183854 2191065 2201637 2214623 2228099
62090 2228099 2240183 2249711 2255959 2258261 2256342 2250748 2242461 2232025 2219141 2202956 2182687 2158216
62078 2158216 2130202 2099415 2065983 2029695 1991077 1951664 1912985 1875719 1839990 1805922 1773508
62067A773508l1056k9877k8570k7414k7043k7341k7385k6635k5437k4236k3006
62056A475508k1716k0493j9111j7115j4848j3494j3574j4112j3976j3390j3319
62045A300360j3883j4274j4052j3597j3279j2873j2094j1120j0362j0002j0029
62034A164795j0406j0957j1300j1150j0684j0355j0325j0211r430p698n175k286
62022A054818M66K702M492O423R040J2159J5017J7127J8594J9467J9255J7418
62010A196978J3912Q875K255n721j3975k1202k6967l1571l4946l6467l5975l4302
61998I80894l2371l0289k7673k4538k1382j8582j6085j3624j1073q572o357m533
61986G65815l035j870j179q53k95J030K835M248M844N023N382O122P266Q883J0739
$$ plain form
62067 1773508 1742452 1712575 1684005 1656591 1629548 1602207 1574822 1548187 1522750 1498514 1475508
62056 1475508 1453792 1433299 1414188 1397073 1382225 1368731 1355157 1341045 1327069 1313679 1300360
62045 1300360 1286477 1272203 1258151 1244554 1231275 1218402 1206308 1195188 1184826 1174824 1164795
62034 1164795 1154389 1143432 1132132 1120982 1110298 1099943 1089618 1079407 1069977 1062279 1057104 1054818
62022 1054818 1055284 1057986 1062478 1068901 1077941 1090100 1105117 1122244 1140838 1160305 1179560 1196978
62010 1196978 1210890 1219765 1222020 1216299 1202324 1181122 1154155 1122584 1087638 1051171 1015196 980894
61998 980894 948523 918234 890561 866023 844641 826059 809974 796350 785277 776705 770348 765815
61986 765815 762780 760910 759731 758878 758583 759613 762448 766696 771540 776563 781945 788067 795333 804216 814955
61971H14955J2166J2692J2731J3179J4457J6205J7829J9066K0074K1242K2985
61960I97581K5431K8228L0813L3029L5345L8320M1929M5522M8549N1131N3826
61949A429704N6908O0094O3084O6117O9842P4681Q0455Q6639R2827R8989J05313
61938B284653J11849J18409J25017J32464J42065J54694J70251J88437K09770
61929C637609K35361K65623K99575L35500L71786M06734M37763M61296M73581
61920F924828M71229M50934M09306L44162K56631J51987L8170p6456j84268k78503
61910H508020l53902m07956m41264m56411m56531m44692m23873l96926l66603
61901D759862l35610l06251k79778k56364k35739k17525k00981j85147j69669
$$ plain form
61971 814955 827121 839813 852544 865723 880180 896385 914214 933280 953354 974596 997581
61960 997581 1023012 1051240 1082053 1115082 1150427 1188747 1230676 1276198 1324747 1375878 1429704
61949 1429704 1486612 1546706 1609790 1675907 1745749 1820430 1900885 1987524 2080351 2179340 2284653
61938 2284653 2396502 2514911 2639928 2772392 2914457 3069151 3239402 3427839 3637609
61929 3637609 3872970 4138593 4438168 4773668 5145454 5552188 5989951 6451247 6924828
61920 6924828 7396057 7846991 8256297 8600459 8857090 9009077 9047247 8970791 8786523 8508020
61910 8508020 8154118 7746162 7304898 6848487 6391956 5947264 5523391 5126465 4759862
61901 4759862 4424252 4118001 3838223 3581859 3346120 3128595 2927614 2742467 2572798
61892B572798j54920j41076j27696j14649j02765r2774q4066p5387o6465n8172
61882A554828n1174m5280m0009l5078l0246k5364k0635j6238j1739o541j009L682
61870A275197P041R971J3596J7976K2320K5982K8841L1033L2741L4127L5132L5441
61858A569398L4732L2843K9694K5397K0439J5461J0778O476L031J265J484L065
61846A754063N171P426R630J1226J1598J0747R197P359N289K954M56k037m286
61833A828793n883o357n362k752J380O535J1909J6906K1580K6186L0505L3914
61821A957354L6242L8160M0414M3022M5659M8723N3443O0669O9991Q0398R1543
61810B565618J03894J17832J33258J50121J68736J89321K11760K36212K63566
$$ plain form
61892 2572798 2417878 2276802 2149106 2034457 1931692 1838918 1754852 1679465 1613000 1554828
61882 1554828 1503654 1458374 1418365 1383287 1353041 1327677 1307042 1290804 1279065 1272524 1271515 1275197
61870 1275197 1282238 1292209 1305805 1323781 1346101 1372083 1400924 1431957 1464698 1498825 1533957 1569398
61858 1569398 1604130 1636973 1666667 1692064 1712503 1727964 1738742 1745218 1748249 1749514 1750998 1754063
61846 1754063 1759234 1766660 1776290 1787516 1799114 1809861 1819058 1826417 1831706 1834660 1835116 1833079 1828793
61833 1828793 1822910 1816553 1811191 1808439 1809819 1816354 1828263 1845169 1866749 1892935 1923440 1957354
61821 1957354 1993596 2031756 2072170 2115192 2160851 2209574 2263017 2323686 2393677 2474075 2565618
61810 2565618 2669512 2787344 2920602 3070723 3239459 3428780 3640540 3876752 4140318
61801D140318K94836L30334L69849M13423M61398N13688N69233O26137O81957
61792H401173P33704P77433Q07592Q16764P96773P41097O46868N15314L51459
61783A4588177J64261l3491k26985m02522n49955o63419p41070p84551p98188
61774A0552257p87838p59874p20360o74241o24839n74096n23354m73914m27120
61765D986621l84124l45506l10955k79606k51050k25720k03990j85165j67891
61756B632614j51443j36133j22570j10935j00995r2308q4331p6679o9403o2859
61746A624958n7241n2464m8354m4701m1223l7742l4343l1245k8552k6273k4286
61735A198534k2210j9582j6382j3073j0038p399n469m666m738m890n214o988j0819
$$ plain form
61801 4140318 4435154 4765488 5135337 5548760 6010158 6523846 7093079 7719216 8401173
61792 8401173 9134877 9912310 10719902 11536666 12333439 13074536 13721404 14236718 14588177
61783 14588177 14752438 14718947 14491962 14089440 13539485 12876066 12134996 11350445 10552257
61774 10552257 9764419 9004545 8284185 7609944 6985105 6411009 5887655 5413741 4986621
61765 4986621 4602497 4256991 3946036 3666430 3415380 3189660 2985670 2800505 2632614
61756 2632614 2481171 2345038 2222468 2111533 2010538 1918230 1833899 1757220 1687817 1624958
61746 1624958 1567717 1515253 1466899 1422198 1380975 1343233 1308890 1277645 1249093 1222820 1198534
61735 1198534 1176324 1156742 1140360 1127287 1117249 1109850 1104381 1099715 1094977 1090087 1084873 1077885 1067066
61722A067066j5301j8556k0357k1649k2643k2770k2077k1167j9939j7743j4861
61711H50003j2419j0819r574q692q815r679j0008r354q700q698q733q330p993
61698G28189p788o548l679o71N39m7r75j448j795k435l553n397p680r126q829
61683F68757p776p753q877r567q993q173q219q694q513p628o917o783o690o041
61669E58133m953m006l568l544l573l283k464j291l74k86q78j398j530j901l106
61654E21978m643n514n595n550n528m917l633k575k395k581k332j606q40j94L44
61639D74419P15J181K366M331O205P399Q505J0271J2212J3242J3267J3044J2644
61626E79801J1104P856L639m13l947p270j0370j2613j3450j3173j2761j2779j2674
$$ plain form
61722 1067066 1051765 1033209 1012852 991203 968560 945790 923713 902546 882607 864864 850003
61711 850003 837584 826765 817191 808499 799684 790005 779997 770643 761943 753245 744512 736182 728189
61698 728189 720401 713853 710174 709503 710042 709995 709020 707572 705777 703342 699789 694392 686712 677586 668757
61683 668757 660981 653228 644351 634784 625791 617618 609399 600705 592192 584564 577647 570864 564174 558133
61669 558133 553180 549174 545606 542062 538489 535206 532742 531451 531077 530791 529913 528515 526985 525084 521978
61654 521978 517335 511821 506226 500676 495148 490231 486598 484023 481628 479047 476715 475109 474269 474075 474419
61639 474419 475134 476315 478681 483012 489217 496616 505121 515392 527604 540846 554113 567157 579801
61626 579801 590905 598761 602400 601987 598040 590770 580400 567787 554337 541164 528403 515624 502950
61613E02950j1487r203o843n217m199l410k853k455j718m30Q23J441J681K094
61599D61174K607K861L076L746M714N369N665O156P080Q042Q663Q976R141R255
61585E46525R458R849J0398J1285J3058J6034J9615K2866K5626K8456L1605L4567
61573G79342L6656L7474L6744L4243L0125K4967J9445J4124R452N597K397k21
61561A030345j933k492k205j499k36J934M727P361R538J1606J3713J5431J6385
61548A102675J6719J6641J6000J4567J2398R671O371K446j834n875r063j1111
61536A169605j2130j2445j2274j1690j0812r731q312o351m037j800M22L242O803
61523A090490J0329J3180J5833J9199K3355K7707L2147L7149M2861M8918N5254
$$ plain form
61613 502950 491463 482260 475417 470200 466001 462591 459738 457283 455565 455135 455958 457399 459080 461174
61599 461174 463781 466642 469718 473464 478178 483547 489212 495368 502448 510490 519153 528129 537270 546525
61585 546525 555983 565832 576230 587515 600573 616607 636222 659088 684714 713170 744775 779342
61573 779342 815998 853472 890216 924459 954584 979551 998996 1013120 1022572 1028169 1030566 1030345
61561 1030345 1028412 1025920 1023715 1022216 1021980 1023914 1028641 1036002 1045540 1057146 1070859 1086290 1102675
61548 1102675 1119394 1136035 1152035 1166602 1179000 1188671 1195042 1197488 1195654 1189779 1180716 1169605
61536 1169605 1157475 1145030 1132756 1121066 1110254 1100523 1092211 1085860 1081823 1080023 1080445 1083687 1090490
61523 1090490 1100819 1113999 1129832 1149031 1172386 1200093 1232240 1269389 1312250 1361168 1416422
61512A416422O2411P0780Q0079Q9808R9726J09691J19401J28572J37198J45372
61502B459460J52889J59154J63531J65968J67233J68160J68447J66463J60458
61493C931763J49682J34161J14157R0431O4664L8952J4943o296k4043l8206m9558
61482D420650n9120o7572p5655q4542r4866j05711j15347j22820j28002j30380
61472C436635j28905j23113j13615j01463q7830p4269o2089n1272m0832l0452
61462B622795k0943j2837n678Q45O045R329J1386J3468J5849J7866J9174K0276
61450B697575K1865K4158K6963K9957L2968L6184M0102M5008N0604N6314O1880
61439C123578O7382P2579P6407P7252P3850O5929N4058L9109K2211N125j0122
$$ plain form
61512 1416422 1478833 1549613 1629692 1719500 1819226 1928917 2048318 2176890 2314088 2459460
61502 2459460 2612349 2771503 2935034 3101002 3268235 3436395 3604842 3771305 3931763
61493 3931763 4081445 4215606 4329763 4420194 4484858 4523810 4538753 4532457 4508414 4470208 4420650
61482 4420650 4361530 4293958 4218303 4133761 4038895 3933184 3817837 3695017 3567015 3436635
61472 3436635 3307730 3184617 3071002 2969539 2881709 2807440 2745351 2694079 2653247 2622795
61462 2622795 2601852 2589015 2583337 2584182 2590227 2599556 2610942 2624410 2640259 2658125 2677299 2697575
61450 2697575 2719440 2743598 2770561 2800518 2833486 2869670 2909772 2954780 3005384 3061698 3123578
61439 3123578 3190960 3263539 3339946 3417198 3491048 3556977 3611035 3650144 3672355 3677480 3667358
61428C667358k2410l2066l9844m5766m9285n0199m8662m4705l8457l0675k2306
61417C242983j3661m787L374R023J0824Q565K651o159j6282k5448l1851l4889
61405C144343l4752l2034k7832k3415j9314j5330j1644r100p914o867m568j065
61393B950508K525N703R231J4156K0758K8611L7305M6994N8253P1413Q6114J01681
61381C433252J17750J34192J50385J65081J77034J85457J89893J90143J86340
61372D929527J78490J65830J47263J22739R3695O1940K8845m189l5413o3582q8611
61361E536534j10775j29785j45359j58102j68824j77197j82045j83048j81300
61352D100099j77959j73095j66175j57198j46818j35667j24038j12143j00310
$$ plain form
61428 3667358 3644948 3612882 3573038 3527272 3477987 3427788 3379126 3334421 3295964 3265289 3242983
61417 3242983 3229322 3224535 3227909 3236932 3247756 3256321 3258972 3252813 3236531 3211083 3179232 3144343
61405 3144343 3109591 3077557 3049725 3026310 3006996 2991666 2980022 2970922 2963008 2956141 2951573 2950508
61393 2950508 2953033 2958736 2967967 2982123 3002881 3031492 3068797 3115791 3174044 3245457 3331571 3433252
61381 3433252 3551002 3685194 3835579 4000660 4177694 4363151 4553044 4743187 4929527
61372 4929527 5108017 5273847 5421110 5543849 5637544 5699484 5728329 5724140 5688727 5625145 5536534
61361 5536534 5425759 5295974 5150615 4992513 4823689 4646492 4464447 4281399 4100099
61352 4100099 3922140 3749045 3582870 3425672 3278854 3143187 3019149 2907006 2806696
61343B806696q8796p7478o5853n3496m0593k7976j6427n915M168J3889K2057K6976
61331B497252K7873K5377K0602J4253P014L37m033n587n502n234n048m296k751
61318B560257r72M24J299J727J771J727K221L807O601J0320J4442J8375K1713
61305B643712K4451K6743K8441K9081K8288K5984K2212J6990J0492L222l992j0264
61293B845360j4966j7908j9163j8824j7270j5723j6013j9392k5710l3762m2024
61282B604605m8939n3165n4227n2677m9218m4055l7479l0477k3997j7941j1619
61271B180811n015J110O183J0166J2990J4330J3988J2107R160O261N060O514R827
61258B283492J3338J6425J9793K4045K8790L3292L7320M1307M6180N2986O2081
$$ plain form
61343 2806696 2717900 2640422 2574569 2521073 2480480 2452504 2436077 2430162 2434330 2448219 2470276 2497252
61331 2497252 2525125 2550502 2571104 2585357 2592371 2592708 2588675 2583088 2577586 2572352 2567304 2563008 2560257
61318 2560257 2559285 2559709 2561008 2562735 2564506 2566233 2568454 2572261 2578862 2589182 2603624 2621999 2643712
61305 2643712 2668163 2694906 2723347 2752428 2780716 2806700 2828912 2845902 2856394 2859616 2855624 2845360
61293 2845360 2830394 2812486 2793323 2774499 2757229 2741506 2725493 2706101 2680391 2646629 2604605
61282 2604605 2555666 2502501 2448274 2395597 2346379 2302324 2264845 2234368 2210371 2192430 2180811
61271 2180811 2175796 2176906 2183089 2193255 2206245 2220575 2234563 2246670 2255830 2262091 2267151 2273665 2283492
61258 2283492 2296830 2313255 2333048 2357093 2385883 2419175 2456495 2497802 2543982 2596968 2659049
61247B659049P2672Q3718R4994J06598J17672J26304J30510J28365J17606R6547
61237C734035O5820K8457j1743n1133q6023j13273j31675j41780j44160j38955
61227C009570j27322j11770r4294p5343n5400l6436k0885r970l924k960o905j4495
61215B449866k4099l4943m6794n8794o9461p7703q3204q5976q6101q3827p9536
61204A719428p3731o7232o0941n5136m9355m3252l7131l1329k5708k0198j5319
61193A240096j1526q393n073j385K019M485O018P119Q240R407J0458J1678J3806
61180A286949J6997K0067K1376K0252J6776J0542Q58j1612k4453l5172m2581m6468
61168A233531m7051m5226m2284l8862l4822l0512k7118k5253k4111k2753k1347
$$ plain form
61247 2659049 2731721 2815439 2910433 3017031 3134703 3261007 3391517 3519882 3637488 3734035
61237 3734035 3799855 3828312 3816569 3765436 3679413 3566140 3434465 3292685 3148525 3009570
61227 3009570 2882248 2770478 2676184 2600841 2545441 2509005 2488120 2478150 2474226 2471266 2464361 2449866
61215 2449866 2425767 2390824 2344030 2285236 2215775 2138072 2054868 1968892 1882791 1798964 1719428
61204 1719428 1645697 1578465 1517524 1462388 1413033 1369781 1332650 1301321 1275613 1255415 1240096
61193 1240096 1228570 1220177 1215104 1213719 1215738 1220223 1226241 1233360 1241600 1251007 1261465 1273143 1286949
61180 1286949 1303946 1324013 1345389 1365641 1382417 1392959 1393817 1382205 1357752 1322580 1279999 1233531
61168 1233531 1186480 1141254 1098970 1060108 1025286 994774 967656 942403 918292 895539 874192
61157H74192k0441j9836j9002j8032j7344j6852j6143j5055j3662j2080j0652
61146F95093r756r119p973o158m348k839j042J422M062O477R061J2149J5282J7832
61132G20143J9378J8995J5410Q738R68o124j2494j8354k2564k3881k2872k1173
61120F56170j9454j7490j5495j3915j2416j0502q825q412q856q653p253n515m139
61107E15245k941j770j006p50m45L76J485K333K573K267J906K111K964L898M519
61092E32765N101N894O581O880P128P613Q004Q001P926Q011P832P190O738O889
61078F32553O874N916M597L987M017L821L227K779K716K867L185L449K984J628
61064F84600M79O96K108L811N523P292Q691R432J0167J1555J3131J4229J5278
$$ plain form
61157 874192 853751 833915 814913 796881 779537 762685 746542 731487 717825 705745 695093
61146 695093 685337 676218 668245 662087 657739 654900 653858 655280 659342 665819 674880 687029 702311 720143
61132 720143 739521 758516 773926 782664 783632 777508 765014 746660 724096 700215 677343 656170
61120 656170 636716 619226 603731 589816 577400 566898 558073 549661 540805 532152 524899 519384 515245
61107 515245 512304 510534 509528 508778 508333 508709 510194 512527 515100 517367 519273 521384 524348 528246 532765
61092 532765 537866 543760 550341 557221 564349 571962 579966 587967 595893 603904 611736 618926 625664 632553
61078 632553 639427 645343 649940 653927 657944 661765 664992 667771 670487 673354 676539 679988 682972 684600
61064 684600 685079 685775 687883 691694 697217 704509 713200 722632 732799 744354 757485 771714 786992
61051G86992J6920J8703J9963K1230K3271K5421K6494K6655K6829K6860K6011
61040A045349K4698K3926K3448K2283K0716J9983K0270K0876K2028K4633K8469
61029A296679L2468L6664M1992M8313N4490O0195O5755P0472P3337P5335P8923
61018A934623Q5207R3701J04667J19176J36735J55210J73348J91246K08717K26102
61008C428732K46865K76343L17750L72456M43848N36663O52328P90531R57089
60999H022605J164586J423628J742148K137663K632712L208140L746997M041742
60991B8120221L892102L230280K176937R92660k7535o49550p60453m02333K24063
60982C6796392Q10621J051880P68016k5225j132724k265780l154807l643349l724642
$$ plain form
61051 786992 803912 822615 842578 863808 887079 912500 938994 965649 992478 1019338 1045349
61040 1045349 1070047 1093973 1117421 1139704 1160420 1180403 1200673 1221549 1243577 1268210 1296679
61029 1296679 1329147 1365811 1407803 1456116 1510606 1570801 1636556 1707028 1780365 1855700 1934623
61018 1934623 2019830 2113531 2218198 2337374 2474109 2629319 2802667 2993913 3202630 3428732
61008 3428732 3675597 3951940 4269690 4642146 5085994 5622657 6274985 7065516 8022605
60999 8022605 9187191 10610819 12352967 14490630 17123342 20331482 24078479 28120221
60991 28120221 32012323 35242603 37419540 38412200 38384665 37735115 36974662 36572329 36796392
60982 36796392 37607013 38658893 39426909 39401684 38268960 36003180 32848373 29205024 25480382
60973B5480382l506119l130582k709881k305466j943004j629668j362264j133345
60965G760053r37693p73370o37907n27186m38133l69084l16910k76407k43237
60956C240126k15349j91312j69604j49949j32996j18113j03465q8885p6609o8457
60946A925387o4018o2302o3178o6114o9056o9923o8315o4867n9999n4167m8395
60935A235053m3536l9438l5559l1912k8875k6514k4565k2802k1043j9223j7553
60924I24033j6236j5013j3482j1841j0710j0188r756r218r002r469j0438j1581
60912G87099j2675j3417j3619j3639j3996j4471j4234j3039j1633j0709j0053
60901F45614r014p427n696m244l131k113j032j19K29J11K12R84K045K728K869
$$ plain form
60973 25480382 21974263 18843681 16133800 13828334 11885330 10255662 8893398 7760053
60965 7760053 6822360 6048990 5411083 4883897 4445764 4076680 3759770 3483363 3240126
60956 3240126 3024777 2833465 2663861 2513912 2380916 2262803 2159338 2070453 1993844 1925387
60946 1925387 1861369 1799067 1735889 1669775 1600719 1530796 1462481 1397614 1337615 1283448 1235053
60935 1235053 1191517 1152079 1116520 1084608 1055733 1029219 1004654 981852 960809 941586 924033
60924 924033 907797 892784 879302 867461 856751 846563 836807 827589 818587 809118 798680 787099
60912 787099 774424 761007 747388 733749 719753 705282 691048 678009 666376 655667 645614
60901 645614 636600 629173 623477 619233 616102 613989 612957 612838 613067 613178 613390 614374 616419 619147 622016
60886F22016K718K371J811J219P96M86K03L2j08n20j107j228o74j37j49j97M85
60869F28017J735K873L633M011L887L609M260O223Q153Q562P872P504P436O200
60855G03975L285o5k598m219n192n455n275n488o575q210j0002j1828j3266j3642
60841F15445j2936j1928j1116j0304r391q718q304p608o460n452n041m858m360
60828E08969l575k911k641k782l039k759j533N6R16O84r9r36j725k122j542p6
60812D84885J442K542L465M188M070K989J999K117L072L784L703L139K639K514
60798E26548K692K804K626K486K786L183K967K273K069K666L122K612J593R86
60784E61413Q79O52o3j185k475l516l820l480l336m002n082n810o040o083n998
$$ plain form
60886 622016 624734 627105 628916 630135 630931 631417 631620 631652 631544 631024 629917 628689 628015 627878 627729 627532 628017
60869 628017 629752 632625 636258 640269 644156 647765 652025 658248 666401 674963 682835 690339 697775 703975
60855 703975 707260 707195 704597 700378 695186 689731 684456 678968 672393 664183 654181 642353 629087 615445
60841 615445 602509 590581 579465 569161 559770 551052 542748 535140 528680 523228 518187 513329 508969
60828 508969 505394 502483 499842 497060 494021 491262 489729 489785 490701 491385 491286 490350 488625 486503 484961 484885
60812 484885 486327 488869 492334 496522 500592 503581 505580 507697 510769 514553 518256 521395 524034 526548
60798 526548 529240 532044 534670 537156 539942 543125 546092 548365 550434 553100 556222 558834 560427 561413
60784 561413 562292 562944 562881 561696 559221 555705 551885 548405 545069 541067 535985 530175 524135 518052 512054
60769E12054n740n623o016o611o665n863m541l166k060j485j451j512j238r02
60755D59181j214k320l502l995l816l545l560l671l465k784j828q56J01J139K152
60740D28017K869L234L480L699L557K713J345Kj031j935k905l748m146m170m328
60725D26653n051o248p382p861p369o117m862m397m739n021m553l713l294l283
60711C52763k984k308j970k204k226j457m94j14l2N38J571K387K808L235L694
60696C53207L730L295L026L420M249M869M752L807K576J988K413L115L127K422
60682C99996J659J135O94N10J007J955K486K236J803J865K452L237L997M656N247
60667D34935N974O849P385P165O640O664P246P499O892N817M690L290J373o66
$$ plain form
60769 512054 506314 500691 494675 488064 481399 475536 470995 467829 465769 464284 462833 461321 460083 459181
60755 459181 457967 455647 452145 448150 444334 440789 437229 433558 430093 427309 425481 424625 424726 425865 428017
60740 428017 430886 434120 437600 441299 444856 447569 448914 448916 447885 445950 443045 439297 435151 430981 426653
60725 426653 421602 415354 407972 400111 392742 386625 381763 377366 372627 367606 363053 359340 356046 352763
60711 352763 349779 347471 345501 343297 341071 339614 339120 339006 338974 339512 341083 343470 346278 349513 353207
60696 353207 356937 360232 363258 366678 370927 375796 380548 384355 386931 388919 391332 394447 397574 399996
60682 399996 401655 402790 403484 403994 405001 406956 409442 411678 413481 415346 417798 421035 425032 429688 434935
60667 434935 440909 447758 455143 462308 468948 475612 482858 490357 497249 503066 507756 511046 512419 511753
60653E11753k187k998l381l663l931l940l346k286j551j649j929j315J96J552
60639D81325K139K349K612K735K535K312K247K042J526J052Q58N62k92j643l127
60624D99232m392m999m549l295k108j510j127l86P40J868K687L039L010L073L619
60609D94902M250M182L447K915K926K812K143J468J251R88J71p38j213j804l296
60594E14404n174o128n916n558n652n612m924m179m255m982n318m663l450k434
60580D46159j801j228o09l08o20j250j595j344o03L97J327J738J480J039J018
60565D43800J275J175O30K65M20O93N91M5r11k273l605m109l582k746k192j640
60549D27836o69L87J009J399K189L515N056O745Q780J1052J3198J5200J7309J9454
$$ plain form
60653 511753 509566 506568 503187 499524 495593 491653 488307 486021 484470 482821 480892 479577 479773 481325
60639 481325 483464 485813 488425 491160 493695 496007 498254 500296 501822 502874 503732 504294 504002 502359 499232
60624 499232 494840 489841 485292 481997 479889 478379 477252 476866 477606 479474 482161 485200 488210 491283 494902
60609 494902 499152 503334 506781 509696 512622 515434 517577 519045 520296 521284 521455 520717 519504 517700 514404
60594 514404 509230 503102 497186 491628 485976 480364 475440 471261 467006 462024 456706 452043 448593 446159
60580 446159 444358 443130 442521 442213 441593 440343 438748 437404 436801 437198 438525 440263 441743 442782 443800
60565 443800 445075 446250 446880 447145 447565 448258 448849 448894 447983 445710 442105 437996 434414 431668 429476 427836
60549 427836 427167 427554 428563 429962 432151 435666 440722 447467 456247 467299 480497 495697 513006 532460
60535E32460K1239K2790K5015K8631L3068L6620L7729L6011L2097K6632J9766
60524H52058J1653L105m675j0948j5668j8969k0805k1240k0649j9446j7804j5782
60512G00830j3572j1481r739q294o713m549j968L33K161M301P429J1021J4151
60499F83910J7024K0615K4921K8710L1085L2242L2265L0433K6367K0975J5493
60488I64040J0282N370J567J51J720N977J2415K0639L0276M1103N3190O6512Q0620
60475A293862R5006J09517J24162J38744J52852J65674J75316J78667J72475J54654
60465B760929J24735Q3769L4483j8760p0848j17080j53839j78881j91645j93363
60455B079500j86618j74497j59720j43922j27722j11617r6536q3125p0976n9506
$$ plain form
60535 532460 553699 576489 601504 630135 663203 699823 737552 773563 805660 832292 852058
60524 852058 863711 866816 862141 851193 835525 816556 795751 774511 753862 734416 716612 700830
60512 700830 687258 675777 666038 657744 651031 646482 644514 644847 647008 651309 658738 669759 683910
60499 683910 700934 721549 746470 775180 806265 838507 870772 901205 927572 948547 964040
60488 964040 974322 979692 981259 981410 983130 989107 1001522 1022161 1052437 1093540 1146730 1213242 1293862
60475 1293862 1388868 1498385 1622547 1761291 1914143 2079817 2255133 2433800 2606275 2760929
60465 2760929 2885664 2969433 3003916 2985156 2914308 2797228 2643389 2464508 2272863 2079500
60455 2079500 1892882 1718385 1558665 1414743 1287021 1175404 1078868 995743 924767 865261
60445H65261m9278m1325l5318k9747k4142j9631j6818j4582j1843r203p644o706
60433E99024n354l903l574m484n443n676n604n769o023n978n505m591l185j399
60419E32536N29K447M184N426O025O289O628P177P988R158J0473J1444J2132J3349
60405F35785J5465J7589J8671J8858J8984J9049J8215J6154J3513J1020Q887P128
60393H19318N730M370K630O70p19r95m76O9J73o8l33n26q31j329j743j890k101
60376H21949k713l276k986j894q59j67Q66K501L727L417J664n85k623m277n675
60361H09069p259r303j1157j1787j1361j1232j1777j1607r823p785p317q138q486
60348F82037p598o121m706l572l032l092k843j553K7O95O57R93J697J754J047
$$ plain form
60445 865261 815983 774658 739340 709593 685451 665820 649002 634420 622577 613374 605730 599024
60433 599024 593670 589767 586193 581709 576266 570590 564986 559217 553194 547216 541711 537120 533935 532536
60419 532536 533065 535512 539696 545122 551147 557436 564064 571241 579229 588387 598860 610304 622436 635785
60405 635785 651250 668839 687510 706368 725352 744401 762616 778770 792283 803303 812190 819318
60393 819318 825048 829418 832048 832718 831999 831004 830528 830597 830770 830702 830369 829843 829012 827683 825940 824050 821949
60376 821949 819236 815960 812974 811080 810221 810054 810920 813421 817148 820565 822229 821644 819021 814744 809069
60361 809069 801810 792507 781350 769563 758202 746970 735193 723586 713763 705978 698661 690523 682037
60348 682037 674439 668318 663612 660040 657008 653916 651073 649520 649547 650242 650899 651892 653589 655343 656390
60333F56390N09L75j87j563l126m401n473o094n627m313l349l460m231n026n507
60318F04917n228l879k149j165r66o42j02k30j073j369m88N31N69j45q45j365
60302E86371j712j569j021q41j289j518q85J05Q64J817L401M908N421N351N936
60287F05339P563R489J0940J1723J1978J2073J2498J3371J4217J4699J5108J5674
60275G54672J5963J5619J5176J5321J5697J5297J3916J2374J1385J0794J0027
60264I06241Q855P659P202Q068J0016J2083J3513J4439J5348J6422J7702J9436
60252A056984K1618K3494K4220K4050K4235K5762K8540L1830L5000L7803M0325
60241A373861M2856M5631M8594N1578N4660N8142O2235O6929P2144P7766Q3452
$$ plain form
60333 656390 656899 657274 657087 655524 652398 647997 642524 636430 630803 626490 623141 619681 615450 610424 604917
60318 604917 599689 595810 593661 592496 591530 590888 590786 590556 589483 588114 587626 588157 588726 588581 587736 586371
60302 586371 584659 583090 582069 581228 579939 578421 577536 577641 578505 580322 583723 588631 594052 599403 605339
60287 605339 612902 622391 633331 645054 657032 669105 681603 694974 709191 723890 738998 754672
60275 754672 770635 786254 801430 816751 832448 847745 861661 874035 885420 896214 906241
60264 906241 915096 922755 929957 938025 948041 960124 973637 988076 1003424 1019846 1037548 1056984
60252 1056984 1078602 1102096 1126316 1150366 1174601 1200363 1228903 1260733 1295733 1333536 1373861
60241 1373861 1416717 1462348 1510942 1562520 1617180 1675322 1737557 1804486 1876630 1954396 2037848
60230B037848Q8636R2884R6202R8792J00494J00619R8527R4346Q8791Q2197P4112
60219C053448O4159N3037M2124L2143K2619J2816K915n924j2598j7059k0318k3305
60207C204057k5808k6761k5571k2635j8444j2880n871J904R736J7882K7036L7043
60195C159688M7037N6616O6021P5167Q3324Q9780R4097R5787R4598R1051Q5788
60184D038954P8350O7666N3938L8909K3907Q557q071k6027m4699o3408q1022r5789
60172C991265j06477j13222j16598j16515j12835j06432r8539q9314p8036o4631
60162B988666n0053l5109j9709l669J2397K7336M0294N0980N9130O3996O4607
60151C198866O0687N3221M3892L3769K2798J0658k200j4603k5497l4422m1287
$$ plain form
60230 2037848 2126484 2219368 2315570 2414362 2514856 2615475 2714002 2808348 2897139 2979336 3053448
60219 3053448 3117607 3170644 3212768 3244911 3267530 3280346 3283261 3277337 3264739 3247680 3227362 3204057
60207 3204057 3178249 3151488 3125917 3103282 3084838 3071958 3066087 3067991 3077727 3095609 3122645 3159688
60195 3159688 3206725 3263341 3329362 3404529 3487853 3577633 3671730 3767517 3862115 3953166 4038954
60184 4038954 4117304 4184970 4238908 4277817 4301724 4310281 4302210 4276183 4231484 4168076 4087054 3991265
60172 3991265 3884788 3771566 3654968 3538453 3425618 3319186 3220647 3131333 3053297 2988666
60162 2988666 2938613 2903504 2883795 2880126 2892523 2919859 2960153 3011133 3070263 3134259 3198866
60151 3198866 3259553 3312774 3356666 3390435 3413233 3423891 3421691 3407088 3381591 3347169 3305882
60140C305882m5927m7961m7027m3129l6682k8163j7831o006O673J9623L2825M6627
60128C138904O1111P6119R1734J08202J25324J42529J59637J77021J94813K12376
60118D487770K28721K43013K54548K62689K67105K67739K64375K56576K44119
60109F776655K27117K05744J80242J51281J19816Q6447N1296J4675k2583n9546
60099G731144r5482j29687j61369j89740k13823k32255k43860k48520k46983k39892
60089E729533k27651k11152j91789j70453j47221j22244r6304p0248m4522j9451
60079D428498M622K7619M9418O9133Q5354R7311J05011J08082J05579R7274Q4244
60068E262145O7709M8205K6431L857j8318l9990o1105q0577r7134j10664j21825
$$ plain form
60140 3305882 3259955 3211994 3164967 3121838 3085156 3056993 3039162 3033156 3039829 3059452 3092277 3138904
60128 3138904 3200015 3276134 3367868 3476070 3601394 3743923 3903560 4080581 4275394 4487770
60118 4487770 4716491 4959504 5214052 5476741 5743846 6011585 6275960 6532536 6776655
60109 6776655 7003772 7209516 7389758 7541039 7660855 7747302 7798598 7813273 7790690 7731144
60099 7731144 7635662 7505975 7344606 7154866 6941043 6708788 6464928 6216408 5969425 5729533
60089 5729533 5501882 5290730 5098941 4928488 4781267 4659023 4562719 4492471 4447949 4428498
60079 4428498 4433120 4460739 4510157 4579290 4664644 4761955 4866966 4975048 5080627 5177901 5262145
60068 5262145 5329854 5378059 5404490 5408347 5390029 5350039 5288934 5208357 5111223 5000559 4878734
60057D878734j30851j37534j41855j43603j41882j36051j26961j16221j04414
60048C699362r0955p5774o0147m5589l2536k0443q605L368J5623K8314M1728N5967
60036C510313P0386Q3651R4619J02928J08434J10412J07794J00124Q7950P2441
60026D449052N4824L5967J6072n038k7091m8966o9269q7069j01907j13459j21583
60015C981533j26320j27530j24824j18279j08926r8091q6391p3697n9952m5612
60005C011911l1408j7778m465R387K4501M0740N7320P3804R0434J07478J24553
59994C486477J40661J54450J64447J69649J70023J65909J57013J42743J23692
59985D875064J01771P8606N4449K9046K679k4162n1238p7940j02775j24041j40581
$$ plain form
60057 4878734 4747883 4610349 4468494 4324891 4183009 4046958 3919997 3803776 3699362
60048 3699362 3608407 3532633 3472486 3426897 3394361 3373918 3365313 3368681 3384304 3412618 3454346 3510313
60036 3510313 3580699 3664350 3758969 3861897 3970331 4080743 4188537 4288661 4376611 4449052
60026 4449052 4503876 4539843 4555915 4550877 4523786 4474820 4405551 4318482 4216575 4103116 3981533
60015 3981533 3855213 3727683 3602859 3484580 3375654 3277563 3191172 3117475 3057523 3011911
60005 3011911 2980503 2962725 2958260 2967647 2992148 3032888 3090208 3164012 3254446 3361924 3486477
59994 3486477 3627138 3781588 3946035 4115684 4285707 4451616 4608629 4751372 4875064
59985 4875064 4976835 5055441 5109890 5138936 5141615 5117453 5066215 4988275 4885500 4761459 4620878
59974D620878j51517j55991j53806j45868j33500j17865j00288q2250o4488m6845
59964C468460k9452j3178J645J5874L0072M3523N5568O6873P8006Q7785R4459
59953C899635R7900R9091R8053R3993Q7206P9056O9996N9255M6708L3539K0634
59942D685066P664n529j7700k7152l3144l5752l4922l0365k1983r977N299K3314
59930D504819M3428O5115Q8020J11932J36921J63241J90642K18074K44592K70153
59920F036937K94775L17021L34239L44137L45328L36338L15272K81022K34235
59911H839304J76915J11769M2262k7462r3380j52238k01302k38209k61716k72451
59901G923492k72403k63480k46699k22721j92879j59412j24569q9836n6364k5972
$$ plain form
59974 4620878 4469361 4313370 4159564 4013696 3880196 3762331 3662043 3579793 3515305 3468460
59964 3468460 3439008 3425830 3427475 3443349 3473421 3516944 3572512 3639385 3717391 3805176 3899635
59953 3899635 3997535 4096626 4194679 4288672 4375878 4454934 4524930 4584185 4630893 4664432 4685066
59942 4685066 4692730 4687201 4669501 4642349 4609205 4573453 4538531 4508166 4486183 4476206 4481505 4504819
59930 4504819 4548247 4613362 4701382 4813314 4950235 5113476 5304118 5522192 5766784 6036937
59920 6036937 6331712 6648733 6982972 7327109 7672437 8008775 8324047 8605069 8839304
59911 8839304 9016219 9127988 9170250 9142788 9049408 8897170 8695868 8457659 8195943 7923492
59901 7923492 7651089 7387609 7140910 6918189 6725310 6565898 6441329 6351493 6295129 6269157
59891F269157r47J7366K9389L6669M1173M5406N2069O2569P6105R0775J05025
59880F824756J17405J25667J27373J21279J07313Q5548N6303K1217j6854n5321
59870G514686r2584j27189j57056j80025j94815k01425k00797j94077j81932j64787
59860E819999j43784j20814r7094p2480m7086k2925k757J2292K2713K8375K7862
59849E404301K0432P511q294k4816m0613n4510o5788p4541q1316q6423q9686r0746
59837D815511q9628q7145q4566q2552q0737p8671p6655p5075p3398p0731o7003
59826C949350o2650n7441n0837m3496l7324l3742l2680l3323l4801l6028l5929
59815C491099l4321l1763k8254k2852j4923m884O735K0190L5971N4054P4232R6705
$$ plain form
59891 6269157 6268210 6285576 6314965 6351634 6392807 6438213 6490282 6552851 6628956 6719731 6824756
59880 6824756 6942161 7067828 7195201 7316480 7423793 7509341 7565644 7586861 7570007 7514686
59870 7514686 7422102 7294913 7137857 6957832 6763017 6561592 6360795 6166718 5984786 5819999
59860 5819999 5676215 5555401 5458307 5385827 5338741 5315816 5313059 5325351 5348064 5376439 5404301
59849 5404301 5424733 5432244 5423950 5399134 5358521 5304011 5238223 5163682 5082366 4995943 4906257 4815511
59837 4815511 4725883 4638738 4554172 4471620 4390883 4312212 4235557 4160482 4087084 4016353 3949350
59826 3949350 3886700 3829259 3778422 3734926 3697602 3663860 3631180 3597857 3563056 3527028 3491099
59815 3491099 3456778 3425015 3396761 3373909 3358986 3354102 3360837 3381027 3416998 3471052 3545284 3641989
59803C641989J21808J49562J79889K12691K47098K80598L09025L26967L28177
59794E797804L06713K59199J87053R7231Q70q9745j64779k19135k52148k65772
59784E657291k63434k49734k29545k06338j81639j56213j31278j08306q8210p1079
59774C971515n6489m3807l2443k1982j2045k297P141J5586K2723K9453L7100M5848
59762C960303N4693O2965P1109P9812Q9108R8699J08565J18972J30232J42729
59752D917187J56834J72720J90451K10211K32067K55643K80376L05945L31806
59743G053240L56520L78095L94830M05143M06927L98127L78220L48483L11055
59734A0430640K68619K25017J85025J52868J31221J21415J23686J36988J59456
$$ plain form
59803 3641989 3763797 3913359 4093248 4305939 4553037 4833635 5142660 5469627 5797804
59794 5797804 6104517 6363716 6550769 6648000 6648870 6559125 6394346 6175211 5923063 5657291
59784 5657291 5393857 5144123 4914578 4708240 4526601 4370388 4239110 4130804 4042594 3971515
59774 3971515 3915026 3871219 3838776 3816794 3804749 3802452 3809593 3825179 3847902 3877355 3914455 3960303
59762 3960303 4014996 4077961 4149070 4228882 4317990 4416689 4525254 4644226 4774458 4917187
59752 4917187 5074021 5246741 5437192 5647403 5879470 6135113 6415489 6721434 7053240
59743 7053240 7409760 7787855 8182685 8587828 8994755 9392882 9771102 10119585 10430640
59734 10430640 10699259 10924276 11109301 11262169 11393390 11514805 11638491 11775479 11934935
59725A1934935J89409K25371K65173L05715L43769L76462M01236M16289M21138
59716A4879497M15923M00230L73644L37386K94262K46774J96521J45602R7114
59707A7386953N3633J6330j3711l4445m3919m1470k7113o66L7668Q6544J44075
59696A7563879K08724K78920L52490M27200N01353N73103O39468O96417P39502
59687B1981056P63997P65150P39012O83015N96036M79146L37123J78588J3832
59678B6536955j47425k96574m26244n31531o11207o67569p05805p33705p60263
59669B1656632p92217q30968q72544r10020r35945r44254r32111r00865q55073
59660A3682635q00494p42671o86121o33676n86348n44043n06182m71790m39893
$$ plain form
59725 11934935 12124344 12349715 12614888 12920603 13264372 13640834 14042070 14458359 14879497
59716 14879497 15295420 15695650 16069294 16406680 16700942 16947716 17144237 17289839 17386953
59707 17386953 17440586 17456916 17443205 17408760 17364841 17323371 17296258 17295592 17333260 17419804 17563879
59696 17563879 17772603 18051523 18404013 18831213 19332566 19905669 20545137 21241554 21981056
59687 21981056 22745053 23510203 24249215 24932230 25528266 26007412 26344535 26523123 26536955
59678 26536955 26389530 26092956 25666712 25135181 24523974 23856405 23150600 22416895 21656632
59669 21656632 20864415 20033447 19160903 18250883 17314938 16370684 15438573 14537708 13682635
59660 13682635 12882141 12139470 11453349 10819673 10233325 9689282 9183100 8711310 8271417
59651H271417m10272l83212l58237l33932l09486k85440k62390k39978k17918
59642E470552j96924j77553j59028j40424j22348j06088r1655p8022o5064n3812
59632D279634m4812l7404l0895k5452k1666j9944k0425k2825k6257k9965l4165
59621C965824l9611m6314n3391o0037o5850p0275p2636p2865p1426o8420o3602
59610C281397n7492n1513m6480m1716l6317l0691k5999k2363j8527j3427p457
59599B929415j796L025P403J1763J5962J9694K2860K5285K6488K6277K5263K4329
59587C135968K3694K3073K2586K2919K4642K7981L3112L9975M7778N5516O3193
59576C520437P1698Q1228R0818R9855J09155J19747J31300J42586J53065J63124
$$ plain form
59651 8271417 7861145 7477933 7119696 6785764 6476278 6190838 5928448 5688470 5470552
59642 5470552 5273628 5096075 4937047 4796623 4674275 4568187 4476532 4398510 4333446 4279634
59632 4279634 4234822 4197418 4166523 4141071 4119405 4099461 4079036 4056211 4029954 3999989 3965824
59621 3965824 3926213 3879899 3826508 3766471 3700621 3630346 3557710 3484845 3413419 3344999 3281397
59610 3281397 3223905 3172392 3125912 3084196 3047879 3017188 2991189 2968826 2950299 2936872 2929415
59599 2929415 2927619 2930644 2938047 2949810 2965772 2985466 3008326 3033611 3060099 3086376 3111639 3135968
59587 3135968 3159662 3182735 3205321 3228240 3252882 3280863 3313975 3353950 3401728 3457244 3520437
59576 3520437 3592135 3673363 3764181 3864036 3973191 4092938 4224238 4366824 4519889 4683013
59566D683013J73031J82434J90822J97771K02657K04743K03709J99808J93316
59557F431304J84015J71401J55518J37311J17694R6006P0017L8225K026l4946
59547G368571o9247r8713j21813j37569j46409j49783j48343j41517j29121j12087
59537F113969r0954o4958l3622J716L9041P7440J16659J55513J91868K23596K48554
59526F978822K64108K67857K58754K36685K01613J54197R7004L3872l1932r8057
59516H362923j61726k19297k67477l04318l28934l41106l41656l32631l16652
59507E749126k95996k72193k46146k18568j90398j62733j36296j11164q7059o3678
59497C964895m0766j8392K766K2120M0263N8572P7417R5608J12151J27603J42838
$$ plain form
59566 4683013 4856044 5038478 5229300 5427071 5629728 5834471 6038180 6237988 6431304
59557 6431304 6615319 6786720 6942238 7079549 7197243 7293249 7363266 7401491 7403517 7368571
59547 7368571 7299324 7200611 7078798 6941229 6794820 6645037 6496694 6355177 6226056 6113969
59537 6113969 6023015 5958057 5924435 5926151 5965192 6042632 6159291 6314804 6506672 6730268 6978822
59526 6978822 7242930 7510787 7769541 8006226 8207839 8362036 8459040 8492912 8460980 8362923
59516 8362923 8201197 7981900 7714423 7410105 7081171 6740065 6398409 6065778 5749126
59507 5749126 5453130 5180937 4934791 4716223 4525825 4363092 4226796 4115632 4028573 3964895
59497 3964895 3924129 3905737 3908503 3930623 3970886 4029458 4106875 4202483 4314634 4442237 4585075
59486D585075J57162J68637J75833J78247J75314J66005J49584J26157R6536O1997
59476F040547K4105j5582n5563r4014j28902j58828j83448k02709k16181k23546
59466D785879k25251k22315k15882k07206j97396j86698j74700j61707j49083
59457C045641j37704j26914j15768j04550r4146q4608p5322o6194n7690n0078
59447B132667m3301l7278l1671k5854j9744j4116r489n374j340K068M378O351
59435A957297Q896J1514J3188J4356J6658K0746K5380K8619K9039K6129K0599
59424B172421J4449R903Q190R554J3893K0639K8595L6762M4834N2227N7384N9151
59412B528002N8343N6921N6119N6431N8679O3614P0730P8791Q7357R6739J06843
$$ plain form
59486 4585075 4742237 4910874 5086707 5264954 5440268 5606273 5755857 5882014 5978550 6040547
59476 6040547 6064652 6049070 5993507 5899493 5770591 5611763 5428315 5225606 5009425 4785879
59466 4785879 4560628 4338313 4122431 3915225 3717829 3531131 3356431 3194724 3045641
59457 3045641 2907937 2781023 2665255 2560705 2466559 2381951 2306629 2240435 2182745 2132667
59447 2132667 2089366 2052088 2020417 1994563 1974819 1960703 1951214 1945840 1944500 1946568 1950946 1957297
59435 1957297 1966193 1977707 1990895 2005251 2021909 2042655 2068035 2096654 2125693 2151822 2172421
59424 2172421 2186870 2196773 2204963 2214517 2228410 2249049 2277644 2314406 2359240 2411467 2468851 2528002
59412 2528002 2586345 2643266 2699385 2755816 2814495 2878109 2948839 3027630 3114987 3211726 3318569
59401C318569J17383J28986J42705J58552J75700J93913K13593K34535K55976
59392D939912K77834L00774L25178L51200L79592M10954M43988M75641N02901
59383H407974N23379N34482N33878N21182M98070M66543M28358L86269L44105
59374A2644240L04875K69575K38022K09655J83081J55987J26126R1642N0332k24
59364A4273311o1066j30956k07248k86780l65709m39350n02912n52312n84768
59355A1142210n99651n98913n85787n62924n32155m95574m55624m14184l72636
59346F524762l32719k96205k63729k35056k10365j90063j73420j58746j45122
59337D519337j32645j21040j09473r8009q7758p9169p1555o4696n9467n6258n4159
$$ plain form
59401 3318569 3435952 3564938 3707643 3866195 4041895 4235808 4449401 4683936 4939912
59392 4939912 5217746 5518520 5843698 6194898 6574490 6985444 7429432 7905073 8407974
59383 8407974 8931353 9465835 9999713 10520895 11018965 11485508 11913866 12300135 12644240
59374 12644240 12949115 13218690 13456712 13666367 13849448 14005435 14131561 14223203 14273535 14273311
59364 14273311 14212245 14081289 13874041 13587261 13221552 12782202 12279290 11726978 11142210
59355 11142210 10542559 9943646 9357859 8794935 8262780 7767206 7311582 6897398 6524762
59346 6524762 6192043 5895838 5632109 5397053 5186688 4996625 4823205 4664459 4519337
59337 4519337 4386692 4265652 4156179 4058170 3970412 3891243 3819688 3754992 3695525 3639267 3585108
59326C585108n2422n1515n1969n3144n4023n4314n4093n3040n0748m7263m2863
59315C019714l7877l2848k8189k3554j8332j2797p708k792L161J0462J8111K5545
59303B912896L3476M2396N1585O0267O8711P7434Q6307R5143J04324J13981J23097
59292C769617J29689J31302J25315J10157Q6890N8820K9160k19k7881n2302p2947
59281D287601r0599j05845j18069j26464j30985j31816j29010j23239j15858j07638
59271C108078r8350q8113p7932o8537n9799n1889m5572m0696l5833l0261k5009
59260B486087k0917j7027j2046o231n51N033J1124J7548K3757K9892L6371M2986
59248B596026M9406N6062O3629P2256Q2035R3552J07197J22615J39597J58734
$$ plain form
59326 3585108 3532686 3481171 3429202 3376058 3322035 3267721 3213628 3160588 3109840 3062577 3019714
59315 3019714 2981837 2948989 2920800 2897246 2878914 2866117 2858409 2855617 2858778 2869240 2887351 2912896
59303 2912896 2946372 2988768 3040353 3100620 3169331 3246765 3333072 3428215 3532539 3646520 3769617
59292 3769617 3899306 4030608 4155923 4266080 4352970 4411790 4440950 4440731 4412850 4360548 4287601
59281 4287601 4197002 4091157 3973088 3846624 3715639 3583823 3454813 3331574 3215716 3108078
59271 3108078 3009728 2921615 2843683 2775146 2715347 2663458 2617886 2577190 2541357 2511096 2486087
59260 2486087 2465170 2448143 2436097 2429866 2429315 2434348 2445472 2463020 2486777 2516669 2553040 2596026
59248 2596026 2645432 2701494 2765123 2837379 2919414 3012966 3120163 3242778 3382375 3541109
59238C541109J80437K04204K29567K56788K85737L15080L43470L70419L94827
59229F121638M13622M23150M21192M06516L77559L33166K74256K03436J23493
59220I098028L7363n1007j37115k16937k86666l42411l81735m05144m14797m12184
59210F487395l98337l75684l47942l18034k87260k56405k26414j98009j71748
59201C907562j48481j28782j12009r6868q2840p0256n9141m8922l9189k9851k0677
59190C070546j1468k673M863J0462J3470J3104R276L138m007j1816k0016k7268
59178C047611l2140l4759l6222l6774l5915l3973l2003l0270k8181k5795k4093
59167B697486k3537k3535k3538k3561k3606k3647k4292k6193k8535k9395k7913
$$ plain form
59238 3541109 3721546 3925750 4155317 4412105 4697842 5012922 5356392 5726811 6121638
59229 6121638 6535260 6958410 7379602 7786118 8163677 8496843 8771099 8974535 9098028
59220 9098028 9135391 9084384 8947269 8730332 8443666 8101255 7719520 7314376 6899579 6487395
59210 6487395 6089058 5713374 5365432 5047398 4760138 4503733 4277319 4079310 3907562
59201 3907562 3759081 3630299 3518290 3421422 3338582 3268326 3209185 3160263 3121074 3091223 3070546
59190 3070546 3059078 3056405 3061268 3071730 3085200 3098304 3107580 3110718 3106711 3094895 3074879 3047611
59178 3047611 3015471 2980712 2944490 2907716 2871801 2837828 2805825 2775555 2747374 2721579 2697486
59167 2697486 2673949 2650414 2626876 2603315 2579709 2556062 2531770 2505577 2477042 2447647 2419734
59156B419734k5032k1690j7527j2024n843k25M306P861J0385J1768J2432J3210
59144B397355J4596J6365J7884J8593J8298J6999J4486J0412N071l53m867q594
59132B516245j1976j4419j4717j2613q990m433J345Q398J5865K2815K9064L4633
59120B561217L9042M1711M2706M2696M2481M2775M4011M5979M7912M9268N0183
59109C049981N1038N1877N2527N2970N3339N3713N4227N5248N7227O0328O4268
59098C656743O8464P2292P5246P6865P6448P3076O6086N5423M1339K3991L691
59087D289664j8468m0666o1237p9323r4607j06778j15558j21057j23777j24162
59077C404031j22427j18880j14022j08037j00497r1059q0279o9182n8061m6472
$$ plain form
59156 2419734 2394702 2373012 2355485 2343461 2337618 2337393 2341699 2349560 2359945 2371713 2384145 2397355
59144 2397355 2411951 2428316 2446200 2464793 2483091 2500090 2514576 2524988 2530059 2529706 2524839 2516245
59132 2516245 2504269 2489850 2475133 2462520 2453530 2449097 2450442 2458840 2474705 2497520 2526584 2561217
59120 2561217 2600259 2641970 2684676 2727372 2769853 2812628 2856639 2902618 2950530 2999798 3049981
59109 3049981 3101019 3152896 3205423 3258393 3311732 3365445 3419672 3474920 3532147 3592475 3656743
59098 3656743 3725207 3797499 3872745 3949610 4026058 4099134 4165220 4220643 4261982 4285973 4289664
59087 4289664 4271196 4230530 4169293 4089970 3995363 3888585 3773027 3651970 3528193 3404031
59077 3404031 3281604 3162724 3048702 2940665 2840168 2749109 2668830 2599648 2541587 2495115
59067B495115l4496k3039j2567k738N891J0835R675K550q397k1337l5070m7634
59055B338788n6633o1316o2837o2095n8695n2431m4347l5632k6606j7396q604
59044A852196p53N968J0957J3235J2784J0801Q142M646M35l306n672p039q000
59031A894394q355p829o708m937j748L012Q207J2958J7726K3025K8161L2381L6131
59018B026418M0032M3617M6207M8116M9763N0528M9687M7645M4955M0907L4413
59007B522288K5552J5042L031j0177k2834l2693l8895m1862m1947l9488l5552
58996B302465l1318k7032k2711j9263j7702j7745j8417j9519k1257k3005k3728
58985B060768k3160k1387j7869j2272n693L06N415J0070J3810J5685J5825J5120
$$ plain form
59067 2495115 2460619 2437580 2425013 2422275 2428166 2439001 2448676 2451226 2442829 2421492 2386422 2338788
59055 2338788 2282155 2220839 2158002 2095907 2037212 1984781 1940434 1904802 1878196 1860800 1852196
59044 1852196 1851443 1857411 1868368 1881603 1894387 1905188 1913330 1917976 1918411 1915105 1909433 1902394 1894394
59031 1894394 1886039 1878210 1871502 1866565 1864817 1867829 1876036 1888994 1906720 1929745 1957906 1990287 2026418
59018 2026418 2066450 2110067 2156274 2204390 2254153 2304681 2354368 2402013 2446968 2487875 2522288
59007 2522288 2547840 2562882 2565913 2555736 2532902 2500209 2461314 2419452 2377505 2338017 2302465
58996 2302465 2271147 2244115 2221404 2202141 2184439 2166694 2148277 2128758 2107501 2084496 2060768
58985 2060768 2037608 2016221 1998352 1986080 1980387 1980693 1986108 1996178 2009988 2025673 2041498 2056618
58973B056618J3757J1566R399Q526Q875R363R804J0984J3059J5392J7825K0557
58961B205725K2786K3041K1074J8095J5127J2396J0344R875J1385J4560J9135
58950B383543K4880L1089L7119M3085M8869N2941N3540N0701M5683L8999L0736
58939B841185K2510J6947J5048J5732J8171K2790K9730L8089M7320N7876O9894
58928C195292Q2452R4709J06773J18996J31440J44221J57515J71072J84639J98870
58918D585979K14706K31936K49384K66229K81956K95395L05426L12642L18853
58909G062506L25099L31718L40156L52608L69358L88077M06174M22298M35077
58900A0433071M42069M40893M30289M09491L77497L33443K76899K07795J27132
$$ plain form
58973 2056618 2070375 2081941 2091340 2099866 2108741 2118104 2127908 2138892 2151951 2167343 2185168 2205725
58961 2205725 2228511 2251552 2272626 2290721 2305848 2318244 2328588 2338463 2349848 2364408 2383543
58950 2383543 2408423 2439512 2476631 2519716 2568585 2621526 2675066 2725767 2771450 2810449 2841185
58939 2841185 2863695 2880642 2895690 2911422 2929593 2952383 2982113 3020202 3067522 3125398 3195292
58928 3195292 3277744 3372453 3479226 3598222 3729662 3873883 4031398 4202470 4387109 4585979
58918 4585979 4800685 5032621 5282005 5548234 5830190 6125585 6431011 6743653 7062506
58909 7062506 7387605 7719323 8059479 8412087 8781445 9169522 9575696 9997994 10433071
58900 10433071 10875140 11316033 11746322 12155813 12533310 12866753 13143652 13351447 13478579
58891A3478579L7928n5420j48630k37438l16871l82700m33765m71404m96703n10090
58881A0463486n13357n09556n00296m85177m64548m40794m16089l90748l64739
58872F378182l39026l14361k90376k66947k45041k25161k06360j87880j70471
58863D132559j55027j41014j27447j14344j02335r1647q2292p4271o6901n9020
58853C118261n0536m2821l6803l1785k6681k1357j6111j0925n924j490K709P631
58841B884168J3354J8835K3794K9378L6333M3993N1872O0680P0737Q0771Q9519
58830C403434R7280J04770J11672J17547J23070J29071J35367J41847J49751J60521
58820D674330J74074J89439K06380K25200K45670K67435K90865L16269L42653
$$ plain form
58891 13478579 13516507 13461087 13312457 13075019 12758148 12375448 11941683 11470279 10973576 10463486
58881 10463486 9950129 9440573 8940277 8455100 7990552 7549758 7133669 6742921 6378182
58872 6378182 6039156 5724795 5434419 5167472 4922431 4697270 4490910 4303030 4132559
58863 4132559 3977532 3836518 3709071 3594727 3492392 3400745 3318453 3244182 3177281 3118261
58853 3118261 3067725 3024904 2988101 2956316 2929635 2908278 2892167 2881242 2875318 2873828 2876537 2884168
58841 2884168 2897522 2916357 2940151 2969529 3005862 3049855 3101727 3162407 3233144 3313915 3403434
58830 3403434 3500714 3605484 3717156 3834703 3957773 4086844 4222211 4364058 4513809 4674330
58820 4674330 4848404 5037843 5244223 5469423 5715093 5982528 6273393 6589662 6932315
58811F932315L68406L92927M16443M38447M57197M70492M76163M72027M56284
58802A0880701M28022L86983L33202K67398J91531J08538K1667o5711j50092k27978
58792A2174261k96123l51916l94178m23468m40895m46818m41304m25660m02409
58783H551490l74197l44073l16653k97082k87952k88054k94063l02003l07236
58774E740177l05393k94920k77843k57354k35501k13364j91853j71287j51287
58765C641375j31759j13158r5404p7777o0182m3249k6808r845P663K4586M0800
58754C156242N7532P4542Q8763R6848R7454R0016P3360M7332J4586k0901n5997
58743C719777q7885j13074j29058j36335j37220j33267j25161j14292j02680r1586
$$ plain form
58811 6932315 7300721 7693648 8110091 8548538 9005735 9476227 9952390 10424417 10880701
58802 10880701 11308723 11695706 12028908 12296306 12487837 12596375 12618042 12552331 12402239 12174261
58792 12174261 11878138 11526222 11132044 10708576 10267681 9820863 9379559 8953899 8551490
58783 8551490 8177293 7833220 7516567 7219485 6931533 6643479 6349416 6047413 5740177
58774 5740177 5434784 5139864 4862021 4604667 4369166 4155802 3963949 3792662 3641375
58765 3641375 3509616 3396458 3301054 3223277 3163095 3119846 3093038 3083193 3090856 3115442 3156242
58754 3156242 3213774 3288316 3377079 3473927 3571381 3661397 3734757 3782089 3796675 3775774 3719777
58743 3719777 3631892 3518818 3389760 3253425 3116205 2982938 2857777 2743485 2640805 2549219
58733B549219q1497p3142o7405o4363o3177o2695o1788n9794n7140n4718n2212
58722A851288m8103m1706l4123k6629j9572j3540j0001r701j1767j5403k0989
58711A599754k8256l4926l8681l9374l7908l4319k8657k2566j8072j5437j3841
58700A287717j3429j4948j7863k0483k1811k1934k0920j8522j4855j0354n252
58689A107346K31N756J1529J8297K5833L2369L6588L9389M2537M6330M9698N2005
58677A467908N3648N5307N7515O0689O4915P0050P5981Q1536Q2864P4670N4293
58666B199376K3847j2024m8770q1740j05917j18359j20214j14919j05164r2709
58656A423407p9645o7825n7604m8468m0311l3074k6124j9164j2943q014l878l24
$$ plain form
58733 2549219 2467722 2394580 2327175 2262812 2199635 2136940 2075152 2015358 1958218 1903500 1851288
58722 1851288 1803185 1761479 1727356 1700727 1681155 1667615 1657614 1647913 1636146 1620743 1599754
58711 1599754 1571498 1536572 1497891 1458517 1420609 1386290 1357633 1335067 1316995 1301558 1287717
58700 1287717 1274288 1259340 1241477 1220994 1199183 1177249 1156329 1137807 1122952 1112598 1107346
58689 1107346 1107577 1113333 1124862 1143159 1168992 1201361 1237949 1277338 1319875 1366205 1415903 1467908
58677 1467908 1521556 1576863 1634378 1695067 1759982 1830032 1906013 1987549 2070413 2145083 2199376
58666 2199376 2223223 2211199 2162429 2080689 1974772 1856413 1736199 1621280 1516116 1423407
58656 1423407 1343762 1275937 1218333 1169865 1129554 1096480 1070356 1051192 1038249 1030235 1026357 1026033
58644A026033J801K287K628L877M943M616L924M555O232P635Q937J1309J4609
58631A103386J7594J9958K2416K5201K8039L1122L4737L8516M2362M7256N3776
58620A464363O0755O6984P3259Q1071R0226R9526J08983J19328J29998J39522
58610B434015J47413J53910J58109J58123J52884J42440J26818J06030Q0881N2648
58600C713271K2443q083l6241n9815p8388r2178j00533j02948j00425r4439q5475
58589B977189p3942o1450m9724l9202k9949k2529j6494r482L88J2549K6056M1910
58577B755320O1085Q1568R9532J12136J17122J11239R2102O0914K1156k4242p1917
58566C416015j15749j49000j68838j76558j74072j62832j45582j26058j06688
$$ plain form
58644 1026033 1027834 1030121 1032749 1036626 1041569 1046185 1050109 1054664 1060896 1068531 1077468 1088777 1103386
58631 1103386 1120980 1140938 1163354 1188555 1216594 1247716 1282453 1320969 1363331 1410587 1464363
58620 1464363 1525118 1592102 1665361 1746432 1836658 1936184 2045167 2164495 2294493 2434015
58610 2434015 2581428 2735338 2893447 3051570 3204454 3346894 3473712 3579742 3660623 3713271
58600 3713271 3735714 3727631 3691390 3631575 3553187 3461009 3360476 3257528 3157103 3062664 2977189
58589 2977189 2903247 2841797 2792073 2752871 2722922 2700393 2683899 2674417 2674805 2687354 2713410 2755320
58577 2755320 2816405 2897973 2997505 3109641 3226763 3338002 3430104 3491018 3512174 3487932 3416015
58566 3416015 3300266 3151266 2982428 2805870 2631798 2468966 2323384 2197326 2090638
58557B090638q8652p3805o4227o0004n9524o1525o4917o7442o7125o4534o1384
58546A357499n7606n2203m6195m1644l8290l4108k9000k4920k2442k0188j7810
58535I73093j6553j6456j5798j3982j2439j1916j1127q823n395j845J167L094
58523H63020L997N318Q458J2669J6065J8383K0906K4039K6999K9573L2087L4021
58511A095535L4701L4931L5955L7448L8708M0921M5744N2463N9254O6394P4997
58500A617051Q3265Q7338Q5867Q0461P1913N9419M3713K7395J1421n592k3991
58489B138260m1942n8184p2919q5307r3099r5637r4642r1339q5446p7514o9486
58478A272745o2172n4714m7223m1279l7164l3299k9073k5677k3505k1346j8932
$$ plain form
58557 2090638 2001986 1928181 1863954 1803950 1744426 1682901 1617984 1550542 1483417 1418883 1357499
58546 1357499 1299893 1247690 1201495 1159851 1121561 1087453 1058453 1033533 1011091 990903 973093
58535 973093 956540 940084 924286 910304 897865 885949 874822 865999 860604 858759 859926 863020
58523 863020 867017 872335 880793 893462 909527 927910 948816 972855 999854 1029427 1061514 1095535
58511 1095535 1130236 1165167 1201122 1238570 1277278 1318199 1363943 1416406 1475660 1542054 1617051
58500 1617051 1700316 1787654 1873521 1953982 2025895 2085314 2129027 2156422 2167843 2162251 2138260
58489 2138260 2096318 2038134 1965215 1879908 1786809 1691172 1596530 1505191 1419745 1342231 1272745
58478 1272745 1210573 1155859 1108636 1067357 1030193 996894 967821 942144 918639 897293 878361
58467H78361j7615j7752j7884j7233j6607j6190j4944j2696j0477q327n370k261
58455G21005p05j75J803N496Q311R061R694J1665J3659J4169J3504J1969Q873
58442H28329M656J428Rj175l135m734n102n181n655n719m956m174l455j763P29
58427G90102K462L378N269Q453J0902J1678J2373J3975J5101J4568J3059J1033
58415I12353P607K821j519m474p035r582j0916j0808j0836j1597j1724j0761j0158
58402H23371j0377r832p984o555o341n684l585j519o95j11J135K194K616L638
58388G80271N924Q296R965J1659J3494J4208J3599J3191J3453J2857J0561P539
58376I15017M451J166j169p47J572K961L235N104R047J1986J2361J2479J4121
$$ plain form
58467 878361 860746 842994 825110 807877 791270 775080 760136 747440 736963 728636 723266 721005
58455 721005 720300 720125 721928 727424 735735 744796 754490 766155 779814 793983 807487 819456 828329
58442 828329 832985 834413 834422 833247 830112 825378 820276 815095 809440 803721 798765 794591 791136 789373 790102
58427 790102 792564 795942 801211 809664 820566 832244 844617 858592 873693 888261 901320 912353
58415 912353 919960 922781 921262 916788 909753 900171 889255 878447 867611 856014 844290 833529 823371
58402 823371 812994 803162 795178 788623 782282 776598 773013 771494 770799 770688 771823 774017 776633 780271
58388 780271 786195 794491 804456 816115 829609 843817 857416 870607 884060 896917 907478 915017
58376 915017 919468 920634 919465 918718 920290 923251 926486 931590 940637 952623 964984 977463 991584
58363I91584J5668J5503J4681J4127J2546R100N215J980j231m158m946l485k166
58350A064418j929j012J172K664K893M050O943R405J0471J2153J5301J7791J8719
58337A163039K0220K3131K5024K4686K4452K5870K7176K7170K7406K8278K7201
58326A443653K3067J8374J4661J0173M252m51k562m201o231o069k787N35K231
58313A494645M819R502J3112J3755J4322J6949J9046J8581J8197K0352K3088K4518
58301A690886K6712L1343L6233M0002M5239N3320O1202O7326P5441Q8293J02842
58290B318839J16076J30137J46862J62549J73031J78911J80720J74117J55261
58281C736503J26458R1724N1803Q454l1625o2731q5485j01682j09225j07083r9610
$$ plain form
58363 991584 1007252 1022755 1037436 1051563 1064109 1073209 1078424 1080404 1079173 1075015 1070069 1066584 1064418
58350 1064418 1062489 1061477 1062649 1065313 1068206 1072256 1079199 1088604 1099075 1111228 1126529 1144320 1163039
58337 1163039 1183259 1206390 1231414 1256100 1280552 1306422 1333598 1360768 1388174 1416452 1443653
58326 1443653 1466720 1485094 1499755 1509928 1514180 1513729 1511167 1506966 1500735 1494666 1491879 1492414 1494645
58313 1494645 1499464 1508966 1522078 1535833 1550155 1567104 1586150 1604731 1622928 1643280 1666368 1690886
58301 1690886 1717598 1748941 1785174 1825176 1870415 1923735 1984937 2052263 2127704 2215997 2318839
58290 2318839 2434915 2565052 2711914 2874463 3047494 3226405 3407125 3581242 3736503
58281 3736503 3862961 3954685 4006488 4014942 3983317 3920586 3835101 3733419 3624194 3517111 3417501
58270C417501r0527p8052o1116m4437l1753k0086o524N493J2854J9334K8852L8345
58258C189884M4079M8963N6614O4242O8422P1891P7626Q2485Q3776Q5587R1400
58247C964969R7221R9454J02297J09649J17350J21649J27278J38343J49478J55479
58237E183167J61362J72834J85359J93242K00975K14404K29262K40106K51981
58228G032692K70992K92108L09011L26975L52860L81648M06813M34371M72127
58219A0279597N14929N55849O01460O59813P24331P87053Q56341R42998J041113
58210A6963484J142872J259406J405173J575390J763048J984075K259805K590194
58202C0943447K974046L439954M025260M742952N607541O675408Q017227R672626
$$ plain form
58270 3417501 3326974 3248922 3187806 3143369 3111616 3091530 3085006 3090499 3103353 3122687 3151539 3189884
58258 3189884 3233963 3282926 3339540 3403782 3472204 3544095 3621721 3704206 3787982 3873569 3964969
58247 3964969 4062190 4161644 4263941 4373590 4490940 4612589 4739867 4878210 5027688 5183167
58237 5183167 5344529 5517363 5702722 5895964 6096939 6311343 6540605 6780711 7032692
58228 7032692 7303684 7595792 7904803 8231778 8584638 8966286 9373099 9807470 10279597
58219 10279597 10794526 11350375 11951835 12611648 13335979 14123032 14979373 15922371 16963484
58210 16963484 18106356 19365762 20770935 22346325 24109373 26093448 28353253 30943447
58202 30943447 33917493 37357447 41382707 46125659 51733200 58408608 66425835 76098461
58194G6098461J1684505J4155122J7205357K0905924K5321586L0532467L6334685
58187B32238107M1725416M4781290M3339879L6118604K3490593P482208q896683
58180D20279414k2652043l1761734l5687169l5217512l1858061k7225886k2695625
58173B13181384j9206797j7135037j6299557j6160987j6102002j5654326j4628833
58166I7993845j3130489j1432850r783466q298811p004008n904538m992834m233535
58158C3213314l589449l049649k610096k247101j933977j666490j449036j270790
58150A5396726j116472r86790q87480q09712p40114o79304o32616n92643n48273
58141H403322n02148m62790m27571l88999l50194l18922k92885k64938k36842
$$ plain form
58194 76098461 87782966 101938088 119143445 140049369 165370955 195903422 232238107
58187 232238107 273963523 318744813 362084692 398203296 421693889 429176097 420279414
58180 420279414 397627371 365865637 330178468 294960956 263102895 235877009 213181384
58173 213181384 193974587 176839550 160539993 144379006 128277004 112622678 97993845
58166 97993845 84863356 73430506 63647040 55348229 48344221 42439683 37446849 33213314
58158 33213314 29623865 26574216 23964120 21717019 19783042 18116552 16667516 15396726
58150 15396726 14280254 13293464 12405984 11596272 10856158 10176854 9544238 8951595 8403322
58141 8403322 7901174 7438384 7010813 6621814 6271620 5952698 5659813 5394875 5158033
58132E158033k14553j95895j75718j57790j49075j47222j45199j43342j45469
58123C683770j47937j43916j34655j26006j17717j06001r2732q2261p2718n9757
58113B600070m5332l3865k3429r609N410J6270K3349K9595L1918K4604Q631j0398
58101B617214l0838n3518p4729q8940r6610j01804j04337j01439r4859q9000q3892
58090A697248p6788o8703o2680n7736n1090m4282m0610l8727l5181l1151l0027
58079A160273l0438k8337k4324k2317k2442k1551j9525j8842j9079j7754j5569
58068I20095j5196j5916j4915j2747j2136j2516j1100q238o584o085m787l477
58056G96398m377o408o826o389p889j0579j1153r374p888p236n767l773l071l194
$$ plain form
58132 5158033 4943480 4747585 4571867 4414077 4265002 4117780 3972581 3829239 3683770
58123 3683770 3535833 3391917 3257262 3131256 3013539 2907538 2814806 2732545 2659827 2600070
58113 2600070 2554738 2520873 2497444 2487835 2493245 2509515 2532864 2562459 2594377 2618981 2627612 2617214
58101 2617214 2586376 2532858 2458129 2369189 2272579 2170775 2066438 1964999 1870140 1781140 1697248
58090 1697248 1620460 1551757 1489077 1431341 1380251 1335969 1295359 1256632 1221451 1190300 1160273
58079 1160273 1129835 1101498 1077174 1054857 1032415 1010864 991339 972497 953418 935664 920095
58068 920095 904899 888983 874068 861321 849185 836669 825569 817331 810747 804662 799875 796398
58056 796398 792021 785613 778787 772398 764509 753930 742777 733403 725515 718279 712512 708739 705668 702474
58042G02474k320j080j187j423O48M024N748N946O940Q545Q772Q174Q838R930
58028G64029Q922O503N716O927Q120R524J3201J8597K3067K6597L1541L7930M3526
58015A004200M8329N4624O2304O8333P1091P1480O9582O4124N5426M5480L4892
58004A649865K3066J1210J590o055j4043k2749l0322l6062m0812m4259m5122m3671
57992A402636m0920l5832k6708j4748k833Q624K0990L3122M1543M4714M3498L7739
57980A511825K6230J0119p231k3848l9334n1821n8533n9607n7860n4572m8877
57969A146491m1200l3656k6675j8739r988k723K126N987R631J2041J2666J1996
57957A067957R730N167n73n439r422j3723j7396j8147j6299j4398j2792r151k793
$$ plain form
58042 702474 700154 699074 697887 696464 697112 701136 706884 712830 719770 728315 737087 745261 754099 764029
58028 764029 772951 779454 785170 792097 800217 809741 822942 841539 864606 891203 922744 960674 1004200
58015 1004200 1052529 1107153 1169457 1237790 1308881 1380361 1449943 1514067 1569493 1614973 1649865
58004 1649865 1672931 1684141 1685731 1679676 1665633 1642884 1612562 1576500 1535688 1491429 1446307 1402636
57992 1402636 1361716 1325884 1299176 1284428 1281595 1290219 1311209 1344331 1385874 1430588 1474086 1511825
57980 1511825 1538055 1548174 1540943 1517095 1477761 1425940 1367407 1307800 1249940 1195368 1146491
57969 1146491 1105291 1071635 1044960 1026221 1016233 1013510 1015636 1021623 1031254 1043295 1055961 1067957
57957 1067957 1077687 1082854 1082281 1076842 1067420 1053697 1036301 1018154 1001855 987457 974665 965514 962721
57944I62721M025R774J5287K0895K4969K6171K4533J9714J0926q43j2979k4028
57932A081165l3925m1615m5372m5631m4569m2628l8412l2139k6101k1284j6638
57921F92851j2099r117p622n580k323N28K105L367M500M244K509Q63l53k570n968
57906F65335q771j0290j1823j3822j5027j5144j5426j5787j4353j0955p968o590
57894E19379n072k014J456M159O810J0030J2813J4559J6304J8575K0048J9694
57882F36741J8274J6603J4300J1246Q277N445J647l183p655j1256j4884j8366
57870F57189k0088j9954k0010k1059k1289j9508j7021j4941j2265q276m313j414
57858D77051J561N545R212J1166J2216J3606J4752J4517J3180J1436Q966N576
$$ plain form
57944 962721 966746 976520 991807 1012702 1037671 1063842 1088375 1108089 1119015 1118172 1105193 1081165
57932 1081165 1047240 1005625 960253 914622 870053 827425 789013 756874 730773 709489 692851
57921 692851 680752 671635 664013 658433 656110 656638 658743 662110 666610 670854 673363 674226 673873 671303 665335
57906 665335 656564 646274 634451 620629 605602 590458 575032 559245 544892 533937 525969 519379
57894 519379 514307 512293 513749 517908 524718 534748 547561 562120 578424 596999 617047 636741
57882 636741 655015 671618 685918 697164 705441 710886 712533 709350 701695 690439 675555 657189
57870 657189 637101 617147 597137 576078 554789 535281 518260 503319 491054 482778 478465 477051
57858 477051 478612 484157 493369 504535 516751 530357 545109 559626 572806 584242 593208 598784
57846E98784K282l03l202p254j1429j4327j6003j7026j7169j6303j5240j4477
57834D68333j3374j1584r842q424o433l619j199J89J648L974O335Q177J0566J4236
57820D58983J8132K1374K4901K9577L4376L8207M1996M7103N2967N8036O1915
57809H87567O4935O6688O6536O4645O1083N4824M4916L1715J6108j230j8755l3786
57797A305246m4741n2472n8222o1647o2178o0791n8834n6367n3134m9890m7154
57786F99816m3936l9364l4494l0841k8168k5423k2771k0959j9505j7391j4867
57775D02097j2957j1659j0206q599p442o625n465l797j940r8J346J742J369J769
57761C39535L798O287P731Q350R269J0646J1976J3300J4633J5033J3784J1774
$$ plain form
57846 598784 601066 600763 597561 590307 578878 564551 548548 531522 514353 498050 482810 468333
57834 468333 454959 443375 433533 425109 418676 415057 413858 414047 415695 419669 426004 434181 444747 458983
57820 458983 477115 498489 523390 552967 587343 625550 667546 714649 767616 825652 887567
57809 887567 952502 1019190 1085726 1150371 1211454 1266278 1311194 1342909 1359017 1357787 1339032 1305246
57797 1305246 1260505 1208033 1149811 1088164 1025986 965195 906361 849994 796860 746970 699816
57786 699816 655880 616516 582022 551181 523013 497590 474819 453860 434355 416964 402097
57775 402097 389140 377481 367275 358676 351234 344609 339144 335347 333407 333309 334655 336397 337766 339535
57761 339535 343333 349620 357351 365701 374970 385616 397592 410892 425525 440558 454342 466116
57749D66116J0249Q834O448L560J874K031L069M014M702N121N169N086N206N391
57735E36870N403N512O041O820P826R711J2770J6021J8248J9434K0286K0955K1257
57722G07154K1508K2121K2793K3221K4076K6248K9498L2910L6393M0720M6293
57711A032935N2744N9632O6901P4774Q3661R3810J04664J15116J24765J34190
57701A943192J43419J50971J54970J54433J48751J36930J18406R4007O5317L3713
57691C144109P48l1236n9900q3886j02460j14926j21173j22135j18982j12290
57681B277869j02418q9875p4814n7089l7276j6473N605L1066O1592R6805J35178
57670B230170J74180K07551K23989K11610J65171Q9475k271r2492j64441k08052
$$ plain form
57749 466116 476365 485199 491647 495207 497081 499112 502181 506195 510897 516018 521187 526273 531479 536870
57735 536870 542273 547785 553826 560646 568472 578183 590953 606974 625222 644656 664942 685897 707154
57722 707154 728662 750783 773576 796797 820873 847121 876619 909529 945922 986642 1032935
57711 1032935 1085679 1145311 1212212 1286986 1370647 1464457 1569121 1684237 1809002 1943192
57701 1943192 2086611 2237582 2392552 2546985 2695736 2832666 2951072 3045079 3110396 3144109
57691 3144109 3144857 3113621 3053721 2969835 2867375 2752449 2631276 2509141 2390159 2277869
57681 2277869 2175451 2085576 2010762 1953673 1916397 1899924 1905529 1936595 1998187 2094992 2230170
57670 2230170 2404350 2611901 2835890 3047500 3212671 3302146 3299875 3207383 3042942 2834890
57660B834890k22991k16011j95506j68394j39771j12619q7488o3891m2118k2883
57650A563218n863J0000K5003L8723N1357O3766P6271Q8508J00170J10974J19963
57639B242090J25945J28403J27185J21509J10239R2932P0047M2538J2105j8733
57629C054260m7760p4003r6906j15300j28126j35612j38803j38371j34861j29361
57619A915157j22808j15169j06313r7171q8895q1452p4140o7031o0718n5161m9958
57608I96341m5326m1602l8177l4171k9875k6341k3885k1973k0261j8704j7032
57597F78994j5150j3635j2860j2119j0728r250q461p831o474m912m301m306l509
57584E65458j703j45M47O79J224K149L511N293O766P172O959P127P532P245O475
$$ plain form
57660 2834890 2611899 2395888 2200382 2031988 1892217 1779598 1692110 1628219 1586101 1563218
57650 1563218 1557355 1567355 1592358 1631081 1682438 1746204 1822475 1910983 2011153 2122127 2242090
57639 2242090 2368035 2496438 2623623 2745132 2855371 2948303 3018350 3060888 3072993 3054260
57629 3054260 3006500 2932497 2835591 2720291 2592165 2456553 2317750 2179379 2044518 1915157
57619 1915157 1792349 1677180 1570867 1473696 1384801 1303349 1229209 1162178 1101460 1046299 996341
57608 996341 951015 909413 871236 837065 807190 780849 756964 734991 714730 696026 678994
57597 678994 663844 650209 637349 625230 614502 605252 596791 588960 582486 577574 573273 568967 565458
57584 565458 563755 563610 564057 564736 565960 568109 571620 576913 583679 590851 597810 604937 612469 619714 626189
57569F26189O521P756R140R956J0706J2021J4004J6861K0825K5200K8673L1094
57557H18946L3818L7952M3190M8650N3958N9246O4949P1655P9354Q6923R3249
57546A491890R8569J03461J06895J06780J02434R4777Q3905O8378M7668K3752
57536B328509o14k4042m6086o5779q1754r3250j00347j03631j03985j02152r8169
57525A508700r1877q4062p6312o9490o3205n6928n0734m4678l8509l2439k7234
57514H73232k3137j9489j5808j2309r057n640k142N87K227L611N398P089Q161
57501H12723R305J1542J4740J7972K1002K4485K8902L4084L9739M5805N2239N8881
57489A171419O5631P2536P9689Q6982R3795R8950J01295J00307R5922Q7779P5192
$$ plain form
57569 626189 632710 640466 649606 659562 670268 682289 696293 713154 733979 759179 787852 818946
57557 818946 852764 890716 933906 982556 1036514 1095760 1160709 1232364 1311718 1398641 1491890
57546 1491890 1590459 1693920 1800815 1907595 2010029 2104806 2188711 2257089 2304757 2328509
57536 2328509 2327895 2303853 2257767 2191988 2110234 2016984 1916637 1813006 1709021 1606869 1508700
57525 1508700 1416823 1332761 1256449 1186959 1123754 1066826 1016092 971414 932905 900466 873232
57514 873232 850095 830606 814798 802489 793432 787792 785650 786237 788464 792075 797473 804562 812723
57501 812723 822028 833570 848310 866282 887284 911769 940671 974755 1014494 1060299 1112538 1171419
57489 1171419 1237050 1309586 1389275 1476257 1570052 1669002 1770297 1870604 1966526 2054305 2129497
57478B129497N7947L6758J2975j1861l6183n8666p8316r4131j04994j10563j11985
57467A630478j10961j08223j03577r7319r0530q3891p7179p0215o3514n7604n2344
57456G15121m7332m2500l7998l3944l0452k7558k5043k2694k0666j9105j7655
57445C90174j5895j4112j2856j1944j0747r337q396q011p634p172p083p279p044
57432B62664o330n990o339o556n970n003m349m146m331m825m961l804j672k58
57418A98130m89j257j085j09N53N55K60l01j240j954j678o99j7Q9K01N51O71L68
57400A92549K23P22J473J730J336P99N48M09n8p84j107o47l2j78r16j089j43J023
57382A95858J255O28J63M78J322K165K730K928K776K402J979J626J370J133P33
$$ plain form
57478 2129497 2187444 2224202 2237177 2225316 2189133 2130467 2052151 1958020 1853026 1742463 1630478
57467 1630478 1519517 1411294 1307717 1210398 1119868 1035977 958798 888583 825069 767465 715121
57456 715121 667789 625289 587291 553347 522895 495337 470294 447600 426934 407829 390174
57445 390174 374279 360167 347311 335367 324620 315283 306887 298876 291242 284070 276987 269708 262664
57432 262664 256334 250344 244005 237449 231479 226476 222127 217981 213650 208825 203864 200060 198388 198130
57418 198130 197641 196384 195299 195190 195743 196298 196558 196257 195017 193063 191385 190686 190669 190758 190959 191510 192181 192549
57400 192549 192772 193494 194967 196697 198033 198832 199380 199789 199731 198947 197840 197193 197161 196983 196067 194978 194835 195858
57382 195858 197113 197741 197904 198382 199704 201869 204599 207527 210303 212705 214684 216310 217680 218813 219546
57367B19546J76j25J73O95P00J94L1O41J320J235O96P33J707K941L670L870M005
57350B42208M293M456M255M067M624N953P025O882N898N283N530O045O274O258
57336C19051O005N375M864N548P578R625J0513J0667J1244J2450J3667J4688J5826
57323D47101J7114J8294J9488K0989K2505K3431K3738K3890K3858K3096K1560
57312F85064J9904J8354J6154J2523P606K111l469q849j3650j7548k0577k2835
57300F74788k4157k4425k3922k3018k1675j9726j7444j5297j3158j0398o921l548
57288D71099j014R47L007N077O423O874P294Q563J0587J2596J4034J4878J5311
57275E75676J5589J6116J7224J8771K0239K1275K2043K2907K3970K5018K5835
$$ plain form
57367 219546 219722 219597 219770 220465 221165 221359 221390 222031 223351 224586 225282 226015 227722 230663 234333 238203 242208
57350 242208 246501 250957 255212 259279 263903 269856 276881 283763 289661 294944 300474 306519 312793 319051
57336 319051 325056 330431 335295 340843 348421 358046 368559 379226 390470 402920 416587 431275 447101
57323 447101 464215 482509 501997 522986 545491 568922 592660 616550 640408 663504 685064
57312 685064 704968 723322 739476 751999 759605 761716 758247 749398 735748 718200 697623 674788
57300 674788 650631 626206 602284 579266 557591 537865 520421 505124 491966 481568 474647 471099
57288 471099 470085 471032 474039 479116 485539 492413 499707 508270 518857 531453 545487 560365 575676
57275 575676 591265 607381 624605 643376 663615 684890 706933 729840 753810 778828 804663
57264H04663K6425K6856K7031K6940K7087K8193L0209L2083L3031L3709L5406
57253A131633L8244M1187M3766M6681N0203N2967N3263N0927M7312M3946M1956
57242A642085M2175M4569M7624M9235M8457M5904M2578L8968L5285L1857K9022
57231B097759K6952K5654K4908K4391K4163K4739K6266K7964K8939K9305K9848
57220B390888L0878L2033L2986L3610L3605L2804L1786L1423L1765L1986L1506
57209B745270L0497K9307K8102K7096K6441K5893K5274K5176K6361K8399K9839
57198C047655K9954K9517K9521L0001L0504L0965L1583L2377L3353L4706L6429
57187C396565L8069L9142L9560L9555L9638M0623M3038M6289M9009N0499N1276
$$ plain form
57264 804663 831088 857944 884975 911915 939002 967195 997404 1029487 1062518 1096227 1131633
57253 1131633 1169877 1211064 1254830 1301511 1351714 1404681 1457944 1508871 1556183 1600129 1642085
57242 1642085 1684260 1728829 1776453 1825688 1874145 1920049 1962627 2001595 2036880 2068737 2097759
57231 2097759 2124711 2150365 2175273 2199664 2223827 2248566 2274832 2302796 2331735 2361040 2390888
57220 2390888 2421766 2453799 2486785 2520395 2554000 2586804 2618590 2650013 2681778 2713764 2745270
57209 2745270 2775767 2805074 2833176 2860272 2886713 2912606 2937880 2963056 2989417 3017816 3047655
57198 3047655 3077609 3107126 3136647 3166648 3197152 3228117 3259700 3292077 3325430 3360136 3396565
57187 3396565 3434634 3473776 3513336 3552891 3592529 3633152 3676190 3722479 3771488 3821987 3873263
57176C873263N2048N2699N2702N1999N1030N0208M9567M8737M7220M5059M3139
57165D417671M2256M1953M1010L9088L7142L6209L6679L8802M2783M8016N3264
57154D874873N7780O0721N9049M8325K7817L810j4597k3334k5759k7472l0671
57143E010542l4055l6112l6742l6283l4659l1774k7972k3688j9031j3890q325
57132D708011k681K485O520Q771Q735O321K105k728o876r483j0257r202o485k562
57118D692674J852O208J0452J4779J9288K4188L0188L8118M8068N9299P1318Q4729
57106E101161J00887J21082J46483J78416K18337K67816L29051M05110M99319
57097G367662O14820P55140R24458J126317J362103J630930J929653K251683K586315
$$ plain form
57176 3873263 3925311 3978010 4030712 4082711 4133741 4183949 4233516 4282253 4329473 4374532 4417671
57165 4417671 4459927 4501880 4542890 4581978 4619120 4655329 4692008 4730810 4773593 4821609 4874873
57154 4874873 4932653 4993374 5052423 5100748 5128565 5132375 5117778 5094444 5068685 5041213 5010542
57143 5010542 4976487 4940375 4903633 4867350 4832691 4800917 4772945 4749257 4730226 4716336 4708011
57132 4708011 4705330 4707815 4714335 4723106 4731841 4738162 4740267 4737539 4730663 4721180 4710923 4701721 4695236 4692674
57118 4692674 4694526 4700734 4711186 4725965 4745253 4769441 4799629 4837747 4885815 4945114 5016432 5101161
57106 5101161 5202048 5323130 5469613 5648029 5866366 6134182 6463233 6868343 7367662
57097 7367662 7982482 8737622 9662080 10788397 12150500 13781430 15711083 17962766 20549081
57088B0549081K920253L238852L524648L756637L913908L979586L940182L785958
57080D9609105L519759L164165K747603K274586J715239J035723K43256o00507
57072F3708929j408611k109434k668125l085706l386288l598523l738208l803687
57064C9910347l786722l685825l509586l272672k993112k691155k385726k090698
57056A5494851j815278j566409j348362j161043j001312q66060p52818o58426
57048F325143n79197n12266m55389m05999l61869l22258k87076k55506k26691
57039B918892k01057j79380j61064j44675j29756j16691j05272r4788q5106p6351
57029A624752o7951n9274n0712m2815l4902k5875j5732m749Q086K4173M3714O7207
$$ plain form
57088 20549081 23469334 26708186 30232834 33989471 37903379 41882965 45823147 49609105
57080 49609105 53128864 56293029 59040632 61315218 63030457 64066180 64309436 63708929
57072 63708929 62300318 60190884 57522759 54437053 51050765 47452242 43714034 39910347
57064 39910347 36123625 32437800 28928214 25655542 22662430 19971275 17585549 15494851
57056 15494851 13679573 12113164 10764802 9603759 8602447 7736387 6983569 6325143
57048 6325143 5745946 5233680 4778291 4372292 4010423 3688165 3401089 3145583 2918892
57039 2918892 2717835 2538455 2377391 2232716 2102960 1986269 1880997 1786209 1701103 1624752
57029 1624752 1556801 1497527 1446815 1404000 1369098 1343223 1327491 1322742 1330828 1355001 1398715 1465922
57017A465922R7354J35503J74892K00132J95902J56382Q7173J417q4397j54203
57007B276077j97338k12338k05696j86623j62709j38695j16877r7670q0554o5234
56997H12343n1934m0756l1313k3169j6270j0648o041k061J276L599M919O058P962
56984F53965J0644J3091J4159J3162R634L387m805j3053j9553k3695k5788k6147
56972F05001k4996k2895k0538j8174j5619j2765r707o584l568q17J882N182R430
56959D85832J4258J9083K3525K6788K7162K3068J4584L545p647j6956k3035k5585
56947E64622k5397k3480k0276j6093j1842q498o004l583r59J508L929P098J1424
56934D72449J6322K1021K5320K9124L1636L1377K6954J7863M963r574k3057l3314
$$ plain form
57017 1465922 1563276 1698779 1873671 2073803 2269705 2426087 2513260 2514677 2430280 2276077
57007 2276077 2078739 1866401 1660705 1474082 1311373 1172678 1055801 958131 877577 812343
56997 812343 760409 719653 688340 665171 648901 638253 632212 630151 631427 635026 639945 646003 653965
56984 653965 664609 677700 691859 705021 714655 718042 713237 700184 680631 656936 631148 605001
56972 605001 580005 557110 536572 518398 502779 490014 480307 473723 470155 469338 471220 476402 485832
56959 485832 500090 519173 542698 569486 596648 619716 634300 637845 630198 613242 590207 564622
56947 564622 539225 515745 495469 479376 467534 459036 453032 449449 448490 449998 453927 461025 472449
56934 472449 488771 509792 535112 564236 595872 627249 654203 672066 677029 667455 644398 611084
56922F11084l9239m0845l9157l5768l1890k7805k3476j9407j6363j4412j2820
56911C09902j0982q948p029n394m172l517l355l314l048k447j512l14Q30J404
56897B58104J140M61L31J494L758O153P981R550J1651J4481J7520K0202K2054
56884C74880K2268K0007J5345R254K530m421j0645j4655j5981j5642j4533j2335
56872C56072q845n192k534l49K689O712J0921J5280K0493K6580L2825L9093M5562
56859E39307N0950N2371M7543L6389K0494K280j5027k8140l5542l8075l7264l3794
56847E61492k8125k1546j5433r831l663L661J1514J8979K5961L3271M1907N2429
56835F70616O4560P6847Q6368Q9147Q1723O3092L5569L878k6578n1209o7347p4774
$$ plain form
56922 611084 571845 531000 491843 456075 424185 396380 372904 353497 337134 322722 309902
56911 309902 298920 289972 282943 277549 273377 269860 266505 263191 260143 257696 256184 255870 256700 258104
56897 258104 259244 259705 260036 261530 265288 271441 279422 288972 300623 315104 332624 352826 374880
56884 374880 397148 417155 432500 441754 444284 439863 429218 414563 398582 382940 368407 356072
56872 356072 347227 342035 339501 339152 341841 348553 359474 374754 395247 421827 454652 493745 539307
56859 539307 590257 642628 690171 726560 747054 749334 734307 706167 670625 632550 595286 561492
56847 561492 533367 511821 496388 486557 482894 486555 498069 517048 543009 576280 618187 670616
56835 670616 735176 812023 898391 987538 1069261 1132353 1167922 1171800 1145222 1094013 1026666 951892
56823I51892p5110p0405o2432n3053m4133l6348k8789k0511j1949l998L638J2035
56811E60837K1345L0797M0223N0161N9881O6263O5325N4756L5207J0135j5363
56800I79567l6536n0863n8291n9927n7094n1389m4675l8299l2598k7308k2052
56789E00535j6468j0469m609L78M645R312J5189K1685K7159K9904K8750K3223
56777F29234J3671J193j2550k5378l4905l9659m0136l8236l5497l2237k8369k4300
56765C32831k0584j7302j4256j1507r252p420n799m478l809l865m167m068l415
56752B22909k718k567k884l009k535j787j295j154j161j177j059n48K61P22L94
56737B02392k17k80L00J055J905L112M376M899M544M199M662N787P005Q121R196
$$ plain form
56823 951892 876782 806377 743945 690892 646759 610411 581622 561111 549162 545164 548802 560837
56811 560837 582182 612979 653202 703363 763244 829507 894832 949588 984795 994930 979567
56800 979567 943031 892168 833877 773950 716856 665467 620792 582493 549895 522587 500535
56789 500535 484067 473598 468989 469367 474012 483324 498513 520198 547357 577261 606011 629234
56777 629234 642905 644098 631548 606170 571265 531606 491470 453234 417737 385500 357131 332831
56765 332831 312247 294945 280689 269182 259930 252510 246711 242233 238424 234559 230392 226324 222909
56752 222909 220191 217624 214740 211731 209196 207409 206114 204960 203799 202622 201563 201015 201276 201998 202392
56737 202392 202175 201895 202195 203250 205155 208267 212643 217542 222086 226285 230947 236734 243739 251860 261056
56722B61056J0126J0768J1147J1188J0483Q814O717N138M406L905K865J344J76
56709C48133j00Q8l3m88n48K10J424K557L399L700L062J675N94N85J131J245Q40
56692C67474M53Nj182l091m742n480n863o775q169r076q764p537o349n752n340
56677B89812m467l258k528k640l024l060k817k634k515k351k215j963j165Q1R01
56662B56157P95M69Q09J664K348K751K997K705J597M36K21P62J100J007J001J195
56646B78014J276J397J841J992R28r69k292k574k666l062l186k713k187j858j086
56631B62855L42J490J641J478K006L009L484L148K587K275K108J874J615J492
56617B91404J626J936K092J790J193Q14Q93J167J290J192R89P80N70J66o51j601
$$ plain form
56722 261056 271182 281950 293097 304285 314768 323582 330299 335437 339843 343748 346613 347957 348133
56709 348133 348033 348121 348088 347600 347052 347262 348686 351243 354642 358342 361404 363079 363673 364258 365389 366634 367474
56692 367474 367927 367932 366750 363659 358917 353437 347574 340799 332630 323554 314790 307253 300904 295152 289812
56677 289812 285345 282087 279559 276919 273895 270835 268018 265384 262869 260518 258303 256340 255175 255256 256157
56662 256157 256952 257421 258230 259894 262242 264993 267990 270695 272292 272728 272949 273711 274811 275818 276819 278014
56646 278014 279290 280687 282528 284520 285448 284479 282187 279613 276947 273885 270699 267986 265799 263941 262855
56631 262855 263197 264687 266328 267806 269812 272821 276305 279453 282040 284315 286423 288297 289912 291404
56617 291404 293030 294966 297058 298848 300041 300855 301748 302915 304205 305397 306386 307166 307736 307902 307251 305650
56601C05650j904j229l31j36n67r38j081j272j336r04l64n26j265j577j076m86
56585B90658m29p20j091j626k141k063j384r26j153j496j280o42k3O08J493K544
56569B80329L566M585N634O544P230P813Q179P896O841N559M728M475M379L857
56555C61615K551O84j003k010k733l921n618p194q229q815r042q951q885r222
56541B89227r692r707r275q972q959q758q036o977n859m853m230m112m043l491
56527A92263k663k143j986j846j794k108k461k304j872j817j974j603p52j98j21
56512A66621qJ50j34n98l34O04J117P89L91L35R9l30M6J560K915K872J818R33
56494A78846P09R73J532K048K087J825K001K661K940K521K248K678L108K765K044
$$ plain form
56601 305650 303746 302517 302186 302050 301483 300545 299464 298192 296856 295952 295588 295062 293797 292220 291144 290658
56585 290658 290229 289509 288418 286792 284651 282588 281204 280278 279125 277629 276349 275707 275684 276292 277785 280329
56569 280329 283895 288480 294114 300658 307888 315701 323880 331776 338617 344176 348904 353379 357758 361615
56555 361615 364166 364850 363847 361837 359104 355183 349565 342371 334142 325327 316285 307334 298449 289227
56541 289227 279535 269828 260553 251581 242622 233864 225828 218851 212992 208139 203909 199797 195754 192263
56527 192263 189600 187457 185471 183625 181831 179723 177262 174958 173086 171269 169295 167692 166940 166742 166621
56512 166621 166613 166763 166629 166031 165697 166301 167418 168207 168598 168933 169032 168702 168748 170308 173223 176095 177913 178846
56494 178846 179555 180528 182060 184108 186195 188020 190021 192682 195622 198143 200391 203069 206177 208942 210986
56479B10986J724J791J848J923K101K052J554R39M72j9n03n43k59m76j358j970
56463B20262j764j545k045k610k318j501j107j195j129p16j92M52J180J430P71
56448B07973k45p23n61k86j14Q3K28J71R8L44R25J632K299K652K352J562R77R85
56430B20352J235J244R53M28k77p70n56Q5K40l84j136j586k036k534k501j897
56414B10860j651k271k930k730k032j738j967k151j895j087J54J219J329O28J94
56399A93932N41R26O29k2m00m22q9P76J790K037J402Q39P78M50m26p60J87J413
56381B03581J733J516J634J756J132K29R4O61J004Q85Q05R55J199J704K540L073
56365B24501K731J988J719J921J946J548R33K41l00k96Q8K3o74r60r1J119J561
$$ plain form
56479 210986 212710 214501 216349 218272 220373 222425 223979 224918 225390 225371 224868 224325 224066 223590 222232 220262
56463 220262 218498 216953 214908 212298 209980 208479 207372 206177 205048 204332 204140 204592 205772 207202 207973
56448 207973 207728 207005 206444 206158 206044 206127 206355 206526 206624 206968 207893 209525 211824 214476 216828 218390 219367 220352
56430 220352 221587 222831 223784 224212 223935 223165 222609 222694 222934 222550 221414 219828 217792 215258 212757 210860
56414 210860 209209 206938 204008 201278 199246 197508 195541 193390 191495 190408 190562 191781 193110 193738 193932
56399 193932 194473 195399 196028 196006 195606 195184 195095 195871 197661 199698 201100 201939 202717 203167 202741 201981 202168 203581
56381 203581 205314 206830 208464 210220 211352 211581 211675 212336 213340 214225 215030 215985 217184 218888 221428 224501
56365 224501 227232 229220 230939 232860 234806 236354 237287 237528 237228 236932 237020 237043 236369 235409 235318 236437 237998
56348B37998J470J671J978J684J009P39Q23N54o0k46L55J312K041K107J284k5
56332B54694p75m07M45R16R67R24P63N39O88J144J055K38j38P38J908K149J891
56315B67739K252L034L198K676K238J972J325L44m24r12j293j226m94N2n12j615
56299B78354j945j295m41L86J437K186J757N73R7P49J413J324J142J705K724L315
56283B93481L181K781K645K872L182L391L770M587N335N131M042L299L705M740
56269C46142N631O374P050P159O588O399P505R251J0275J0259R894R702R796J0293
56255D62318J1032J1326J0798R990R524R288Q959Q560P871O175L445Q66o69j740
56241E57743l210m867o091o956p641p714p012o318o170n945n081m203l961l848
$$ plain form
56348 237998 239468 241139 243117 244801 245810 246549 247372 247926 247866 247620 247975 249287 251328 253435 254719 254694
56332 254694 253919 253512 253957 254873 255840 256764 257527 258066 258754 259898 260953 261191 261053 261791 263699 265848 267739
56315 267739 269991 273025 276223 278899 281137 283109 284434 284778 284354 283442 282149 280923 280429 280481 279969 278354
56299 278354 276409 275114 274673 275059 276496 278682 280439 281012 281109 281858 283271 284595 285737 287442 290166 293481
56283 293481 296662 299443 302088 304960 308142 311533 315303 319890 325225 330356 334398 337697 341402 346142
56269 346142 351773 358147 365197 372356 378944 385343 392848 402099 412374 422633 432527 442229 452025 462318
56255 462318 473350 484676 495474 505464 514988 524276 533235 541795 549666 555841 559286 560152 559483 557743
56241 557743 554533 549666 543575 536619 528978 521264 514252 507934 501764 495819 490738 486535 482574 478726
56227D78726l221k537k419k536k583l193m657n820n594m475l352k014j71J313
56213D37467J750J966K766L256K392J063P78J338J671J935K904M127M748N333
56199D73494O893Q750R331Q656Q114Q218Q298P971P380O438N382N354O949Q878
56185E80106R664R772J0506J1732J2539J3223J4651J6423J7634J8752K0768K3146
56173G58916K4641K5512K6959K8961L0655L2393L5419L9866M4888N0467N7426
56162A156103O6094P6514Q9428J05582J24920J47857J76431K12474K55569L04084
56152B715056L56440M08888M53388M80352M83526M61363M16211L55447K91981
56143F422652K39450K05263J88425J81958J75217J56550J19063O5616O828m5718
$$ plain form
56227 478726 475505 472968 470549 468013 465430 462237 457580 451760 446166 441691 438339 436325 436154 437467
56213 437467 439217 441183 443949 447205 449597 450660 451438 452776 454447 456382 459286 463413 468161 473494
56199 473494 480387 489137 498468 507124 515238 523456 531754 539725 547105 553543 558925 564279 571228 580106
56185 580106 589770 599542 610048 621780 634319 647542 662193 678616 696250 715002 735770 758916
56173 758916 783557 809069 836028 864989 895644 928037 963456 1003322 1048210 1098677 1156103
56162 1156103 1222197 1298711 1388139 1493721 1618641 1766498 1942929 2155403 2410972 2715056
56152 2715056 3071496 3480384 3933772 4414124 4897650 5359013 5775224 6130671 6422652
56143 6422652 6662102 6867365 7055790 7237748 7412965 7569515 7688578 7754194 7761022 7715304
56133G715304q3985j04962j12543j17914j34299j69446k23059k88913l56697m13845
56123E709641m50385m63325m55191m29799l91790l48038l05043k65065k27664
56114B373341j94053j66443j44073j23877j04953q8889p5944o4485n4242m6571
56104A309811m1381l6878l2487k9057k6241k2766j9090j6788j5537j3652j1232
56093A044702r646q478o250l690k823l209k549o48P54J608L321N272N443M315
56079A028122M339N674O177N577N753O959P632P867R241J1186J1449J0252J0050
56066A130278J1220J1796J1474J1905J3077J3320J2866J3538J5050J5572J5555
56055A275651J6966J9167J9872J9620K0829K3050K3846K3773K5421K8093K8652
$$ plain form
56133 7715304 7631319 7526357 7413814 7295900 7161601 6992155 6769096 6480183 6123486 5709641
56123 5709641 5259256 4795931 4340740 3910941 3519151 3171113 2866070 2601005 2373341
56114 2373341 2179288 2012845 1868772 1744895 1639942 1551053 1475109 1410624 1356382 1309811
56104 1309811 1268430 1231552 1199065 1170008 1143767 1121001 1101911 1085123 1069586 1055934 1044702
56093 1044702 1035056 1026578 1020328 1016638 1013815 1010606 1008057 1007409 1008163 1009771 1013092 1018364 1023807 1028122
56079 1028122 1032461 1038135 1044312 1049889 1055642 1062601 1070233 1078100 1087341 1098527 1109976 1120228 1130278
56066 1130278 1141498 1153294 1164768 1176673 1189750 1203070 1215936 1229474 1244524 1260096 1275651
56055 1275651 1292617 1311784 1331656 1351276 1372105 1395155 1419001 1442774 1468195 1496288 1524940
56044A524940K7284K6963K7647K6599K4402K4580K7222K8778K8514K9270L1518
56033A827717L2596L2301L3392L6072L7813L8832M1723M5648M7263M7382N0074
56022B270813N5046N7988N8675O1322O6484P0200P1886P5354Q1113Q5392Q7730
56011C042003R1644R6892R9262R9017J01050J05603J07607J06390J07004J10604
56001D067076J12954J13861J18384J27018J34646J40869J50958J64877J76337
55992E306980J84745J96692K13291K28050K39737K54993K75283K94256L11196
55983G505223L33591L62897L91808M19354M53854M96817N39530N80277O28522
55974A1711873O86945P46637Q05899Q75737R60631J053050J153646J276384J426758
$$ plain form
56044 1524940 1552224 1579187 1606834 1633433 1657835 1682415 1709637 1738415 1766929 1796199 1827717
56033 1827717 1860313 1892614 1926006 1962078 1999891 2038723 2080446 2126094 2173357 2220739 2270813
56022 2270813 2325859 2383847 2442522 2503844 2570328 2640528 2712414 2787768 2868881 2954273 3042003
56011 3042003 3133647 3230539 3329801 3428818 3529868 3635471 3743078 3849468 3956472 4067076
56001 4067076 4180030 4293891 4412275 4539293 4673939 4814808 4965766 5130643 5306980
55992 5306980 5491725 5688417 5901708 6129758 6369495 6624488 6899771 7194027 7505223
55983 7505223 7838814 8201711 8593519 9012873 9466727 9963544 10503074 11083351 11711873
55974 11711873 12398818 13145455 13951354 14827091 15787722 16840772 17994418 19270802 20697560
55965B0697560J597295J792517K034199K333659K686347L104150L623736M272795
55957D2142258N063495O034029P257904Q795973J0685453J2996918J5846977J9330630
55949A28153637K3511708K8483270L4216487M0063721M4372636M4853588L9677621
55942C83332668K8529286J2904006m395809k0196198l1967023l8580746m0443617
55935B89182567l8923143l5519514l1353374k7105274k3138246j9594347j6482999
55928I7065670j3783916j1490820r580261p995364o681721n608186m741389m032228
55920C3151785l442133k957026k563693k235892j954045j716401j519906j349516
55912A5413173j195591j063183r54658q59752p71120o93824o31156n75779n22550
$$ plain form
55965 20697560 22294855 24087372 26121571 28455230 31141577 34245727 37869463 42142258
55957 42142258 47205753 53239782 60497686 69293659 79979112 92976030 108823007 128153637
55949 128153637 151665345 180148615 214365102 254428823 298801459 343655047 383332668
55942 383332668 411861954 424765960 420370151 400173953 368206930 329626184 289182567
55935 289182567 250259424 214739910 183386536 156281262 133143016 113548669 97065670
55928 97065670 83281754 71790934 62210673 54215309 47533588 41925402 37184013 33151785
55920 33151785 29709652 26752626 24188933 21953041 19998996 18282595 16762689 15413173
55912 15413173 14217582 13154399 12199741 11339989 10568869 9875045 9243889 8668110 8145560
55903H145560m76237m39241m04767l69063l37970l14682k92965k68815k47314
55894D994506k31682k16547j98363j81954j70689j60075j47081j36282j30822
55885C421011j26253j19063j12686j09693j06162r9201r2134q7242q0970p1183
55875B416424o1668n4672m6342l4487k3922j9336j9396k2096k8991l9543m7834
55864B018137m9866m8544m7372m5129m0766l7417l7157l7350l6236l6642m0175
55853A561483m3286m3161m2259m3073m3558m1801m0136m0585m0892l8972l6772
55842A106988l6000l4529l0721k6965k5240k3456j9621j5567j3117j0710p065
55831H63997m129l186k079N32K265J466L69O41m9l680q126j1105j3961j8029k1064
$$ plain form
55903 8145560 7669323 7230082 6825315 6456252 6118282 5803600 5510635 5241820 4994506
55894 4994506 4762824 4546277 4347914 4165960 3995271 3835196 3688115 3551833 3421011
55885 3421011 3294758 3175695 3063009 2953316 2847154 2747953 2655819 2568577 2487607 2416424
55875 2416424 2354756 2300084 2253742 2219255 2195333 2175997 2156601 2134505 2105514 2065971 2018137
55864 2018137 1968271 1919727 1872355 1827226 1786460 1749043 1711886 1674536 1638300 1601658 1561483
55853 1561483 1518197 1475036 1432777 1389704 1346146 1304345 1264209 1223624 1182732 1143760 1106988
55842 1106988 1070988 1036459 1005738 978773 953533 930077 910456 894889 881772 871062 863997
55831 863997 859868 856682 854603 855135 857400 858866 859235 859876 859827 856147 848021 836916 822955 804926 783862
55816G83862k0888j9142j8039j6620j3567j0360q433o300k653Q14K639M577Q400
55803F84290J2784J6250K0081K5432L0508L3395L4684L4672L1102K2554J1129
55792I56881p53j3086k5431l4959m0138m3116m5546m5588m2011l7683l5503l4138
55780E58929l1303k8048k6155k4315k0762j7098j5615j5109j3148j0374q918q475
55768C39609p452o244n983n757m284k863l516n607p068p499p576p014n694n031
55754B58021n844o680o531o964r033j0539r268o605m838l148K75M082N425M375
55740B02728L272K840K110J136P34L79p84j732r96O45J382J289J564J942J390
55725B17899M20K14M00j3m26M03K150L750N334P296Q636Q401P528P175O479M241
$$ plain form
55816 783862 762974 743832 725793 709173 695606 685246 676813 670513 667860 668674 671313 675890 684290
55803 684290 697074 713324 733405 758837 789345 822740 857424 892096 923198 945752 956881
55792 956881 956128 943042 917611 882652 842514 799398 753852 708264 666253 628570 593067 558929
55780 558929 527626 499578 473423 449108 428346 411248 395633 380524 367376 357002 348084 339609
55768 339609 332157 325913 319930 314173 309889 307026 303510 297903 290835 283336 275760 268746 263052 258021
55754 258021 252177 245497 238966 232002 222969 212430 203162 196557 191719 188571 188846 192928 198353 202728
55740 202728 206000 208840 210950 212086 212820 213199 212415 210683 209687 210332 211714 213003 214567 216509 217899
55725 217899 218319 218533 218933 218920 218494 218897 221047 224797 230131 237427 246063 254464 261992 269167 275646 279887
55709B79887J540K75K16k01j172j861k456l643m906n428n663o187o136m742l227
55694B36296l058l526l066j743m22J216L741O321Q185J0368J3837J7198J8704
55681C04051J9180K0612K3042K5297K7611L0813L3946L5230L4645L3112L0074
55670F17613K4351J6720R185K324m398j0412j4440j6472j7276j6629j4137j0909
55658E65520q184n169n93M486P791Q934R020P787L845k587r611j6097k2130k7328
55644E15684l0878l2934l4104l3941l1789k8600k5923k3682k0885j7853j5655
55633B19440j4010j1908r796q934q977q401o995n857n227m322l164k605k686k681
55619A23877k537k699k974k957l017l372l157j975j226k009k976k394j132j153
$$ plain form
55709 279887 281427 281702 281918 281717 280545 278684 276228 272585 267679 262251 256588 250401 244265 239523 236296
55694 236296 233238 229712 226646 224903 224481 225697 229438 235759 243944 254312 268149 285347 304051
55681 304051 323231 343843 366885 392182 419793 450606 484552 519782 554427 587539 617613
55670 617613 641964 658684 667869 670193 665795 655383 640943 624471 607195 590566 576429 565520
55658 565520 557336 552167 551574 556060 563851 572785 581805 589592 593437 590850 581239 565142 543012 515684
55644 515684 484806 451872 417768 383827 352038 323438 297515 273833 252948 235095 219440
55633 219440 205430 193522 183726 174792 165815 157414 150419 144562 139335 135013 131849 129244 126558 123877
55619 123877 121340 118641 115667 112710 109693 106321 103164 101189 99963 97954 94978 92584 91452 90299
55605I0299k131k283j659j733k308j766j79O19K0p85j205j763k237j731o64l98
55589G0096q88q62k26o1l98k68J76o2n54K0J160R43o96j681j085j63K96J051K224
55570F9022K486J418M86P78J512J627J241Q24M55L92R42J495J214P39J492L180
55554H9303L951L227K411K465K772K897L436M520N339N749O674Q307R612J0209
55540A60872J1029J2572J4063J5054J6292J8319K0622K2644K4365K5452K5167
55529C66451K3387K0471J6075R660K183m601j0530j6795k3098k7227k8148k7361
55517C00467k6456k5201k3074k0817j9190j7679j5575j3212j1208r543q173p485
55505A02854p387o982n849m660m037l783l617l610l520k839j798j241j266j178
$$ plain form
55605 90299 88168 85885 84226 82493 80185 78419 78240 78859 78879 78094 76889 75126 72889 71158 70494 70096
55589 70096 69208 68346 68120 68059 67661 67393 67569 67507 66953 66973 68133 69076 68380 66699 65614 65451 65747 66798 69022
55570 69022 71508 72926 73412 74190 75702 77329 78570 79394 79849 80241 81183 82678 83892 84631 86123 89303
55554 89303 93254 96481 98892 101357 104129 107026 110462 114982 120321 126070 132744 141051 150663 160872
55540 160872 171901 184473 198536 213590 229882 248201 268823 291467 315832 341284 366451
55529 366451 389838 410309 426384 436044 438227 433626 423096 406301 383203 355976 327828 300467
55517 300467 274011 248810 225736 204919 185729 168050 152475 139263 128055 118512 110339 102854
55505 102854 95467 88485 82636 77976 73939 70156 66539 62929 59409 56570 54772 53531 52265 51087
55491E1087r07j110j684j703j099q85j354j622j286r91r12l86M62M03q82k033
55475C5098k014j427j099q48m29k60m22k68J94k5j113j746j100k19l33j040j207
55458B1742o51N1N31O26K11k78o8P03R73M33M9L93P24L69j98l90l97l79L4P25
55438B5203Q55L72M15J355J835Q31o26r75k81M25R33J609K103J709O52j56l37
55421C5922j29L68J125J649J313J89r56j399r96k38M0n23j322j574j444j665k112
55404B8248j893r04j21j25l93m50n26p47p59n89p96j316j273m47K02J4m43m20
55386A7262l0L52P11Q95N27j33k10M23Q57O18K74J84j24p79j054p01n05p75o28
55367A7164L91J183O63n62j133o91K34J219J970K061J439O65L9o79j312j035K21
$$ plain form
55491 51087 50180 49070 47386 45683 44584 43699 42345 40723 39437 38446 37534 37148 37610 38013 37131 35098
55475 35098 33084 31657 30558 29710 29281 29021 28599 28331 28525 28500 27387 25641 24541 24322 23989 22949 21742
55458 21742 21091 21142 21673 22299 22510 22232 22164 22867 23840 24273 24322 24715 25439 25808 25610 25220 24823 24444 24478 25203
55438 25203 26058 26430 26845 28200 30035 30866 30240 29265 28984 29409 30342 31951 34054 35763 36415 36259 35922
55421 35922 35793 36161 37286 38935 40248 40437 39481 38082 37086 36848 36888 36365 35043 33469 32025 30360 28248
55404 28248 26355 25451 25330 25205 24812 24362 23836 23089 22330 21741 20945 19629 18356 17909 18111 18125 17682 17262
55386 17262 17232 17584 18295 19190 19717 19584 19374 19797 20654 21272 21546 21730 21606 20827 19773 19072 18567 17792 17164
55367 17164 17555 18738 19401 18839 17706 17015 17249 18468 20438 22499 23938 24603 24642 23963 22651 21616 21837
55350B1837J223R79m9r24j386j424p84K76Q14N29K66M52K57p84j583j052J44O11
55332A9402K09j74j13J46L97M84J07o05r95r21j029j445j258j07R18R54P70J319
55314A8059J972J616N79j6j23n11j085r61mR42J274J034L18p47j606j716j278
55297A7747q65n68j97O6j9j66M0L82L16k59r65j408j297n93J56K87L1L23J265
55278A4276J822J425P62L90j78j187j713j088j27J87K46P94J311Q97o3n41n21
55261A6692o70q40l90M49Q47Q04R68J257R70J40l83k59j8j18m98r79j328j084
55243A5560j20Q17Q88L02o0J11M09N45N41L32p8l05j26k6m63r54p18J05N80K06
55223A7546o70j385j366l32J262K301K132J255M78j16p48j176j108q03o07l27
$$ plain form
55350 21837 23060 24039 23990 23066 21680 20256 19472 19748 20562 21091 21357 21809 22066 21282 19699 18647 18791 19402
55332 19402 19611 19437 19324 19470 19867 20351 20458 19853 18858 17937 16908 15463 14205 14098 15016 15970 16740 18059
55314 18059 20031 21647 22226 22210 22087 21576 20491 19530 19526 20468 21742 22776 23094 22347 20741 19025 17747
55297 17747 16882 16314 16117 16183 16164 15998 16038 16420 16736 16477 15512 14104 12807 12214 12370 12657 12688 13011 14276
55278 14276 16098 17523 18285 18675 18497 17310 15597 14509 14382 14569 14815 15609 16920 17817 17754 17213 16692
55261 16692 16022 15182 14792 15241 16088 16892 17860 19117 20087 20227 19844 19585 19567 19449 18951 17972 16644 15560
55243 15560 15440 16257 17145 17447 17387 17498 17907 18452 18993 19325 19247 18942 18816 18790 18327 17373 16655 16760 17340 17546
55223 17546 16876 15491 14125 13793 15055 17356 19488 20743 21221 21105 20357 19181 18073 17270 16663 16336
55207A6336K01N04K02k29j83J11J78K24O24J052R89O00K29l63j296j773j073J30
55189A6463N65Q9l78l34n5K50O09Q17O64M31M56M63P9m43o91q24j030r20k65K41
55169A6187lm10j31N46Q39R05J351J885J747J153R15R60N78j32m07k44l37o45
55151B4757l83N30J281J500J555J504R44J48J17J207K667L793M690N602O331O631
55135F2874O471N746M337K594J100p5j305k651l748m380m626m577m430m561m924
55120D7845m789l777k611k115j960j405p29p10j113r12Q2J044J444J448J084J84
55104C3010q04j040m92K3P8O3K66M40L75K35K01L67Q24J364J393P77L08O02J121
55085C9111J104Q31R15J035O43K90P40J322P71n35r28O2J196J635J837K150K174
$$ plain form
55207 16336 16537 17041 17243 17014 16831 16942 17120 17344 17968 19020 20009 20609 20838 20475 19179 17406 16333 16463
55189 16463 17028 17117 16739 16405 16350 16600 17209 18026 18690 19121 19577 20040 20119 19676 18985 18161 17131 16211 15946 16187
55169 16187 16184 15774 15643 16189 17028 17933 19284 21169 22916 24069 24984 25944 26522 26390 25983 25739 25402 24757
55151 24757 24374 24904 26185 27685 29240 30744 31688 31836 31953 33160 35827 39620 44310 49912 56243 62874
55135 62874 69345 75091 79428 82022 83122 83047 81742 79091 75343 70963 66337 61760 57330 52769 47845
55120 47845 43056 39279 36668 34553 32593 31188 30459 29749 28636 27724 27806 28850 30294 31742 32826 33010
55104 33010 32206 31166 30674 30697 30775 30838 31104 31544 31919 32154 32355 32722 33546 34910 36303 37080 37388 37990 39111
55085 39111 40215 41046 41961 42996 43639 43929 44669 45991 46762 46227 45299 45361 46557 48192 50029 52179 54353
55068E4353J882J927K302K030P39n99j006n77J46P99R73N05K17J252L366N024
55052G3333N499N605O070O459O183N379M201K445M66o76o87o14j277k084k154
55037A08148j662j302j140q44m65m07r58k206l887n167n248m420l786l753l668
55022F9235l112k533k224j749q53m3K79L78M24L2q25j358j025l40k5j4P5J89J47
55003E6658J84O18J381K252L037L387L054K514K622L365L850L767L897M740N650
54988A00976O039O522Q014J0362J2689J4646J6609J8918K1486K3907K5540K5847
54976B91555K4803K2612J9027J3656P067P51m362q577j2295j5146j6758j7584
54964C04749j8234j8645j8526j7967j7109j5796j4155j2851j2103j1088r032o492
$$ plain form
55068 54353 56235 58162 60464 62494 63233 62634 61628 61051 61197 61996 62969 63474 63691 64943 68309 73333
55052 73333 78832 84437 90507 96966 103149 108528 112729 115174 115640 114964 114277 113663 112386 110302 108148
55037 108148 106486 105184 104044 103200 102735 102328 101370 99164 95277 90110 84862 80442 76656 72903 69235
55022 69235 66123 63590 61366 59617 58764 58721 59000 59378 59802 59834 59009 57651 56626 56286 56261 56247 56322 56511 56658
55003 56658 56842 57460 58841 61093 64130 67517 70571 73085 75707 79072 82922 86689 90586 95326 100976
54988 100976 107015 113537 121551 131913 144602 159248 175857 194775 216261 240168 265708 291555
54976 291555 316358 338970 357997 371653 378720 379471 375109 366532 354237 339091 322333 304749
54964 304749 286515 267870 249344 231377 214268 198472 184317 171466 159363 148275 139243 132751
54952A32751m698l955l468k601j555p82k76L82J536L182N157P473J0222J3048
54938A56416J5186J6468J7759J9741K1538K1494J9100J5211J0447M575k293r040
54926C06602j4533j8471k0866k1601k0943j9729j8533j7208j5547j3708j1702
54915A13761r286o707m829m096l921l516k704j710p69j39J37N94J681K756K648
54900H3900J354O2o48j378k387k854k266j343q42n51k15l34j163j948k087k132
54884F5168k662l088k627j697j224j199j065r35j299j835j697q03J13O44J014
54869D6808J256R07k49j620k213j535j23Q36O82mk44N0K97N29J280K192K061P30
54851E1640l78k13N72R93J187J547J513M96p45r33K4J156J864K305K745L434M713
$$ plain form
54952 132751 128053 124098 120630 118029 116474 115692 115416 115798 117334 120516 125673 133146 143368 156416
54938 156416 171602 188070 205829 225570 247108 268602 287702 302913 313360 317935 315642 306602
54926 306602 292069 273598 252732 231131 210188 190459 171926 154718 139171 125463 113761
54915 113761 104475 97768 92939 88843 84922 81406 78702 76992 76223 76084 76221 76815 78496 81252 83900
54900 83900 85254 85316 84668 83290 80903 78049 75783 74440 73598 73047 72832 72498 71335 69387 67300 65168
54884 65168 62506 59418 56791 55094 53870 52671 51606 50671 49372 47537 45840 45037 45150 45794 46808
54869 46808 48064 48971 48722 47102 44889 43354 43231 44067 44749 44745 44501 44551 44848 45377 46657 48849 50910 51640
54851 51640 51262 51049 51621 52614 53801 55348 56861 57357 56612 55679 55703 56859 58723 61028 63773 67207 71920
54834G1920O418P664P979Q211R419J1462J3499J5394J7543J9683K0993K1260K0972
54821B52417K0259J8528J5189J0162L856k825q611j2669j5255j7113j8442j8793
54809B26703j7814j5701j3111j0828r222p929o480n175m674m696m179k939k019
54796A21936j953j910j184k99K08R25K399M020N206O702R295J2132J3829J4637
54782A85943J5948J8148K0337K1793K2249K1008J7349J1819N905L78m832r304
54770C26741j1971j2488j1595r964p648m802j966N32K649M017M049K756P45j602
54756B79453m321p310j0229j2885j5043j6194j6106j5435j4883j4162j2625j0626
54744A29634r153q339p411o133n132m705m283l417k386j624j186j014j137j428
$$ plain form
54834 71920 78338 86002 93981 102192 111611 123073 136572 151966 169509 189192 210185 231445 252417
54821 252417 272676 291204 306393 316555 320411 317586 308975 296306 281051 263938 245496 226703
54809 226703 208889 193188 180077 169249 160027 152098 145618 140443 135769 131073 126894 123955 121936
54796 121936 119983 118073 116889 116590 116798 117723 120122 124142 129348 136050 145345 157477 171306 185943
54782 185943 201891 220039 240376 262169 284418 305426 322775 334594 340499 340877 336045 326741
54770 326741 314770 302282 290687 280723 273075 268273 266307 266839 269488 273505 277554 280310 281055 279453
54756 279453 275132 267822 257593 244708 229665 213471 197365 181930 167047 152885 140260 129634
54744 129634 120481 112142 104731 98598 93466 88761 84478 81061 78675 77051 75865 74851 73714 72286
54730G2286j601j486r80n7Q08P15m88j619j571p63l02k58J1L55M4o95q09j04N45
54711F4031O95P56Q05L98k34j71O03R33L80k1M30Q48K59o75o20M65J406J479J042
54692G2809P29Q21J346K126K771L032L049L026K886K598K563L220M290M938M717
54677A14921M104L844L938L636K524J316J101J970K903L148K995K998L180L464
54663A56042M215N629P145Q207R173J0761J2962J5304J7841K0979K4545K7768
54651C20571L0035L0979L0017K6653K1039J3588M450n866j5784k3582k8767l1681
54639C71652l2251l0359k7103k4227k2218k0213j7786j5479j3509j1323q879o963
54627A41342n812m631l069j963j920k235k052j689j894k516k804k581k302k298
$$ plain form
54730 72286 70685 69199 68219 68162 68970 69685 69197 67578 66007 65244 64942 64684 64695 65050 65094 64399 63590 63486 64031
54711 64031 64726 65482 66287 66685 66451 66280 66883 67816 68196 68175 68605 69453 69712 69037 68417 68882 70288 71767 72809
54692 72809 73538 74359 75705 77831 80602 83634 86683 89709 92595 95193 97756 100976 105266 110204 114921
54677 114921 119025 122869 126807 130443 132967 134283 135384 137354 140257 143405 146400 149398 152578 156042
54663 156042 160257 165886 173031 181238 190411 201172 214134 229438 247279 268258 292803 320571
54651 320571 350606 381585 411602 438255 459294 472882 477332 471466 455682 432100 403333 371652
54639 371652 339401 309042 281939 257712 235494 215281 197495 182016 168507 157184 148305 141342
54627 141342 135530 130899 127830 125867 123947 121712 119660 117971 116077 113561 110757 108176 105874 103576
54613A03576k512k756k785k367j666j183j082j039r26j046j384j313n68R3k05
54598H2837j280k192k351j869j067k70P0l45j172j643j397r06q84j333j457o95
54582F4046L90P39K19k24n6O1m98j114q72l0M53M85P58J323J533J278J132J189
54564G0812R78O35R14J743K019J336O71P84J127J159J596L246N308O171N603N039
54548A09141N754P518R193J0049J0316J0760J1921J3590J4965J5335J4532J2751
54536B45825J0145O631K043l338q405j1778j3141j3588j4144j4358j3232j1134
54524A61526r671r573r774q989p344n903n197m821m172l191k348k048k054j709
54510H4732q98l08l85n97l69j00l90p66l56N28P10J7m88k25J17k08j058j890k293
$$ plain form
54613 103576 101064 98308 95523 93156 91490 90307 89225 88186 87260 86214 84830 83517 82949 83042 82837
54598 82837 81557 79365 77014 75145 74078 73808 73878 73533 72361 70718 69321 68415 67531 66198 64741 64046
54582 64046 64436 65175 65394 65170 65114 65175 64677 63563 62691 62661 63114 63599 64357 65680 67213 68491 69623 70812
54564 70812 71790 72425 73339 75082 77101 78437 79108 79892 81019 82178 83774 87020 92328 98499 104102 109141
54548 109141 114895 122413 131606 141655 151971 162731 174652 188242 203207 218542 233074 245825
54536 245825 255970 262601 264644 261306 252901 241123 227982 214394 200250 185892 172660 161526
54524 161526 151855 142282 132508 123519 116175 110272 105075 100254 96082 92891 90543 88495 86441 84732
54510 84732 83834 83526 83141 82544 82175 82075 81685 80919 80563 81091 81801 81818 81330 81105 81222 81014 79956 78066 75773
54491G5773j880o95K91M5j008j502j150r78j417j600r76k12N6J29L03K60jJ68
54473F5606Q39J109O11J98M09M92j61q69q40m28j98J16O97P42k67j359j389p50
54455F4558n59q67r06n21j43J57M07J71o61j054q1J469J996J238K86k04n43q85
54437F3858q48l45J65L45J21o45j750k188j128P35J819J623J072R58J060J006
54421F5858R72J142J326J483J970K862L542L396K615J939J805K015K104J900J588
54406I6517J311R30L06l15o55r43j536k076j871j194j216k326l387l291k337j440
54390G6477p93k03P0k37o64o68n22o69p24j40N73M17m90j029o97j34N2J1Q7K80
54370G0997M87P35R80J062R36P29O05Q05J474K223K331J722J236J471J930J881
$$ plain form
54491 75773 73893 73198 73489 73534 72526 71024 69874 68896 67479 65879 64903 64691 64747 64876 65179 65439 65438 65606
54473 65606 66445 67554 68165 68363 68772 69264 69103 68234 67394 66966 66768 66884 67581 68323 68056 66697 65308 64558
54455 64558 63999 63132 62226 61705 61562 61719 62126 62297 61636 60582 60501 61970 63966 65204 65490 65286 64743 63858
54437 63858 63010 62665 62830 63175 63296 62651 60901 58713 57585 58320 60139 61762 62834 63792 64852 65858
54421 65858 66830 67972 69298 70781 72751 75613 79155 82551 85166 87105 88910 90925 93029 94929 96517
54406 96517 97828 98758 99064 98749 98094 97151 95615 93539 91668 90474 89258 86932 83545 80254 77917 76477
54390 76477 75684 75481 75551 75314 74650 73982 73460 72791 72067 71927 72500 72917 72427 71398 70701 70567 70619 70630 70717 70997
54370 70997 71484 72219 73199 74261 75197 75926 76531 77336 78810 81033 83364 85086 86322 87793 89723 91604
54354I1604J455J190J070P73M12K07j11p90j416j526j401j466j465j143j084j815
54338H4494k614k442j637j339j647j675j221r45r67p55m38p69j585j736r02r4
54322F3728Q2K62Q21R08j11j362j619r96m60l13j58L9j47p05j075r00m41j26j27
54303E7300l75p29r57p63k2Q96J140J61j429k152j262L07J036O03p9k83j64m4
54285E3184J63N72R57J048Q49N48L58M69Q02Q93L99l56p39n95k31J09L25K21k04
54266E8772m55j20M36N78M04M97Q68R70O95N08N45M49J29k9R7K17K30L08L11p8
54246F5332o04o15j56O3j49k36j30n45j582k076j155L25Q49K45l37j11M99P15
54228F0332M25O2j18l15p82j311j356o90K98J176J957K703K943K182P37m92j071
$$ plain form
54354 91604 93059 94249 95319 96092 96504 96711 96600 95810 94394 92868 91467 90001 88536 87393 86309 84494
54338 84494 81880 79438 77801 76462 74815 73140 71919 70974 70007 69252 68814 68045 66460 64724 63822 63728
54322 63728 63810 64072 64893 65801 65690 64328 62709 61713 61253 60940 60782 60821 60674 59969 58894 57994 57553 57427 57300
54303 57300 56925 56196 55239 54476 54454 55350 56490 56651 55222 53070 51808 52115 53151 53754 53675 53392 53228 53184
54285 53184 53347 53919 54876 55924 56773 57321 57679 58148 58950 59843 60242 59886 59147 58552 58321 58430 58755 58976 58772
54266 58772 58317 58197 58633 59211 59615 60112 60980 61950 62645 63153 63698 64147 64276 64247 64344 64561 64791 65099 65410 65332
54246 65332 64728 64113 63957 64020 63871 63635 63505 62960 61378 59302 58147 58472 59321 59566 59229 59118 59617 60332
54228 60332 60757 60819 60701 60386 59604 58293 56937 56247 56545 57721 59678 62381 65324 67506 68243 67751 66680
54211F6680j173q60J2J066J413O62o29j699k230k153j470n53m7j70m94n54l20
54194E7481L1K87J12o48j511j713j153m37j9J16o5o60j290j309q26o44j022j295
54176D5435j074q86j173j469j246p80n29k09O95J831K207J409P0q69r92n99k54
54159D1567j82n0M60J080J299J088P21J21q05j348n80J037J769Q62m44p26k86
54142D5583l39j045j409q19L37J373J942K022J837J699J577J081J52o15p72o61
54126E1943p67q40l47N30J061R82O78M84L26K8m87j188j876k130j767j064l39
54109D5227M39J238J552R33k16j001j035o56k95p0O8K56O73J230J421R16J87K6
54091E0893N05R06O99J12l96p55j114j347j062j29J004J650J591J306J306J397
$$ plain form
54211 66680 65507 64647 64659 65725 67138 67800 67171 65472 63242 61089 59619 59066 59019 58849 58355 57801 57481
54194 57481 57512 57799 57911 57263 55752 54039 52886 52449 52430 52546 52481 51821 50531 49222 48396 47752 46730 45435
54176 45435 44361 43475 42302 40833 39587 38807 38278 38069 38764 40595 42802 44211 44281 43412 42420 41821 41567
54159 41567 41385 41335 41795 42875 44174 45262 45983 46104 45299 43951 43371 44408 46177 47039 46595 45869 45583
54142 45583 45244 44199 42790 41971 42308 43681 45623 47645 49482 51181 52758 53839 53991 53376 52604 51943
54126 51943 51176 50336 49989 50519 51580 52562 53240 53724 54050 54078 53591 52403 50527 48397 46630 45566 45227
54109 45227 45666 46904 48456 49389 49173 48172 47137 46481 46186 46116 46184 46440 47113 48343 49764 50680 50867 50893
54091 50893 51398 52304 53003 53115 52719 51964 50850 49503 48441 48312 49316 50966 52557 53863 55169 56566
54075E6566J024L13J47R30J874K012J463J089J142J033M43n3K43J208K035K128
54059G3597J576R04N76P00J100J558J904J940J522Q29L36L18M36J60n16r82o50
54042H5308M68J892L107L819M012L971M160M769N347N183M229L451L836N248O615
54027A45415P225P242O867N806M026K401J877K305K766K845K791K670K186J405
54013A97827Q34O10K39n17j221j472j570k066l020m051m794n096n022m846m792
53998A61043m729m392l886l565l438l182k807k731l085l402l271k833k423k096
53984A15203j730j302q73n55n03p41j015j163j404j865k140j865j487j602j857
53969I5101j428n34k77r09j381r37l1P22J386J987K032J428Q97Q39P09K19R8Q33
$$ plain form
54075 56566 57590 57903 58050 58980 60854 62866 64329 65418 66560 67593 68036 67983 68226 69434 71469 73597
54059 73597 75173 76077 76653 77353 78453 80011 81915 83855 85377 86206 86542 86860 87296 87456 86940 85958 85308
54042 85308 85776 87668 90775 94594 98606 102577 106737 111506 116853 122036 126265 129716 133552 138800 145415
54027 145415 152640 159882 166749 172555 176581 178982 180859 183164 185930 188775 191566 194236 196422 197827
54013 197827 198661 199271 199510 198993 197772 196300 194730 192664 189644 185593 180799 175703 170681 165835 161043
53998 161043 156314 151922 148036 144471 141033 137851 135044 132313 129228 125826 122555 119722 117299 115203
53984 115203 113473 112171 111298 110743 110240 109499 108484 107321 105917 104052 101912 100047 98560 96958 95101
53969 95101 93673 93139 92862 91953 90572 89635 89604 90326 91712 93699 95731 97159 98056 98895 99604 99823 99921 100754
53951A00754J710K045K457L720N174N642N359N561O514P277P294O993O854O952
53937A74306P409Q206Q585P639N601L603K060L67j666l168l466l089k912k954
53923B00521k624j669l87Q78J986K914L649M150M404M568M925N462N784N774O055
53908B46390P180Q574Q958P929O437N445M784L657J874Q1j003j332j525k212l329
53893B91908m113m026l489l447m222n219n805o018o293o821p407p729p540o827
53879B12952n962n537n806o289o180n184l868l003k715k549k381k731l803m701
53865A52243m334l002k202k680l442l212k110j312j447k040k304j966j329r63
53851A19900j182j607j430m05O79Q87J86p28j361j710j860j790j546j280j122
$$ plain form
53951 100754 102464 104509 106966 110686 115860 121502 126861 132422 138936 146213 153507 160500 167354 174306
53937 174306 181715 189921 198506 206145 211746 215349 217409 217776 216110 212942 209476 206387 203475 200521
53923 200521 197897 196228 195841 196719 198705 201619 205268 209418 213822 218390 223315 228777 234561 240335 246390
53908 246390 253570 262144 271102 279031 285468 290913 295697 299354 301228 301309 300306 298974 297449 295237 291908
53893 291908 287795 283769 280280 276833 272611 267392 261587 255569 249276 242455 235048 227319 219779 212952
53879 212952 206990 201453 195647 189358 183178 177994 174126 171123 168408 165859 163478 160747 156944 152243
53865 152243 147909 144907 142705 140025 136583 133371 131261 129949 128502 126462 124158 122192 120863 119900
53851 119900 118718 117111 115681 115276 115955 116842 117028 116300 114939 113229 111369 109579 108033 106753 105631
53836A05631j228j711k300k401j735p01J65O85Q31M96j02l34L8M08K29n0K97J039
53818I9257J268O96l0l49k98o8L36Q45J265J598K078K765L426L799L792L559L539
53801A27478M149N142N621N091M220M033M662N395N670N471M978M382L955L728
53787A93975L340K534J604Q96K90l03m00K96R77N40r38k390l294l979m530m478
53771A84140l828l421l855m733n345n475n191m506l608k963k788k774k588k293
53757A30772k109k082k133k159j991j572j199j188j430j641j910k466k989k873
53743A03030k183j619j432j121m83j16m56r44p91k01j33r72j994k186j365l22
53727H6712k7o65j532j791j233k43O25R34N43j56l87K06J113J582J432R01J07
$$ plain form
53836 105631 104403 102692 100392 97991 96256 95555 95720 96405 97236 97732 97630 97296 97334 97742 97971 97921 98218 99257
53818 99257 100525 101221 101191 100842 100544 100476 100812 101657 102922 104520 106598 109363 112789 116588 120380 123939 127478
53801 127478 131627 136769 142390 147481 151701 155734 160396 165791 171461 176932 181910 186292 190247 193975
53787 193975 197315 199849 201453 202349 202639 202336 201936 202232 203209 203749 202811 200421 197127 193148 188618 184140
53771 184140 180312 176891 173036 168303 162958 157483 152292 147786 144178 141215 138427 135653 133065 130772
53757 130772 128663 126581 124448 122289 120298 118726 117527 116339 114909 113268 111358 108892 105903 103030
53743 103030 100847 99228 97796 96675 96192 96076 95620 94676 93885 93684 93551 92579 90585 88399 87034 86712
53727 86712 86685 86020 84488 82697 81464 81221 81846 82780 83323 83167 82780 82986 84099 85681 87113 88014 88121
53710H8121p52j126p12r4k5k97j37M39O50L14J98P23J302J356J203J479K167K771
53692I7580K972K784K384K053J957J853J420R54J156K031K616K206J318J001J590
53677A25875K626L576M170M153L319J913P31O23J753L362M354M324L839L621L738
53662A71977L819L669L275K512J497Q83J144J717J649R63N25N87M44k31o98k85
53646A93447N67R24N37j44p09j062j224j250j222j107q05l89m0K37M37K49n58
53629A87888j528j882j574j289j360j380j114r49j078r83k49O36Q44K05p88j594
53613A73805j879j483n95L04Q82J194J350J336J293J550K117K618K862K982K898
53598A91234K243J197P17J365K394K644K057J660K214L453M674N514N956N910
$$ plain form
53710 88121 87369 86243 85531 85437 85412 85115 84978 85417 86067 86381 86579 87302 88604 89960 91163 92642 94809 97580
53692 97580 100552 103336 105720 107773 109730 111583 113003 113957 115113 117144 119760 121966 123284 124285 125875
53677 125875 128501 132077 136247 140400 143719 145632 146363 146986 148739 152101 156455 160779 164618 168239 171977
53662 171977 175796 179465 182740 185252 186749 187632 188776 190493 192142 193105 193630 194217 194661 194430 193732 193447
53646 193447 194014 194938 195475 195331 194622 193560 192336 191086 189864 188757 187952 187563 187523 187760 188197 188446 187888
53629 187888 186360 184478 182904 181615 180255 178875 177761 176812 175734 174751 174502 175138 175982 176187 175399 173805
53613 173805 171926 170443 169848 170152 171034 172228 173578 174914 176207 177757 179874 182492 185354 188336 191234
53598 191234 193477 194674 195391 196756 199150 201794 203851 205511 207725 211178 215852 221366 227322 233232
53584B33232N227M093L197L149L783M352M516M697N137N266M599L751L707M310
53570B93016M473L857L331L604M271M570M260L488K481J722J724K236K294J399
53556C36726J06q39j325j508j375j101j201j792k242k023j478j238j395j682k094
53541C15539k767l541m081m204l888l257k727k738l136l203k543j496n94j03k07
53526B77054r69j896k178j698j128q00k52P46J515J473J116J287J921K185J656
53511B80032Q30O23J580L320M656M732M148M331N693P114P548P336P464Q231R232
53496C56870J0070J0626J0976J1441J2281J3178J3587J3723J4392J5731J7056
53485D99931J8134J9478K1101K2215K2699K3556K5126K6218K5940K5178K5088
$$ plain form
53584 233232 238459 242552 245749 248898 252681 257033 261549 266246 271383 276649 281248 284999 288706 293016
53570 293016 297489 301346 304677 308281 312552 317122 321382 324870 327351 329073 330797 333033 335327 336726
53556 336726 336832 335993 334668 333160 331785 330684 329483 327691 325449 323426 321948 320710 319315 317633 315539
53541 315539 312772 309231 305150 300946 297058 293801 291074 288336 285200 281997 279454 277958 277364 277261 277054
53526 277054 276085 274189 272011 270313 269185 268385 268133 268879 270394 271867 272983 274270 276191 278376 280032
53511 280032 280862 281485 283065 286385 291041 295773 299921 304252 309945 317059 324607 331943 339407 347638 356870
53496 356870 366940 377566 388542 399983 412264 425442 439029 452752 467144 482875 499931
53485 499931 518065 537543 558644 580859 603558 627114 652240 678458 704398 729576 754664
53474G54664K5295K4949K4607K5453K7368K9230L0703L2281L3961L5227L6110
53463A079848L6973L7455L6838L5181L3030L0303K6789K3351K1154J9853J8039
53452A398814J5567J3939J4162J5565J7161J8840K0627K1958K2375K2120K1441
53441A602569K0023J7750J5290J3232J1094P911L566r31m497o983r121j1564j4137
53428A644202j6181j7617j9199k1494k4058k6101k7482k8537k9325k9650k9590
53417A374968k9403k9187k9122k9654l0828l1843l1963l1441l0825k9818k7771
53406A043113k4949k2344k0290j8278j5926j3338j0549p510m598k239j37K390
53394I05345N336Q129J0609J2998J5051J6291J7088J8451K0596K2651K3888K4462
$$ plain form
53474 754664 779959 804908 829515 854968 882336 911566 942269 974550 1008511 1043738 1079848
53463 1079848 1116821 1154276 1191114 1226295 1259325 1289628 1316417 1339768 1360922 1380775 1398814
53452 1398814 1414381 1428320 1442482 1458047 1475208 1494048 1514675 1536633 1559008 1581128 1602569
53441 1602569 1622592 1640342 1655632 1668864 1679958 1687869 1691435 1690504 1686007 1679024 1669903 1658339 1644202
53428 1644202 1628021 1610404 1591205 1569711 1545653 1519552 1492070 1463533 1434208 1404558 1374968
53417 1374968 1345565 1316378 1287256 1257602 1226774 1194931 1162968 1131527 1100702 1070884 1043113
53406 1043113 1018164 995820 975530 957252 941326 927988 917439 909929 905331 903092 902955 905345
53394 905345 910681 918810 929419 942417 957468 973759 990847 1009298 1029894 1052545 1076433 1100895
53382A100895K4779K5035K5517K6557K8009K9446L0985L3158L5962L8825M1568
53371A440736M4532M7800N1034N4152N7306O0161O2127O3363O4618O6078O7361
53360B079268O8601P0395P2425P3407P2740P1088O8952O5964O2105N8416N5781
53349B819142N3931N2380N1433N1469N2109N2899N4085N5748N6836N5948N2710
53338C408690M7509M0256L0245J7131J479j5534l2403m7521n9710o8683p4828
53327C246631p8677q0687q1332q1163q0813q0843q1228q1167p9893p7730p5805
53316B367293p4885p4912p5597p6584p7123p6456p4712p2631p0340o7270o3414
53305A563369n9628n6303n2712m8175m3013l7871l2874k7986k3475j9505j5944
$$ plain form
53382 1100895 1125674 1150709 1176226 1202783 1230792 1260238 1291223 1324381 1360343 1399168 1440736
53371 1440736 1485268 1533068 1584102 1638254 1695560 1755721 1817848 1881211 1945829 2011907 2079268
53360 2079268 2147869 2218264 2290689 2364096 2436836 2507924 2576876 2642840 2704945 2763361 2819142
53349 2819142 2873073 2925453 2976886 3028355 3080464 3133363 3187448 3243196 3300032 3355980 3408690
53338 3408690 3456199 3496455 3526700 3543831 3545310 3529776 3497373 3449852 3390142 3321459 3246631
53327 3246631 3167954 3087267 3005935 2924772 2843959 2763116 2681888 2600721 2520828 2443098 2367293
53316 2367293 2292408 2217496 2141899 2065315 1988192 1911736 1837024 1764393 1694053 1626783 1563369
53305 1563369 1503741 1447438 1394726 1346551 1303538 1265667 1232793 1204807 1181332 1161827 1145883
53294A145883j2942j0960r829q687p268o352o306o240n372m301l991m239m128
53281A055268l420k487j387j5J239J967K588L895N930Q115J0149J2073J3737J5025
53267A122677J6337J8066J9805K0853K1342K2088K3469K5223K7178K9350L1336
53256A377724L2391L2371L2003L2111L2887L3965L4801L5049L4937L5120L5756
53245A749115L5926L4441L1139K6820K2091J6810J0755M285j953p627j2963j8442
53233A890397k4298l0253l5784m0597m4574m7420m8834m9161m9171m8967m7805
53222A423533m5364m2452l9902l7502l4825l2468l1497l1948l2957l4173l6071
53211A024374l8819m1693m3760m4527m3826m1746l8864l5946l3194l0191k6708
$$ plain form
53294 1145883 1132941 1121981 1112152 1103465 1096197 1089845 1083539 1077299 1071927 1067626 1063635 1059396 1055268
53281 1055268 1051848 1049361 1047974 1047959 1049198 1051165 1053753 1057648 1063578 1071693 1081842 1093915 1107652 1122677
53267 1122677 1139014 1157080 1176885 1197738 1219080 1241168 1264637 1289860 1317038 1346388 1377724
53256 1377724 1410115 1442486 1474489 1506600 1539487 1573452 1608253 1643302 1678239 1713359 1749115
53245 1749115 1785041 1819482 1850621 1877441 1899532 1916342 1927097 1931382 1929429 1921802 1908839 1890397
53233 1890397 1866099 1835846 1800062 1759465 1714891 1667471 1618637 1569476 1520305 1471338 1423533
53222 1423533 1378169 1335717 1295815 1258313 1223488 1191020 1159523 1127575 1094618 1060445 1024374
53211 1024374 985555 943862 900102 855575 811749 770003 731139 695193 661999 631808 605100
53200F05100k3092j9755j6696j3736j0945q685p271o706o617o637o925p951r588
53187D60496j0884j1191j1046j1286j1768j1748j1283j1198j1609j1510j0237
53176C36736q512p520p429p416o857n945n229n035n350n973o557o731o276n424
53162B46482m788m838n323n422m684l579k908k803k692k196j694j809k510k951
53148A98285k276o05Q80R95l08j937k763k477j505l79N31J016R44K67q37j803
53132A88028j957j332q50j163j657j377o89q91k099k866k268j197p67o97k32K89
53116A68275J04m07k19N91R51N03lk6J58L20P50J548K364K986L464L467K442O62
53098A87930o62p57j15L37K56k54j073j942k417k430k464k815l176l298l528m167
$$ plain form
53200 605100 582008 562253 545557 531821 520876 512191 504920 498214 491597 484960 478035 470084 460496
53187 460496 449612 438421 427375 416089 404321 392573 381290 370092 358483 346973 336736
53176 336736 328224 320704 313275 305859 299002 293057 287828 282793 277443 271470 264913 258182 251906 246482
53162 246482 241694 236856 231533 226111 221427 217848 214940 212137 209445 207249 205555 203746 201236 198285
53148 198285 196009 195404 196284 197279 196971 195034 192271 189794 188289 187910 188441 189457 190401 190668 189831 188028
53132 188028 186071 184739 183889 182726 181069 179692 179003 178112 176013 173147 170879 169682 168915 168218 167986 168275
53116 168275 168379 167972 167753 168344 169295 169798 169795 169769 169927 170247 170997 172545 174909 177895 181359 184826 187268 187930
53098 187930 187268 186511 186396 186733 186989 186735 185662 183720 181303 178873 176409 173594 170418 167120 163592 159425
53082A59425m732m519l687l158l449m122m398l938k979j964j291j129j335j520
53068A17204j357r06o22r21j708k353k270j444l90L18M16N8l11l11k0Q4k81p87
53050A04399q26k07O65J171J002L64j74k39q3k44p56j092r66p28o79n09Q4O83
53032A01865O18j04r02j415j689j695j336q20m77k41K37Q74J152Q47L09r8m20
53015I6705q57j421j980k286k023j161l26l31j171j859j472k20P88P37j10p57
52999H2256n82J5J65l36p89n37K22P88P72L59MJ28P44J268J115N82N48J022R32
52980H8676j13q18j0J429J737Q99N34J308K066J833J185R87J022O72R7j88j85
52963A01131o4N05J803L205L704L183K540K572L253M016M278L712K462J187N69
$$ plain form
53082 159425 154693 150174 146487 143329 139880 135758 131360 127422 124443 122479 121188 120059 118724 117204
53068 117204 115847 114941 114319 113398 111690 109337 107067 105623 105233 105551 105967 106025 105714 105403 105383 105467 105186 104399
53050 104399 103573 103366 104031 105202 106204 106568 106394 106155 106072 105828 105072 103980 103014 102286 101607 101098 101182 101865
53032 101865 102483 102379 101477 100062 98373 96678 95342 94522 94045 93804 94041 94915 96067 96914 97223 97125 96705
53015 96705 95848 94427 92447 90161 88138 86977 86651 86320 85149 83290 81818 81598 82386 83123 83013 82256
52999 82256 81674 81689 81854 81518 80729 80192 80414 81202 81974 82333 82337 82465 83209 84477 85592 86174 86722 87744 88676
52980 88676 88563 87745 87735 89164 90901 91800 92334 93642 95708 97541 98726 99713 100735 101407 101504 101316 101131
52963 101131 101067 101572 103375 106580 110284 113467 116007 118579 121832 125848 130126 133838 136300 137487 138056
52948A38056O15O54J37p14j253j298j403k089l011l246k435j204l46m1r9m56j045
52931A20822j505j546j302r66m29K48N33J85j46J71P20P09K67L9q1n63q78KJ690
52912A17970K440J543K57j62L7K31O64J528J921J073k20n98n7L79L81M41N97L10
52894A28735l63o75m29l33q07j279j023m9J119J974K050J068m77j407j050o8L22
52877A27308j82p07m16M77J077R53O29Q86J802K659K718J942R60M92Q14J561K093
52860A45066K090J753J316O28m40j417j664j285j003j082j045p02o49j333k143
52845A38090k125j216k13K61J77k59p95j030o99m3N01R49J632K433K709K096J049
52828A43517K82j2j63m47p80r65j016j170j560k004k192k092j998k148k390k375
$$ plain form
52948 138056 138671 139325 139462 138748 137495 136197 134794 132705 129694 126448 124013 122809 122463 122422 122323 121867 120822
52931 120822 119317 117771 116469 115503 115074 115322 115855 116040 115894 116065 116785 117494 117761 117800 117719 117156 116278 116280 117970
52912 117970 120410 121953 122210 122048 122085 122316 122980 124508 126429 127502 127282 126684 126627 127006 127387 127828 128425 128735
52894 128735 128372 127697 127268 126935 126128 124849 123826 123777 124896 126870 128920 129988 129511 128104 127054 126986 127308
52877 127308 127126 126419 126003 126480 127557 128510 129139 130025 131827 134486 137204 139146 140106 140598 141412 142973 145066
52860 145066 147156 148909 150225 150853 150413 148996 147332 146047 145044 143962 142917 142215 141566 140233 138090
52845 138090 135965 134749 134536 134797 134974 134715 133920 132890 132191 132148 132649 133598 135230 137663 140372 142468 143517
52828 143517 143799 143787 143624 143177 142397 141432 140416 139246 137686 135682 133490 131398 129400 127252 124862 122487
52812A22487k011j549j282j221j154r41p37p80j034j188j113j118j520k100k294
52797A02445j800q39J03N49K50m48o88jR81J254P73L81M45M11r7o17p51j002j953
52778I9396l158l592l068k376k109j952j372m87O9K2j47J67P93Q70J11m95J69
52761H2841J655K294J374Q1j88L97O51P8q74j784k592l059k847k180j691j533
52745G2623j274p61m61o86j042r71m85k2J20l3l40o74r53j150j209r56k94N02
52727F1934R29P83L75J01M5P7J20J36M0j97m02m28l99n74q54p22O9R71J098K92
52707F3394o06o93mO57P43M69L77O62J041J141R05O55O68P64N69K33M68J536K619
52688G5598K740K052J567J749K106K128J941J796J596J251R06N79k9r72j776k039
$$ plain form
52812 122487 120476 118927 117645 116424 115270 114329 113592 112812 111778 110590 109477 108359 106839 104739 102445
52797 102445 100645 99806 99909 100458 100708 100260 99572 99571 100552 101806 102579 102960 103405 103816 103719 103102 102351 101349 99396
52778 99396 96238 92646 89578 87202 85093 83141 81769 81282 81351 81373 81226 81393 82186 83056 83167 82672 82841
52761 82841 84496 86790 88164 88245 88057 88454 89105 89183 88309 86525 83933 80874 78027 75847 74156 72623
52745 72623 71349 70588 70127 69441 68399 67428 66943 66921 67041 67008 66668 65994 65041 63891 62682 61726 61432 61934
52727 61934 62863 63646 64021 64122 64167 64244 64364 64500 64540 64343 63941 63513 63114 62540 61686 60964 61033 62004 63102 63394
52707 63394 62788 62095 62091 62748 63491 63960 64337 64999 66040 67181 68086 68741 69409 70173 70742 70975 71443 72979 75598
52688 75598 78338 80390 81957 83706 85812 87940 89881 91677 93273 94524 95430 96009 95980 95008 93232 91193
52672I1193j947j931k118k349k393j942q42M56J180J164J033J191J296J040Q00
52657H5831R61J155P87j7o87j039j296j516j579j523j426j193q60p97j114j264
52641G4423q09j48J24J99O22J212J327J041J060J435J379N97r3R2P98J096P04
52624H5059J26j09Q7M84P79P72N29L29L56M90M61J49k65m03j2P06J224J263J113
52605I3138J170J381J393J068N65L2m55p35o97n27m76m42n9P45J537J760J231
52588A00629L57j47O0M52J97o80j129m52P01J211R45O08N65N71N75Q68J356J469
52570A08156J052P19R57J430J513J097N77K71J92K15K48L22N39Q19Q88O75N42
52553A20212P39Q56L41n16q24l72K8k34o16k47P78J476J245N24J23K39K90l17
$$ plain form
52672 91193 89246 87315 85197 82848 80455 78513 77671 78127 79307 80471 81504 82695 83991 85031 85831
52657 85831 86792 87947 88734 88717 88030 86991 85695 84179 82600 81077 79651 78458 77598 76801 75687 74423
52641 74423 73614 73466 73590 73789 74411 75623 76950 77991 79051 80486 81865 82462 82369 82461 83259 84355 85059
52624 85059 85185 85076 85163 85647 86426 87198 87727 88056 88412 88902 89363 89512 89247 88844 88832 89538 90762 92025 93138
52605 93138 94308 95689 97082 98150 98715 98747 98292 97557 96860 96333 95857 95415 95356 96101 97638 99398 100629
52588 100629 100986 100839 100899 101351 101548 100868 99739 99287 99988 101199 102144 102752 103317 103888 104463 105331 106687 108156
52570 108156 109208 109927 110884 112314 113827 114924 115501 115772 115964 116179 116427 116749 117288 118107 118995 119670 120212
52553 120212 120951 121807 122148 121632 120808 120436 120464 120230 119614 119367 120145 121621 122866 123390 123513 123752 124042 123725
52535A23725j439k296k289j526n00M03R15P29j27r48r22q6P01P55J83n38j054
52518A15686j198r30n04l01l64l98k81k66m96p17o34k89J67O57J005R18M02q9
52500A12368k03j71l99q42j095r71o31k08L34R00J127P73R6l76m10k58k81n15
52482A09238q09j111j413j438q71M9N42K18l76m47K2L43O7n84j120j244r38l89
52464I9739J30N23R60J447J570J059L65K13N93Q19N93M49R14J675J946J412N26
52447A14933j9N9M05M54J36M6O28J404J456O54r1QO64J049R24P82J004J320J273
52428A27089R13P48J004J221Q42J2n44m39k8K10K34J54j23o18r43p77l90k83m71
52409A27811n41k67K06O28P50L90k34n32l20j31l49m69L0N98L30m99p40j01N08
$$ plain form
52535 123725 122286 119990 117701 116175 115675 116078 116993 117722 117595 116647 115725 115639 116340 117095 117278 116740 115686
52518 115686 114488 113558 113054 112753 112389 111991 111710 111444 110948 110231 109597 109308 109475 110132 111137 112055 112457 112368
52500 112368 112165 111994 111595 110753 109658 108687 108056 107848 108182 109082 110209 110982 111078 110702 110292 110034 109753 109238
52482 109238 108429 107318 105905 104467 103596 103645 104187 104405 104029 103582 103604 103947 104014 103430 102310 101066 100128 99739
52464 99739 99869 100392 101352 102799 104369 105428 105793 106006 106599 107418 108011 108460 109374 111049 112995 114407 114933
52447 114933 114914 114973 115378 115832 115968 116014 116642 118046 119502 120156 120065 120073 120737 121786 122710 123492 124496 125816 127089
52428 127089 128002 128750 129754 130975 131817 131829 131285 130846 130818 131028 131262 131416 131293 130675 129732 128955 128565 128282 127811
52409 127811 127270 127003 127209 127837 128587 128977 128743 128211 127891 127760 127411 126942 126972 127570 127900 127401 126661 126560 127068
52390A27068M65J79N7j51n24m72K57R02P65K89K87N88M25j48j46Q72K007K033
52372A34753Q54m31p44j03O20Q11P27R67J688K551L083K908J913O26Q2P26J730
52355A52761K036J743J691J932J630N35m81o51j27O37J500K214K278J760J490
52340A70948J960K567K546J912J066J23p71j089o17L4K06J05K29M35K35l22p69
52323A78798r33r21o88k46j8l12p11o30k42j29k19J46J051J704J473P36M38J080
52305A80377K298L195L183K608K427L048L804L926L706M140N486O802P014O110
52291B38124N048M717N125N579N568N330N400N740N809N487N381N977O976P760
52277C18021Q065P958P585P303P545Q177Q487Q206P994Q407Q989R121R112R606
$$ plain form
52390 127068 127533 127712 127769 127618 127094 126622 126879 127781 128546 128835 129122 129710 130135 129987 129841 130713 132720 134753
52372 134753 135607 135176 134432 134329 134949 135760 136487 137454 139142 141693 144776 147684 149597 150223 150305 151031 152761
52355 152761 154797 156540 158231 160163 161793 162328 161847 161196 161069 161706 163206 165420 167698 169458 170948
52340 170948 172908 175475 178021 179933 180999 181122 180351 179262 178645 178679 178885 178990 179219 179654 179889 179567 178798
52323 178798 177865 176944 176256 176010 175992 175680 174969 174339 174097 173968 173749 173895 174946 176650 178123 178859 179297 180377
52305 180377 182675 185870 189053 191661 194088 197136 200940 204866 208572 212712 218198 225000 232014 238124
52291 238124 243172 247889 253014 258593 264161 269491 274891 280631 286440 291927 297308 303285 310261 318021
52277 318021 326086 334044 341629 348932 356477 364654 373141 381347 389341 397748 406737 415858 424970 434576
52263D34576J0342J0521J0153J0029J0408J0736J0770J0961J1478J1646J0858
52252E52478R457Q340Q062Q589R439R936R608Q609P503O571N708M943M498M242
52238F57983L680K733J970J726J538R38L58O09J587K197J767R48Q94J792K717
52223F83437K876K571K648L366M274M977N546O128O696P317Q206R280J0070J0360
52209G67752J0537J0966J1420J1439J0939J0100R112Q342Q336R024R386Q520O802
52196H92675N320M419L571K495J538Q82J54q70j820k348k700l406m574n819o670
52181H82847o999p168p707q641r327r247q786q763r304r733r579r095q722q489
52167G61287q193p756p175o456n735n286n191n242n176m914m557m303m244m107
$$ plain form
52263 434576 444918 455439 465592 475621 486029 496765 507535 518496 529974 541620 552478
52252 552478 561935 570275 578337 586926 596365 606301 615909 624518 632021 638592 644300 649243 653741 657983
52238 657983 661663 664396 666366 668092 669630 670568 670926 671535 673122 675319 677086 678034 678928 680720 683437
52223 683437 686313 688884 691532 694898 699172 704149 709695 715823 722519 729836 738042 747322 757392 767752
52209 767752 778289 789255 800675 812114 823053 833153 842265 850607 858943 867967 877353 885873 892675
52196 892675 897995 902414 905985 908480 910018 910900 911054 910184 908364 906016 903316 899910 895336 889517 882847
52181 882847 875848 868680 860973 852332 843005 833758 824972 816209 806905 797172 787593 778498 769776 761287
52167 761287 753094 745338 738163 731707 725972 720686 715495 710253 705077 700163 695606 691303 687059 682952
52153F82952l440k305j531j711k350k513k159k044k426k661k258j573j207j283
52139F53491j602k001k315k397k432k751l196l224k821k677l180l837m077m044
52125F12937m092m089l807l571l834m385m677m725n000n496n633n157m590m487
52111E49394m674m546l856k947k293k028j911j696j472j497j703j580p77L63J141
52096E19918J352J482K029K907L693M162M428M723N272O211P310P920P561O670
$$ plain form
52153 682952 679512 677207 675676 673965 671615 669102 666943 664899 662473 659812 657554 655981 654774 653491
52139 653491 651889 649888 647573 645176 642744 639993 636797 633573 630752 628075 624895 621058 616981 612937
52125 612937 608845 604756 600949 597378 593544 589159 584482 579757 574757 569261 563628 558471 553881 549394
52111 549394 544720 540174 536318 533371 531078 529050 527139 525443 523971 522474 520771 519191 518414 518777 519918
52096 519918 521270 522752 524781 527688 531381 535543 539971 544694 549966 556177 563487 571407 578968 585638
$$ [...]
##END NTUPLES=NMR SPECTRUM
##END=
