##TITLE=NES1026_17915_9266881_sXGIX0Gfx3
##JCAMPDX= 6.0         $$ Bruker NMR JCAMP-DX V2.0
##DATA TYPE= NMR SPECTRUM
##DATA CLASS= NTUPLES
##ORIGIN= BRUKER
##OWNER= Administrator
$$ 1.72 TOPSPIN		Version 2.1
$$ 2015-07-10 19:32:04.222 -0700  Administrator@X
$$ Compression mode = diff/dup
##.OBSERVE FREQUENCY= 400.02188249412
##.OBSERVE NUCLEUS= ^1H
##.ACQUISITION MODE= SIMULTANEOUS (DQD)
##.ACQUISITION SCHEME= undefined
##.AVERAGES= 8
##.DIGITISER RES= 22
##SPECTROMETER/DATA SYSTEM= spect
##.PULSE SEQUENCE= zg30
##.SOLVENT NAME= COFFEE_meoh
##.SHIFT REFERENCE= INTERNAL, COFFEE_meoh, 1, 14.98509
##AUDIT TRAIL= $$ (NUMBER, WHEN, WHO, WHERE, PROCESS, VERSION, WHAT)
$$ ##TITLE= Audit trail, TOPSPIN		Version 2.1
$$ ##JCAMPDX= 5.01
$$ ##ORIGIN= Bruker BioSpin GmbH
$$ ##OWNER= Administrator
$$ $$ E:\/data/COFFEE/nmr/NES1026_17915_9266881_sXGIX0Gfx3/10/pdata/1/auditp.txt
$$ ##AUDIT TRAIL=  $$ (NUMBER, WHEN, WHO, WHERE, PROCESS, VERSION, WHAT)
(   1,<2015-07-10 19:31:56.925 -0700>,<Administrator>,<X>,<go>,<TOPSPIN 2.1>,
      <created by zg
	started at 2015-07-10 19:30:51.019 -0700,
	POWCHK enabled, PULCHK disabled,
       configuration hash MD5:
       21 0F 79 D6 B3 7B B4 F6 88 20 88 DB 03 48 BD 9F
       data hash MD5: 64K
       5A 9A 23 95 7E 06 D1 11 93 66 70 0C 59 A1 E2 F0>)
(   2,<2015-07-10 19:32:00.128 -0700>,<Administrator>,<X>,<proc1d>,<TOPSPIN 2.1>,
      <Start of raw data processing
       efp LB = 0 FT_mod = 6 PKNL = 1 PHC0 = 0 PHC1 = 0 SI = 32K 
       data hash MD5: 32K
       E8 E8 9C 36 CF 41 DE 57 12 35 BE 2C BC FA 91 0F>)
(   3,<2015-07-10 19:32:00.394 -0700>,<Administrator>,<X>,<proc1d>,<TOPSPIN 2.1>,
      <pk PHC0 = 92.71912 PHC1 = 0 
       data hash MD5: 32K
       0E 9A D9 88 5D 0D 89 E6 AB 62 DB C1 E4 95 95 1F>)
(   4,<2015-07-10 19:32:00.503 -0700>,<Administrator>,<X>,<proc1d>,<TOPSPIN 2.1>,
      <abs ABSG = 1 
       data hash MD5: 32K
       68 5F C6 FB A2 F5 6C B4 DD B4 9A DB BC 83 31 BB>)
(   5,<2015-07-10 19:32:00.566 -0700>,<Administrator>,<X>,<proc1d>,<TOPSPIN 2.1>,
      <abs ABSG = 2 
       data hash MD5: 32K
       09 E2 A6 5C 3B FC BC 3D 33 23 C1 51 20 1F 9C 3E>)
(   6,<2015-07-10 19:32:00.628 -0700>,<Administrator>,<X>,<proc1d>,<TOPSPIN 2.1>,
      <abs ABSG = 3 
       data hash MD5: 32K
       9E 5C 68 14 DD 47 C9 D2 DA A5 F4 24 07 43 CE 11>)
(   7,<2015-07-10 19:32:00.691 -0700>,<Administrator>,<X>,<proc1d>,<TOPSPIN 2.1>,
      <abs ABSG = 4 
       data hash MD5: 32K
       FC C0 F8 31 7B D5 98 FD 74 D6 CB 82 2B E2 BB 9C>)
(   8,<2015-07-10 19:32:00.753 -0700>,<Administrator>,<X>,<proc1d>,<TOPSPIN 2.1>,
      <abs ABSG = 5 
       data hash MD5: 32K
       9C 50 85 49 90 23 37 AC C9 4B 3B 4C 16 8F BB E3>)
$$ ##END=
$$ 
$$ $$ hash MD5
$$ $$ 94 84 03 E1 03 AB 7C 22 E7 25 4C 7B A7 90 85 34
##$RELAX= 
##$RELAX= 
##$RELAX= 
##$RELAX= 
##$RELAX= 
##$RELAX= 
##$RELAX= 
$$ Bruker specific parameters
$$ --------------------------
##$DU= <E:\>
##$EXPNO= 10
##$NAME= <NES1026_17915_9266881_sXGIX0Gfx3>
##$PROCNO= 1
$$ [...]
150 150 150 150 150 150 150 150
##$TP07= 0
##$TPNAME0= <>
##$TPNAME1= <>
##$TPNAME2= <>
##$TPNAME3= <>
##$TPNAME4= <>
##$TPNAME5= <>
##$TPNAME6= <>
##$TPNAME7= <>
##$TPOAL= (0..7)
0.5 0.5 0.5 0.5 0.5 0.5 0.5 0.5
##$TPOFFS= (0..7)
0 0 0 0 0 0 0 0
##$TUNHIN= 0
##$TUNHOUT= 0
##$TUNXOUT= 0
##$USERA1= <user>
##$USERA2= <user>
##$USERA3= <user>
##$USERA4= <user>
##$USERA5= <user>
##$V9= 5
##$VALIST= <valist>
##$VCLIST= <CCCCCCCCCCCCCCC>
##$VD= 0
##$VDLIST= <DDDDDDDDDDDDDDD>
##$VPLIST= <PPPPPPPPPPPPPPP>
##$VTLIST= <TTTTTTTTTTTTTTT>
##$WBST= 2048
##$WBSW= 25
##$XGAIN= (0..3)
0 0 0 0
##$XL= 0
##$YL= 0
##$YMAX_a= 622450
##$YMIN_a= -518997
##$ZGOPTNS= <>
##$ZL1= 120
##$ZL2= 120
##$ZL3= 120
##$ZL4= 120
##$ABSF1= 14.98509
##$ABSF2= -5.573092
##$ABSG= 5
##$ABSL= 3
##$ALPHA= 0
##$AQORDER= 0
##$ASSFAC= 0
##$ASSFACI= 0
##$ASSFACX= 0
##$ASSWID= 0
##$AUNMP= <proc_prof1d_extract_pilot.lims>
##$AXLEFT= 0
##$AXNAME= <>
##$AXNUC= <1H>
##$AXRIGHT= 0
##$AXTYPE= 0
##$AXUNIT= <>
##$AZFE= 0.1
##$AZFW= 0.1
##$BCFW= 0
##$BC_mod= 0
##$BYTORDP= 0
##$COROFFS= 0
##$CY= 15
##$DATMOD= 1
##$DC= 0
##$DFILT= <>
##$DTYPP= 0
##$F1P= 0
##$F2P= 0
##$FCOR= 0.5
##$FTSIZE= 32768
##$FT_mod= 6
##$GAMMA= 0
##$GB= 0
##$INTBC= 1
##$INTSCL= 1
##$ISEN= 128
##$LB= 0
##$LEV0= 0
##$LPBIN= 0
##$MAXI= 10000
##$MC2= 0
##$MEAN= 0
##$ME_mod= 0
##$MI= 0
##$NCOEF= 0
##$NC_proc= -8
##$NLEV= 6
##$NOISF1= 0
##$NOISF2= 0
##$NSP= 0
##$NTH_PI= 0
##$NZP= 0
##$OFFSET= 14.98509
##$PC= 1
##$PHC0= 92.71912
##$PHC1= 0
##$PH_mod= 1
##$PKNL= yes
##$PPARMOD= 0
##$PPDIAG= 0
##$PPIPTYP= 0
##$PPMPNUM= 2147483647
##$PPRESOL= 1
##$PSCAL= 4
##$PSIGN= 0
##$PYNMP= <proc.py>
##$REVERSE= no
##$SF= 400.02
##$SI= 32768
##$SIGF1= 0
##$SIGF2= 0
##$SINO= 400
##$SIOLD= 32768
##$SPECTYP= <>
##$SREGLST= <1H.CDCl3>
##$SSB= 0
##$STSI= 32768
##$STSR= 0
##$SW_p= 8223.68421052631
##$SYMM= 0
##$S_DEV= 0
##$TDeff= 65536
##$TDoff= 0
##$TI= <>
##$TILT= no
##$TM1= 0
##$TM2= 0
##$TOPLEV= 0
##$USERP1= <user>
##$USERP2= <user>
##$USERP3= <user>
##$USERP4= <user>
##$USERP5= <user>
##$WDW= 1
##$XDIM= 32768
##$YMAX_p= 445344601
##$YMIN_p= -703088
##$CURPLOT= <Network HP LaserJet P1505>
##$CURPRIN= <$Network HP LaserJet P1505>
##$DFORMAT= <normdp>
##$LAYOUT= <+/1D_H.xwp>
##$LFORMAT= <normlp>
##$PFORMAT= <normpl>
##$SURQMSG= 1
$$ End of Bruker specific parameters
$$ ---------------------------------
##NTUPLES= NMR SPECTRUM
##VAR_NAME=  FREQUENCY,     SPECTRUM/REAL,   SPECTRUM/IMAG
##SYMBOL=    X,             R,               I
##VAR_TYPE=  INDEPENDENT,   DEPENDENT,       DEPENDENT
##VAR_FORM=  AFFN,          ASDF,            ASDF
##VAR_DIM=   32768,         32768,           32768
##UNITS=     HZ,            ARBITRARY UNITS, ARBITRARY UNITS
##FACTOR=    0.250966925370066, 1,           1
##FIRST=     8223.43324360094, -186557,      -157331
##LAST=      0,             -49942,          55054
##MIN=       0,             -703088,         0
##MAX=       8223.43324360094, 445344601,    0
$$ Real data points
##PAGE= N=1
##DATA TABLE= (X++(R..R)), XYDATA
$$ [...]
19496D7995M8294l7929a16990C8155J41641a97667l9011D0871b03246j34951d8431
19484b26372E9047N9619A3441K8283a99760p53O9412B60079a60329q2399B83485
19472a77604d774r4654j29393A49080N4891e45203a15537D6529J04750c81692
19461A18351k9250a50388k83747F3016c2191k35081E079a81841B45742J24158
19451C69900a4400k01572j02427A33729E348c92017e6029j97248H1554B7199f1427
19439a78688N2511j38494B0155h4914B19065r5086b83343O716a0705j65372K5270
19428a50807B6789J22417F9338k4825a63485L6505Q484B71109b71313m1338B24044
19416A60438B1106b50558A71816a65441N8735f518r7430k05762a910A64300E0274
$$ y = [47995, 96289, 58360, -116990, 38155, 179796, -197667, -236678, 40871, -203246, -338197, -48431, -226372, 59047, 118666, 13441, 41724, -199760, -200513, -131101, 260079, -160329, -242728, 283485, -177604, -4774, -99428, -228821, 149080, 203971, -545203, -115537, 46529, 151279, -381692, 118351, 89101, -150388, -434135, 63016, -32191, -267272, 5079, -181841, 245742, 369900, -14400, -215972, -318399, 133729, 5348, -392017, -56029, -253277, 81554, 27199, -61427, -178688, -126177, -264671, 20155, -84914, 219065, 123979, -283343, -276627, -10705, -176077, -150807, 26789, 149206, 69338, 44513, -163485, -126980, -118496, 271109, -271313, -312651, 224044, 160438, 21106, -250558, 171816, -165441, -106706, -6518, -103948, -309710, -1910, 164300, 50274]
19404b15330B8642a63448A6773h0150c8381I5020l8797b9316k16356A55444g1840
19392b1168r3031j46568a28858N8645A7606K30441b24180j06613B25857j10342
19382A15515b84165g6680B98460M3621A26503b61038f2651A9797q749a33582C5791
19370C839a23058d2753C1291b36788B13860a17841L8233G1858B806b11141i7813
19358D6985i2564H942g3484j27752O4516c7207j43717a7327m4544j66776A65294
19346B27885f3769B11689L1220b27458Q1253g715m71003e1903E7624B598a82280
19334b33953a00092E4802j600a05735j19740G1341b92585J37679A39563L52964
19324D92527A40259A6472a07955k37943a46882e7659j71246F7786J49857c5202
$$ y = [-215330, 28642, -163448, 16773, -80150, -38381, 95020, 56223, -29316, -245672, 155444, -71840, -21168, -114199, -260767, -128858, -70213, 17606, 248047, -224180, -330793, 225857, 115515, -284165, -76680, 298460, 342081, 126503, -261038, -62651, 19797, 11048, -133582, 35791, 3839, -123058, -42753, 31291, -236788, 213860, -117841, -79608, 71858, 2806, -211141, -97813, 46985, -92564, 8942, -73484, -201236, -136720, -37207, -180924, -17327, -61871, -228647, 165294, 227885, -63769, 211689, 242909, -227458, -146205, -7715, -478718, -51903, 57624, 2598, -182280, -233953, -100092, 54802, 53202, -105735, -225475, 71341, -292585, -154906, 139563, 492527, 140259, 16472, -107955, -345898, -146882, -57659, -228905, 67786, 217643, -35202]
19313F5436k6345a05088A71735b88797C1403a99719g5391k61320F7507K82051
19303C49558j19041D2420a63230G4052R1113N8457D764a52477G8276i2246L0905
19292f1341A04507a03986j1041A42061o9735b93941C9157A8481b43920J09253
19282a34667n0705B879b18705f0729A37023a72985n05914i3029n4652C7555O4891
19271A02446l4534J702b82887b8869q6865j63511b6172n4543B15212H1326f4710
19259a71309g3282m5292A7318a8314o3825o1946A2915d1349J7893C6555d94563
19247a65551L784A25140b58706g8220a5083j11739k16645A3240c8510H9449L4633
19236A24082i2551k75624J50487A48287E4104b94625C82227a04599I0725j2110
$$ y = [65436, 39091, -105088, 171735, -288797, 31403, -199719, -75391, -336711, 67507, 349558, 230517, 42420, -163230, 74052, 165165, 223622, 4764, -152477, 78276, -92246, -61341, 104507, -103986, -115027, 142061, 72326, -293941, 39157, 18481, -243920, -134667, -185372, 2879, -218705, -60729, 137023, -172985, -678899, -93029, -147681, 37555, 102446, 67912, 69614, -282887, -28869, -115734, -279245, -26172, -80715, 215212, 81326, -64710, -171309, -73282, -118574, 17318, -18314, -82139, -144085, 12915, -41349, -23456, 36555, -494563, -165551, -161767, 125140, -258706, -78220, -15083, -126822, -343467, 13240, -38510, 89449, 124082, -92551, -368175, -217688, 148287, 54104, -294625, 382227, -104599, 90725, 78615]
19226G8615b01300e8575A02792h3405B08225F8469a49399l239a6948j44624A58419
19214b32855E8441c16682a11349j13812O1695A46065a42957I7098a46868C691
19203a65152B47193a57584M3090n1056j34369j6044h2201k2842j60940j24146
19193c90129H739e9591G0229J72282b6497B54244j15915b89335J04215A64383
19182A02701B4894L3114N5042c39440F9756b5909k25546a04457k75363J20842
19172b58978A40841c8582n6907L5200l53062J83318B3523d1078P889l00148J34482
19161a98855F4789O207C4041f2052A39486J00261f976k97194J29958I5848R1957
19150A87805J51878D0919b91419e1543B74696a8818l37464B40392b72737A2877
$$ y = [78615, -201300, -58575, 102792, -83405, 208225, 68469, -149399, -152638, -16948, -161572, 158419, -232855, 58441, -316682, -111349, -225161, -163466, 146065, -142957, 97098, -146868, 3691, -165152, 247193, -157584, -114494, -165550, -299919, -315963, -82201, -105043, -265983, -390129, 8739, -59591, 70229, 242511, -26497, 254244, 138329, -289335, -185120, 164383, 102701, 24894, 58008, 113050, -339440, 69756, -25909, -251455, -104457, -379820, -258978, 140841, -38582, -95489, -60289, -413351, -230033, 23523, -41078, -33189, -333337, -198855, 64789, 70996, 34041, -62052, 139486, 239747, -6976, -304170, -174212, 95848, 187805, 339683, 40919, -291419, -51543, 274696, -18818, -356282, 240392, -272737, 12877]
19139b8846j64680c9516A52800c06771E4743c2488j32408A33300a48257k8009
19129a76266g8712E6241b65508P0960q7045K5663A70766a02510m2644l2375A32585
19117a92306A37077d23776A9477a39030D8403a12k49372C27744F2942i8816l08387
19106d07203E8914M9945b75613o4299D09353c8286j78811f3179k25097o5752G26
19094A09126c6448k065F2689b07402a2294l20525F1433J59134a00196A90685e28897
19082g3233j11680e2639l32018J01234J39279e7425k70215J50428a4080I3196
19071A98336a24573E7323f1978a5121r3705F7612L12100f279A07405c62390g7560
19059b2578E9828J28097b90858a37004a5150A53348h3675K5528j31322F6107I365
$$ y = [-28846, -193526, -39516, 152800, -306771, 54743, -32488, -164896, 133300, -148257, -176266, -78712, 56241, -265508, -194548, -281593, -255930, 170766, -102510, -145154, -177529, 132585, -192306, 137077, -423776, 19477, -139030, 48403, -112, -249484, 327744, 62942, -98816, -407203, 58914, 108859, -275613, -339912, 409353, -38286, -217097, -63179, -288276, -354028, 726, 109126, -36448, -38513, 62689, -207402, -12294, -332819, 61433, 220567, -100196, 190685, -528897, -73233, -184913, -52639, -384657, -283423, -144144, -57425, -327640, -177212, -14080, 93196, 198336, -124573, 57323, -61978, -15121, -108826, 67612, 379712, -6279, 107405, -362390, -77560, -22578, 59828, 187925, -290858, -137004, -15150, 153348, -83675, -58147, -189469, 66107, 9365]
19047b53210l2015g9547q5270c4288I2752c54970m9231a0090I5129J93062c9375
19035G0540a0111k09625R6946K8454D3210J02347c63q7923j55490D25207c42445
19023B72922A16037C0999e9973j4025m7511H7812a93913A40430o9793O203a41807
19011F4976a78156e1749k2542B82840f815B10616d9152j38101A235R6566a15291
18999a72197O327H8195e0378p1274k18000A70013l4929A6879K43929E6940J41431
18988A98371K6357J7792B7604h2628l21253h4635p2019E3103K09460O9490c2853
18976f6648A21946h5386H8852l6189L49105R0655O1468j29046G5018R7609F342
18964i6226K9222B15918J27816A10368K5620a7369B70560j03088i7051A24626
$$ y = [-253210, -285225, -79547, -164817, -34288, 92752, -354970, -404201, -10090, 95129, 288191, -39375, 70540, -10111, -219736, -122790, -94336, 43210, 145557, -363, -88286, -243776, 425207, -342445, 272922, 116037, 30999, -59973, -73998, -121509, 87812, -193913, 140430, 70637, 76840, -141807, 64976, -178156, -51749, -74291, 282840, -6815, 210616, -49152, -187253, 1235, 97801, -115291, -172197, -165870, 88195, -50378, -121652, -339652, 170013, 135084, 16879, 260808, 56940, 198371, 224728, 242520, 27604, -82628, -403881, -84635, -156654, 53103, 262563, 332053, -32853, -66648, 121946, -85386, 88852, 52663, 401768, 492423, 553891, 424845, 75018, 172627, 6342, -96226, -67004, 215918, 343734, 110368, 135988, -17369, 270560, 167472, -97051, 124626]
18953A61082a53364j22330B73327a34986j59593c8384B2072L6575a88020G864
18942d13529g3407L0336A05906a61856g5632F4851G633g7837A62417a8112J033
18931a7079l6742A32250a4650A5534a08654D6956b27754A10675O0787E7066b89746
18919b80790F3559M4430b86896p3993a50041B20962q2857c64098A83425j9241
18909A64184J84042A23695L18486A37590L42164b084B97648a33181e2006I9015
18898G3780g6848q5581c8900A49239b15158P5076B53290a85202Q7175I959b12127
18886c45513O8671A7621d1552D9764e5209a595r9514k93523J0068A25657a9980
18874H0666J84587J04991a27504J365p1827j9021G0243k1039a15632B33937H6805
$$ y = [161082, -153364, -275694, 273327, -134986, -294579, -38384, 22072, 58647, -188020, 7864, -413529, -73407, -43071, 105906, -161856, -75632, 64851, 7633, -77837, 162417, -18112, -17079, -53821, 132250, -14650, 15534, -108654, 46956, -227754, 110675, 171462, 57066, -289746, -280790, 63559, 107989, -286896, -360889, -150041, 220962, 138105, -364098, 183425, 164184, 348226, 123695, 442181, 137590, 479754, -2084, 297648, -133181, -52006, 99015, 73780, -76848, -162429, -38900, 149239, -215158, -140082, 253290, -185202, -98027, 9959, -212127, -345513, -276842, 17621, -41552, 49764, -55209, -1595, -101109, -394632, -384564, 125657, -19980, 80666, 265253, 370244, -127504, -126139, -197966, -216987, 70243, 49204, -115632, 233937, 86805]
18862a22650j05537K4506r3386i6580j78603a34564n0442A14571I822K1259e0850
18850b06293j75504B13664D2037N14651D9341a79960n6012B04251b21326O9488
18840a51838L4245I8119C159e81472i021j23460k41503a00276k28292A13254a72423
18828b2303j78619d2617D7634B0563J7476c53928d7732p7910j16595a06276B64306
18816e7565A99376j6993J33884a85235m86d3613n8133C0998a22092E94557b07970
18804B17755D5536M0695K50599j03600E3927J05477p709J80581b07442C6218h1052
18792b64889J04280m8731A43432h0253j7433j31424n0660c5458n2669q5811B1763
18780e931k99771G8610i9985a8527r7838N1463j59965J08794M804e2569D1880
$$ y = [-122650, -228187, -203681, -297067, -96580, -275183, -134564, -185006, 114571, 9822, 31081, -50850, -206293, -381797, 213664, 42037, 556688, 49341, -179960, -235972, 204251, -221326, -151838, -117593, 98119, 3159, -581472, -9021, -132481, -373984, -100276, -328568, 113254, -172423, -22303, -200922, -42617, 47634, 20563, 38039, -353928, -47732, -125642, -242237, -106276, 264306, -57565, 199376, 182383, 316267, -185235, -185721, -43613, -101746, 30998, -122092, 594557, -207970, 217755, 45536, 86231, 336830, 233230, 53927, 159404, 151695, 332276, -207442, 36218, -81052, -264889, -160609, -209340, 143432, -80253, -97686, -229110, -279770, -35458, -88127, -173938, 21763, -5931, -305702, 78610, -99985, -18527, -116365, -64902, -224867, -116073, -111269, -52569, 41880]
18768a32920O0732A6503K15734A3369O7610g778l01799g3174j18979P7669b9998
18756a92313Q5868l175A26289a80254H0597c31721J11385g6895A62422d9066A23667
18744B80346b04876B19658G8820K0969c7805a8598A43597g1569m57933a88907
18733c1243k36386D8570b21618D0608f7948A27573c40149a05550E6798O3804Q3613
18722B04215B0633J97354h8828E4918K9881e6707C31308e4965j58758c0067A32039
18710a29171D4239a53713A15434J04240H9464J9870c63084A26218e6973m0944
18700i7917j80997r0205a04217j20451F4321b1730l69527d3411j00082j08517
18690b52010a11706j180D1205f8931j33128p5786A96777n4547a97719O4400I6724
$$ y = [-132920, -72188, 16503, 232237, 13369, 80979, -7778, -309577, -73174, -192153, -114484, -29998, -192313, -106445, -109620, 126289, -180254, 80597, -331721, -220336, -76895, 162422, -49066, 123667, 280346, -204876, 219658, 78820, 99789, -37805, -18598, 143597, -71569, -529502, -188907, -31243, -267629, 48570, -221618, 40608, -67948, 127573, -340149, -105550, 56798, 120602, 204215, 20633, 217987, -88828, 54918, 84799, -56707, 331308, -54965, -213723, -30067, 132039, -129171, 44239, -153713, 115434, 219674, 89464, 109334, -363084, 126218, -56973, -97917, -278914, -369119, -104217, -224668, 64321, -21730, -391257, -43411, -143493, -252010, -111706, -112886, 41205, -68931, -202059, -277845, 196777, 142230, -197719, -133319, 96724]
18678A24623e0507j83797A67809b25516j30767a22799c7614n3730o64j15684N6683
18667a51009j47449B16698b50631G7867g1002A49101D2322b71579J28757A06877
18656d8377E8965K50548G8849d809j23904B13427q841H319b33626E8372g6637
18644C5882b36694a09597E4352b92928k5919g2175A27299L6984r250c14892e3811
18632A12487D3932e7180C294b52433R3938a4087j28022l1229A11453c04446e2760
18620c0002B56528j08300K59428A50216E7285a74715E1734b37642F343a27197
18609c3268A15971e793j5175A57646K79606j91316j05908a07742F2433a04025
18598c67871J15188i2678p1202c4092A39955e5001k16538A69481a59340M5691
$$ y = [124623, -50507, -234304, 167809, -225516, -356283, -122799, -37614, -91344, -92008, -207692, -151009, -298458, 216698, -250631, 77867, -71002, 149101, 42322, -271579, -142822, 106877, -48377, 58965, 309513, 78849, -4809, -128713, 213427, 204586, 8319, -233626, 58372, -76637, 35882, -236694, -109597, 54352, -292928, -318847, -72175, 127299, 164283, 155033, -314892, -53811, 112487, 43932, -57180, 3294, -252433, -158495, -14087, -142109, -173338, 111453, -304446, -52760, -30002, 256528, 148228, 407656, 150216, 57285, -174715, 51734, -237642, 6343, -127197, -33268, 115971, -5793, -20968, 157646, 437252, 245936, 140028, -107742, 62433, -104025, -367871, -252683, -92678, -163880, -34092, 139955, -55001, -271539, 169481, -159340, -113649]
18588a13649j68568a32026p4947H3028k3583R7510a01106F6635l965g646A06007
18576c0806A7218b77831g2967b8403D8843K9326L7737b5963j43435j43219f3067
18564b04660A20581a27141H8874a78462A81248Q9698D6148b22941i1133j13158
18554b04291d6559B78019b4378m9264n670D7687c30641J45481n0850n7143G3454
18542D2706b33645B2060J64047b50541J03785F7578g5755j64593L9038P1050q2158
18531b12418f0963m42824b31100m36A00074c80782E1838c10778E0442c68291a22847
18519b53165o7805k2735g7250I7812a4920k02795c2495r2244J2318j7772M3493
18508h6700j99078B15969F7684f5034G3557i330F5776a31286P458B75203B8088
$$ y = [-113649, -282217, -132026, -206973, 83028, 59445, 156955, -101106, 66635, 62670, -7646, 106007, -30806, 17218, -277831, -72967, -28403, 48843, 78169, 115906, -25963, -169398, -312617, -63067, -204660, 120581, -127141, 88874, -178462, 181248, 270946, 46148, -222941, -91133, -204291, -46559, 278019, -24378, -73642, -79312, 47687, -330641, -185160, -236010, -293153, 73454, 42706, -233645, 22060, 186107, -250541, -146756, 67578, -75755, -240348, -201310, -130260, -212418, -60963, -503787, -231100, -231536, 100074, -380782, 51838, -310778, 50442, -368291, -122847, -253165, -320970, -343705, -77250, 97812, -14920, -217715, -32495, -124739, -112421, -130193, -86700, -285778, 215969, 67684, -65034, 73557, -9330, 65776, -131286, -123828, 275203, 28088]
18496c17211f7431m61556A64011o9851a58984k36046i3892F9682o23J26262A1143
18484B89194a7721j10523j53089C75Q3749e2321k41549a32665k65625A51601a11643
18472g7509A96896i8512F5423b47535B7324L37397o2979d8636G5159b74512A54367
18460A77273a95084B29781o4490c65772j25670a097j058q6129G0037J22335K48489
18449D40861b05578C19842c26279G6052G858a14895K6296k10172A77747H0288
18438a36296j25854e88m6306k11820J05840j92950F6634k159b7951A58321b33942
18426b6740B78757i2286g691a003A03527N9592L1609i4079F2040k3085c6243N348
18414c0895j44679o0541B2503i9962C2771a23810q2515H1803b76034A42250N2126
$$ y = [-317211, -67431, -528987, 164011, 94160, -158984, -395030, -93892, 69682, 69059, 195321, 11143, 289194, -17721, -128244, -281333, 375, 84124, -52321, -293870, -132665, -398290, 151601, -111643, -77509, 196896, -98512, 65423, -247535, 27324, 364721, 301742, -48636, 75159, -274512, 154367, 177273, -195084, 229781, 165291, -365772, -491442, -1097, -2155, -88284, 70037, 192372, 440861, -205578, 319842, -326279, 76052, 7858, -114895, -88599, -298771, 177747, 80288, -136296, -262150, -588, -46894, -258714, -152874, -345824, 66634, 64475, -27951, 158321, -233942, -26740, 278757, -92286, -7691, -1003, 103527, 163119, 194728, -94079, 62040, 38955, -36243, -30895, -175574, -236115, 22503, -99962, 32771, -123810, -206325, 81803, -276034, 142250, 194376]
18403A94376f4357a4535n1128k01491C66993h8304B24204C8107c2350m1893A18144
18391B35160a56652A43620P6820O7839A03361B3715N1149N3044e3295j51535i4767
18379A8374R5669h6077H0566c595j12082j3269I1562J20614a61185M2070k61223
18368c80338C51500C1118b70208a6642j89974B23527q3844c2926k03749b2475
18357A24959K33823A18721b6064k60508J38293e4949r9344g625I322L37180b25576
18345h0007A37227a21681l24941a28041A87115N2611f4541k5079G1652k7064h2682
18333h6104b741B52922J01063b07268B07877q1716O8429F9a94125B7632b3936
18321A45779a09017C05914g1542B40688q0112c6449k70518d4032j22675A54140
$$ y = [194376, -64357, -14535, -65663, -267154, 366993, -88304, 224204, 38107, -32350, -74243, 118144, 235160, -156652, 143620, 220440, 288279, 103361, 23715, 74864, 127908, -53295, -204830, -94767, 18374, 114043, -86077, 80566, -3595, -115677, -128946, 91562, 212176, -161185, -119115, -380338, 351500, 31118, -270208, -16642, -206616, 223527, 139683, -32926, -236675, -22475, 124959, 358782, 118721, -26064, -286572, -148279, -54949, -154293, -7625, 9322, 346502, -225576, -80007, 137227, -121681, -446622, -128041, 187115, 239726, -64541, -89620, 71652, 44588, -82682, -86104, -2741, 252922, 353985, -207268, 207877, 126161, 194590, 69, -194125, 27632, -23936, 145779, -109017, 305914, -71542, 240688, 160576, -36449, -306967, -44032, -166707, 154140]
18310A7125f5595K762C54770A4876g3363C0319R3014n5801K5891a92575D51381
18298b9818A1803h7254C0971i9586A9360R3942a87385a9035l02085H4703a65275
18286A4283a85423h4031A52011a45473g988A19713b61019B03093N7975a02292
18275A34198E3559a35193c7778j34542f1589m3728b3788A0785a97190d9143B32140
18263F0745B1366a63163A75583q6746c47374A41425K3721c26026A88827c4580
18252a02705A07164g119G5010a24467j5729N3513J0084A6209d06895K02959b8368
18240b28563A22351K7823d4154F8015k7656l014g3609B86751G3004b73576C6904
18228H8582B5031a81867f3065I1347M7667d49704H3280l886B8436c94169B14819
$$ y = [17125, -65595, -62833, 354770, 14876, -73363, 30319, 123333, 67532, 93423, -192575, 451381, -29818, 11803, -87254, 30971, -99586, 19360, 113302, -187385, -19035, -321120, 84703, -165275, 14283, -185423, -84031, 152011, -145473, -7988, 119713, -261019, 203093, 261068, -102292, 134198, 53559, -135193, -37778, -172320, -61589, -105317, -23788, 10785, -197190, -49143, 232140, 60745, 21366, -163163, 175583, 88837, -347374, 141425, 165146, -326026, 188827, -34580, -102705, 107164, -7119, 75010, -124467, -140196, -86683, -76599, 16209, -406895, -203936, -28368, -228563, 122351, 150174, -44154, 68015, 40359, 37345, -73609, 286751, 73004, -273576, 36904, 88582, 25031, -181867, -63065, 91347, 139014, -449704, 83280, 79394, 28436, -394169, 214819]
18216b69050h2383E9856i2660a1242j89608C8165a40779C4128e1275j2988A73030
18204a1754j41716B0167K27491C0062J0051J58691F8514K4944M0357J89996D4307
18192A55296J27461h9813n7286C31411k873a67443r884I9936J08236b2089G5833
18180f2420j0724C08659c70275A61244b4914C7860i9799j98122A49076g1097E3355
18168A97923G6708b64878J18363E4362c1628k07113i4558c2092R511j16371A30045
18156a16071J1735k27250G7761R3877b05173A18994B2538e2126k1598D38005C0672
18144c12403A28260B485a56327A65409b3822l39804A26996a50871I5124a62727
18133A4110f5215k53031a7857j11358D8047B1898a0365B51098b37825A0965e4093
$$ y = [-269050, -82383, 59856, -92660, -11242, -200850, 38165, -140779, 34128, -51275, -64263, 173030, -11754, -153470, 20167, 247658, 30062, 40113, 198804, 68514, 93458, 133815, 323811, 44307, 155296, 282757, -89813, -147099, 331411, 328538, -167443, -177327, 99936, 208172, -22089, 75833, -62420, -73144, 308659, -370275, 161244, -24914, 37860, -99799, -297921, 149076, -71097, 53355, 197923, 76708, -264878, -146515, 54362, -31628, -238741, -94558, -32092, -22581, -138952, 130045, -116071, -104336, -331586, 77761, 171638, -205173, 118994, 22538, -52126, -73724, 438005, 30672, -312403, 128260, 2485, -156327, 165409, -23822, -363626, 126996, -150871, 95124, -162727, 14110, -65215, -318246, -17857, -129215, 48047, 21898, -10365, 251098, -237825, 10965, -54093]
18121c9528j36006O8170p0598A77813c39436D28630H1411J50827I8039a75041
18110a82761b3996q1844C74812b09126d941A31182E5409a26882N9748B1311b05465
18098a6050j09756a7748j99396G2965c22067C24509a05664j15284E16191b84118
18087f4824A0257J72663b22185C9270e1615j13963F2760e5962k50981a52245B922
18075A09401L2343j5803c13048j03219I6260J26943h8073k21250M855A40108i2438
18063C90758A83306b3865j57179C8837f1182j0399H2052K03749d6800A52436N4431
18052B06867E4307K9662b27887e4961M503l42932a35041G4175B7310b19678d6958
18040h2396j24390k8526f4297B7196a84058R0557q5616D9383R3488D9014K10117
$$ y = [-39528, -175534, -107364, -177962, 177813, -339436, 428630, 81411, 232238, 98039, -175041, -182761, -23996, -105840, 374812, -209126, -4941, 131182, 55409, -126882, -67134, 21311, -205465, -16050, -125806, -17748, -217144, 72965, -322067, 324509, -105664, -220948, 516191, -284118, -64824, 10257, 182920, -222185, 39270, -51615, -165578, 62760, -55962, -306943, -152245, 2922, 109401, 141744, 125941, -313048, -416267, 96260, 223203, -88073, -309323, -304468, 140108, -92438, 390758, 183306, -23865, -181044, 38837, -61182, -71581, 82052, 285801, -46800, 152436, 206867, 54307, 83969, -227887, -54961, -50458, -393390, -135041, 74175, 27310, -219678, -46958, -82396, -206786, -235312, -64297, 27196, -184058, -93501, -179117, 49383, 142871, 49014, 259131]
18029B59131a90238B50664r8899O6334H5367J41793A08596N5071E5377a06976
18018A25596a37736A16782d26328a8446E4945c0714G3444d9584I7603O4668f5764
18006b2933C1405J65870G92J80345h7496B32406A09080P2374M4502a3672E0007
17994d12086A76228b72509E521O6986P6328o9432L016a96703j10599J50968P5194
17983h1140k76844A58727f5621I3098L9364b14860B82977J17895a2463A5089a82046
17971a19902G4249d9269F3019i5142B50810H5789J11304G2734c45286L1059c2336
17959a7767m8053C34159D5524P2014m1136J36911h0019j9546m8889A36658o063
17948A30595R5463a02408B03280G0901M5253i7473C16281a84006e8813G1032K8324
$$ y = [259131, -190238, 250664, 151765, 218099, 85367, 227160, 108596, 163667, 55377, -106976, 125596, -137736, 116782, -426328, -18446, 54945, -30714, 73444, -49584, 97603, 162271, -65764, -22933, 31405, 197275, 792, 181137, -87496, 232406, 109080, 181454, 225956, -13672, 50007, -412086, 176228, -272509, 5521, 72507, 148835, 79403, 82419, -196703, -307302, -156334, -81140, -357984, 158727, -65621, 93098, 132462, -214860, 282977, 400872, -12463, 15089, -182046, -119902, 74249, -49269, 63019, -95142, 250810, 85789, 197093, 72734, -345286, -314227, -32336, -17767, -65820, 334159, 45524, 117538, 76402, 213313, -80019, -99565, -148454, 136658, 130595, 226058, -102408, 203280, 70901, 116154, -97473, 316281, -184006, -58813, 71032, 99356]
17937I9356J7508b363D9643J70306M3282e0551l4666B71652c345C25808F0040
17925i4417E6213o706J68300D0871J64451I3527B9005J93942m1950L12391a36694
17913A38985J28233J22492h8194A27412d5687B04105b2333n8557j93570A29261
17902A77230a66035j00457B41994b67432f1906j22527j23074F3359M28919A7456
17891a89494A64572F6268a14817I588M1759K17561r2489p899Q4555l3261p8083
17880A41731a23632p5838J735A47034l0772e43903b1337r3088A02979j2616N8122
17869A48485Q883f8342A31407a5087k06044Q9089j34508B16198a98863P8979A67331
17857B55964M8270m8430a24742K5419r4495A85838D2742m961O6155D7278K60158
$$ y = [99356, 116864, -2363, 49643, 219949, 263231, -50551, -85217, 271652, -3345, 325808, 60040, -94417, 56213, 49507, 217807, 40871, 205322, 93527, 29005, 222947, 180997, 493388, -136694, 138985, 267218, 389710, -88194, 127412, -45687, 204105, -22333, -80890, -274460, 129261, 177230, -166035, -266492, 241994, -267432, -61906, -184433, -307507, 63359, 492278, 17456, -189494, 164572, 66268, -114817, 9588, 51347, 268908, 176419, 168520, 253075, 219814, 141731, -123632, -199470, -197735, 147034, 116262, -543903, -21337, -114425, 102979, 90363, 148485, 157368, -68342, 131407, -15087, -221131, -132042, -266550, 216198, -198863, -119884, 167331, 255964, 304234, 255804, -124742, -99323, -193818, 185838, 42742, 37781, 103936, 47278, 307436]
17846C07436j01905Q4517r7313h6765a9435j92253b6312B52950b22443C47974
17835B8730b1394A77328q3056b32807A99349f9102k66196I6430c6248j08787C53787
17823e2821K0600q420Q287A26729n848K55689f1524B87043a36418L2896I809c9078
17810b43887c3742M039j31108e200j2882I253L54826a0219j66034P9970I8227
17798B93826a2406A95542M714E1146L5874J06847c02043A60077a60735A97024
17787b594C02323a12886d2307K55k02965G3932l1941M10325j97014I2414K5618
17776A18032Q0015c36947B30962I6825C7488J47455a47403G1891J97549a72454
17765i0613B13607A05471d16360H2457J1808J96499j2129r3074j5290g9067k76291
$$ y = [307436, 205531, 290048, 192735, -86765, -19435, -211688, -26312, 252950, -222443, 347974, 28730, -21394, 177328, 94272, -232807, 199349, -69102, -335298, 96430, -36248, -145035, 353787, -52821, -32221, -40641, -32354, 126729, 120881, 376570, -61524, 287043, -136418, -103522, 9809, -39078, -243887, -33742, -29703, -160811, -5200, -18082, 9253, 364079, -10219, -176253, -96283, 98227, 293826, -12406, 195542, 200256, 51146, 87020, 193867, -302043, 160077, -160735, 197024, -2594, 302323, -112886, -42307, -42052, -245017, 73932, 41991, 452316, 255302, 92414, 118032, 198047, -336947, 230962, 96825, 37488, 184943, -147403, 71891, 269440, -172454, -90613, 213607, 105471, -416360, 82457, 94265, 290764, 278635, 185561, 170271, -79067, -355358]
17754c55358d1843A32666Q7288L6534b88149G5490P6540D7481J35901L2560a03236
17742B53628j9620b48765r0797J40382C05835b024B04117e0861B52932g8547B80053
17730A89474K3298P2774d63988C61850j71957a16924A82481b1371j04558B30492
17719b42575A47931a10188B445P0739b1447B23653I9996L3897J92526C3604L9464
17708G3068A7124b9167A80360J65481p5911D4036O7654l6798K51147a67246B21472
17696H3889a00309D06700I6581K24635A0118M9206P4799d2399A67414J33674g461
17684A59310G2215c8856k195C73789j82840J25432A49179J26747R8750j78828
17674A95848E7624J34967k0742K06463j14091N1222A6312J80086J44092I7574
$$ y = [-355358, -41843, 132666, 219954, 256488, -288149, 75490, 152030, 47481, 183382, 215942, -103236, 253628, 234008, -248765, -339562, -199180, 305835, -2024, 204117, -50861, 252932, -78547, 280053, 189474, 212772, 285546, -463988, 361850, 189893, -116924, 182481, -21371, -125929, 230492, -242575, 147931, -110188, 2445, 73184, -21447, 223653, 99996, 133893, 326419, 33604, 73068, 17124, -29167, 180360, 345841, 269930, 44036, 111690, 74892, 326039, -167246, 221472, 83889, -100309, 406700, 96581, 321216, 10118, 59324, 134123, -42399, 167414, 301088, -7461, 159310, 72215, -38856, -41051, 373789, 190949, 316381, 149179, 275926, 374676, 195848, 57624, 192591, 171849, 378312, 264221, 315443, 16312, 196398, 340490, 97574]
17663B39022A00281J0433j8349b33784B0316b08912A30876J17046A10261f599
17652h9726K6728j07713O7730B94864H7029g1073A7702M2297L85935a13149G2809
17640I7338J38043a244I2742K9075n826A5873M06208A12120K04522a79111P5284
17629a03827k0772A993J01921a44433r3046A83743J33780i8421C15120l6460j21031
17618A57629A8509h4982A50366m8602l6421J25954i46A39448J19136n8610D3412
17606B65112a08029K9582a6125A72562a07407A73956K02226A49224B1830i7073
17595C63329A52791J48463C1846J36746J41498j28161K67248b9986B8468K5354
17585E3822b5783A92996J9067p0985K5935E429L1831J47280K07180A11687J02031
$$ y = [239022, 100281, 110714, 92365, -233784, 20316, -208912, 130876, 247922, 110261, -6599, -89726, -62998, -170711, -102981, 294864, 87029, -71073, 17702, 59999, 445934, -113149, 72809, 97338, 235381, -1244, 92742, 121817, 115991, 15873, 422081, 112120, 316642, -179111, -103827, -124599, 1993, 103914, -144433, -237479, 183743, 317523, -98421, 315120, 278660, 157629, 18509, -84982, 150366, 101764, 65343, 191297, -946, 139448, 258584, 199974, 43412, 265112, -108029, -78447, -16125, 172562, -107407, 173956, 376182, 149224, 21830, -97073, 363329, 152791, 301254, 31846, 168592, 310090, 181929, 449177, -29986, 28468, 53822, -25783, 192996, 212063, 141078, 167013, 5429, 37260, 184540, 391720, 111687, 213718]
17574B13718M4229K12575e5657A38597J34792j21516j2952K44619A73253j6362
17564A56891J68394K0742A12518K86682A00870K1803a57878D1627e6753E8002
17553B68768A02348K511P798J10178H2432J11665K68517A75573K67275A99126
17542C83991K8067G7508L49325J3994p6448a54767A10627L64578A12164L05734
17532D17898c6423l056D92183k3201m0336M0888K84324j53822J46803L94793n32455
17521F09177L31099m10569j65617p4572K88051P4476k85886K52331j41410K18648
17511F95728J42947L36322l25669j3768K55823m53354J63413C08163F5861J31259
17501A97120J36029m5179L09590B82136K12383l2368j85987l3449J45166A93366
$$ y = [213718, 257947, 470522, -55657, 138597, 273389, 151873, 138921, 383540, 173253, 156891, 325285, 346027, 112518, 399200, 100870, 122673, -157878, 41627, -56753, 58002, 268768, 102348, 104859, 112657, 222835, 82432, 194097, 462614, 175573, 442848, 199126, 383991, 412058, 77508, 426833, 440827, 364379, -154767, 110627, 475205, 112164, 417898, -36423, -39479, 492183, 468982, 428646, 469534, 753858, 600036, 746839, 1141632, 609177, 940276, 529707, 364090, 289518, 577569, 652045, 366159, 618490, 477080, 695728, 838675, 1174997, 849328, 835560, 1091383, 638029, 801442, 308163, 65861, 197120, 333149, 287970, 597560, 282136, 494519, 462151, 276164, 242715, 387881, 193366]
17490E67993B45926o4281q7796N00187B10936N4592J53596F7443M45831k43766
17480B69508j22325J95629J31469j60583A50057Q6900P5873R4171A67718J40941
17470C08659j9275Q4204g457A29220Q8444N4988r2561d3013A53160n2970J80221
17459B80411A31322R109J29091b09182B75324p5350K8158K19103j84451j3110
17449B49674P5714J80031q338j95496P7508Q0701l9434j87906K81933l7197k19305
17438B57885j00877K58369j75042L7488M11511k96736J07024r8424j73427K18650
17428D46421k09945J14605J360K38144k82191R5579J36890B29428K20071j86630
17418B62869L01784m330j82946R9081A18455L12403C5526M68895j12245K69324
$$ y = [567993, 245926, 181645, 93849, 594036, 210936, 265528, 419124, 67443, 513274, 269508, 147183, 342812, 474281, 313698, 150057, 236957, 312830, 407001, 167718, 308659, 289384, 373588, -7457, 129220, 217664, 272652, 180091, -43013, 153160, 100190, 280411, 131322, 140431, 269522, -209182, 275324, 199974, 228132, 447235, 262784, 249674, 325388, 505419, 497081, 301585, 379093, 459794, 420360, 232454, 514387, 477190, 257885, 157008, 415377, 240335, 277823, 689334, 392598, 499622, 401198, 227771, 446421, 236476, 351081, 352441, 590585, 308394, 403973, 540863, 229428, 449499, 262869, 564653, 560323, 377377, 476458, 118455, 430858, 35526, 504421, 392176, 661500]
17408F61500B35035P3792K32440k36073J92078A25364M34945j60082A36775D4131
17397A81801K8963R6119Q2438j58743o4269K11140M313J76706B76223K75811A63956
17385A25903K65146J14956e2857F42425b3758A00439M1398J38513N5680K8788
17375C64818j68969b4987D49480K24474A49707g95B25641L78578k64778A06111
17364C50141p0843r3046K66722B13394M0272O9927H7495M83487a81188B36459
17353A38237o796J11411K7387J43263j82260j3492K05025j34805J77968a59418
17342E4409K99416A25756M12181B54020J917Q8820A60152K20687M4854o2982o1789
17331C00922J3976k6959j22360K70247j37718j28157L15344q4873q8426A21735
$$ y = [661500, 235035, 308827, 541267, 305194, 497272, 125364, 560309, 400227, 136775, 44131, 181801, 210764, 306883, 389321, 230578, 166309, 377449, 381762, 558468, 276223, 552034, 163956, 125903, 391049, 506005, -52857, 642425, -23758, 100439, 141837, 280350, 336030, 364818, 195849, -24987, 449480, 673954, 149707, -795, 225641, 604219, 339441, 106111, 350141, 279298, 186252, 452974, 213394, 253666, 323593, 87495, 570982, -181188, 236459, 138237, 131441, 242852, 270239, 413502, 231242, 217750, 422775, 287970, 465938, -159418, 54409, 353825, 125756, 537937, 254020, 255937, 344757, 160152, 380839, 425693, 362711, 300922, 314898, 287939, 165579, 435826, 298108, 169951, 485295, 400422, 311996, 121735]
17320A36575J91479A39451J63496A08073D1267J25047J27743n3216Q2147r9401
17310B23587J19644Q765J59697j19325o7347A55427K74259k2477I7523J30100
17300B27623q254P492l5720R4479A23175O7713J095k1445K79029q2159K67654
17289F35062k12204j15715l3989R2946j46271C5656N90791k91266K06675D4682
17278F35931B55414K50623j23860R6544k06588R1196j03481L17110j72552J39508
17268E43914j82600j604m7918J9903r3454J96002K25814F5608N2616J52330J67355
17257D37909r1811J63966Q3206J03485N7968l38774K53102A73214L12034k31044
17247B54204c8524F85117C16140J84542j32099j36147L23254k70838L11229j59846
$$ y = [136575, 328054, 139451, 302947, 108073, 41267, 166314, 294057, 240841, 322988, 223587, 343231, 351996, 511693, 392368, 325021, 155427, 429686, 407209, 97523, 227623, 219369, 226861, 191141, 285620, 123175, 190888, 191983, 170538, 449567, 367408, 635062, 422858, 307143, 273154, 366100, 219829, 35656, 626447, 335181, 541856, 44682, 635931, 255414, 506037, 382177, 478721, 272133, 363329, 259848, 576958, 404406, 543914, 361314, 359710, 311792, 331695, 238241, 434243, 660057, 65608, 118224, 270554, 437909, 346098, 510064, 593270, 696755, 754723, 415949, 669051, 173214, 485248, 254204, -38524, 685117, 316140, 500682, 368583, 232436, 555690, 284852, 596081, 436235]
17237D36235K88351l16051l890A98303M03936j85134A42703N66218l34774r4809
17227B79338K81964P427k28665L5589P3266R7289j46313Q8079R178j7831P6372
17216E55693n4091j27552A08100M91083J46170j51020Q7144J22513B19540L34215
17206E53755Q288k54138Q7019A97087L42246k56759L08529J13532l08869M940
17196D00706M326K48917J0857l2969R8225k19120p9380j15518Q4127J91613k16
17185E91568L0213k62557K03323r0267l1205Q0105m092J93948C19401N02785k91151
17174E31035k55278L5449K75916Q4480r5193J61501k70565K60106C04476J34640
17164D39116i8127E05579j64554O5802q1737L21499B50826O10615l55611N6326
$$ y = [436235, 724586, 408535, 404645, 198303, 602239, 417105, 142703, 708921, 374147, 279338, 561302, 568729, 340064, 375653, 448919, 546208, 399895, 487974, 497152, 479321, 555693, 501602, 374050, 108100, 599183, 745353, 594333, 681477, 803990, 219540, 553755, 562043, 307905, 394924, 197087, 539333, 282574, 591103, 704635, 395766, 400706, 405032, 653949, 664806, 631837, 730062, 510942, 431562, 316044, 400171, 591784, 591568, 621781, 359224, 562547, 472280, 441075, 521180, 517088, 711036, 319401, 822186, 531035, 275757, 311206, 587122, 671602, 576409, 737910, 467345, 727451, 304476, 439116, -98127, 505579, 341025, 406827, 325090, 646589, 250826, 861441, 505830, 562156]
17154E62156q7861K19499j53251L12628J47906m67155K24049o9105m1236j41146
17144E06484J73370J03672o6172m6000P2762k93500M9313J93334k37914J90512
17134F45861B31996N21200o9186N1462J6739J52888l39463L62780k79163Q8943
17124G38196r3638j12631O9507K20112k38822n958O8456J76360k97888L14146
17114H37840o2800N7690K2841O558l01919K72324J86738l89491L90810l30357
17104F90234J92935j09648M8795J46317o3656m00217M58540j05534J9547J07924
17094I85237m61982N10630p0872k37361N3126q1868j90340K58118K66912j06556
17084I25044M2813k94917l6346P0802p2343m056O983M42041k99100O5590K84741
$$ y = [562156, 474295, 693794, 540543, 853171, 1001077, 533922, 757971, 688866, 647630, 506484, 679854, 783526, 717354, 671354, 744116, 450616, 499929, 693263, 455349, 645861, 231996, 753196, 684010, 735472, 752211, 905099, 565636, 928416, 649253, 738196, 644558, 531927, 601434, 821546, 582724, 576766, 645222, 821582, 523694, 837840, 775040, 832730, 855571, 862129, 560210, 832534, 1019272, 629781, 1020591, 690234, 883169, 773521, 822316, 968633, 904977, 504760, 963300, 857766, 877313, 985237, 523255, 1033885, 963013, 725652, 778778, 696910, 506570, 764688, 1031600, 925044, 967857, 672940, 636594, 707396, 635053, 630997, 637980, 1080021, 780921, 846511, 1131252]
17073A131252j91328k82834J17705m0431K51925j16476J83508m48472K17764M06913
17063A229526l50445k8437O7030L16478k48114K1221J17525k84176P0103J48788
17053A059499m544m9679j9647j01201L12382P4996m2136r3768k1498j25468K23634
17042A212570m4943P2219k83054k76383N12849M3571M21543m88152j66739o6807
17032I36674L22152K0796J0928l0746k2625N7657m14952L01463j42159N00275
17022A539463j35662l0408j02943J13883J27997l07676K25377p9360j08730J74121
17012A416062j27595N4329K46033m97488J35594K26812o1629L05483k42041k01355
17002A254205j39346O13758m94282L60620k89278M39026q4755j71454l7825J36946
$$ y = [1131252, 939924, 657090, 774795, 734364, 986289, 869813, 1053321, 604849, 822613, 1229526, 879081, 850644, 917674, 1234152, 986038, 1007259, 1124784, 840608, 910711, 1059499, 1054955, 1005276, 985629, 884428, 1196810, 1271806, 1229670, 1135902, 1114404, 988936, 1212570, 1167627, 1239846, 956792, 680409, 1193258, 1236829, 1658372, 1170220, 1003481, 936674, 1258826, 1279622, 1290550, 1259804, 1237179, 1294836, 879884, 1181347, 1039188, 1539463, 1403801, 1373393, 1270450, 1384333, 1512330, 1204654, 1430031, 1350671, 1241941, 1416062, 1288467, 1342796, 1588829, 1091341, 1226935, 1453747, 1392118, 1697601, 1455560, 1254205, 1114859, 1728617, 1234335, 1594955, 1305677, 1744703, 1659948, 1488494, 1450669, 1587615]
16992A587615l55176J79628K24663k5207J73151j66226o208o0769O2911K59829
16982A874211j87853J75263j19589R4311m12106L60103m3325M3814m870n5902
16972A724057K71728j17948j73362K87755j63511J05755R7493L3789j88595J45400
16962B022561j85071K9461L8472J61927P4030N3197k96426J09000P6577l38196
16952A745532M43575k54465J88618K14488j73221l4750J33856J38590k5338j16037
16942B260848p7023N30247n88155K82390l65986L74195J29523K13502k00651n580
16932B553310j80901Q1340L14039k00483j86047J68217J57238K31039P631o7403
16922B877980K30722l06900K91073j71174R4713M46577l74566j70840L24067q7426
$$ y = [1587615, 1232439, 1412067, 1636730, 1611523, 1784674, 1618448, 1612240, 1551471, 1614382, 1874211, 1686358, 1861621, 1742032, 1836343, 1424237, 1784340, 1741015, 1784829, 1779959, 1724057, 1995785, 1877837, 1704475, 1992230, 1828719, 1934474, 2031967, 2065756, 1877161, 2022561, 1837490, 1866951, 1905423, 2067350, 2141380, 2194577, 1898151, 2007151, 2083728, 1745532, 2189107, 1934642, 2123260, 2337748, 2164527, 2129777, 2263633, 2402223, 2376885, 2260848, 2183825, 2714072, 2125917, 2408307, 2042321, 2416516, 2546039, 2759541, 2558890, 2553310, 2372409, 2453749, 2767788, 2567305, 2381258, 2549475, 2706713, 2937752, 2945383, 2877980, 3108702, 2801802, 3092875, 2921701, 3016414, 3462991, 3088425, 2917585, 3241652, 3154226]
16912C154226p0298j69004K01799K99751m39597o2729K71710L11656O1207l34241
16902C224480J65501L48434l90844J05985L04334j61612J33042J15307p9611K8150
16892C793166J36353j38357K42683j15966K32579k58888L74010Q6122J52804j97331
16882D307175K79146m08165J61285L31908k27974L19537q6176j71862J84553J71944
16872D861371n5297J6400K07591J72488K34937j31318r522l381P8714j23311N59795
16861E808467r6276j7437n6473N07289k83056M22184k16708N5588p8713L02860
16851F347725L45306k62149L52604J60374J64899O3536j37954K84057L4406J09017
16841G461821L02730j00650J45849J6155L73209J12597o4910N17164l1508K38645
$$ y = [3154226, 3083928, 2914924, 3116723, 3416474, 2976877, 2914148, 3185858, 3497514, 3558721, 3224480, 3389981, 3738415, 3347571, 3453556, 3757890, 3596278, 3729320, 3844627, 3765016, 3793166, 3929519, 3791162, 4033845, 3917879, 4150458, 3891570, 4265580, 4351702, 4504506, 4307175, 4586321, 4178156, 4339441, 4671349, 4443375, 4762912, 4676736, 4504874, 4689427, 4861371, 4806074, 4822474, 5030065, 5202553, 5437490, 5306172, 5296650, 5293269, 5371983, 5248672, 5808467, 5712191, 5694754, 5638281, 6145570, 5862514, 6284698, 6067990, 6123578, 6044865, 6347725, 6693031, 6430882, 6783486, 6943860, 7108759, 7172295, 7034341, 7318398, 7352804, 7461821, 7764551, 7663901, 7809750, 7825905, 8199114, 8311711, 8246801, 8763965, 8732457, 8971102]
16831H971102J56212K07528j99981N50522M7774J27148L58825j36871K57283L159
16821A0342701N25206J31089R3085K57307K29626P13051p5275j87412Q13320R8407
16811A2941105O7233M49274J22674L31952q5681N75823K5470L43767M57076L13562
16801A5542255N67636q8815N50138L33460R70568j97690N06598L70917N55192
16792A9110259L57361L35702M95818M71465R63660L23767J53796R25050L16212
16783B3453090N16505P46869N79041J022907M13184Q37816N94909Q79161Q04389
16774B9847871Q49910L96860J324040O60504P11172J124148P36126J480813O77673
16765C7809117J122866J060995J019821J135753J671695J068748J342110Q92210
$$ y = [8971102, 9127314, 9334842, 9134861, 9685383, 9733157, 9860305, 10219130, 10082259, 10339542, 10342701, 10867907, 10998996, 11092081, 11349388, 11579014, 12292065, 12216790, 12029378, 12842698, 12941105, 13008338, 13457612, 13580286, 13912238, 13826557, 14402380, 14427850, 14771617, 15228693, 15542255, 16109891, 16021076, 16571214, 16904674, 17875242, 17677552, 18184150, 18555067, 19110259, 19467620, 19803322, 20299140, 20770605, 21734265, 22058032, 22211828, 23136878, 23453090, 23969595, 24716464, 25295505, 26318412, 26731596, 27569412, 28164321, 29043482, 29847871, 30697781, 31094641, 32418681, 33079185, 33790357, 34914505, 35650631, 37131444, 37809117, 38931983, 39992978, 41012799, 42148552, 43820247, 44888995, 46231105, 47123315]
16757D7123315J748950J164933J578307J186264J596043J635665J276680J865346
16749E9175503J686224J622665J668589J250839J753597J315887K137560J912329
16741G2523193J671373J543292J643453J706109J510869J433829J415244J366153
16733H4813515J513366P33633J708545Q79301Q20519P99125M76989L86835O45676
16724I2777504K23274K71222j64688j91354o01174k74966p50481q00375p83108
16715H9705854j208337p48102j349787j427035j103655j422655j792483j598094
16707G9055706j356842j469372k218584j199271j875674j620330j593412j982715
16699F5739506j731511j461999j909197j104876j707140j786032j591529j478338
$$ y = [47123315, 48872265, 50037198, 51615505, 52801769, 54397812, 56033477, 57310157, 59175503, 60861727, 62484392, 64152981, 65403820, 67157417, 68473304, 70610864, 72523193, 74194566, 75737858, 77381311, 79087420, 80598289, 82032118, 83447362, 84813515, 86326881, 87060514, 88769059, 89648360, 90468879, 91268004, 91744993, 92131828, 92777504, 93000778, 93272000, 93107312, 92915958, 92314784, 92039818, 91289337, 90488962, 89705854, 88497517, 87749415, 86399628, 84972593, 83868938, 82446283, 80653800, 79055706, 77698864, 76229492, 74010908, 72811637, 70935963, 69315633, 67722221, 65739506, 64007995, 62545996, 60636799, 59531923, 57824783, 56038751, 54447222, 52968884]
16691E2968884j488399j135051j709168j395150j041235j548312j299248r95663
16683D2356658j213454j252676r66631r28190j396708q88353o55431j249041o54808
16674C3151366r92236q93206r26744p52850o88705p98317n98889n42306o17580
16665B6340533j208639l77210o07763p43538K9194j212041j07325p61610j97718
16656B1153883o81329n21898k02258p10830m74180n22913p8938m19648n87133
16647A6954756l44022P3902p79985K1099m73339m05749n8200q42828J87392m50734
16637A3882292n18164m3430j42757o6522n92092L9301m86247k53556m3330l11225
16627A1464270k13407L5455n32158j03444k64646p188k81933l16909j10350j965
$$ y = [52968884, 51480485, 50345434, 48636266, 47241116, 46199881, 44651569, 43352321, 42356658, 41143204, 39890528, 38923897, 37995707, 36598999, 35710646, 35055215, 33806174, 33151366, 32159130, 31265924, 30339180, 29586330, 28897625, 28099308, 27500419, 26958113, 26340533, 25131894, 24754684, 24146921, 23403383, 23432577, 22220536, 22113211, 21351601, 21153883, 20472554, 19950656, 19748398, 19037568, 18563388, 18040475, 17961537, 17541889, 16954756, 16610734, 16684636, 15904651, 15925750, 15452411, 15046662, 14988462, 14145634, 14333026, 13882292, 13364128, 13320698, 13177941, 13111419, 12519327, 12558628, 12072381, 11818825, 11775495, 11464270, 11250863, 11286318, 10754160, 10650716, 10386070, 10378882, 10096949, 9780040, 9669690, 9667725]
16617I667725m61277K47643j19717l15370l61013J7675l29040J11136O4006l16409
16607H205359l71232l8618M2143j22484l28102J79758k15900r2270k26079j38312
16597F894263j10912m1794N2034r1890m25682o1193J96379l8658l92054J79247
16587F159740m41510L15687l02734J12682k09296k1288j44382R7820k54288N3641
16577E366072N844l98045K66774l06500l5371K91227m81937J08932q6454K57465
16567D988007m05428k262k28558O3810j01972J38455l15637K76689j19346j47545
16557D146213j66001K34174k48117J44708n5685r6634J12028m03475P4670L13734
16547D055615r0477l09135k46704K24075k50258K76323k41820r0849J99381k81704
$$ y = [9667725, 9206448, 9454091, 9334374, 9019004, 8657991, 8675666, 8346626, 8457762, 8521768, 8205359, 7834127, 7795509, 7837652, 7715168, 7387066, 7566824, 7350924, 7258654, 7032575, 6894263, 6783351, 6741557, 6793591, 6701701, 6276019, 6214826, 6411205, 6372547, 5980493, 6159740, 5718230, 6033917, 5731183, 5843865, 5634569, 5613281, 5468899, 5566719, 5312431, 5366072, 5371916, 4973871, 5240645, 4934145, 4898774, 5190001, 4708064, 4816996, 4730542, 4988007, 4582579, 4580317, 4351759, 4415569, 4313597, 4452052, 4136415, 4413104, 4293758, 4146213, 3980212, 4214386, 3966269, 4110977, 4055292, 3958658, 4070686, 3667211, 3741881, 4055615, 3965138, 3656003, 3409299, 3633374, 3383116, 3659439, 3417619, 3326770, 3526151, 3244447]
16537C244447M42021m80313J32234m2657L7184n43829M34808m24875K10084p0928
16527B938176K41499n63106L13456j39500K0571r005p8626J4778l0881k3691j85808
16516B497863K83080k69319j01783J74341O7350j28174n1706J34762k15118O04
16506B391900Q8208n1373q0345o4311K2805O536J8868J50853j30321j06013O1197
16495B308004q5680N1356k78296K36370j35822J2381O2519j6163m29492L12888
16485B038065O1087o1794r3512J46590q6486m56303L27879m306j8026J87013p9000
16474A961207q9834J49749J69510k69929l2954J92350k14164k52294P8033l5324
16464A656350M62423n07507J09422J64169l37901n019q0866L82977l41280J06384
$$ y = [3244447, 3686468, 3206155, 3338389, 3295732, 3332916, 2789087, 3223895, 2799020, 3009104, 2938176, 3179675, 2616569, 2930025, 2790525, 2811096, 2802091, 2723465, 2738243, 2707362, 2683671, 2497863, 2780943, 2511624, 2409841, 2584182, 2651532, 2523358, 2471652, 2606414, 2391296, 2391900, 2480108, 2428735, 2348390, 2284079, 2306884, 2313420, 2332288, 2483141, 2352820, 2246807, 2308004, 2222324, 2273680, 1995384, 2231754, 2095932, 2108313, 2170832, 2154669, 1725177, 2038065, 2099152, 2037358, 1943846, 2090436, 2003950, 1547647, 1875526, 1871220, 1853194, 2040207, 1961207, 1871373, 2021122, 2190632, 1920703, 1887749, 2080099, 1865935, 1613641, 1691674, 1656350, 2118773, 1611266, 1720688, 1884857, 1546956, 1541937, 1461071, 1844048, 1502768, 1609152]
16454A609152k0171j31169L34503k69500M3864Q7988J20818j9086k6650o0000
16444A669749k46303p3947j6711K25626j69760j26560J957L46738m9569k42167
16434A319053P1305J1365k80459K63707J70629j49063j5890L8186k00079K64890
16424A493644l52127k4051K63941k94620n9924L80029n56693J89115N59389m94593
16414A104110L08107l56282J49240o3764j2549K9710J23386r8454K28558j62270
16404A249792Q4283j05675k34133O04654k94741k99231r4651R2023N0291Q0529
16394A133141M367q082q8829k72496J43408J12302j01119J95745o1125k75313
16384G81999o7970J80600j91540K86384n8350k3273D18028N53114m17008N27722
$$ y = [1609152, 1588981, 1457812, 1792315, 1522815, 1566679, 1654667, 1775485, 1756399, 1729749, 1669749, 1423446, 1349499, 1332788, 1558414, 1388654, 1262094, 1264051, 1610789, 1561220, 1319053, 1390358, 1401723, 1121264, 1384971, 1555600, 1406537, 1390647, 1428833, 1228754, 1493644, 1141517, 1117466, 1381407, 1086787, 1026863, 1406892, 850199, 1039314, 1598703, 1104110, 1412217, 1055935, 1205175, 1141411, 1128862, 1158572, 1281958, 1183504, 1412062, 1249792, 1334075, 1228400, 994267, 1598921, 1304180, 1004949, 910298, 1002321, 1052612, 1133141, 1137508, 1129426, 1040597, 768101, 911509, 1023811, 922692, 1118437, 1057312, 781999, 714029, 894629, 703089, 989473, 931123, 907850, 418028, 971142, 554134, 1081856]
16374A081856k51597J86470j01516j64417J73395m7389M3474j46159J61901m0498
16364H95520j16174r1818K21960J25287m3883k64120q5815K35871j67424l3535
16354F75869k13618L15503k6778L02598r7080k51733K91313j32804j38697L45070
16344A069643k87543L3376J10996J73837R990k34846J01041k69599J61999k43843
16334F25051K29028k29347p2281K76225m5712l1777j83356K90582N0538j01116
16324H07835L7832k82439N8063R9128P2295l13834J41225L59889m76259N35214
16314A038949m87008J73231P023K43274j36292C74495L53716l22994j55782M01685
16304F51120q8991M44271k88281j90013N1407k2659j5798K19379l49986L31517
$$ y = [1081856, 830259, 1016729, 915213, 750796, 924191, 876802, 920276, 774117, 936018, 895520, 779346, 687528, 909488, 1034775, 990892, 726772, 640957, 876828, 709404, 675869, 462251, 777754, 750976, 1053574, 956494, 704761, 996074, 863270, 724573, 1069643, 782100, 815476, 926472, 1100309, 1110299, 875453, 976494, 706895, 868894, 625051, 854079, 624732, 552451, 828676, 782964, 751187, 567831, 858413, 908951, 807835, 845667, 563228, 621291, 720419, 792714, 478880, 620105, 979994, 503735, 1038949, 551941, 725172, 732195, 975469, 839177, 374495, 728211, 405217, 249435, 651120, 562129, 1006400, 718119, 528106, 579513, 556854, 541056, 760435, 410449, 741966]
16294G41966j7223j15190o9484l6430p0393P0084J38092j54607J3423j48039Q4193
16283D36392J60876O8601P3128P3844j98257B29301N13368k81881J99390l2167
16273F28011k76114J24364K10507q3847p1518k52270L64535Q877o4674K9103D875
16261C12232M4929K859M2171J75762J40575r1992l473J91929l96294p8220J80147
16250E20625J88493A85352J78838J39287l4886j03447J99940A01841O86086k67608
16240E20319r4198p541L6876L06960l68343J42815J77205l45732Q4935Q8009j86758
16229C54547n0576J96629A75654J08839N4451K95071A26906K51375M3725j85472
16219B36534L72420A54013L8545K5100O67087l78639A65633J45861R0688O9315
$$ y = [741966, 724743, 609553, 540069, 503639, 433246, 503330, 641422, 486815, 500238, 352199, 436392, 597268, 665869, 738997, 812841, 614584, 229301, 742669, 460788, 660178, 628011, 351897, 476261, 686768, 602921, 531403, 279133, 643668, 652545, 587871, 616974, 4875, 312232, 357161, 360020, 402191, 577953, 718528, 626536, 623063, 814992, 418698, 340478, 520625, 709118, 185352, 364190, 503477, 468591, 365144, 565084, 101841, 787927, 520319, 426121, 418580, 455456, 762416, 394073, 536888, 714093, 368361, 453296, 541305, 354547, 303971, 500600, 175654, 284493, 338944, 634015, 126906, 378281, 422006, 236534, 608954, 154013, 192558, 217658, 884745, 506106, 165633, 311494, 402182, 471497]
16209D71497j28379k6999n9901J21788J24584k25033q8708K19821J80969k76914
16199C12725J12364l0754j48438J25466R9474j1886L2840B17606j7168J3885m9443
16188A64880n756K79847j51159L8213Q0940j02042A36807M82414j95831j39941
16178B83449E1037L006N25135k18252R1339j0822j1967q0261H6287J00295m0068
16167A46514e0415B83621A41374K32217J66353A53050m7110M21564k43899m4574
16157B39031J59753J1395j35067j21345n2250N3656J16819J25993J3397A53907
16146B86982R8700q5363L8714m7094l2203N3414K09746D4366J84715J03979F1998
16134A87971J30737e3331B37221J90213B04967O4348A29414K01666A06720j0712
$$ y = [471497, 343118, 316119, 256218, 378006, 502590, 277557, 188849, 408670, 589639, 312725, 425089, 394335, 245897, 371363, 470837, 458951, 491791, 217606, 200438, 214323, 164880, 159124, 438971, 287812, 326025, 406965, 304923, 136807, 619221, 423390, 283449, 51037, 54043, 579178, 360926, 452265, 441443, 429476, 349215, 86287, 186582, 146514, -50415, 283621, 141374, 373591, 539944, 153050, 105940, 527504, 283605, 239031, 398784, 410179, 275112, 153767, 101517, 155173, 271992, 397985, 411382, 153907, 286982, 385682, 300319, 339033, 291939, 259736, 313150, 522896, 44366, 229081, 333060, 61998, 187971, 318708, -53331, 237221, 427434, 204967, 269315, 129414, 331080, 106720, 96008]
16124I6008C749K59880q5405J99506A70125q2544K2856J01072J8652L45912F8749
16112I2247R2277Q2558b29754B35256M20I1020J89262k1823L11891H5601M2740
16101A28341O4920d4375l9400C1787a13215C62172F9292J97855J40725J32939
16091E40811B55659j09979J46217o900k0185j8312L5981G2070P9804M1081k9984
16080A62971m9597C5752K67404J96620a91906A67470L1230b390A73252h2331C54775
16068A07358J65897d194j02184A49844a92987e447A73742J68318a48893B71022
16057B89791J10259A47757a15280A64399F8266J58524K21835D8616N0255b8902
16046B40858L4856N2131A31816K8358J57536A48176l9136a18004k3424C24866
$$ y = [96008, 3749, 263629, 178224, 377730, 170125, 87581, 110437, 211509, 230161, 576073, 68749, 92247, 184524, 267082, -229754, 235256, 235676, 91020, 280282, 258459, 570350, 85601, 128341, 193261, -44375, -83775, 31787, -113215, 362172, 69292, 267147, 407872, 540811, 255659, 145680, 291897, 284997, 264812, 246500, 282481, 72070, 151874, 192955, 162971, 113374, 35752, 303156, 499776, -191906, 167470, 198700, -2390, 173252, -82331, 354775, 107358, 273255, -4194, -106378, 149844, -192987, -5447, 173742, 342060, -148893, 271022, 289791, 400050, 147757, -115280, 164399, 68266, 226790, 448625, 48616, 98871, -28902, 240858, 275714, 327845, 131816, 160174, 317710, 148176, 109040, -118004, -141428, 324866]
16035D13263H5656L12302d5932A91481J36272I5025J0468K61182b8910D69611
16024i8930B95632j30819m325N7690j08542m7502d040B60902E1427K98990A68990
16012C30053j54093l3754K32395O1330b89759c1513g138B09777P265j0512i2618
16000f5269A49987q496J97390A66883F4903A0923d7810b0936C77320j07543A26875
15988B73956L46706L42278N9104J15691l9747k40699P1427m60868m4097j27924
15978B95827j41642j2383J62479j09013C6401K66083a08478n7618N5997E2768
15967C43913J19039G3853j9587Q6793J14144J27030a79142g4328G583K40581h6856
15955e8830D44928D4375J73978g5918A47025K1262R0343h8403m6536E8118O3876
$$ y = [413263, 85656, 397958, -45932, 191481, 327753, 95025, 105493, 366675, -28910, 469611, -98930, 295632, 164813, 160488, 218178, 109636, 62134, -4040, 260902, 51427, 350417, 168990, 330053, 175960, 142206, 374601, 435931, -289759, -31513, -7138, 209777, 217042, 206530, -92618, -65269, 149987, 141491, 338881, 166883, 64903, 10923, -47810, -20936, 377320, 269777, 126875, 273956, 620662, 962940, 1022044, 1137735, 1097988, 857289, 928716, 467848, 423751, 295827, 154185, 141802, 304281, 195268, 36401, 302484, -108478, -166096, -110099, 52768, 343913, 462952, 73853, 54266, 141059, 255203, 382233, -179142, -74328, 7583, 248164, -86856, -58830, 444928, 44375, 218353, -75918, 147025, 168287, 258630, -88403, -134939, 58118, 121994]
15944A21994f228p0040A37434b05891G8912J30950o757b03262b5224J2609I6422
15932g9651B26838a3807A11131a13306k2345K3776K3197q841d4673C16300b59418
15920B26082B9098M04492b78824d4450A82136g2353L3892a2091A79435J47o0039
15909A19543J72997f8313B44245j10309N7761a68769b297B57594A0368J42441
15899A52809b62125A95352n5852k2665b30717f1324L0396A4804K44940a14370
15888H9102R191r135a86964c6023k16470A7J43053f9076H9865K02817M6088a19122
15875c11601E854L8160A4553a6792j4839J0021I5064d3236B0098J51504N9658
15864B31260a07097B0096c9759j41390B55110c2557B14790J9108e3864A14307
$$ y = [121994, -6228, -76268, 137434, -205891, 78912, 209862, 203105, -203262, -25224, -12615, 96422, -79651, 226838, -13807, 111131, -113306, -135651, -111875, -88678, -97519, -44673, 316300, -259418, 226082, 29098, 433590, -278824, -44450, 182136, -72353, -38461, -12091, 179435, 179582, 119543, 292540, -68313, 244245, 133936, 191697, -168769, -2297, 257594, 10368, 152809, -262125, 195352, 139500, 116835, -230717, -61324, -30928, 14804, 259744, -114370, 89102, 98293, 89158, -186964, -36023, -252493, 17, 143070, -69076, 89865, 292682, 338770, -119122, -311601, 5854, 44014, 14553, -16792, -31631, -21610, 95064, -43236, 20098, 171602, 231260, -107097, 20096, -39759, -181149, 255110, -32557, 214790, 233898, -53864, 114307]
15853C9360a79681B86290a14948A29910g9489k5280N1792j54696L6338j00199
15843b71534A912R6407b925A93378k0106J1672L4119a73151A80897P1739j02518
15832A50118c83371A11452b1769k66531A56688E4508a85580b1617C37496h4132
15821b53452A08561L30246I5732B9515K07827c60743A93142a52069A50261a75623
15810a12537C03205a93809B61492b3154A59156k2883a967E2853R4533J14813A5427
15798A07158b20044Q5086I3516P1062e0153B99022A35446K49409I4600L2098f9382
15786G5447o689M4904b187l6723A24782a25857B08536G6634a74002A08440L24595
15775D33035i2004A83597A5226J28180a66641k26017H5057M3702a14658l1068
$$ y = [39360, -179681, 286290, -114948, 129910, -79489, -104769, -52977, -207673, -171335, -271534, 1912, 98319, -2925, 193378, 173272, 184944, 219063, -173151, 180897, 252636, 150118, -383371, 111452, -21769, -288300, 156688, 54508, -185580, -21617, 337496, -84132, -253452, 108561, 438807, 95732, 29515, 237342, -360743, 193142, -152069, 150261, -175623, -112537, 303205, -193809, 261492, -23154, 159156, 136273, -1967, 52853, 147386, 262199, 15427, 107158, -220044, -134958, 93516, 164578, -50153, 299022, 135446, 384855, 94600, 126698, -69382, 75447, 68758, 113662, -2187, -38910, 124782, -125857, 208536, 76634, -174002, 108440, 433035, -92004, 183597, 15226, 143406, -166641, -392658, 85057, 128759, -114658, -145726]
15765a45726r6093B21539I5033k9008a06584A69775a16941A30289L4365L5991
15755B00645D0441i0618M837A22205b67390C01486p9653H0553p02K39990B8831
15743E2850b04150A38306a64975B94836d946C0498J60342o6393e1712B0462J31734
15732A52196a84544C57349b41055B33021F32c08326D1164L28759a179A74721a54610
15720a40212p9580I0223a47629j57238g9691A33138E9407Q9931a00765C17322
15709F9550a93673E677Q4677J33171c15104F8049b5884k94257a23550C5019g2714
15697a60796p4791K5820D33182d968j45598C29180j02144P3509I5095D5682c1968
15685B02193j0410a4706k27045I3297a7866B5205Q7157J06327a09204A89359b0386
$$ y = [-145726, -241819, 221539, 95033, 66025, -106584, 169775, -116941, 130289, 164654, 200645, 40441, -90618, -85781, 122205, -267390, 301486, 221833, 80553, 79851, 319841, 28831, 52850, -204150, 138306, -164975, 294836, -4946, 30498, 190840, 124447, -51712, 20462, 152196, -184544, 357349, -241055, 233021, 632, -308326, 41164, 369923, -1179, 174721, -154610, -140212, -219792, 90223, -147629, -304867, -79691, 133138, 59407, 149338, -100765, 317322, 69550, -193673, 5677, 90354, 223525, -315104, 68049, -25884, -320141, -123550, 35019, -72714, -160796, -235587, -209767, 433182, -4968, -150566, 329180, 227036, 300545, 95095, 45682, -31968, 202193, 191783, -14706, -241751, 93297, -17866, 25205, 112362, 218689, -109204, 189359, -20386]
15673F2662k7148a86821d5515q1204j27538B17124N8406j1095J434D7391a40243
15661G0553b9271B18997a79478A1250n542Q8370a42707N0717A41917a12987A82696
15649f6146A0558b11746c1057C7508L96478A05309O3604R8311b87956c470A72962
15637i590j16088I8705h9108L3149A85203j5494G647L8828a98672O4605B41368
15625b28471B2722a18145N8514B99182d3164b744A7549a25038C26787a89817B7905
15613F7703l858a52894B5803J10422b23002C6310K34475c26k72024E7680c24538
15601a15109J2143A000J05481h3745F3334J15560a46055D08405a91830m5974L118
15590b34686B08064a22310A02276P0284b45530e7756k4750B83919A3524a44434
$$ y = [62662, 35514, -186821, -45515, -126719, -254257, 217124, 275530, 264435, 265869, 47391, -140243, 70553, -29271, 218997, -179478, 11250, 5708, 94078, -142707, -91990, 141917, -112987, 182696, -66146, 10558, -211746, -31057, 37508, 433986, 105309, 168913, 267224, -287956, -3470, 172962, -9590, -125678, 98705, -89108, -55959, 185203, 169709, 7647, 46475, -198672, -134067, 241368, -228471, 22722, -118145, -59631, 299182, -43164, -2744, 17549, -125038, 326787, -189817, 27905, 67703, 63845, -152894, 25803, 136225, -223002, 36310, 270785, -326, -272350, 57680, -324538, -115109, -102966, 1000, 106481, -83745, 63334, 178894, -146055, 408405, -191830, -237804, -234686, 208064, -122310, 102276, 172560, -245530, -57756, -82506, 283919, 13524, -144434]
15579i8729G3758d45709A92951a76523B56312G4429c11901a20832j11008m0948
15569b72788j6622A15785a11798B15151B3317J28124B2949h4153I909a35605A4615
15557B71097E4632K94975n737H1243a35237m8946A85390G3276e1052j30807B12916
15545B8324d4286J5535j32191G9402C8002b96732A67679E8865g6201A53840K0320
15534A74160H1951J17607m4853J73711A12510L8842a12B60216O4137J63665B8874
15522e6076j09858i953A85680j6876k133D3708c26101C81190j30784g8142G4601
15510e1370B02955J37579L4359a7775B13261L08967A62344c3908l915B09811B5625
15498i0738j18278E9567M7233i6495k1936C00098a00658A16078c5444A15912j3271
$$ y = [-98729, 73758, -445709, 192951, -176523, 256312, 74429, -311901, -120832, -231840, -272788, -289410, 115785, -111798, 215151, 23317, 151441, 22949, -84153, 9909, -135605, 14615, 271097, 54632, 349607, 343870, 81243, -135237, -184183, 185390, 73276, -51052, -181859, 212916, 28324, -44286, -28751, -160942, 79402, 38002, -296732, 167679, 58865, -76201, 153840, 174160, 81951, 199558, 154705, 328416, 112510, 151352, -112, 260216, 324353, 488018, 28874, -56076, -165934, -9953, 185680, 168804, 166671, 43708, -326101, 381190, 250406, -78142, 74601, -51370, 202955, 340534, 374893, -17775, 213261, 522228, 162344, -33908, -37823, 209811, 25625, -90738, -209016, 59567, 106800, -96495, -118431, 300098, -100658, 116078, -35444, 115912, 102641]
15487A02641m0325b14190j7042A27662K44886f67n241C30264L5127A54482N26508
15476F80990q1613k52751L36017C20333A51756R2571j1713E720b8384j69477A66945
15464B5307P0628l6571J12676o2054h4412B8759L13305A67763E6285a81944P7120
15453a04824B91363d0394B31041e9497E47980a12852D22658K81004C16392N58514
15443H74906M2152l3954L30334F02130M0617e1997A39524c5737c42F9576K4189
15432I3765b22711E6705L05835A15380g0497c1451j80575C5036i9581c3956D12207
15420A03010C4680J03365a13388H806K48277B630a07699c6915j96235b8330D80280
15408A51264R0257E9244a87236b1001k565I3097c09681J05529c8740J1205j90649
$$ y = [102641, 62316, -214190, -231232, 127662, 372548, -667, -5908, 330264, 365391, 154482, 680990, 599377, 346626, 682643, 320333, 151756, 244327, 232614, 5720, -28384, -197861, 166945, 25307, 95935, 59364, 172040, 109986, -84412, 28759, 342064, 167763, 56285, -181944, -104824, 291363, -40394, 231041, -59497, 547980, -112852, 422658, 703662, 316392, 874906, 917058, 883104, 1213438, 602130, 642747, -51997, 139524, -35737, -342, 69576, 93765, -222711, 56705, 362540, 115380, -70497, -31451, -212026, 35036, -99581, -33956, 412207, 103010, 34680, 138045, -113388, 8806, 257083, 2630, -107699, -36915, -233150, -28330, 480280, 151264, 241521, 59244, -187236, -21001, -23566, 93097, -309681, -204152, -38740, -27535, -218184]
15397b18184P7986L859E5090M5673D9200N4750C0574j0434K28987e3321A09359
15385b68342D8008i4666A6083L11434b57342P3429f8145A80072N2331m7279H7634
15373A37913R4126C4993K81996j57993f0927A94375N86450E0996R2228L1802A3626
15361E6701L39037j41919n1768M0472n9593a38376E8152K94254A21769Q0104c018
15349A46743L1964R350I1693K95068A79324f569D41275r1504q1933L19318k48565
15338C38591O9355F1903f3231A45897J2628p2170M9412a87180C32640a62251D31561
15326a629B02312C8088b0657B23136f5211B59731C243a5192j88525C23818F9282
15314E2664L70436k1832A01398P6981O1661C6720M12231E8721J72728n6644f9128
$$ y = [-218184, -140198, -136339, 55090, 100763, 49200, 103950, 30574, 20140, 249127, -53321, 109359, -268342, 48008, -94666, 16083, 327517, -257342, -183913, -68145, 180072, 232403, 185124, 87634, 137913, 232039, 34993, 316989, 158996, -60927, 194375, 780825, 50996, 143224, 175026, 13626, 56701, 395738, 253819, 202051, 242523, 182930, -138376, 58152, 352406, 121769, 201873, -3018, 146743, 178707, 188057, 91693, 386761, 179324, -6569, 441275, 349771, 267838, 587156, 338591, 407946, 61903, -63231, 145897, 158525, 86355, 135767, -187180, 332640, -162251, 431561, -1629, 202312, 38088, -20657, 223136, -65211, 259731, 3243, -15192, -203717, 323818, 69282, 52664, 423100, 401268, 101398, 178379, 240040, 36720, 448951, 58721, 231449, 174805, -69128]
15302B25490r4499H228e627D7432K66213r9678J32646A22184K20458g1574A8687
15290b34980C25082A4924O0207e1354B30780c1416l1908D869e2559A90221A1518
15278A12838m4493K37148m5873l9840a09759j96512B05909q3503c13506A0861
15267d3383E7004J09641a99710q6882a23077A17873d5262l1424c3323B89501j38142
15256A51359p362n3378c23898F48L0366K43636A21465L283c03711Q6139G335J28517
15244A35852c4909D36078J93670O53493Q49663p10769N28433r0083E99401j75520
15234D23881c2990B01705N7438O9703O6687M5178B198N3182O6005J94227k4768
15223B90844b10242N4319L3022B45760m5896m444F1506a38223M5671C58544m1802
$$ y = [225490, 130991, 8228, -5627, 47432, 313645, 213967, 346613, 122184, 342642, -71574, 18687, -234980, 325082, 14924, 75131, -51354, 230780, -31416, -63324, 4869, -52559, 190221, 11518, 112838, 68345, 305493, 259620, 219780, -109759, -306271, 205909, 122406, -313506, 10861, -43383, 57004, 166645, -199710, -286592, -123077, 117873, -45262, -76686, -33323, 289501, 151359, 143997, 90619, -323898, 648, 31014, 274650, 121465, 124748, -303711, -217572, 7335, 135852, -34909, 436078, 629748, 1283241, 2132904, 1422135, 1950568, 1860485, 599401, 423881, -32990, 201705, 259143, 328846, 395533, 440711, 2198, 55380, 121385, 315612, 290844, -210242, -155923, -122901, 245760, 199864, 195420, 61506, -138223, -92552, 358544, 316742]
15212C16742C3955M087J22535G1977B6057c08238A78425K0690J8181m5283d5208
15200a10443A84566O1030g220o687B33952I5289h2261n7057H0717p084a65221
15188b21382A94619g0806A83909Q0450g6949N91l86232A14239o761L43089j77084
15177B73483I9750B2158J54534J40847g9058H5698L40211A49467a94754A33264
15166A37325c031B27510A8854J28353B8421g2836m865F2076Q4813F9826R6263
15155A66089J99000b7987C45120A07487k9253A5073a34681d9966B16670a2338
15144A7262e5453A4381O2841A4352R4045a3663j44675A40959J6484m8903A4586
15132b64587B91967L7162A42140J65304a77780A43487b8437A15635K27208l2000
$$ y = [316742, 33955, 38042, 160577, 71977, 26057, -308238, 178425, 199115, 217296, 172013, -45208, -110443, 184566, 245596, -7220, -13907, 233952, 95289, -82261, -139318, 80717, 73633, -165221, -221382, 194619, -70806, 183909, 264359, -76949, -76358, -462590, 114239, 107478, 450567, 273483, 99750, 22158, 176692, 317539, -79058, 85698, 425909, 149467, -194754, 133264, 137325, -3031, 227510, 18854, 147207, 28421, -72836, -77701, 62076, 146889, 69826, 166089, 365089, -27987, 345120, 107487, 78234, 15073, -134681, -49966, 216670, -12338, 17262, -55453, 14381, 77222, 14352, 108397, -13663, -158338, 140959, 157443, 108540, 14586, -264587, 291967, 329129, 142140, 307444, -177780, 143487, -28437, 115635, 342843, 310843]
15122C10843j01084n096k9053P1208K2139K12302b11589A83730l3661D6754d1989
15110h958C88682C624K70205a89720i0649E3888N2238a07029B4228e350C8990
15098A02449J23820I7428d5764B70095O0269B0779K65096A7096K40534b5918C24788
15086I6966J03670B8349J40331m245M6782l9057j917p4317J22441l3798F4553
15074A03105A9645K20225J35048n0504A23855A5786K9353K78206n7433b3681A30091
15062C50011j64719l1693J45488p4559C53K00964R8391J15784p5099C9075K87674
15051C26749j31025K65705O3256B52447N6273m4028j2702n6397J33648e2497a3839
15039F56206P6A75153J30812L33039a0121D04325O4288P1087l2437j35516K83728
$$ y = [310843, 209759, 204663, 175610, 246818, 268957, 481259, -211589, 183730, 150069, 46754, -41989, -8958, 388682, 3624, 273829, -189720, -90649, 53888, 106126, -107029, 24228, -5350, 38990, 102449, 226269, 97428, -45764, 270095, 330364, 20779, 285875, 17096, 257630, -25918, 324788, 96966, 200636, 28349, 168680, 164435, 211217, 172160, 170243, 95926, 218367, 184569, 64553, 103105, 19645, 239870, 374918, 324414, 123855, 15786, 45139, 323345, 265912, -23681, 130091, 350011, 185292, 153599, 299087, 224528, 353, 201317, 299708, 415492, 340393, 39075, 326749, 195724, 461429, 524685, 252447, 308720, 264692, 251990, 195593, 329241, -52497, -13839, 656206, 656282, 175153, 305965, 639004, -10121, 404325, 468613, 539700, 507263, 371747, 655475]
15028F55475K56914j15124j20961j29685j33430J13908B58330O0616L0224M09375
15018G58545l59893j7625L05785l36245j00469L12483A81618j2167L22164k15874
15008B75741J3849J48523m7293n8682J2499J57809j64472J01346A33898M48564
14998E82462q8764j09100n6451J18836J31632n1258k60237M12815L6973n3959
14988F62949p0084k02855R2236M1496J05405k9619l8165M36566l18741k1583B86937
14976D13366J23188B49854K12708J39554L023J2525J66298k8687l35464P5378
14966D95189M6405k35400K75986j96128m0797J10853p3441J18059j62521A68543
14955D01801R1558j24053j10287A05636K13986Q5540j74904G9607O54462R249
$$ y = [655475, 912389, 797265, 676304, 546619, 413189, 527097, 258330, 318946, 349170, 758545, 398652, 381027, 686812, 350567, 250098, 562581, 181618, 169451, 491615, 275741, 289590, 438113, 390820, 332138, 344637, 502446, 337974, 439320, 133898, 582462, 493698, 384598, 328147, 446983, 578615, 527357, 267120, 679935, 716908, 662949, 592865, 390010, 482246, 523742, 629147, 599528, 561363, 997929, 679188, 657605, 286937, 413366, 536554, 249854, 462562, 602116, 605139, 617664, 783962, 755275, 419811, 495189, 541594, 306194, 582180, 386052, 345255, 456108, 382667, 500726, 338205, 168543, 401801, 493359, 369306, 259019, 105636, 319622, 405162, 230258, 79607, 734069, 743318]
14945G43318j58381J95842C70455j0872L45189C27656J43586o6711r9609L08748
14935F13670k70820K27222J34004J07060K69194K14148m3522j992J36787L87539
14925A773290q2855K37160p87952M56965k49370M31776L22726J12j05781j20082
14915A875989o96356o9510M4349l00399J1968l43273p7251K07315B86325P824
14905B94149K28490J08617j23316k18178K9832J05542M7862j0397K0106k04666
14895B78041J69712J87594n3455B75056M82183C45927M20762l78690K57214J60926
14885H06139j5170k09124L18590l81545K44626p2125J2783J86781j30127C60564
14874C40770K33430j79175K9571o0423l844J54496R0034J42426J340k84357J65998
$$ y = [743318, 584937, 780779, 370455, 359583, 704772, 327656, 471242, 404531, 304922, 613670, 342850, 570072, 704076, 811136, 1080330, 1294478, 1250956, 1248964, 1385751, 1773290, 1690435, 1927595, 1139643, 1596608, 1347238, 1779014, 2101740, 2101852, 1996071, 1875989, 1179633, 1110123, 1154472, 854073, 866041, 522768, 445517, 652832, 286325, 294149, 522639, 631256, 507940, 289762, 319594, 425136, 472998, 462601, 482707, 278041, 447753, 635347, 581892, 275056, 757239, 345927, 766689, 387999, 645213, 806139, 790969, 581845, 900435, 518890, 763516, 691391, 704174, 890955, 760828, 360564, 340770, 574200, 395025, 424596, 364173, 360329, 514825, 604859, 747285, 748625, 464268, 630266]
14863F30266k91716J99588j88911J36095o5644j86496j576L05663j95476J4019
14853C55812q7835K79542r0093J3377P1917r508J48104j16900L31549J12465k25652
14842G82778J8171N6603J48273k01303N2421L84635m99410k892p7351J15103j78584
14831E98444K24045k37525q4131J54906k16630A51427L46449J48251p8786m1960
14821E25381K364J61973K13610Q3864l88924j87350M96855D14435K5599L54861
14811G94895k39062J79465N2489j98988J14144K75501l50055J39439J56855B93945
14800D80362J10773J42056l56190j15955K11146p7869m2826M68619k42412K5801
14790F03505B22030L80792l8845B80469O82543j86544k36561o6993L27820k12288
$$ y = [630266, 338550, 538138, 349227, 485322, 419678, 233182, 231606, 537269, 341793, 355812, 267977, 547519, 457426, 470803, 542720, 533212, 681316, 564416, 895965, 1008430, 782778, 800949, 857552, 1005825, 804522, 856943, 1241578, 742168, 739276, 661925, 777028, 598444, 822489, 584964, 500833, 655739, 439109, 151427, 497876, 646127, 567341, 525381, 527745, 689718, 903328, 987192, 598268, 410918, 907773, 414435, 440034, 794895, 555833, 735298, 787787, 588799, 702943, 978444, 628389, 767828, 924683, 293945, 480362, 591135, 733191, 377001, 261046, 472192, 394323, 351497, 820116, 577704, 603505, 222030, 602822, 563977, 280469, 963012, 776468, 539907, 472914, 800734, 588446]
14780E88446j45777M56539J0500j87546R8052J17790j05600j12207k19360J61096
14770F61933j2349j33526l2735J09904Q7033m926J084k19684J32326k30572o7233
14759B91255J0153J56851Q5438j27673L29628K89683l66901J70152l58604J17759
14749E97741j05463K94588j56749J01977j91089K58539k78978J99922K6830K9839
14739G77157J65296k83933J10831l4935j66466K79538q1809K44951r9775K63234
14729A174089M67065k40055K45387J57155q7198m48528O6264m60878n580J93495
14719A061216l01249P4526O9996n4380p9989K670Q2517j59871L24324K3250j08973
14708I34037p1331J28928L30156o7188N7534L36783J43541J54704m52341j18748
$$ y = [588446, 442669, 899208, 909708, 722162, 820214, 938004, 832404, 720197, 500837, 661933, 649584, 516058, 483323, 593227, 680260, 675334, 676418, 456734, 589060, 358488, 291255, 301408, 458259, 543697, 416024, 745652, 1035335, 668434, 838586, 479982, 597741, 492278, 786866, 630117, 732094, 541005, 799544, 520566, 720488, 747318, 777157, 942453, 658520, 769351, 734416, 567950, 847488, 765679, 1010630, 910855, 1174089, 1641154, 1401099, 1646486, 1803641, 1716443, 1267915, 1334179, 873301, 867721, 1061216, 759967, 834493, 904489, 850109, 770120, 772790, 855307, 695436, 1019760, 1043010, 934037, 862706, 991634, 1321790, 1254602, 1312136, 1648919, 1792460, 1947164, 1494823, 1376075]
14698A376075J77978k67924k65275m5341j47901L02233J41319k91746K66036l06901
14688I38553k75332J19094j08847M43091l45596J10657r4558m0152L13292n06216
14678E53986J87148L05117M3531o774K6114J88979l63238K87483k58127L0286
14668I94505K14038l59619k5584L16739L5312j98800j7882J46724k39859Q6938
14658I52512M26255j61464n4064R8947l38866L74078j6010L8300m5800p9991j83313
14647A010584J34154N456j44755J14423J78974k99128R0328K14387k34683J38526
14637A208266k72706J55658K37840j56248o271P3379p0216J02479j00023k35072
14627I37086K7435L07026o0901j24378N85491r5671P41m04273o2191K56872k8172
$$ y = [1376075, 1554053, 1286129, 1020854, 975513, 827612, 1129845, 1271164, 979418, 1245454, 938553, 663221, 782315, 673468, 1116559, 770963, 881620, 787062, 746910, 1060202, 553986, 741134, 1046251, 1089782, 1083008, 1109122, 1298101, 934863, 1222346, 964219, 994505, 1208543, 848924, 823340, 1140079, 1175391, 976591, 958709, 1105433, 865574, 952512, 1378767, 1217303, 1163239, 1262186, 923320, 1297398, 1281388, 1319688, 1273888, 1193897, 1010584, 1144738, 1150194, 1005439, 1119862, 1298836, 999708, 1090036, 1304423, 1069740, 1208266, 935560, 1091218, 1329058, 1172810, 1166539, 1239918, 1169702, 1272181, 1172158, 937086, 964521, 1271547, 1210646, 1086268, 1671759, 1576088, 1576829, 1172556, 1110365, 1367237, 1339065]
14616A339065j09032L75364n250N0597l19857j72414n1348K46762l3348M7636
14606A368175k63209J780K87545l7374m5830j29459N05813K7812l24732j42646
14596A247875P7742J04111J79907J9405l3318J52206J32313k82781K55316j96520
14586A656256J3723O8113L7000k63098R0271K71004p634j62575J05144j91860
14576A616344L19958k05628K3185L93118j18597r1961J40779j41605K12234j62235
14566A985592J55462K04713l62302J30295L20266o251j2606K53343n7545N7992
14556B668959M0076L52753J74289j54536Q67366M59105J110841K441631L948987
14547A1909471P802605J4459837Q648299A8715248H573288m247987j604135m44710
$$ y = [1339065, 1230033, 1605397, 1600147, 1650744, 1330887, 1158473, 1107125, 1353887, 1320539, 1368175, 1104966, 1106746, 1394291, 1356917, 1311087, 1181628, 1687441, 1715253, 1390521, 1247875, 1325617, 1429728, 1609635, 1629040, 1595722, 1747928, 1880241, 1597460, 1852776, 1656256, 1669979, 1738092, 1775092, 1511994, 1602265, 1873269, 1865635, 1703060, 1808204, 1616344, 1936302, 1730674, 1753859, 2146977, 2028380, 1936419, 2077198, 1935593, 2147827, 1985592, 2141054, 2345767, 1983465, 2113760, 2434026, 2427775, 2415169, 2668512, 2610967, 2668959, 2709035, 3061788, 3236077, 3081541, 3948907, 4408012, 5518853, 7960484, 11909471, 19712076, 34171913, 42820212, 18715248, 8573288, 4325301, 2721166, 2276456]
14539B276456N25969l3033N29830J650818l4847k187962q8782o17586k06090M69575
14529B284348k86455O8781K0926q9181r2713N67714m68014L00716M2775J43947
14519B492844N4294l02501M2636J74752N2461k8390K5245L7796L77506n05614
14509B421029L08924q1035J19441R0013m2902k64177K76605K13088l9105j96995
14499B804886k9075R6007L23022o47214M67865J18725k42495K48371J60209j62062
14489C138239L19170n35817L28501R9121J14507J83880q8991k75631J11413L97285
14479C791677M2629p7211L2263o1504J67270Q0495m39647N53691j52099j09884
14469C827680K26620O5634K25350N1910j14836P2979j13222p6222J54881K22230
$$ y = [2276456, 2802425, 2769392, 3299222, 4950040, 4915193, 2727231, 2638449, 2020863, 1814773, 2284348, 1997893, 2066674, 2087600, 1998419, 1905706, 2473420, 2005406, 2306122, 2348897, 2492844, 2547138, 2244637, 2287273, 2462025, 2514486, 2486096, 2511341, 2549137, 2926643, 2421029, 2729953, 2648918, 2768359, 2858372, 2815470, 2551293, 2827898, 3040986, 3001881, 2804886, 2775811, 2871818, 3194840, 2547626, 3015491, 3134216, 2891721, 3140092, 3300301, 3138239, 3457409, 2921592, 3250093, 3349214, 3463721, 3647601, 3558610, 3282979, 3394392, 3791677, 3834306, 3757095, 3789358, 3727854, 3895124, 3975619, 3535972, 4089663, 3937564, 3827680, 4054300, 4119934, 4345284, 4397194, 4282358, 4355337, 4242115, 4165893, 4320774, 4543004]
14459D543004j06644n3224M6007M57865J00931l89053J79733O31185m95047o375
14449D908382q3768L50701K04878O4845j41128n5664K84935J85880k8140q9379
14439E601542l1461J56410J85123l7284L08559l3113M47286m9066l3393j90746
14429F323857O09120l7410L0936r0365K87504L8505P17905O8457R104l74742K4699
14418G607570K49386K45279K47603J8761l9680J21118k28437M60462k27217L73487
14408H828332K31400K87667M1965L42182l40284L58542l86339K59397P8410Q6818
14398I788090M69282K59872K71630L4668j594L69454K51378j028J47570M58659
14388A2047981K92849k22428K86797M40297K29392L8218L78369L83512l3417K24365
$$ y = [4543004, 4436360, 4383136, 4429143, 4887008, 4987939, 4598886, 4778619, 5409804, 4914757, 4908382, 4824614, 5175315, 5380193, 5445038, 5303910, 5248246, 5533181, 5719061, 5690921, 5601542, 5570081, 5726491, 5911614, 5874330, 6182889, 6149776, 6597062, 6547996, 6514603, 6323857, 6932977, 6895567, 6926503, 6836138, 7123642, 7162147, 7880052, 7948509, 7957613, 7582871, 7607570, 7856956, 8102235, 8349838, 8368599, 8328919, 8450037, 8221600, 8682062, 8454845, 8828332, 9059732, 9347399, 9389364, 9731546, 9391262, 9749804, 9363465, 9622862, 9701272, 9788090, 10257372, 10517244, 10788874, 10823542, 10821948, 11191402, 11442780, 11441752, 11589322, 12047981, 12340830, 12118402, 12405199, 12845496, 13074888, 13113106, 13491475, 13874987, 13841570, 14065935]
14378A4065935N32873P4105N6721M89073K50445K85381N24425L00716K38324O43968
14368A7461966N8341L29000K71620M01853N277O23105M73073L1272R13453K49287
14358B0818247O72709K64970P67552K75093O81025M98217N90246P57888N28049
14349B5853996O39116J068611K20663P58765O65411O32970R07532N89506J134936
14340C2471506Q41643J051789J046947N91247J229654J311393R92878J509692
14332D1046749R74482J455904J282677Q84063J505082K046433J660947J670619
14324E2526956J540222J934852J972668K261000J678809J800149K116537K751216
14316F8582409K269346K953543L275872K821696K993831L237012L509170L920847
$$ y = [14065935, 14598808, 14672913, 14729634, 15218707, 15469152, 15754533, 16278958, 16579674, 16817998, 17461966, 17520307, 17849307, 18120927, 18522780, 18528057, 19151162, 19624235, 19655507, 20568960, 20818247, 21490956, 21755926, 22523478, 22798571, 23479596, 23977813, 24568059, 25325947, 25853996, 26493112, 27561723, 27782386, 28541151, 29206562, 29839532, 30747064, 31336570, 32471506, 33313149, 34364938, 35411885, 36003132, 37232786, 38544179, 39537057, 41046749, 42021231, 43477135, 44759812, 45643875, 47148957, 49195390, 50856337, 52526956, 54067178, 56002030, 57974698, 60235698, 61914507, 63714656, 65831193, 68582409, 70851755, 73805298, 77081170, 79902866, 82896697, 86133709, 89642879, 93563726]
14308I3563726L956130L908392M501402M669426N229354N191834N478486N696299
14300A32195049O453069O700070O976534P284922Q176804P984689R115339R234553
14292A94121029J0404194R835204J1453504J1394700J2711643J2489330J3033940
14285B75443544J3914793J4028786J4511035J4690923J4394930J4777078J4803490
14278C76564579J4178828J3592849J2969891J0886005P854064K539747Q64400
14271D39450363J410992J307079L176167m462531l473665m397252p293473r225228
14263D16492452j1504625j2813048j4261004j4788368j5107116j5437314j5660716
14256C16920261j4974472j4704354j4637756j3320102j3153493j2424151j2168957
$$ y = [93563726, 97519856, 101428248, 105929650, 110599076, 115828430, 121020264, 126498750, 132195049, 138648118, 145348188, 152324722, 159609644, 167786448, 175771137, 184886476, 194121029, 204525223, 214360427, 225813931, 237208631, 249920274, 262409604, 275443544, 289358337, 303387123, 317898158, 332589081, 346984011, 361761089, 376564579, 390743407, 404336256, 417306147, 428192152, 436046216, 438585963, 439450363, 440861355, 442168434, 445344601, 440882070, 437408405, 433011153, 425717680, 416492452, 404987827, 392174779, 377913775, 363125407, 348018291, 332580977, 316920261, 301945789, 287241435, 272603679, 259283577, 246130084, 233705933, 221536976]
14249B21536976j1528025j0380339r804724p772033q989141q435971p886071p717461
14241A49023211o973875o831299o227565n722982n493370n527511m768935m743834
14233A02733840m540562l568942l288687m171270l524160l565448k707230l626212
14225G3741329k433108k784821k452515k327648j959204j924231k482042j627801
14217E5749959j739428k136168j409184j344868j448885j835446j248993j504288
14209D3082699r83964j263173r28094r72334j574159r18710j043292r65771p51675
14200C3681527p80413j156072q21613p05702q51941n25635p88154n86907r31078
14191B6534012o22634n15028q10936K3897r16399o74540m60756j90029m87695
$$ y = [221536976, 210008951, 199628612, 189823888, 182051855, 173062714, 164626743, 156740672, 149023211, 142049336, 135218037, 128990472, 123267490, 117774120, 112246609, 107477674, 102733840, 98193278, 94624336, 91335649, 87164379, 83640219, 80074771, 77367541, 73741329, 71308221, 68523400, 66070885, 63743237, 61784033, 59859802, 57377760, 55749959, 54010531, 51874363, 50465179, 49120311, 47671426, 45835980, 44586987, 43082699, 42098735, 40835562, 39907468, 38935134, 37360975, 36442265, 35398973, 34433202, 33681527, 32901114, 31745042, 30923429, 30217727, 29365786, 28840151, 28051997, 27465090, 26534012, 25911378, 25396350, 24585414, 24609311, 23692912, 23018372, 22557616, 22367587, 21879892]
14182B1879892o58299k49694p69563p21263k42146k06449m77583k23618p43703
14173A7587574j59191j19522l20153m69759j7055n76617n15189K5487n37982k66013
14163A4631580j2575j44564o60749k2117m21552k90592l35148J32178m13034j03623
14153A2359804l86807r8191j37805j82142n92348K01438k90227j87189p6317O2893
14143A0673109n90356j2930P6608j80137l55460K24328m51954m62322J29357r324
14133I040919k76497j8291R4886m48561l21354N70028n42884j49819J65438J12675
14123H226540n14224j57001J88261k40278j19361j42154J12784j68323k78599
14114F907645j82247J64307k93836q3053j63897K81977k58456Q4374k16973k3903
$$ y = [21879892, 21221593, 20971899, 20202336, 19481073, 19238927, 19032478, 18554895, 18331277, 17587574, 17428383, 17308861, 16988708, 16518949, 16501894, 15925277, 15410088, 15435575, 14897593, 14631580, 14619005, 14474441, 13813692, 13791575, 13370023, 13079431, 12744283, 12876461, 12463427, 12359804, 11972997, 11874806, 11737001, 11554859, 10962511, 11163949, 10873722, 10686533, 10610216, 10673109, 10082753, 10069823, 10146431, 9966294, 9610834, 9835162, 9383208, 8920886, 9050243, 9040919, 8764422, 8746131, 8841017, 8392456, 8071102, 8641130, 8098246, 7948427, 8113865, 8226540, 7712316, 7555315, 7743576, 7503298, 7383937, 7241783, 7354567, 7186244, 6907645, 6725398, 6889705, 6595869, 6512816, 6348919, 6630896, 6372440, 6456814, 6239841, 6215938]
14104F215938k4019l41767K76844n333n73224K75959l02856k2399K03028m06403
14094E295768K20489k98115J78349n57091L01043o814r3807J53391m26447L44798
14084E111564k77949M7530n99555O72641l27846m52902N28266l2143l10577J45667
14074D504696l54739R0700P2986l63742M1784J42033Q288K7418l51277K21776
14064D039923l26209M05269n9725K4061j71013K4414L1362j16155k03694M86479
14054D134712q98333N41408k02877k71379L00814l11496K4470J83761j73920j57697
14044C169463J26244L1356k37445r9753j3054R4048J14871l39422J74264j26194
14034B894378j16930Q7887J27443J42640J04700k70295j92378L99439l48571j01746
$$ y = [6215938, 6191919, 5850152, 6126996, 6121663, 5548439, 5824398, 5521542, 5499143, 5702171, 5295768, 5516257, 5218142, 5396491, 4839400, 5140443, 5133629, 5039822, 5193213, 4766766, 5111564, 4833615, 4881145, 4281590, 4954231, 4626385, 4173483, 4701749, 4669606, 4359029, 4504696, 4149957, 4240657, 4313643, 3949901, 3991685, 4133718, 4142006, 4169424, 3818147, 4039923, 3713714, 4118983, 4059258, 4083319, 3912306, 3936720, 3968082, 3851927, 3648233, 4134712, 3236379, 3777787, 3574910, 3303531, 3604345, 3292849, 3317319, 3501080, 3327160, 3169463, 3295707, 3327063, 3089618, 2989865, 2976811, 3070859, 3185730, 2846308, 3020572, 2894378, 2777448, 2865335, 2992778, 3135418, 3240118, 2969823, 2777445, 3176884, 2828313, 2726567]
14024B726567j78165J46389J48349l70622L57156l50927J69336m17688J86281
14015B416676n026j36680O2477j6692n9863k43724L29541j6050k15995J9019P4581
14004B208264P8415m13836K55509n0388l4638k6264m35008k4421M65490J1239
13994B034362l39747O9054O9936L75967L21315J550804K716453N907635J3572575
13985B6278354J8557465j7808406j2658945n701362k574032j386675p44727k49939
13977C711733o80289j25642O09k75217l26857L18078K97210l80185j54733J67594
13967B552301j60341j93375k71701K82449j6799P881P3646L6955l42212J59234
13957B128038J48918m99600l4631o5567N50528m50859k44293K00466J75253j45508
$$ y = [2726567, 2548402, 2694791, 2843140, 2472518, 2829674, 2478747, 2648083, 2230395, 2416676, 2411650, 2274970, 2337447, 2320755, 2260892, 2017168, 2346709, 2330659, 2114664, 2133683, 2208264, 2286679, 1872843, 2128352, 2077964, 2043326, 2017062, 1582054, 1557633, 2023123, 2034362, 1694615, 1763669, 1833605, 2209572, 2530887, 4081691, 6798144, 12705779, 26278354, 44835819, 27027413, 14368468, 8667106, 6093074, 4706399, 3961672, 3711733, 3031444, 2905802, 2906411, 2631194, 2304337, 2622415, 2919625, 2539440, 2384707, 2552301, 2391960, 2198585, 1926884, 2209333, 2192534, 2200415, 2274061, 2311016, 1968804, 2128038, 2276956, 1777356, 1742725, 1677158, 2227686, 1776827, 1532534, 1733000, 1908253, 1762745]
13947A762745L3078K07569o28617M34699p4131O6863j80941M536l90912M00755
13937A635644R3046l27266N56223l67287J81590l76684K80165p9938p6560J20391
13927A639324j65745j81672J48119k20294L43848p0712J50700j02749q8605K3615
13917A475829K86417l17490l7997n0944L19850m67873J01645j15043N3858N7743
13907A305995M46060m67136p2J6875J60771k0019j84419K63722m74130N1266M5024
13896A143937J04789M9086J0143K08801j05156l32483J46605l28336K95073J29229
13886A321688J04123J5437l26830j25489L76747j79691K11611k19512j75045q6115
13876I16924M6808Q28R4535J27254k37038K6978p6754Q5205R5310k86585K03915
$$ y = [1762745, 1795823, 2003392, 1374775, 1809474, 1735343, 1802206, 1621265, 1625801, 1234889, 1635644, 1728690, 1401424, 1957647, 1590360, 1771950, 1395266, 1675431, 1595493, 1518933, 1639324, 1473579, 1291907, 1440026, 1219732, 1563580, 1492868, 1643568, 1540819, 1452214, 1475829, 1762246, 1444756, 1406759, 1355815, 1675665, 1207792, 1309437, 1194394, 1248252, 1305995, 1752055, 1284919, 1284847, 1301722, 1462493, 1442474, 1258055, 1521777, 1047647, 1098913, 1143937, 1248726, 1297812, 1307955, 1516756, 1411600, 1079117, 1225722, 897386, 1192459, 1321688, 1425811, 1441248, 1114418, 988929, 1365676, 1185985, 1397596, 1178084, 1003039, 916924, 963732, 964560, 1059095, 1186349, 949311, 976289, 899535, 984740, 1080050, 793465, 997380]
13865I97380K6536j85782P7965p082K86008j27538j83746L75266k17580r5013
13855I46414l4501L63686M2964m39775j60351K38164r5625J73218P8515l42878
13845G69831J02457J34014l11994N0056L17845k22093J21131j66677J84373k8515
13835I50428K35861k09176k47252j23772L82754m4489r2903K4631j47519L10748
13825A039311j67899j27490l0182p1454M23412j70907K6101l00521p7586J8189
13815E60974K52426j18972J64637j74635J83350k78461J22645j29532L96835J50975
13805A130242k43507J55095n7060l81782R3677j89509l4011Q3481n069J46617
13795F98174l7460k18455K71638l6440q3959n5330q9779M12722k85032P1327j27012
$$ y = [997380, 1023916, 838134, 916099, 909017, 1195025, 1067487, 883741, 1259007, 1041427, 946414, 911913, 1275599, 1318563, 878788, 718437, 956601, 860976, 1034194, 1112709, 769831, 872288, 1006302, 694308, 744364, 1062209, 840116, 961247, 794570, 978943, 950428, 1186289, 977113, 729861, 606089, 988843, 944354, 851451, 876082, 728563, 1039311, 871412, 743922, 713740, 642286, 1065698, 894791, 920892, 620371, 542785, 560974, 813400, 694428, 859065, 684430, 867780, 589319, 711964, 582432, 979267, 1130242, 886735, 1041830, 984770, 602988, 696665, 507156, 473145, 556626, 551557, 698174, 660714, 442259, 713897, 677457, 593498, 538168, 448389, 861111, 576079, 647406, 520394]
13784E20394P3159j28257L71836j43576L4374j40993M35418j28555C31011K61990
13774E93001K61455k10687J5958K6971N5137r4190k45723K62167q9586j48475
13764D26028J99670j39932j21748j11748N13031j20705K4470B67480K88886L7838
13754E94204m5545K14639o0391o5917B88862L1729K91841j92788J66691k07485
13744C78850K38637p3194J92217B76252J41482R9884q9071N8022L03562j3906
13734G76225j41043k99826n0077K27839L59176k44753l8324j25900K47450l46950
13724C63817J48026J85304l22327N04421l34190J16730r4325j53124q8626r0636
13714B35070M26307k37150J19995N3862r8650r2562N1536r1775P6560K99707l71081
$$ y = [520394, 593553, 465296, 837132, 693556, 727930, 586937, 1022355, 893800, 331011, 593001, 854456, 643769, 659727, 686698, 741835, 647645, 401922, 664089, 574503, 426028, 625698, 485766, 364018, 252270, 765301, 644596, 669066, 267480, 556366, 594204, 548659, 763298, 702907, 636990, 288862, 320591, 612432, 419644, 586335, 378850, 617487, 544293, 736510, 276252, 417734, 517618, 428547, 486569, 790131, 776225, 635182, 335356, 285279, 513118, 872294, 627541, 589217, 463317, 710767, 363817, 511843, 697147, 374820, 879241, 545051, 661781, 567456, 414332, 325706, 235070, 661377, 424227, 544222, 598084, 499434, 406872, 458408, 366633, 443193, 742900, 371819]
13703C71819J376J13182J04845j79727j15092K99984R824k437j38315j23793N2403
13692C94069K49932r2977K32316k55622j25284K97827k67776J42364I2998M17592
13682E10590o9764A72993O07057l04964K60528k85429J81102o5538B70519N73712
13672H44231B57792P1110K79399m2730j35764r366j23497K20853q2150L01972
13662G37619k02954p7359A69246J17245K24887J1594A68687l802N00641k20181
13652D45345M2178j93996K14921m7041j58473q639P8051j10827P6701j16518L65978
13641E87680o9693k33463p8570n2910K35432j54497p0605M06343j80647n1033
13631C38037D9431M99435k46027O4194L0243L8728n553p3586K43514j41767j6820
$$ y = [371819, 373195, 486377, 591222, 411495, 296403, 596387, 606211, 603774, 465459, 341666, 394069, 644001, 551024, 783340, 527718, 402434, 700261, 432485, 574849, 92998, 510590, 440826, 172993, 780050, 475086, 735614, 450185, 631287, 565749, 270519, 844231, 257792, 328902, 608301, 565571, 429807, 420441, 296944, 517797, 435647, 737619, 534665, 457306, 169246, 286491, 511378, 522972, 168687, 164885, 665526, 445345, 487523, 293527, 508448, 461407, 302934, 294295, 372346, 261519, 338220, 221702, 587680, 517987, 284524, 205954, 153044, 388476, 233979, 163374, 569717, 389070, 338037, 49431, 548866, 302839, 367033, 397276, 436004, 430451, 356865, 600379, 458612, 441792]
13620D41792n5619J10775J7684j61258A66858K76446J89506A96618O7789J13650
13610C78057q4878L80370H7673K14984e6633A80470m8934N68983k16058q4217
13600D00244J33629Q2348j5060q8535B53234p3508K17428r0218P0815L02236B96913
13588D06242m2529J69168j57783A28593N4816J15048a5822B30333K55459A42679
13577A70554M1443n5477O9120j9668o5458J80945A16926L66218A31042D3656L6831
13566H0487k7919M81045j89595j57960J7297J28100j13315D2035L55732I9699
13555E01359F2320M4381J54211q520j3067A09230k8613h9826A37111J13145A6571
13543A36876N7287H8246K28697j56785F2970O5896J39865p5366J27330a9294C54306
$$ y = [441792, 386173, 496948, 514632, 353374, 166858, 443304, 632810, 196618, 264407, 378057, 293179, 673549, 87673, 302657, -56633, 180470, 131536, 700519, 484461, 400244, 533873, 616221, 601161, 512626, 253234, 179726, 397154, 306936, 377751, 679987, 296913, 406242, 363713, 532881, 375098, 128593, 183409, 298457, -15822, 230333, 485792, 142679, 170554, 211997, 156520, 225640, 205972, 140514, 321459, 116926, 483144, 131042, 43656, 80487, 52568, 533613, 344018, 186058, 203355, 331455, 218140, 42035, 397767, 99699, 501359, 62320, 106701, 260912, 252392, 239325, 109230, 80617, -89826, 137111, 250256, 16571, 136876, 194163, 88246, 316943, 160158, 62970, 128866, 268731, 193365, 320695, -19294, 354306]
13531A92647M9087J33277p6983Q6218B6762R6129Q3937l5621J17631L37075H1899
13519B59759p5280J31366D8397Q9460o462J62142J5960J3901o997h6314C59790
13507A19726J88191J054A53186F7361M64649B20257n0191a51044A76887b29126
13496D76396e8242H40a01173B73447j4863H0020K90972J20651e1954H1449q892
13485G2557c3672D47111F0959N1448M6134K40406K9546j66843K28816B07783L1211
13474B38994l135m6210N03948j70887I5566J37654R6986j63758j8452k1077D1462
13462a70167B66807K20765M4407h8327B95825K17866A17945J35855a733B68815
13451A85293J45488q3409N0358A10359C2894K29525L0346j03607l5619a74243
$$ y = [192647, 241734, 375011, 298028, 384246, 26762, 122891, 206828, 171207, 288838, 625913, 81899, 259759, 184479, 315845, 48397, 137857, 131395, 293537, 309497, 323398, 316401, -86314, 359790, 119726, 307917, 308971, 153186, 67361, 532010, 220257, 170066, -151044, 176887, -229126, 476396, -58242, 840, -101173, 273447, 258584, 80020, 370992, 491643, -51954, 81449, 72557, -33672, 447111, 60959, 112407, 158541, 398947, 428493, 261650, 490466, 207783, 238994, 235859, 189649, 693597, 522710, 95566, 233220, 330206, 166448, 147996, 126919, 41462, -170167, 266807, 487572, 531979, -88327, 295825, 513691, 117945, 253800, -1733, 268815, 185293, 330781, 247372, 297730, 110359, 32894, 262419, 292765, 189158, 153539, -174243]
13440g7824B09941a29598A64368d3014B00712l8185J07395D874J64770D1804L05541
13429C47345A18082J9834c094j22052B22648D3668c4315C3258L61124H645M49721
13418D58366b966B89047J277P480J90872i5355H668J54852L1733K55416F5565
13406c157A99913j9831a3649B44797g2888C56308j07324I1608l9987h8881B49887
13394B85497p8703E3231J40019N3176j14036k6214k0O2207J2846J21587j7722
13383B85074J16847A1825M8106a61906G7337a03002j6999C09589n4534p8054N2285
13372B29286D3237L29685A22432C6057K57827F4565J67170m5325K8948M35768
13362F51126B50356K45750B15631J87106n0540j65083G0144J47030J9132l9576
$$ y = [-77824, 209941, -129598, 164368, -43014, 200712, 162527, 269922, 4874, 169644, 41804, 347345, 118082, 137916, -3094, -125146, 222648, 43668, -34315, 33258, 394382, 8645, 458366, -2966, 289047, 290324, 297804, 488676, -95355, 8668, 163520, 195253, 450669, 65565, -3157, 199913, 180082, -13649, 244797, -72888, 356308, 248984, 91608, 51621, -88881, 249887, 285497, 206794, 53231, 193250, 246426, 132390, 106176, 106156, 168363, 181209, 302796, 285074, 401921, 11825, 59931, -161906, 77337, -103002, -120001, 309589, 255055, 177001, 229286, 43237, 372922, 122432, 36057, 293884, 64565, 231735, 186410, 215358, 651126, 250356, 496106, 215631, 402737, 352197, 187114, 70144, 217174, 236306, 196730]
13352A96730K59676j72512K8877J65376f693A85121Q362L4909N8848a26586A42187
13340A3773J88926K8437L3215r3999m292c0792A03517j4435M01372I4339L57520
13329D51859A63701K2345E0253J04093M773g020D35487C3341J56862J71889I7435
13317D10593j19406r5563E1262L00298A26104J55994J36575L0808o6364A24635
13306B04054J20829A06283m7485J48331J11682E1665L98006B05286r6574n0908
13296E7804J17597l3122n1154L46901e9520A26022a47825C35956m9210d2155C86608
13284E1766O2741A8938K09788j04402K19628j31420A0621J05559a4123o975B54873
13272b04876A76471a5630C85348c59076I1439J87873C5727L0048b30438a9205
$$ y = [196730, 456406, 283894, 312771, 478147, -6693, 185121, 193483, 228392, 287240, -126586, 142187, 13773, 202699, 231136, 264351, 170352, 166060, -30792, 103517, 89082, 490454, 94339, 451859, 163701, 186046, 50253, 154346, 159119, -7020, 435487, 33341, 190203, 362092, 97435, 410593, 291187, 195624, 51262, 351560, 126104, 282098, 418673, 449481, 383117, 124635, 204054, 324883, 106283, 58798, 207129, 318811, 51665, 449671, 205286, 108712, 57804, 175401, 142279, 91125, 438026, -59520, 126022, -147825, 335956, 286746, -42155, 386608, 51766, 114507, 18938, 228726, 124324, 343952, 212532, 10621, 116180, -14123, -21098, 254873, -204876, 176471, -15630, 385348, -359076, 91439, 279312, 35727, 65775, -230438, -19205]
13261A63656e1043A53555J53829J02583k01715H8360M00472b3599D2291N8641
13251A00932J14881d38769C43875J33729A66635B6552R6581a44328l4241O4886
13241a13683N167A11392J0225g7876B51043a32615P986A40093B2917b32716e479
13229c17350C62927g8212A08756J73196D9576P8706k0289a63098A24522I552J75786
13218A85338F7158f0188j15732A58642e5454D4635J42971a1448k8480C3252J86183
13207B19435m5760M1136E5166c28421G2611P6860f9686C30331b7345C1993b31231
13195A67036n2272a40374H5058P1089P4042A98L1634J83193h6339D1682g0971
13183B97101b4773B24708b18039A23162J48830A18671J36567A19705D3349J78389
$$ y = [163656, -51043, 153555, 307384, 409967, 208252, 88360, 488832, -23599, 42291, 100932, 215813, -438769, 343875, 477604, 166635, 26552, 123133, -144328, -178569, -113683, -108516, 111392, 121617, -77876, 251043, -132615, -124629, 140093, 22917, -232716, -5479, -317350, 362927, -78212, 108756, 281952, 49576, 128282, 107993, -163098, 124522, 9552, 185338, 67158, -60188, -175920, 158642, -55454, 44635, 187606, -11448, -39928, 33252, 219435, 173675, 214811, 55166, -328421, 72611, 149471, -69686, 330331, -27345, 31993, -231231, 167036, 114764, -140374, 85058, 156147, 230189, 198, 31832, 215025, -86339, 41682, -70971, 297101, -24773, 224708, -218039, 123162, 271992, 118671, 255238, 119705, 43349, 221738]
13173B21738K45336a10635d0129B25069A06123a14083C80032A83656j4568h353
13162a93066c2761A04140g4565j14668L6991A55173e6454E9411O4688g553o1730
13151f9283A19948n9196J74039i1819C197K19140g0826C5304J8057O4223l5525
13140H2059B5565e5418J319o21A40110a57330o9755E2699K93706a88126h3690
13128A39417m2202f4266b0714B9841R3520J27384a17869G1859a5093r6996b2322
13116a9952B00393R1125e9286K7321D664a1624n7868B13080A06460E3064K49618
13105C02682I2454N4271a02029B52894a2589B41489n3654A4364d0900B76285H837
13093B29545c7141C48286e322I3530b41833D9609J22140J40674b45493A67327
$$ y = [221738, 467074, -110635, -40129, 225069, 106123, -114083, 380032, 183656, 169088, -8353, -193066, -32761, 104140, -74565, -189233, -152242, 155173, -56454, 59411, 124099, -7553, -69283, 119948, 60752, 234791, -91819, 3197, 222337, -70826, 35304, 53361, 117584, 82059, 25565, -55418, -54099, -54720, 140110, -157330, -227085, 52699, 346405, -188126, -83690, 139417, 97215, -64266, -20714, 29841, 123361, 250745, -117869, 71859, -15093, -112089, -22322, -19952, 200393, 291518, -59286, -31965, 4664, -11624, -69492, 213080, 106460, 53064, 302682, 92454, 146725, -102029, 252894, -12589, 241489, 187835, 14364, -40900, 276285, 8837, 229545, -37141, 348286, -5322, 93530, -241833, 49609, 171749, 312423, -245493, 167327]
13082B56524b034k66781a06731M5228B04369H3548O9475c3296l07726F4484O4061
13071A28545J31977a33607A30341d1681o1289B04766A588Q1509J07224m2190a95385
13059A6142a1095B71638r9389J8739G7455M3338a44813A90272E7728J66460C3098
13047h9060G0286i2150B49117D3267d1125j02808c2631A48477i2220C79911A28313
13035a6676A07497A1054L48974a98169A46922l9181h0512j06719F4875K25034
13025B89909a80987B24601a28339B69688a11032e4983K5993A63359M004J81968
13015C49331A14774J43221a04135B43157K3235a32395A86042k0165c34558D5289
13004B69897r8960m6487A5096L36741A25651c44781A76251o8898J7611B4199g3975
$$ y = [256524, -2034, -268815, -106731, -61503, 204369, 83548, 153023, -33296, -341022, 64484, 128545, 260522, -133607, 130341, -41681, -102970, 204766, 1588, 83097, 190321, 148131, -195385, 16142, -11095, 271638, 172249, 190988, 77455, 120793, -144813, 190272, 57728, 224188, 33098, -89060, 70286, -92150, 249117, 43267, -41125, -143933, -32631, 148477, -92220, 379911, 128313, -16676, 107497, 11054, 360028, -198169, 146922, 107741, -80512, -187231, 64875, 289909, -180987, 224601, -128339, 269688, -111032, -54983, -28990, 163359, 167363, 349331, 114774, 257995, -104135, 243157, 266392, -132395, 186042, 165877, -334558, 45289, 269897, 170937, 124450, 15096, 351837, 125651, -344781, 176251, 107353, 124964, 24199, -73975]
12992C64021r0015e109C53576h730k67337a19155D3837K6182a25654b9781H5085
12980a68107F99b6478p7129q8654C90038a36193e7A47628L2137a6725B02296q643
12968A93653i4845c528j7428j08715D1703L28482b74942B25619A5588J52910i9497
12956B17782e7525D2686K82626A8572b08565B0371J9316a5899k11151B5200O9240
12945I4440Q2803a73539A27295i3717A43752g0430B74332J39615A38066d45337
12934b04039b5991o2933A22131Q6478J62292a19280A31566f3303B400J72907O4306
12923B39613K7087f3561A76114a4930A06840O3143q3918a18849H1338L59063b14916
12911A76689J79533g8720B04398p4466a37429E41672A10933a59809f0487A50988
$$ y = [364021, 274006, -5109, 353576, -8730, -276067, -119155, 43837, 70019, -125654, -29781, 85085, -168107, 699, -26478, -103607, -192261, 390038, -136193, -57, 147628, 179765, -16725, 202296, 193653, -94845, -3528, -20956, -129671, 41703, 370185, -274942, 225619, 15588, 168498, -99497, 217782, -57525, 42686, 325312, 18572, -208565, 20371, 39687, -15899, -227050, 25200, 94440, 177243, -173539, 127295, -93717, 143752, -70430, 274332, 413947, 138066, -445337, -204039, -25991, -88924, 122131, 208609, 370901, -119280, 131566, -63303, 2400, 175307, 239613, 266700, -63561, 176114, -14930, 106840, 169983, 86065, -118849, 81338, 440401, -214916, 176689, 356222, -78720, 204398, 129932, -137429, 541672, 110933, -159809, -60487, 150988]
12900A80180b80073C9321c94906a57103b7758B34487a13648d590p9005c5295p8857
12889a14152I733L8882a89453A19034K09446I2376a954B68151a17128l3770d8073
12877C90146b56743J27176A99662i1326A83115o3648R0232A0714i4799m9621L7226
12866a07194c6859D23676d1750k87029h7143b2820m74819C73940A47605l947d6744
12854b1062j76851c1693J0790B04031b45657J07964A35880o7107b5353k27618
12844b52971B65595b11916B89558b96076A00441j0520J24980i3346b2401H0512
12833d0543o5128b723A07865B9276M6973M59236a73572F5120a88964H5898J57815
12822B43713c56775A65243a14421D73915a6402P944I8171b05009g6734F1653J5841
$$ y = [180180, -280073, 39321, -394906, -157103, -27758, 234487, -113648, -4590, -83595, -35295, -114152, 9733, 48615, -189453, 119034, 328480, 92376, -1954, 268151, -117128, -150898, -48073, 390146, -256743, -129567, 199662, -91326, 183115, 119467, 209699, 10714, -94799, -144420, -107194, -36859, 423676, -41750, -328779, -87143, -22820, -497639, 373940, 147605, 143658, -46744, -21062, -197913, -31693, -20903, 204031, -245657, -137693, 135880, 68773, -25353, -252971, 265595, -211916, 289558, -296076, 100441, 89921, 214901, -93346, -22401, 80512, -40543, -105671, -2723, 107865, 29276, 76249, 535485, -173572, 65120, -188964, 85898, 243713, -356775, 165243, -114421, 473915, -16402, -8458, 98171, -205009, -76734, 61653, 77494]
12811G7494a09481k4226D45915b27925C9616a72271A75812a36016j15837a9822
12800I2828k791R5927a1179k46443a26687j16421a01010k3359A8760d8222j67522
12789b15744I243b67723E9004J33356n4842f7032A97222c02967o9010a49122g2131
12777a1763A18726c32145J03080R5977B74704A28413J1145a53686p39j86938g8946
12765h3684B31941j14220b7333B73191D1669a2440k76038a19091l04054D8605
12754f4409I9482j6120c11755b5190D7078c2555A89061O860c60868B15830E807
12742c42170B47768q8307a5130B19555b18785A12898b24667l6197B06781g8296
12731a77738A17463c6703A13657a2123j32984A7031M59a94653B39159D6734a94119
$$ y = [77494, -109481, -133707, 445915, -227925, 39616, -172271, 175812, -136016, -251853, -19822, 92828, 90037, 185964, -11179, -257622, -126687, -243108, -101010, -124369, 18760, -48222, -215744, 9243, -267723, 59004, 192360, 137518, -67032, 197222, -302967, -371977, -149122, -72131, -11763, 118726, -332145, -229065, -133088, 274704, 128413, 139558, -153686, -154425, -341363, -78946, -83684, 231941, 117721, -27333, 273191, 41669, -12440, -288478, -119091, -423145, 48605, -64409, 99482, 83362, -311755, -25190, 47078, -32555, 189061, 195921, -360868, 215830, 5807, -342170, 247768, 159461, -15130, 219555, -218785, 112898, -224667, -260864, 206781, -78296, -177738, 117463, -36703, 113657, -12123, -145107, 17031, 17490, -194653, 239159, 46734, -194119]
12719e0842J4306A5680N7325e7590k3888j64670A93696D5836L03707C0455L7802
12708F8257L11705A74807p1530l7883a82264O6179D19762f3138F9091g9634J2901
12697f6733n2521H4768a52153A8597b24457j44882b2354B46244J68a40172F5607
12685f5126A98737C6858b03709B09782K8889B9975e5501A38131m9028B7923e1203
12673B21565a2374A47430a0106q692j08599n7907M0904A95655e8166A8265K51167
12662B69432a04879j58592f9447J1313B26869j02195c7842j12232P3007k1438
12652i8505A37719n3197r24g4531A84363O1774b73827C4068C821J69825J97167
12641C70813G9485a14691A55739J72627q2919A5496J5039N8802a70468I165a08602
$$ y = [-50842, -36536, 15680, 73005, -57590, -81478, -246148, 193696, 45836, 349543, 30455, 68257, 379962, 174807, 103277, 65394, -182264, -116085, 419762, -63138, 69091, -79634, -66733, -119254, 84768, -152153, 18597, -224457, -369339, -22354, 246244, 246412, -140172, 65607, -65126, 198737, 36858, -203709, 209782, 238671, 29975, -55501, 138131, 89103, 27923, -51203, 221565, -12374, 147430, -10106, -18798, -127397, -185304, -144400, 195655, -58166, 18265, 269432, -104879, -263471, -69447, -58134, 226869, 124674, -37842, -150074, -77067, -98505, 137719, 84522, 83598, -74531, 184363, 246137, -273827, 34068, 3821, 173646, 370813, 79485, -114691, 155739, 328366, 245447, 15496, 30535, 89337, -170468, 9165, -108602]
12629D19262A71848L6059k7463M67946D5872P8979a7916q2937B64094A08831N10
12618A09341K5519a97423F4766N3030l7812a194j60525A39419A1457J23066c17917
12606a2090B99066h1591j09510R4471q1460C09266a2715l02624B60879j09565
12596A51314a91144A74010b11758l8585E2384K71494j6914e0774p3346n392p3939
12585b03451h6185b5909n9647H9607c2398m2013q9909B2081J5987f74E9483J36504
12573A95987a61535A45440o3031a50094N8139B32967d9738I0074d4603B3135K54591
12562B77726i5900j97947M8903i9529d3567a9386G1937i9346c2162A86973a29673
12550a20171F85c9069m1476L3682P606C2022b57123e4294G4210a70059P7214a5567
$$ y = [419262, 171848, 207907, 180444, 648390, 45872, 124851, -17916, -100853, 264094, 108831, 109341, 134860, -197423, 64766, 117796, 79984, -1194, -161719, 139419, 11457, 134523, -317917, -12090, 299066, -81591, -191101, -96630, -178090, 309266, -12715, -315339, 260879, 151314, -191144, 174010, -211758, -250343, 52384, 323878, 306964, -50774, -124120, -129512, -203451, -86185, -25909, -85556, 89607, -32398, -74411, -164320, 22081, 38068, -674, 59483, 195987, -161535, 145440, 82409, -150094, -91955, 232967, -49738, 90074, -44603, 23135, 277726, -95900, -293847, -244944, -99529, -43567, -19386, 71937, -99346, -32162, 186973, -129673, -120171, 685, -39069, -80545, -46863, -39257, 32022, -257123, -54294, 74210, -170059, -92845, -15567]
12537a33879j97m495b7928A41532c8515A2487Q9391B1240c0380q036a6363n9900
12525g6263p568j08043g2293B5911Q9294q354a09191a5997j3064C3064K21161
12514B54225a84586A23583h2096L8080k99145h335j09812I6872P2116n7005f2508
12502d75580D936a8934a811G3964B5894Q6224J11491B0023a12500D0110g6178
12490a10129B99955i3983B84598b84989A63630F5636M36070H8585f4337J0179
12480e4158a7856B47135F632K10339H8424N3523c22443N7815a03788b388B07780
12468c8381B17715i4145l092r8209C48109A69277a18969L2375K4224B2768a40759
12456g6072H5597a15989G7959C7788K2051M33716a17351C29339M798a26415D4387
$$ y = [-133879, -134076, -138571, -27928, 141532, -38515, 12487, 101878, 21240, -30380, -38416, -16363, -76263, -83831, -191874, -72293, 25911, 115205, 106851, -109191, -15997, -29061, 33064, 254225, -184586, 123583, -82096, -44016, -343161, -8335, -118147, 96872, 168988, 111983, -62508, -475580, 4936, -18934, -1811, 73964, 25894, 112118, 223609, 20023, -112500, 40110, -76178, -110129, 299955, -93983, 284598, -284989, 163630, 65636, 501706, 88585, -64337, -54158, -17856, 247135, 6632, 216971, 88424, 141947, -322443, -264628, -103788, -2388, 207780, -38381, 217715, -94145, -97237, -195446, 348109, 169277, -118969, -86594, -62370, 22768, -140759, -76072, 85597, -115989, 77959, 37788, 59839, 493555, -117351, 329339, 334137, -126415, 44387]
12444F8598c26741b406k15243q6621R1047F240a02447G6246f7562E935h9158L4398
12432e4760p7022J5573j21323F5449e5323k86053Q4486R5729D462K18604h7124
12420a77357d3458B9576b35484A58697n7973d3585j27984B06512b93329d3880
12409A7716L0617B1426c04892h8137C00378E6021d3108A0918Q9560a71523a3528
12397a19406n5610K4949F5891K07331A20699a62510l4399a692C05676k0252J7303
12386C02727b2891A82395J8820I8106g3084j37819G2597L00404A36103b05949
12375e9892j28530G3833J72090o1969a10161A05207Q7081a74503B62656a06169
12364a9834m2744b7733j77715A70936E4886M7456a44889A17994F741J45954F4854
$$ y = [68598, -326741, -2406, -217649, -304270, -213223, 6240, -102447, 76246, -67562, 5935, -89158, -54760, -131782, -116209, -237532, 65449, -55323, -341376, -256890, -161161, 4462, 223066, -87124, -177357, -43458, 29576, -235484, 158697, 100724, -43585, -171569, 206512, -293329, -43880, 17716, 48333, 21426, -304892, -88137, 300378, 56021, -43108, 10918, 100478, -171523, -13528, -119406, -175016, -150067, 65891, 273222, 120699, -162510, -196909, -1692, 305676, 285424, 302727, -22891, 182395, 201215, 98106, -73084, -210903, 72597, 373001, 136103, -205949, -59892, -188422, 73833, 245923, 183954, -110161, 105207, 192288, -174503, 262656, -106169, -19834, -62578, -27733, -205448, 170936, 54886, 102342, -144889, 117994, 6741, 152695, 64854]
12352H1199a3552I3234N3403N4225c120D0404R74k732a83158a25B44487j04415
12340A40072b33690B72679D075K16165E7789J00991a54786A81167k4222J92460
12330C49405j34512f416F31576A78903C2752b07099A9291J35825K48600F5969
12319A47950b47536A82205L83707B77850j11214K3644B1068M7770e0999j57107
12309b08106D8764J28657e1480A29681c8963A16845k7455J6703n2121J71800H1633
12297C28743c2220E3948K2223K02827j26676J5086J2796g4091E7667a4209F7279
12285B26726K49229c0349o9310D0236b2958h124j80471K6449F2710Q2181D3269
12273A48376m1010K88548A54093Q6432E5013J34670Q8331L10840b42931H6169
$$ y = [81199, -13552, 93234, 146637, 200862, -3120, 40404, 41378, 38646, -183158, -125, 244487, 140072, -233690, 272679, 4075, 220240, 57789, 158780, -154786, 181167, 156945, 349405, 214893, -6416, 631576, 178903, 32752, -207099, 19291, 155116, 403716, 65969, 147950, -247536, 182205, 565912, 277850, 166636, 190280, 21068, 68838, -50999, -208106, 48764, 177421, -51480, 129681, -38963, 116845, 89390, 106093, 53972, 225772, 81633, 328743, -32220, 53948, 76171, 278998, 152322, 167408, 180204, -74091, 57667, -14209, 67279, 226726, 475955, -30349, -99659, 40236, -22958, -8124, -188595, -162146, 62710, 144891, 43269, 148376, 107366, 395914, 154093, 240525, 55013, 189683, 278014, 588854, -242931, 86169]
12262F03062B32378J25315d550l8816l7695j23400B76507C9660K26053J24284
12252C89997A49028a58637d1695E832c1035E66287b6974p1351A26772a8753B73675
12240i9416B85651a0706A34136L8099E5633J76194a23263k57665B21537b3241
12229i9810c6690B01691I8006a62323G6186Q7429J04252J31677a0608B80299J18176
12218C98475p7631A17343L66414d4219H7471J5386N3038M6854C8180J66773H2743
12206a39402A07051e6211A14814Q9693n9170a0926C67555B1456L94400R0752H5992
12194B28509M4193j2075r3530L29243j06430C4286L01530q9539P5035n0197n1599
12183B19516r9432K17170j28833a1714j11667C93749f7086b0764B97350g8492
$$ y = [603062, 232378, 357693, -4550, -43366, -81061, -204461, 276507, 39660, 265713, 389997, 149028, -158637, -41695, 5832, -31035, 566287, -26974, -98325, 126772, -18753, 273675, -99416, 285651, -10706, 134136, 172235, 55633, 231827, -123263, -380928, 221537, -23241, -99810, -36690, 201691, 98006, -162323, 76186, 163615, 267867, 399544, -10608, 280299, 398475, 320844, 117343, 483757, -44219, 87471, 102857, 155895, 202749, 38180, 204953, 82743, -139402, 107051, -56211, 114814, 204507, 145337, -10926, 367555, 21456, 415856, 506608, 85992, 228509, 272702, 260627, 167097, 496340, 389910, 34286, 335816, 246277, 321312, 271115, 219516, 120084, 337254, 208421, -11714, -123381, 393749, -67086, -20764, 297350, -78492]
12172B33343K1785K3923o599p0604K5928o0530L4341J85629n7060A1770J49514
12161A61284J7057c6948o6531C43718j38690m7202J11190f5739A53065H044R7935
12150A05979J22864e3164k7711K8362A89079i9987H7865m0536b3976C42035a1340
12138E45074I4187j7868K84116A73574k2900P0716B1582Q4118K08044A20980d9363
12126B1314J15536J91462j27696Q782q3912J48206i226F6805K72287E9083Q1196
12115A40279f2787j7722Q305A90867J13060o9330e2948A42190Q4097a58363B54811
12103B7488J54471K2541M564n5163K15453j00380m5200P4502A15094c28491A25127
12091C93379g506k6651B46530d054B23158N3071O7299G0496L16005j19851m5355
$$ y = [233343, 255128, 279051, 272452, 201848, 227776, 167246, 201587, 387216, 330156, 11770, 161284, 178341, -36948, -103479, 343718, 205028, 157826, 269016, -65739, 153065, 8044, 105979, 228843, -53164, -80875, -52513, 189079, -99987, 87865, 47329, -23976, 342035, -11340, 545074, 94187, 76319, 360435, 173574, 150674, 221390, 21582, 105700, 313744, 120980, -49363, 21314, 136850, 328312, 200616, 209398, 125486, 273692, -9226, 66805, 339092, 59083, 140279, -62787, -80509, -72204, 190867, 303927, 234597, -52948, 142190, 226287, -158363, 254811, 27488, 181959, 204500, 209064, 153901, 369354, 268974, 223774, 298276, 115094, -328491, 125127, 393379, -7506, -34157, 246530, -4054, 223158, 276229, 343528, 70496, 386501, 266650, 221295]
12080B21295J2936B5340f9414A28361K65859I0015n984J21374a978B73575q1531
12069A92044g7950j19445A05384J47435A17190J67709e7907H9974J54557a88871
12058I0560a7568m8210k77412B7735F270J22134a63045L5360A14737J40517n2264
12047B02990L820Q0525d9573J1644j9159B14516G3847b17578J03611c8321l325
12036d1646k4385r0486o6534A52894b78985E3651M5163b78620B55137G9712b69976
12024A47707a66206h259j30720e7113A41586n3022B5615J46366b37129C68165
12013A48607f672B9305K10004P2461j6062A34196o096a32562H9075m3786M2918
12002H8207O9007J4907E5095J23868e1204A07751a04306l4581E3606J14554D597
$$ y = [221295, 234231, 25340, -69414, 128361, 394220, 90015, 84031, 205405, -1978, 273575, 192044, -77950, -197395, 105384, 252819, 117190, 284899, -57907, 89974, 244531, -188871, 90560, -17568, -65778, -343190, 27735, 6270, 128404, -163045, -127685, 114737, 255254, 202990, 206810, 287335, -49573, -37929, -57088, 214516, 73847, -217578, -113967, -38321, -41646, -66031, -156517, -223051, 152894, -278985, 53651, 98814, -278620, 255137, 79712, -269976, 147707, -166206, -8259, -138979, -57113, 141586, 88564, 25615, 171981, -237129, 368165, 148607, -6672, 29305, 239309, 311770, 295708, 134196, 128100, -132562, 89075, 45289, 88207, 157214, 172121, 55095, 178963, -51204, 107751, -104306, -138887, 53606, 168160, 4597]
11990B30366C3659b91475j28464J94949h3454f16k8511D0773g4217A19081j5465
11979A03616A6353K16515D6335f2644j01468E9120a47052B06338E6712j705a4502
11967D17190b91957a4694B4918J89334B2223a79195L5180l2813j07091P4635D8092
11955H5697j5749b75420B3870K30630D4682L8647b23119B01338b1328k00576A80995
11943D8961d36574J34867b9004C5845R4863b5288B86475e3028J441A75961c6180
11931B39142r946c76510D790b04296B30163m5492E3518a71153k8800D2315d723
11919A28539b97983f9659A9057a53926a2700k494k0169A87645J77405f0496C0084
11907E2580d5304A38465a91486A85318J74852j42387C1836K63210A45598m4723
$$ y = [230366, 33659, -291475, -419939, -224990, -83454, -616, -29127, 40773, -74217, 119081, 103616, 16353, 232868, 46335, -62644, -164112, 59120, -147052, 206338, 56712, 55007, -14502, 417190, -291957, -14694, 24918, 214252, 22223, -179195, -144015, -176828, -283919, -209284, 48092, 85697, 69948, -275420, 23870, 254500, 44682, 83329, -223119, 201338, -21328, -221904, 180995, 48961, -436574, -301707, -29004, 35845, 130708, -25288, 286475, -53028, -51587, 175961, -36180, 239142, 229196, -376510, 4790, -204296, 230163, 184671, 53518, -171153, -199953, 42315, -4723, 128539, -297983, -69659, 19057, -153926, -12700, -15194, -35363, 187645, 365050, -60496, 30084, 52580, -45304, 138465, -191486, 185318, 360170, 217783, 31836, 295046, 145598, 100875]
11897A00875g1056C7347L0627K4553g4400l11496e6557A2502M1013B6387L7495
11886F3882c7996a8220A21754O7025A7360b70052h1156j82066J28445B76747o0479
11875B16268e8493B33233b53523j16970c3413o584j4609A26329g5669l9073M4059
11864g0683D457b04117j80482J46458B12107a32135k04390A2983b29143B48462
11853B57242A11156F910N7679b98091a00957A40059k8547d574A28426M1675g285
11841a86220Q0079B68187b44048F6376j6627c3929H4436b79274a17355F3051b89579
11829F6823b76065c8049D1568d14373k4523g5172l29499F832P5780Q3926b24110
11817A93445b7904r8599L3788p0314A87010D0869a83151F0424M9664a1378k35262
$$ y = [100875, -71056, 37347, 67974, 92527, -74400, -385896, -56557, 12502, 53515, 26387, 63882, -37996, -18220, 121754, 188779, 17360, -270052, -81156, -263222, -134777, 276747, 216268, -58493, 233233, -253523, -370493, -33413, -39997, -54606, 126329, -75669, -114742, -70683, 4457, -204117, -384599, -238141, 212107, -132135, -336525, 12983, -229143, 248462, 257242, 111156, 6910, 64589, -298091, -100957, 140059, 111512, -4574, 128426, 170101, -7285, -186220, -106141, 268187, -244048, 66376, 49749, -33929, 84436, -279274, -117355, 63051, -289579, 66823, -276065, -38049, 41568, -414373, -438896, -75172, -404671, 6832, 82612, 166538, -224110, 193445, -27904, -126503, -92715, -163029, 187010, 40869, -183151, 60424, 110088, -11378, -246640]
11806b46640J14976n8917e8292j8094B84805r0041b7551k61892J7660O4508A14557
11794D6028a22388H572b83827J31930D2675J92402C6968b09849A87144n93c8830
11782c83k5740p5077d6447k0845G9018a26591A7801J73715D6501b57769A28394
11770B1636a32434e3473A31722J1987O9171I9223J2602b22352g9305i607A4938
11758A09521a62683A38070e7999b7941j12263e7360k04215r047A74993a83865
11747D7905a35899f5994m10227a01694k43103B58487G507J40938M9087h7903J8615
11736f9288c1305A149J58009b1157F2507a10595B80207c00979B32660a28631M7163
11725h1468G0529D295Q7449a35010B6891b56477R0762C28703A01334A6089e5614
$$ y = [-246640, -131664, -190581, -58292, -76386, 284805, 194764, -27551, -289443, -271783, -207275, 114557, 46028, -122388, 8572, -283827, -151897, 42675, 235077, 36968, -209849, 187144, 186551, -38830, -383, -26123, -101200, -46447, -67292, 79018, -126591, 17801, 191516, 46501, -257769, 128394, 21636, -132434, -53473, 131722, 143709, 212880, 99223, 111825, -222352, -79305, -9607, 14938, 109521, -162683, 138070, -57999, -27941, -140204, -57360, -261575, -270622, 174993, -183865, 47905, -135899, -65994, -476221, -101694, -344797, 258487, 7507, 148445, 197532, -87903, -69288, -31305, 1149, 159158, -21157, 62507, -110595, 280207, -300979, 232660, -128631, -81468, 70529, 4295, 91744, -135010, 26891, -256477, -165715, 328703, 101334, 16089, -55614]
11713B43358a51399j10224J13265C0854J03808C2522J15894R275C5317J4721b87627
11701B4058a73517A5939a8141p3493c6627E4304P8334c2404m51640a46747e5680
11689b7379j72716A44296h9817J2332O628l9440B12458F4504C0551d8320A629
11677c0309I2379d4526A07789A5817O2593a7368A90987a29773j36554A58743o0058
11666I8685J9307i1138A21746b00681i4038E9313e5823B4263a03711k22089a28216
11654h4147L2155A13580d9129B5559N2196g3875H7344R0542L4121i8647j34658
11643b33305a05062j28729F919K84724D0897K29809A22300j845J56490k5228i0964
11631c93900B38242f1452k31587M7219i3865A18333g1668A06044J06787b72391
$$ y = [243358, -151399, -261623, -148358, 30854, 134662, 32522, 148416, 157691, 35317, 50038, -287627, 24058, -173517, 15939, -18141, -91634, -36627, 54304, 132638, -32404, -484044, -146747, -55680, -27379, -200095, 144296, -89817, -77485, -70857, -110297, 212458, 64504, 30551, -48320, 1629, -30309, 92379, -44526, 107789, 15817, 78410, -17368, 190987, -129773, -266327, 158743, 98685, 117992, -91138, 121746, -200681, -94038, 59313, -55823, 24263, -103711, -325800, -128216, -84147, -51992, 113580, -49129, 25559, 77755, -73875, 87344, 177886, 212007, -98647, -233305, -105062, -233791, 6919, 291643, 40897, 270706, 122300, 120455, 276945, 251717, -90964, -393900, 238242, -61452, -293039, -245820, -93865, 118333, -71668, 106044, 212831, -272391]
11620a62281a9035l52790A3264J46485e0344A7111O9950N624a72316B75724d34428
11608a61894n8488G660L75050b04638G3774K04157q331f3806B03778a23735I4659
11596a26326j85073a5904j25793A42897C3204K6031R1775j4815J55278a18708
11585A6186N0198M9161K02267p9377F5767f6073A03294a6672D3612K27608H9965
11573c7515D27663b12333F5176a27739b03n9836j69567G1045L72583g3436C46953
11561D84431a59884C88630A00448R1466n3277d4195j3975C6679K36940b05749
11550G7273M4752n4818c3905l6427F7062d0329B8441b09834J02349I4189f6340
11538E548J77131J37790a46654d5038n4403F567b99363A84138a20724B7949K20760
$$ y = [-162281, -19035, -371825, 13264, 159749, -50344, 17111, 87061, 92685, -172316, 275724, -434428, -161894, -220382, 7660, 382710, -204638, 73774, 277931, 269600, -63806, 203778, -123735, 94659, -126326, -311399, -15904, -141697, 142897, 33204, 59235, 151010, 136195, 291473, -118708, 16186, 66384, 115545, 317812, 238435, 65767, -66073, 103294, -16672, 43612, 271220, 89965, -37515, 427663, -212333, 65176, -127739, -203, -60039, -229606, 71045, 443628, -73436, 346953, 484431, -159884, 388630, 100448, 191914, 138637, -44195, -58170, 36679, 273619, -205749, 77273, 122025, 67207, -33905, -70332, 67062, -40329, 28441, -209834, -107485, 94189, -66340, 5548, 182679, 320469, -146654, -45038, -99441, 6567, -299363, 184138, -120724, 27949, 248709]
11527B48709a48845B556M4542J39139D6621b8649A4979b733l0658k74425B52064
11515h1284C0232a89797B43184a56366D02723r4905k9540J53573A24349p586f250
11503E38737k33288E6821l492K9888J6116J92971a03431m0522A44036D8057J07045
11492A55102O937E9692c00375B24372J38143i9215B05535a00641A18693b53029
11481b3918F9901I920g3067C01083a73461A05259r197J45812p8924b75225C63773
11469B06491a52710r0844C02548A07852a27685F1378c38066E0137J26456a81605
11458C07059A130J82458K61231r0454D2509e7121B23986a64761l3111C92141A24378
11446i2189A06424L12341J3891a12957A05472f5537A88637g7278H8587a7107G2868
$$ y = [248709, -148845, 2556, 47098, 186237, 46621, -28649, 14979, -2733, -33391, -307816, 252064, -81284, 30232, -189797, 243184, -156366, 402723, 307818, 278278, 431851, 124349, 116763, -6250, 538737, 305449, 56821, 53329, 83217, 99333, 292304, -103431, -143953, 144036, 48057, 155102, 162039, 59692, -300375, 224372, 362515, -99215, 205535, -100641, 118693, -253029, -23918, 69901, 9920, -73067, 301083, -173461, 105259, 96062, 241874, 162950, -275225, 363773, 206491, -152710, -243554, 302548, 107852, -127685, 61378, -338066, 50137, 176593, -181605, 307059, 1130, 183588, 444819, 354365, 42509, -57121, 223986, -164761, -197872, 392141, 124378, -92189, 106424, 418765, 432656, -112957, 105472, -65537, 188637, -77278, 88587, -17107, 72868]
11434A82253J41797j57527l7268m7250h2118K8889B28820A02194b47444B15996
11423G5610p770c85053D1463J20035A2989N09177d5918j6664P077A32056a40790
11411c05060C19983e825k79705A03077b06461C5454O2247J1288e7086C0346K09844
11400B40190K9624o060J4971a96220F4299J01767A0483K06309b91850a39892j69426
11389c09318g1395k14434G3478b2581A2705J56052J39937a7578C513J48279c949
11377A60648j465d4758q6919D3815a30163c9873j40500b0697G6292a50152j17753
11366b67905L3087I0946j0676b4831a0709k1645l3002k87993a17963B85455b33358
11354B6568N9156b4296E1476c57920C324J1724b16497b2578j4533A60499c14688
$$ y = [182253, 324050, 166523, 129255, 82005, -82118, -53229, 228820, 102194, -247444, 215996, 75610, 67840, -385053, 41463, 161498, 12989, 522166, -45918, -62582, -55505, 132056, -140790, -305060, 319983, -5825, -285530, 103077, -206461, 35454, 97701, 108989, -57086, 30346, 240190, 269814, 263754, 278725, -196220, 64299, 166066, 10483, 216792, -291850, -139892, -309318, -71395, -285829, 73478, -22581, 12705, 168757, 308694, -17578, 3513, 151792, -3949, 160648, 159183, -44758, -131677, 43815, -130163, -39873, -180373, -20697, 76292, -150152, -267905, -234818, 90946, 80270, -24831, -10709, -32354, -65356, -353349, -117963, 285455, -233358, 26568, 85724, -24296, 51476, -357920, 3324, 15048, -216497, -22578, -37111, 160499, -314688]
11342a43439e7159D7204c3863k71869B19776A05925D7873h8912j47083e6119k72635
11331c28754H4204f3265B153J8657K09736e8683j09665A29270a63166f9639o8618
11320a38257a3223n8339r0757n254l28796b35241l8744P1303B63128A31030b54666
11308F6776b0521A09110D4719c05504A25788b19389b2917D2743b73656e2837j63728
11297b16565A61354j7126a9017E2770K23543a05548B47760a70881N437J6166M5481
11286a03797j31034a14040j7730O3889K9842o7160o8112C17452a01668B68996
11275f0463D1969c05134A6657b74470B08759a93322e090A2073e7413j87872A45806
11263a47574B22933b66125A02129Q7260a09374P048r0173c1468A14830n4258b01305
$$ y = [-143439, -57159, 47204, -33863, -305732, 219776, 105925, 47873, -88912, -235995, -56119, -328754, 84204, -63265, 2153, 20810, 230546, -58683, -168348, 129270, -163166, -69639, -138257, -13223, -71562, -162319, -167573, -496369, -235241, -273985, -202682, 263128, 131030, -254666, 66776, -20521, 109110, 44719, -305504, 125788, -219389, -22917, 42743, -273656, -52837, -216565, 161354, 144228, -19017, 52770, 276313, -105548, 247760, -170881, -165444, -149278, -103797, -234831, -114040, -131770, -67881, -38039, -105199, -173311, 317452, -101668, 268996, -60463, 41969, -305134, 16657, -274470, 208759, -193322, -5090, 12073, -57413, -245285, 145806, -147574, 222933, -266125, 102129, 189389, -109374, -102326, -192499, -31468, 114830, 60572, -201305]
11251a79859B17339b72338D9005c58894a7376k437B82736b7318j71109f1046I495
11239C46178A19117k3128b04843g9241k08827G817h129j83958A05771a53800b0982
11227C47092b32385k58152A09364o219d9795o8528H3867d09614a84233g7286a331
11215f8590A90855d1641A51844D6037d0414C66661b73030a646k36229J17351j63163
11204b83687B27706h3860F3700E946c1682G1936b97377A15813C489a91245j1221
11193b02466L3532q3193I7249a26416j02770L3873c1420j09487k76377a05058
11182C944f5189k64888B62780c9661r6058j2526j6351m8238B48251a27885Q562
11171a19323j6337N8691k49581F9787i1092D8593a07129A9666J65523a28004J565
$$ y = [-179859, 217339, -272338, 49005, -358894, -17376, -19813, 282736, -27318, -198427, -61046, 9495, 346178, 119117, 95989, -204843, -79241, -288068, 7817, -8129, -192087, 105771, -153800, -20982, 347092, -232385, -490537, 109364, 103145, -49795, -118323, 83867, -409614, -184233, -77286, -1331, -68590, 190855, -41641, 151844, 46037, -40414, 366661, -273030, -1646, -237875, -120524, -283687, 227706, -83860, 63700, 5946, -31682, 71936, -297377, 115813, 3489, -191245, -202466, -168934, -252127, 97249, -126416, -229186, -195313, -31420, -140907, -417284, -105058, 3944, -65189, -330077, 262780, -39661, -135719, -148245, -164596, -212834, 248251, -127885, -119323, -135660, -76969, -326550, 69787, -91092, 48593, -107129, 19666, 185189, -128004, -126439]
11160a26439L7231j70078g7969B7004c8114j46624k07800c3748k14934A26080
11149a87007a3830G8053J16783J25961A46738a2072j57168F6284H699R9687b31912
11137a34207j5330c6556j61504A0048h7727q196A66309j4730J3479a15790J3219
11126a02571E1198I032O1657b33505A20910a75744a0588k0553C82346A09973j7553
11115I2420J07379m5699n0045m8542J03772a09334M5054A49088b4029C28952A40894
11103C5441P6206l639J12056a92521A59134j0860E7109c2629M464B33021r5899
11092A37122N8786q9999J20656D9970K42951c58037i7426A57964p1742P9786E9910
11080D34798k5692H2864L36256k08074P9709F1740K09345r6203n570J70105m7144
$$ y = [-126439, -89208, -259286, -77969, 27004, -38114, -184738, -392538, -33748, -248682, 126080, -187007, -13830, 78053, 194836, 320797, 146738, -12072, -169240, 66284, 8699, 108386, -231912, -134207, -149537, -36556, -198060, 10048, -87727, -95923, 166309, 151579, 165058, -115790, -102571, 51198, 9032, 70689, -233505, 120910, -175744, -10588, -31141, 382346, 109973, 92420, 199799, 154100, 104055, 55513, 159285, -109334, -64280, 149088, -24029, 328952, 140894, 35441, 111647, 108008, 220064, -192521, 159134, 148274, 57109, -32629, -28165, 233021, 137122, 195908, 105909, 226565, 49970, 292921, -358037, -97426, 157964, 86222, 166008, 59910, 434798, 409106, 82864, 419120, 211046, 290755, 61740, 271085, 174882, 169312, 339417, 292273]
11069B92273j27244M27348k48927A26329k9945K26161n9385J88700j27225O7154
11059C91789J08963A62576L83494B24825M22322Q7357p9092j89770K4997J84110
11049F74749j65113Q9188J94115K36655D59323M42118q5301j73688J58448l292
11039G97608J25140j71350Q2402k0374K86494m34327J97468q7606k32709K98478
11029H41224n3019k18873k5372A73347L50834L39629Q3275l55934m2202J15337
11019F64286p6424j6740J19103q8170j94928K22585Q613j45628l0631L12678k32934
11008E41810p0864m8726L21758n3830k48721R2677O1196K23532l85427O7700l2425
10997D68680l1819J73202L85148l00902j26232M05232j09337l94547N7038r5279
$$ y = [292273, 165029, 592377, 343450, 126329, 96384, 322545, 263160, 451860, 324635, 391789, 500752, 162576, 546070, 224825, 647147, 734504, 655412, 465642, 490639, 674749, 509636, 598824, 792939, 1029594, 459323, 901441, 816140, 642452, 800900, 797608, 922748, 751398, 833800, 813426, 1099920, 665593, 863061, 775455, 542746, 841224, 788205, 569332, 543960, 173347, 524181, 863810, 947085, 591151, 548949, 664286, 587862, 571122, 690225, 602055, 407127, 629712, 638325, 492697, 462066, 774744, 541810, 470946, 422220, 743978, 690148, 441427, 534104, 595300, 818832, 433405, 501105, 468680, 436861, 610063, 995211, 694309, 568077, 973309, 863972, 469425, 526463, 431184]
10987D31184P5744M6686L40799j96684q5406l1074r8879K78998j73577K0251J29346
10976G37388L37665j13018J93458J58856M3407L5808M86860J35279p6577K32567
10966B171693K77423K78851j01992r6937L30587l77820l26932j95369l31424l17986
10956A310094K04945m40518j0059K26395j18430N3673J93152j3188l67551K41312
10946A279825m0114l89659K94815m55612K63756k97974B90431J87296j4669k22676
10936B40382o8867E8940M37716a84650A61523n9526K44472a81174n3948d8922
10925G3705a55836j20074F5772K1129b94470A34816K22938b97802a44494G5978
10914C9238P0907c496j42182d7243j40201C40241a91038A2564J9843d2904p6411
$$ y = [431184, 506928, 553614, 894413, 697729, 612323, 581249, 482370, 761368, 587791, 608042, 737388, 1075053, 962035, 1155493, 1314349, 1357756, 1393564, 1880424, 2015703, 1939126, 2171693, 2449116, 2727967, 2625975, 2529038, 2859625, 2481805, 2154873, 1959504, 1628080, 1310094, 1515039, 1074521, 1064462, 1290857, 1172427, 1226100, 1419252, 1406064, 1038513, 1279825, 1239711, 850052, 1144867, 689255, 953011, 655037, 290431, 477727, 463058, 240382, 171515, 58940, 496656, -184650, 161523, 101997, 346469, -181174, -235122, -48922, 73705, -155836, -275910, 65772, 86901, -294470, 134816, 357754, -297802, -144494, 75978, 39238, 110145, -3496, -145678, -47243, -187444, 340241, -191038, 12564, 32407, -42904, -119315]
10903a19315c5458F9811h2753D4407J94905f264k8462B44322i1169r0586p9084
10892b60839Q2126f9655j24474f4944c0543j17032k67437J89002A56902a73193
10881h662k52453b664j94697j63524a11565d9598j05242E4575L96783a04895D8641
10869a29082r7867B0407J17243c00512J47614L8925j72692d5329q5841e4071H814
10857A62409c8481o104B95786a73360F0068J6631c1117k739B70448e5281j14935
10846a70216h3181A59859E204b17379g64k21549B6650L8506d9480B2624f3589
10834a49945K7238A40674a28009B3428J1461a88183j11588e4851A46863D7482
10823A02868l5863a77976C2151a48984L5353D2537e5180r9087A99065q5957a97081
$$ y = [-119315, -35458, 69811, -82753, 44407, 239312, -6264, -34726, 244322, -91169, -181755, -260839, -178713, -69655, -194129, -64944, -30543, -147575, -415012, -226010, 156902, -173193, -8662, -261115, -2664, -197361, -360885, -111565, -49598, -154840, 54575, 451358, -104895, 48641, -129082, -226949, 20407, 137650, -300512, -152898, -113973, -286665, -45329, -131170, -54071, 8814, 162409, -38481, -44585, 295786, -173360, 60068, 76699, -31117, -33856, 270448, -55281, -170216, -83181, 159859, 5204, -217379, -764, -222313, 26650, 65156, -49480, 22624, -63589, -149945, -122707, 140674, -128009, 23428, 34889, -188183, -299771, -54851, 146863, 47482, 102868, 67005, -177976, 32151, -148984, -113631, 42537, -55180, -154267, 199065, 113108, -197081]
10811A47789a25484b8682k32503Q6026K1160c6601k3986l10095p5925d0383j54914
10800a95297A09205a61306A39692a70418g0351E0178a23720r4104L0855F79e0196
10788a57160A08836a17339l8853E2290Q8765d6414B45723C1963M3892j2016J1897
10777G5736Q3862K712q934O458a29234j1919A00931g139A53811g9267A47492h751
10764d3401j0742B22418d9310q4131j3401l4575Q140B1923b44368K1455j39971
10753c62884A60693a13720n5469j30981A60893h7823A44512g601o3403K9249k3247
10742f5002k86809a50757F7378a05204A96181f2081H719P6671a16092j07297m844
10731b28233N0271k4928B38567b1453j46951j80915D8554b74907A06868a59758
$$ y = [147789, -125484, -28682, -261185, -175159, -153999, -36601, -60587, -370682, -446607, -40383, -195297, 109205, -161306, 139692, -170418, -70351, 50178, -123720, -217824, -186969, 679, -50196, -157160, 108836, -117339, -156192, 52290, 141055, -46414, 245723, 31963, 75855, 63839, 75736, 159598, 162310, 153376, 159834, -129234, -141153, 100931, -7139, 153811, -79267, 147492, -8751, -43401, -54143, 222418, -49310, -133441, -146842, -181417, -173277, 21923, -244368, -222913, -362884, 160693, -113720, -169189, -300170, 160893, -87823, 144512, -7601, -71004, -41755, -65002, -351811, -150757, 67378, -105204, 196181, -62081, 8719, 85390, -116092, -223389, -228233, -177962, -202890, 238567, -21453, -168404, -349319, 48554, -274907, 106868, -159758]
10720H0150g5040A57621i0914F6434a46741A85350i0703k23086F1506j6490b47135
10708c18990D01862B2341b8583j21322I6050f015j784A086a81268l13401a62249
10696A4570a28966I6662b7086C7786b52621A85703h3147A67488d2394j2712k01736
10685b56842Q1493B55713c69716A31103b84851a4734C445c64259A27912g4621
10674A98495K9128c7339l56141g6549N897q2933l34961B00219b34061A02786K06729
10663C09515b86761J24537B79087H7466c3772C8922O5197H105a41988b9217P603
10652b1614G7889O8667a0314D5510d0067f260j44639F4506d6229r7912G784b30907
10639a74066o898M1412l6162B19962g7238a4876q0355L2683K7294a981m24849
$$ y = [80150, -75040, 157621, -90914, 66434, -146741, 185350, -90703, -313789, 61506, 45016, -247135, -318990, 401862, 22341, -28583, -149905, 96050, -6015, -7799, 1086, -181268, -494669, -162249, 14570, -128966, 96662, -27086, 37786, -252621, 185703, -83147, 167488, -42394, -55106, -256842, -175349, 255713, -369716, 131103, -284851, -14734, 3445, -364259, 127912, -74621, 198495, 227623, -37339, -393480, -76549, -70652, -153585, -488546, 200219, -234061, 102786, 309515, -286761, -162224, 279087, 87466, -33772, 38922, 104119, 8105, -141988, -29217, -21614, 77889, 146556, -10314, 45510, -40067, -6260, -150899, 64506, -46229, -144141, 7784, -230907, -174066, -180964, -139552, -175714, 219962, -77238, -14876, -95231, -62548, -35254, -1981, -426830]
10628d26830f7084K343j38037n9631d8834n2202A70816R2576a31552O2673h697
10616c1650j69628Q8723L2794G7129p642b03962A34671a27933j24432J02528j5616
10605a65453l4886c7895C4347b22840a6332k99385a4399m0014A42246J35626j25309
10594A52563N4073g6622A17480c99214a44762f2569A51044p0376a11234B24731
10583a58852d3140q6128E0236l317c91373a24546j72538B02359G629c36166a12577
10571A96852a92296N4734k63070g2168r3802j58815F8374c3550F252O9908b38285
10559A21007f6707n6946k10166a12656d0777C9314j2081b78027A9371J70596J24095
10548C14062q8913b18174g9358j85326B0091J8004b01017b3633A2149g4376r3953
$$ y = [-426830, -67084, -64741, -202778, -262409, -48834, -101036, 170816, 263392, -131552, -68879, -8697, -31650, -201278, -112555, -79761, 77129, 69487, -203962, 134671, -127933, -252365, -149837, -165453, -200339, -37895, 34347, -222840, -16332, -315717, -14399, -54413, 142246, 277872, 152563, 206636, -76622, 117480, -399214, -144762, -62569, 151044, 80668, -111234, 224731, -158852, -43140, -129268, 50236, 46919, -391373, -124546, -297084, 202359, 7629, -336166, -112577, 196852, -192296, -137562, -400632, -72168, -165970, -324785, 68374, -33550, 6252, 76160, -238285, 121007, -66707, -123653, -333819, -112656, -40777, 39314, 27233, -278027, 19371, 189967, 314062, 225149, -218174, -79358, -264684, 20091, 38095, -201017, -23633, 12149, -74376, -168329]
10537a68329o8820j87741a56683r7320C09175A15785c09241G323a04805A77484
10526b35864G3803b75220E4345c5218B7703a74888Q068G6274a36449o1158A2521
10514A71697E083a87296A41028h8792c6857A03048b12425C7914b48795a10029
10503A49063a31472A49816b0572m1194n3991L0062J2344A98583c69957a9393j53954
10492a73347o5357k1000Q9314A9790a43021a1417j97799I1772a91321H172c5610
10480d71998e8891A45210e325j80576h6472j32986A94874J62124R9237B26916
10469A73011k9419L14273q2102A62433a05325F8690L87500C962L72718B0810c3499
10457b24103E2731J4563G039a71619j12268B79997d17767C21795E0443k3509d512
$$ y = [-168329, -237149, -424890, -156683, -254003, 309175, 115785, -309241, 7323, -104805, 177484, -235864, 73803, -275220, 54345, -35218, 27703, -174888, -166820, 76274, -136449, -197607, 12521, 171697, 5083, -187296, 141028, -88792, -36857, 103048, -212425, 37914, -248795, -110029, 149063, -131472, 149816, -20572, -61766, -115757, -85695, -73351, 198583, -369957, -19393, -173347, -238704, -259704, -170390, 19790, -143021, -11417, -209216, 91772, -191321, 8172, -35610, -471998, -58891, 145210, -5325, -185901, -86472, -219458, 194874, 356998, 456235, 226916, 173011, 143592, 457865, 375763, 162433, -105325, 68690, 456190, 3962, 376680, 20810, -33499, -224103, 52731, 67294, 7039, -171619, -283887, 279997, -417767, 321795, 50443, 26934, -4512]
10445G3052e136C8276a78716A05900l5794a32905G8989i450A21058a10925F159
10433a53210M1341A70705b65414a18465a5770k20054A58418J8602b22355A5590
10422B01951K0727a1299A41717c15842D6627a98122o1492J16051E2767J9246h7235
10410h8388a6097r9166J7006D6116M8320a75416f9872j59736P0290A42772n689
10399A37083f4247k15295j66627f6628J7707n8366Q222A05694M2177p979h9378
10387D06110c36669E03870g8555m9955L1809G1260K12244j09001J46257b43760
10376F442Q2224J88650C1748J97765A8826J80043r3782M6833L62839k52569A28314
10364A45837o7010L65294K52702C13130J75370n510B09393P5009k9459Q8984K0075
$$ y = [73052, -5136, 38276, -178716, 105900, 70106, -132905, 78989, -9450, 121058, -110925, 6159, -153210, -111869, 170705, -265414, -118465, -15770, -235824, 158418, 177020, -222355, 15590, 201951, 222678, -11299, 141717, -315842, 46627, -198122, -259614, -143563, 52767, 72013, -87235, -88388, -16097, -115263, -98257, 46116, 94436, -175416, -69872, -229608, -159318, 142772, 137083, -64247, -279542, -446169, -66628, -48921, -107287, -99065, 105694, 147871, 139892, -89378, 406110, -336669, 503870, -78555, -128510, -96701, 71260, 283504, 174503, 320760, -243760, 6442, 88666, 277316, 31748, 229513, 18826, 198869, 105087, 151920, 514759, 262190, 128314, 145837, 78827, 444121, 696823, 313130, 488500, 482990, 209393, 284402, 254943, 343927, 364002]
10353C64002F6265i0551A91098I3579L18603K00823B64210Q6228Q5636J97570
10343F33644k04021j46512m9079O4054j26700J54428j54104M8414q4881f7709
10332B80137e005D86972B04412m1915E4237a37473j9497B50421a24554K6008k84275
10321c82821A39564a05892A32550l1634K91888A86900D9914K22048j31673C3501
10310B78446F9610b96410p5560r4005J63196B25592D1519P2724K99803i2524C44767
10298h5420j7617A06266f7760p0016j64366J50934B10223a01538C17428C5552
10287a24245M0969b2430A42146E5751P0170c44725a06495B90511c9196m2043l1205
10276a12444A5991a24368n2073m921H574a98688j15600i795A06503a29468b8770
$$ y = [364002, 66265, -90551, 191098, 93579, 412182, 613005, 264210, 350438, 436074, 633644, 429623, 283111, 234032, 298086, 171386, 325814, 171710, 220124, 135243, -67709, 280137, -5005, 486972, 204412, 162497, 54237, -137473, -156970, 250421, -124554, -98546, -382821, 139564, -105892, 132550, 100916, 392804, 186900, 49914, 271962, 140289, 33501, 278446, 69610, -296410, -371970, -465975, -302779, 225592, 41519, 114243, 414046, -92524, 344767, -85420, -103037, 106266, -67760, -137776, -302142, -151208, 210223, -101538, 317428, 35552, -124245, -83276, -22430, 142146, 55751, 125921, -344725, -106495, 290511, -39196, -81239, -112444, 15991, -124368, -176441, -181362, 8574, -198688, -314288, -9795, 106503, -129468, -28770]
10264a29467a8554A27146a79704I224R4530N4452p8891d27236C6868e0042C53309
10252A3307L7077K012K81791P1135a6996B24137L7961j26172R939b85066A04455
10240A28009a13309n3970p3023e4020a4361l0694n1002r3310a5497A56975b82785
10228A10669e5746j1810C62017a89352C9461h2440A01773b82727E2667f3170l03157
10217c66327A98858a12061A06418c11693N5168R5392q6198j9313A91423a29880
10206a03369k12332j41571C595K68332C4002b53495A08006i4704A28633a81813
10195g3226j13846K4448b9560j31699r0301j36161b247l02113c346j15109r168
10184a27623K6219M6719r7991O8801B0193J2975c5550j57834o3405k0979j24345
$$ y = [-129467, -18554, 127146, -179704, 9224, 103754, 158206, 79315, -427236, 36868, -50042, 353309, 13307, 50384, 52396, 334187, 405322, -16996, 224137, 262098, 135926, 145865, -285066, 104455, 128009, -113309, -167279, -240302, -54020, -14361, -45055, -96057, -189367, -15497, 156975, -282785, 110669, -55746, -67556, 362017, -189352, 39461, -82440, 101773, -282727, 52667, -63170, -366327, 198858, -112061, 106418, -311693, -256525, -161133, -247331, -266644, 191423, -129880, -103369, -315701, -457272, 3595, 271927, 34002, -253495, 108006, -94704, 128633, -181813, -73226, -187072, -162624, -29560, -161259, -251560, -387721, -2247, -304360, -3346, -118455, -127623, -101404, -54685, -152676, -83875, 20193, 33168, -35550, -193384, -256789, -277768, -402113]
10173d02113a84983a0574l8522j53557A09933a20567K7066j96578h3413p3013
10163a56426P2832j46646M8309k20667J99277A05587a23213H9763b58420a10782
10152A27194m2068g6421q1426g1944A53848j1132b60816A48269G447J35242c70071
10140B25451b33824B0484L63983E7752N8325d9744j6715K2987j83059R3536j60218
10129b93213E744a55744H8301f7796J6569j25427K1908j16948F1697O6533g7406
10117b51981j91086A29875c38402k2542B0942a70542N3317A09673g3252j73388
10107b46640a20594G1984d12692B64280a53943e1284j18873A70059a77174A57359
10096E7483a14200r9301d9349C38341b04186a2408q0761B01457b53326C8595b17800
$$ y = [-402113, -184983, -10574, -49096, -202653, 109933, -120567, -93501, -290079, -83413, -156426, -83594, -230240, -181931, -402598, -203321, 105587, -123213, 89763, -258420, -110782, 127194, 85126, -76421, -157847, -71944, 153848, 142716, -260816, 148269, 7447, 142689, -370071, 225451, -233824, 20484, 384467, 57752, 116077, -49744, -66459, -43472, -226531, -132995, -293213, 5744, -155744, 88301, -67796, -51227, -176654, -154746, -271694, 61697, 128230, -77406, -251981, -443067, 129875, -338402, -360944, 20942, -170542, -117225, 109673, -73252, -246640, -120594, 71984, -412692, 264280, -153943, -51284, -170157, 170059, -177174, 157359, 57483, -114200, -213501, -49349, 338341, -204186, -12408, -93169, 201457, -253326, 38595, -217800]
10084F6776b1230r5461j47557J17064C39001l7352a53374d5063D6700c98968a68757
10072I7638d2522k31018d3903j667p3855l3849B3330a78110m4271R5755k63926
10061c90552E8871b02897j83556F9188c95631D0091b36534i6376j73877A16833
10050e6598B96763i6651a7532k02814H8058a65167B47578a05653L2076k30981
10040c04558c8568k88872c2172E3012K3626b41024p4845H9896a80991A82694a30332
10028c49671h7611A53600C2123b95196G6126a47750D4351P4083c6202E4159N3140
10017A07299M7516c11801a13176A72670a7215k078A77182a68625J2216e384A27405
10005B2766b68441A64568a7892D4546d00000C12655a46050j59253D7191b73148
$$ y = [66776, -21230, -116691, -264248, -147184, 339001, 301649, -153374, -45063, 46700, -398968, -168757, 97638, -42522, -273540, -43903, -45570, -119425, -153274, 23330, -178110, -222381, -126626, -390552, 58871, -202897, -386453, 69188, -395631, 40091, -236534, -96376, -270253, 116833, -56598, 296763, -96651, -17532, -220346, 88058, -165167, 247578, -105653, -73577, -304558, -38568, -327440, -32172, 53012, 76638, -241024, -315869, 89896, -180991, 182694, -130332, -349671, -87611, 153600, 32123, -295196, 76126, -147750, 44351, 118434, -36202, 54159, 107299, 154815, -311801, -113176, 172670, -17215, -19293, 177182, -168625, -156409, -5384, 127405, 22766, -268441, 164568, -17892, 44546, -400000, 312655, -146050, -305303, 47191, -273148]
9994A7244a91730f626k67671a08088A35269D7381a13053k9095A66274a70499f8785
9982a55598O3288p5627j75896d3142H3716R8387D5066b22648M3780A41851J75873
9971C17724a76410j29996B46268G7045K62747b42690a10655k28227J38318a8575
9960d07579r5213i2875G4580K9970C6727C953a30847e3252l03031a59514M1350
9949a18164p2541D273a24596r1832k23053C13249a32898j15690R0589k6062e195
9937d67858G892L6339e8665A08253f6802o8315m6017l6747E4535J18000A0884
9925c19117j71900a35514b7701A56971G2765a05332j43796j06765a00451J1666
9915h8785B45133i0984a563C2342K6498J08641d30792f8114I6893a9698E9514
$$ y = [17244, -191730, -6626, -274297, -108088, 135269, 47381, -113053, -142148, 166274, -170499, -68785, -155598, -92310, -167937, -343833, -43142, 83716, 182103, 45066, -222648, -178868, 141851, 317724, -176410, -306406, 246268, 77045, 339792, -242690, -110655, -338882, -200564, -18575, -407579, -502792, -92875, 74580, 104550, 36727, 3953, -130847, -53252, -356283, -159514, -118164, -190705, 4273, -124596, -216428, -439481, 313249, -132898, -248588, -157999, -184061, -5195, -467858, 7892, 44231, -58665, 108253, -66802, -135117, -181134, -217881, 54535, 172535, 10884, -319117, -491017, -135514, -27701, 156971, 72765, -105332, -249128, -355893, -100451, -88785, 245133, -90984, -1563, 32342, 58840, 167481, -430792, -68114, 96893, -19698, 59514]
9903a90962r186A3015M23714A0852K01968n749H6027d5657k42308B58777I019
9891a57390j42866J16875E4493a64653n2982h5809p2072K1345o3302d3070l0715
9880g3785j92116D06190a73153O9992A4776N7153c87783A85366a40875k328K5726
9869a17477B3023K66907A27167f4624J807o9413j44258a35533A02982i7366A50214
9857G5838J8258J06145c47454F8907b66223h98p9933G4099d36154e65k05663A22071
9844c91705J3001i2403F0030o305f1441k07522M1008A33167a41047c8399m1754
9833h0153j46508h4229p1225F1063K5210B4401K04461d9161j2863D5225c767k13209
9821b16976H9632a53774A27151a14799B2235O0257a6340B20373D520a74631j17945
$$ y = [-190962, -200148, 13015, 436729, 10852, 212820, 207071, 86027, -45657, -287965, 258777, 9019, -157390, -300256, -183381, 54493, -164653, -217635, -85809, -157881, -136536, -199838, -43070, -73785, -265901, 406190, -173153, -103161, 14776, 71929, -387783, 185366, -140875, -143203, -117477, 23023, 289930, 127167, -64624, -62817, -132230, -276488, -135533, 102982, -97366, 150214, 75838, 94096, 200241, -347454, 68907, -266223, -898, -80831, 74099, -436154, -565, -206228, 122071, -391705, -378704, -92403, 60030, 53725, -61441, -268963, -227955, 133167, -141047, -38399, -80153, -226661, -84229, -155454, 61063, 86273, 24401, 228862, -49161, -62024, 45225, -3767, -216976, 89632, -153774, 127151, -114799, 22235, 82492, -16340, 220373, 4520, -174631, -292576]
9810b92576J38277o9082J00985a4482C1183a37183B04113E6067O32a07609K4715
9799h2894p5197k68100D2297K84716J8283G0250c35816R7017R9886f7416B64923
9787A01022K2463e1149I3445a41796q2679C8609a44881B22471M886E0523a13291
9775b4280k93242a50789b7152m7383k8787r4758L0365P53I3169J16163c72539
9763g4537k09779i1931A08678P9363a16954j51945J5292B36481a23542B44040
9752B9041J03977f1046j21473f9658n4562G7684a94110M0728A36584b33558A21235
9740a78977A63997A7983N3655J05217a14858j31535O5418D1107a33798D42675
9729c07009A26396D6249N6307a83150e6826l64453B5232b60991M6621c8443o9374
$$ y = [-292576, -154299, -223381, -122396, -14482, 31183, -137183, 204113, 56067, 56699, -107609, -82894, -158091, -426191, 42297, 327013, 345296, 70250, -335816, -238799, -138913, -67416, 264923, 101022, 123485, -51149, 93445, -141796, -224475, 38609, -144881, 222471, 227357, 50523, -113291, -24280, -317522, -150789, -27152, -74535, -103322, -198080, -167715, -166962, 93169, 209332, -372539, -74537, -284316, -91931, 108678, 188041, -116954, -268899, -253607, 236481, -123542, 244040, 29041, 133018, -61046, -182519, -69658, -124220, 77684, -194110, -153382, 136584, -233558, 121235, -178977, 163997, 17983, 71638, 176855, -114858, -246393, -180975, 41107, -133798, 442675, -307009, 126396, 46249, 102556, -183150, -56826, -421279, 25232, -260991, -214370, -38443, -107817]
9718a07817F3454R9400b28473j0889R0810J7896E0610A7066a15732j69109N9067
9707b25774B15590b65226D6958i8858q5904k1118N6859D4526e6323k31130N8705
9696b28748f6206c2395B3245a2056m9682j40468f5075j77450c5877l14436a57382
9684a25303j9571B2707c5313l12877g8672E2678a21319e0524l00604g5375B090
9672I188K6850b50019C23607g4865C3826b15058P6081e7005m5144j11823b6533
9660A2389a44888e2069C21343b7103A03507c08666C1653c9886A36808d44745j4341
9649d59086J47442O9987R1552e0372o8114B21135c58608f020l59627E5902f0258
9637h3857b9253B7843N7267L8503a9091k5227k24637I7899J3358f2669k2312B43307
$$ y = [-107817, 63454, 162854, -228473, -239362, -148552, -130656, 50610, 17066, -115732, -284841, -225774, 215590, -265226, 46958, -98858, -184762, -205880, -149021, 44526, -56323, -287453, -228748, -66206, -32395, 23245, -12056, -61738, -202206, -65075, -242525, -35877, -350313, -157382, -125303, -144874, 22707, -35313, -348190, -78672, 52678, -121319, -50524, -351128, -75375, 2090, 9188, 36038, -250019, 323607, -74865, 33826, -215058, -138977, -57005, -102149, -213972, -26533, 12389, -144888, -52069, 321343, -27103, 103507, -308666, 31653, -39886, 136808, -444745, -459086, -311644, -241657, -150105, -50372, -118486, 221135, -358608, -6020, -365647, 55902, -60258, -83857, -29253, 27843, 85110, 123613, -19091, -44318, -268955, 97899, 111257, -62669, -84981, 243307]
9624A08888a63623r1086n2205Q0171j00587D2348a62210P1748L7256C7993a62276
9612F212a52438H4069b94458a42808k8806q0069a6218F6003a0628A74232c9814
9600H4787g1178j47285i0267A0614K48386G07L90767b06695m5055P1261l9144
9589b19633R69d8057k63317d8493B48553B3247J05354e0390j33518A1995c41159
9577A23775a44655k44723H2682a6387p0756a651l17496H6722c94609A17063m7102
9566F9961K53184a72934f0334C8883O2561A8302e2621N120j3261G6379d5308r702
9554e5010k67003A37497c2882l4136k1725l1210e6204j57978d2022r5477k3202
9543a60701J4640l7459k2092I2459N7228b43338H0033j8130J56397b28972j2837
$$ y = [108888, -163623, -254709, -306914, -226743, -327330, 42348, -162210, -90462, -53206, 37993, -162276, 6212, -152438, 84069, -294458, -142808, -171614, -251683, -16218, 66003, -10628, 174232, -39814, 84787, -71178, -218463, -90267, 10614, 259000, 707, 391474, -206695, -251750, -180489, -219633, -218664, -48057, -311374, -48493, 248553, 23247, 128601, -50390, -183908, 11995, -341159, 123775, -144655, -389378, 82682, -16387, -87143, -1651, -319147, 86722, -394609, 117063, 69961, 323145, -172934, -60334, 38883, 101444, 18302, -52621, -47501, -60762, 76379, -45308, -55010, -322013, 137497, -32882, -67018, -88743, -119953, -56204, -214182, -42022, -137499, -160701, -146061, -183520, -205612, 92459, 149687, -243338, 80033, 61903, 218300, -228972, -241809]
9532b41809r0555C428c96615A15559L7640a62028b5911j34249P0531n6045A92356
9520c16825J21084Q4308C47705E3978d1730k25790J11054M7896j2561K9262L8104
9509e3765B151b91820A39029c8170j37669j3889g4675l10271a22909R632B03372
9497a70683M2880A57094b9551j59166E524a1114F5377L3369e1012q2361A12423
9485A2459a2709B18335r6166R8413F7387a67320b6222G8069L2710a66152A39925
9473A99680b24998B64895f2805N85j53591G0349l153h4239A74984a808l4593j79206
9461b15607J07791E8664d93994C6341a55227j35465h3159A74575a7357k28390
9451b45747b3683A2636c52859D3722J40727q7163m948a357m57249g3388F8069
$$ y = [-241809, -332364, 3428, -396615, 115559, 153199, -162028, -25911, -160160, -89629, -145674, 192356, -316825, -195741, -111433, 347705, 53978, -41730, -267520, -156466, -108570, -121131, -91869, -53765, 2151, -291820, 139029, -38170, -175839, -189728, -74675, -384946, -122909, -113277, 203372, -170683, -127803, 157094, -29551, -188717, 5524, -11114, 65377, 98746, -51012, -133373, 112423, 12459, -12709, 218335, 122169, 220582, 67387, -167320, -26222, 78069, 110779, -166152, 139925, 199680, -224998, 264895, -62805, -62220, -215811, 70349, 67196, -84239, 174984, -1808, -36401, -215607, -107816, 58664, -493994, 36341, -155227, -290692, -83159, 174575, -17357, -245747, -23683, 12636, -352859, 43722, 184449, 97286, 92338, -1357, -458606, -73388, 68069]
9439E8722K14484a18787C8851b06974A43281K9229a00597A57463a26211m0056
9429a66267f4588A1272e2556A2738b31380F9438b26325j14936B97064G0114b28063
9417b49389m3461R1039A76867b67115g1913j65921O1984G2347b84139A61134a94552
9405E3984c31228g5147A03687a90087K655L6051E0083J3376b27339A10872m1422
9394F9450a55466k20884a71800A88853b16906E4485A451b3772p2085J324A2854
9382d42144A94469a68512C54241a75763B6935b57863I1575l2953c4762B8239a34137
9370f9198l5382m29111J69271J03911k85626K16915h4689B1562K07930Q5995A040
9358A95084H0511a43592H4020a8498E3195b31369B87669A19021a47386M3413j9663
$$ y = [58722, 273206, -118787, 38851, -206974, 143281, 172510, -100597, 157463, -126211, -166267, -64588, 11272, -52556, 12738, -231380, 69438, -226325, -341261, 297064, 70114, -228063, -249389, -292850, -201811, 176867, -267115, -71913, -237834, -175850, 72347, -284139, 161134, -194552, 53984, -331228, -75147, 103687, -190087, -187432, -151381, 50083, 63459, -227339, 110872, 69450, -155466, -376350, -171800, 188853, -216906, 54485, 1451, -23772, -95857, -94533, 12854, -442144, 194469, -168512, 354241, -175763, 26935, -257863, 91575, 58622, -34762, 28239, -134137, -69198, -104580, -533691, -364420, -260509, -546135, -329220, -84689, 21562, 229492, 315487, 1040, 195084, 80511, -143592, 84020, -18498, 53195, -231369, 287669, 119021, -147386, -103973, -123636]
9347a23636m6509O1043A85561b07435a7401C4206C347K6551J92813c66234R6704
9336b69530N4941k1737A7633c1977j283A06856b16612C729c5523m3703m3408A03689
9323a28348A39530c74291A1936f4888E4523M2407a77795N4247B1772d32575a27402
9311A97737C9728g3308B12527A02732C0292M3843a18053k07017J30918A40175
9300e0708m4375I9291a04162l7458A53003a66204F5925c39516b1788B29678a54434
9288d14003A86404b57755A98328b13964F0801J53566a21475a6172j06982N8142
9278f5012n0295E7315K9006O7545f4747J8351k6731J6149r9264j1170o8929K2175
9266b14166b6647H5496a23950k9636j13824C8338b71B62411n8975B0951J58994
$$ y = [-123636, -170145, -109102, 185561, -207435, -17401, 34206, 3347, 29898, 222711, -366234, -269530, -214589, -236326, 17633, -31977, -33260, 106856, -216612, 3729, -35523, -79226, -122634, 103689, -128348, 139530, -374291, 11936, -64888, 54523, 96930, -177795, -123548, 21772, -432575, -127402, 197737, 39728, -73308, 212527, 102732, 30292, 74135, -118053, -325070, -194152, 140175, -50708, -95083, 99291, -104162, -141620, 153003, -166204, 65925, -339516, -21788, 229678, -154434, -414003, 186404, -257755, 198328, -213964, 60801, 214367, -121475, -16172, -123154, -65012, -115307, 57315, 86321, 153866, -64747, -46396, -73127, -56978, -156242, -167412, -236341, -214166, -26647, 85496, -123950, -153586, -267410, 38338, -271, 262411, 203436, 20951, 179945]
9255A79945a78291H8117c00385g3041j66052A08031a38807D7230O6936E747b9093
9243A88877E0937a9039C1204b55188A35676f128p3018a598q0030A10989a7534
9231a16377b2702D5308J45490b91323a08712M5013B7422a14736A61128b83284
9220C9078j5869e3799B54715a92319A29970j073e751A45137i5107C34866f8518
9208F6075a78806h4769F1476a48656B11799i1710A6526b08150o5820R2469F3249
9196b93831A3913K046O3964h7202k77640J61991M6270c6299A59369B4908a18918
9184f3530j47785Q5433K0701K8159j8312k20126J49038B2953g7477r6607A08854
9172b00164c2842L784k54239C14631b54281f241l76689d5883l45586B10586l0675
$$ y = [179945, -178291, 88117, -300385, -73041, -239093, 108031, -138807, 47230, 114166, 5747, -29093, 188877, 50937, -19039, 31204, -255188, 135676, -6128, -79146, -1598, -81628, 110989, -17534, -116377, -22702, 45308, 190798, -291323, -108712, -63699, 27422, -114736, 161128, -283284, 39078, 23209, -53799, 254715, -192319, 129970, 128897, -5751, 145137, -95107, 334866, -68518, 66075, -178806, -84769, 61476, -148656, 211799, -91710, 16526, -208150, -273970, -181501, 63249, -293831, 13913, 15959, 79923, -87202, -364842, -202851, -156581, -36299, 159369, 24908, -118918, -63530, -211315, -125882, -105181, -77022, -95334, -315460, -166422, 22953, -77477, -174084, 108854, -200164, -32842, -29058, -283297, 314631, -254281, -6241, -382930, -45883, -391469, 210586, 179911]
9161A79911a72098e6586j18012G1812i9183d955A99250a64552k15571a75212B10420
9149a75398B26418C9454J17269B8969g9062o5304P661N4521j24667j20132J34815
9138a92168A57508c82056J62656n3206I1400A6420a4789A91452c75788C5998J3919
9127D9917i130C5021a22317j93F4559c09821d4245q9245m18B39483H6199c37837
9114c43755a03121j53115H0068C8533g817j64957o8769o6201E5053d6100j43464
9103a89564B3172b1352l16117L6242A04027a81587N2104f1491j887A22331b0656
9091a85069a208k56358N0267d4464K487j64164I5522d2105l51597A74896a5187
9079b31856B83058N4118H3802h0813l2672a2793m0392j12255I4667d3457A06560
$$ y = [179911, -172098, -56586, -174598, 71812, -99183, -4955, 199250, -164552, -380123, -175212, 210420, -175398, 226418, 39454, 156723, 28969, -79062, -144366, -136705, -82184, -206851, -326983, -192168, 157508, -382056, -219400, -272606, 91400, 16420, -14789, 191452, -375788, 35998, 49917, -9130, 35021, -122317, -122510, 64559, -309821, -44245, -133490, -133908, 239483, 86199, -337837, -343755, -103121, -256236, 80068, 38533, -7817, -172774, -241543, -307744, 55053, -46100, -189564, 23172, -21352, -337469, -301227, 104027, -181587, -129483, -61491, -63378, 122331, -20656, -185069, -1208, -257566, -207299, -44464, -41977, -206141, 95522, -42105, -393702, 174896, -15187, -231856, 283058, 337176, 83802, -80813, -113485, -12793, -53185, -165440, 94667, -43457, 106560]
9067b03384F9705b1138A0733a86496M5113o078A70719b71066J00713A46205i4368
9055C4439J72983c2514I5946J41038n8662J5491c52340B41878a64581J7768F3357
9043a98518l1483j9611b9306n9074I6703d03837a56854j31488I3478c80014E4680
9031a28547B134g386B2424c11324a1395A0389h336D4780a02841i987B96961a75013
9018a05969k48084A0208a70936N3284e6119J8922A2716J34115b74987E1734a15287
9006I5931b20114H0280l4567A5825a70230j35041G4607b67957K2788j0522A93481
8994b37204B12840c5531a2087l5814J1557D2974A7613c73355A04397P4104c26468
8982C34409c08894E340J1054b31321h2749B11043i8545k58635J15429A56711Q7133
$$ y = [-203384, 69705, -21138, 10733, -186496, -141383, -147461, 170719, -271066, -170353, 146205, -94368, 34439, 207422, -32514, 95946, 236984, 178322, 193813, -352340, 241878, -164581, -146813, 63357, -198518, -230001, -249612, -29306, -88380, 96703, -403837, -156854, -288342, 93478, -380014, 54680, -128547, 2134, -7386, 22424, -311324, -11395, 10389, -8336, 44780, -102841, -9987, 296961, -175013, -105969, -354053, 10208, -170936, -117652, -56119, -37197, 12716, 146831, -274987, 51734, -115287, 95931, -220114, 80280, 45713, 15825, -170230, -305271, 74607, -267957, -245169, -255691, 193481, -237204, 212840, -35531, -12087, -47901, -36344, 42974, 17613, -373355, 104397, 178501, -326468, 334409, -308894, 5340, 16394, -231321, -82749, 211043, -98545, -357180, -241751, 156711, 243844]
8971B43844a68891A19270J96542G8846b52525D3412J9411J72991M0074a07493
8960i852C7719b38145J08981E7776b77590P1027G6751f4128D9448b39253g4123
8948G9350b50148a07645k182E2390j4426e3923K6767o6705A32229d72353J29342
8937c43011i6472l93649e6824o1805C8058d944q977F4177J63175g5305q7681l1559
8925a94545I8784i7729B53904b82414g2992D1725J46116J40472M23866a6468B07348
8913a24960j8505j1066A22328b61636e6712j13733f7028n6454a716j0007j05618
8902a17341M6079E1007a82722L4078k13623B6331d17716a92799F392a13763c2493
8890a17206A82932p8463g777B50780b60857E8760O560c1200a1897C275a00338
$$ y = [243844, -168891, 119270, 315812, 78846, -252525, 43412, 62823, 235814, 275888, -107493, -9852, 37719, -238145, -129164, 57776, -277590, -206563, 76751, -64128, 49448, -239253, -74123, 79350, -250148, -107645, -109827, 52390, 37964, -53923, -27156, -93861, 132229, -472353, -343011, -96472, -490121, -56824, -118629, 38058, -4944, -13921, 64177, 227352, -75305, -162986, -194545, 98784, -97729, 253904, -282414, -72992, 41725, 187841, 328313, 752179, -16468, 207348, -124960, -143465, -154531, 122328, -261636, -56712, -170445, -67028, -123482, -1716, -11723, -117341, -71262, 51007, -182722, -148644, -362267, 26331, -417716, -192799, 6392, -113763, -32493, -117206, 182932, 104469, -7777, 250780, -260857, 58760, 65320, -31200, -11897, 3275, -100338]
8878b24493o685P8067A35770L3892b32019R9968e3845k18145j04489d0462A37942
8866f8258k10639b4818k93513C8505h2464m2855m2569E6407J09860c44671B76993
8854A44540c85021J79538C7891c0769H6385a09406j44847M7624A6859J12125m0853
$$ y = [-224493, -231178, -153111, 135770, 169662, -232019, -132051, -53845, -271990, -376479, -40462, 137942, -68258, -278897, -24818, -318331, 38505, -82464, -125319, -167888, 56407, 166267, -344671, 276993, 144540, -385021, -205483, 37891, -30769, 86385, -109406, -254253, -206629, 16859, 128984, 88131]
$$ [...]
##END NTUPLES=NMR SPECTRUM
##END=
