##TITLE=NES1031_Conilon_9266930_AQFG5NnhPy
##JCAMPDX= 6.0         $$ Bruker NMR JCAMP-DX V2.0
##DATA TYPE= NMR SPECTRUM
##DATA CLASS= NTUPLES
##ORIGIN= BRUKER
##OWNER= Administrator
$$ 1.72 TOPSPIN		Version 2.1
$$ 2015-07-09 20:35:31.050 -0700  Administrator@X
$$ Compression mode = diff/dup
##.OBSERVE FREQUENCY= 400.02188249412
##.OBSERVE NUCLEUS= ^1H
##.ACQUISITION MODE= SIMULTANEOUS (DQD)
##.ACQUISITION SCHEME= undefined
##.AVERAGES= 64
##.DIGITISER RES= 22
##SPECTROMETER/DATA SYSTEM= spect
##.PULSE SEQUENCE= noesygpps1d.comp
##.SOLVENT NAME= COFFEE_meoh
##.SHIFT REFERENCE= INTERNAL, COFFEE_meoh, 1, 14.96507
##AUDIT TRAIL= $$ (NUMBER, WHEN, WHO, WHERE, PROCESS, VERSION, WHAT)
$$ ##TITLE= Audit trail, TOPSPIN		Version 2.1
$$ ##JCAMPDX= 5.01
$$ ##ORIGIN= Bruker BioSpin GmbH
$$ ##OWNER= Administrator
$$ $$ E:\/data/COFFEE/nmr/NES1031_Conilon_9266930_AQFG5NnhPy/12/pdata/1/auditp.txt
$$ ##AUDIT TRAIL=  $$ (NUMBER, WHEN, WHO, WHERE, PROCESS, VERSION, WHAT)
(   1,<2015-07-09 20:35:25.425 -0700>,<Administrator>,<X>,<go>,<TOPSPIN 2.1>,
      <created by zg
	started at 2015-07-09 20:23:55.675 -0700,
	POWCHK enabled, PULCHK disabled,
       configuration hash MD5:
       21 0F 79 D6 B3 7B B4 F6 88 20 88 DB 03 48 BD 9F
       data hash MD5: 64K
       67 FA 31 5A 40 7B 15 92 5E 02 FE B1 49 D3 FA 12>)
(   2,<2015-07-09 20:35:28.941 -0700>,<Administrator>,<X>,<proc1d>,<TOPSPIN 2.1>,
      <Start of raw data processing
       efp LB = 0.3 FT_mod = 6 PKNL = 1 PHC0 = 0 PHC1 = 0 SI = 128K 
       data hash MD5: 128K
       0C 2A FA E2 3D F5 1E 1C B5 A5 4B 2E 23 1E B6 5E>)
(   3,<2015-07-09 20:35:29.831 -0700>,<Administrator>,<X>,<proc1d>,<TOPSPIN 2.1>,
      <pk PHC0 = -88.83545 PHC1 = 0 
       data hash MD5: 128K
       2B 4B EC 53 55 06 A6 26 F0 89 17 E1 AD 8E FD 2E>)
(   4,<2015-07-09 20:35:30.238 -0700>,<Administrator>,<X>,<proc1d>,<TOPSPIN 2.1>,
      <abs ABSG = 1 
       data hash MD5: 128K
       F8 96 3C 5C 7A 0F B6 09 33 F0 7E D2 99 C1 AC D1>)
(   5,<2015-07-09 20:35:30.331 -0700>,<Administrator>,<X>,<proc1d>,<TOPSPIN 2.1>,
      <abs ABSG = 2 
       data hash MD5: 128K
       1B 2F 87 5C 91 D7 A9 53 CB CD 8A CE 62 CA D3 F4>)
(   6,<2015-07-09 20:35:30.410 -0700>,<Administrator>,<X>,<proc1d>,<TOPSPIN 2.1>,
      <abs ABSG = 3 
       data hash MD5: 128K
       49 DB 08 20 F8 96 14 C5 F9 55 AE 14 F5 3E B3 58>)
(   7,<2015-07-09 20:35:30.503 -0700>,<Administrator>,<X>,<proc1d>,<TOPSPIN 2.1>,
      <abs ABSG = 4 
       data hash MD5: 128K
       AC 5B CC BA 7C 09 7C A0 45 54 46 86 DC 63 0C C5>)
(   8,<2015-07-09 20:35:30.613 -0700>,<Administrator>,<X>,<proc1d>,<TOPSPIN 2.1>,
      <abs ABSG = 5 
       data hash MD5: 128K
       E6 7C 1A E4 E4 6C 2F 77 2D 95 32 2F 78 C4 B6 C0>)
$$ ##END=
$$ 
$$ $$ hash MD5
$$ $$ 0B 6D EE 51 ED 3E E7 2B 46 D7 C8 E1 0B 92 B4 BC
##$RELAX= 
##$RELAX= 
##$RELAX= 
##$RELAX= 
##$RELAX= 
##$RELAX= 
##$RELAX= 
##$RELAX= 
$$ Bruker specific parameters
$$ --------------------------
##$DU= <E:\>
##$EXPNO= 12
$$ [...]
150 150 150 150 150 150 150 150
##$TP07= 0
##$TPNAME0= <>
##$TPNAME1= <>
##$TPNAME2= <>
##$TPNAME3= <>
##$TPNAME4= <>
##$TPNAME5= <>
##$TPNAME6= <>
##$TPNAME7= <>
##$TPOAL= (0..7)
0.5 0.5 0.5 0.5 0.5 0.5 0.5 0.5
##$TPOFFS= (0..7)
0 0 0 0 0 0 0 0
##$TUNHIN= 0
##$TUNHOUT= 0
##$TUNXOUT= 0
##$USERA1= <user>
##$USERA2= <user>
##$USERA3= <user>
##$USERA4= <user>
##$USERA5= <user>
##$V9= 5
##$VALIST= <valist>
##$VCLIST= <CCCCCCCCCCCCCCC>
##$VD= 0
##$VDLIST= <DDDDDDDDDDDDDDD>
##$VPLIST= <PPPPPPPPPPPPPPP>
##$VTLIST= <TTTTTTTTTTTTTTT>
##$WBST= 2048
##$WBSW= 25
##$XGAIN= (0..3)
0 0 0 0
##$XL= 0
##$YL= 0
##$YMAX_a= 6328583
##$YMIN_a= -13603323
##$ZGOPTNS= <>
##$ZL1= 120
##$ZL2= 120
##$ZL3= 120
##$ZL4= 120
##$ABSF1= 14.96507
##$ABSF2= -5.593112
##$ABSG= 5
##$ABSL= 3
##$ALPHA= 0
##$AQORDER= 0
##$ASSFAC= 0
##$ASSFACI= 0
##$ASSFACX= 0
##$ASSWID= 0
##$AUNMP= <proc_prof1d_extract.lims>
##$AXLEFT= 0
##$AXNAME= <>
##$AXNUC= <1H>
##$AXRIGHT= 0
##$AXTYPE= 0
##$AXUNIT= <>
##$AZFE= 0.1
##$AZFW= 0.1
##$BCFW= 0
##$BC_mod= 0
##$BYTORDP= 0
##$COROFFS= 0
##$CY= 15
##$DATMOD= 1
##$DC= 0
##$DFILT= <>
##$DTYPP= 0
##$F1P= 0
##$F2P= 0
##$FCOR= 0.5
##$FTSIZE= 131072
##$FT_mod= 6
##$GAMMA= 0
##$GB= 0
##$INTBC= 1
##$INTSCL= 1
##$ISEN= 128
##$LB= 0.3
##$LEV0= 0
##$LPBIN= 0
##$MAXI= 10000
##$MC2= 0
##$MEAN= 0
##$ME_mod= 0
##$MI= 0
##$NCOEF= 0
##$NC_proc= -2
##$NLEV= 6
##$NOISF1= 0
##$NOISF2= 0
##$NSP= 0
##$NTH_PI= 0
##$NZP= 0
##$OFFSET= 14.96507
##$PC= 1
##$PHC0= -88.83545
##$PHC1= 0
##$PH_mod= 1
##$PKNL= yes
##$PPARMOD= 0
##$PPDIAG= 0
##$PPIPTYP= 0
##$PPMPNUM= 2147483647
##$PPRESOL= 1
##$PSCAL= 4
##$PSIGN= 0
##$PYNMP= <proc.py>
##$REVERSE= no
##$SF= 400.0200080079
##$SI= 131072
##$SIGF1= 0
##$SIGF2= 0
##$SINO= 400
##$SIOLD= 131072
##$SPECTYP= <>
##$SREGLST= <1H.CDCl3>
##$SSB= 0
##$STSI= 131072
##$STSR= 0
##$SW_p= 8223.68421052631
##$SYMM= 0
##$S_DEV= 0
##$TDeff= 65536
##$TDoff= 0
##$TI= <>
##$TILT= no
##$TM1= 0
##$TM2= 0
##$TOPLEV= 0
##$USERP1= <user>
##$USERP2= <user>
##$USERP3= <user>
##$USERP4= <user>
##$USERP5= <user>
##$WDW= 1
##$XDIM= 131072
##$YMAX_p= 435570353
##$YMIN_p= -11555
##$CURPLOT= <Network HP LaserJet P1505>
##$CURPRIN= <$Network HP LaserJet P1505>
##$DFORMAT= <normdp>
##$LAYOUT= <+/1D_H.xwp>
##$LFORMAT= <normlp>
##$PFORMAT= <normpl>
##$SURQMSG= 1
$$ End of Bruker specific parameters
$$ ---------------------------------
##NTUPLES= NMR SPECTRUM
##VAR_NAME=  FREQUENCY,     SPECTRUM/REAL,   SPECTRUM/IMAG
##SYMBOL=    X,             R,               I
##VAR_TYPE=  INDEPENDENT,   DEPENDENT,       DEPENDENT
##VAR_FORM=  AFFN,          ASDF,            ASDF
##VAR_DIM=   131072,        131072,          131072
##UNITS=     HZ,            ARBITRARY UNITS, ARBITRARY UNITS
##FACTOR=    0.0627417313425164, 1,          1
##FIRST=     8223.62146879497, 2483,         -37630
##LAST=      0,             2916,            -37467
##MIN=       0,             -11555,          0
##MAX=       8223.62146879497, 435570353,    0
$$ Real data points
##PAGE= N=1
##DATA TABLE= (X++(R..R)), XYDATA
$$ [...]
$$ plain form
63480 274096 267133 260918 255336 250592 247227 245243 243743 241898 239933 238727 238729 239702 241241 243040 244834
63465 244834 246598 248733 251626 255149 258968 263170 268153 274015 280512 287474 294843 302438 310173 318345
63451 318345 327108 335714 342911 348192 352087 355143 357227 358066 357977 357756 358112 359318 361021 362301 362447 361969
63435 361969 362373 364589 367922 370837 372403 372606 371665 369684 366869 363520 359716 355370 350683 346252 342563
63420 342563 339567 336900 334383 332222 330781 330246 330426 330874 331303 331915 333205 335335 337848 340191 342453
63405 342453 345329 349333 354288 359724 365488 371720 378407 385274 392105 398834 405371 411621 417741 424038
63391 424038 430496 436662 442111 446724 450425 452953 454130 454064 452944 450975 448753 447244 446913 447153 447108 446891
63375 446891 447384 448809 450142 450234 449073 447516 445982 443808 439929 433917 426266 417853 409317 400917 392712
$$ packed form
63480B74096o963o215n582m744l365j984j500j845j965j206KR73J539J799J794
63465B44834J764K135K893L523L819M202M983N862O497O962P369P595P735Q172
63451C18345Q763Q606P197N281L895L056K084Q39q9k21L56J206J703J280J46m78
63435C61969M04K216L333K915J566K03r41j981k815l349l804m346m687m431l689
63420C42563k996k667k517k161j441n35J80M48M29O12J290K130K513K343K262
63405C42453K876M004M955N436N764O232O687O867O831O729O537O250O120O297
63391D24038O458O166N449M613L701K528J177o6j120j969k222j509l31K40m5k17
63375D46891M93J425J333R2j161j557j534k174l879o012p651q413q536q400q205
$$ plain form
63360 392712 384744 377183 370518 365460 362355 360685 359400 357774 355706 353323 350737 348274 346389 345080
63346 345080 343749 341906 339642 337192 334509 331623 328946 326719 324513 321802 318737 315792 313009 310289
63332 310289 308109 307021 306468 304992 301896 297953 294261 291133 288505 286617 285550 284529 282515 279474
63318 279474 276500 274622 273859 273508 272952 271986 270553 268515 265793 262677 259804 257715 256500 255965 255989 256444
63302 256444 256855 256499 254995 252623 249986 247594 245743 244476 243482 242266 240669 238991 237469 235897 234072
63287 234072 232332 231247 230783 230208 228943 227215 225804 225417 226398 228620 231289 233112 233230 232043 230775
63272 230775 230211 230236 230578 231353 232496 233303 233228 232823 233105 234084 234723 234489 234091 234308 234793 234644 233710 232694 232183
63253 232183 232127 232169 232034 231627 231120 230943 231450 232648 234384 236524 238766 240650 242157 244012 246890 250550
$$ packed form
63360C92712p968p561o665n058l105j670j285j626k068k383k586k463j885j309
63346C45080j331j843k264k450k683k886k677k227k206k711l065k945k783k720
63332C10289k180j088n53j476l096l943l692l128k628j888j067j021k014l041
63318B79474k974j878p63l51n56r66j433k038k722l116k873k089j215n35K4M55
63302B56444M11l56j504k372k637k392j851j267r94j216j597j678j522j572j825
63287B34072j740j085m64n75j265j728j411l87R81K222K669J823J18j187j268
63272B30775n64K5L42P75J143Q07p5m05K82R79O39k34l98K17M85j49r34j016n11
63253B32183n6M2j35m07n07j77N07J198J736K140K242J884J507J855K878L660
$$ plain form
63237 250550 254215 257618 261084 264711 268142 271199 274172 277311 280522 283726 287122 290915 295123 299770
63223 299770 304938 310469 315961 321207 326382 331640 336850 341848 346686 351465 356208 361083 366446 372434
63209 372434 378643 384492 389889 395409 401795 409240 417082 424281 430298 435453 440362 445257 450067 454867
63195 454867 459757 464421 468336 471532 474713 478440 482553 486546 490235 493860 497796 502369 507780 514013
63181 514013 520846 528055 535554 543433 551947 561356 571629 582477 593949 606724 621376 637487 653963
63168 653963 670226 686548 703250 720166 737099 754224 771719 789307 806444 822685 837802
63157 837802 851913 865628 879582 893541 906406 917346 926453 933897 938912 940282 937626 931641 923093
63144 923093 912097 898500 882638 865527 848346 831761 815644 799569 783601 768511 755078
$$ packed form
63237B50550L665L403L466L627L431L057K973L139L211L204L396L793M208M647
63223B99770N168N531N492N246N175N258N210M998M838M779M743M875N363N988
63209C72434O209N849N397N520O386P445P842P199O017N155M909M895M810M800
63195D54867M890M664L915L196L181L727M113L993L689L625L936M573N411O233
63181E14013O833P209P499P879Q514R409J0273J0848J1472J2775J4652J6111J6476
63168F53963J6263J6322J6702J6916J6933J7125J7495J7588J7137J6241J5117
63157H37802J4111J3715J3954J3959J2865J0940R107P444N015J370k656n985q548
63144I23093j0996j3597j5862j7111j7181j6585j6117j6075j5968j5090j3433
$$ plain form
63133 755078 743350 732673 722312 711900 701494 691458 682282 674365 667867 662678 658433 654657 651181
63120 651181 648350 646521 645361 644105 642554 641368 641108 641496 641987 642713 644362 647262 651033 655074 659031
63105 659031 662826 666517 670162 673723 677184 680880 685358 690547 695305 698306 699448 699969 701114 703038
63091 703038 705092 706787 708143 709260 709945 709923 709283 708556 708268 708450 708693 708645 708274 707648 706667 705192 703292
63074 703292 701144 698775 696055 692916 689392 685454 680976 675929 670581 665528 661515 659008 657742 656700
63060 656700 654858 652079 649289 647683 647740 648870 649910 649985 649065 647880 647298 647693 648831 650235 651539 652463
63044 652463 652651 651849 650298 648623 647020 644781 641003 635751 630035 624566 619022 612822 606077 599301 592608
63029 592608 585847 579294 573438 568049 562219 555641 549289 544411 541189 538777 536406 534042 532073 530708
$$ packed form
63133G55078j1728j0677j0361j0412j0406j0036r176p917o498n189m245l776l476
63120F51181k831j829j160j256j551j186k60L88M91P26J649K900L771M041L957
63105F59031L795L691L645L561L461L696M478N189M758L001J142N21J145J924
63091G03038K054J695J356J117O85k2o40p27k88J82K43m8l71o26r81j475j900
63074G03292k148k369k720l139l524l938m478n047n348n053m013k507j266j042
63060F56700j842k779k790j606N7J130J040P5r20j185n82L95J138J404J304R24
63044F52463J88q02j551j675j603k239l778n252n716n469n544o200o745o776o693
63029E92608o761o553n856n389n830o578o352m878l222k412k371k364j969j365
$$ plain form
63015 530708 529763 528870 527900 527186 527240 528191 529617 531024 532320 533763 535590 537896 540826 544668 549646 555600
62999 555600 561954 568218 574628 582159 591739 603489 616844 631270 646673 663203 680940 699724
62987 699724 719143 738732 758325 778140 798397 819074 840179 861879 883951 905438 925403
62976 925403 943901 961657 978897 995034 1009447 1021920 1032169 1039534 1043347 1043204 1038707 1029399 1015083
62963 1015083 995910 972087 943879 911894 876917 839526 800423 761078 723232 687573 653545
62952 653545 620689 589441 560357 533436 508660 486412 466724 448734 431616 415549 401085
62941 401085 388032 375770 364297 354143 345359 337386 329860 322867 316391 310171 304193 298794 294119
62928 294119 289823 285485 281024 276672 272792 269710 267422 265453 263255 260707 258030 255327 252528 249681
$$ packed form
63015E30708r45q93r70p14N4R51J426J407J296J443J827K306K930L842M978N954
62999E55600O354O264O410P531R580J1750J3355J4426J5403J6530J7737J8784
62987F99724J9419J9589J9593J9815K0257K0677K1105K1700K2072K1487J9965
62976I25403J8498J7756J7240J6137J4413J2473J0249P365L813j43m497r308j4316
62963A015083j9173k3823k8208l1985l4977l7391l9103l9345l7846l5659l4028
62952F53545l2856l1248k9084k6921k4776k2248j9688j7990j7118j6067j4464
62941D01085j3053j2262j1473j0154q784p973p526o993o476o220n978n399m675
62928B94119m296m338m461m352l880l082k288j969k198k548k677k703k799k847
$$ plain form
62914 249681 246973 244417 241798 238988 236110 233337 230643 227783 224564 221218 218489 217053 216771 216742 216205
62899 216205 215151 213989 212958 212109 211481 211015 210607 210491 211263 213193 215776 218256 220316 221990 223274 224258
62883 224258 225395 227178 229652 232504 235472 238354 240859 242781 244149 245024 245402 245522 245799 246127 245724 244114
62867 244114 241857 239794 237954 235798 233168 230352 227464 224427 221392 218545 215663 212487 209384 206987
62853 206987 205308 203820 202291 200887 199565 198090 196635 195580 194718 193397 191566 189999 189306 189351 189780
62838 189780 190437 191021 191078 190650 190342 190394 190306 189794 189463 189895 190529 190209 188703 187054 186401 186937 188090 189297
62820 189297 190352 191248 191974 192491 192764 192755 192426 191812 191095 190496 190093 189809 189544 189200 188607 187705 186745 186053 185563
62801 185563 184989 184470 184499 185017 185239 184803 184458 184997 186024 186527 186372 186380 187139 188527 190317 192400 194426 196062
$$ packed form
62914B49681k708k556k619k810k878k773k694k860l219l346k729j436k82k9n37
62899B16205j054j162j031q49o28m66m08j16P72J930K583K480K060J674J284R84
62883B24258J137J783K474K852K968K882K505J922J368Q75L78J20K77L28m03j610
62867B44114k257k063j840k156k630k816k888l037l035k847k882l176l103k397
62853B06987j679j488j529j404j322j475j455j055q62j321j831j567o93M5M29
62838A89780O57N84N7m28l08N2q8n12l31M32O34l20j506j649o53N36J153J207
62820A89297J055Q96P26N17K73rl29o14p17n99m03k84k65l44n93r02r60o92m90
62801A85563n74n19K9N18K22m36l45N39J027N03j55QP59J388J790K083K026J636
$$ plain form
62783 196062 197730 200419 204485 209251 213928 218357 222683 226872 230827 234499 237736 240488 243216 246490
62769 246490 250005 252595 253513 253157 252316 251268 249924 248242 246109 243283 239857 236333 232845 228839 224009
62754 224009 219130 215296 212575 210019 206875 203286 199813 196802 194340 192434 190955 189559 187879 185924
62740 185924 184289 183771 184606 186138 187413 188035 188200 188055 187535 186900 186957 188417 191172 194385 197160 199128
62724 199128 200596 202226 204376 206837 209383 212352 216230 220788 225250 229414 234003 239627 246001 252591
62710 252591 259632 267942 277892 288977 300437 312142 324871 339703 356973 375880 395379 415388
62698 415388 436821 460569 486994 516349 548904 584335 621552 659574 698144 737113 775683
62687 775683 812742 847613 879970 909226 934425 954577 968680 975651 974787 966398 951611 931492
$$ packed form
62783A96062J668K689M066M766M677M429M326M189L955L672L237K752K728L274
62769B46490L515K590R18l56q41j048j344j682k133k826l426l524l488m006m830
62754B24009m879l834k721k556l144l589l473l011k462j906j479j396j680j955
62740A85924j635n18Q35J532J275O22J65j45n20o35N7J460K755L213K775J968
62724A99128J468J630K150K461K546K969L878M558M462M164M589N624O374O590
62710B52591P041Q310R950J1085J1460J1705J2729J4832J7270J8907J9499K0009
62698D15388K1433K3748K6425K9355L2555L5431L7217L8022L8570L8969L8570
62687G75683L7059L4871L2357K9256K5199K0152J4103O971q64q389j4787k0119
$$ plain form
62675 931492 906500 876841 843132 806654 768998 731422 694459 658176 622704 588420 555709
62664 555709 524891 496327 470268 446494 424449 403824 384696 367071 350717 335600 322023
62653 322023 310088 299421 289723 281171 273942 267637 261578 255417 249161 242913 237011 232188 229050 227339
62639 227339 225966 223817 220452 216232 212057 208808 206735 205342 203948 202217 200088 197541 194773 192373
62625 192373 190903 190328 190104 189760 189159 188267 187105 186018 185651 186338 187571 188327 188003 186888 185639 184486
62609 184486 183208 181734 180297 178992 177747 176903 177207 178726 180295 180737 180277 180054 180567 181455 182505 183846
62593 183846 185159 185776 185817 186225 187372 188618 189659 191283 194069 197157 199156 199683 199283 198451 197591 197430
62577 197430 198414 199812 200336 199630 198431 197289 195917 193961 191753 189914 188596 187469 186331 185427 185073
$$ packed form
62675I31492k4992k9659l3709l6478l7656l7576l6963l6283l5472l4284l2711
62664E55709l0818k8564k6059k3774k2045k0625j9128j7625j6354j5117j3577
62653C22023j1935j0667r698q552p229o305o059o161o256o248n902m823l138j711
62639B27339j373k149l365m220m175l249k073j393j394j731k129k547k768k400
62625A92373j470n75k24l44o01q92j162j087l67O87J233P56l24j115j249j153
62609A84486j278j474j437j305j245q44L04J519J569M42m60k23N13Q88J050J341
62593A83846J313O17M1M08J147J246J041J624K786L088J999N27m00q32q60j61
62577A97430R84J398N24p06j199j142j372j956k208j839j318j127j138r04l54
$$ plain form
62562 185073 185122 185088 184897 185233 186675 188745 190379 191280 192091 193166 194028 194331 194489 194899 195260 195343 195701 196873
62544 196873 198415 199557 200424 201750 203667 205581 207146 208612 210302 212369 214966 218044 221077 223623
62530 223623 226092 229460 234200 239908 245818 251226 255632 259139 262704 267493 273937 281690 290262 299294
62516 299294 308570 318351 329468 342479 356944 372115 388074 405475 424406 444329 464998 486514
62504 486514 508445 529719 549501 567382 582622 594119 601478 605385 606520 604681 599423 591046 580540
62491 580540 568811 556238 542694 527822 511622 494896 478822 464044 450532 438266 427516
62480 427516 418314 410256 403046 396818 391728 387672 384550 382337 380710 379077 377151 375022 372562 369423
62466 369423 365871 362863 360816 358997 356770 354815 354198 354577 354315 352418 349490 346616 344148 342033 340645
$$ packed form
62562A85073M9l4j91L36J442K070J634R01Q11J075Q62L03J58M10L61Q3L58J172
62544A96873J542J142Q67J326J917J914J565J466J690K067K597L078L033K546
62530B23623K469L368M740N708N910N408M406L507L565M789O444P753Q572R032
62516B99294R276R781J1117J3011J4465J5171J5959J7401J8931J9923K0669K1516
62504D86514K1931K1274J9782J7881J5240J1497P359L907J135j839n258q377j0506
62491E80540j1729j2573j3544j4872j6200j6726j6074j4778j3512j2266j0750
62480D27516r202q058p210o228n090m056l122k213j627j633j926k129k460l139
62466C69423l552l008k047j819k227j955o17L79k62j897k928k874k468k115j388
$$ plain form
62451 340645 340561 341783 343831 346488 349856 353698 357487 361427 366798 374649 384537 395229 406346 418466
62437 418466 431762 445598 459693 474606 490474 506192 520723 534526 548678 562974 575934
62426 575934 586541 594989 601733 606698 609577 610141 608120 603462 596857 589403 581717 573971 566734 560895
62412 560895 556617 553243 550511 548985 548954 549834 551256 553937 558807 565911 574909 586065 599831 615856
62398 615856 633348 652269 673335 696855 722387 749681 779209 811417 845944 881905 918502
62387 918502 955002 990468 1023990 1055179 1084045 1110294 1132984 1151077 1164227 1172818 1177237 1177384
62375 1177384 1173094 1164844 1153690 1140429 1125077 1107348 1087554 1066833 1046450 1026943 1008078 989628
62363 989628 972011 955951 941616 928481 916140 904750 894385 884402 874096 863863 855143 849162
$$ packed form
62451C40645q4J222K048K657L368L842L789L940N371P851R888J0692J1117J2120
62437D18466J3296J3836J4095J4913J5868J5718J4531J3803J4152J4296J2960
62426E75934J0607Q448O744M965K879N64k021m658o605p454p686p746p237n839
62412E60895m278l374k732j526l1Q80J422K681M870P104Q998J1156J3766J6025
62398F15856J7492J8921K1066K3520K5532K7294K9528L2208L4527L5961L6597
62387I18502L6500L5466L3522L1189K8866K6249K2690J8093J3150Q591M419J47
62375A177384m290q250j1154j3261j5352j7729j9794k0721k0383j9507j8865j8450
62363I89628j7617j6060j4335j3135j2341j1390j0365r983j0306j0233q720n981
$$ plain form
62351 849162 846108 845498 846840 849826 854372 860709 869115 879300 890306 901157 911431 921010 929518
62338 929518 936220 940397 941714 940233 936108 929240 919400 906849 892678 878234 864200 850446 836641
62325 836641 822777 809219 796571 785459 776136 768283 761429 755463 750536 746710 744099 743107 743999 746300
62311 746300 749125 752077 755325 758897 762482 765991 769792 774314 779863 786767 795136 804443 813967 823671
62297 823671 834005 844822 855283 865115 875195 886517 899246 913141 928218 944456 961477 979084
62285 979084 997616 1017222 1037301 1057364 1078064 1100596 1125308 1151590 1178942 1207412 1236879
62274 1236879 1266542 1295366 1322709 1348423 1372611 1395412 1416789 1436396 1453663 1468077 1479502
62263 1479502 1488467 1496126 1503521 1510563 1516018 1518739 1518745 1516960 1514223 1510938 1507384 1503850 1500455 1497163 1494057
$$ packed form
62351H49162l054o10J342K986M546O337Q406J0185J1006J0851J0274R579Q508
62338I29518O702M177J317j481m125o868r840j2551j4171j4444j4034j3754j3805
62325H36641j3864j3558j2648j1112r323p853o854n966m927l826k611r92Q92K301
62311G46300K825K952L248L572L585L509L801M522N549O904Q369R307R524R704
62297H23671J0334J0817J0461R832J0080J1322J2729J3895J5077J6238J7021J7607
62285I79084J8532J9606K0079K0063K0700K2532K4712K6282K7352K8470K9467
62274A236879K9663K8824K7343K5714K4188K2801K1377J9607J7267J4414J1425
62263A479502Q965P659P395P042N455K721Oj785k737l285l554l534l395l292l106
$$ plain form
62248 1494057 1491434 1489621 1488778 1488825 1489512 1490714 1492661 1495710 1499826 1504535 1509443 1514549 1520100 1526521 1534448
62233 1534448 1544248 1555294 1566329 1576853 1587655 1599580 1612384 1625380 1638648 1652897 1668435
62222 1668435 1685132 1703166 1722937 1744101 1765481 1786264 1806844 1828259 1851238 1876008 1902561
62211 1902561 1930693 1959977 1990044 2020911 2052886 2086154 2120478 2155219 2189658 2223404 2256470
62200 2256470 2288780 2319599 2347664 2372083 2393105 2412018 2430329 2448972 2468107 2487495 2507017
62189 2507017 2526894 2547502 2569045 2591349 2613831 2635730 2656504 2676062 2694591 2712193 2728692
62178 2728692 2743620 2756254 2765930 2772643 2777201 2780386 2782009 2781225 2777699 2771942 2764434 2755048 2743659
62165 2743659 2730721 2716784 2701795 2685491 2668321 2651434 2635707 2621117 2607087 2593206 2579528
$$ packed form
62248A494057k623j813q43M7O87J202J947L049M116M709M908N106N551O421P927
62233A534448R800J1046J1035J0524J0802J1925J2804J2996J3268J4249J5538
62222A668435J6697J8034J9771K1164K1380K0783K0580K1415K2979K4770K6553
62211A902561K8132K9284L0067L0867L1975L3268L4324L4741L4439L3746L3066
62200B256470L2310L0819K8065K4419K1022J8913J8311J8643J9135J9388J9522
62189B507017J9877K0608K1543K2304K2482K1899K0774J9558J8529J7602J6499
62178B728692J4928J2634R676O713M558L185J623p84l526n757p508r386j1389
62165B743659j2938j3937j4989j6304j7170j6887j5727j4590j4030j3881j3678
$$ plain form
62154 2579528 2566352 2553859 2541969 2530491 2519262 2508014 2496295 2483823 2470865 2457919 2445104
62143 2445104 2432261 2419588 2407586 2396289 2385109 2373657 2362082 2350306 2337621 2323617 2309010
62132 2309010 2294834 2281098 2266864 2251467 2235043 2217945 2200291 2182070 2163186 2143332 2122318
62121 2122318 2100612 2079160 2058529 2038547 2018860 1999464 1980542 1962051 1943740 1925437 1907207
62110 1907207 1889306 1872008 1855424 1839493 1824264 1810174 1797855 1787679 1779547 1773074 1767857 1763580
62098 1763580 1760067 1757277 1755142 1753312 1751104 1747805 1743063 1736940 1729553 1720768 1710473 1699127 1687706
62085 1687706 1676926 1666890 1657787 1650483 1645794 1643385 1642095 1641354 1641629 1643499 1647183 1653224 1662564 1674924
62071 1674924 1687324 1694959 1693728 1682030 1660893 1633258 1603104 1574280 1549207 1528032 1508618 1487316
$$ packed form
62154B579528j3176j2493j1890j1478j1229j1248j1719j2472j2958j2946j2815
62143B445104j2843j2673j2002j1297j1180j1452j1575j1776j2685j4004j4607
62132B309010j4176j3736j4234j5397j6424j7098j7654j8221j8884j9854k1014
62121B122318k1706k1452k0631j9982j9687j9396j8922j8491j8311j8303j8230
62110A907207j7901j7298j6584j5931j5229j4090j2319j0176q132o473n217m277
62098A763580l513k790k135j830k208l299m742o123p387q785j0295j1346j1421
62085A687706j0780j0036r103p304m689k409j290p41K75J870L684O041R340J2360
62071A674924J2400P635j231j1698k1137k7635l0154k8824k5073k1175j9414k1302
$$ plain form
62059 1487316 1460342 1425272 1381869 1331963 1278679 1225306 1174157 1126199 1081917 1042203 1007854
62048 1007854 978381 952210 928218 906355 886527 867782 849145 830597 812607 795226 778212
62037 778212 761617 745669 730444 716113 703091 691361 680094 668535 656965 646251 636784 628428
62025 628428 621211 615449 611373 609056 608414 608830 609183 608887 608619 609575 612294 616594 622075 627952 632873 635724
62009 635724 636367 634942 630912 623696 613897 602911 591477 579561 567512 556241 546115 536678 527724
61996 527724 519892 513895 509747 506917 504667 502163 498982 495737 493675 493432 494593 496442 498596 500882
61982 500882 503253 506027 509684 514299 519638 525693 532551 539776 546729 553598 561288 570078 579079 587291
61968 587291 594554 601217 607650 614428 622321 631518 641379 651436 662259 674860 689607 706139 724050
$$ packed form
62059A487316k6974l5070m3403m9906n3284n3373n1149m7958m4282l9714l4349
62048A007854k9473k6171k3992k1863j9828j8745j8637j8548j7990j7381j7014
62037G78212j6595j5948j5225j4331j3022j1730j1267j1559j1570j0714r467q356
62025F28428p217n762m076k317o42M16L53k96k68R56K719M300N481N877M921K851
62009F35724O43j425m030p216r799j0986j1434j1916j2049j1271j0126r437q954
61996E27724p832n997m148k830k250k504l181l245k062k43J161J849K154K286
61982E00882K371K774L657M615N339O055O858P225O953O869P690Q790R001Q212
61968E87291P263O663O433O778P893R197R861J0057J0823J2601J4747J6532J7911
$$ plain form
61955 724050 743240 763829 786096 810364 836698 864893 894888 926909 961000 996769 1033863
61944 1033863 1072508 1113400 1157293 1204919 1257075 1314619 1378551 1450200 1531077 1622309 1724359
61933 1724359 1837344 1961424 2096761 2243305 2400686 2568159 2744457 2927525 3113811
61924 3113811 3297160 3468313 3616066 3729531 3799931 3821511 3792234 3714373 3594154 3440348
61914 3440348 3262739 3071039 2873960 2678471 2489722 2311443 2146161 1995139 1858586
61905 1858586 1736041 1626503 1528534 1440803 1362384 1292144 1228159 1168482 1112423 1060415 1012727
61894 1012727 969071 929420 894246 863616 836774 813017 792380 775124 761075 749810 741047
61883 741047 734578 730178 727731 727058 727571 728704 730756 734608 740393 747175 754262 762121 771539 782537
$$ packed form
61955G24050J9190K0589K2267K4268K6334K8195K9995L2021L4091L5769L7094
61944A033863L8645M0892M3893M7626N2156N7544O3932P1649Q0877R1232J02050
61933A724359J12985J24080J35337J46544J57381J67473J76298J83068J86286
61924C113811J83349J71153J47753J13465P0400K1580k9277p7861j20219j53806
61914C440348j77609j91700j97079j95489j88749j78279j65282j51022j36553
61905A858586j22545j09538r7969q7731p8419p0240o3985n9677n6059n2008m7688
61894A012727m3656l9651l5174l0630k6842k3757k0637j7256j4049j1265q763
61883G41047o469m400k447o73N13J133K052L852N785O782P087P859R418J0998
$$ plain form
61869 782537 794655 807789 822187 837953 854967 872958 891382 909673 927939 946845 966343
61858 966343 985016 1001197 1014256 1024329 1031326 1035032 1035981 1035484 1034685 1033984 1033308 1032601 1032099 1032329 1033644
61843 1033644 1035577 1036938 1036789 1035080 1032139 1027999 1022603 1016304 1009670 1003045 996732 991396 987845 986524
61829 986524 987570 991290 998228 1008793 1022963 1040325 1060447 1083443 1110124 1141043 1175302 1210939
61817 1210939 1246852 1283808 1323258 1365873 1411926 1462543 1519646 1584799 1658898 1742949 1838487
61806 1838487 1947103 2070073 2208541 2363676 2536609 2728598 2941295 3176368 3434515
61797 3434515 3714741 4014275 4328585 4650997 4971940 5278265 5553335 5778721 5937423
61788 5937423 6017127 6011955 5922643 5756045 5524295 5243189 4929778 4599954 4266891 3940596
$$ packed form
61869G82537J2118J3134J4398J5766J7014J7991J8424J8291J8266J8906J9498
61858I66343J8673J6181J3059J0073O997L706R49m97p99p01o76p07n02K30J315
61843A033644J933J361j49j709k941m140n396o299o634o625o313n336l551j321
61829I86524J046L720O938J0565J4170J7362K0122K2996K6681L0919L4259L5637
61817A210939L5913L6956L9450M2615M6053N0617N7103O5153P4099Q4051R5538
61806A838487J08616J22970J38468J55135J72933J91989K12697K35073K58147
61797C434515K80226K99534L14310L22412L20943L06325K75070K25386J58702
61788E937423P9704n172q9312j66598k31750k81106l13411l29824l33063l26295
$$ plain form
61778 3940596 3628216 3334482 3061994 2811728 2583945 2378759 2195659 2032760 1887218
61769 1887218 1756622 1639646 1535346 1442470 1359669 1285859 1219973 1160810 1107468 1059595 1016864
61758 1016864 978518 943779 912360 884187 858891 835921 814913 795648 777812 761135 745525
61747 745525 730899 717080 704097 692309 681952 672807 664437 656488 648696 641111 634443 629662 626888
61734 626888 625146 623529 622057 621034 620187 619024 617544 615941 613895 610823 606611 601569 595917 589859
61720 589859 583997 579075 575332 572438 569932 567482 565011 562915 561886 562182 563423 565404 568498 572755
61706 572755 577230 580998 584413 588458 593186 597770 601897 606016 610072 612956 613607 611949 608403 603081
61692 603081 595846 586673 575550 562402 547522 531900 516770 502852 490116 478234 467176 457414
$$ packed form
61778C940596l12380k93734k72488k50266k27783k05186j83100j62899j45542
61769A887218j30596j16976j04300r2876q2801p3810o5886n9163n3342m7873m2731
61758A016864l8346l4739l1419k8173k5296k2970k1008j9265j7836j6677j5610
61747G45525j4626j3819j2983j1788j0357r145q370p949p792p585o668m781k774
61734F26888j742j617j472j023q47j163j480j603k046l072m212n042n652o058
61720E89859n862m922l743k894k506k450k471k096j029K96J241J981L094M257
61706E72755M475L768L415M045M728M584M127M119M056K884O51j658l546n322
61692F03081p235r173j1123j3148j4880j5622j5130j3918j2736j1882j1058r762
$$ plain form
61680 457414 449457 443088 437253 430955 424192 417853 412801 409195 406504 403947 401089 398260 396222 395256
61666 395256 394856 394457 394080 393908 393697 393111 392263 391417 390403 388922 387189 385702 384573 383637 382988 382745 382450
61649 382450 381474 380009 378982 378928 379586 380631 382084 383823 385337 386304 386909 387392 387703 387820 387960 388265 388673
61632 388673 389233 390095 390983 391209 390584 389896 389991 390637 390754 389706 387961 386518 386060 386760 388537 391118 393938
61615 393938 396373 398351 400535 403619 407492 411423 414980 418408 422071 426059 430468 435577 441456 447874
61601 447874 455004 463712 474623 487207 500293 513263 526213 539268 552377 565704 579644 594465
61589 594465 610316 627537 646569 667723 691422 718500 749773 785388 824985 868210 914408
61578 914408 961888 1008029 1050098 1085589 1112006 1127204 1130232 1121584 1102752 1075971 1044129 1010091
$$ packed form
61680D57414p957o369n835o298o763o339n052l606k691k557k858k829k038r66
61666C95256m00l99l77j72k11n86q48q46j014j481j733j487j129r36o49k43k95
61649C82450r76j465j027n4O58J045J453J739J514R67O05M83L11J17J40L05M08
61632C88673N60Q62Q88K26o25o88R5O46J17j048j745j443m58P00J777K581K820
61615C93938K435J978K184L084L873L931L557L428L663L988M409N109N879O418
61601D47874P130Q708J0911J2584J3086J2970J2950J3055J3109J3327J3940J4821
61589E94465J5851J7221J9032K1154K3699K7078L1273L5615L9597M3225M6198
61578I14408M7480M6141M2069L5491K6417J5198L028q648j8832k6781l1842l4038
$$ plain form
61566 1010091 975765 942163 910262 881174 855440 832848 813248 797112 784993 776766 771580 768340
61554 768340 766234 765143 765600 768046 772022 776340 779994 782599 784069 784337 783476 781749 779432 776719 773712
61539 773712 770289 766300 762240 759398 758815 760328 763136 766991 772175 778639 786072 794752 805472 818628
61525 818628 834189 852643 875096 902227 933966 970419 1012251 1059835 1112862 1171243 1235646
61514 1235646 1306625 1383952 1467525 1558358 1657718 1765277 1878442 1993245 2105352 2210618
61504 2210618 2305614 2388302 2458476 2517801 2569559 2618052 2667664 2721919 2782783 2850347 2923227
61493 2923227 2999748 3079009 3160784 3244592 3329141 3412372 3491339 3561905 3619032 3657463 3671951
61482 3671951 3657343 3609708 3528158 3415532 3277489 3121423 2955891 2789434 2628659 2477323
$$ packed form
61566A010091l4326l3602l1901k9088k5734k2592j9600j6136j2119q227n186l240
61554G68340k106j091M57K446L976M318L654K605J470K68q61j727k317k713l007
61539G73712l423l989m060k842n83J513K808L855N184O464P433Q680J0720J3156
61525H18628J5561J8454K2453K7131L1739L6453M1832M7584N3027N8381O4403
61514A235646P0979P7327Q3573R0833R9360J07559J13165J14803J12107J05266
61504B210618R4996Q2688P0174N9325N1758M8493M9612N4255O0864O7564P2880
61493B923227P6521P9261Q1775Q3808Q4549Q3231P8967P0566N7127L8431J4488
61482C671951j4608m7635q1550j12626j38043j56066j65532j66457j60775j51336
$$ plain form
61472 2477323 2337354 2210191 2096820 1997168 1910252 1834838 1769733 1713802 1666194 1626407 1593863
61461 1593863 1567591 1546522 1529814 1516730 1506541 1498916 1494147 1492693 1494719 1500252 1509495 1522671
61449 1522671 1539806 1561018 1586932 1618513 1656525 1701340 1753209 1812650 1880518 1957500 2043132
61438 2043132 2135001 2228726 2318328 2396583 2455956 2490751 2499275 2484016 2449865 2402478 2347709
61427 2347709 2291096 2236798 2187160 2143599 2107696 2081366 2066476 2064598 2076710 2102699 2141194
61416 2141194 2189727 2244395 2299117 2345905 2376728 2385703 2370376 2332081 2275584 2207635 2134842
61405 2134842 2062386 1994062 1932517 1878961 1833264 1794893 1763609 1739080 1720329 1706062 1695380
61394 1695380 1688039 1684448 1685577 1692403 1705107 1723194 1746529 1775649 1810672 1850554 1893994 1940655
$$ packed form
61472B477323j39969j27163j13371r9652q6916p5414o5105n5931m7608l9787l2544
61461A593863k6272k1069j6708j3084j0189p625m769j454K026N533R243J3176
61449A522671J7135K1212K5914L1581L8012M4815N1869N9441O7868P6982Q5632
61438B043132R1869R3725Q9602P8255N9373L4795Q524j5259l4151m7387n4769
61427B347709n6613n4298m9638m3561l5903k6330j4890j878J2112K5989L8495
61416B141194M8533N4668N4722M6788L0823Q975j5327l8295n6497o7949p2793
61405B134842p2456o8324o1545n3556m5697l8371l1284k4529j8751j4267j0682
61394A695380p341l591J129O826J2704J8087K3335K9120L5023L9882M3440M6661
$$ plain form
61382 1940655 1990940 2044956 2102327 2162760 2226087 2291781 2358944 2426699 2494043 2559141 2619085
61371 2619085 2670582 2710885 2738222 2751600 2750391 2734240 2703397 2658996 2602709 2536257 2461500
61360 2461500 2380750 2296443 2210435 2124025 2038661 1956038 1877403 1803196 1733383 1667749 1606022
61349 1606022 1548486 1496542 1451819 1414466 1383052 1356284 1333981 1316055 1301653 1290067 1281750
61338 1281750 1277609 1277835 1282086 1290196 1301874 1316149 1332050 1349644 1369689 1392468 1417673 1445229
61326 1445229 1475490 1508515 1543577 1579245 1613550 1644302 1669868 1689687 1703762 1711995 1714525 1712524
61314 1712524 1707986 1702616 1697204 1691918 1686831 1682188 1678501 1676297 1675582 1675803 1676631 1678516 1682108 1687343 1693513
61299 1693513 1700051 1706880 1714158 1722101 1730974 1740905 1751713 1762983 1774140 1784334 1792607 1798430 1801867
$$ packed form
61382A940655N0285N4016N7371O0433O3327O5694O7163O7755O7344O5098N9944
61371B619085N1497M0303K7337J3378j209j6151l0843m4401n6287o6452p4757
61360B461500q0750q4307q6008q6410q5364q2623p8635p4207o9813o5634o1727
61349A606022n7536n1944m4723l7353l1414k6768k2303j7926j4402j1586q317
61338A281750m141K26M251Q110J1678J4275J5901J7594K0045K2779K5205K7556
61326A445229L0261L3025L5062L5668L4305L0752K5566J9819J4075Q233K530k001
61314A712524m538n370n412n286n087m643l687k204p15K21Q28J885L592N235O170
61299A693513O538O829P278P943Q873R931J0808J1270J1157J0194Q273N823L437
$$ plain form
61286 1801867 1803141 1802497 1800763 1799562 1800506 1804366 1811044 1819780 1828983 1836413 1840175 1839377 1833658 1822661
61272 1822661 1806580 1786777 1765241 1743562 1722728 1703443 1686057 1670470 1656626 1644955 1636082
61261 1636082 1630516 1629036 1632774 1642281 1656910 1675743 1698763 1726547 1759271 1796948 1840398 1891105
61249 1891105 1950095 2017548 2093482 2178077 2271204 2372099 2479553 2591922 2706593 2819286
61239 2819286 2923443 3010290 3070565 3097709 3090275 3051634 2988044 2907171 2817260 2725853 2638390
61228 2638390 2558045 2486710 2425793 2376432 2339705 2316871 2309148 2317307 2341503 2380797 2432099 2489579
61216 2489579 2545480 2591583 2620299 2625852 2605850 2561830 2497757 2418073 2327315 2230527 2132712
61205 2132712 2037789 1948569 1867216 1794772 1730529 1672872 1620715 1573387 1529573 1487691 1447460
$$ packed form
61286A801867J274o44j734j201R44L860O678Q736R203P430L762p98n719j0997
61272A822661j6081j9803k1536k1679k0834j9285j7386j5587j3844j1671q873
61261A636082n566j480L738R507J4629J8833K3020K7784L2724L7677M3450N0707
61249A891105N8990O7453P5934Q4595R3127J00895J07454J12369J14671J12693
61239B819286J04157Q6847O0275K7144p434l8641o3590q0873q9911r1407q7463
61228B638390q0345p1335o0917m9361l6727k2834p723Q159K4196L9294N1302N7480
61216B489579N5901M6103K8716N553k0002m4020o4073p9684r0758r6788r7815
61205B132712r4923q9220q1353p2444o4243n7657n2157m7328m3814m1882m0231
$$ plain form
61194 1447460 1410005 1376058 1344856 1315132 1286461 1259250 1234007 1210909 1189627 1169314 1149154
61183 1149154 1129112 1109795 1091531 1074008 1056878 1040305 1024879 1011347 1000408 992344 986846 983622
61171 983622 983049 985788 991743 999738 1007940 1014030 1015239 1009094 994637 972819 945861 916378 886530
61158 886530 857287 828611 800823 775378 753597 735023 717966 701592 686563 673670 662749
61147 662749 653118 644314 636277 629486 624951 623338 623959 625308 626645 628373 630864 633893 637410 641960
61133 641960 647802 654386 661251 668920 678341 689849 703124 717895 734191 751897 770242 787705
61121 787705 802497 813305 819627 821366 818523 811680 802434 792651 783329 774588 766552 759567 753649 748370
61107 748370 743362 738475 733519 728376 723337 718823 714889 711456 708751 706905 705328 703202 700428 697337
$$ packed form
61194A447460l7455l3947l1202k9724k8671k7211k5243k3098k1282k0313k0160
61183A149154k0042j9317j8264j7523j7130j6573j5426j3532j0939q064n498l224
61171I83622n73K739N955P995Q202O090J209o145j4457k1818k6958k9483k9848
61158H86530k9243k8676k7788k5445k1781j8574j7057j6374j5029j2893j0921
61147F62749r631q804q037o791m535j613O21J349J337J728K491L029L517M550
61133F41960N842O584O865P669R421J1508J3275J4771J6296J7706J8345J7463
61121G87705J4792J0808O322J739k843o843r246r783r322q741q036o985n918n279
61107G48370n008m887m956n143n039m514l934l433k705j846j577k126k774l091
$$ plain form
61093 697337 693682 688814 682852 676743 671089 665717 660514 655864 652070 649067 646862 645583 645006 644700 644698
61078 644698 645290 646116 646314 645771 645440 646138 647702 649540 651355 653143 655149 658016 662391 668304 675522 684497
61062 684497 696065 710070 725201 740561 756603 774140 793096 812620 831850 850133 866989
61051 866989 882207 895668 906917 915311 920645 923193 923133 920435 915372 908654 901124 893767 887769 883855
61037 883855 881660 880491 880494 882348 886065 891112 897620 906410 917755 931062 945814 961911 979092 997092
61023 997092 1016483 1038373 1063104 1090097 1118972 1149848 1182605 1216942 1253198 1292007 1333167
61012 1333167 1375976 1420616 1467787 1516972 1566504 1615517 1664364 1712952 1760267 1805980 1850907
61001 1850907 1895320 1938211 1978745 2017040 2053050 2086263 2117191 2147823 2180067 2215203 2255267
$$ packed form
61093F97337l655m868n962o109n654n372n203m650l794l003k205j279n77l06k
61078F44698N92Q26J98n43l31O98J564J838J815J788K006K867M375N913P218Q975
61062F84497J1568J4005J5131J5360J6042J7537J8956J9524J9230J8283J6856
61051H66989J5218J3461J1249Q394N334K548o0k698n063o718p530p357n998l914
61037H83855k195j169LJ854L717N047O508Q790J1345J3307J4752J6097J7181J8000
61023I97092J9391K1890K4731K6993K8875L0876L2757L4337L6256L8809M1160
61012A333167M2809M4640M7171M9185M9532M9013M8847M8588M7315M5713M4927
61001A850907M4413M2891M0534L8295L6010L3213L0928L0632L2244L5136M0064
$$ plain form
60990 2255267 2303158 2360571 2427485 2504600 2594601 2699943 2820779 2955810 3103551 3261793
60980 3261793 3427700 3599973 3780015 3970493 4174509 4396824 4643588 4919357 5225932
60971 5225932 5564833 5938762 6350414 6804197 7312297 7896826 8583663 9396591 10359067
60962 10359067 11497043 12836019 14400812 16227014 18373819 20924166 23982236 27684563
60954 27684563 32199321 37653854 43979117 50766476 57276849 62653056 66235849 67811212
60946 67811212 67674699 66514313 65183721 64439140 64698050 65885572 67438905 68496639
60938 68496639 68213376 66069240 62039767 56558830 50310042 43966012 38006661 32676381
60930 32676381 28042835 24078087 20714213 17873262 15484118 13487693 11831523 10464027
$$ packed form
60990B255267M7891N7413O6914P7115R0001J05342J20836J35031J47741J58242
60980C261793J65907J72273J80042J90478K04016K22315K46764K75769L06575
60971E225932L38901L73929M11652M53783N08100N84529O86837Q12928R62476
60962A0359067J137976J338976J564793J826202K146805K550347L058070L702327
60954B7684563M514758N454533O325263O787359O510373N376207L582793J575363
60946F7811212j36513j160386j330592p44581K58910J187522J553333J057734
60938F8496639k83263k144136m029473n480937o248788o344030n959351n330280
60930C2676381m633546l964748l363874k840951k389144j996425j656170j367496
$$ plain form
60922 10464027 9335650 8401989 7623196 6963059 6391808 5888781 5440485 5037125 4671995
60913 4671995 4341783 4044695 3778617 3541950 3334475 3155413 3001363 2867218 2747846
60904 2747846 2637845 2531575 2425649 2320635 2218814 2121160 2027790 1939870 1858897 1784617
60894 1784617 1715428 1650359 1589163 1531144 1475631 1423286 1375254 1331216 1289709 1250182 1213244
60883 1213244 1178979 1146569 1115728 1087194 1061420 1037776 1015417 994156 974233 955809 938796
60872 938796 922706 906764 890611 874638 859146 843666 827817 812371 798483 786075 773972
60861 773972 761555 749414 738378 728720 720371 713135 706505 699803 692648 684977 676752 668134 659747
60848 659747 652199 645422 638973 632817 627299 622544 618466 615188 612862 611186 609652 608163 606894 605770
$$ packed form
60922A0464027j128377r33661p78793o60137n71251n03027m48296m03360l65130
60913D671995l30212k97088k66078k36667k07475j79062j54050j34145j19372
60904B747846j10001j06270j05926j05014j01821r7654r3370q7920q0973p4280
60894A784617o9189o5069o1196n8019n5513n2345m8032m4038m1507l9527l6938
60883A213244l4265l2410l0841k8534k5774k3644k2359k1261j9923j8424j7013
60872I38796j6090j5942j6153j5973j5492j5480j5849j5446j3888j2408j2103
60861G73972j2417j2141j1036r658q349p236o630o702p155p671q225q618q387
60848F59747p548o777o449o156n518m755m078l278k326j676j534j489j269j124
$$ plain form
60834 605770 604595 603553 602990 602950 603445 604861 607370 610182 612220 613403 614440 615457 615722 614858 613470 612319
60818 612319 611547 610932 610222 608950 606554 603010 598797 593930 587520 578721 567792 555934 544349 533659
60804 533659 523844 514443 505023 495680 486949 479146 472081 465452 459151 453025 446699 439944 432987 426260
60790 426260 420058 414555 409863 405826 402017 398241 394888 392505 391093 390092 389057 388124 387773 388221 389119
60775 389119 389790 389787 389225 388656 388624 389380 390897 393054 395745 398933 402559 406443 410303 413994 417694 421762
60759 421762 426456 431782 437474 442952 447441 450414 451975 452587 452360 450840 447689 443383 438963 435042 431323
60744 431323 427253 422957 419141 416058 412959 408868 403743 398495 393917 389964 386223 382758 380153 378759
60730 378759 378164 377542 376441 375170 374430 374685 375982 378265 381539 385591 389804 393564 396758 399641 402287
$$ packed form
60834F05770j175j042n63m0M95J416K509K812K038J183J037J017K65q64j388j151
60818F12319p72o15p10j272k396l544m213m867o410q799j0929j1858j1585j0690
60804E33659r815r401r420r343q731p803p065o629o301o126o326o755o957o727
60790D26260o202n503m692m037l809l776l353k383j412j001j035r33l51M48Q98
60775C89119O71ln62n69l2P56J517K157K691L188L626L884L860L691L700M068
60759D21762M694N326N692N478M489K973J561O12k27j520l151m306m420l921l719
60744D31323m070m296l816l083l099m091n125n248m578l953l741l465k605j394
60730C78759n95o22j101j271p40K55J297K283L274M052M213L760L194K883K646
$$ plain form
60715 402287 404413 405753 406336 406380 406126 405796 405504 405150 404531 403519 402054 400136 398008 396156 394817 393707
60699 393707 392603 391974 392440 393707 394698 394848 394672 394890 395635 396853 398868 402022 406033 410190 413922 416854
60683 416854 418704 419697 420877 423381 427305 431639 435371 438312 440818 443079 444935 446263 447334 448725
60669 448725 450881 453728 456697 459121 460601 461102 460943 460727 461081 462240 463886 465440 466425 466503 465287 462312
60653 462312 457323 450676 443341 436293 429829 423660 417691 412302 407698 403400 398895 394489 390966 388561
60639 388561 386902 385872 385752 386349 386652 385797 383962 381997 380496 379515 378911 378649 378889 379895 381701 383856
60623 383856 385798 387505 389433 391845 394681 398040 402117 406476 410047 412310 414007 416261 419386 422915
60609 422915 426322 429236 431322 432600 433701 435358 437704 440426 443438 447065 451714 457730 465358 474542
$$ packed form
60715D02287K126J340N83M4k54l30k92l54o19j012j465j918k128j852j339j110
60699C93707j104o29M66J267R91J50j76K18P45J218K015L154M011M157L732K932
60683D16854J850R93J180K504L924M334L732K941K506K261J856J328J071J391
60669D48725K156K847K969K424J480N01j59k16L54J159J646J554R85P8j216k975
60653D62312m989o647p335p048o464o169n969n389m604m298m505m406l523k405
60639C88561j659j030j20N97L03q55j835j965j501r81o04k62K40J006J806K155
60623C83856J942J707J928K412K836L359M077M359L571K263J697K254L125L529
60609D22915L407K914K086J278J101J657K346K722L012L627M649O016P628R184
$$ plain form
60595 474542 484916 496349 509291 524179 540693 557990 575621 593772 612569 631523 649733
60584 649733 666376 680827 692455 700469 704082 702978 697601 688814 677293 663437 647858 631553
60572 631553 615485 600279 586389 574085 563041 552435 541868 531888 523275 516099 509838 504157
60560 504157 499112 494819 491300 488563 486500 484804 483289 482125 481514 481357 481590 482647 485222 489646 495761
60545 495761 503243 511726 520817 530323 540374 551030 561934 572621 582997 593215 603339 613534
60533 613534 624406 636682 650648 666279 683829 703852 726766 752825 782454 816140 853960
60522 853960 895762 942071 994532 1055269 1126006 1207831 1301469 1407484 1526059 1656450 1796314
60511 1796314 1941361 2085514 2221428 2341225 2437618 2505242 2541403 2546028 2521504 2472685 2406103
$$ packed form
60595D74542J0374J1433J2942J4888J6514J7297J7631J8151J8797J8954J8210
60584F49733J6643J4451J1628Q014L613j104n377q787j1521j3856j5579j6305
60572F31553j6068j5206j3890j2304j1044j0606j0567r980q613p176o261n681
60560E04157n045m293l519k737k063j696j515j164o11j57K33J057K575M424O115
60545D95761P482Q483R091R506J0051J0656J0904J0687J0376J0218J0124J0195
60533F13534J0872J2276J3966J5631J7550K0023K2914K6059K9629L3686L7820
60522H53960M1802M6309N2461O0737P0737Q1825R3638J06015J18575J30391J39864
60511A796314J45047J44153J35914J19797R6393O7624L6161M625k4524m8819o6582
$$ plain form
60500 2406103 2328052 2243079 2154446 2065559 1980166 1901273 1830595 1769204 1718030 1677474 1647184
60489 1647184 1626707 1616145 1615898 1626183 1647377 1680839 1729018 1794412 1878157 1979156 2094171
60478 2094171 2218583 2347014 2473403 2591149 2694402 2780145 2849139 2904552 2949412 2985163
60468 2985163 3011968 3029498 3037087 3033536 3017560 2988975 2949955 2905672 2864108 2834878 2827201 2848003
60456 2848003 2901541 2990744 3118786 3289302 3505523 3769807 4084006 4449595 4866442 5330335
60446 5330335 5830355 6347155 6853090 7314646 7696717 7967531 8103192 8091268 7932833 7642272
60436 7642272 7244679 6771493 6255386 5725688 5205557 4711376 4253618 3837992 3466479
60427 3466479 3138421 2851397 2601686 2384901 2197185 2036007 1899456 1784898 1688914 1608547
$$ packed form
60500B406103p8051q4973q8633q8887q5393p8893p0678o1391n1174m0556l0290
60489A647184k0477j0562k47J0285K1194L3462M8179O5394Q3745J00999J15015
60478B094171J24412J28431J26389J17746J03253Q5743O8994N5413M4860L5751
60468B985163K6805J7530P589l551j5976k8585l9020m4283m1564k9230p677K0802
60456B848003N3538Q9203J28042J70516K16221K64284L14199L65589M16847M63893
60446E330335N00020N16800N05935M61556L82071K70814J35661j1924j58435k90561
60436G642272l97593m73186n16107n29698n20131m94181m57758m15626l71513
60427C466479l28058k87024k49711k16785j87716j61178j36551j14558r5984q0367
$$ plain form
60417 1608547 1542029 1488071 1445024 1411029 1384632 1365000 1351807 1344969 1344155 1348487 1357013 1369397
60405 1369397 1385502 1404270 1423644 1441714 1457272 1469036 1475230 1474575 1467251 1454486 1437679 1418279
60393 1418279 1397909 1377959 1359257 1342431 1328090 1316261 1306149 1296947 1288399 1280184 1271422 1261453
60381 1261453 1250621 1239645 1228809 1218553 1210310 1205623 1204545 1205769 1208183 1211369 1214547 1215922 1213342
60368 1213342 1205059 1189906 1167517 1138632 1104751 1067359 1027905 988285 950447 915227 882258
60357 882258 851299 823045 798192 776252 755926 736517 718543 702996 690283 679962 671380 664393
60345 664393 659371 656522 655410 655248 655437 655670 655767 655753 655880 656113 655637 653336 648900 643206 637439 631950 626126
60328 626126 619320 611762 604397 597864 591975 586432 581667 578356 576292 574559 572915 572131 572611 573587 574280
$$ packed form
60417A608547o6518n3958m3047l3995k6397j9632j3193o838q14M332Q526J2384
60405A369397J6105J8768J9374J8070J5558J1764O194o55p324j2765j6807j9400
60393A418279k0370j9950j8702j6826j4341j1829j0112r202q548q215q762r969
60381A261453j0832j0976j0836j0256q243m687j078J224K414L186L178J375k580
60368A213342q283j5153k2389k8885l3881l7392l9454l9620l7838l5220l2969
60357H82258l0959k8254k4853k1940k0326j9409j7974j5547j2713j0321q582o987
60345F64393n022k849j112j62J89K33R7j4J27K33m76k301m436n694n767n489n824
60328F26126o806p558p365o533n889n543m765l311k064j733j644p84M80R76O93
$$ plain form
60313 574280 575084 576813 579383 582144 585112 588801 592996 596692 599369 601602 604260 607690 611838 616618
60299 616618 622005 628132 635422 644335 654998 667367 681622 697974 716191 735783 756647 779070
60287 779070 803061 828005 853123 878022 902753 927300 950934 972163 989881 1004698 1018595
60276 1018595 1032957 1047611 1062138 1077215 1093811 1111660 1129622 1147224 1164950 1183323 1202767
60265 1202767 1224243 1248832 1276459 1305817 1335728 1365962 1396685 1427846 1459222 1490417 1520790
60254 1520790 1550015 1578695 1607758 1637262 1666538 1695397 1724312 1753394 1782169 1810619 1839559
60243 1839559 1869587 1900395 1931537 1963285 1996372 2031393 2068746 2108622 2150764 2194601 2239649
60232 2239649 2285268 2330067 2372397 2411720 2448879 2484870 2520015 2554554 2589132 2624142 2659179
$$ packed form
60313E74280Q04J729K570K761K968L689M195L696K677K233K658L430M148M780
60299F16618N387O127P290Q913J0663J2369J4255J6352J8217J9592K0864K2423
60287G79070K3991K4944K5118K4899K4731K4547K3634K1229J7718J4817J3897
60276A018595J4362J4654J4527J5077J6596J7849J7962J7602J7726J8373J9444
60265A202767K1476K4589K7627K9358K9911L0234L0723L1161L1376L1195L0373
60254A520790K9225K8680K9063K9504K9276K8859K8915K9082K8775K8450K8940
60243A839559L0028L0808L1142L1748L3087L5021L7353L9876M2142M3837M5048
60232B239649M5619M4799M2330L9323L7159L5991L5145L4539L4578L5010L5037
$$ plain form
60221 2659179 2693759 2728273 2763831 2801414 2841349 2883168 2925646 2967159 3006125 3040862 3069202
60210 3069202 3088953 3098966 3099437 3091408 3076763 3058627 3040550 3024596 3010750 2998497 2988306 2981210
60198 2981210 2977705 2977713 2981119 2987688 2996741 3007333 3018544 3029329 3038485 3045075 3048601 3048579 3044362 3035408
60184 3035408 3021151 3000401 2971444 2932989 2884438 2825235 2754946 2674527 2586699 2494436 2399760
60173 2399760 2304548 2211666 2124238 2044211 1972476 1909971 1857681 1815684 1783088 1758992 1742901
60162 1742901 1734241 1732116 1735568 1743510 1754279 1765756 1776056 1783847 1788109 1788096 1783665 1775221 1763175
60149 1763175 1747715 1729203 1708542 1687000 1665821 1646110 1628959 1615411 1606161 1601335 1600763 1604629
60137 1604629 1613689 1628746 1650059 1677524 1711219 1751414 1798318 1852354 1914583 1986096 2066813
$$ packed form
60221B659179L4580L4514L5558L7583L9935M1819M2478M1513L8966L4737K8340
60210C069202J9751J0013M71q029j4645j8136j8077j5954j3846j2253j0191p096
60198B981210l505QL406O569R053J0592J1211J0785R156O590L526k2m217q954
60184C035408j4257k0750k8957l8455m8551n9203p0289q0419q7828r2263r4676
60173B399760r5212r2882q7428q0027p1735o2505n2290m1997l2596k4096j6091
60162A742901q660k125L452P942J0769J1477J0300P791M262j3m431q444j2046
60149A763175j5460j8512k0661k1542k1179j9711j7151j3548r250m826n72L866
60137A604629R060J5057K1313K7465L3695M0195M6904N4036O2229P1513Q0717
$$ plain form
60126 2066813 2155468 2251039 2353642 2463695 2580796 2703971 2832681 2966944 3106387 3249394
60116 3249394 3393190 3534575 3670531 3798137 3913932 4013859 4094345 4153434 4190563 4205501
60106 4205501 4198103 4168968 4119509 4051253 3965768 3865424 3753501 3633183 3507047 3377806
60096 3377806 3248837 3123374 3003553 2890532 2785120 2688023 2600024 2522336 2456304 2402365
60086 2402365 2359746 2327604 2305982 2295303 2295427 2305646 2325005 2351966 2384106 2418832 2454208 2488602
60074 2488602 2519842 2545431 2563707 2574494 2578661 2577270 2570945 2559793 2544056 2524983 2504778 2485568
60062 2485568 2468801 2455856 2448733 2449661 2460223 2481149 2512582 2554082 2604448 2661795 2723611 2786665
60050 2786665 2847406 2903065 2952422 2995346 3031765 3061031 3081936 3093168 3094160 3085761 3069780 3047795
$$ packed form
60126B066813Q8655R5571J02603J10053J17101J23175J28710J34263J39443J43007
60116C249394J43796J41385J35956J27606J15795R9927Q0486N9089L7129J4938
60106D205501p398k9135m9459o8256q5485j00344j11923j20318j26136j29241
60096C377806j28969j25463j19821j13021j05412r7097q7999p7688o6032n3939
60086B402365m2619l2142k1622j0679J24J0219J9359K6961L2140L4726L5376L4394
60074B488602L1240K5589J8276J0787M167j391o325j1152j5737j9073k0205j9210
60062B485568j6767j2945p123R28J0562K0926L1433M1500N0366N7347O1816O3054
60050B786665O0741N5659M9357M2924L6419K9266K0905J1232R92q399j5981k1985
$$ plain form
60038 3047795 3020718 2989426 2955090 2918595 2880217 2840185 2799031 2757051 2713989 2669566 2623788
60027 2623788 2576415 2526824 2474991 2422125 2369782 2318775 2269405 2222378 2178911 2140139 2106671
60016 2106671 2078342 2054198 2033276 2015703 2002484 1993890 1988872 1986625 1987981 1994519 2006971 2025285
60004 2025285 2049730 2080901 2118789 2162616 2211448 2264370 2320292 2378137 2436944 2495338 2551361
59993 2551361 2603532 2651699 2696096 2735898 2769445 2795462 2813082 2820886 2817136 2801197 2773970 2736781
59981 2736781 2690707 2637338 2579461 2520426 2463059 2409469 2361505 2320846 2288535 2264652 2248735
59970 2248735 2240589 2240553 2248722 2264143 2285205 2310842 2340940 2375597 2414588 2457634 2504443 2554217
59958 2554217 2605757 2658344 2711827 2765440 2817316 2865682 2909828 2949270 2982726 3008772 3027027
$$ packed form
60038C047795k7077l1292l4336l6495l8378m0032m1154m1980m3062m4423m5778
60027B623788m7373m9591n1833n2866n2343n1007m9370m7027m3467l8772l3468
60016B106671k8329k4144k0922j7573j3219q594n018k247J356O538J2452J8314
60004B025285K4445L1171L7888M3827M8832N2922N5922N7845N8807N8394N6023
59993B551361N2171M8167M4397L9802L3547K6017J7620P804l750j5939k7227l7189
59981B736781m6074n3369n7877n9035n7367n3590m7964m0659l2311k3883j5917
59970B248735q146l6Q169J5421K1062K5637L0098L4657L8991M3046M6809M9774
59958B554217N1540N2587N3483N3613N1876M8366M4146L9442L3456K6046J8255
$$ plain form
59947 3027027 3037863 3041279 3036724 3023727 3002278 2973202 2938917 2903249 2869620 2839733 2814672 2796595
59935 2796595 2788226 2791001 2804870 2829934 2867297 2918217 2983177 3061958 3154091 3259128 3376767
59924 3376767 3506472 3646576 3794017 3945223 4096701 4244172 4381964 4504288 4607048
59915 4607048 4687929 4745527 4779640 4792188 4786892 4768083 4740512 4709797 4681848 4661760 4653891 4662520
59903 4662520 4691129 4740675 4808781 4889827 4974663 5050885 5105513 5128842 5116327 5068296 4989783
59892 4989783 4890470 4782621 4677317 4582224 4501989 4439053 4393662 4364319 4348945 4345223 4350002
59881 4350002 4359669 4371492 4383800 4394665 4401577 4402953 4399115 4391445 4381579 4372038 4366819 4370570 4387529
59868 4387529 4421491 4476018 4554144 4658342 4791093 4954634 5149223 5371348 5613200 5862792
$$ packed form
59947C027027J0836L416m555j2997k1449k9076l4285l5668l3629k9887k5061j8077
59935B796595q369K775J3869K5064L7363N0920O4960P8781R2133J05037J17639
59924C376767J29705J40104J47441J51206J51478J47471J37792J22324J02760
59915D607048Q0881N7598L4113J2548n296j8809k7571l0715k7949k0088p869Q629
59903D662520K8609M9546O8106Q1046Q4836P6222N4628K3329j2515m8031p8513
59892D989783r9313j07849j05304r5093q0235o2936m5391k9343j5374l722M779
59881D350002R667J1823J2308J0865O912J376l838p670r866r541n219L751J6959
59868D387529L3962N4527P8126J04198J32751J63541J94589K22125K41852K49592
$$ plain form
59858 5862792 6104233 6319232 6490423 6605004 6656942 6647538 6584667 6480538 6348497 6200237
59848 6200237 6044118 5884109 5719503 5546307 5360002 5157759 4939190 4706462 4464292
59839 4464292 4219227 3978268 3747875 3533565 3339276 3166637 3015263 2883931 2771089
59830 2771089 2674505 2591467 2519734 2457864 2404638 2358938 2320258 2288476 2262830 2241932 2225076
59819 2225076 2212742 2205465 2203085 2205626 2214133 2229940 2253687 2285675 2326816 2378642 2442670 2520153
59807 2520153 2612080 2718836 2839913 2973857 3117711 3265672 3408362 3534107 3631769 3693655
59797 3693655 3717495 3706866 3669758 3616016 3555123 3494784 3439681 3390622 3345237 3300226 3253452
59786 3253452 3204666 3155254 3107509 3063417 3023571 2987298 2953767 2922506 2893029 2864770 2837825
$$ packed form
59858E862792K41441K14999J71191J14581N1938r404o2871j04129j32041j48260
59848F200237j56119j60009j64606j73196j86305k02243k18569k32728k42170
59839D464292k45065k40959k30393k14310j94289j72639j51374j31332j12842
59830B771089r6584q3038p1733o1870n3226m5700l8680l1782k5646k0898j6856
59819B225076j2334p277k380K541Q507J5807K3747L1988M1141N1826O4028P7483
59807B520153R1927J06756J21077J33944J43854J47961J42690J25745R7662O1886
59797C693655K3840j0629l7108n3742o0893o0339n5103m9059m5385m5011m6774
59786C253452m8786m9412m7745m4092l9846l6273l3531l1261k9477k8259k6945
$$ plain form
59775 2837825 2813284 2792548 2776608 2766069 2761376 2762843 2770732 2785374 2806936 2835169 2869817 2911015
59763 2911015 2958673 3011662 3068306 3127589 3189183 3252599 3317410 3384304 3454764 3529442 3607819
59752 3607819 3689676 3775756 3866457 3960787 4057123 4154040 4249727 4341341 4425743 4500496 4563792
59741 4563792 4614177 4651202 4676220 4692213 4703128 4713442 4727698 4749906 4783460 4831406 4896110
59730 4896110 4978717 5079729 5200016 5340163 5498592 5671364 5854063 6042722 6232639 6417866
59720 6417866 6592966 6754393 6899446 7025072 7128895 7210705 7271883 7314029 7339239 7351151
59710 7351151 7354468 7353650 7352992 7357629 7373403 7405718 7459167 7537844 7644885 7781339 7946047 8136795
59698 8136795 8351461 8588422 8846389 9123646 9416801 9720118 10025988 10325389 10607404
$$ packed form
59775B837825k4541k0736j5940j0539m693J467P889J4642K1562K8233L4648M1198
59763B911015M7658N2989N6644N9283O1594O3416O4811O6894P0460P4678P8377
59752C607819Q1857Q6080R0701R4330R6336R6917R5687R1614Q4402P4753O3296
59741D563792N0385L7025K5018J5993J0915J0314J4256K2208L3554M7946O4704
59730D896110Q2607J01012J20287J40147J58429J72772J82699J88659J89917J85227
59720F417866J75100J61427J45053J25626J03823Q1810O1178M2146K5210J1912
59710G351151L317q18o58M637J5774L2315N3449P8677J07041J36454J64708J90748
59698H136795K14666K36961K57967K77257K93155L03317L05870K99401K82015
$$ plain form
59689 10607404 10858841 11065458 11214399 11296369 11306908 11246770 11121116 10937889 10706572 10437483
59679 10437483 10140311 9821800 9484837 9130196 8759102 8374434 7980930 7585432 7196526
59670 7196526 6822817 6471170 6146251 5850575 5584047 5343969 5126497 4928060 4745178
59661 4745178 4573834 4410145 4251600 4097058 3946036 3798766 3656552 3521068 3393155
59652 3393155 3272795 3159992 3054968 2957668 2867813 2785560 2711645 2646857 2591582 2545612 2508088
59641 2508088 2477886 2454353 2437282 2425819 2417904 2411259 2404485 2396745 2386993 2374231 2358198 2339163
59629 2339163 2317328 2293032 2267147 2240530 2213301 2185161 2156208 2126925 2097815 2069663 2043879
59618 2043879 2021939 2004604 1991942 1983604 1978604 1975413 1972975 1971188 1969839 1967702 1963496 1957208 1949606
$$ packed form
59689A0607404K51437K06617J48941Q1970J0539o0138j25654j83227k31317k69089
59679A0437483k97172l18511l36963l54641l71094l84668l93504l95498l88906
59670G196526l73709l51647l24919k95676k66528k40078k17472j98437j82882
59661D745178j71344j63689j58545j54542j51022j47270j42214j35484j27913
59652C393155j20360j12803j05024r7300q9855q2253p3915o4788n5275m5970l7524
59641B508088l0202k3533j7071j1463p915o645o774p740r752j2762j6033j9035
59629B339163k1835k4296k5885k6617k7229k8140k8953k9283k9110k8152k5784
59618B043879k1940j7335j2662q338n000l191k438j787j349k137m206o288p602
$$ plain form
59605 1949606 1940982 1931352 1921437 1912294 1904186 1896828 1890505 1885848 1882650 1880085 1878165 1877873 1879816 1883885
59591 1883885 1890565 1901454 1917889 1939847 1966661 1998109 2034173 2074243 2117180 2161896 2207477
59580 2207477 2252975 2297610 2341290 2384879 2429886 2477728 2528935 2583070 2639547 2698463 2760555
59569 2760555 2826610 2897201 2972741 3053374 3138860 3228724 3322187 3417610 3512279 3603120 3687302
59558 3687302 3761875 3823438 3869062 3897509 3909140 3904986 3886689 3857081 3819738 3777342 3730643
59547 3730643 3678945 3621435 3558428 3492221 3427077 3368131 3320051 3286485 3269940 3271431 3290342
59536 3290342 3325122 3373836 3433490 3499148 3564661 3624504 3674526 3711181 3731009 3731326 3710971 3670097
59524 3670097 3609529 3530636 3435670 3327983 3211688 3090808 2968508 2847120 2728794 2615659
$$ packed form
59605A949606q624r630r915r143q108p358o323m657l198k565j920k92J943M069
59591A883885O680J0889J6435K1958K6814L1448L6064M0070M2937M4716M5581
59580B207477M5498M4635M3680M3589M5007M7842N1207N4135N6477N8916O2092
59569B760555O6055P0591P5540Q0633Q5486Q9864R3463R5423R4669R0841Q4182
59558C687302P4573O1563M5624K8447J1631m154j8297k9608l7343m2396m6699
59547C730643n1698n7510o3007o6207o5144n8946m8080l3566j6545J491J8911
59536C290342L4780M8714N9654O5658O5513N9843N0022L6655J9828L17k0355m0874
59524C670097o0568p8893r4966j07687j16295j20880j22300j21388j18326j13135
$$ plain form
59514 2615659 2509269 2410393 2319638 2237712 2164625 2099250 2040405 1988122 1943198 1905764 1875048
59503 1875048 1850586 1832994 1823379 1822278 1829289 1843550 1864491 1892169 1926737 1967822 2014819 2067690
59491 2067690 2126712 2191330 2260051 2331741 2406081 2482079 2556941 2627126 2689847 2742831 2783386
59480 2783386 2808915 2818112 2810866 2787352 2748087 2694666 2629590 2555445 2474742 2390191 2304337 2219063
59468 2219063 2135877 2056251 1981118 1910487 1844273 1783016 1727200 1676515 1630679 1590422 1556712
59457 1556712 1529479 1508061 1492352 1482392 1477309 1475971 1478420 1485409 1496696 1511055 1527878 1547514
59445 1547514 1570000 1594736 1621522 1650717 1682039 1714327 1746876 1780156 1814854 1850985 1888163
59434 1888163 1926019 1964127 2002281 2041058 2081617 2124816 2171020 2220446 2272800 2326519 2379264
$$ packed form
59514B615659j06390r8876r0755q1926p3087o5375n8845n2283m4924l7434l0716
59503A875048k4462j7592r615j101P011J4261K0941K7678L4568M1085M6997N2871
59491B067690N9022O4618O8721P1690P4340P5998P4862P0185O2721N2984M0555
59480B783386K5529R197p246k3514l9265n3421o5076p4145q0703q4551q5854q5274
59468B219063q3186p9626p5133p0631o6214o1257n5816n0685m5836m0257l3710
59457A556712k7233k1418j5709r960n083j338K449O989J1287J4359J6823J9636
59445A547514K2486K4736K6786K9195L1322L2288L2549L3280L4698L6131L7178
59434A888163L7856L8108L8154L8777M0559M3199M6204M9426N2354N3719N2745
$$ plain form
59423 2379264 2429460 2477071 2523283 2570350 2621491 2679789 2746873 2823149 2908908 3004097 3107054
59412 3107054 3214487 3322892 3429395 3531839 3629652 3724984 3821794 3923300 4030862 4144940
59402 4144940 4265582 4391451 4519554 4646691 4770724 4890508 5005786 5117628 5228109
59393 5228109 5338986 5451105 5564897 5680342 5796087 5909531 6018171 6120217 6213911 6297483
59383 6297483 6370294 6433218 6487534 6534236 6574644 6610520 6642836 6670959 6693320 6708144 6713244
59372 6713244 6705948 6683798 6644859 6587285 6509536 6411572 6295339 6163841 6020257 5867872 5709926
59361 5709926 5549133 5387920 5228980 5074620 4925556 4781484 4643054 4512131 4389818
59352 4389818 4275267 4166623 4061771 3957696 3850602 3737764 3618634 3493793 3364022
$$ packed form
59423B379264N0196M7611M6212M7067N1141N8298O7084P6276Q5759R5189J02957
59412C107054J07433J08405J06503J02444R7813R5332R6810J01506J07562J14078
59402D144940J20642J25869J28103J27137J24033J19784J15278J11842J10481
59393E228109J10877J12119J13792J15445J15745J13444J08640J02046R3694Q3572
59383F297483P2811O2924N4316M6702M0408L5876L2316K8123K2361J4824N100
59372F713244p296k2150l8939n7574p7749r7964j16233j31498j43584j52385j57946
59361E709926j60793j61213j58940j54360j49064j44072j38430j30923j22313
59352D389818j14551j08644j04852j04075j07094j12838j19130j24841j29771
$$ plain form
59343 3364022 3231098 3098244 2968634 2844000 2725345 2614028 2511175 2416725 2329942 2250329
59333 2250329 2177343 2109983 2047634 1990818 1940311 1895932 1856892 1822806 1793650 1769243 1749536
59322 1749536 1735039 1726266 1723116 1725417 1733615 1748299 1769387 1796394 1829103 1867410 1910916 1959363
59310 1959363 2013122 2072572 2137147 2205551 2276695 2349934 2424532 2499407 2573381 2645474 2715008
59299 2715008 2781566 2844711 2903785 2958228 3007850 3052175 3089574 3117741 3135074 3140948 3134890 3116629
59287 3116629 3087184 3048811 3003501 2952497 2897647 2842022 2788402 2737991 2691308 2649450 2613697
59276 2613697 2584599 2562288 2547071 2538984 2537335 2541396 2550974 2565631 2583994 2604676 2627401 2652492
59264 2652492 2679764 2708700 2739294 2771905 2806594 2843374 2882830 2925714 2972042 3021211 3072916
$$ packed form
59343C364022j32924j32854j29610j24634j18655j11317j02853r4450q6783p9613
59333B250329p2986o7360o2349n6816n0507m4379l9040l4086k9156k4407j9707
59322A749536j4497q773l150K301Q198J4684K1088K7007L2709L8307M3506M8447
59310A959363N3759N9450O4575O8404P1144P3239P4598P4875P3974P2093O9534
59299B715008O6558O3145N9074N4443M9622M4325L7399K8167J7333N874o058j8261
59287C116629k9445l8373m5310n1004n4850n5625n3620n0411m6683m1858l5753
59276B613697k9098k2311j5217q087j649M061R578J4657J8363K0682K2725K5091
59264B652492K7272K8936L0594L2611L4689L6780L9456M2884M6328M9169N1705
$$ plain form
59253 3072916 3127468 3185317 3246765 3312194 3382525 3459528 3545282 3640195 3740828 3840164 3930881
59242 3930881 4008845 4074255 4130832 4184397 4241047 4305045 4377681 4457596 4541507 4624542 4700951
59231 4700951 4765250 4812562 4838166 4837949 4809948 4754833 4674703 4572417 4452508 4321462 4186028
59220 4186028 4051710 3923292 3805683 3703182 3618339 3552252 3505429 3477860 3469030 3478673 3506977
59209 3506977 3553557 3616877 3695137 3786661 3888547 3995727 4102246 4202665 4291311 4361025
59199 4361025 4404022 4413915 4386650 4320801 4218568 4086126 3931614 3762502 3585107 3405552
59189 3405552 3229588 3061440 2903642 2757807 2624738 2504140 2395273 2297972 2212525 2138871
59179 2138871 2076579 2025291 1984516 1953324 1930917 1917052 1911216 1911799 1916878 1925448 1937102 1950885
$$ packed form
59253C072916N4552N7849O1448O5429P0331P7003Q5754R4913J00633R9336R0717
59242C930881P7964O5410N6577N3565N6650O3998P2636P9915Q3911Q3035P6409
59231D700951O4299M7312K5604k17k8001n5115q0130j02286j19909j31046j35434
59220D186028j34318j28418j17609j02501q4843o6087m6823k7569q830R643K8304
59209C506977M6580O3320P8260R1524J01886J07180J06519J00419Q8646O9714
59199D361025M2997R893k7265o5849j02233j32442j54512j69112j77395j79555
59189C405552j75964j68148j57798j45835j33069j20598j08867r7301q5447p3654
59179B138871o2292n1288m0775l1192k2407j3865n836N83N079Q570J1654J3783
$$ plain form
59167 1950885 1965436 1980124 1995384 2012137 2031525 2054969 2083813 2118963 2161115 2210720 2267165
59156 2267165 2328463 2392321 2457081 2521252 2583030 2641209 2695932 2747537 2794884 2835451 2866669
59145 2866669 2886662 2894460 2890387 2875816 2851845 2818714 2776944 2728102 2673574 2613630 2548870 2481892
59133 2481892 2416295 2354696 2298941 2251460 2214734 2189589 2175380 2171743 2178942 2196638 2223528 2258219
59121 2258219 2299465 2345680 2395282 2447463 2501700 2556541 2609647 2658778 2701929 2737024 2762617
59110 2762617 2778753 2786305 2785885 2778470 2766593 2753522 2741339 2730809 2722656 2717508 2714694 2712490 2709565
59097 2709565 2704970 2696817 2682512 2660657 2631690 2596579 2556124 2511694 2465208 2417832 2369701 2321384
59085 2321384 2274720 2231755 2193601 2160715 2133534 2112379 2097186 2087532 2082494 2080636 2080795 2082925
$$ packed form
59167A950885J4551J4688J5260J6753J9388K3444K8844L5150M2152M9605N6445
59156B267165O1298O3858O4760O4171O1778N8179N4723N1605M7347M0567L1218
59145B866669J9993P798m073j4571k3971l3131m1770m8842n4528n9944o4760o6978
59133B481892o5597o1599n5755m7481l6726k5145j4209l637P199J7696K6890L4691
59121B258219M1246M6215M9602N2181N4237N4841N3106M9131M3151L5095K5593
59110B762617J6136P552m20p415j1877j3071j2183j0530q153n148k814k204k925
59097B709565m595q153j4305k1855k8967l5111m0455m4430m6486m7376m8131m8317
59085B321384m6664m2965l8154l2886k7181k1155j5193r654n038j858J59K130
$$ plain form
59073 2082925 2087538 2094345 2101917 2108131 2109891 2102747 2082332 2046889 1998025 1939163 1874070 1806579
59061 1806579 1740250 1677557 1619883 1568392 1524301 1488327 1460684 1441635 1431232 1428444 1431266 1437823
59049 1437823 1446742 1456730 1466793 1477039 1488455 1501857 1517743 1537032 1560871 1589541 1622393 1659071
59037 1659071 1700076 1746133 1797863 1856253 1922697 1998401 2084280 2181349 2290420 2411327 2542867
59026 2542867 2682977 2827806 2970613 3102570 3214863 3299722 3350451 3362628 3336177 3275649
59016 3275649 3188257 3082152 2965951 2847889 2734310 2629327 2536020 2457066 2394089 2347412
59006 2347412 2316789 2301514 2299503 2307110 2320295 2335511 2349511 2359353 2363046 2359584 2348155 2327969
58994 2327969 2299081 2262758 2220967 2176138 2131352 2089828 2053810 2024315 2001736 1985966 1976088
$$ packed form
59073B082925M613O807P572O214J760p144k0415l5443m8864n8862o5093o7491
59061A806579o6329o2693n7674n1491m4091l5974k7643j9049j0403k788K822O557
59049A437823Q919R988J0063J0246J1416J3402J5886J9289K3839K8670L2852L6678
59037A659071M1005M6057N1730N8390O6444P5704Q5879R7069J09071J20907J31540
59026B542867J40110J44829J42807J31957J12293Q4859N0729J2177k6451o0528
59016C275649q7392j06105j16201j18062j13579j04983r3307p8954o2977m6677
59006B347412l0623j5275k011P607J3185J5216J4000R842L693l462j1429k0186
58994B327969k8888l6323m1791m4829m4786m1524l6018k9495k2579j5770r878
$$ plain form
58983 1976088 1970847 1969443 1971085 1973947 1975632 1974848 1971833 1967322 1962122 1957697 1955923 1957958 1964167 1975189
58969 1975189 1991936 2014305 2040930 2070511 2102508 2136325 2170931 2205781 2241331 2278263 2316871
58958 2316871 2357516 2401142 2449206 2503508 2565641 2635435 2709719 2783287 2850861 2907470 2947795
58947 2947795 2967368 2965138 2943910 2908211 2862917 2813763 2766997 2727320 2696921 2676967 2668884 2673708
58935 2673708 2691485 2722115 2765842 2822195 2889402 2965587 3049906 3142075 3241829 3349604 3467029
58924 3467029 3595985 3737617 3892376 4059889 4237824 4421259 4603775 4779179 4942752
58915 4942752 5092433 5229770 5359102 5485156 5611370 5739941 5871878 6006282 6140341
58906 6140341 6270593 6393628 6505408 6601056 6675980 6726616 6749775 6742239 6701728 6627766 6521401
$$ packed form
58983A976088n241j404J642K862J685p84l015m511n200m425j774K035O209J1022
58969A975189J6747K2369K6625K9581L1997L3817L4606L4850L5550L6932L8608
58958B316871M0645M3626M8064N4302O2133O9794P4284P3568O7574N6609M0325
58947B947795J9573k230k1228l5699m5294m9154m6766l9677l0399j9954q083M824
58935B673708J7777L0630M3727N6353O7207P6185Q4319R2169R9754J07775J17425
58924C467029J28956J41632J54759J67513J77935J83435J82516J75404J63573
58915D942752J49681J37337J29332J26054J26214J28571J31937J34404J34059
58906F140341J30252J23035J11780R5648P4924N0636K3159p536m0511p3962j06365
$$ plain form
58895 6521401 6384894 6221938 6037194 5834828 5617968 5389755 5154057 4914722 4674909
58886 4674909 4437603 4205944 3982429 3768354 3564585 3372406 3193271 3028156 2877381
58877 2877381 2740487 2616106 2502537 2398729 2304242 2218423 2140355 2069631 2006353 1950258
58867 1950258 1900634 1857079 1819498 1787409 1760107 1737460 1719569 1705783 1695126 1687501 1683250 1681681
58855 1681681 1681522 1682841 1686926 1694097 1703264 1713955 1727032 1742927 1760901 1780878 1804420 1832935
58843 1832935 1866289 1904065 1946858 1995361 2049448 2109135 2175167 2247398 2323449 2399997 2474615
58832 2474615 2545537 2610815 2669191 2721460 2770079 2817729 2866745 2919410 2978162 3045823 3125640
58821 3125640 3220147 3329707 3453065 3589529 3739437 3902166 4074963 4254199 4436350 4617057
$$ packed form
58895F521401j36507j62956j84744k02366k16860k28213k35698k39335k39813
58886D674909k37306k31659k23515k14075k03769j92179j79135j65115j50775
58877B877381j36894j24381j13569j03808r4487q5819p8068p0724o3278n6095
58867A950258m9624m3555l7581l2089k7302k2647j7891j3786j0657p625m251j569
58855A681681j59J319M085P171R167J0691J3077J5895J7974J9977K3542K8515
58843A832935L3354L7776M2793M8503N4087N9687O6032P2231P6051P6548P4618
58832B474615P0922O5278N8376N2269M8619M7650M9016N2665N8752O7661P9817
58821C125640R4507J09560J23358J36464J49908J62729J72797J79236J82151J80707
$$ plain form
58811 4617057 4790572 4951115 5093752 5213272 5303582 5359431 5378099 5358879 5302159 5209960
58801 5209960 5086328 4936151 4764251 4576146 4378440 4177262 3976955 3780850 3592308
58792 3592308 3414168 3248085 3095248 2956948 2833842 2725710 2632622 2555353 2494040 2447487
58782 2447487 2414240 2392691 2379003 2366315 2347518 2318523 2278589 2229225 2174114 2118866 2069040
58771 2069040 2028442 1999604 1984618 1984462 1998587 2026267 2067551 2122273 2189525 2269303 2363517 2474073
58759 2474073 2600777 2741948 2895515 3057632 3220644 3373572 3504226 3600703 3653131 3656712
58749 3656712 3613539 3530891 3418382 3286896 3147981 3011575 2883903 2768063 2665699 2577175
58739 2577175 2501238 2435986 2379808 2330672 2285663 2242406 2200185 2158869 2117998 2078217 2042469
$$ packed form
58811D617057J73515J60543J42637J19520R0310N5849J8668j9220n6720r2199
58801E209960j23632j50177j71900j88105j97706k01178k00307j96105j88542
58792C592308j78140j66083j52837j38300j23106j08132r3088p7269o1313m6553
58782B447487l3247k1549j3688j2688j8797k8995l9934m9364n5111n5248m9826
58771B069040m0598k8838j4986j56J4125K7680M1284N4722O7252P9778R4214J10556
58759B474073J26704J41171J53567J62117J63012J52928J30654R6477N2428L581
58749C656712m3173q2648j12509j31486j38915j36406j27672j15840j02364q8524
58739B577175p5937o5252n6178m9136m5009m3257m2221m1316m0871l9781l5748
$$ plain form
58728 2042469 2014342 1995947 1988297 1992215 2006909 2028160 2049204 2062867 2062270 2041379 1997261 1931651
58716 1931651 1849251 1755221 1655068 1555056 1460277 1372717 1292596 1220791 1158338 1104631 1058067
58705 1058067 1017943 984008 954826 928562 905075 885515 870091 857832 848264 841786 838573 838572 842460
58692 842460 851341 865636 885249 910289 940419 973906 1008536 1043038 1076650 1108077 1136213 1161248
58680 1161248 1183740 1203264 1219325 1232975 1246053 1259285 1272390 1285433 1298723 1311942 1324600
58669 1324600 1336537 1346463 1350642 1344584 1325855 1294518 1252250 1202650 1151278 1103096 1059957 1021732
58657 1021732 988913 962367 941544 925107 912876 905290 901380 899193 897928 897863 898570 898924 898511 897359
58643 897359 894728 889971 884146 879053 875117 872014 870734 872884 878265 885351 894022 905735 921009 938855
$$ packed form
58728B042469k8127j8395p650L918J4694K1251K1044J3663n97k0891m4118o5610
58716A931651q2400r4030j00153j00012r4779q7560q0121p1805o2453n3707m6564
58705A058067m0124l3935k9182k6264k3487j9560j5424j2259r568o478l213jL888
58692H42460Q881J4295J9613K5040L0130L3487L4630L4502L3612L1427K8136K5035
58680A161248K2492J9524J6061J3650J3078J3232J3105J3043J3290J3219J2658
58669A324600J1937R926M179o058j8729l1337m2268m9600n1372m8182m3139l8225
58657A021732l2819k6546k0823j6437j2231p586l910k187j265o5P07L54m13j152
58643H97359k631m757n825n093l936l103j280K150N381P086Q671J1713J5274J7846
$$ plain form
58629 938855 958919 982323 1010058 1042185 1078860 1120596 1167339 1218671 1274939 1336873 1404176
58618 1404176 1475838 1551527 1631134 1713224 1795437 1876104 1953821 2025716 2087858 2137281 2172149
58607 2172149 2190540 2191082 2174717 2144089 2101442 2048903 1990454 1931340 1875278 1823886 1778686 1741591
58595 1741591 1713332 1693352 1681546 1678360 1683082 1693960 1710343 1733097 1762739 1799003 1842595 1895733
58583 1895733 1960484 2037848 2128404 2231895 2345334 2462342 2574231 2670669 2739987 2771394
58573 2771394 2758404 2700183 2600706 2468147 2314233 2151396 1989279 1834199 1690810 1562190
58563 1562190 1448694 1348958 1262377 1189230 1128705 1078762 1037946 1005460 979349 956326 933654
58552 933654 909903 884216 856569 828651 802758 779728 759197 741322 726543 714175 703194
$$ packed form
58629I38855K0064K3404K7735L2127L6675M1736M6743N1332N6268O1934O7303
58618A404176P1662P5689P9607Q2090Q2213Q0667P7717P1895O2142M9423L4868
58607B172149J8391N42j6365l0628m2647n2539n8449n9114n6062n1392m5200l7095
58595A741591k8259j9980j1806l186M722J0878J6383K2754K9642L6264M3592N3138
58583A895733O4751P7364R0556J03491J13439J17008J11889R6438O9318L1407
58573B771394j2990n8221r9477j32559j53914j62837j62117j55080j43389j28620
58563A562190j13496r9736q6581p3147o0525m9943m0816l2486k6111k3023k2672
58552I33654k3751k5687k7647k7918k5893k3030k0531j7875j4779j2368j0981
$$ plain form
58541 703194 694156 688511 686355 686615 688954 693553 699693 706681 715596 727801 742325 757210 773015
58528 773015 792356 816281 843745 874357 908700 945865 983464 1020237 1055938 1088613 1115011
58517 1115011 1134225 1148274 1158763 1165814 1170873 1177659 1189462 1207876 1234750 1272595 1322007 1380900
58505 1380900 1446962 1518504 1592201 1662518 1724490 1775345 1813210 1836693 1846221 1843197 1826995 1795048
58493 1795048 1746540 1683781 1609672 1526532 1438101 1349737 1265339 1186166 1113288 1048581 992285
58482 992285 942185 896448 855200 818434 784789 753541 725707 702078 681989 664684 649827
58471 649827 636174 622068 607947 596119 587501 580833 575382 571674 569010 565275 560140 555723 553150
58458 553150 551150 548906 547402 546929 546141 544786 544541 545961 547334 547839 549053 552032 555702 559450 564468
$$ packed form
58541G03194r038n645k156K60K339M599O140O988Q915J2205J4524J4885J5805
58528G73015J9341K3925K7464L0612L4343L7165L7599L6773L5701L2675K6398
58517A115011J9214J4049J0489P051N059O786J1803J8414K6874L7845M9412N8893
58505A380900O6062P1542P3697P0317O1972N0855L7865K3483R528l024j6202l1947
58493A795048m8508o2759p4109q3140q8431q8364q4398p9173p2878o4707n6296
58482I92285n0100m5737m1248l6766l3645l1248k7834k3629k0089j7305j4857
58471F49827j3653j4106j4121j1828q618o668n451l708k664l735n135m417k573
58458E53150k000k244j504m73p88j355k45J420J373N05J214K979L670L748N018
$$ plain form
58443 564468 571064 577332 581975 585759 588853 589670 587991 586368 586580 587324 587124 586887 587711 588803 589528 591070
58427 591070 594135 597324 599694 602641 607366 612653 616957 620579 624113 626905 628689 630617 633075 634620
58413 634620 634571 634377 635028 635451 634889 634445 634814 635017 634814 635748 638256 640447 641377 642886 646444 650861 654859
58396 654859 659261 664885 670882 676908 684306 693439 702674 711691 722929 737878 754987 773351 795523
58383 795523 824396 859712 899202 939807 975579 997902 1001336 987643 962480 930815 897220 866846
58371 866846 842700 823941 809072 798504 792229 788049 784461 782555 782960 783848 784212 785957 790332 795306
58357 795306 799011 802852 808724 816054 824009 833559 844981 856383 867204 879971 896274 914245 932447
58344 932447 952580 975716 999575 1022518 1046565 1073383 1100862 1126698 1151577 1175502 1194762
$$ packed form
58443E64468O596O268M643L784L094Q17j679j623K12P44k00k37Q24J092P25J542
58427E91070L065L189K370K947M725N287M304L622L534K792J784J928K458J545
58413F34620m9j94O51M23n62m44L69K03k03R34K508K191R30J509L558M417L998
58396F54859M402N624N997O026P398R133R235R017J1238J4949J7109J8364K2172
58383G95523K8873L5316L9490M0605L5772K2323L434j3693k5163l1665l3595l0374
58371H66846k4146j8759j4869j0568o275m180l588j906M05Q88L64J745M375M974
58357G95306L705L841N872P330P955R550J1422J1402J0821J2767J6303J7971J8202
58344I32447K0133K3136K3859K2943K4047K6818K7479K5836K4879K3925J9260
$$ plain form
58333 1194762 1206254 1211451 1212717 1209312 1200677 1189989 1180565 1172008 1163502 1157390 1155735 1156835 1158966
58320 1158966 1163943 1173183 1184059 1194249 1205895 1221185 1237634 1252345 1267247 1285389 1305550 1325360
58308 1325360 1346371 1371176 1398736 1427380 1459278 1497152 1539745 1585333 1636530 1696828 1765610
58297 1765610 1841439 1927063 2026201 2138428 2261784 2396887 2543342 2695162 2844328 2985296
58287 2985296 3111573 3212325 3278262 3307775 3302911 3264082 3194428 3104761 3007561 2909186 2813035
58276 2813035 2725474 2652135 2592555 2544875 2511741 2495287 2490937 2493076 2502548 2521727 2546913 2573203
58264 2573203 2602403 2638360 2678648 2718773 2760483 2807812 2858843 2909451 2961293 3018041 3077675
58253 3077675 3136628 3197492 3264454 3335415 3406917 3482240 3566041 3655781 3747278 3843692 3949708
$$ packed form
58333A194762J1492N197J266l405q635j0688r424q557q506o112j655J100K131
58320A158966M977R240J0876J0190J1646J5290J6449J4711J4902J8142K0161J9810
58308A325360K1011K4805K7560K8644L1898L7874M2593M5588N1197O0298O8782
58297A765610P5829Q5624R9138J12227J23356J35103J46455J51820J49166J40968
58287B985296J26277J00752O5937K9513m864l8829o9654q9667r7200r8375r6151
58276B813035q7561p3339n9580m7680l3134j6454m350K139R472J9179K5186K6290
58264B573203K9200L5957M0288M0125M1710M7329N1031N0608N1842N6748N9634
58253C077675N8953O0864O6962P0961P1502P5323Q3801Q9740R1497R6414J06016
$$ plain form
58242 3949708 4062192 4176352 4295805 4426376 4565456 4708078 4857875 5021028 5195177
58233 5195177 5375811 5567603 5777309 6001534 6234134 6479524 6745565 7030000 7327889
58224 7327889 7645645 7992891 8367227 8762736 9186659 9651335 10156891 10699284 11288210
58215 11288210 11938756 12652934 13428923 14280863 15229359 16281357 17442034 18738260 20207452
58206 20207452 21873901 23763357 25932541 28458630 31413760 34883037 38994763 43895024
58198 43895024 49702897 56528741 64522670 73867622 84762709 97496298 112538241 130510244
58190 130510244 152117355 178210084 209759319 247230249 289362395 332274482 369912826
58183 369912826 395871464 405590466 397820448 374809419 341271756 302656108 263537414
$$ packed form
58242C949708J12484J14160J19453J30571J39080J42622J49797J63153J74149
58233E195177J80634J91792K09706K24225K32600K45390K66041K84435K97889
58224G327889L17756L47246L74336L95509M23923M64676N05556N42393N88926
58215A1288210O50546P14178P75989Q51940R48496J051998J160677J296226J469192
58206B0207452J666449J889456K169184K526089K955130L469277M111726M900261
58198D3895024N807873O825844P993929R344952J0895087J2733589J5041943J7972003
58190A30510244K1607111K6092729L1549235L7470930M2132146M2912087L7638344
58183C69912826K5958638R719002p770018k3011029l3537663l8615648l9118694
$$ plain form
58176 263537414 226839120 193962195 165317150 140773989 119938632 102349052 87587824
58169 87587824 75279618 65053925 56561525 49510153 43654704 38771630 34669973 31210711
58161 31210711 28289363 25809917 23691511 21882746 20347572 19046723 17946336 17029971
58153 17029971 16285424 15689393 15215958 14847849 14569486 14363097 14223780 14168475 14223382 14414644
58143 14414644 14775238 15344309 16152600 17221905 18581421 20270461 22330866 24823994
58135 24823994 27858179 31580452 36159834 41824116 48874507 57496365 67374244 77431879
58127 77431879 86014119 91462023 92727794 89713359 83229557 74634171 65321340 56318208
58119 56318208 48171474 41073209 35027237 29943280 25690953 22149474 19225369 16830928
$$ packed form
58176B63537414l6698294l2876925k8645045k4543161k0835357j7589580j4761228
58169H7587824j2308206j0225693q492400p051372n855449m883074m101657l459262
58161C1210711k921348k479446k118406j808765j535174j300849j100387r16365
58153A7029971p44547n96031m73435l68109k78363k06389j39317n5305N4907J91262
58143A4414644L60594N69071Q08291J069305J359516J689040K060405K493128
58135B4823994L034185L722273M579382N664282P050391Q621858R877879J0057635
58127G7431879Q582240N447904J265771l014435o483802q595386r312831r003132
58119E6318208q146734p098265o045972n083957m252327l541479k924105k394441
$$ plain form
58111 16830928 14871841 13265313 11950949 10874919 9980109 9219665 8564928 7992302 7475438
58102 7475438 6996123 6549249 6130138 5728320 5339078 4969498 4627288 4313224 4028412
58093 4028412 3777957 3562263 3374080 3208652 3068273 2953525 2859000 2780636 2717756 2664085
58083 2664085 2605876 2533464 2447538 2351608 2246753 2136855 2030274 1931956 1840537 1755861 1681804
58072 1681804 1618811 1561348 1506169 1456110 1412794 1372790 1334285 1300504 1272960 1247811 1222408
58061 1222408 1199341 1180637 1163778 1146694 1131031 1117243 1101938 1083331 1064411 1047847 1032529
58050 1032529 1017583 1004767 994382 983729 972100 962532 956357 950854 944511 939701 937844 936901 936127
58037 936127 938512 945897 956165 967737 982396 1001229 1022173 1044106 1069157 1098528 1130173 1163080
$$ packed form
58111A6830928j959087j606528j314364j076030q94810p60444o54737n72626n16864
58102G475438m79315m46874m19111m01818l89242l69580l42210l14064k84812
58093D028412k50455k15694j88183j65428j40379j14748r4525p8364o2880n3671
58083B664085n8209p2412q5926r5930j04855j09898j06581r8318r1419q4676p4057
58072A681804o2993n7463n5179n0059m3316m0004l8505l3781k7544k5149k5403
58061A222408k3067j8704j6859j7084j5663j3788j5305j8607j8920j6564j5318
58050A032529j4946j2816j0385j0653j1629r568o175n503o343m810j857r43p74
58037I36127K385P385J0268J1572J4659J8833K0944K1933K5051K9371L1645L2907
$$ plain form
58025 1163080 1199943 1243229 1292524 1348104 1413149 1489898 1577084 1673392 1779764 1895852 2017401
58014 2017401 2139158 2257104 2365977 2458163 2527319 2570406 2585128 2569211 2524040 2455478 2369288
58003 2369288 2269118 2160164 2050469 1946208 1849141 1760595 1684180 1622404 1574319 1538957
57993 1538957 1517818 1511752 1518776 1537505 1569779 1617641 1680609 1757848 1849640 1953952 2063915
57982 2063915 2170537 2265220 2338266 2379055 2381230 2345973 2278593 2184771 2071897 1950268 1829285
57971 1829285 1713919 1606678 1510443 1427050 1355559 1294593 1244737 1206826 1179991 1163337 1157522
57960 1157522 1162866 1177945 1201819 1235645 1280483 1335658 1400750 1476817 1563852 1659090 1759098
57949 1759098 1860792 1958503 2042690 2103951 2136806 2138607 2107931 2046590 1960944 1858678 1745627
$$ packed form
58025A163080L6863M3286M9295N5580O5045P6749Q7186R6308J06372J16088J21549
58014B017401J21757J17946J08873R2186O9156M3087J4722j5917m5171o8562q6190
58003B369288j00170j08954j09695j04261r7067q8546p6415o1776m8085l5362
57993A538957k1139o066P024J8729L2274M7862O2968P7239R1792J04312J09963
57982B063915J06622R4683P3046M0789K175l5257o7380r3822j12874j21629j20983
57971A829285j15366j07241r6235q3393p1491o0966m9856l7911k6835j6654n815
57960A157522N344J5079K3874L3826M4838N5175O5092P6067Q7035R5238J00008
57949A759098J01694R7711Q4187O1261L2855J801l0676o1341q5646j02266j13051
$$ plain form
57938 1745627 1626924 1508464 1394758 1287204 1186501 1094828 1013631 941330 875479 815563
57928 815563 761870 713600 670272 633177 603220 578736 557403 538768 523045 509055 495431
57917 495431 482530 471280 461427 452544 445326 440229 436301 433001 431748 434006 439226 446132 454540 464369
57903 464369 474357 483386 491695 499426 505473 509094 511008 511548 509529 504496 498222 492327 486127 478440
57889 478440 469707 460583 450409 439117 428997 422361 418773 416494 415361 416319 419434 424284 431177 440215
57875 440215 450240 460297 470884 482311 493288 502818 511936 521828 531516 539203 544505 547630 547778
57862 547778 544259 537958 529929 519877 507662 494833 482748 470777 458312 447031 438850 433052
57850 433052 427824 423456 421539 422032 423703 426785 432628 441123 450745 460885 472058 484048 495754
$$ packed form
57938A745627j18703j18460j13706j07554j00703r1673q1197p2301o5851n9916
57928H15563n3693m8270m3328l7095k9957k4484k1333j8635j5723j3990j3624
57917D95431j2901j1250r853q883p218n097l928l300j253K258N220O906Q408R829
57903D64369R988R029Q309P731O047L621J914N40k019n033o274n895o200p687
57889D78440q733r124j0174j1292j0120o636l588k279j133R58L115M850O893R038
57875D40215J0025J0057J0587J1427J0977R530R118R892R688P687N302L125J48
57862E47778l519o301q029j0052j2215j2829j2085j1971j2465j1281q181n798
57850D33052n228m368j917M93J671L082N843Q495R622J0140J1173J1990J1706
$$ plain form
57837 495754 506726 517133 526401 533475 538216 541249 542866 543389 543994 545788 548557 551605 555082 559221
57823 559221 563314 566977 571533 578534 587823 598723 612298 630636 654664 684452 721015 766012
57811 766012 820244 884131 958949 1045572 1142209 1244662 1347928 1445664 1529053 1588951 1619874
57800 1619874 1621063 1594693 1545151 1479477 1405746 1330013 1255593 1184755 1119300 1059601 1004923
57789 1004923 955045 910285 870012 832585 796904 762786 729888 697634 666303 636974 610292
57778 610292 586260 565126 547313 532370 518945 505826 492503 479182 467109 458411 454505 454917
57766 454917 458331 464259 472891 484054 497222 511637 525243 534424 536360 531230 521122 507651 491941
57753 491941 475797 460926 447422 434591 422808 412996 404877 397469 390887 385951 382418 379426 377416
$$ packed form
57837D95754J0972J0407R268P074M741L033J617N23O05J794K769L048L477M139
57823E59221M093L663M556P001R289J0900J3575J8338K4028K9788L6563M4997
57811G66012N4232O3887P4818Q6623R6637J02453J03266R7736Q3389N9898L0923
57800A619874J189k6370m9542o5674p3731p5733p4420p0838o5455n9699n4678
57789A004923m9878m4760m0273l7427l5681l4118l2898l2254l1331k9329k6682
57778F10292k4032k1134j7813j4943j3425j3119j3323j3321j2073q698l906M12
57766D54917L414N928Q632J1163J3168J4415J3606R181J936n130j0108j3471j5710
57753D91941j6144j4871j3504j2831j1783r812q119p408o582m936l533k992k010
$$ plain form
57740 377416 377753 380566 384699 389700 396080 403590 411156 418710 427299 437002 446390 454518 462027 469796
57726 469796 477919 486600 496779 509135 523440 539471 557805 579257 604217 632868 665441 702042
57714 702042 742744 787892 837797 892202 950624 1012838 1078268 1145101 1210773 1273031 1329755
57703 1329755 1378163 1415201 1438644 1447217 1440265 1418368 1383872 1339825 1288680 1232826 1175492 1119729
57691 1119729 1066877 1017308 972209 933167 900411 873023 850732 834022 822652 815752 813605 817956
57679 817956 830359 851444 881886 922823 975151 1039691 1118353 1214172 1330193 1469617 1637339
57668 1637339 1840019 2083120 2366113 2677113 2988706 3259537 3445234 3514658 3461340 3303669
57658 3303669 3075880 2815953 2555517 2314990 2104578 1928006 1785141 1673282 1588993 1529693
$$ packed form
57740C77416L37K813M133N001O380P510P566P554Q589R703R388Q128P509P769
57726D69796Q123Q681J0179J2356J4305J6031J8334K1452K4960K8651L2573L6601
57714G02042M0702M5148M9905N4405N8422O2214O5430O6833O5672O2258N6724
57703A329755M8408L7038K3443Q573o952k1897l4496m4047n1145n5854n7334n5763
57691A119729n2852m9569m5099l9042l2756k7388k2291j6710j1370o900k147M351
57679H17956J2403K1085L0442M0937N2328O4540P8662R5819J16021J39424J67722
57668A637339K02680K43101K82993L11000L11593K70831J85697O9424n3318j57671
57658C303669k27789k59927k60436k40527k10412j76572j42865j11859q4289n9300
$$ plain form
57648 1529693 1492890 1474355 1468643 1471358 1479470 1489412 1496520 1496808 1488049 1468864 1438167 1396148 1344735
57635 1344735 1286519 1223873 1159167 1094639 1031653 970900 913450 860653 812876 769289 729054
57624 729054 691826 657181 624698 594712 567887 543997 522186 502385 485179 470209 456192
57613 456192 442750 430879 421214 413167 406154 400383 395883 391988 388348 385476 383863 383559 384918 388606
57599 388606 394386 401024 407804 414981 422397 428869 433555 436760 438779 439079 437282 433901 429402 423548
57585 423548 416398 408998 402328 396412 391111 386841 383816 381449 379321 377969 378016 379227 381149 383938 387872
57570 387872 392746 398477 405646 414705 425260 436875 450074 465865 484651 506214 530337 556954
57558 556954 586109 618229 654014 693605 736250 781008 827123 873316 917375 956948 990360
$$ packed form
57648A529693l6803j8535n712K715Q112R942P108K88q759j9185l0697m2019n1413
57635A344735n8216o2646o4706o4528o2986o0753n7450n2797m7777m3587m0235
57624G29054l7228l4645l2483k9986k6825k3890k1811j9801j7206j4970j4017
57613D56192j3442j1871r665q047p013n771m500l895l640k872j613l04J359L688
57599C88606N780O638O780P177P416O472M686L205K019L00j797l381m499n854
57585D23548p150p400o670n916n301m270l025k367k128j352M7J211J922K789L934
57570C87872M874N731P169R059J0555J1615J3199J5791J8786K1563K4123K6617
57558E56954K9155L2120L5785L9591M2645M4758M6115M6193M4059L9573L3412
$$ plain form
57547 990360 1016294 1033276 1040027 1036038 1021634 997817 966192 928560 886492 841746 796814 754058
57535 754058 714262 676911 641977 610335 582354 557380 535052 515867 499802 485572 472088
57524 472088 459677 449055 439905 431344 423084 415398 408630 403431 400755 400803 402556 405058 408522 413520
57510 413520 419811 426847 434836 444388 455521 467829 481330 496393 513158 531692 552473 576114
57498 576114 602754 632119 663882 697688 733298 770978 811103 852886 894033 932099 965596
57487 965596 993385 1013721 1024618 1024695 1013244 990237 956975 916162 870525 821739 771106 720500
57475 720500 671766 625676 582293 541922 504980 471321 440580 412920 388673 367431 348187
57464 348187 330256 313580 298288 284488 272271 261488 251720 242763 234824 227974 221864 216259 211303
$$ packed form
57547I90360K5934J6982O751l989j4404k3817l1625l7632m2068m4746m4932m2756
57535G54058l9796l7351l4934l1642k7981k4974k2328j9185j6065j4230j3484
57524D72088j2411j0622r150q561q260p686o768n199k676M8J753K502L464M998
57510D13520O291P036P989R552J1133J2308J3501J5063J6765J8534K0781K3641
57498E76114K6640K9365L1763L3806L5610L7680M0125M1783M1147L8066L3497
57487I65596K7789K0336J0897P7j1451k3007l3262m0813m5637m8786n0633n0606
57475G20500m8734m6090m3383m0371l6942l3659l0741k7660k4247k1242j9244
57464C48187j7931j6676j5292j3800j2217j0783r768q957p939o850o110n605m956
$$ plain form
57451 211303 206901 202557 198267 194838 192711 191200 189596 188235 187634 187230 186064 184235 182621 181419 179998
57436 179998 178004 175706 173368 171095 169224 168007 166958 165335 163350 162226 162921 165258 168293 171046
57422 171046 173030 174578 176604 179627 183144 186285 188788 190882 192639 194106 195834 198486 201978 205562
57408 205562 208676 211217 213119 214238 214601 214337 213533 212574 212319 213366 215250 216891 217710 217910 217946 218189 218871
57391 218871 219815 220439 220432 220142 219973 219955 220385 222157 225564 229370 232140 234113 236612 239880 242793 244697 246270
57374 246270 248236 250379 252250 253986 255917 258144 260969 265047 270561 276753 282754 288482 294342 300464
57360 300464 306650 312737 318579 323902 328596 332986 337561 342475 347429 351980 355853 359109 362091 365196
57346 365196 368779 373259 379019 385859 392842 399154 405067 411600 419258 427580 436003 444708 454321 465000
$$ packed form
57451B11303m402m344m290l429k127j511j604j361o01m04j166j829j614j202j421
57436A79998j994k298k338k273j871j217j049j623j985j124O95K337L035K753
57422A71046J984J548K026L023L517L141K503K094J757J467J728K652L492L584
57408B05562L114K541J902J119L63k64q04r59k55J047J884J641Q19K00L6K43O82
57391B18871R44O24pk90j69j8M30J772L407L806K770J973K499L268K913J904J573
57374B46270J966K143J871J736J931K227K825M078N514O192O001N728N860O122
57360C00464O186O087N842N323M694M390M575M914M954M551L873L256K982L105
57346C65196L583M480N760O840O983O312N913O533P658Q322Q423Q705R613J0679
$$ plain form
57332 465000 476069 486575 496195 505576 515639 526557 537722 548722 559838 571353 582966 594375
57320 594375 605909 617887 629713 640343 649461 657467 664429 669812 673221 674699 674308 672084 668487
57307 668487 664239 659630 654550 649305 644746 641454 639321 638055 637546 637664 638259 639490 641683 644821 648800
57292 648800 654130 661615 671166 681747 692757 704685 718004 732218 746607 761229 776526 792413
57280 792413 808469 824649 841097 857477 873190 888215 903154 918397 933644 948311 962036
57269 962036 974705 986242 996508 1005432 1013335 1021170 1030128 1040798 1052884 1065870 1079593 1093951
57257 1093951 1108478 1122795 1137354 1153142 1170600 1189270 1208659 1228963 1250624 1273514 1297039
57246 1297039 1321030 1346053 1372640 1400456 1428566 1456432 1484318 1512736 1541875 1571727 1602394
$$ packed form
57332D65000J1069J0506R620R381J0063J0918J1165J1000J1116J1515J1613J1409
57320E94375J1534J1978J1826J0630R118Q006O962N383L409J478l91k224l597
57307F68487m248m609n080n245m559l292k133j266n09J18N95J231K193L138L979
57292F48800N330P485R551J0581J1010J1928J3319J4214J4389J4622J5297J5887
57280G92413J6056J6180J6448J6380J5713J5025J4939J5243J5247J4667J3725
57269I62036J2669J1537J0266Q924P903P835Q958J0670J2086J2986J3723J4358
57257A093951J4527J4317J4559J5788J7458J8670J9389K0304K1661K2890K3525
57246A297039K3991K5023K6587K7816K8110K7866K7886K8418K9139K9852L0667
$$ plain form
57235 1602394 1633957 1666226 1698980 1732331 1766606 1801988 1838634 1876979 1917513 1960275 2004915
57224 2004915 2051251 2099437 2149587 2201580 2255211 2310160 2365824 2421609 2477459 2533628 2589794
57213 2589794 2644826 2697684 2748288 2797389 2845925 2894628 2943873 2993713 3044402 3097057 3153394
57202 3153394 3214526 3280249 3349704 3422313 3497776 3575643 3655453 3737171 3821046 3907076 3994942
57191 3994942 4084379 4175312 4267628 4361093 4455431 4550294 4645174 4739383 4831960 4921542 5006775
57180 5006775 5087297 5164169 5238811 5311437 5380865 5445972 5507066 5565649 5623010 5679174 5733143
57169 5733143 5783986 5831686 5877135 5921646 5966579 6013026 6061231 6110122 6157744 6202378 6243246
57158 6243246 6280337 6314005 6344743 6372733 6397265 6416993 6430990 6439124 6441151 6436096 6423207 6403095
$$ packed form
57235A602394L1563L2269L2754L3351L4275L5382L6646L8345M0534M2762M4640
57224B004915M6336M8186N0150N1993N3631N4949N5664N5785N5850N6169N6166
57213B589794N5032N2858N0604M9101M8536M8703M9245M9840N0689N2655N6337
57202C153394O1132O5723O9455P2609P5463P7867P9810Q1718Q3875Q6030Q7866
57191C994942Q9437R0933R2316R3465R4338R4863R4880R4209R2577Q9582Q5233
57180E006775Q0522P6872P4642P2626O9428O5107O1094N8583N7361N6164N3969
57169E733143N0843M7700M5449M4511M4933M6447M8205M8891M7622M4634M0868
57158F243246L7091L3668L0738K7990K4532J9728J3997Q134K027n055j2889k0112
$$ plain form
57146 6403095 6377217 6346558 6311678 6273961 6235856 6199584 6166278 6136645 6111720 6092361 6078393
57135 6078393 6068756 6062284 6057949 6054592 6050980 6046168 6039425 6029784 6016052 5997575 5974963 5949996 5924974
57122 5924974 5902305 5884460 5873623 5870635 5874152 5881338 5889870 5899351 5910874 5925849 5945745 5972648
57110 5972648 6009208 6057832 6120433 6199244 6297470 6418756 6566441 6744062 6957063 7214279
57100 7214279 7528478 7916873 8402467 9015353 9792093 10772860 11998503 13509290 15344008
57091 15344008 17537045 20113781 23086760 26452999 30190126 34250496 38555477 42992906
57083 42992906 47423169 51703600 55733563 59495141 63043885 66430799 69602104 72358520
57075 72358520 74412776 75503013 75484682 74358642 72245117 69331808 65817741 61870906
$$ packed form
57146F403095k5878l0659l4880l7717l8105l6272l3306k9633k4925j9359j3968
57135F078393r637o472m335l357l612m812o743r641j3732j8477k2612k4967k5022
57122E924974k2669j7845j0837k988L517P186Q532R481J1523J4975J9896K6903
57110E972648L6560M8624O2601P8811R8226J21286J47685J77621K13001K57216
57100G214279L14199L88395M85594O12886P76740R80767J225643J510787J834718
57091A5344008K193037K576736K972979L366239L737127M060370M304981M437429
57083D2992906M430263M280431M029963L761578L548744L386914L171305K756416
57075G2358520K054256J090237j8331j126040k113525k913309l514067l946835
$$ plain form
57067 61870906 57615524 53148471 48563983 43965275 39459966 35149129 31117162 27424047
57059 27424047 24101817 21157206 18578225 16340301 14410898 12754067 11334477 10119115
57051 10119115 9077326 8181487 7408220 6738309 6155378 5645314 5196797 4801326 4452026
57042 4452026 4142507 3866736 3619513 3396824 3195844 3014498 2850729 2702162 2566449
57033 2566449 2441733 2326628 2220006 2120984 2028932 1943350 1863883 1790310 1722159 1658411 1598161
57022 1598161 1541467 1488896 1440249 1394610 1351750 1312444 1276960 1244258 1213329 1184474 1158545
57011 1158545 1135648 1115398 1097779 1082908 1070458 1060118 1052193 1047021 1044215 1043191 1044001 1046939 1051763
56998 1051763 1058014 1065801 1075696 1088263 1104154 1124098 1148235 1176061 1207569 1243793 1285893 1334830
$$ packed form
57067F1870906m255382m467053m584488m598708m505309m310837m031967l693115
57059B7424047l322230k944611k578981k237924j929403j656831j419590j215362
57051A0119115j041789q95839p73267o69911n82931n10064m48517l95471l49300
57042D452026l09519k75771k47223k22689k00980j81346j63769j48567j35713
57033B566449j24716j15105j06622r9022r2052q5582p9467p3573o8151o3748o0250
57022A598161n6694n2571m8647m5639m2860l9306l5484l2702l0929k8855k5929
57011A158545k2897k0250j7619j4871j2450j0340p925n172k806j024Q10K938M824
56998A051763O251P787R895J2567J5891J9944K4137K7826L1508L6224M2100M8937
$$ plain form
56986 1334830 1392748 1463543 1551113 1657940 1785844 1936364 2109375 2303836 2522610 2775717
56976 2775717 3077859 3446322 3905068 4485574 5209296 6055826 6942333 7735160 8289966
56967 8289966 8500312 8334300 7843907 7140584 6348985 5566556 4849750 4222998 3692372
56958 3692372 3253810 2897683 2612299 2385166 2202653 2051173 1919895 1801971 1693652
56949 1693652 1593467 1501780 1419175 1344563 1275480 1210019 1147492 1087551 1030135 976394 928322
56938 928322 887106 852660 824886 804447 792214 788948 795594 812603 838202 867688 894610 912353
56926 912353 915288 900316 868470 824570 774619 723386 673983 628413 587667 551711 520013 492125
56914 492125 467769 446776 429093 414481 402121 390951 380564 371369 363729 357371 351781 346723
$$ packed form
56986A334830N7918P0795Q7570J06827J27904J50520J73011J94461K18774K53107
56976B775717L02142L68463M58746N80506P23722Q46530Q86507P92827N54806
56967H289966K10346j66012m90393p03323p91599p82429p16806o26752n30626
56958C692372m38562l56127k85384k27133j82513j51480j31278j17924j08319
56949A693652j00185r1687q2605p4612o9083o5461o2527n9941n7416n3741m8072
56938I28322m1216l4446k7774k0439j2233l266O646J7009K5599K9486K6922J7743
56926I12353K935j4972l1846m3900m9951n1233m9403m5570m0746l5956l1698k7888
56914D92125k4356k0993j7683j4612j2360j1170j0387r195p640o358n590n058
$$ plain form
56902 346723 342227 338452 335768 334526 334573 335423 337094 340236 345144 351201 357875 365866 376632 390947
56888 390947 408625 429614 454413 482743 512107 538347 557729 568335 569765 562464 547912 528957
56876 528957 509019 490631 474896 462150 452614 446437 443775 445177 451438 462774 478522 498036
56864 498036 521675 550738 586807 631308 685016 746883 812847 875870 927458 960016 969236 955573
56852 955573 923842 881072 834154 788530 747717 713269 685414 664287 650547 644790 646853 656201
56840 656201 672790 697257 730567 773926 828971 897593 981146 1078812 1185297 1289290 1375175
56829 1375175 1428195 1439870 1410249 1346721 1261105 1166204 1072566 986816 912196 849946 800042
56818 800042 761665 734037 716799 709334 710465 719593 737602 765775 804435 853715 915025 989628
$$ packed form
56902C46723m496l775k684j242M7Q50J671L142M908O057O674P991J0766J4315
56888C90947J7678K0989K4799K8330K9364K6240J9382J0606J430p301j4552j8955
56876E28957j9938j8388j5735j2746r536o177k662J402O261J1336J5748J9514
56864D98036K3639K9063L6069M4501N3708O1867O5964O3023N1588L2558R220j3663
56852I55573l1731m2770m6918m5624m0813l4448k7855k1127j3740n757K063R348
56840F56201J6589K4467L3310M3359N5045O8622Q3553R7666J06485J03993Q5885
56829A375175N3020J1675k9621o3528q5616r4901r3638q5750p4620o2250m9904
56818H00042l8377k7628j7238p465J131R128J8009K8173L8660M9280O1310P4603
$$ plain form
56806 989628 1074733 1161437 1236902 1288573 1307685 1291501 1244168 1175143 1095504 1014662 939105
56795 939105 872369 815188 766374 724591 689452 660858 638044 619981 606486 598278 596085 600225
56783 600225 611103 629478 655746 688597 724089 755923 777131 782464 770134 742022 702596 657283
56771 657283 610905 566678 526164 489926 458088 430449 406555 385943 368202 352718 338687
56760 338687 325690 314164 304984 298515 294227 291181 288658 286278 283873 281577 279939 279560 280542 282527
56746 282527 285303 288994 293476 298140 302776 308396 316517 327681 341234 356565 373852 393442 415191
56733 415191 438798 464188 491033 518186 543990 567019 586391 601793 613440 621724 626728 628560
56721 628560 628262 627614 627616 627838 627758 628003 629433 631744 634057 636539 640257 645465 651109 656154 660465 664096
$$ packed form
56806I89628Q5105Q6704P5465N1671J9112j6184m7333o9025p9639q0842p5557
56795I39105o6736n7181m8814m1783l5139k8594k2814j8063j3495q208k193M140
56783F00225J0878J8375K6268L2851L5492L1834K1208N333j2330k8112l9426m5313
56771F57283m6378m4227m0514l6238l1838k7639k3894k0612j7741j5484j4031
56760C38687j2997j1526r180o469m288l046k523k380k405k296j638l79R82J985
56746B82527K776L691M482M664M636N620Q121J1164J3553J5331J7287J9590K1749
56733D15191K3607K5390K6845K7153K5804K3029J9372J5402J1647Q284N004J832
56721F28560k98o48KK22q0K45J430K311K313K482L718N208N644N045M311L631
$$ plain form
56705 664096 666608 667571 667080 665158 661045 653640 642609 628720 613145 596616 579255 561055 542408
56692 542408 524079 506723 490715 476503 464675 455424 448270 442682 438535 435537 432682 429005 424660
56679 424660 420542 416949 413374 409606 406277 404139 403478 404492 407607 412953 419931 427675 435636 443448
56665 443448 450503 456101 459982 462480 464195 465646 467232 469398 472646 477151 482342 487181 491036 494021
56651 494021 496174 496717 494689 490195 484486 478762 473346 468121 463309 459556 457452 457143 458326 460639 464128
56636 464128 469218 476041 484028 492338 500459 508035 514448 519154 522313 524537 526027 526545 526226 525786 525681
56621 525681 525626 525293 525029 525482 526764 528408 530004 531438 532545 532880 532062 530171 527581 524422 520488 515780
56605 515780 510912 506675 503297 500447 497856 495488 493076 490028 486031 481298 475961 469661 462087 453464
$$ packed form
56705F64096K512R63m91j922m113p405j1031j3889j5575j6529j7361j8200j8647
56692E42408j8329j7356j6008j4212j1828r251p154n588m147k998k855l677m345
56679D24660m118l593l575l768l329k138o61J014L115N346O978P744P961P812
56665D43448P055N598L881K498J715J451J586K166L248M505N191M839L855K985
56651D94021K153N43k028m494n709n724n416n225m812l753k104l09J183K313L489
56636D64128N090O823P987Q310Q121P576O413M706L159K224J490N18l19m40j05
56621E25681n5l33k64M53J282J644J596J434J107L35q18j891k590l159l934m708
56605E15780m868m237l378k850k591k368k412l048l997m733n337o300p574q623
$$ plain form
56591 453464 444111 433864 422381 409776 396507 382957 369558 357040 345907 335816 326019 316442
56579 316442 307899 301230 296550 293344 290974 289153 288180 288655 290796 294181 298360 303445 309847 317693 326790
56564 326790 336884 347626 358581 369633 381098 392987 404460 414431 422537 429102 434474 438869
56552 438869 442542 445461 446974 446394 443865 440136 435520 429591 421901 412543 401976 390682 379097 367609
56538 367609 356511 346064 336507 327932 320327 313849 308775 305129 302706 301603 302259 304839 309026 314593
56524 314593 321472 328966 335588 340253 343092 344648 344958 343945 342076 339861 337219 333902 330007 325515
56510 325515 320024 313656 307521 302399 297638 292277 286614 281576 277103 272405 267481 263174 259847 257170
56496 257170 255114 254140 254333 255213 256384 257684 258899 260038 261640 264040 266724 269155 271626 274360 276442
$$ packed form
56591D53464r353j0247j1483j2605j3269j3550j3399j2518j1133j0091r797r577
56579C16442q543o669m680l206k370j821r73M75K141L385M179N085O402P846R097
56564C26790J0094J0742J0955J1052J1465J1889J1473R971Q106O565N372M395
56552D38869L673K919J513n80k529l729m616n929p690r358j0567j1294j1585j1488
56538C67609j1098j0447r557q575p605o478n074l646k423j103O56K580M187N567
56524C14593O879P494O622M665K839J556L10j013j869k215k642l317l895m492
56510C25515n491o368o135n122m761n361n663n038m473m698m924m307l327k677
56496B57170k056r74J93Q80J171J300J215J139J602K400K684K431K471K734K082
$$ plain form
56481 276442 277026 277079 278389 281008 283242 284097 284166 284021 283319 281972 280767 280211 279776 278766 276968 274135 269927
56464 269927 264804 260012 256208 252932 249773 247110 245305 244069 243150 242833 243289 244064 244674 245201 246039 247555
56448 247555 250103 253717 257696 261158 264058 267060 270451 273964 277573 281525 285588 289170 292209 295026
56434 295026 297380 298746 299521 300724 302402 303498 303518 303095 302642 301737 300343 299387 299526 300386 301603 303592
56418 303592 306640 310156 313463 316488 319075 320529 320561 319987 319757 319873 319803 319397 318809 318007 316848 315284 313183
56401 313183 310357 306934 303255 299280 294697 289663 284795 280426 276512 273171 270501 267951 264842 261454
56387 261454 258590 256138 253264 250027 247454 245816 244234 242327 240844 240173 239607 238751 238354 238942 239857 240467
56371 240467 241241 242670 244097 244608 244324 243892 243418 242781 242463 243129 244773 246872 249046 251081 252741 254021
$$ packed form
56481B76442N84N3J310K619K234Q55O9j45p02j347j205n56m35j010j798k833m208
56464B69927n123m792l804l276l159k663j805j236r19l17M56P75O10N27Q38J516
56448B47555K548L614L979L462K900L002L391L513L609L952M063L582L039K817
56434B95026K354J366P75J203J678J096K0m23m53r05j394r56J39Q60J217J989
56418C03592L048L516L307L025K587J454L2n74k30J16p0m06n88q02j159j564k101
56401C13183k826l423l679l975m583n034m868m369l914l341k670k550l109l388
56387B61454k864k452k874l237k573j638j582j907j483o71n66q56l97N88R15O10
56371B40467P74J429J427N11k84m32m74o37l18O66J644K099K174K035J660J280
$$ plain form
56355 254021 255198 256371 257338 258044 258627 258991 259087 259546 261052 263001 263864 263136 261891 261077 260424 259452 258481
56338 258481 258007 257950 258042 258234 258365 258239 258277 259263 261250 263627 266343 269891 274004 277674 280729 283992 287550
56321 287550 290355 292043 293726 296275 299194 301812 304200 306223 307139 307014 307207 308512 310085 311092 312173
56306 312173 314260 317170 320414 324225 328748 333230 337159 341209 346080 351347 356475 361994 368610 376000
56292 376000 383480 391051 398859 406497 413811 421499 430015 438667 446767 454782 463412 472332 480879 489247
56278 489247 498088 507597 517808 529124 541743 555230 569356 584650 601566 620015 640297 663506
56266 663506 690184 719484 750366 782752 816806 852082 888157 925192 963041 1000606 1036810
56255 1036810 1071403 1104236 1134619 1161968 1186234 1207279 1224833 1239362 1251798 1261945 1268375
$$ packed form
56355B54021J177J173R67P06N83L64R6M59J506J949Q63p28j245q14o53r72r71
56338B58481m74n7R2J92J31j26L8R86J987K377K716L548M113L670L055L263L558
56321B87550K805J688J683K549K919K618K388K023R16j25J93J305J573J007J081
56306C12173K087K910L244L811M523M482L929M050M871N267N128N519O616P390
56292C76000P480P571P808P638P314P688Q516Q652Q100Q015Q630Q920Q547Q368
56278D89247Q841R509J0211J1316J2619J3487J4126J5294J6916J8449K0282K3209
56266F63506K6678K9300L0882L2386L4054L5276L6075L7035L7849L7565L6204
56255A036810L4593L2833L0383K7349K4266K1045J7554J4529J2436J0147O430
$$ plain form
56244 1268375 1270222 1267762 1260919 1248869 1231597 1210149 1184783 1154672 1120142 1083238 1045264 1005695
56232 1005695 964513 923545 884245 846154 808933 774007 742554 713666 686203 660901 638912
56221 638912 619727 602238 586498 572810 560353 548408 537759 529325 522504 516224 510428 505252
56209 505252 500104 494951 491092 489300 488614 488304 489430 492955 497886 502851 507906 513185 517500 520058 522014
56194 522014 524539 526990 528749 531157 535587 541197 546640 552407 559333 566390 572288 577897 584714 592141
56180 592141 598613 604268 610271 616567 622545 628862 636417 644417 651537 658074 665022 672156 678995 686525
56166 686525 695903 706533 717329 728670 741211 754142 766739 780304 796452 814801 834385 855876
56154 855876 880179 906423 933907 964665 1001656 1045590 1095917 1153630 1220666 1297878 1386240
$$ packed form
56244A268375J847k460o843j2050j7272k1448k5366l0111l4530l6904l7974l9569
56232A005695m1182m0968l9300l8091l7221l4926l1453k8888k7463k5302k1989
56221F38912j9185j7489j5740j3688j2457j1945j0649q434o821o280n796n176
56209E05252n148n153l859j792o86l10J126L525M931M965N055N279M315K558J956
56194E22014K525K451J759K408M430N610N443N767O926P057N898N609O817P427
56180E92141O472N655O003O296N978O317P555Q000P120O537O948P134O839P530
56166F86525R378J0630J0796J1341J2541J2931J2597J3565J6148J8349J9584K1491
56154H55876K4303K6244K7484L0758L6991M3934N0327N7713O7036P7212Q8362
$$ plain form
56143 1386240 1489009 1610395 1753394 1921311 2119807 2354441 2626617 2933234 3267701
56134 3267701 3618004 3965525 4289831 4575559 4814617 5005453 5154058 5273434 5376897
56125 5376897 5470472 5552412 5617301 5657682 5664881 5634295 5570855 5486614 5392838 5295270 5193560
56114 5193560 5080422 4942344 4765887 4545014 4282118 3985033 3666448 3343591 3033071
56105 3033071 2745244 2485240 2256886 2061803 1896656 1755970 1637004 1538585 1457071 1387862
56095 1387862 1329594 1282600 1244453 1211382 1182870 1160308 1142088 1124673 1107752 1093759 1082943
56084 1082943 1073344 1065014 1059597 1056227 1052331 1048159 1046263 1046872 1047969 1049354 1052426 1056640 1060437 1064868
56070 1064868 1071977 1080549 1087964 1095200 1105253 1117619 1129313 1140381 1153315 1167946 1182177 1196853
$$ packed form
56143A386240J02769J21386J42999J67917J98496K34634K72176L06617L34467
56134C267701L50303L47521L24306K85728K39058J90836J48605J19376J03463
56125E376897R3575Q1940O4889M0381P199l0586o3440q4241r3776r7568j01710
56114E193560j13138j38078j76457k20873k62896k97085l18585l22857l10520
56105C033071k87827k60004k28354j95083j65147j40686j18966r8419q1514o9209
56095A387862n8268m6994l8147l3071k8512k2562j8220j7415j6921j3993j0816
56084A082943r599q330n417l370l896m172j896O09J097J385L072M214L797M431
56070A064868P109Q572P415P236J0053J2366J1694J1068J2934J4631J4231J4676
$$ plain form
56058 1196853 1214416 1233500 1250429 1265500 1282184 1300725 1318299 1334985 1353637 1374176 1393852
56047 1393852 1412898 1434081 1456988 1478755 1500100 1524470 1551529 1577643 1602550 1629255 1657693
56036 1657693 1685093 1712364 1743495 1778858 1815887 1855989 1903563 1958186 2014968 2072609 2133845
56025 2133845 2198133 2261634 2324600 2390977 2460436 2528527 2594770 2662569 2731158 2796086 2857872
56014 2857872 2921494 2987160 3050576 3112593 3179116 3250982 3323651 3397573 3478809 3568481 3661884
56003 3661884 3759111 3866048 3983608 4106794 4235725 4376532 4529956 4690537 4858709 5041854
55993 5041854 5241751 5453176 5676563 5919154 6181656 6457038 6744526 7050717 7374669
55984 7374669 7706767 8045198 8398489 8769189 9151496 9548308 9973673 10434780 10929255
$$ packed form
56058A196853J7563J9084J6929J5071J6684J8541J7574J6686J8652K0539J9676
56047A393852J9046K1183K2907K1767K1345K4370K7059K6114K4907K6705K8438
56036A657693K7400K7271L1131L5363L7029M0102M7574N4623N6782N7641O1236
56025B133845O4288O3501O2966O6377O9459O8091O6243O7799O8589O4928O1786
56014B857872O3622O5666O3416O2017O6523P1866P2669P3922Q1236Q9672R3403
56003C661884R7227J06937J17560J23186J28931J40807J53424J60581J68172J83145
55993E041854J99897K11425K23387K42591K62502K75382K87488L06191L23952
55984G374669L32098L38431L53291L70700L82307L96812M25365M61107M94475
$$ plain form
55975 10929255 11463877 12056788 12717019 13442053 14240301 15134424 16137742 17251569 18492723
55966 18492723 19899107 21502122 23322385 25402663 27817567 30644290 33959385 37876592
55958 37876592 42550046 48124248 54719004 62478153 71590158 82255800 94716008 109363770
55950 109363770 126785672 147689921 172913974 203518040 240492841 283703827 330582033
55943 330582033 375727718 412094357 433252966 435570353 419330180 388396440 348623635
55936 348623635 305805908 264199771 226169388 192647522 163736250 139106263 118255282
55929 118255282 100692795 85996867 73766543 63601358 55146395 48114334 42252754
55922 42252754 37329342 33160471 29618675 26597589 23994559 21732383 19766177 18055500
$$ packed form
55975A0929255N34622N92911O60231P25034P98248Q94123J003318J113827J241154
55966A8492723J406384J603015J820263K080278K414904K826723L315095L917207
55958C7876592M673454N574202O594756P759149R112005J0665642J2460208J4647762
55950A09363770J7421902K0904249K5224053L0604066L6974801M3210986M6878206
55943C30582033M5145685L6366639K1158609K317387j6240173l0933740l9772805
55936C48623635m2817727m1606137l8030383l3521866k8911272k4629987k0850981
55929A18255282j7562487j4695928j2230324j0165185q454963p032061n861580
55922D2252754m923412m168871l541796l021086k603030k262176j966206j710677
$$ plain form
55914 18055500 16551452 15217537 14038294 12997346 12067090 11227336 10473659 9799123 9185995
55905 9185995 8622744 8111461 7650875 7228275 6835083 6474705 6147957 5845378 5560719
55896 5560719 5298101 5059238 4836654 4625802 4431282 4254980 4090086 3932796 3788429
55887 3788429 3660108 3542352 3431337 3330761 3242134 3159715 3080740 3010848 2953973 2906154
55877 2906154 2864417 2832524 2812718 2800414 2791754 2787616 2785406 2775557 2751355 2714404 2666134 2602464
55865 2602464 2522003 2431521 2337898 2241721 2143507 2048899 1962429 1882606 1807852 1740938 1683166
55854 1683166 1630638 1580848 1536958 1501239 1470237 1440564 1413627 1390582 1368530 1345876 1325885
55843 1325885 1310933 1298701 1287814 1281517 1281759 1285091 1288372 1293202 1300808 1307996 1312450 1317155 1325707
$$ packed form
55914A8055500j504048j333915j179243j040948r30256q39754p53677o74536o13128
55905I185995n63251n11283m60586m22600l93192l60378l26748l02579k84659
55896E560719k62618k38863k22584k10852j94520j76302j64894j57290j44367
55887C788429j28321j17756j11015j00576q8627q2419p8975o9892n6875m7819
55877B906154m1737l1893j9806j2304q660m138k210r849k4202l6951m8270o3670
55865B602464q0461r0482r3623r6177r8214r4608q6470p9823p4754o6914n7772
55854A683166n2528m9790m3890l5719l1002k9673k6937k3045k2052k2654j9991
55843A325885j4952j2232j0887o297K42L332L281M830P606P188M454M705Q552
$$ plain form
55830 1325707 1338164 1355113 1380244 1414017 1449020 1475738 1489123 1486692 1466001 1428930 1384188
55819 1384188 1340704 1301575 1267563 1242000 1227957 1224470 1229928 1245920 1273981 1311749 1355893 1405365
55807 1405365 1458115 1507799 1547439 1573765 1585291 1579652 1556173 1518032 1468877 1410217 1344503
55796 1344503 1277000 1211563 1148026 1086502 1030363 981683 937384 893412 849517 806860 764672
55785 764672 722923 684956 653509 626814 601942 579182 559832 542679 526276 512009 501388
55774 501388 492696 483537 474329 466307 458607 450360 443079 437924 433126 427049 421176 417084 413280 408200
55760 408200 403603 401601 400853 399067 396898 395927 395044 392290 388339 384831 381114 375781 369603 363987 358368
55745 358368 351974 346173 342187 338591 334020 330265 329637 331191 332643 334106 336877 340489 344152 349356
$$ packed form
55830A325707J2457J6949K5131L3773L5003K6718J3385k431k0691l7071m4742
55819A384188m3484l9129l4012k5563j4043l487N458J5992K8061L7768M4144M9472
55807A405365N2750M9684L9640K6326J1526n639k3479l8141m9155n8660o5714
55796A344503o7503o5437o3537o1524n6139m8680m4299m3972m3895m2657m2188
55785G64672m1749l7967l1447k6695k4872k2760j9350j7153j6403j4267j0621
55774E01388q692r159r208q022p700q247p281n155m798o077n873m092l804n080
55760D08200m597k002p48j786k169r71q83k754l951l508l717n333o178n616n619
55745C58368o394n801l986l596m571l755o28J554J452J463K771L612L663N204
$$ plain form
55731 349356 357833 368476 379219 390274 402486 414226 423126 429515 435061 439334 440700 439282 436154
55718 436154 430811 422295 411696 400905 390088 378896 368744 361302 356046 351836 349444 349968 352323
55705 352323 355044 359055 365829 374287 382417 390622 400562 412016 423923 437400 454720 476261 501256
55692 501256 530570 565846 606826 652395 703487 762199 828644 901097 978238 1058294 1136515
55681 1136515 1206175 1261977 1300921 1321283 1323522 1311423 1289779 1261472 1228708 1195651 1166981
55670 1166981 1144642 1128612 1120003 1120614 1130045 1145934 1166492 1190115 1212834 1228746 1233040 1222929
55658 1222929 1196567 1153704 1097249 1032077 962354 891334 822466 758277 698790 643169 592272
55647 592272 547588 508601 473489 441619 413217 387478 363417 341760 323616 308061 293410
$$ packed form
55731C49356Q477J0643J0743J1055J2212J1740Q900O389N546M273J366j418l128
55718D36154n343q516j0599j0791j0817j1192j0152p442n256m210k392N24K355
55705C52323K721M011O774Q458Q130Q205R940J1454J1907J3477J7320K1541K4995
55692E01256K9314L5276M0980M5569N1092N8712O6445P2453P7141Q0056P8221
55681A136515O9660N5802L8944K0362K239j2099k1644k8307l2764l3057k8670
55670A166981k2339j6030q609O11R431J5889K0558K3623K2719J5912M294j0111
55658A222929k6362m2863n6455o5172o9723p1020o8868o4189n9487n5621n0897
55647E92272m4684l8987l5112l1870k8402k5739k4061k1657j8144j5555j4651
$$ plain form
55636 293410 280057 269507 261306 253583 246067 239985 235365 230965 226561 222836 219332 214934 210119 206370
55622 206370 203602 200486 197006 194357 192451 189953 186723 183989 182176 180661 179527 179415 179769 179354 178427
55607 178427 178348 179142 179527 179194 179013 179096 178694 178009 178106 179041 179968 180961 182836 185253 186916 187588 188146 188837 189225
55588 189225 189608 190655 191845 192117 191794 192080 192974 193571 193988 194992 196068 195953 194878 194261 194437 194654 195011
55571 195011 196252 197861 198521 198391 198939 200658 202967 206051 210645 216106 220941 225243 230519 237225 244679
55556 244679 253324 264732 279159 295315 312812 332730 355599 380950 409171 441722 479140 520748
55544 520748 566538 617188 671781 727393 781278 831483 874947 907140 924470 925694 910822 880459
55532 880459 836794 783565 724446 662592 601510 544406 492312 444485 400862 362495 329539
$$ packed form
55636B93410j3353j0550q201p723p516o082m620m400m404l725l504m398m815l749
55622B06370k768l116l480k649j906k498l230k734j813j515j134j12L54m15r27
55607A78427p9P94L85l33j81Q3m02o85R7R35R27R93J875K417J663O72N58O91L88
55588A89225L83J047J190K72l23K86Q94N97M17J004J076j15j075o17J76K17L57
55571A95011J241J609O60j30N48J719K309L084M594N461M835M302N276O706P454
55556B44679Q645J1408J4427J6156J7497J9918K2869K5351K8221L2551L7418M1608
55544E20748M5790N0650N4593N5612N3885N0205M3464L2193J7330J224j4872l0363
55532H80459m3665n3229n9119o1854o1082n7104n2094m7827m3623l8367l2956
$$ plain form
55521 329539 300753 275307 253294 234189 216724 200784 187661 177839 170024 162848 156067 149716
55509 149716 143571 137851 133188 129555 126352 123549 121453 119518 116842 113707 111109 109054 106919 105067
55495 105067 104242 103745 102284 100334 99327 98633 95992 91182 86766 84568 83728 82917 82203 81837 81197 79937
55479 79937 78538 76986 74516 71281 68633 67217 66345 65690 65813 66561 66785 66205 65826 66039 66116 66029 66817 68510
55461 68510 69628 69431 68849 68564 68085 67415 67619 68836 69555 68878 67728 66961 66126 65075 65001 66580 68651
55444 68651 69905 70610 71599 72881 74211 75808 77556 78657 78883 79027 79531 79903 79985 80378 81102 81312 80925
55427 80925 80930 81543 81769 81417 81720 83117 84223 83981 83122 82455 81455 79739 78312 78077 78515 79045 80275 82638
55409 82638 85121 86611 87430 88393 89438 90177 90642 90576 89197 86672 84531 83599 82736 80681 77877 75424
$$ packed form
55521C29539k8786k5446k2013j9105j7465j5940j3123r822p815p176o781o351
55509A49716o145n720m663l633l203k803k096j935k676l135k598k055k135j852
55495A05067q25m97j461j950j007o94k641m810m416k198q40q11p14l66o40j260
55479G9937j399j552k470l235k648j416q72o55J23P48K24n80l79K13P7q7P88J693
55461F8510J118j97n82k85m79o70K04J217P19o77j150p67q35j051p4J579K071
55444F8651J254P05R89J282J330J597J748J101K26J44N04L72Q2L93P24K10l87
55427H0925NO13K26l52L03J397J106k42q59o67j000j716j427k35M38N30J230K363
55409H2638K483J490Q19R63J045P39M65o6j379k525k141r32q63k055k804k453
$$ plain form
55393 75424 73495 71975 71431 72125 73030 73098 72639 72431 72330 71785 70884 69948 68898 67842 67399 67651 67634 66620
55375 66620 65019 63417 61760 60119 59090 58725 58163 57017 55980 55483 55041 54573 54957 56469 57978 58550
55359 58550 58514 58204 57134 55348 54113 54174 54663 54719 54817 55435 55864 55515 55097 55299 55535 55136 54542 54257 53917
55340 53917 53481 53888 55349 56393 55938 54933 54630 54615 54031 53421 53758 54757 55604 56314 57001 56992 56054 55347 55710
55321 55710 56231 55939 55588 56115 56736 56386 55821 56261 57005 56571 55348 54916 55342 55237 54147 52911 51976 51189
55303 51189 51046 52347 54619 56464 57390 57936 58227 57836 56834 55675 54268 52451 51060 51103 52125 52694
55287 52694 52309 51642 51180 50883 50835 51035 50846 49882 49029 49350 50365 50766 50433 50373 50934 51547 52102 53124 54516
55268 54516 55377 55179 54140 52511 50454 48525 47350 46939 47048 47897 49640 51544 52619 52780 52553 52122
$$ packed form
55393G5424j929j520n44O94R05O8m59k08j01n45r01r36j050j056m43K52j7j014
55375F6620j601j602j657j641j029l65n62j146j037m97m42m68L84J512J509N72
55359E8550l6l10j070j786j235O1M89N6R8O18M29l49m18K02K36l99n94k85l40
55340E3917m36M07J461J044m55j005l03j5n84o10L37R99Q47P10O87rr38p07L63
55321E5710N21k92l51N27O21l50n65M40P44m34j223m32M26j05j090j236r35p87
55303E1189j43J301K272J845R26N46K91l91j002j159j407j817j391M3J022N69
55287E2694l85o67m62k97m8K00j89r64q53L21J015M01l33o0N61O13N55J022J392
55268E4516Q61j98j039j629k057j929j175m11J09Q49J743J904J075J61k27m31
$$ plain form
55252 52122 51553 51346 51815 52455 52867 53587 54950 55989 55772 55104 55404 56526 57207 57130 56992 56936 56598 56464 57463
55233 57463 59248 60432 60591 60619 60990 61119 60630 60006 59693 59583 59574 59742 59942 60078 60632 62028 63662 64510 64465
55214 64465 64108 63512 62392 61159 60617 60697 60586 59957 59037 57799 56244 55220 55667 57139 58257 58489 58349
55197 58349 58021 57131 55844 54941 54727 54872 55245 55838 56069 55413 54566 54740 55848 56661 56699 56655 56919 57056 56889
55178 56889 56822 56818 56284 55278 54729 55107 55830 56251 56387 56501 56818 57706 59317 61003 61972 62336 62612 62465 61203
55159 61203 59360 58423 58812 59456 59623 59905 60965 62509 64074 65895 68348 71243 74179 77142 80440 84370
55143 84370 88965 93630 97259 99297 100402 101343 101604 100005 96443 92002 87538 83225 79279 75990 73068
55128 73068 70129 67788 67111 67955 68987 69463 69858 70561 71132 71179 70934 70613 70048 69319 68979 69323 70013 70574
$$ packed form
55252E2122n69k07M69O40M12P20J363J039k17o68L00J122O81p7j38n6l38j34R99
55233E7463J785J184J59K8L71J29m89o24l13j10rJ68K00J36N54J396J634Q48m5
55214F4465l57n96j120j233n42Q0j11o29r20j238j555j024M47J472J118K32j40
55197E8349l28q90j287r03k14J45L73N93K31o56q47J74J108Q13L8m4K64J37j67
55178E6889o7mn34j006n49L78P23M21J36J14L17Q88J611J686R69L64K76j47j262
55159F1203j843r37L89O44J67K82J060J544J565J821K453K895K936K963L298L930
55143H4370M595M665L629K038J105R41K61j599l562m441m464m313l946l289k922
55128G3068k939k341o77Q44J032M76L95P03N71M7k45l21n65p29l40L44O90N61
$$ plain form
55110 70574 70732 70386 69831 69823 70705 71767 72230 72466 73237 74164 74139 73042 71822 71104 70943 71747 74016 77088
55092 77088 79458 80494 80721 80492 79703 78856 78916 79874 80688 80915 81200 81934 82691 83280 84142 85384 86512 87379
55074 87379 88311 89141 89276 88906 88949 89679 90630 91898 94103 96911 99199 101115 104332 109607 115527 120441
55058 120441 124357 128113 131883 135402 138651 141489 143343 143919 143517 142244 139821 136555 133516 131246 129212
55043 129212 126912 124479 121837 118445 114426 110805 107994 105130 101574 97999 95242 93068 90871 88700
55029 88700 86878 85392 84354 84258 85150 86257 87016 87713 88631 89441 89919 90391 90897 90838 89992 89022 88465 88146
55011 88146 88109 89046 91198 93771 96096 98390 100742 102485 103421 104638 107189 110848 115088 120378 127494
54996 127494 136288 146202 157405 170461 185344 201691 219684 239959 263008 289128 318333 349669
$$ packed form
55110G0574J58l46n55qQ82J062M63K36P71R27k5j097j220p18j61Q04K269L072
55092G7088K370J036K27k29p89q47O0R58Q14K27K85P34P57N89Q62J242J128Q67
55074H7379R32Q30J35l70M3P30R51J268K205K808K288J916L217N275N920M914
55058A20441L916L756L770L519L249K838J854N76m02j273k423l266l039k270k034
55043A29212k300k433k642l392m019l621k811k864l556l575k757k174k197k171
55029H8700j822j486j038r6Q92J107P59O97R18Q10M78M72N06n9q46r70n57l19
55011H8146l7R37K152K573K325K294K352J743R36J217K551L659M240N290P116
54996A27494Q794R914J1203J3056J4883J6347J7993K0275K3049K6120K9205L1336
$$ plain form
54984 349669 381106 410531 436263 456347 468528 471754 467005 455935 439539 418867 395965 372951
54972 372951 350671 329155 308766 289967 272571 256218 241214 228020 216403 205918 196794 189520
54960 189520 183941 179639 176782 175777 176288 177449 178871 180851 183878 188448 195077 203952 214837 227734
54946 227734 243203 261652 282774 306061 331182 357276 382461 404621 422141 433455 436756 431064
54934 431064 417197 397083 372638 345760 318518 292324 267341 243491 221542 202465 186292
54923 186292 172465 160868 151638 144382 138487 133912 130867 128961 127456 126144 125264 124695 123916 122635
54909 122635 120913 118882 116790 115051 113774 112469 110665 108433 106027 103463 100845 98464 96138 93122
54895 93122 89296 85777 83628 82550 81561 80381 79306 78265 76958 75603 74658 73990 73085 71920 70968 70494
$$ packed form
54984C49669L1437K9425K5732K0084J2181L226m749j1070j6396k0672k2902k3014
54972C72951k2280k1516k0389j8799j7396j6353j5004j3194j1617j0485r124p274
54960A89520n579m302k857j005N11J161J422J980L027M570O629Q875J0885J2897
54946B27734J5469J8449K1122K3287K5121K6094K5185K2160J7520J1314L301n692
54934D31064j3867k0114k4445k6878k7242k6194k4983k3850k1949j9077j6173
54923A86292j3827j1597r230p256n895m575l045j906j505j312q80n69p79j281
54909A22635j722k031k092j739j277j305j804k232k406k564k618k381k326l016
54895I3122l826l519k149j078r89j180j075j041j307j355r45o68r05j165r52m74
$$ plain form
54879 70494 70405 70569 70800 70809 70640 70773 71339 71714 71410 70884 70861 71337 71903 72582 73638 74919 76037 76890 77489
54860 77489 77712 77751 78314 79787 81688 83501 85499 88104 91081 94027 97075 100389 103601 106559 110005
54845 110005 114555 119608 124246 128755 134229 141125 149246 158829 170592 184911 201888 221919 245232
54832 245232 271088 298394 326801 356071 384451 408825 426591 436658 438743 432868 419843 401452
54820 401452 379713 356263 332347 308889 286502 265785 247356 231250 216697 203110 190936
54809 190936 180963 173253 167414 163403 161178 160013 159149 158828 159789 162108 165502 170460 177908 187840 199376
54794 199376 212103 226374 242366 259955 279621 302322 328189 356124 384808 413196 439778
54783 439778 462362 479083 489153 492497 489458 481216 469861 457554 445814 435548 427200 420633
$$ packed form
54879G0494q9J64K31Rj69J33N66L75l04n26k3M76N66O79J056J281J118Q53N99
54860G7489K23L9N63J473J901J813J998K605K977K946L048L314L212K958L446
54845A10005M550N053M638M509N474O896Q121R583J1763J4319J6977K0031K3313
54832B45232K5856K7306K8407K9270K8380K4374J7766J0067K085n875j3025j8391
54820D01452k1739k3450k3916k3458k2387k0717j8429j6106j4553j3587j2174
54809A90936r973p710n839m011k225j165q64l21R61K319L394M958P448R932J1536
54794A99376J2727J4271J5992J7589J9666K2701K5867K7935K8684K8388K6582
54783D39778K2584J6721J0070L344l039q242j1355j2307j1740j0266q348o567
$$ plain form
54771 420633 415195 410000 403868 395272 383031 367189 348804 328951 308308 287474 267001 247095
54759 247095 227871 209882 193895 180232 168808 159612 152486 146617 140989 135373 130235 125752 121596
54746 121596 117707 114498 112156 110336 108747 107467 106511 105574 104438 103263 102308 101624 101124 100765 100671 101167
54730 101167 102475 104213 105534 106006 106006 106005 106007 106069 106693 108112 109727 110966 112194 114034 116297 118442 120651
54713 120651 123469 126653 129368 131396 133311 135524 137944 140441 142923 145132 147045 149174 151719 153836
54699 153836 154734 155068 156129 157846 158899 158813 158745 159961 162535 165850 169399 172732 175375 177271 178838 180467
54683 180467 182371 184812 187916 191343 194774 198510 202941 207736 212444 217581 224102 232046 240835 250837
54669 250837 263343 278887 296826 316914 340084 367213 397962 431245 465870 500190 531762
$$ packed form
54771D20633n438n195o132q596j2241j5842j8385j9853k0643k0834k0473j9906
54759B47095j9224j7989j5987j3663j1424r196p126n869n628n616n138m483m156
54746A21596l889l209k342j820j589j280r56r37j136j175r55o84n00l59r4M96
54730A01167J308J738J321M72%jKO2O24J419J615J239J228J840K263K145K209
54713A20651K818L184K715K028J915K213K420K497K482K209J913K129K545K117
54699A53836Q98L34J061J717J053q6o8J216K574L315L549L333K643J896J567J629
54683A80467J904K441L104L427L431L736M431M795M708N137O521P944Q789J0002
54669B50837J2506J5544J7939K0088K3170K7129L0749L3283L4625L4320L1572
$$ plain form
54658 531762 557856 575950 583885 580505 566573 544417 516390 484177 449463 414260 380247 348423
54646 348423 319537 294048 271579 251266 232885 216919 203482 192111 182682 175442 169883 164697
54634 164697 159285 154334 150429 147075 143618 140252 137521 135533 134187 133453 132904 131720 129756 127986 127388
54619 127388 127938 129102 130641 132415 133982 134991 135574 135971 136188 136315 136630 137072 137212 137046 137232 138253 139934
54602 139934 142064 144759 147892 150873 153426 155960 158778 161559 164013 166341 168647 170571 171903 172918
54588 172918 173743 174125 174165 174452 174892 174356 172165 169188 166689 164824 163078 161474 160344 159424 158231 157090
54572 157090 156781 157313 157908 158228 158799 160119 161997 163961 165842 167813 170212 173442 177833 183470 190306
54557 190306 198424 208088 219545 232825 247598 263243 279285 295785 313054 330855 348021 362706
$$ packed form
54658E31762K6094J8094P935l380j3932k2156k8027l2213l4714l5203l4013l1824
54646C48423k8886k5489k2469k0313j8381j5966j3437j1371r429p240n559n186
54634A64697n412m951l905l354l457l366k731j988j346p34n49j184j964j770n98
54619A27388N50J164J539J774J567J009N83L97K17J27L15M42J40j66J86J021J681
54602A39934K130K695L133K981K553K534K818K781K454K328K306J924J332J015
54588A72918Q25L82M0K87M40n36k191k977k499j865j746j604j130r20j193j141
54572A57090l09N32N95L20N71J320J878J964J881J971K399L230M391N637O836
54557A90306Q118R664J1457J3280J4773J5645J6042J6500J7269J7801J7166J4685
$$ plain form
54545 362706 372877 376921 374460 366636 355198 341308 325567 308866 292353 276608 261602 247547
54533 247547 234955 223790 213418 203664 195099 187960 181701 176010 171424 168331 166059 163635 160907
54520 160907 158317 156056 154035 152335 151126 150365 149956 149959 150371 151021 151873 153073 154509 155742 156497 156740 156257
54503 156257 154840 153000 151707 151202 150879 150580 151049 152623 154436 155593 156313 157173 158007 158422 158763 159601 160655
54486 160655 161146 160960 160660 160499 160138 159294 158078 156704 155315 154002 152721 151316 149856 148710 148039 147504
54470 147504 146702 145503 143805 141391 138375 135386 132953 131074 129599 128542 127732 126702 125254 123680 122157
54455 122157 120421 118334 116184 114126 111984 109930 108680 108570 109055 109589 110319 111403 112311 112443 111895 111039
54439 111039 109863 108287 106639 105276 104198 103410 103025 102644 101454 99552 98334 98747 99898 100220 99391 98231
$$ packed form
54545C62706J0171M044k461p824j1438j3890j5741j6701j6513j5745j5006j4055
54533B47547j2592j1165j0372r754q565p139o259n691m586l093k272k424k728
54520A60907k590k261k021j700j209p61m09LM12O50Q52J200J436J233P55K43m83
54503A56257j417j840j293n05l23k99M69J574J813J157P20Q60Q34M15L41Q38J054
54486A60655M91j86l00j61l61q44j216j374j389j313j281j405j460j146o71n35
54470A47504q02j199j698k414l016k989k433j879j475j057q10j030j448j574j523
54455A22157j736k087k150k058k142k054j250j10M85N34P30J084R08J32n48q56
54439A11039j176j576j648j363j078p88l85l81j190j902j218M13J151L22q29j160
$$ plain form
54423 98231 97326 96783 96875 97874 99405 100776 101718 102264 102352 102249 102820 104451 106184 106842 106637 106644 107027 106955 106142
54404 106142 105348 105218 105560 105973 106421 106963 107487 107903 108224 108454 108708 109262 110134 110956 111647 112715 114360 115808
54386 115808 116343 116498 117372 119127 121130 123257 125878 128693 130742 131819 132818 134369 135969 136888 137221 137567
54370 137567 138120 138520 138384 137706 136815 135969 134948 133276 131012 128963 127710 126772 125228 122880 120251 117737
54354 117737 115313 112909 110489 107940 105374 103328 102065 100970 99275 97173 95450 94219 92802 90856
54340 90856 88853 87316 86231 85356 84589 83894 83258 82801 82570 82247 81406 80047 78594 77486 76986 77101 77415
54323 77415 77390 77164 77585 78990 80508 81136 80937 80463 79599 78017 76325 75600 75896 76238 76072 75707 75278 74325
54305 74325 72682 70942 69707 68989 68605 68574 68907 69485 70308 71464 72768 73792 74279 74226 73712 73071 72963 73728
$$ packed form
54423I8231r05n43R2R99J531J371R42N46Q8j03N71J631J733O58k05PL83p2q13
54404A06142p94j30L42M13M48N42N24M16L21K30K54N54Q72Q22O91J068J645J448
54386A15808N35J55Q74J755K003K127K621K815K049J077R99J551J600R19L33L46
54370A37567N53M00j36o78q91q46j021j672k264k049j253r38j544k348k629k514
54354A17737k424k404k420k549k566k046j263j095j695k102j723j231j417j946
54340I0856k003j537j085q75p67o95o36m57k31l23q41j359j453j108n00J15L14
54323G7415k5k26M21J405J518O28j99m74q64j582j692p25K96L42j66l65m29r53
54305G4325j643j740j235p18l84l1L33N78Q23J156J304J024M87n3n14o41j08P65
$$ plain form
54287 73728 74874 75756 76423 77180 77674 77317 76352 75565 75040 74115 72576 70964 69611 68278 66862 65636 64624
54270 64624 63545 62525 62108 62371 62792 63154 63797 64787 65562 65698 65311 64489 63046 61117 59336 58064 57068
54253 57068 56206 55846 56236 57025 57767 58444 59185 59868 60254 60231 59826 59322 59303 60078 61098 61501 61269 61203 61759 62593
54233 62593 63340 64083 64850 65343 65433 65313 64934 63942 62398 60985 60252 60181 60666 61753 63166 64289 64914 65457
54215 65457 66144 66611 66556 66148 65460 64161 62258 60565 59878 60059 60357 60287 59807 59001 58049 57290 56973 57056 57410
54196 57410 57979 58617 59036 59058 58687 57903 56716 55421 54438 53860 53547 53575 54066 54602 54401 53254 51819 50940
54178 50940 51118 52492 54644 56378 56560 55423 54361 54187 54309 53902 53116 52629 52659 53007 53678 54853 56444
54161 56444 58037 59164 59574 59475 59577 60486 61979 63339 64345 65410 66669 67653 68055 68157 68216 68061 67634
$$ packed form
54287G3728J146Q82O67P57M94l57r65p87n25r25j539j612j353j333j416j226j012
54270F4624j079j020m17K63M21L62O43R90P75J36l87q22j443j929j781j272r96
54253E7068q62l60L90P89P42O77P41O83L86k3m05n04j9P75J020M03k32o6N56Q34
54233F2593P47P43P67M93R0j20l79r92j544j413p33p1M85J087J413J123O25N43
54215F5457O87M67n5m08o88j299j903j693o87J81K98p0m80q06r52p59l17Q3L54
54196E7410N69O38M19K2l71p84j187j295r83n78l13K8M91N36k01j147j435q79
54178E0940J78J374K152J734J82j137j062j74J22m07p86m87L0L48O71J175J591
54161E6444J593J127M10r9J02R09J493J360J006J065J259R84M02J02N9j55m27
$$ plain form
54144 67634 67396 67795 68734 69838 70845 71566 71890 72033 72340 72679 72498 71602 70318 68857 67180 65643 64996
54127 64996 65466 66468 67447 68305 68803 68414 67203 66061 65577 65398 65152 65139 65453 65200 63486 60766 58419
54110 58419 57281 57207 57696 58283 58546 58413 58356 58870 59916 61148 62411 63603 64392 64452 63803 62634 61117 59619
54092 59619 58704 58621 59102 59843 60715 61354 61213 60407 59904 60409 61552 62605 63396 64013 64279 64256 64710 66239 68203
54073 68203 69303 69141 68600 68762 69874 71309 72170 72059 71447 71095 70985 70340 68932 67653 67278 67388 67233
54056 67233 67090 67857 69571 71248 72108 72278 72357 72918 74347 76475 78384 79160 78884 78438 78379 78548 78749 79189
54038 79189 80021 80936 81462 81475 81302 81504 82573 84624 87286 90021 92608 95288 98505 102509 107071 111555
54022 111555 115458 118977 122846 127555 132842 137978 142357 145917 149220 152998 157318 161334 164287 166498
$$ packed form
54144F7634k38L99R39J104J007P21L24J43L07L39j81q96j284j461j677j537o47
54127F4996M70J002R79Q58M98l89j211j142m84j79k46j3L14k53j714k720k347
54110E8419j138p4M89N87K63j33n7N14J046J232J263J192P89O0o49j169j517j498
54092E9619r15q3M81P41Q72O39j41q06n03N05J143J053P91O17K66k3M54J529J964
54073F8203J100j62n41J62J112J435Q61j11o12l52j10o45j408j279l75J10j55
54056F7233j43P67J714J677Q60J70P9N61J429K128J909P76k76m46n9J69K01M40
54038G9189Q32R15N26J3j73K02J069K051K662K735K587K680L217M004M562M484
54022A11555L903L519L869M709N287N136M379L560L303L778M320M016K953K211
$$ plain form
54008 166498 168796 171201 173022 174140 175194 176393 177144 177143 176822 176356 175248 173480 172085 171749 171662 170512
53992 170512 167973 164493 160354 155838 151656 148301 145403 142597 140475 139732 139790 139235 137422 134775 131795
53977 131795 128645 125540 122721 120118 117689 115801 114630 113526 111816 109836 108310 106968 104839 101810
53963 101810 98907 97000 96061 95674 95417 94741 93303 91526 90088 88911 87452 85894 85073 85141 85280 84989
53947 84989 84746 85094 85939 87127 88817 90751 91945 91799 91013 90726 91163 91775 92415 93681 96069 99351 102938
53930 102938 106564 110335 114179 117505 119645 120627 121243 122193 123500 125000 127026 130046 133800 137412 140394
53915 140394 143063 145949 149261 153048 157373 162097 166857 171535 176475 182021 187985 193847 199372 204907
53901 204907 211068 218200 226101 234213 242008 249200 255695 261592 267170 272564 277444 281308 284175 286618
$$ packed form
54008A66498K298K405J821J118J054J199P51jl21m66j108j768j395l36q7j150
53992A70512k539l480m139m516m182l355k898k806k122p43N8n55j813k647k980
53977A31795l150l105k819k603k429j888j171j104j710j980j526j342k129l029
53963A01810k903j907r39l87k57o76j438j777j438j177j459j558q21O8J39k91
53947H4989k43L48Q45J188J690J934J194j46p86k87M37O12O40J266K388L282L587
53930A02938L626L771L844L326K140R82O16R50J307J500K026L020L754L612K982
53915A40394K669K886L312L787M325M724M760M678M940N546N964N862N525N535
53901B04907O161P132P901Q112P795P192O495N897N578N394M880L864K867K443
$$ plain form
53887 286618 288973 290911 292018 292373 292325 292020 291474 290740 289702 287975 285236 281394 276323 269991 263057 256703
53871 256703 251428 246539 241297 235990 231342 227446 223960 220818 217996 214990 211339 207336 203506 199668
53857 199668 195341 190794 186857 183814 181256 178865 176528 173821 170256 166044 161855 157773 153252 148218
53843 148218 143472 139819 137361 135781 134769 134012 133166 131996 130291 127766 124464 121060 118293 116240 114604
53828 114604 113470 113186 113704 114638 115747 116743 116944 115951 114475 113677 113732 113855 113667 113603 113987 114537 114980 115386
53810 115386 115756 115965 116273 117222 118942 121088 123432 125861 127973 129523 131206 133982 137555 140491 142046
53795 142046 142953 144133 145653 147313 149266 151504 153505 155028 156619 158851 161592 164456 167397 170483
53781 170483 173597 176756 180130 183426 185825 186975 187484 188075 188843 189680 190740 191971 192783 192798 192459 192289
$$ packed form
53887B86618K355J938J107L55m8l05n46p34j038j727k739l842n071o332o934o354
53871B56703n275m889n242n307m648l896l486l142k822l006l651m003l830l838
53857A99668m327m547l937l043k558k391k337k707l565m212m189m082m521n034
53843A48218m746l653k458j580j012p57q46j170j705k525l302l404k767k053j636
53828A14604j134k84N18R34J109R96K01r93j476p98N5J23j88o4L84N50M43M06
53810A15386L70K09L08R49J720K146K344K429K112J550J683K776L573K936J555
53795A42046R07J180J520J660J953K238K001J523J591K232K741K864K941L086
53781A70483L114L159L374L296K399J150N09N91P68Q37J060J231Q12J5l39j70
$$ plain form
53765 192289 191928 190513 187809 184471 181333 178767 176554 174133 171152 167900 164957 162406 159815 157013
53751 157013 154288 151763 149243 146913 145332 144403 143106 140844 138372 136721 135781 134708 133292 132120 131586
53736 131586 131401 131017 129960 127915 125025 122067 119834 118322 116866 115010 112891 110833 108910 107046 105335
53721 105335 104118 103695 103884 104015 103575 102749 101984 101174 99829 98050 96639 95991 95500 94415 92746 90966
53705 90966 89374 88295 88401 90155 93062 95988 98084 99131 99256 98826 98534 99117 100879 103578 106558 108843
53689 108843 109494 108332 106166 104037 102327 100849 99497 98440 97873 97965 98944 100852 103236 105427 107123
53674 107123 108461 109577 110462 111281 112463 114220 116138 117585 118530 119628 121293 122973 123726 123443 122986 123117
53658 123117 123889 125206 127283 130046 132741 134771 136495 138494 140512 141931 142866 143860 144783 145130 145261 146216
$$ packed form
53765A92289l61j415k704l338l138k566k213k421k981l252k943k551k591k802
53751A57013k725k525k520k330j581r29j297k262k472j651r40j073j416j172n34
53736A31586j85l84j057k045k890k958k233j512j456j856k119k058j923j864j711
53721A05335j217m23J89J31m40q26p65q10j345j779j411o48m91j085j669j780
53705I0966j592j079J06J754K907K926K096J047J25m30k92N83J762K699K980K285
53689A08843O51j162k166k129j710j478j352j057n67R2R79J908K384K191J696
53674A07123J338J116Q85Q19J182J757J918J447R45J098J665J680P53k83m57J31
53658A23117P72J317K077K763K695K030J724J999K018J419R35R94R23L47J31R55
$$ plain form
53642 146216 148204 150320 151917 153239 154445 155119 155130 155042 155180 155156 154737 154312 154018 153319 152070 151139 151323 152334
53624 152334 153493 154686 155904 156576 156188 155109 154046 153175 152424 152043 152138 152130 151491 150587 150003 149411 148019 145900
53606 145900 144007 142926 142338 141671 140765 139856 139354 139539 140175 140626 140667 140777 141278 141737 141819 142212 143920 146856
53588 146856 149894 152169 153668 154729 155667 156915 158868 161467 164247 166843 169174 171351 173656 176356
53574 176356 179192 181435 182851 184200 186257 188771 191001 192909 195050 197562 200071 202487 205041 207527
53560 207527 209279 210102 210659 211703 213308 214996 216292 217132 218008 219652 222276 225196 227491 228864 229514
53545 229514 229385 228097 225588 222413 219387 217119 215767 214915 213890 212478 211150 210341 209799 208955 207605
53530 207605 205810 203572 201059 198860 197443 196626 196093 196054 196755 197709 198153 198088 198084 198190 197843 196912 196058 195923
$$ packed form
53642A46216J988K116J597J322J206O74J1q8J38k4m19m25k94o99j249r31J84J011
53624A52334J159J193J218O72l88j079j063q71p51l81R5qo39r04n84n92j392k119
53606A45900j893j081n88o67r06r09n02J85O36M51M1J10N01M59Q2L93J708K936
53588A46856L038K275J499J061R38J248J953K599K780K596K331K177K305K700
53574A76356K836K243J416J349K057K514K230J908K141K512K509K416K554K486
53560B07527J752Q23N57J044J605J688J296Q40Q76J644K624K920K295J373O50
53545B29514j29j288k509l175l026k268j352q52j025j412j328q09n42q44j350
53530B07605j795k238k513k199j417q17n33l9P01R54M44o5mJ06l47r31q54j35
$$ plain form
53512 195923 196542 197690 199256 201089 202904 204483 205725 206546 207112 208047 209897 212472 215149 217720 220453
53497 220453 223434 226493 229792 233875 238956 244616 250322 255919 261622 267912 275381 284224 293830 303325
53483 303325 312517 321920 331909 342324 352968 364068 376103 389464 404263 420201 436662 453247
53471 453247 470151 487735 505933 524425 543107 561895 580311 597915 615047 632587 651037
53460 651037 670383 690761 712566 735868 760320 785735 812254 839847 868088 896442 924283
53449 924283 950657 974586 995705 1014236 1030406 1044372 1056586 1067622 1077696 1087030 1096606 1107761
53437 1107761 1120871 1135208 1150225 1166142 1182873 1199166 1213502 1225467 1235712 1244809 1252613 1258551
53425 1258551 1262128 1263130 1261545 1257283 1250066 1239778 1226896 1212280 1196512 1179646 1161536 1142060
$$ packed form
53512A95923O19J148J566J833J815J579J242Q21N66R35J850K575K677K571K733
53497B20453K981L059L299M083N081N660N706N597N703O290P469Q843R606R495
53483C03325R192R403R989J0415J0644J1100J2035J3361J4799J5938J6461J6585
53471D53247J6904J7584J8198J8492J8682J8788J8416J7604J7132J7540J8450
53460F51037J9346K0378K1805K3302K4452K5415K6519K7593K8241K8354K7841
53449I24283K6374K3929K1119J8531J6170J3966J2214J1036J0074R334R576J1155
53437A107761J3110J4337J5017J5917J6731J6293J4336J1965J0245R097P804N938
53425A258551L577J002j585m262p217j0288j2882j4616j5768j6866j8110j9476
$$ plain form
53413 1142060 1121102 1098760 1075655 1052674 1030303 1008391 986530 964324 941462 917915 894011
53402 894011 869938 845368 820082 794876 771177 749732 730251 712288 695766 680538 666269
53391 666269 653157 642161 634077 628864 626201 626231 629203 634678 641613 649292 657947 668468 681559 697093
53377 697093 714296 732576 752064 773174 795897 819846 844740 870426 896599 923026 949931
53366 949931 977723 1006525 1036522 1068513 1103360 1140963 1180560 1222037 1266127 1313138 1362277
53355 1362277 1412467 1463064 1513530 1563277 1612439 1662255 1714079 1768179 1823629 1878913 1932409
53344 1932409 1982892 2029998 2074006 2115102 2153403 2189759 2225758 2262529 2299998 2337603 2375155
53333 2375155 2412746 2450469 2488575 2527201 2565373 2600761 2630817 2653580 2666992 2668418 2655957
$$ packed form
53413A142060k0958k2342k3105k2981k2371k1912k1861k2206k2862k3547k3904
53402H94011k4073k4570k5286k5206k3699k1445j9481j7963j6522j5228j4269
53391F66269j3112j0996q084n213k663L0K972N475O935P679Q655J0521J3091J5534
53377F97093J7203J8280J9488K1110K2723K3949K4894K5686K6173K6427K6905
53366I49931K7792K8802K9997L1991L4847L7603L9597M1477M4090M7011M9139
53355A362277N0190N0597N0466M9747M9162M9816N1824N4100N5450N5284N3496
53344A932409N0483M7106M4008M1096L8301L6356L5999L6771L7469L7605L7552
53333B375155L7591L7723L8106L8626L8172L5388L0056K2763J3412J426j2461
$$ plain form
53322 2655957 2630060 2593118 2547668 2495580 2438563 2378373 2316241 2252657 2187904 2122537 2057265
53311 2057265 1992632 1928808 1865559 1802555 1739890 1678047 1617085 1556187 1494396 1431702 1369091
53300 1369091 1307720 1248332 1191301 1136778 1084795 1035453 989005 945661 905554 869027 836651
53289 836651 808630 784386 763051 744195 727832 713916 702232 692701 685443 680447 677331 675471
53277 675471 674317 673683 673734 674650 676435 679215 683505 689652 697102 704800 712421 720586 729673 739142 748446
53262 748446 758054 769005 781856 796504 812610 829613 846748 863664 880911 899271 918845 939307
53250 939307 960749 983623 1007929 1033114 1058733 1084636 1110446 1135448 1159268 1182344 1205641
53239 1205641 1230137 1256517 1284781 1313883 1342035 1367679 1390155 1409427 1425408 1437696 1445801
$$ packed form
53322B655957k5897l6942m5450n2088n7017o0190o2132o3584o4753o5367o5272
53311B057265o4633o3824o3249o3004o2665o1843o0962o0898o1791o2694o2611
53300A369091o1371n9388n7031n4523n1983m9342m6448m3344m0107l6527l2376
53289H36651k8021k4244k1335j8856j6363j3916j1684r531p258m996l116j860
53277F75471j154o34N1R16J785K780M290O147P450P698P621Q165R087R469R304
53262G48446R608J0951J2851J4648J6106J7003J7135J6916J7247J8360J9574K0462
53250I39307K1442K2874K4306K5185K5619K5903K5810K5002K3820K3076K3297
53239A205641K4496K6380K8264K9102K8152K5644K2476J9272J5981J2288Q105
$$ plain form
53228 1445801 1449436 1448515 1442897 1432276 1416536 1396214 1372270 1345273 1315116 1281769 1245953 1208698
53216 1208698 1170530 1131648 1092772 1055158 1019647 986172 954427 924568 896863 870856 845286
53205 845286 818839 790812 761091 729781 696980 662793 627426 591294 555103 519797 486319
53194 486319 455369 427356 402427 380425 360927 343529 328128 314775 303297 293317 284612 277100
53182 277100 270464 264264 258570 253891 250148 246280 241503 236450 232280 228954 225282 220681 215985 212278
53168 212278 209659 207444 205037 202245 199137 195929 192753 189465 185966 182646 180022 177963 175845 173500
53154 173500 171337 169410 167172 164457 161980 160335 159072 157319 154935 152528 150653 149426 148670 148052 147240
53139 147240 146218 145218 144252 143065 141720 140747 140418 140272 139673 138487 136990 135468 134105 132852 131314
$$ packed form
53228A445801L635r21n618j0621j5740k0322k3944k6997l0157l3347l5816l7255
53216A208698l8168l8882l8876l7614l5511l3475l1745k9859k7705k6007k5570
53205H45286k6447k8027k9721l1310l2801l4187l5367l6132l6191l5306l3478
53194D86319l0950k8013k4929k2002j9498j7398j5401j3353j1478r980q705p512
53182B77100o636o200n694m679l743l868m777n053m170l326l672m601m696l707
53168B12278k619k215k407k792l108l208l176l288l499l320k624k059k118k345
53154A73500k163j927k238k715k477j645j263j753k384k407j875j227p56o18q12
53139A47240j022j000r66j187j345r73l29j46n99j186j497j522j363j253j538
$$ plain form
53124 131314 129251 127292 126367 126246 125548 123660 121716 121005 121265 121434 121333 121445 121497 120549 118484 116388 115311
53107 115311 115366 116114 117078 117749 117784 117436 117376 117928 118806 119579 120052 120183 120025 119754 119495 119210 119026 119414 120632
53088 120632 122124 122967 122810 122058 121314 121066 121675 123129 124880 126336 127456 128423 128893 128121 125878 122859
53072 122859 120123 118315 117266 116114 114049 111280 108991 107972 107614 106727 105016 103186 101914 101351 101406
53057 101406 101786 101852 101125 99883 98713 97600 96156 94649 93990 94596 95906 97157 98020 98406 98346 98290 98841
53040 98841 99909 100573 100111 98750 97256 96222 95906 96311 97058 97556 97555 97310 97158 97240 97656 98422 99058 98705 97053
53021 97053 94908 93525 93423 93963 93967 92760 90763 89048 88191 87687 86720 85286 84127 83727 83886 84260 84712
53004 84712 85070 85078 84777 84467 84095 83102 81174 78803 76867 75901 75942 76714 77732 78411 78370 77584 76315 75077
$$ packed form
53124A31314k063j959r25j21o98j888j944p11K60J69j01J12N2r48k065k096j077
53107A15311N5P48R64O71L5l48o0N52Q78P73M73J31j58k71k59k85j84L88J218
53088A20632J492Q43j57p52p44k48O09J454J751J456J120R67M70p72k243l019
53072A22859k736j808j049j152k065k769k289j019l58q87j711j830j272n63N5
53057A01406L80O6p27j242j170j113j444j507o59O06J310J251Q63L86o0n6N51
53040I8841J068O64m62j361j494j034l16M05P47M98jk45j52Q2M16P66O36l53j652
53021I7053k145j383j02N40Mj207j997j715q57n04r67j434j159m00J59L74M52
53004H4712L58Ql01l10l72r93j928k371j936r66M1P72J018O79m1p86j269j238
$$ plain form
52986 75077 74582 75238 76578 77517 77419 76690 76178 76224 76435 76208 75353 74252 73424 72822 71776 69875 67724 66388
52968 66388 66155 66344 66260 65848 65331 64795 64333 64148 64175 63965 63243 62336 61828 62015 62853 64136 65452 66254 66344
52949 66344 66214 66599 67641 68638 68717 67762 66639 66355 66959 67484 67111 66141 65549 65840 66731 67708 68384 68415 67705
52930 67705 66767 66313 66339 66102 65195 64174 63812 64186 64804 65269 65459 65293 64796 64295 64234 64748 65582 66398 67067
52911 67067 67633 68031 67886 66769 64785 62744 61514 61254 61501 61836 62126 62229 61984 61578 61528 62106 63010 63692
52893 63692 63792 63266 62405 61807 61988 62888 63952 64754 65293 65737 66219 66867 67656 68174 68012 67463 67336 67879 68361
52874 68361 68101 67504 67630 68984 71141 73400 75366 76880 77822 78197 78238 78254 78401 78730 79404 80655 82488
52857 82488 84566 86694 89331 93290 98738 104748 109904 113100 113712 111594 107325 102129 97018 92171 87480
$$ packed form
52986G5077m95O56J340R39r8p29n12M6K11k27q55j101q28o02j046j901k151j336
52968F6388k33J89q4m12n17n36m62j85K7k10p22r07n08J87Q38J283J316Q02R0
52949F6344j30L85J042R97P9r55j123k84O04N25l73r70n92K91Q91R77O76L1p10
52930F7705r38m54K6k37r07j021l62L74O18M65J90j66m97n01o1N14Q34Q16O69
52911F7067N66L98j45j117j984k041j230k60K47L35K90J03k45m06n0N78R04O82
52893F3692J00n26q61n98J81R00J064Q02N39M44M82O48P89N18j62n49j27N43M82
52874F8361k60n97J26J354K157K259J966J514R42L75M1J6J47L29O74J251J833
52857H2488K078K128K637L959N448O010N156L196O12k118m269n196n111m847m691
$$ plain form
52842 87480 83296 80040 77366 74461 71174 68226 66292 65385 65207 65490 65880 66025 65944 65888 65742 65048 63746
52825 63746 62382 61390 60613 59707 58678 57774 57195 57009 57090 57097 56797 56402 56221 56112 55814 55730 56642 58514 60253
52806 60253 60950 60765 60275 59594 58630 57739 57500 58041 58976 59926 60844 61897 63143 64212 64390 63377 61963
52789 61963 61417 62099 63170 63814 64160 64697 65380 65801 65869 65812 65727 65585 65504 65635 65871 65951 65809 65615 65574 65763 66045
52768 66045 66082 65701 65286 65493 66377 67172 67183 66690 66674 67727 69461 70948 71678 72083 73072 75046 77576 80152
52750 80152 82845 85850 88752 90859 92111 92979 93516 93149 91463 88584 84801 80484 76443 73624 72145
52735 72145 71213 70101 68676 66930 64822 62826 61799 61913 62394 62609 62716 62877 62694 61948 61166 60804 60531
52718 60531 59978 59566 59840 60408 60400 59655 58758 58061 57402 56668 56120 56124 56867 58241 59746 60703 60811 60310 59536 58734
$$ packed form
52842H7480m184l256k674k905l287k948j934r07j78K83L90J45q1n6j46o94j302
52825F3746j364r92p77r06j029r04n79j86Q1Pl00l95j81j09k98q4R12J872J739
52806F0253O97j85m90o81r64q91k39N41R35R50R18J053J246J069J78j013j414
52789F1963n46O82J071O44L46N37O83M21O8n7q5j42q1J31K36Q0j42j94m1J89K82
52768F6045L7l81m15K07Q84P95J1m93j6J053J734J487P30M05R89J974K530K576
52750H0152K693L005K902K107J252Q68N37l67j686k879l783m317m041k819j479
52735G2145r32j112j425j746k108j996j027J14M81K15J07J61j83p46p82l62k73
52718F0531n53m12K74N68qp45q97o97o59p34n48MP43J374J505R57J08n01p74q02
$$ plain form
52698 58734 58375 58958 60202 61100 61228 61330 62068 62856 62669 61517 60359 59897 60171 61005 62109 62900 62889 62186
52680 62186 61198 60112 59075 58533 58783 59481 60097 60540 60781 60353 59016 57634 57508 58847 60605 61801 62385
52663 62385 62814 63355 63919 64219 64048 63684 63854 65036 67101 69873 73469 77548 80768 81826 80787 78682
52647 78682 76139 73214 70262 67970 66458 65230 64078 63316 63009 62684 62015 61204 60539 60088 59941 60212 60645
52630 60645 60703 60197 59454 58838 58500 58630 59406 60596 61607 62083 62173 62180 62219 62218 62036 61704 61705 62702 64618 66375 67076
52609 67076 67125 67562 68553 69312 69357 69052 68857 68775 68681 68663 68826 69210 69910 70884 71751 72261 72823 73984 75495 76580
52589 76580 77031 77401 78086 78899 79598 80144 80430 80389 80456 81181 82283 82786 82227 81114 80057 79175 78541 78388 78557
52570 78557 78438 77777 76968 76187 74957 73027 71075 69982 69826 70102 70519 71026 71358 71152 70472 69861 69871 70709
$$ packed form
52698E8734l59N83J244Q98J28J02P38P88j87j152j158m62K74Q34J104P91j1p03
52680F2186r88j086j037n42K50O98O16M43K41m28j337j382j26J339J758J196N84
52663F2385M29N41N64L00j71l64J70J182K065K772L596M079L220J058j039k105
52647G8682k543k925k952k292j512j228j152p62l07l25o69q11o65m51j47K71M33
52630F0645N8n06p43o16l38J30P76J190J011M76R0PL9jj82l32JR97J916J757P01
52609F7076M9M37R91P59M5l05j95q2r4j8J63L84P00R74Q67N10N62J161J511J085
52589G6580M51L70O85Q13O99N46K86m1O7P25J102N03n59j113j057q82o34j53J69
52570G8557j19o61q09p81j230j930j952j093j56K76M17N07L32k06o80o11J0Q38
$$ plain form
52552 70709 72195 73836 75074 75640 75651 75439 75395 75834 76677 77344 77357 77003 76989 77512 78180 78821 79742 81058 82382
52533 82382 83452 84494 85661 86534 86596 85930 85146 84780 84937 85300 85360 84773 83599 82090 80415 78838 77858
52516 77858 77680 77766 77510 77197 77557 78520 79248 79412 79490 79673 79491 78956 78990 80051 81170 81213 80491 80222 80834 81686
52496 81686 82216 82523 82862 83277 83812 84509 85105 85169 84654 84000 83606 83485 83503 83682 84103 84628 84926 84806 84506 84455
52476 84455 84683 84663 83986 83010 82502 82771 83506 84369 85215 85776 85719 85145 84580 84313 84196 84158 84360 84711 84775 84396
52456 84396 83978 83922 84220 84690 85136 85165 84534 83891 84424 86396 88662 90092 90819 91579 92456 93024 93288 93736 94619
52437 94619 95737 96743 97294 97171 96709 96797 97980 99799 101383 102452 103298 104123 104853 105358 105459 104976 104163
52420 104163 103704 103815 103701 102469 100243 97879 95905 94374 93426 93268 93658 94065 94284 94396 94273 93732 93050
$$ packed form
52552G0709J486J641J238N66J1k12m4M39Q43O67J3l54j4N23O68O41R21J316J324
52533H2382J070J042J167Q73O2o66p84l66J57L63O0n87j174j509j675j577r80
52516G7858j78Q6k56l13L60R63P28J64P8J83j82n35L4J061J119M3p22k69O12Q52
52496H1686N30L07L39M15N35O97N96O4n15o54l94j21J8J79M21N25K98j20l00n1
52476H4455K28k0o77r76n08K69P35Q63Q46N61n7n74n65k67j17l8K02L51O4l79
52456H4396m18n6K98M70M46K9o31o43N33J972K266J430P27P60Q77N68K64M48Q83
52437I4619J118J006N51j23m62Q8J183J819J584J069Q46Q25P30N05J01m83q13
52420A04163m59J11j14j232k226k364j974j531r48j58L90M07K19J12j23n41o82
$$ plain form
52403 93050 92684 92512 91936 90757 89442 88499 88094 88260 88996 90095 91322 92724 94359 95837 96688 97078 97551
52386 97551 98064 97983 97089 95916 94896 93844 92615 91671 91575 92323 93483 94642 95409 95429 94813 94241 94285 94836
52368 94836 95465 96060 96738 97405 97847 98106 98319 98348 98019 97681 98015 99162 100470 101348 102005 103030 104504 105979
52350 105979 107222 108469 109734 110351 109668 108038 106681 106468 107241 108374 109572 110714 111303 110728 109147 107624
52334 107624 107128 107647 108496 109225 109859 110402 110601 110381 110170 110486 111303 112165 112907 113886 115394 117147 118668 120010
52316 120010 121719 124065 126590 128550 129685 130460 131599 133487 135955 138566 140951 142781 143637 143273 142127
52301 142127 141174 140948 140921 140118 138194 135683 133448 132099 131709 131701 131259 130292 129751 130533 132261 133776 134658 135508
52283 135508 136719 137850 138537 139334 141128 144083 147575 150969 154233 157944 162746 168531 174246 178897 182675
$$ packed form
52403I3050l66j72n76j179j315r43m05J66P36J099J227J402J635J478Q51L90M73
52386I7551N13q1q94j173j020j052j229r44r6P48J160J159P67K0o16n72M4N51
52368I4836O29N95O78O67M42K59K13K9l29l38L34J147J308Q78O57J025J474J475
52350A05979J243J247J265O17o83j630j357k13P73J133J198J142N89n75j581j523
52334A07624m96N19Q49P29O34N43J99k20k11L16Q17Q62P42R79J508J753J521J342
52316A20010J709K346K525J960J135P75J139J888K468K611K385J830Q56l64j146
52301A42127r53k26k7q03j924k511k235j349l90qm42r67n41P82J728J515Q82Q50
52283A35508J211J131O87P97J794K955L492L394L264L711M802N785N715M651L778
$$ plain form
52268 182675 186461 190275 193119 194608 195877 198196 201333 204036 205740 207068 208829 211194 213874 216555
52254 216555 219063 221342 223404 225176 226479 227223 227533 227687 228098 229197 230961 232635 233446 233598 234015 235108
52238 235108 236471 237858 239571 241631 243453 244854 246543 249014 251672 253738 255412 257388 259837 262578
52224 262578 265634 268793 271233 272580 273884 276513 280375 284279 287796 291592 295958 300179 303573 306256
52210 306256 308629 310927 313477 316610 320011 322813 324703 326413 328880 332358 336442 340452 343676 345827
52196 345827 347474 349548 352316 355275 358125 361158 364547 367918 370983 374058 377569 381416 385221 388901
52182 388901 392681 396795 401393 406528 411975 417273 422158 426768 431316 435735 439835 443649 447460 451583
$$ packed form
52268A82675L786L814K844J489J269K319L137K703J704J328J761K365K680K681
52254B16555K508K279K062J772J303P44L10J54M11J099J764J674Q11J52M17J093
52238B35108J363J387J713K060J822J401J689K471K658K066J674J976K449K741
52224B62578L056L159K440J347J304K629L862L904L517L796M366M221L394K683
52210C06256K373K298K550L133L401K802J890J710K467L478M084M010L224K151
52196C45827J647K074K768K959K850L033L389L371L065L075L511L847L805L680
52182C88901L780M114M598N135N447N298M885M610M548M419M100L814L811M123
$$ [...]
##END NTUPLES=NMR SPECTRUM
##END=
