##TITLE=NES1035_50200289_9243015_XzrnRGQSAB
##JCAMPDX= 6.0         $$ Bruker NMR JCAMP-DX V2.0
##DATA TYPE= NMR SPECTRUM
##DATA CLASS= NTUPLES
##ORIGIN= BRUKER
##OWNER= Administrator
$$ 1.72 TOPSPIN		Version 2.1
$$ 2015-07-01 21:29:18.617 -0700  Administrator@X
$$ Compression mode = diff/dup
##.OBSERVE FREQUENCY= 400.02188249412
##.OBSERVE NUCLEUS= ^1H
##.ACQUISITION MODE= SIMULTANEOUS (DQD)
##.ACQUISITION SCHEME= undefined
##.AVERAGES= 8
##.DIGITISER RES= 22
##SPECTROMETER/DATA SYSTEM= spect
##.PULSE SEQUENCE= zg30
##.SOLVENT NAME= COFFEE_meoh
##.SHIFT REFERENCE= INTERNAL, COFFEE_meoh, 1, 14.98509
##AUDIT TRAIL= $$ (NUMBER, WHEN, WHO, WHERE, PROCESS, VERSION, WHAT)
$$ ##TITLE= Audit trail, TOPSPIN		Version 2.1
$$ ##JCAMPDX= 5.01
$$ ##ORIGIN= Bruker BioSpin GmbH
$$ ##OWNER= Administrator
$$ $$ E:\/data/COFFEE/nmr/NES1035_50200289_9243015_XzrnRGQSAB/20/pdata/1/auditp.txt
$$ ##AUDIT TRAIL=  $$ (NUMBER, WHEN, WHO, WHERE, PROCESS, VERSION, WHAT)
(   1,<2015-07-01 21:29:11.367 -0700>,<Administrator>,<X>,<go>,<TOPSPIN 2.1>,
      <created by zg
	started at 2015-07-01 21:28:05.461 -0700,
	POWCHK enabled, PULCHK disabled,
       configuration hash MD5:
       21 0F 79 D6 B3 7B B4 F6 88 20 88 DB 03 48 BD 9F
       data hash MD5: 64K
       40 09 CF 14 FD D5 8A 06 6F D4 1B 32 99 5F A3 C1>)
(   2,<2015-07-01 21:29:14.508 -0700>,<Administrator>,<X>,<proc1d>,<TOPSPIN 2.1>,
      <Start of raw data processing
       efp LB = 0 FT_mod = 6 PKNL = 1 PHC0 = 0 PHC1 = 0 SI = 32K 
       data hash MD5: 32K
       10 7C 26 E6 A0 EB 08 56 5D A5 20 DD AE ED 69 98>)
(   3,<2015-07-01 21:29:14.805 -0700>,<Administrator>,<X>,<proc1d>,<TOPSPIN 2.1>,
      <pk PHC0 = 93.75732 PHC1 = 0 
       data hash MD5: 32K
       62 10 BF 3D A8 ED 73 43 E9 E8 FA E7 1F 07 50 46>)
(   4,<2015-07-01 21:29:14.914 -0700>,<Administrator>,<X>,<proc1d>,<TOPSPIN 2.1>,
      <abs ABSG = 1 
       data hash MD5: 32K
       E3 24 ED CB 78 59 1F 27 F1 E5 06 81 05 A5 8F C0>)
(   5,<2015-07-01 21:29:14.961 -0700>,<Administrator>,<X>,<proc1d>,<TOPSPIN 2.1>,
      <abs ABSG = 2 
       data hash MD5: 32K
       F4 57 86 70 AF D7 AB F1 26 F1 DA F7 85 21 2C 0E>)
(   6,<2015-07-01 21:29:15.024 -0700>,<Administrator>,<X>,<proc1d>,<TOPSPIN 2.1>,
      <abs ABSG = 3 
       data hash MD5: 32K
       B0 5C CC 2D D1 F5 A9 03 46 AD 2C ED 78 4C F0 F0>)
(   7,<2015-07-01 21:29:15.086 -0700>,<Administrator>,<X>,<proc1d>,<TOPSPIN 2.1>,
      <abs ABSG = 4 
       data hash MD5: 32K
       42 9E 7F 93 DA 76 BB 4B 9A 47 43 80 54 9E 33 8D>)
(   8,<2015-07-01 21:29:15.149 -0700>,<Administrator>,<X>,<proc1d>,<TOPSPIN 2.1>,
      <abs ABSG = 5 
       data hash MD5: 32K
       5F EE 86 33 C9 96 AF A4 35 B9 A3 45 99 83 3E C3>)
$$ ##END=
$$ 
$$ $$ hash MD5
$$ $$ 3D 22 95 8C CE 92 F0 19 A5 D5 C8 2A 15 43 DA BF
##$RELAX= 
##$RELAX= 
##$RELAX= 
##$RELAX= 
##$RELAX= 
##$RELAX= 
##$RELAX= 
$$ Bruker specific parameters
$$ --------------------------
##$DU= <E:\>
##$EXPNO= 20
##$NAME= <NES1035_50200289_9243015_XzrnRGQSAB>
$$ [...]
150 150 150 150 150 150 150 150
##$TP07= 0
##$TPNAME0= <>
##$TPNAME1= <>
##$TPNAME2= <>
##$TPNAME3= <>
##$TPNAME4= <>
##$TPNAME5= <>
##$TPNAME6= <>
##$TPNAME7= <>
##$TPOAL= (0..7)
0.5 0.5 0.5 0.5 0.5 0.5 0.5 0.5
##$TPOFFS= (0..7)
0 0 0 0 0 0 0 0
##$TUNHIN= 0
##$TUNHOUT= 0
##$TUNXOUT= 0
##$USERA1= <user>
##$USERA2= <user>
##$USERA3= <user>
##$USERA4= <user>
##$USERA5= <user>
##$V9= 5
##$VALIST= <valist>
##$VCLIST= <CCCCCCCCCCCCCCC>
##$VD= 0
##$VDLIST= <DDDDDDDDDDDDDDD>
##$VPLIST= <PPPPPPPPPPPPPPP>
##$VTLIST= <TTTTTTTTTTTTTTT>
##$WBST= 2048
##$WBSW= 25
##$XGAIN= (0..3)
0 0 0 0
##$XL= 0
##$YL= 0
##$YMAX_a= 572453
##$YMIN_a= -479556
##$ZGOPTNS= <>
##$ZL1= 120
##$ZL2= 120
##$ZL3= 120
##$ZL4= 120
##$ABSF1= 14.98509
##$ABSF2= -5.573092
##$ABSG= 5
##$ABSL= 3
##$ALPHA= 0
##$AQORDER= 0
##$ASSFAC= 0
##$ASSFACI= 0
##$ASSFACX= 0
##$ASSWID= 0
##$AUNMP= <proc_prof1d_extract_pilot.lims>
##$AXLEFT= 0
##$AXNAME= <>
##$AXNUC= <1H>
##$AXRIGHT= 0
##$AXTYPE= 0
##$AXUNIT= <>
##$AZFE= 0.1
##$AZFW= 0.1
##$BCFW= 0
##$BC_mod= 0
##$BYTORDP= 0
##$COROFFS= 0
##$CY= 15
##$DATMOD= 1
##$DC= 0
##$DFILT= <>
##$DTYPP= 0
##$F1P= 0
##$F2P= 0
##$FCOR= 0.5
##$FTSIZE= 32768
##$FT_mod= 6
##$GAMMA= 0
##$GB= 0
##$INTBC= 1
##$INTSCL= 1
##$ISEN= 128
##$LB= 0
##$LEV0= 0
##$LPBIN= 0
##$MAXI= 10000
##$MC2= 0
##$MEAN= 0
##$ME_mod= 0
##$MI= 0
##$NCOEF= 0
##$NC_proc= -8
##$NLEV= 6
##$NOISF1= 0
##$NOISF2= 0
##$NSP= 0
##$NTH_PI= 0
##$NZP= 0
##$OFFSET= 14.98509
##$PC= 1
##$PHC0= 93.75732
##$PHC1= 0
##$PH_mod= 1
##$PKNL= yes
##$PPARMOD= 0
##$PPDIAG= 0
##$PPIPTYP= 0
##$PPMPNUM= 2147483647
##$PPRESOL= 1
##$PSCAL= 4
##$PSIGN= 0
##$PYNMP= <proc.py>
##$REVERSE= no
##$SF= 400.02
##$SI= 32768
##$SIGF1= 0
##$SIGF2= 0
##$SINO= 400
##$SIOLD= 32768
##$SPECTYP= <>
##$SREGLST= <1H.CDCl3>
##$SSB= 0
##$STSI= 32768
##$STSR= 0
##$SW_p= 8223.68421052631
##$SYMM= 0
##$S_DEV= 0
##$TDeff= 65536
##$TDoff= 0
##$TI= <>
##$TILT= no
##$TM1= 0
##$TM2= 0
##$TOPLEV= 0
##$USERP1= <user>
##$USERP2= <user>
##$USERP3= <user>
##$USERP4= <user>
##$USERP5= <user>
##$WDW= 1
##$XDIM= 32768
##$YMAX_p= 438208003
##$YMIN_p= -689060
##$CURPLOT= <Network HP LaserJet P1505>
##$CURPRIN= <$Network HP LaserJet P1505>
##$DFORMAT= <normdp>
##$LAYOUT= <+/1D_H.xwp>
##$LFORMAT= <normlp>
##$PFORMAT= <normpl>
##$SURQMSG= 1
$$ End of Bruker specific parameters
$$ ---------------------------------
##NTUPLES= NMR SPECTRUM
##VAR_NAME=  FREQUENCY,     SPECTRUM/REAL,   SPECTRUM/IMAG
##SYMBOL=    X,             R,               I
##VAR_TYPE=  INDEPENDENT,   DEPENDENT,       DEPENDENT
##VAR_FORM=  AFFN,          ASDF,            ASDF
##VAR_DIM=   32768,         32768,           32768
##UNITS=     HZ,            ARBITRARY UNITS, ARBITRARY UNITS
##FACTOR=    0.250966925370066, 1,           1
##FIRST=     8223.43324360094, -172850,      -216413
##LAST=      0,             20070,           19266
##MIN=       0,             -689060,         0
##MAX=       8223.43324360094, 438208003,    0
$$ Real data points
##PAGE= N=1
##DATA TABLE= (X++(R..R)), XYDATA
$$ [...]
19517c43843d266k05912m760d2974j40136c8063F0969J07181f552A6852O6542
19506H3394M187a11641A7492f9526k35433M3744D8601R2401a72264E4830b87202
19494a81011n7780C5172o691e4680E6713B7193c53916B12792a64405O9369o5871
19483a60907A2681a72582P3109A0364K95144j38835c04380r4099Q7015h7031r9298
19472a86329o1884i8228r8299O5747j47785e5296j32554A72723b9733j85989c070
19460A21627c43738c5235a308p5643j16227n3507F9035a6589B71554f9352B7171
19448c24415A18646c41595A24683d751j69255b2790k20715h5914E4722J30297
19438A85019a42664O5836C5206g8985p2466r0991j92405e8012j48932m9310R2447
$$ plain form
19517 -343843 -4266 -210178 -214938 -42974 -183110 -38063 60969 168150 -6552 16852 83394
19506 83394 87581 -111641 17492 -69526 -304959 -261215 48601 141002 -172264 54830 -287202
19494 -181011 -238791 35172 28481 -54680 56713 27193 -353916 212792 -164405 -95036 -160907
19483 -160907 12681 -172582 -99473 10364 305508 166673 -304380 -398479 -311464 -87031 -186329
19472 -186329 -248213 -98228 -196527 -130780 -278565 -55296 -187850 172723 -29733 -215722 -3070
19460 121627 -343738 -35235 -1308 -76951 -193178 -246685 69035 -16589 271554 -69352 27171
19448 -324415 118646 -341595 124683 -4751 -174006 -22790 -243505 -85914 54722 185019
19438 185019 -142664 -76828 35206 -78985 -151451 -242442 -434847 -58012 -206944 -256254 -163807
19427a63807d5588C02997I4440a30294H3348O1716J44848H0053b55587H5104D813
19415G4107a74090j46219G2784a13803a8094j92512j78036g8746l11201D139a04170
19403E9693J58405a08549p9943L5431O2827c8655J4578A76913B7439b24167M7854
19392a76313k98395D5078e3604j79443A0793Q1025f3000q3339b3725A57381f2893
19380c63273a10404A20032M9154p4368J12069A565b78483f8976H5636d024j94642
19369a98666A70849N4102C9584J29934c21449J22701E5054L5697l4629J75130
19359B31252A5169J15466c54859A71154a00321m734j26225A21470a43195L8799
19349a04396E9544a004B62709b53776a5659j50890c9850a015k16070j27557h5562
$$ plain form
19427 -163807 -45588 302997 94440 -130294 83348 145064 289912 80053 -255587 85104 4813
19415 74107 -174090 -320309 72784 -113803 -18094 -210606 -388642 -78746 -389947 4139 -104170
19403 59693 218098 -108549 -188492 -153061 -90234 -38655 -24077 176913 27439 -224167 -176313
19392 -176313 -474708 45078 -53604 -233047 10793 91818 -63000 -146339 -23725 157381 -62893
19380 -363273 -110404 120032 169186 94818 206887 1565 -278483 -68976 85636 -4024 -198666
19369 -198666 170849 224951 39584 169518 -321449 -198748 55054 90751 56122 231252
19359 231252 15169 130635 -354859 171154 -100321 -105055 -231280 121470 -143195 -104396
19349 -104396 59544 -1004 262709 -253776 -15659 -166549 -39850 -1015 -217085 -344642 -85562
19337F7493c10022J41793L1481A00752J3715b97931F1723a29425l2224A9877a90888
19325a14161L7224I2015J15496I6365c9618H4026L2999c6300J5027o7985k22639
19314c11897P6321B1157J76981H2297d6130B9111A196c67680N8019J10032A406
19302b01943J1030g0399R789j04942A26041l2861l5208a47822K8995B31019B5658
19290D5488f9652H8923K4624K9898o4696J98137e4004G8277l6634L3710L18682
19279C94035c16186N7644f4400K8291k69516P8047M7711D2971J19228p8289a17861
19267B3508A1478i7398k15868Q297A23601a32887B5910f9747k401A18110b948
19255A35466E6813c620C5588a99859C2411j4880c8953G7468e1968l2419F9032
$$ plain form
19337 67493 -310022 -168229 -136748 100752 114467 -297931 61723 -129425 -161649 19877 -190888
19325 -114161 -76937 92015 207511 96365 -39618 84026 117025 -36300 -21273 -89258 -311897
19314 -311897 -235576 21157 198138 82297 -46130 29111 1196 -367680 -309661 -199629 1406
19302 -201943 -190913 -70399 -60610 -165552 126041 93180 57972 -147822 -118827 231019 25658
19290 45488 -69652 88923 113547 143445 78749 276886 -54004 78277 41643 75353 394035
19279 394035 -316186 -258542 -64400 -36109 -305625 -227578 -179867 42971 162199 83910 -117861
19267 23508 11478 -97398 -313266 -304969 123601 -132887 25910 -69747 -72148 118110 -2948
19255 135466 56813 -3620 35588 -199859 32411 17531 -38953 77468 -51968 -84387 69032
19243c0440r8353A6342i0843J3784a5566n6118R896r0404J3518A46781b56039
19231a89694L0363B44110b19472H0437b60128b923D6668a75828k77209H3645N6588
19220A40233a9336k75889a15698j60042b6670j8001a019C239a58958k1792g294
19208A45657c0824K455n5617A21959b48180R5318e5210j70863A15217Q8893c20596
19196b05227I1909j0130b41766j528Q7564A39084d2592I7053c87633J85163e8560
19184C7824b69703G0577a03179j97110n1294A11179L6403a17406L2815p5340f6270
19172A59066D743J18256g4016o2550H8975k216h2914r2582A6728D897d45322a2858
19159b23689B64602j20492i5052J52A4124a11901J7910m62228b07695b6383H6342
$$ plain form
19243 -30440 -128793 16342 -90843 -77059 -15566 -71684 -61788 -152192 -138674 146781 -256039
19231 -189694 -159331 244110 -219472 80437 -260128 -2923 46668 -175828 -453037 83645 140233
19220 140233 -19336 -295225 -115698 -275740 -26670 -44671 -1019 3239 -158958 -180750 -7294
19208 145657 -30824 -28369 -83986 121959 -248180 -152862 -55210 -226073 115217 204110 -320596
19196 -205227 91909 81779 -241766 -243294 -155730 139084 -42592 97053 -387633 -202470 -58560
19184 37824 -269703 70577 -103179 -300289 -351583 111179 147582 -117406 -84591 -159931 -66270
19172 159066 4743 122999 -74016 -136566 88975 86759 -82914 -175496 16728 4897 -445322 -12858
19159 -223689 264602 144110 -95052 -94900 14124 -111901 -93991 -556219 -207695 -26383 86342
19147d44658B22910G8081l0694Q5098K54836h7679k8837j46454R5313A18420c34990
19135g524l12194e1780H1859k1237a09156L6932j88788b0730k1467O0j07419M7752
19123a01804A50847E9877c12990B02600b21163A13090n214e5717A61144a75535
19112C0283d00420a25422H4516a74065A39319n9503a04258G1334B9251J4569a35664
19100d9276j48314b1277B76959a785q9761p0534a993B1271K1158a13679A38129
19088e2174B8290J17208c07038a17288A96563P8512F8095B0193a53446A38103
19077G8483b9294l3995j66463E3453c43314A15343j05b24272e8582C1182G563
19065A07867b71620r2120F1217c11806Q5380h5417j28127B72022a3393A19393
$$ plain form
19147 -444658 222910 78081 47387 132485 387321 -87679 -116516 -262970 -167657 118420 -334990
19135 -7524 -319718 -51780 81859 60622 -109156 -72224 -261012 -20730 -42197 -42137 -149556 -101804
19123 -101804 150847 59877 -312990 202600 -221163 113090 107876 -55717 161144 -175535
19112 30283 -400420 -125422 84516 -174065 139319 79816 -104258 71334 29251 43820 -135664
19100 -49276 -197590 -21277 276959 -1785 -91546 -162080 -1993 21271 42429 -113679 138129
19088 -52174 28290 145498 -307038 -117288 196563 275075 68095 20193 -153446 138103
19077 78483 -29294 -63289 -229752 53453 -343314 115343 115238 -224272 -58582 31182 7563
19065 107867 -271620 -363740 61217 -311806 -226426 -85417 -213544 272022 -13393 119393
19054f4508q901P26A54067i9913G2428a60073D5633a56318H7252J03857G3452
19042B60998E6391a90653k5751O5903P4995B0479c93909C53469a36546j6204L4816
19031a17934A33008h262j01467A76117a20852A75292m4198D0417f9792D41477
19020c27069E3106e1731B44289a29486j71372B7964c2637D62516B9338P7460a40978
19008A44841D576L43610a02443B5847h1144j72252A1207M76540c01279a03550
18997A03929b73924h0403n3846b1011j2660o263A65152N7774a50081d354F0638
18985A86600g2375C8406a80630I520f6781c0196j4385B4816R610d75792a29378
18973F8552a03992B84179G7285a03204l01658J83968G8092c03189C5422Q9272
$$ plain form
19054 -64508 -73409 -72683 154067 -99913 72428 -160073 45633 -156318 87252 191109 73452
19042 260998 56391 -190653 -216404 -150501 -75506 20479 -393909 353469 -136546 -152750 -117934
19031 -117934 133008 -8262 -109729 176117 -120852 175292 131094 40417 -69792 441477
19020 -327069 53106 -51731 244289 -129486 -300858 27964 -32637 462516 29338 106798 -140978
19008 144841 4576 348186 -102443 25847 -81144 -253396 11207 487747 -301279 -103550
18997 103929 -273924 -80403 -134249 -21011 -33671 -39934 165152 222926 -150081 -4354 60638
18985 186600 -72375 38406 -180630 9520 -66781 -30196 -44581 24816 34426 -475792 -129378
18973 68552 -103992 284179 77285 -103204 -404862 -220894 78092 -303189 35422 124694
18963A24694k8570B2569J872a79547a6085G6203b29380E9681P1987f2035n2392
18952a14427p4015H3401d949D3661K33301a26885k1812k33667E7631a74060M0786
18941a33274j46480H0236d4547j86231b6644I1861a38488B9772Q871a41960e1432
18929b25301p6685C03a16863B27530a48426n013k91279c3915j51347g5779a78
18917c38820a54479C1894a96749G2443c79042B42479A04136a31938K4962c2320
18906F6580a73969k3507j00560B77164G8989k4248h1029A56663l949b1385q8513
18895a09898k37116a05447C83023a5464j61647e1925l3365A14873m9954C436L95807
18884C99243m4140a25880j97053B01489B1576b3413A90377b10529k3345H267c41928
$$ plain form
18963 124694 96124 22569 24441 -179547 -16085 76203 -229380 59681 131668 -62035 -114427
18952 -114427 -188442 83401 -4949 43661 276962 -126885 -148697 -382364 57631 -174060 -133274
18941 -133274 -279754 80236 -44547 -230778 -26644 91861 -138488 29772 38643 -141960 -51432
18929 -225301 -301986 303 -116863 227530 -148426 -153439 -444718 -33915 -185262 -75779 -178
18917 -338820 -154479 31894 -196749 72443 -379042 242479 104136 -131938 -106976 -32320
18906 66580 -173969 -197476 -298036 277164 78989 54741 -81029 156663 152714 -21385 -109898
18895 -109898 -347014 -105447 383023 -15464 -177111 -51925 -85290 114873 64919 3436 399243
18884 399243 355103 -125880 -322933 201489 21576 -23413 190377 -210529 -233874 8267 -341928
18872B02956C3258c02325H3668a73751E0544A8707g188k43355G4319c76226C05445
18860a279j28091k15426E7869d0382D85814j44480f3771l1980j34108O2837d3905
18848C8749L2671B7987J06924b41257a4509A94563B044J01189Q9184n2652a39304
18836d8403j09976a8752C0664K34625A4992a51694p3342K5686k8095R5435k07382
18825c39392a5293E1235a59968C4668K8341a99893c0364B96474c549I6095J06679
18814B02774n173a21705B34452A05729a50563l57148b14180F1560b87074J15897
18804a71177A65084a19003B55840c10347a32203L9886L6271A6589e40459a07522
18793a3543I8439h137k933l90177A70283d3060j97384A06611a96124G9040b24683
$$ plain form
18872 202956 33258 -302325 83668 -173751 50544 18707 -7188 -250543 74319 -376226 305445
18860 -1279 -129370 -344796 57869 -40382 485814 341334 -63771 -95751 -229859 -167022 -43905
18848 38749 71420 27987 134911 -241257 -14509 194563 2044 103233 192417 139765 -139304
18836 -48403 -158379 -18752 30664 265289 14992 -151694 -225036 -199350 -227445 -132010 -339392
18825 -339392 -15293 51235 -159968 34668 63009 -199893 -30364 296474 -3549 96095 202774
18814 202774 197601 -121705 234452 105729 -150563 -507711 -214180 61560 -287074 -171177
18804 -171177 165084 -119003 255840 -310347 -132203 -92317 -56046 16589 -540459 -107522
18793 -13543 98439 -8137 -11070 -401247 170283 -43060 -240444 106611 -196124 79040 -224683
18781i9765j22999a9735k26770G2734J39837a67739H4182b2746k33004C42319
18770B4191b56033r6676C5342K23112a60055A27499J41359p659g8788D8805b18759
18758a29039B00624a32780N2644i222j28648B53616B6518b30881r5661J17523
18748b09019f8743j2767n76p8110j22988B2435a55449G1775J42441r8642E1894
18736i8128m3834K5476H2234d33519J70410N2648j8005B02104d61453e5092k22043
18725b77135a09882A72757p5642b23026J05421e7504l76092J09151H11a55381
18714a45851e5971k18138E665J0356c53195B81061D6704a89997A6821K72241b66388
18702C11554A07897a76572A9986a94142j14935J39916d402o8083F261b25180g8356
$$ plain form
18781 -99765 -222764 -19735 -246505 72734 212571 -167739 84182 -22746 -255750 342319
18770 24191 -256033 -352709 35342 258454 -160055 127499 268858 261199 -78788 48805 -218759
18758 -129039 200624 -132780 -80136 -9222 -137870 253616 26518 -230881 -326542 -209019
18748 -209019 -68743 -81510 -82086 -160196 -283184 22435 -155449 71775 214216 115574 51894
18736 -98128 -141962 -116486 82234 -433519 -263109 -210461 -228466 202104 -461453 -55092 -277135
18725 -277135 -109882 172757 97115 -223026 -117605 -57504 -433596 -324445 811 -155381
18714 -145851 -55971 -274109 5665 16021 -353195 281061 46704 -189997 16821 289062 -266388
18702 311554 107897 -176572 19986 -194142 -309077 -169161 -4402 -72485 6261 -225180 -78356
18690A0761J0678a0008k12471a2677j28577A41666f0225A68220n1806a92854Q6655
18679a06199m971b1720k24001Q9635A9671g9250j73638C31091a88089K2822O4200
18668a01067c6428a4700A35483J04595g1131D361a73887B67526e0126k01142M7528
18657b03740Q575f1116p7180j55052J24634l3427C01124a3006C7559a16249A97025
18645a56957L1236F3354d15306A52618J38017c21702i6511G4343R7752a77595
18634A50063K06799c8629j25976L5065A97896b3118n7217B5480J02141D6089c0786
18622a35975A84400q8220b59k52516a04537E0905L9400b88418f2983j76557A9336
18610h1418j08069B2503N1681C4950R2202m6213j8931g5670r8398I1114K21642
$$ plain form
18690 10761 21439 -10008 -222479 -12677 -141254 141666 -60225 168220 116414 -192854 -106199
18679 -106199 -111170 -21720 -245721 -156086 19671 -79250 -252888 331091 -188089 -165267 -101067
18668 -101067 -36428 -14700 135483 240078 -71131 4361 -173887 267526 -50126 -251268 -203740
18657 -203740 -195165 -61116 -138296 -293348 -168714 -202141 301124 -13006 37559 -116249 197025
18645 -156957 -125721 63354 -415306 152618 290635 -321702 -96511 74343 172095 -177595
18634 150063 356862 -38629 -164605 -129540 197896 -23118 -80335 25480 127621 46089 -30786
18622 -135975 184400 96180 -259 -252775 -104537 50905 90305 -288418 -62983 -239540 19336
18610 -81418 -189487 22503 74184 34950 127152 80939 62008 -75670 -174068 91114 312756
18599C12756a67588A59263b19526G2998d495l44640A2482e77B09949c14958b7028
18587B78378b24959f247B45279h1582J7438a9920m78669K40309l2915B538K48496
18576B51034b97797h4025j00142i161k56516J08387j20079m5506A46850b30301
18565F394J56755D3045j0160c90771p424A1829P0835A2879P9779J9161J00566
18554B12385c64303b8795r6131e0218j00120c7431j33001A71553d9177G928J55934
18543A63862J36371c7670E7761M3343D9059A9216H952f6914k29944M6401O6591
18532a83866n8217M3423D53210A19422B8287J4876b17700e1829A12258J939a50082
18520b27835r712J07085a0382B44026f4798D2337L9479R1528d57108B0511J86515
$$ plain form
18599 312756 -167588 159263 -219526 72998 -4495 -349135 12482 -577 209949 -314958 -27028
18587 278378 -224959 -6247 245279 -81582 -64144 -19920 -498589 -258280 -291195 2538 251034
18576 251034 -297797 -84025 -184167 -9161 -265677 -157290 -277369 -322875 146850 -230301
18565 6394 163149 43045 32885 -390771 -398195 11829 82664 12879 92658 111819 212385
18554 212385 -364303 -28795 -124926 -50218 -150338 -37431 -170432 171553 -49177 7928 163862
18543 163862 300233 -37670 57761 101104 49059 19216 8952 -66914 -296858 -250457 -183866
18532 -183866 -242083 -198660 453210 119422 28287 43163 -217700 -51829 112258 114197 -150082
18520 -227835 -237547 -130462 -10382 244026 -64798 42337 81816 173344 -457108 20511 207026
18509B07026k4935b71018J03152G9263b93637B5934P1430c15135f3803B47378
18498a9283I2291c95101a71235L3587N9385r8817J3726k55460D9382g3022A9863
18486a87956O7868A9909c55235A45958J83319b3427j31128O5359k15164A1619
18475b92054j50345g808j26258A02417a17687J2461L3375q1970B50726a55431
18464a28407Q254b572j0188A00848a32754A13434i1688d45B4143a99115A47881
18452d6919j80372D5001k0819c22823B36876A11357C565a41436M5275A85787H6488
18440H0848b02809f3042D687J51690O3628a38844j04118C9518J7509a21805d7848
18428b2571A6175i8501L8816H7967c05155A12811a43964A95354a53886L0337A92434
$$ plain form
18509 207026 182091 -271018 -167866 79263 -293637 25934 97364 -315135 -63803 247378
18498 -19283 92291 -395101 -171235 -137648 -78263 -177080 -163354 -418814 49382 -73022 19863
18486 -187956 -120088 19909 -355235 145958 329277 -23427 -154555 -89196 -304360 11619
18475 -292054 -442399 -7808 -134066 102417 -117687 -105226 -71851 -153821 250726 -155431
18464 -128407 -120153 -2572 -12760 100848 -132754 113434 -91688 -445 24143 -199115 147881
18452 -46919 -227291 45001 24182 -322823 236876 111357 3565 -141436 -96161 185787 86488
18440 80848 -202809 -63042 4687 156377 220005 -138844 -242962 39518 57027 -121805 -47848
18428 -22571 16175 -98501 -59685 87967 -305155 112811 -143964 195354 -153886 -123549 192434
18416A43650F7233J53446G7352k852J21662m0319j074b64859B99897n0516L9821
18405B89202q0076b32416A83615a4417A57192F1896M5392l2212j6278B2209a32606
18393D3470a76999D5636g4151m576I3790l2150G10d7101F5688J31157d2477A61088
18380b0251j86565o220J367g8535A60018a44373A42648J08221f3464A8228a06156
18368a60608A53356n2771J46755a07828B62709h4229E701Q7442a97759c1686R02
18357c0784H6492a09025B7737j1036a07348A25197C7645A4484c36210J67461C0861
18345G9209B3827a58915A22851d9111A11732O4945a10800d5471l3507k887c7044
18333B20371a72459h1379A35384a69092B2699b88337J38592K1956N7158k80115
$$ plain form
18416 143650 67233 220679 77352 74500 196162 155843 154769 -264859 299897 249381 289202
18405 289202 209126 -232416 183615 -14417 157192 61896 107288 75076 58798 22209 -132606
18393 43470 -176999 45636 -74151 -78727 93790 61640 710 -47101 65688 196845 -42477 161088
18380 -20251 -206816 -213036 -211669 -78535 160018 -144373 142648 250869 -63464 18228 -106156
18368 -160608 153356 100585 247340 -107828 262709 -84229 5701 93143 -197759 -31686 -30784
18357 -30784 86492 -109025 27737 16701 -107348 125197 37645 14484 -336210 -168749 30861
18345 79209 23827 -158915 122851 -49111 111732 176677 -110800 -45471 -78978 -81865 -37044
18333 220371 -172459 -81379 135384 -169092 22699 -288337 -149745 -127789 -70631 -350746
18323c50746a8863n7047j89022O978D2826b25344j28872a42973j04048B16335
18312f1640A74664b59239d3565a2817B24396d7635k32715e0568j37351H39a60649
18300B24291a10514I2662a50351G7036J10209b44903K8659H8003b29568g7366
18289A26184J03252C5258J34444d7733j78588h1418C39638a96909M0107A60364
18278c75549A10997a46895B6515a43762j20586i523j84516D7234A8589c49587
18267B32450e0907l1747m7728N3626A26731D4548J2654a41208N4948B24019A7310
18255B9398R826a55203o4596E4401r197J41371l7265e671j75412l65432a0459
18243c6613I2051b28163A08881R4338h0266k30610e740r6712M5521A10226j1977
$$ plain form
18323 -350746 -18863 -75910 -264932 -257954 42826 -225344 -354216 -142973 -247021 216335
18312 -61640 174664 -259239 -43565 -12817 224396 -47635 -280350 -50568 -187919 839 -160649
18300 224291 -110514 92662 -150351 77036 187245 -244903 -216244 88003 -229568 -77366
18289 126184 229436 35258 169702 -47733 -226321 -81418 339638 -196909 -156802 160364
18278 -375549 110997 -146895 26515 -143762 -264348 -9523 -194039 47234 18589 -349587
18267 232450 -50907 -82654 -130382 -76756 126731 44548 57202 -141208 -86260 224019 17310
18255 29398 39224 -155203 -219799 54401 45204 186575 149310 -5671 -181083 -546515 -10459
18243 -36613 92051 -228163 108881 203219 -80266 -310876 -5740 -102452 -56931 110226 98249
18232I8249D8045g0933r5191A40521a8398k09458a07841n8160N2839G8949H927
18220a29747A85672a07576r8104N7147j6751j95805d5985k3401c05F0674b45013
18208b78349e1613I52c26292a55809k32916C8638c24455B32169a70363F9689L1637
18197A01326E0025B1318M1954N037J58795a08330A06815c36204I4731j4860b844
18185a26938j0982A54839a1205G4298a55731E6281c09602g0108m4717A43311h7
18173e1633E1609J63301a8090j32873A23613a35120B38181A04371c3614B31153
18162a1415A21039k6542a51366D8958M6285J02764p0286g6767K7015B59564H061
18150B76110c07330c9969j7104q5390G3193b10908B59684b02868A12474a97105
$$ plain form
18232 98249 48045 -70933 -166124 140521 -18398 -227856 -107841 -166001 -113162 78949 8927
18220 -129747 185672 -107576 -205680 -148533 -165284 -361089 -45985 -69386 -305 60674 -245013
18208 -278349 -51613 952 -326292 -155809 -388725 38638 -324455 232169 -170363 69689 101326
18197 101326 50025 21318 63272 68309 227104 -108330 106815 -336204 94731 79871 -2844
18185 -126938 -137920 154839 -11205 74298 -155731 56281 -309602 -70108 -114825 143311 -87
18173 -51633 51609 214910 -18090 -150963 123613 -135120 238181 104371 -33614 231153
18162 -11415 121039 94497 -151366 48958 95243 198007 127721 -76767 -49752 259564 8061
18150 276110 -307330 -39969 -57073 -142463 73193 -210908 259684 -202868 112474 -197105
18139a67756C8876J70327b1120A28453J33244a318n1219C14327d678j9554A29803
18127B1778g1980n4839L7211A3791J00587e2643k7719B2731i6747m151A98910
18115B36172H5678b3784j71380A51767l2360b65219c4724j54892j82507a53134
18104B36086e8494A03504h6512l9071I6787a23556A51286a99186e7749A6049d7382
18092a07115I9260J44264a16881C5433K43734b27574R2778D5641J1584a74641
18081g9601j69763A03225b30446m1341A44702J2503J02684a39254C19886a44333
18070B51460b09892H1458a82522o7146B6164a46997f4458j33010B48961a97161
18059C06609h9352m2594K9630k2540a9490C90373i3046H3969d21516I144a87331
$$ plain form
18139 -167756 38876 209203 -21120 128453 261697 -1318 -52537 314327 -4678 -24232 129803
18127 21778 -71980 -126819 -89608 13791 114378 -52643 -80362 22731 -96747 -100898 198910
18115 236172 85678 -23784 -195164 151767 119407 -265219 -34724 -189616 -372123 -153134
18104 236086 -58494 103504 -86512 -125583 96787 -123556 151286 -199186 -57749 16049 -47382
18092 -107115 99260 243524 -116881 35433 279167 -227574 -134796 45641 57225 -174641
18081 -79601 -249364 103225 -230446 -271787 144702 157205 259889 -139254 319886 -144333
18070 251460 -209892 81458 -182522 -249668 26164 -146997 -64458 -197468 248961 -197161
18059 306609 -89352 -131946 -102316 -124856 -19490 390373 -93046 83969 -421516 9144 -187331
18047A41887m2644a30134A95467a13426F2763d313n33111A07349O2562h3336j0637
18036i3973D07572e2105F1679J6088Q1456b26769I7048b63540J13160D9534C643
18024a23879N4901A1422b0574O461A03303e958r0401r0310A09753b13955B3983
18012a98567q4965H9729J33126a34739b3677B46055c1418k3A8788J06422J64697
18001B89907d7878G7330O9256J81342c7673A04779J34207C4176g1976k07565C432
17989C608K0222a48451m4808E5013a72966E027B415J37026e1271A22921k1572
17978A01349a16466B32380a1237j66059j49186A49234N3217h0676k15678b9043
17967a81074B13527a26535B94986b19225A04556b29461A3052e5461A7668J25926
$$ plain form
18047 141887 99243 -130134 195467 -113426 62763 -4313 -537424 107349 169911 -83336 -93973
18036 -93973 407572 -52105 61679 77767 159223 -226769 97048 -263540 -150380 49534 3643
18024 -123879 -68978 11422 -20574 -14113 103303 -5958 -96359 -186669 109753 -213955 23983
18012 -198567 -283532 89729 222855 -134739 -23677 246055 -31418 -31441 18788 125210 289907
18001 289907 -47878 77330 146586 327928 -37673 104779 238986 34176 -71976 -279541 3432
17989 3608 23830 -148451 -193259 55013 -172966 5027 2415 139441 -51271 122921 101349
17978 101349 -116466 232380 -11237 -177296 -326482 149234 202451 -80676 -296354 -29043
17967 -181074 213527 -126535 294986 -219225 104556 -229461 13052 -55461 17668 143594
17957A43594B8783h7192C2774R8247n4507K6834b42172K6581L3591f7581n6421
17946a24002I2441a68623g5268A02823A2267a18934C5704O6738a12086B21583
17935B73277a43551A78211R169a90212l8632c3510A46781l4472b4138A65455n7097
17924A08358j9680c5619P501k8778D68802b91110B13559Q5305a56053L8772I0427
17912e9120l8891j46047C21660G5924a34541C05354a93365G0424c3006A28613
17901b23086J06659A94819Q7826A03068c36643J35974A13308J0818a40737O7916
17891g2821C14354a2965A36292E4538O7783a53592j63901G087J7418a89084E2212
17879b50166i1374l5623A3426J54068o2995e1410I5852J20348H9381a90734A056
$$ plain form
17957 143594 28783 -87192 32774 131021 76514 103348 -242172 -215591 -182000 -67581 -124002
17946 -124002 92441 -168623 -75268 102823 12267 -118934 35704 102442 -112086 221583
17935 273277 -143551 178211 187380 -190212 -228844 -33510 146781 112309 -24138 165455 108358
17924 108358 88678 -35619 -28118 -56896 468802 -291110 213559 298864 -156053 -117281 90427
17912 -59120 -98011 -244058 321660 75924 -134541 305354 -193365 70424 -33006 128613
17901 -223086 -116427 194819 282645 103068 -336643 -200669 113308 124126 -140737 -72821
17891 -72821 314354 -12965 136292 54538 122321 -153592 -317493 7087 24505 -189084 52212
17879 -250166 -91374 -126997 13426 167494 104499 -51410 95852 216200 89381 -190734 1056
17867H2937K37861a41941I9217a12598L705A31488a60712A82523C3703M0601d1165
17855e3568j73947d6481a6382C56085A07689c40117i474B03117O8630A26188D6147
17843A01492P1765J13095a25074j15777P2033B32887o2112c44977D01391F4177
17832G2328b92878B13960p5877a95313j0358I0627a07958E0240A408K11037b62665
17820b10401A53331l6130g5216B22237d6819A0071J66230B413L33726C283J3074
17809A6357a40477A48243j8268J16603F0010J28937N2514I877J46112b15226j8045
17798b33271K6030q8345J18660B0068b97596H1389M9700R0038a77086C5269b86289
17786H1701J3475P9248B9840a9222A04493a6996C80574A70441c31102A12075a4211
$$ plain form
17867 82937 320798 -141941 99217 -112598 -108893 131488 -160712 182523 33703 74304 -41165
17855 -53568 -227515 -46481 -16382 356085 107689 -340117 -9474 203117 271747 126188 46147
17843 101492 173257 286352 -125074 -240851 -168818 232887 170775 -344977 401391 64177
17832 72328 -292878 213960 138083 -195313 -205671 90627 -107958 50240 1408 212445 -262665
17820 -210401 153331 117201 -75216 222237 -46819 10071 176301 2413 336139 3283 16357
17809 16357 -140477 148243 129975 246578 60010 188947 241461 9877 155989 -215226 -233271
17798 -233271 -207241 -295586 -176926 20068 -297596 81389 131089 221127 -177086 35269 -286289
17786 81701 95176 174424 29840 -19222 104493 -16996 380574 170441 -331102 112075 -14211
17774A52166n6053b30602B9971c20648a23284D35001q1733b29502i7467C2720
17763H7060C4269b94584B36867j2769i3104C25350J17434A32211O3367H8968c25194
17751C73155C5921e3959D7280n471K09779J00302q702H1357c127A07327f4723
17739F6470c8914k43737D14350a6456A88084C9525e6400C2625K72227A8643J1780
17728C0423R386K7165K39779A17156k3006J33357A8716K16866J866a88955f3265
17716b293j34652l276B03191E1496K84300r3189c2337B2054b2545j49117J8367
17705a53295A26493j2554b46558A51985m7140K66279I9537a46436A70626b33953
17694C37174B7998K3554J53705c1986C88237E6553i6609I6512M9486d73474E7361
$$ plain form
17774 152166 96113 -230602 29971 -320648 -123284 435001 353268 -229502 -97467 32720
17763 87060 34269 -294584 236867 224098 -93104 325350 442784 132211 195578 88968 -325194
17751 373155 35921 -53959 47280 41809 251588 351890 343188 81357 -3127 107327 -64723
17739 66470 -38914 -282651 414350 -16456 188084 39525 -56400 32625 304852 18643 30423
17728 30423 39809 66974 306753 117156 94150 227507 18716 235582 237448 -188955 -63265
17716 -2293 -136945 -140221 203191 51496 335796 242607 -32337 22054 -22545 -171662 -153295
17705 -153295 126493 113939 -246558 151985 104845 371124 99537 -146436 170626 -233953
17694 337174 27998 51552 205257 -31986 388237 56553 -96609 96512 145998 -473474 57361
17682d960A75482J01796a8298I5625m5831L22728i7239C37743g1968A0850K30948
17671B41798k8572d1847B61800r8728F4755P5949f9152A67130n003J2854a60933
17659i528l77560A27769E64d2045B25081d0015F5336A8803b34492P8366E15165
17647b36917h28F5378j9402g3134j27825f8060C80360a01234B9862J68825I9086
17635b9036B21471d7273j84020f1588A23602a61689A78063b8395i970B97299j05824
17624A91475q1333J67258D5951a58261b6903n83361A00645b37270B25871l7874
17614A87997O282L3229E5670J83786f9104F1698f8157B18568m3893K1193H1932
17602c1355B4555P1825n957k4285a6247E02492d4754k02828H6589L39639A30282
$$ plain form
17682 -4960 175482 277278 -18298 95625 49794 372522 -97239 337743 -71968 10850 241798
17671 241798 213226 -41847 261800 163072 64755 140704 -69152 167130 162127 174981 -160933
17659 -9528 -387088 127769 564 -42045 225081 -40015 65336 18803 -234492 -156126 515165
17647 -236917 -828 65378 45976 -73134 -200959 -68060 380360 -101234 29862 198687 99086
17635 -29036 221471 -47273 -231293 -61588 123602 -161689 178063 -28395 -9970 297299 191475
17624 191475 110142 277400 45951 -158261 -26903 -610264 100645 -237270 225871 187997
17614 187997 194279 227508 55670 239456 -69104 61698 -68157 218568 174675 195868 81932
17602 -31355 24555 96380 90423 66138 -16247 502492 -44754 -247582 86589 426228 130282
17590A75439C1435i5333b1111j88498m0382C53063a43525L9685q0405c2357B72026
17578C643J67478n9729C1205L26251D9931O152C211L735L70067c18726h4227n2624
17566a36851C76676j22829c610C1614L66826j73602r7365C0226O1659J11697a7541
17554a89887B0295J5695K23119M5948A31044A1977M59457E1647K54649m8521K17529
17543D75304D0912a47003C51283i9106m2790A92114K14382j06295p3124J82734
17533D09811a6285C04146j34293m3968J26624Q0176j04875a05430C89870l895
17523C85975A20654L53656k6174J75049k68300N4774A59932C7607J43412J9620
17513B00639n1139j3196m937L38756A86927K53968j38064K27142R7600B17199
$$ plain form
17590 175439 31435 -95333 -21111 -209609 -249991 353063 -143525 -103840 -184245 -32357 272026
17578 3643 171121 111392 31205 357456 49931 56083 3211 6946 377013 -318726 -84227 -136851
17566 -136851 376676 253847 -3610 31614 398440 224838 127473 30226 91885 203582 -17541
17554 -189887 20295 35990 259109 305057 131044 11977 471434 51647 306296 257775 475304
17543 475304 40912 -147003 351283 -99106 -141896 192114 406496 300201 227077 409811
17533 409811 -16285 304146 169853 125885 252509 332685 227810 -105430 389870 385975
17523 385975 120654 474310 448136 623185 354885 409659 159932 37607 181019 200639
17513 200639 149500 136304 131367 470123 186927 440895 302831 529973 627573 217199
17502B44076L58518i3396E34334l6915j99651A01944L9172K57228d9199B72502
17491B01789d5162E43786E544K29303L5966C2161J66665N5431g9720D04783A73253
17479B94442A17082J06385q0132J06777a49771k9505A32595G341M37036m6738
17469C97639q7067c0108r5738A00384k499L50742A82868c6104A31301n0268a22309
17457C36042b03967B08902m6127J90283I4568d2884A19086J71966A17608J89862
17447C07470p4197K25320M967A0174K13812O397g0161F76327C30361A55670l2338
17436A23332m8340J26091d573C32172J0548r9182A02744k890N45111C1777K77822
17425C09599m094K72153E8396J91205A00075A2176J65267q7774K1721J21050n9770
$$ plain form
17502 244076 602594 -93396 534334 497419 297768 101944 141116 398344 -49199 272502
17491 201789 -45162 543786 5544 234847 270813 32161 198826 254257 -79720 404783 173253
17479 294442 117082 223467 143335 250112 -149771 -179276 132595 7341 444377 397639
17469 397639 310572 -30108 -125846 100384 97885 448627 182868 -36104 131301 81033 -122309
17457 336042 -203967 208902 162775 353058 94568 -42884 119086 291052 117608 307470
17447 307470 233273 458593 463560 10174 223986 230383 -70161 676327 330361 155670 123332
17436 123332 74992 201083 -4573 332172 342720 243538 102744 99854 644965 31777 309599
17425 309599 305505 577658 58396 249601 100075 12176 177443 89669 111390 232440 172670
17414A72670E7984c21477A48059C3552Q7137i512A05231a38163A16083L2389i674
17402A31095E3435K32664P6505A68518J18058A10249B386L3658K96065j19468
17392B12641p3074J77742A51696M3030J29100j37665j6922k4757k7928g2592b3036
17380D04328j2420a88181D72652j60181D1568J06024J67105B9352L5560e0157
17369B88729o4483a05165A20893K72456a02180A07298b05006C87534a83253B79067
17358A28629K28471N7356A99857J71673d4271I2506d07687D77015B19038k8448
17348A90590L00385f2286A56006J98872J19001B15095c8194L743A02189J32388
17338B34577O5227j1973E1764K71217d8946A98874K30911P3034j86669j12531
$$ plain form
17414 172670 57984 -321477 148059 33552 120689 -9512 105231 -138163 116083 148472 -9674
17402 131095 53435 286099 362604 168518 286576 110249 2386 36044 332109 212641
17392 212641 139567 317309 151696 194726 323826 186161 169239 144482 116554 -72592 -23036
17380 404328 391908 -188181 472652 312471 41568 147592 314697 29352 64912 -50157
17369 288729 224246 -105165 120893 393349 -102180 107298 -205006 387534 -183253 279067
17358 128629 357100 414456 199857 371530 -44271 92506 -407687 477015 219038 190590
17348 190590 490975 -62286 156006 354878 473879 215095 -38194 -34451 102189 234577
17338 234577 299804 287831 51764 322981 -48946 198874 429785 502819 316150 203619
17328B03619J41533J1274K748A27274a12731I0407b12334G049L77583N8643c9414
17316C24765j9849A31986N8180A0986Q4824J16319J04787F8127M4462D7100M40111
17305D87211A00262L18879I7185L4604K1893D5607J71232J25870k1917j15059
17295B05733n3477n9480J02558P5495H6664a91662f2555B02973b7031B09702R074
17284B18776J97959A67922R9636j09227N6248j5998L6428B2333c5701B18510K74670
17273D93180I1390B5836J04373K29132j53795J16542A37858d1285j78082F10926
17262A49133I791h3912L7059A32471K4525J70250r5451A10009K58080A14991K17362
17251C32353j31545G6372k9755a28559C71719d8351A73964J09965n4579J1161
$$ plain form
17328 203619 345152 356426 359174 127274 -112731 90407 -212334 7049 384632 443275 -39414
17316 324765 304916 131986 190166 10986 95810 212129 316916 68127 112589 47100 487211
17305 487211 100262 419141 97185 131789 153682 45607 216839 342709 320792 205733
17295 205733 152256 92776 195334 270829 86664 -191662 -62555 202973 -27031 209702 218776
17284 218776 416735 167922 267558 158331 214579 198581 235009 22333 -35701 218510 493180
17273 493180 91390 25836 130209 359341 205546 322088 137858 -41285 -219367 610926
17262 149133 9791 -83912 -46853 132471 156996 327246 231795 110009 368089 114991 332353
17251 332353 200808 76372 46617 -128559 371719 -48351 173964 283929 229350 240511
17241B40511m6852J13091J997O4678J06549K9380k1872I7161M22676E344J53682
17230A59026J43402L30364B98642D5852J88105J5130A00130K05746P4034c6186
17219B57334o9460P4319b18444h7922B91253O663F4569L57506I7001J79329A04033
17207A44230j0548K74444J13828H1755Q3235P9360E9848L53353L0256m2431A85992
17195C52710M05101B89874A42168m5261Q3699M15482j63863j90089L64777O570
17185F13483B59114L2776J30739J2099A48937L60368j89778o829J57505R2260
17175E62463q6452A65627L26953p884O3831P0512k28659j9206O1237P8404A73611
17163C00617R4725m1587J35317A66870d0410F90254A53426n4175J32055R7531
$$ plain form
17241 240511 193659 306750 308747 373425 479974 509354 487482 97161 519837 5344 159026
17230 159026 302428 632792 298642 45852 233957 249087 100130 305876 379910 -36186
17219 257334 187874 262193 -218444 -87922 291253 297916 64569 422075 97001 276330 104033
17207 144230 133682 408126 521954 81755 164990 244350 59848 413201 443457 401026 185992
17195 352710 757811 289874 142168 96907 180606 596088 432225 242136 606913 613483
17185 613483 259114 291890 422629 434728 148937 509305 319527 312698 470203 562463
17175 562463 476011 165627 492580 484696 548527 619039 390380 371174 432411 510815 173611
17163 300617 395342 353755 489072 166870 -40410 690254 153426 99251 231306 328837
17153C28837J20698J55048j38092j18470N2730f3166F13443k07973A29314L16527
17143D45841J86356j78972B05881Q7647n7442L79243A12740K98026J30650O2772
17133F04188o1497j29541K8465j53157K12577B43183N06937C03355K4545J27919
17123D55819J18368k59042p8746L68957j88011j3423m6062J3649j15898K65448
17113E21059J86694j80621o271J37403B77287J32871K44787J12107q0757B68887
17102H71399C49746J24961l3118R9010K90526C66352K32242O2871l3015A85082
17091H45467l31019J60118j15833j27254L55027P9125k91626B60656J56542J23700
17081E40898K28853j78893J04862L1268C58758K68265A93213J73206j6533L22541
$$ plain form
17153 328837 449535 604583 466491 348021 400751 -63166 613443 405470 129314 445841
17143 445841 632197 453225 205881 293528 236086 615329 112740 410766 541416 604188
17133 604188 542691 413150 441615 288458 501035 243183 750120 303355 327900 455819
17123 455819 574187 315145 236399 605356 417345 403922 357860 371509 255611 521059
17113 521059 707753 527132 520861 658264 277287 410158 654945 767052 686295 268887
17102 871399 349746 474707 441589 540599 831125 366352 598594 661465 628450 185082
17091 845467 514448 674566 558733 431479 786506 865631 574005 260656 417198 540898
17081 540898 769751 590858 695720 726988 358758 627023 193213 366419 349886 672427
17071F72427K29807l37918n7915J25278K84909C86196L63068J1503M6694l75191
17061D32270J54557J48034k52389L16013j79096o9285P1802l1602j06241K65034
17051G49097r7962n3848K61671k41455J56659l80710K42166r5503J30685N8268
17041G29068K91380k83399p888K01028l30850J79426J68934m02061J47048L21347
17031A014033p5680k53298K42712j59232k0929o7874p2183J43177k541J06200
17021H54385L20341l55852K77561j9303j85186L858P1647q7960K36714l0837j81649
17010I03719J63994Q4837K4352l68118J52918j1726N8615N7597L0097k1882N3402
16999A127805j90518P9298j92630K51846r2083J16653o4431O8472j86983Q6412
$$ plain form
17071 672427 902234 564316 506401 631679 916588 386196 749264 760767 807461 432270
17061 432270 586827 734861 482472 798485 619389 550104 621906 590304 484063 749097
17051 749097 651135 597287 858958 617503 774162 393452 635618 540115 670800 729068
17041 729068 1020448 737049 729161 930189 599339 778765 947699 545638 692686 1014033
17031 1014033 938353 685055 927767 768535 747606 679732 607549 750726 748185 854385
17021 854385 1174726 818874 1096435 1077132 891946 895804 967451 879491 1116205 1085368 903719
17010 903719 1067713 1152550 1176902 808784 961702 949976 1008591 1066188 1096285 1074403 1127805
16999 1127805 937287 1016585 823955 1075801 983718 1100371 1035940 1104412 917429 1003841
16989A003841R9323J2507L8874j58354O51453k52268k25853Q1546k60902R3445
16979A083612J78269p3545L1297J41263p6770J20688k16297j43798K06320p6924
16969A174115N2703O9898O5649J17441Q0974F07454Q95191j47910L371Q8473n3289
16958A393290J13458J73090q5143L426k3769K19466l57995K95155k76562J81896
16948A636312K51438n61732K88181J03494j07452j93467J39538J19346K82230
16939A957888j56321r6057J49290N4532L1636j8544p8461L8719k87968L12026
16929A906740M1976n8593K62351k4520J52436j98595k8712J79344n7415j28557
16919B046455J35061J45006p5289L21063m22633N1104M43268k34577L20970m27832
$$ plain form
16989 1003841 1103164 1115671 1154545 996191 1647644 1395376 1169523 1251069 990167 1083612
16979 1083612 1261881 1188336 1219633 1360896 1284126 1404814 1188517 1044719 1251039 1174115
16969 1174115 1226818 1296716 1362365 1479806 1560780 607454 1502645 1354735 1358106 1446579 1393290
16958 1393290 1506748 1679838 1594695 1598121 1574352 1793818 1435823 1730978 1454416 1636312
16948 1636312 1887750 1326018 1614199 1717693 1610241 1416774 1556312 1675658 1957888
16939 1957888 1801567 1705510 1854800 1909332 1940968 1922424 1843963 1882682 1594714 1906740
16929 1906740 1948716 1890123 2152474 2127954 2280390 2081795 2053083 2232427 2175012 2046455
16919 2046455 2181516 2326522 2251233 2572296 2149663 2200767 2644035 2409458 2730428 2302596
16909B302596M55989k85679L82762k22713m2264J87349l1041J30292J82500l33485
16899B726306L3482L24105k93657N97116l28270J43714p9736j58760J41169K39041
16889C344510J40254l62794L73654J12014k7011m74735M34389j14117M14805l98879
16879C442090K38340J09121J31910L30279l31662K0398J15679N18838m37451Q186
16869D145728J56700j12386M11442j48249K45226J42733j6544r0931P2397K1615
16859D827731O11066k82560l829N96630m72692M02062j98140K81517j05389J21873
16849E778269K45036J01073O7850K3293L56034l3228j04225L71818k6751M26386
16839G205555o8272L20445j54648J81N5964M48869N09641k83882J84295M92812
$$ plain form
16909 2302596 2758585 2472906 2855668 2632955 2590691 2778040 2746999 2877291 3059791 2726306
16899 2726306 2759788 3083893 2790236 3387352 3059082 3202796 3123060 2964300 3105469 3344510
16889 3344510 3484764 3121970 3495624 3607638 3580627 3105892 3540281 3426164 3840969 3442090
16879 3442090 3680430 3789551 3921461 4251740 3920078 3940476 4056155 4574993 4137542 4145728
16869 4145728 4302428 4190042 4601484 4453235 4698461 4841194 4824650 4733719 4806116 4827731
16859 4827731 5438797 5156237 5152408 5749038 5276346 5678408 5480268 5761785 5656396 5778269
16849 5778269 6023305 6124378 6192228 6215521 6571555 6538327 6434102 6805920 6779169 7205555
16839 7205555 7137283 7457728 7303080 7303261 7359225 7808094 8317735 8033853 8218148 8710960
16829H710960L2372R3468K09979M99707l7438r4503O56410k06863N19837K5174
16819A0409103L05670J41318K47200L41835K66134K15270K93879J39368r596M25584
16809A2775765P77987l50981J050713P1496K60622K02887O28206J60825P73316
16800A6350836k4149P74140n6455Q06929L28158O90518L43562P96073L13334M20455
16790B0743401Q94366O01910M52553N37119R11682K72944J386222K88250P41832
16781B6830279O66020J151162P20266O71379J096159O23392R33135J368439J257073
16772C5317304Q75713P01641J535755J100132J382540P41230J610900J427908
16764D4693123J191057J883141J238766J516362J184861J535818J806301J417483
$$ plain form
16829 8710960 8743332 8836800 9046779 9546486 9509048 9414545 10070955 9864092 10383929 10409103
16819 10409103 10714773 10856091 11103291 11445126 11711260 11926530 12220409 12359777 12350181 12775765
16809 12775765 13553752 13202771 14253484 14324980 14585602 14788489 15416695 15577520 16350836
16800 16350836 16326687 17100827 17044372 17851301 18179459 18869977 19213539 20009612 20322946 20743401
16790 20743401 21637767 22239677 22692230 23229349 24141031 24413975 25800197 26088447 26830279
16781 26830279 27496299 28647461 29367727 30039106 31135265 31758657 32691792 34060231 35317304
16772 35317304 36193017 36894658 38430413 39530545 40913085 41654315 43265215 44693123
16764 44693123 45884180 47767321 49006087 50522449 51707310 53243128 55049429 56466912
16756E6466912J527139J930912J694408J848206J596091J386024J865523J649383
16748F9964598J851169J347027J870781J424367J839289Q99967J711460J176952
16740H2085610J275143J097964Q84675J008514Q13413L91804O30646l1714K70269
16731H8426324L44922l22808J01366m90174j017979k43607j030552r15770j195137
16722H3656585j102116j408628r03288j246738j623905j240668j690278j730307
16714G2710657j607442j507146j591879j469923j470457k056931j557404j381915
16706F0067560j555848j729978j283214j310127j666000j500760j544018j304913
16698D8172702j300351j338092j374765q72211j607682n83339j198394j242598
$$ plain form
16756 56466912 57994051 59924963 61619371 63467577 65063668 66449692 68315215 69964598
16748 69964598 71815767 73162794 75033575 76457942 78297231 79197198 80908658 82085610
16740 82085610 83360753 84458717 85343392 86351906 87165319 87557123 88187769 88156055 88426324
16731 88426324 88771246 88448438 88549804 88059630 87041651 86798044 85767492 84851722 83656585
16722 83656585 82554469 81145841 80242553 78995815 77371910 76131242 74440964 72710657
16714 72710657 71103215 69596069 68004190 66534267 65063810 63006879 61449475 60067560
16706 60067560 58511712 56781734 55498520 54188393 52522393 51021633 49477615 48172702
16698 48172702 46872351 45534259 44159494 43287283 41679601 41096262 39897868 38655270
16690C8655270r43402j390965p07382r97168q91948j146213n97503q68288n95341
16681C0517060o13655j022792m43338q99869p04689r08690m79810o49967l70806
16672B4423444q87369k19315p68725n29363k75649o47177n67984m50126l00660
16663A9777076m54090m30687m45049n53372j51274n82836l75001j7974p72915
16654A5993878k29672k25621n03042k34374J23208m65501l65098m7351j92827
16645A3853600n90378j02750l06210k08039k16256j39710l25974k8927j90835
16636A1744521l27196J28290k90523m08224l99536J80925k89896m350j78986j39856
16626A0015169n26070J15547l36228j12656j71812k38412K2465P4943p6479m31946
$$ plain form
16690 38655270 37711868 36320903 35613521 34616353 33724405 32578192 31980689 31112401 30517060
16681 30517060 29903405 28880613 28437275 27537406 26832717 25924027 25444217 24794250 24423444
16672 24423444 23536075 23316760 22548035 22018672 21743023 21095846 20527862 20077736 19777076
16663 19777076 19322986 18892299 18447250 17893878 17742604 17159768 16784767 16766793 15993878
16654 15993878 15764206 15538585 15035543 14801169 14924377 14458876 14093778 14046427 13853600
16645 13853600 13263222 13160472 12854262 12646223 12429967 12290257 11964283 11935356 11744521
16636 11744521 11417325 11545615 11255092 10846868 10447332 10628257 10338361 10334011 10155025 10015169
16626 10015169 9489099 9604646 9268418 9155762 8983950 8745538 8768003 8842946 8766467 8334521
16616H334521P2036j01689j72161J48336m42270j55554j91481L71870p19166J43217
16606G287659K46279n63445L36869l57149k67980J42481N4000o37891J95952j9591
16596F417184Q9991m15217L43706l05870j08981p1215n1064L5147j2693p5253
16586E845735j68990O2701k22535o0833j23135N9989k7489k3383N9831j0478l88434
16575E002979J68009J24847l61731O3149O3410O1594n03781l95836L58285R5706
16565D676631k39710k0670K02593j58549j21288j34818l52381P27386l12967J8375
16555D284602j6645N6233k55138r0060m72864L22308O9876J02199k98693L04304
16545D006122o8630j19651j04848J65798k14726N1363j03664j70565K12794j6049
$$ plain form
16616 8334521 8406557 8304868 8132707 8281043 7838773 7683219 7491738 7863608 7144442 7287659
16606 7287659 7533938 6970493 7307362 6950213 6682233 6824714 6878714 6240823 6436775 6417184
16596 6417184 6507175 6091958 6435664 6129794 6020813 5949598 5898534 5933681 5920988 5845735
16586 5845735 5676745 5739446 5516911 5456078 5332943 5392932 5365443 5342060 5401891 5391413 5002979
16575 5002979 5170988 5295835 4934104 4997253 5060663 5122257 4618476 4222640 4580925 4676631
16565 4676631 4436921 4416251 4618844 4460295 4339007 4204189 3851808 4579194 4266227 4284602
16555 4284602 4267957 4324190 4069052 3978992 3506128 3828436 3898312 4000511 3701818 4006122
16545 4006122 3937492 3817841 3712993 3878791 3664065 3715428 3611764 3441199 3653993 3637944
16535C637944j79010J11476l2590j37484J54117j22049k05680k60116L62901m8549
16525C280960L82710n52680K26255K63001n78497J89148l69654R5504p1912K72194
16515C137029l31637j77K54242L9327k11708K39344J1077m5592k26640O0781j29658
16504B796388j5572J36837k24231Q336M23045m75500J21650R1324l01274J76236
16494B737239m5570O7030j80049M04494k82794P1131m45765K76128K9096N0307
16484B681247k73727j49804L34601k06224L0745J43221l15169K79665j11402l2226
16474B380927M66939m88642R9135l61855M54737j60347L0285J6271j40851J60372
16464B456971p14441N8622J69340K99330K60918l01660N1028R2251K1188k31028
$$ plain form
16535 3637944 3458934 3570410 3537820 3400336 3554453 3432404 3226724 2966608 3329509 3280960
16525 3280960 3663670 3110990 3337245 3600246 3021749 3210897 2841243 2936747 2864835 3137029
16515 3137029 2805392 2805215 3059457 3098784 2887076 3126420 3137497 3091905 2865265 2926046 2796388
16504 2796388 2780816 2917653 2693422 2701758 3124803 2649303 2770953 2862277 2561003 2737239
16494 2737239 2691669 2758699 2578650 2983144 2700350 2771481 2325716 2601844 2630940 2681247
16484 2681247 2407520 2257716 2592317 2386093 2416838 2560059 2244890 2524555 2413153 2380927
16474 2380927 2847866 2359224 2458359 2096504 2551241 2390894 2421179 2437450 2296599 2456971
16464 2456971 1742530 1801152 1970492 2269822 2530740 2229080 2280108 2372359 2393547 2162519
16454B162519P1426O3082O615j81320J96733l91630m2086J35511L02205k83224
16444B039831p288k35235J03505J40989k2591o1824k84179M71546J2736p5728
16434B081762J64542m02391o824l3048K25278j56672k88324K59953K23266l02440
16424A765102K42158N489J0878J34299m79052K71991j23947j7599K9347k65403
16414A573263L51550O8069k08281k85348J97541J4200J38045m3284L0770J45440
16404A981965p9922l06876M70097l33660N8698j26731J55127j00367j39792m7218
16394A531321J1159N14649l60868j7618o0576J3500q0715p5213L77356n15703
16384A337292K73467L9824J09956j19080j20410K97621j43242j02048L07111m84422
$$ plain form
16454 2162519 2233945 2297027 2303642 2122322 2319055 1927425 1885339 2020850 2323055 2039831
16444 2039831 2032543 1797308 1900813 2041802 2019211 1957387 1673208 2144754 2157490 2081762
16434 2081762 2246304 1843913 1837089 1804041 2029319 1872647 1584323 1844276 2067542 1765102
16424 1765102 2007260 2012749 2023627 2157926 1678874 1950865 1826918 1809319 1838666 1573263
16414 1573263 1924813 1992882 1784601 1499253 1696794 1710994 1849039 1805755 1836525 1981965
16404 1981965 1902043 1595167 2065264 1731604 1790302 1663571 1818698 1718331 1578539 1531321
16394 1531321 1542480 2057129 1696261 1678643 1618067 1631567 1550852 1475639 1852995 1337292
16384 1337292 1610759 1650583 1760539 1641459 1521049 1818670 1675428 1573380 1880491 1396069
16374A396069Q3716K12675k43266L28426O0471n71141M33970j70375k27781N18244
16364A821008l18577O7361m00548J50192K13518J32109j13233j83414P9337J1681
16354A459434L54532k33348m6701O9396m01669J97816R4485j81237L9383K24761
16344A576852Q6974o0357k81289k54889K14181J75753J73724k04266P3901k60584
16334A240000K62459l46292J0574K07234N0470l92428K12010J8296J48933J17929
16324A529185j03472j01110R4532J14027k40482J46644j24031j7089j04174Q6722
16314A280752Q1093Q0548J2556j86266O3451n3098o1331J39072m3070J26990l39570
16303A101127J1475K76486m6017O6851j02070K57615j78917k34961l6522L63891
$$ plain form
16374 1396069 1479785 1692460 1449194 1777620 1838091 1266950 1700920 1530545 1302764 1821008
16364 1821008 1502431 1569792 1169244 1319436 1532954 1665063 1551830 1368416 1447753 1459434
16354 1459434 1813966 1580618 1533917 1603313 1201644 1399460 1493945 1312708 1352091 1576852
16344 1576852 1663826 1603469 1322180 1067291 1281472 1457225 1630949 1426683 1500584 1240000
16334 1240000 1502459 1156167 1166741 1373975 1424445 1032017 1244027 1262323 1411256 1529185
16324 1529185 1425713 1324603 1419135 1533162 1292680 1439324 1315293 1298204 1194030 1280752
16314 1280752 1361845 1442393 1454949 1268683 1332134 1279036 1217705 1356777 1313707 1440697 1101127
16303 1101127 1112602 1389088 1343071 1409922 1307852 1565467 1386550 1151589 1115067 1478958
16293A478958k29785j04685Q5910j60558O3604o0710j40707K39412l05531K16223
16283A082131K00492R389j31013J06237J57575j24203m86877K51704M9564P432
16273A122431K3891j30963k13798N15588l45926l65890N49123j29226P3387m31020
16263F67597K51340L06085P9896m42946J3897L44795J13818m36573K42749J3342
16253A154000k81795k3555M88697m45329j29422N4883J50779l5552L0805J6254
16243I79765q1922K4832j81843L08443j39418k0843N7030k27324J17513L03692
16233A139925n06801L98919q2847k45892K21892J00949j44536k78871J17875J08416
16223H29029j58696K05165Q7489l48939m519J82540J73771p0699K29804k01824
$$ plain form
16293 1478958 1249173 1144488 1230398 1069840 1133444 1072734 932027 1171439 865908 1082131
16283 1082131 1282623 1292012 1160999 1267236 1424811 1300608 813731 1065435 1114999 1122431
16273 1122431 1146322 1015359 801561 1317149 971223 605333 1154456 1025230 1098617 667597
16263 667597 918937 1225022 1304918 861972 875869 1220664 1334482 897909 1140658 1154000
16253 1154000 872205 848650 1337347 892018 762596 817479 968258 932706 963511 979765
16243 979765 897843 922675 740832 1049275 909857 889014 946044 718720 836233 1139925
16233 1139925 633124 1032043 949196 703304 925196 1026145 881609 602738 720613 829029
16223 829029 670333 875498 962987 614048 609529 792069 965840 895141 1124945 923121
16213I23121k82379j24981L45610J67558k20463j99703J03716O1633l390r9877
16203F70845J6986J02062l32468K36753k07534j10817L49482J62580j23632j30281
16193F33976L65173l19759J7558k87533K52616M69875n05507K1861L1119J44397
16183H23776m10602K26140R9237j94373M0718r2190K97691J71145Q4976E12660
16172I91740q6736k03595K10962l25645O818K86937m19966J8770J76328p087J5188
16161F63714j56197J26899n0944q651B53684N11796k10905n2681J49857J46928
16151G98679C58011L92663k36174j926J53559j91421L08499q0662k07635J28185
16141F23099J38248j41840k96489L43380j75410J3898J30195J64966k95802k09815
$$ plain form
16213 923121 640742 515761 861371 1028929 808466 608763 712479 774112 770722 670845
16203 670845 687831 789893 457425 694178 486644 375827 725309 887889 764257 633976
16193 633976 999149 679390 696948 409415 662031 1131906 626399 648260 679379 823776
16183 823776 413174 639314 738551 544178 584896 492706 790397 961542 1046518 512660
16172 991740 905004 701409 912371 586726 593544 880481 460515 479285 655613 648526 663714
16161 663714 507517 634416 583472 574821 253684 765480 554575 501894 651751 798679
16151 798679 358011 750674 514500 512574 666133 474712 783211 702549 494914 623099
16141 623099 761347 619507 323018 666398 490988 504886 635081 800047 504245 294430
16131B94430p1231R9491J01224J83652B47189O28442D29068L04422B60230G1307
16120D92227j03679K62770p091k07101J5276j19612J27027A48186K32556J04800
16110D85542l2877K49137B62287M88963j6303j55290k87764L15841j47556P7295
16100E37473j61627K8910n5657Q4815J29985k24690J59011A55305K01825A25251
16089E09327J99938A88314K61021j49806j1322K85509A60454L21171k03870p3986
16079B03769K72812K562m9340A23403K30708J3508j5787j66627J2854G7715L01879
16068C79594B1227L72637K0051D6858L3421L9573J39179J25220j77232J88288
16058C95307j25514N0235j12719J34795j6464a02860C58509j06334o285R3893
$$ plain form
16131 294430 223199 322690 423914 607566 247189 875631 429068 733490 260230 71307
16120 492227 388548 651318 644227 437126 452402 332790 459817 148186 380742 485542
16110 485542 452665 701802 262287 751250 734947 579657 291893 607734 460178 537473
16100 537473 375846 404756 349099 433914 563899 339209 498220 155305 357130 125251
16089 509327 709265 188314 449335 299529 288207 573716 160454 481625 277755 203769
16079 203769 476581 479143 429803 123403 354111 367619 351832 185205 198059 77715 379594
16068 379594 21227 393864 413915 46858 80279 119852 259031 384251 207019 395307
16058 395307 269793 320028 207309 342104 325640 -102860 358509 252175 245890 339783
16048C39783k4813r2346L2136G4099j84a96026i4725C01594F9963L65020I6608
16036C26487l1698j26518B8583O6641J93252B8492J41432O646J18804L5419A29522
16024a5566D26133j96313L04210B07991j3573K27700I0988K32794j37848L49353
16014E35287A07184N5518a0970o362A97790M9523p4293p0437Q0259a93176A37324
16002B94986F5916b53247B95871I4904J86199R690g9800A59718M8590B3801L35635
15991C59436M6062j30962J25151O8704l9768L96110K81620E37237J2409k09787
15981C39859A60062M28497k8373A44119M12551A52886k3730P9954e6915k5826
15971h2741B53390A11975O2412d9048A78731H8766C9182g1988o8095A13359I931
$$ plain form
16048 339783 314970 222624 254760 74099 73915 -196026 -94725 301594 69963 434983 96608
16036 326487 294789 168271 28583 95224 288476 28492 169924 176570 295374 330793 129522
16024 -15566 426133 229820 534030 207991 194418 422118 90988 323782 185934 535287
16014 535287 107184 162702 -10970 -17332 197790 247313 173020 102583 182842 -193176 137324
16002 294986 65916 -253247 295871 94904 281103 290793 -79800 159718 208308 23801 359436
15991 359436 405498 274536 399687 468391 428623 824733 1106353 537237 549646 339859
15981 339859 160062 588559 560186 144119 556670 152886 129156 209110 -56915 -82741
15971 -82741 253390 111975 174387 -49048 178731 88766 39182 -71988 -140083 113359 9931
15959A36540L50J16084A03618K92444b54243C50379a36568A0081L7927a32330
15948C16380b42054A69872o2885D9704i4146H0412B2255a01508I0341d2499D12011
15936H4031K7500N9927M5625J81644g0492r4859A25244A8955e9160A134a56396
15924A65185N1694o9080j1451b62730C40198j35893r9930D1257a26940j39976
15914b66916A85982c9940A64737i4280A3455O9049f046o3874F1746b32103A99741
15902I4559m7195b6740k1414A43480c26043C3564J35785f9313D6873J75627m8485
15891A74015m9476P4333A6542a03321j48569C4726J32410J00379a93887I1037
15880C8314K38737B0250a38876m7950d1684B53431l0621a88975d7597k67108B98230
$$ plain form
15959 136540 136890 252974 103618 396062 -254243 350379 -136568 10081 48008 -132330
15948 316380 -242054 169872 106987 49704 -94146 80412 22255 -101508 90341 -42499 412011
15936 84031 111531 171458 217083 398727 -70492 -165351 125244 18955 -59160 1134 -156396
15924 165185 216879 147799 136348 -262730 340198 204305 104375 41257 -126940 -266916
15914 -266916 185982 -39940 164737 -94280 13455 82504 -6046 -69920 61746 -232103 199741
15902 94559 47364 -26740 -48154 143480 -326043 33564 169349 -69313 46873 222500 174015
15891 174015 124539 198872 16542 -103321 -251890 34726 167136 267515 -193887 91037
15880 38314 277051 20250 -138876 -186826 -41684 253431 222810 -188975 -47597 -314705 298230
15868B32825b255j88638j2247M2995B52105A22221f1757r005j2254C47863D6879
15856B11297J14663A59356Q4302j9348B6339a79943O5221b7316C6484J78004q1716
15845A32772J11587A07393J53166a74481F3114a28503H5617J11285F7050P4320
15835A41370a74389O9581B41509A6787J01969k948a24031C59094a33944B58521
15824i4186A37806D6428f0127J8320A41598m9364b7803E8719a51722A9455i3009
15812G3195a04543A50045a64759L9414I9764C8958h4477e168G4787a81478d3377
15800a11300B16042J1350b8302j06426E10159A17275m7450K97914A57907B1310
15789a03561L0259A34354d0706E2302L0945G071K15556j10841b34398p891j5315
$$ plain form
15868 232825 -2255 -190893 -203140 -160145 252105 122221 -61757 -70762 -83016 347863 46879
15856 211297 325960 159356 243658 224310 26339 -179943 -114722 -27316 36484 214488 132772
15845 132772 244359 107393 260559 -174481 63114 -128503 85617 196902 67050 141370
15835 141370 -174389 -104808 241509 16787 118756 115808 -124031 359094 -133944 258521
15824 -94186 137806 46428 -60127 -41807 141598 92234 -27803 58719 -151722 19455 -93009
15812 73195 -104543 150045 -164759 -125345 99764 38958 -84477 -5168 74787 -181478 -43377
15800 -111300 216042 227392 -28302 -134728 510159 117275 69825 367739 157907 21310
15789 -103561 -73302 134354 -40706 52302 83247 7071 222627 111786 -234398 -242289 -257604
15778b57604b4630k03549A90136d5858p5612E4424b49582C2842J32639J31200
15768B96681a48509E0713R3031C7947a04129B99486P3803b64535D3594J6311a740
15756A71010b27141Q0699p2293F7002f002E70056a23190J5920b0528A31202J04564
15745B35766A08745Q949C6091a9318R652A9217N9610f5708j48589A0911J83952
15734A94863k1134D9406a95877A84921E6397Q7773n3935D994a0214j8080B06497
15722a3191A7584J81832E2258P6942D6745M9918a22388j10353Q5927c6232C43695
15710D6158K58291a36021I829K69668b11762M5973J1461A07815f5892r6629j38856
15699c01377B09558a68840f8297j65803c2485A55535i262C32714A2640b25189
$$ plain form
15778 -257604 -24630 -228179 190136 -45858 -121470 54424 -249582 32842 165481 296681
15768 296681 -148509 50713 143744 37947 -104129 299486 373289 -264535 43594 59905 -1740
15756 171010 -227141 -146442 -218735 67002 -6002 570056 -123190 -107270 -20528 131202 235766
15745 235766 108745 117694 36091 -19318 -9666 19217 78827 -65708 -214297 10911 194863
15734 194863 173729 49406 -195877 184921 56397 144170 90235 4994 -10214 -28294 206497
15722 -13191 17584 199416 52258 129200 46745 96663 -122388 -232741 -146814 -36232 343695
15710 46158 304449 -136021 9829 279497 -211762 -165789 -154328 107815 -65892 -162521 -301377
15699 -301377 209558 -168840 -68297 -234100 -32485 155535 -9262 332714 12640 -225189
15688a40876j23650e2769A62116O5760G562L43080q6624I234J86818b14650J02406
15677a12244b5582I996K1603G002a8870E7845a17685d8322l11131a09856q9408
15666a99264b8334A65221E0037L2178b67697P5217i839l81869B2471J24365D1169
15654b43558B3358J94682a85811B70822a54797I3809J27999a06955H9356a06927
15643b45825H5382P0888R6985a96405l5695N3481A04352h8817A9403i128A76566
15631e7943A8669J2330i1231B04Q7901e2976A03687B4032a03822B12756i2343
15619I2613c2047A13108i291I2808m224b73864B52090a53712p6824N4162a3194
15607e7908J3190K583A11899a17025O471b9993o6898B3182a87919m7489R8132
$$ plain form
15688 -140876 -264526 -52769 162116 227876 7562 350642 264018 9234 196052 -214650 -112244
15677 -112244 -25582 9996 31599 7002 -18870 57845 -117685 -48322 -359453 -109856 -199264
15666 -199264 -28334 165221 50037 82215 -267697 -192480 -9839 -391708 22471 146836 41169
15654 -243558 23358 218040 -185811 270822 -154797 93809 221808 -106955 89356 -106927
15643 -245825 85382 156270 253255 -196405 -232100 -178619 104352 -88817 19403 -9128 176566
15631 -57943 18669 30999 -91231 204 88105 -52976 103687 24032 -103822 212756 -92343
15619 92613 -32047 113108 -9291 92808 88584 -273864 252090 -153712 -230536 -176374 -13194
15607 -57908 -44718 -42135 111899 -117025 -110554 -29993 -96891 23182 -187919 -235408 -137276
15596a37276j26007p7734B63726p594n1018g0248q8151P4752B04871r4031J39932
15585B50772A25170a49493M0236G598M206b7159k29145B09234a15775K6980k40103
15574c28898d8787B25892a34592d054k9556A16011O1322a13447j6494A83389l7583
15563A45806m6876b79155j25803B40024i8698b438o626q4145j38103h5550B44015
15551i275n6008j19750A72650L6958H6241l9826a2712A56159a98381j62348a68144
15539C78971h1106J594G2132d045G3161i3973m0462A36259m0137b53640a18932
15527c85234A49454o5602b38573B14600I182K28883i8121C55029N2180b30271
15516H6667K6994F429L55827j22668a88536L6812A99882J6441A01681B1772a6887
$$ plain form
15596 -137276 -263283 -341017 263726 256132 205114 -70248 -158399 -83647 204871 110840 250772
15585 250772 125170 -149493 -109257 7598 11804 -27159 -256304 209234 -115775 -88795 -328898
15574 -328898 -48787 225892 -134592 -4054 -33610 116011 177333 -113447 -129941 183389 145806
15563 145806 98930 -279155 -404958 240024 -98698 -2438 -9064 -93209 -231312 -85550 244015
15551 -9275 -65283 -185033 172650 209608 86241 46415 -12712 156159 -198381 -360729 -168144
15539 378971 -81106 -79512 72132 -4045 73161 -93973 -134435 136259 96122 -253640 -118932
15527 -385234 149454 83852 -238573 214600 9182 238065 -98121 355029 407209 -230271
15516 86667 113661 6429 362256 239588 -188536 -151724 199882 216323 101681 21772 -16887
15504c40689A86188E9138a01337n3645I8476C6250L3235Q4079n9334D4976J50046
15493A95022A8614g2295j5819p4526j6988e7227A74561a61290e7194k96042H5952
15481D5584C241M1857J1658a20181L1319k4516C26104p7516J18177b96229c8982
15469A07891J80440j4747D5567N8778f8726b4643A33559A2737L10961f6984g329
15457B13527n3618f5653k02205B34707l4961H5350N8424N501f4990I7198O2130
15446A59328h7316C25068q6308J11242J46070B20064K23101K29204B17960P3832
15436B91792g086F6612a1697C5321c5674a0067j66675Q1691k16105J27428J2305
15425a71423A4670Q9725a66217f7330k00993C238a57010N2554j24624D6757a13101
$$ plain form
15504 -340689 186188 59138 -101337 -154982 98476 36250 69485 153564 94230 44976 195022
15493 195022 18614 -72295 -88114 -162640 -179628 -57227 174561 -161290 -57194 -353236 85952
15481 45584 3241 45098 56756 -120181 -88862 -113378 326104 248588 366765 -296229 -38982
15469 107891 288331 273584 45567 104345 -68726 -24643 133559 12737 323698 -66984 -7329
15457 213527 159909 -65653 -267858 234707 199746 85350 143774 149275 -64990 97198 159328
15446 159328 -87316 325068 238760 350002 496072 220064 443165 672369 217960 291792
15436 291792 -7086 66612 -11697 35321 -35674 -10067 -176742 -95051 -311156 -183728 -171423
15425 -171423 14670 104395 -166217 -67330 -268323 3238 -157010 -104456 -229080 46757 -113101
15413g3609O896A18572d7396E699M06975a19474A78043q8092b48914n164A75298
15401A62396b75100a9152j6320a7529%C36326A7240b06073A99827a77932C66893
15389b85677A86059n4233n8810g1360A01321e8959j49024e6112D1818M0768R5737
15378A78323K32078i2779n036A11869l9674d4864H4514B1451M36973i8583K0332
15367g8251C3153b1230j62550G454M85871r8561A04554A319K32089G2228J44108
15356B16336r8568B669c01521A74329c1548n5003q8325Q0668G8867a26999B4922
15344G6027K66009a2125A162J70913P5710l1206p0207K55291A44615C565J01419
15333A04984f5587g53I9317h6565C47037a88703O0032B3217P7494J56024k8709
$$ plain form
15413 -73609 -66713 118572 -47396 5699 412674 -119474 178043 89951 -248914 -254078 175298
15401 162396 -275100 -19152 -35472 -17529 -17529 336326 17240 -206073 199827 -177932 366893
15389 -285677 186059 131826 73016 -71360 101321 -58959 -207983 -56112 41818 82586 178323
15378 178323 410401 -92779 -97815 111869 72195 -44864 84514 21451 458424 -98583 -78251
15367 -78251 33153 -21230 -183780 7454 493325 394764 104554 1319 233408 72228 216336
15356 216336 117768 2669 -301521 174329 -31548 -86551 -174876 -94208 78867 -126999 24922
15344 76027 342036 -12125 1162 172075 247785 216579 146372 401663 144615 3565 104984
15333 104984 -65587 -753 99317 -86565 347037 -188703 -128671 23217 100711 256735 228026
15322B28026Q0704E3600a40571A82487C5642K15064a66849j17505A5843L2275
15312D8118a52850I4143a28104C04340R106j14899n2712a07916A99289a25573
15301B67435p0853a49920j10508i9378A45669e2271A67067p128a47647B11232
15290f7706C73371A24798J51412c42215f7541l6183C57914d04594a24237k06517
15280c30754c7879B31316a8443A58180i9641a7515j63579A57718a23823j9022
15270a42845C29072h7458C27543j56343m6760m4395A4842J01567e8462B22510
15259B02134M2990F3994J95738a89063Q2699A01240a68947G1732K03214H7244
15248b10824I2384j9234B7941f7407D3485m290N1463j2932b02128D1199J14659
$$ plain form
15322 228026 308730 53600 -140571 182487 35642 250706 -166849 -284354 15843 48118
15312 48118 -152850 94143 -128104 304340 313446 198547 145835 -107916 199289 -125573
15301 267435 196582 -149920 -260428 -99378 145669 -52271 167067 159939 -147647 211232
15290 -67706 373371 124798 276210 -342215 -67541 -103724 357914 -404594 -124237 -330754
15280 -330754 -37879 231316 -18443 158180 -99641 -17515 -181094 157718 -123823 -142845
15270 -142845 329072 -87458 327543 171200 124440 80045 14842 116409 -58462 222510
15259 202134 245124 63994 259732 -189063 -106364 101240 -168947 71732 274946 87244
15248 -210824 92384 73150 27941 -67407 43485 39195 90658 77726 -202128 41199 155858
15237A55858O1736G5274B3567J2098b09392A71449o7254B2867K55111I5789a63480
15225I2431J35416q3941n4627K81040A47603Q7723e2637k11185G6738g5343k4302
15214i9645C07838q1108A1405g882A67789B0174K994J56055K65376j06588e9168
15202a57754e6820B66881J16552e4343B58357a12659c7013F9258P6722J42078
15192B88058g9940k1501j44009q299B60557i3461c8273B81232H0838C5120c8031
15180b29422A38499c3951B46941b6831j9286C4169J31521N4991a03452B42423
15169b08541I629i0807A14239K61943E4182a91183e8837f195B86782J94022h2190
15157A136K62045r8472b7952k91476A63842M8520P5005m8541c24064a61555A28077
$$ plain form
15237 155858 217594 75274 23567 35665 -209392 171449 104195 22867 277978 95789 -163480
15225 92431 227847 143906 89279 370319 147603 235326 -52637 -263822 76738 -75343 -99645
15214 -99645 307838 226730 11405 -7882 167789 20174 23168 179223 444599 338011 -59168
15202 -157754 -56820 266881 383433 -54343 258357 -112659 -37013 69258 145980 288058
15192 288058 -79940 -101441 -245450 -253749 260557 -93461 -38273 281232 80838 35120 -38031
15180 -229422 138499 -33951 246941 -26831 -46117 34169 165690 220681 -103452 242423
15169 -208541 9629 -90807 114239 376182 54182 -191183 -58837 -6195 286782 480804 -82190
15157 1136 263181 164709 -27952 -319428 163842 212362 287367 238826 -324064 -161555 128077
15145B83842I8434k7461A6920J24328a03062o3440A15445J12806b21442B33674
15134A68957N8523a2305B03323e2578F5336P1017K12305C3600L07203A49812e9238
15122B24652a86578D6272J75449E285L14497a12394D1566J37463D6903k1832b15873
15110A2815b87506C72165A13856a1241o3569H0340j9724O4651B167J29138M9064
15099A80369c5166C66484j29737B0131K1083i8579B52113I1586K20177A23140
15088C3123A728J36764e8123G4220M6960Q2148g2139n1846D23741L37032B21590
15076E0555K350K56390G7163O1095P3727k4490n2370n1508B8761L9837d7917G3230
15063A55068F9913J06668J81217J14234k26484I4223l4385K60417B272J59138
$$ plain form
15145 283842 98434 70973 16920 141248 -103062 -166502 115445 228251 -221442 233674
15134 168957 227480 -12305 203323 -52578 65336 136353 348658 33600 340803 149812 -59238
15122 224652 -186578 46272 221721 5285 319782 -112394 41566 179029 46903 25071 -215873
15110 12815 -287506 372165 113856 -11241 -74810 80340 60616 125267 2167 131305 180369
15099 180369 -35166 366484 236747 20131 41214 -98579 252113 91586 311763 123140
15088 33123 1728 138492 -58123 74220 121180 203328 -72139 -123985 423741 760773 221590
15076 50555 52905 309295 77163 138258 211985 187495 135125 83617 28761 68598 -47917 73230
15063 155068 69913 176581 357798 472032 245548 94223 59838 320255 2272 161410
15053A61410K18708j13383p8592M1932F158L65255j68344j3776J20726F0954a31856
15041B54794n2810k0062P7809r8209k4366n2514N14649e81B29248J24583A18017
15029B35601J36993I2092L51004o5123P3833A18858K98652K9161P881m1292j08574
15018C04686a1004C73696E6635R3281K34569A47455n8873R0572a09980B97657
15007B56700o2263M1100q9414K77846f0049C78034J6887F8887K55171J00479A93994
14995B65502k1286J61055k3100J2173j91304q3959n9007M76042q0510q0695P6048
14984D50959j64065O6339p0627C5474K11319A8145K36436J55288K45666l029j33559
14973E18947B03143J13000L3955D2826N13105j78187J38814j45697J07724a14967
$$ plain form
15053 161410 380118 266735 188143 230075 6158 371413 203069 189293 310019 60954 -131856
15041 254794 201984 181922 259731 161522 137156 84642 599291 -581 229248 353831 118017
15029 235601 372594 92092 443096 377973 451806 118858 417510 446671 454552 413260 304686
15018 304686 -11004 373696 56635 149916 384485 147455 88582 179154 -109980 297657
15007 256700 194437 235537 146123 423969 -60049 378034 394921 68887 324058 424537 193994
14995 265502 244216 405271 382171 394344 203040 119081 60074 536116 455606 374911 450959
14984 450959 286894 353233 282606 35474 246793 18145 254581 409869 655535 652506 518947
14973 518947 203143 316143 350098 42826 555931 377744 516558 370861 478585 -114967
14962D18055F2762J48624p2398n1138L24201j36744K42608l8096j57492m2861
14952B79466J73812p3817E0852J31373J23802Q5338D6683N20177J37717B25724
14941B86277m2680D8229P1406K7633Q4230J51098r8426J45450B06224K96748r0211
14930D12761J02219k3506P128K23395j89163L31491k11634K0802r9005K68236
14920H42724J3575J09592J12706k45241L17032n8602l45622J23528k78162J99712
14910G91242k45485B11092L14114j44453K4451I1775K51233j20777K07231j11712
14900C17750A01833R8235q5932P0880N6512K04652J38543n0432F3582M58321j57978
14889C63925K26802j57364l1610M0042j77595l2363J91016n7077H456M36875A26041
$$ plain form
14962 418055 62762 211386 138988 87850 412051 275307 517915 479819 322327 279466
14952 279466 453278 379461 50852 182225 306027 391365 46683 566860 704577 225724
14941 286277 243597 48229 119635 147268 231498 382596 284170 429620 206224 502972 412761
14930 412761 514980 491474 498602 721997 532834 864325 652691 673493 574488 842724
14920 842724 856299 965891 1078597 833356 1150388 1091786 746164 869692 591530 791242
14910 791242 545757 211092 525206 380753 405204 91775 343008 222231 429462 317750
14900 317750 101833 200068 114136 185016 241528 446180 584723 534291 63582 521903 363925
14889 363925 590727 433363 401753 441795 264200 231837 422853 365776 8456 445331 126041
14877C98210N7101k14241K45904J34817B53624K22454j17985G6252M26057q7523
14867D14786g0157E20400j92911L6330o6463j40397q315K17539A39572Q9422r371
14856B19623K31430j29577J14072A21946K0056J67159Q6558A71180p2742G369
14845F57864k49979M2234L02756k62453Q2397J97102k93624K53038k07571L08413
14835H30177J2324O613k03541j63067r4155A91609J98114l3370j9863J63325J6351
14824E16166A96365L84115B64885I3412K87896j89118K83813q6173r6488n7540
14814B35802J52770K99340l30535j35773I6894K86610L8255j12146K40000m68
14804E49145k1717o8941j34367K21820L65307l50039P4778J07019B93085K02366
$$ plain form
14877 398210 455311 241070 486974 621791 253624 476078 358093 76252 502309 414786
14867 414786 -70157 520400 327489 363819 297356 156959 148644 366183 139572 228994 219623
14856 219623 451053 321476 435548 121946 142002 309161 395719 171180 98438 7369
14845 657864 407885 450119 752875 490422 572819 769921 476297 729335 521764 830177
14835 830177 842501 849114 645573 482506 388351 191609 389723 356353 336490 499815 516166
14824 516166 196365 580480 264885 93412 381308 192190 476003 389830 293342 235802
14814 235802 388572 687912 357377 221604 96894 383504 421759 309613 549613 549145
14804 549145 527428 458487 324120 545940 911247 561208 635986 743005 293085 495451
14794D95451q4217A67465J12925L17050j21670j29932J94341Q7545k19432L70382
14784G78674C51959L598O7402P5454K5538B19867K94686j53310L64341C58507
14773F68737l26037J66222j22490K82703k30488A63913K80592J00190k05430j68703
14763A70562K50283j25685M2055K14881M07362B93141Q963K84386K76849D24779
14752C07491K57887M35905m55669p544r8007P7347J29041M34301C90179Q4428
14742D74607j90131K97020Q4994j01640J30802j19532k51198L67695k50940K11904
14732F53581J07074J00500k79279j40578J8974K78870q8591L53355r0140j55090
14722G58676k6409j3961J26786R1947l0162R436k6284k23874J35638K7725l68996
$$ plain form
14794 495451 411234 167465 280390 597440 475770 345838 540179 627724 408292 778674
14784 778674 351959 355557 422959 498413 523951 219867 514553 361243 725584 358507
14773 668737 342700 508922 386432 669135 438647 163913 444505 544695 339265 170562
14763 170562 420845 295160 337215 552096 959458 293141 302104 586490 863339 424779
14752 307491 565378 1001283 545614 538070 440063 517410 646451 1080752 390179 474607
14742 474607 284476 581496 666490 564850 695652 576120 324922 692617 441677 653581
14732 653581 760655 861155 581876 441298 460272 739142 650551 1003906 913766 758676
14722 758676 732267 718306 845092 937039 906877 916313 890029 666155 801793 829518 460522
14711D60522N80895D39017K01554L2149L8516l13637K72953j21764r4669O99237
14701A153356j32186j69462o3994Q700O0000o9765N62476m54336J73658l58821
14691G09626K04764k65677O3630n0787R1693n9773k8326N7489k63619L21436l21534
14680D58922M76334k85764J31657M63225E90550r625R2483L68704l69425j74925
14670D97762M48919r7601j55095K67022q013R6455m04894L71144l49490J47925
14660H14134j00438K6569K99410l03831J88756k8632K32018k68760n2155L19379
14650A126450j71363J10266j87854k4105L7144R1145q2044L47242E60066M48855
14640A008921l5230j28504K11008Q8026j25154j04526n0230N1971K08452m29287
$$ plain form
14711 460522 1041417 439017 640571 672720 711236 397599 670552 548788 454119 1153356
14701 1153356 1021170 851708 787714 796414 856414 786649 1349125 894789 1068447 709626
14691 709626 914390 648713 712343 661556 753249 693476 665150 722639 459020 780456 458922
14680 458922 935256 649492 781149 1244374 590550 580925 673408 1042112 672687 497762
14670 497762 946681 849080 693985 961007 952994 1049449 644555 1015699 666209 814134
14660 814134 713696 740265 1039675 735844 924600 895968 1127986 859226 807071 1126450
14650 1126450 955087 1065353 877499 853394 890538 981683 899639 1246881 560066 1008921
14640 1008921 973691 845187 1056195 1144221 1019067 914541 864311 916282 1124734 695447
14630F95447M09383K44m0839q7003M2995o8606j97888L46801k86740K86669k24094
14619H76369N64009l10438J35269j46636O4110M3696J04610l76673L85696m41746
14609H98266j8889K72370k48991q0489M11495L6453k75027J84107K61825j61299
14599A279821j48891J36453o9684j34282K44408j18424J60773j02891q2389L06702
14589A471596L3322j54048N6115n0727K62254n3431J8930j30847q4792K50710
14579A619082j9436k21400J86374L17891m9943k07628L03028j36155K2289j96069
14569A618033J88944k34273K93218n9570q747L35447j72467J93136K4623l19288
14559A859056K16981L57017k28573L90552o7823K19820R1526O61917O61011P39619
$$ plain form
14630 695447 1104830 1105074 1064235 977232 1020227 951621 753733 1100534 813794 1100463 876369
14619 876369 1440378 1129940 1265209 1118573 1182683 1226379 1330989 954316 1340012 898266
14609 898266 879377 1151747 902756 822267 1233762 1270215 995188 1179295 1441120 1279821
14599 1279821 1130930 1267383 1197699 1063417 1307825 1189401 1350174 1247283 1164894 1471596
14589 1471596 1504918 1350870 1406985 1356258 1618512 1565081 1584011 1453164 1368372 1619082
14579 1619082 1599646 1378246 1564620 1882511 1832568 1624940 1927968 1791813 1814102 1618033
14569 1618033 1806977 1572704 1865922 1806352 1797605 2133052 1960585 2153721 2178344 1859056
14559 1859056 2076037 2433054 2204481 2595033 2527210 2747030 2838556 3500473 4161484 4901103
14549D901103K135499L226164O604038R750298N169360j1919312I841714D799878
14540C345704j007604q5018J37021o72358K62444m38061J50945k32982J94373
14531A654464j96322M09556k06463K22285r4176k33788J31071r4323K45038L45453
14521B182795m79772N31875j84465q7719K92861k65268J12624j68921J61787j8245
14511B077552J41581j17421P9549Q8947n3536N0285m2961m4364N3433J87971j13688
14500B307348J32923K18731k27795L7061K75490k69775L33617j20346K3449J41031
14490B851734j67153o8688p8874L50742P684J687q4748L6601K13553k78417K82890
14479C067011j02361L48536m5573m15204N3209J35438K60641J25478R645j67494
$$ plain form
14549 4901103 7036602 10262766 16866804 26617102 31786462 19867150 9841714 4799878
14540 3345704 2338100 2253082 2390103 1717745 1980189 1542128 1693073 1460091 1654464
14531 1654464 1458142 1867698 1661235 1883520 1789344 1555556 1686627 1592304 1837342 2182795
14521 2182795 1703023 2234898 2050433 1962714 2255575 1990307 2102931 1934010 2095797 2077552
14511 2077552 2219133 2101712 2181261 2270208 2216672 2266957 2223996 2179632 2233065 2421036 2307348
14500 2307348 2440271 2659002 2431207 2468268 2743758 2473983 2807600 2687254 2710703 2851734
14490 2851734 2684581 2615893 2537019 2887761 2895445 2897132 2812384 2848985 3062538 2784121 3067011
14479 3067011 2964650 3313186 3267613 2852409 2905618 3041056 3301697 3427175 3436820 3269326
14469C269326K50240j09956o5200R4925k80032N19600k91816L46861j05637K73076
14459C901387k7943R2635M0034j77799L33148m05019K22989L48478o1245L8664
14449D305329P3238l23594J77040J109L61134o1152j10438J39311K36688J5124
14439D813789M4965J46648k4607J61944Q0941j47189K43072j91728J43968J86889
14429E458692j53976L64841J7810k3547K28775r0866K86934J17016J22940k34616
14419F094003K86409L33944N7862L132K00791J32173m45715l2512K19586M33244
14409G282917o6794k9888J9081J38124N66337k1796M36517k66512J31488K84891
14399H474365k76855J40435M77566p7151L03711J18250J82207O3471K52220K58865
$$ plain form
14469 3269326 3519566 3409610 3344410 3439335 3159303 3678903 3387087 3733948 3628311 3901387
14459 3901387 3873444 3966079 4006113 3828314 4161462 3756443 3979432 4327910 4266665 4305329
14449 4305329 4378567 4054973 4232013 4233122 4594256 4533104 4422666 4561977 4798665 4813789
14439 4813789 4858754 5005402 4980795 5142739 5223680 5076491 5319563 5127835 5271803 5458692
14429 5458692 5304716 5669557 5687367 5663820 5892595 5801729 6088663 6205679 6328619 6094003
14419 6094003 6380412 6714356 6772218 6775350 6976141 7108314 6662599 6630087 6849673 7282917
14409 7282917 7216123 7186235 7205316 7343440 7909777 7887981 8324498 8057986 8189474 8474365
14399 8474365 8197510 8337945 8815511 8738360 9042071 9160321 9342528 9405999 9658219 9917084
14389I917084k1052L51566K98087j67457O79496k43744J44485N94293j08035L03356
14379A1748079R147J49441M44329L97510L6257K30617K33346M39808M9030O30575
14369A4368139k35538N69100J79532Q85040j6041K87319L11737J68791K62904
14360A6780983M67524Q02173J97995L2322O75886M51199N49985J87363N00638
14351B0646068N88882O02194O53044O01271M49390K20993J095746L20438J060175
14342B6238201M45146P82340P46276L33348Q71847J028290Q42049J049517R33730
14333C3270744P65532J223342J115092J541490R01280J483218J016154J305489
14325D2622341J552177J484608J575174J806632J324282J920408J803299K419592
$$ plain form
14389 9917084 9896032 10247598 10545685 10378228 11057724 10813980 10958465 11552758 11444723 11748079
14379 11748079 11757226 11906667 12350996 12748506 12784763 13015380 13248726 13688534 13737564 14368139
14369 14368139 14132601 14701701 14881233 15766273 15750232 16037551 16349288 16518079 16780983
14360 16780983 17248507 18050680 18248675 18280997 18956883 19408082 19958067 20145430 20646068
14351 20646068 21234950 21837144 22490188 23091459 23540849 23761842 24857588 25178026 26238201
14342 26238201 26683347 27465687 28211963 28545311 29417158 30445448 31287497 32337014 33270744
14333 33270744 34036276 35259618 36374710 37916200 38817480 40300698 41316852 42622341
14325 42622341 44174518 45659126 47234300 49040932 50365214 52285622 54088921 56508513
14317E6508513J667982K153238K139220L060570K635242K675079K931293L348104
14309G7119241K703165M087603L470293L976912M375050M420598M579816N202893
14301A09935571N471897N405776O046151O883722O582658P921880P916182Q024894
14293A64188731Q970488R664294R913465J0525959J1322321J2130597J2244905
14286B38960760J3121281J4106605J4168471J4721315J5367585J5802595J5743670
14279C41992282J5603336J5214532J4691997J4016014J2416999J0521774O066378
14272D30523312K772823K149563J385745J376560j618214l583802n125483q311548
14264D19568956j0660855j2419576j3476472j4495429j5690758j6113924j6244579
$$ plain form
14317 56508513 58176495 60329733 62468953 65529523 68164765 70839844 73771137 77119241
14309 77119241 79822406 83910009 87380302 91357214 95732264 100152862 104732678 109935571
14301 109935571 115407468 120813244 126859395 133743117 140325775 148247655 156163837 164188731
14293 164188731 173159219 182823513 192736978 203262937 214585258 226715855 238960760
14286 238960760 252082041 266188646 280357117 295078432 310446017 326248612 341992282
14279 341992282 357595618 372810150 387502147 401518161 413935160 424456934 430523312
14272 430523312 433296135 435445698 436831443 438208003 436589789 433005987 427880504 419568956
14264 419568956 408908101 396488525 383012053 368516624 352825866 336711942 320467363
14257C20467363j6087236j5587126j5008070j4581922j4030388j3020942j2737267
14250B19414412j1595886j1332292j0406505r696295r332050q494395q001669
14243A50555320p537459p455126o213279o564194n598375n701941m921934m645707
14235A01917305m907113m204674m247704l523204l422680l375091l066664l167133
14227G2003042k918402k844458k520909k284902k387963j704354k261707k061285
14219E3019062j806661j884458j704747j696285j453748j434245j093141j079739
14211D0866038j799466j063886j352454o91656r13753n48593j549987p54963j039507
14202C1151773p32815j089898n46815p80767p85572n61732j129124k80167l64479
$$ plain form
14257 320467363 304380127 288793001 273784931 259203009 245172621 232151679 219414412
14250 219414412 207818526 196486234 186079729 176383434 167051384 158556989 150555320
14243 150555320 143017861 135562735 129349456 122785262 117186887 111484946 106563012 101917305
14235 101917305 97010192 92805518 88557814 85034610 81611930 78236839 75170175 72003042
14227 72003042 69084640 66240182 63719273 61434371 59046408 57342054 55080347 53019062
14219 53019062 51212401 49327943 47623196 45926911 44473163 43038918 41945777 40866038
14211 40866038 39066572 38002686 36650232 35958576 35044823 34496230 32946243 32191280 31151773
14202 31151773 30418958 29329060 28782245 28001478 27215906 26654174 25525050 25244883 24880404
14193B4880404j010577q48397m55739o12296k88298o88089n76049m85948l51104
14184A9563907o60339p4622n53534m81842n11509p1977l45650o42035n3893n91667
14174A5576839j53690m14995l99958J80103m10793j22617o23118K14989o04415
14165A3242345k39205m49268k7891k77845j35205n66472k7553L644o11729L79537
14155A1290358l87386n01209p2214l7842o097m64518J8977m39645J00959j84594
14145I316789M2655j81938l41664k60353J18320m05458Q4275m5918m81250p0819
14135G774639k65922j91827N53926k68490k70596M6317K0256l76518L4128j99172
14125F856741m2594q868l52678L15676n04442N5276j11705J58892m13975J78142
$$ plain form
14193 24880404 23869827 23021430 22565691 21953395 21665097 20977008 20400959 19915011 19563907
14184 19563907 18903568 18828946 18275412 17793570 17282061 17210084 16864434 16222399 16168506 15576839
14174 15576839 15423149 15008154 14608196 14788299 14377506 14254889 13631771 13846760 13242345
14165 13242345 13003140 12553872 12525981 12248136 12112931 11546459 11518906 11522550 10910821 11290358
14155 11290358 10902972 10401763 10329549 10291707 10285610 9821092 9840069 9400424 9501383 9316789
14145 9316789 9359444 9177506 8835842 8575489 8693809 8288351 8372626 8326708 7845458 7774639
14135 7774639 7508717 7316890 7870816 7602326 7331730 7378047 7398303 7021785 7055913 6856741
14125 6856741 6814147 6805279 6452601 6768277 6263835 6319111 6207406 6366298 5952323 6130465
14115F130465k85487k51643J0557l6124r9399J33437j83031k79524K28182R3184
14105E460617l27030L9743L9086j69900L9102r0324j98904R909J92j01216J31690
14094D832965n9273l14944m7227p8449n1945j70676J95591j1393O3567J00562
14084D458778j59051k8435k99993J16869k26961k01174J56942J30388k28944K06444
14074C924863l65716l0584m0925O7343J94348k60699m8233K4750J66432l25804
14064C305775q2605K70575J13404l02192M0535L6696P805m4949n10176K53378
14054C088246n9577Q0138j7147j51467o3738j29795J99419j61369J63542l54047
14044B594205r8292K65640l44326L56932j32294M5828j67457n3487L48644m6797
$$ plain form
14115 6130465 5844978 5593335 5603892 5567768 5468369 5601806 5418775 5139251 5367433 5460617
14105 5460617 5133587 5173330 5212416 5042516 5081618 4991294 4792390 4802299 4802491 4701275 4832965
14094 4832965 4773692 4458748 4411521 4333072 4281127 4110451 4306042 4294649 4358216 4458778
14084 4458778 4299727 4271292 3971299 4088168 3861207 3660033 3816975 3947363 3718419 3924863
14074 3924863 3559147 3528563 3487638 3554981 3749329 3488630 3440397 3465147 3631579 3305775
14064 3305775 3223170 3493745 3607149 3304957 3345492 3382188 3389993 3345044 2834868 3088246
14054 3088246 3028669 3108807 3091660 2940193 2876455 2746660 2946079 2784710 2948252 2594205
14044 2594205 2495913 2761553 2417227 2774159 2641865 2687693 2520236 2466749 2815393 2768596
14034B768596L02637k07951l76504L00829m96962N12484q2763j72709k54139J22848
14024B416366J05607k01402m36852M10904j7384k14165J46216j58746M4481J50960
14014B245985j4178k74957J8607j00248M69358o37493J52256J39398l81542J72178
14004A789364K2694J94270m15866J91366n5368K47325l72249L26017N7861K28203
13994B213617k60181R1190N20481r6221M42328J145134K266558M696912R710904
13985B0730722J0712614n214736j0772051o194709l442095j168271m02253q62148
13977C387073m08709j39469l13597k63168J66729k51564L7101J02102j09756l01727
13967A905015k23087K42896j26254J70478k0820r8350J7851j16460Q4758j12612
$$ plain form
14034 2768596 3071233 2863282 2486778 2787607 2290645 2803129 2720366 2547657 2293518 2416366
14024 2416366 2521973 2320571 1883719 2294623 2277239 2063074 2209290 2050544 2095025 2245985
14014 2245985 2231807 1956850 1975457 1875209 2344567 1707074 1859330 1998728 1617186 1789364
14004 1789364 1812058 2006328 1590462 1781828 1726460 1973785 1601536 1927553 1985414 2213617
13994 2213617 1953436 2044626 2565107 2468886 2911214 4056348 6322906 11019818 20730722
13985 20730722 31443336 26228600 15456549 9261840 5819745 4651474 4249221 3387073
13977 3387073 2978364 2838895 2525298 2262130 2428859 2177295 2214396 2316498 2206742 1905015
13967 1905015 1681928 1924824 1798570 1969048 1948228 1849878 1867729 1751269 1836027 1723415
13957A723415m3397j79234L35390k38175j37265K92514n34207K37254N3816q0264
13947A429847J38674n9496r2622J33220K6277J24065l98947J77927k37408L04043
13937A545580j30391k355k7408j93997M52084j92502j24433l6636j68386P4302
13927A195858M02407n66437M53461k88252N3547j15705N6251K82553k83180j89348
13917A001155M66935k21443o5707p246j28556K61131k43826k0327J45297o3380
13907A124033j39845J9523J71878l34554M8292J7378O9465K62564J9076l07038
13897I50772L24781k36653J15184L7162q3387l9496j3750j57756J01009j32527
13887H65339M32264j89414k81900k5439L17773q5901j80181j11281J76046Q9174
$$ plain form
13957 1723415 1680018 1500784 1836174 1597999 1460734 1753248 1219041 1456295 1510111 1429847
13947 1429847 1568521 1509025 1416403 1549623 1575900 1699965 1301018 1478945 1241537 1545580
13937 1545580 1415189 1412834 1385426 1191429 1643513 1451011 1326578 1289942 1121556 1195858
13927 1195858 1598265 1031828 1485289 1197037 1250584 1134879 1191130 1473683 1190503 1001155
13917 1001155 1468090 1246647 1180940 1173694 1045138 1306269 1062443 1042116 1187413 1124033
13907 1124033 984188 1003711 1175589 841035 889327 906705 976170 1238734 1257810 950772
13897 950772 1275553 1038900 1154084 1191246 1107859 1068363 1054613 896857 997866 865339
13887 865339 1297603 1108189 826289 800850 1118623 1032722 852541 741260 917306 1006480
13877A006480O0796k99788L04766l39717J64886l11098M09465Q5212j77295J10826
13867A014533J01829j19054l67268L59873k28996J81765o5524m6393J69257P2049
13857A072071j0115r3856k68056K67389l93802K42783r2529L0886J60135j46277
13847G68629M9350N7014O1847q6088j71383J94448k93629J77510q734J38616l89904
13836D97676M18164q6158j80143J02750o8795J85753N3161j70607o9116B71038
13825G48400k3984O1694j34930M66624n28120J03579L09320D45895L51609j97039
13815F00465J52902k4348M9115J28802j25913l14996q6524L91478j14452J17373
13805G73902j13920O5377C54596J69595K03002J64382j98351j57745J90542q9926
$$ plain form
13877 1006480 1067276 767488 1072254 732537 897423 586325 995790 1081002 903707 1014533
13867 1014533 1116362 997308 630040 989913 760917 942682 877158 830765 1000022 1072071
13857 1072071 1061956 968100 700044 967433 573631 816414 723885 754771 914906 768629
13847 768629 817979 874993 936840 850752 679369 873817 580188 757698 748964 887580 497676
13836 497676 915840 829682 649539 752289 683494 869247 922408 751801 682685 271038
13825 748400 724416 786110 651180 1117804 589684 693263 1002583 445895 797504 600465
13815 600465 753367 729019 778134 906936 781023 466027 379503 770981 656529 773902
13805 773902 659982 725359 354596 524191 727193 891575 693224 535479 726021 636095
13795F36095j54356J50686L5870j21460r2085N04644C58589J53846j76865L76735
13785G12305k80134K50055j55180N12431l64240K06392B06197L11252J16960L3414
13775F67823j94736M26641l64646j85594O3319J37786M56141k12903k75878L3324
13765E51277k62603J75198o7550J70016J67006k70677j5615J51696k73324J89642
13755E15066j11205M29472k94669o4827M87258C96892J91383j40495N2238r0128
13745D09890m3338r6648L81521O9682k68440J79643k63509K58244j65901N565
13735D66709J0434A87708L95541J520j52701l6885J75246j94767L7688J2598J36206
13724E62154B00870L47792k03378N5100l3348m3251N4670A77143N60143k42093
$$ plain form
13795 636095 481739 632425 668295 546835 454750 959394 358589 512435 335570 712305
13785 712305 432171 682226 527046 1039477 675237 881629 206197 517449 634409 667823
13775 667823 473087 899728 535082 349488 412807 550593 1006734 793831 517953 551277
13765 551277 288674 463872 396322 566338 733344 462667 447052 598748 325424 515066
13755 515066 403861 833333 538664 473837 961095 396892 588275 447780 500018 409890
13745 409890 366552 269904 651425 721107 452667 632310 368801 627045 461144 466709
13735 466709 477143 187708 583249 584769 432068 395183 570429 375662 413350 425948 562154
13724 562154 200870 548662 345284 400384 367036 323785 378455 177143 737286 495193
13714D95193J54544B93918K39825q4530P7882J23893l8905N4085k85742R078k0758
13703C68746K7093A40132K50390r0220Q767H0684M83495j61117M00916C78079
13692D84421g1538D67789j4443J19208p8309A12547K67035l3814j37301L7563
13682B46030O3125K82426B07755N2791A21682N03366D3119N48797B44466J11557
13672C56023j64106M0494L97963j84091j75737L7719J62292A56476J6718J89470
13662C62664K72716k71597A14719N14462A40800K3516K68093M1428j08786P6555
13652D41606j32251o2218j18856l6849K15890J27687N1933p7059A13671O1102
13642A74773J23721d7024B19424K35299A78468J19635j33636J00785J18615l4305
$$ plain form
13714 495193 649737 293918 533743 449213 527095 650988 612083 666168 380426 389504 368746
13703 368746 395839 140132 390522 300302 309069 80684 564179 403062 803978 378079
13692 484421 -71538 467789 453346 572554 494245 112547 379582 345768 208467 246030
13682 246030 309155 591581 207755 260546 121682 625048 43119 591916 244466 356023
13672 356023 191917 232411 630374 446283 270546 308265 470557 156476 173194 362664
13662 362664 635380 363783 114719 629181 140800 164316 432409 473837 365051 441606
13652 441606 309355 247137 128281 91432 307322 435009 486942 409883 113671 174773
13642 174773 298494 -47024 219424 454723 178468 298103 164467 265252 383867 349562
13632C49562K12446A93123M6532j2991K73453r1102j79510P8059j03288J60296
13622C64572n3269K76860C5350J1709L02068F3556e305p2893B55628J58162j93215
13611B20575J86461j50777O5777Q8262I4062L7071J46787J3079j23426e6198C98033
13599A63947D5205L75950c9863a2496B24041o2840J58205O589m2249J02144M2275
13588D28165K0012j70891o4658J86598j70082O5047J77252k01452Q5972r3600
13578B62363k8880J12490A27631J29382K46253A69786K30014j75005r1478N5722
13568A89039I4321M70082B10177Q9477O7108A36532R0159a37706A07750K25224
13558C32974m2589j02212L3568m3568k2990K31009a13673D14939F6168N4900K00996
$$ plain form
13632 349562 562008 193123 239655 226664 500117 409015 229505 307564 204276 364572
13622 364572 311303 588163 35350 47059 349127 63556 -5305 -78198 255628 413790 220575
13611 220575 407036 256259 322036 410298 94062 131133 277920 290999 167573 -56198 398033
13599 163947 45205 421155 -39863 -12496 224041 161201 319406 325995 283746 385890 428165
13588 428165 448177 277286 212628 399226 229144 294191 471443 269991 355963 262363
13578 262363 233483 345973 127631 257013 503266 169786 399800 224795 133317 189039
13568 189039 94321 564403 210177 299654 366762 136532 226691 -137706 107750 332974
13558 332974 290385 188173 221741 178173 155183 386192 -113673 414939 66168 121068 322064
13547C22064m719p9539J12545A28648j7768a29345D65922D5876J40010R5026j8796
13536B62116J00552q7926P4279j68336G6763L47143J19854g5963A07361Q0026
13526A87387J20080F5465f7908A77961J07735L49996D7094R3993K51253j78062
13516B14278b31295C99808a34687E54476B42713D8217b1619B97677k3710j16830
13506A57137J05594H7696P2125a84405b171D17141j83137G538L46787a3695A08631
13494A93027i6611C06610j05973a6941B81383J03715h114B32678J7957H0462L46054
13483D26516l0181j47066a11130C58357A02355J57164J8752j028q9422J23612
13473C11433m8200J08221R3455J29590b50898E19644A35884k2443a6698n4431
$$ plain form
13547 322064 317345 237806 350351 128648 110880 -129345 465922 45876 185886 280912 262116
13536 262116 362668 274742 349021 180685 76763 423906 543760 -75963 107361 187387
13526 187387 307467 65465 -67908 177961 285696 635692 47094 141087 392340 214278
13516 214278 -231295 399808 -134687 554476 242713 48217 -21619 297677 273967 157137
13506 157137 262731 87696 159821 -184405 -2171 417141 234004 7538 354325 -13695 108631
13494 193027 -96611 306610 200637 -16941 281383 385098 -8114 232678 250635 80462 426516
13483 426516 396335 249269 -111130 358357 102355 259519 278271 277243 187821 311433
13473 311433 263233 371454 464909 594499 -250898 519644 135884 113441 -16698 -71129
13463g1129C93800A08030K72693l7812n9877j40377a29255A28193f124A56007
13452C06483a07925B02347I2147J35480d4339E2425K94201N8526o1781K41893
13442E85264Q7897B52377j10180n645Q6430n3879K9813k4169Q3318j03433J2314
13431A66946o2980k698L02873j04017o6317A07626K21407b44577A01145J109K88621
13420C90875j19717o7216a59830C40153M8849F5943K05264r8763Q2633B6294K31766
13409B58060a07453c4591B49022B0183L27218k8483q4600e4949D8846L25945j75036
13398A99755l9429M5957f0915H4320C9234a21715m1907D52429E3493R616J37366
13387B00475H2673i8086B91396a42746A30787K38149A05736B5430c0114r7623
$$ plain form
13463 -71129 393800 108030 380723 342911 283034 142657 -129255 128193 -6124 156007
13452 306483 -107925 202347 92147 227627 -44339 52425 346626 405152 343371 585264
13442 585264 673161 252377 142197 136552 222982 169103 198916 174747 258065 154632 166946
13431 166946 103966 101268 404141 300124 233807 107626 329033 -244577 101145 102254 390875
13420 390875 271158 203942 -159830 340153 389002 65943 271207 172444 255077 26294 258060
13409 258060 -107453 -34591 249022 20183 347401 318918 234318 -54949 48846 374791 199755
13398 199755 160326 206283 -60915 84320 39234 -121715 -163622 452429 53493 63109 200475
13387 200475 82673 -98086 291396 -142746 130787 368936 105736 25430 -30114 -127737
13377a27737O2699k18210A60333l2779E6778e6174B41250h5082B52458k655F7955
13365B86169r662a40738c1551A18091J32655r8531M201e9857B85091E2262L3461
13354H5723J85208J32172j52933h0668E0071I843L37094b40965B14627L37579
13344E52206A08161j6192J57162a44991D42820c8167k7172c534B05230K27777
13334D33007I4447K42746A45884J21219D0768a22820E8162f3579C85796j36816
13324B48980j14419J38927j18751J9736D595J06213m9078q839K23931n1919K1248
13313B46151a4581A51671R0920r3888J40038G1837Q9393c37269E72469I8485J60417
13302B58902a91356A53860j6307n5192a82044A00037Q8684K1879p6245k1165d0927
$$ plain form
13377 -127737 -65038 -283248 160333 127554 56778 -56174 241250 -85082 252458 249803 67955
13365 286169 276507 -140738 -31551 118091 250746 152215 156416 -59857 285091 52262 85723
13354 85723 270931 403103 250170 -80668 50071 9843 346937 -240965 214627 552206
13344 552206 108161 91969 249131 -144991 442820 -38167 -65339 -3534 205230 433007
13334 433007 94447 337193 145884 267103 40768 -122820 58162 -63579 385796 248980
13324 248980 134561 273488 154737 174473 4595 110808 61730 52891 276822 224903 246151
13313 246151 -14581 151671 242591 148703 288741 71837 161230 -337269 572469 98485 258902
13302 258902 -191356 153860 137553 82361 -182044 100037 188721 210600 134355 113190 -40927
13290b43464D45348C3675c2835B42279B2987N5654d7029B30681P300A07422P7352
13279A84774p8000a6315j60092A02074h9948n1685A08545K62556H9343K25940
13269C15283j29400c3541j42783H0431e8782A76421a0306a192E5342K4755K06297
13258B86394b0301q5923D74068b34343f2234k39098A06069K71742H6903J05220
13248A92123A9797c6831A48128E9383b07048B01252b95054A39251F9471J58489
13238B27960D4871b20384e3577B20279E1140a19525k79100c5996l56322A10501
13227a39203c1598I6264R9467n7624L0172k5501l9611d0521p2368A87019A6592
13215a81650B04589r6990E0752K66344I5200h8166C29667C9170K12092c76849
$$ plain form
13290 -243464 445348 33675 -32835 242279 22987 78641 -47029 230681 237981 107422 184774
13279 184774 106774 -16315 -176407 102074 -89948 -141633 108545 371101 89343 315283
13269 315283 185883 -33541 -176324 80431 -58782 176421 -10306 -1192 55342 80097 286394
13258 286394 -20301 -106224 474068 -234343 -62234 -301332 106069 377811 86903 192123
13248 192123 19797 -36831 148128 59383 -207048 201252 -295054 139251 69471 227960
13238 227960 44871 -220384 -53577 220279 51140 -119525 -398625 -35996 -392318 110501
13227 -139203 -31598 96264 195731 138107 168279 142778 103167 -40521 -112889 187019 16592
13215 -181650 204589 107599 50752 317096 95200 -88166 329667 39170 251262 -376849
13204G7690I327J59750K4968J59033a76731C13494A8081J51459C2276a82292q9293
13193b71585C25413G5949K37111d5014A07112d27293A14278J63481j00114c7713
13182g3410C02870j44187a24437e4606j98540f4438E6502d0036A54368M7987h4037
13170A26302i9446j29206A53422J68130A21154F73K84515n1462k1490a12696A35957
13158D25875D018P4479J33545E6900b42338a6126D89647i7470a4414C98094F6951
13146C09329D2279h0737l1793k58172D5704J3821Q6615i1511F6981a55681B8478
13134b17499b1491A8496J59270m1870a33282r4536a03980K9740G7260k0709N5752
13123A12303j2630k1243R0624P3753D6531J6083a9899G9204a4199j85659c4113
$$ plain form
13204 77690 9327 169077 194045 353078 -176731 313494 18081 169540 32276 -182292 -271585
13193 -271585 325413 75949 313060 -45014 107112 -427293 114278 277759 177645 -37713
13182 -73410 302870 158683 -124437 -54606 -253146 -64438 56502 -40036 154368 202355 -84037
13170 126302 -99446 -228652 153422 321552 121154 673 285188 233726 212236 -112696 135957
13158 425875 4018 78497 212042 56900 -242338 -16126 489647 -97470 -14414 398094 66951
13146 309329 42279 -80737 -112530 -370702 45704 59525 146140 -91511 66981 -155681 28478
13134 -217499 -21491 18496 177766 135896 -133282 -227818 -103980 -74240 77260 56551 112303
13123 112303 99673 78430 169054 242807 46531 62614 -19899 79204 -14199 -199858 -34113
13111a01405E4571j0590f7308k6351E9148P5051a09992F4425f992A69339O0619
13100B29958o9421E3788R4330R9323A02418a96264D4925J89820C7009b10930J993
13089b08937A03838m5549M1493e2982C6565b43053h1452n8873d4937B02390C9819
13077A85712R3293r1336J16556j22724J63209d4789j2116A1427P8461a49316C29053
13065B36628a82861j86506E0635L24970f6170K7277A11214D3881J64007B4187
13054A07811A5113f8058A30497J54209A4K74435b5034A59121j4948E0006j9416
13043C0590K3464J9002J16792a62959B9586a64500B48524a78657B96670G6224
13032H3970L2694B8480J93233H7482L7051E6203c54271B21222M5000E3882L4490
$$ plain form
13111 -101405 54571 43981 -67308 -93659 59148 134199 -109992 64425 -6992 169339 229958
13100 229958 160537 53788 148118 247441 102418 -196264 44925 234745 37009 -210930 -208937
13089 -208937 103838 58289 99782 -52982 36565 -243053 -81452 -140325 -44937 202390 39819
13077 185712 279005 187669 304225 181501 344710 -44789 -56905 11427 89888 -149316 329053
13065 236628 -182861 -369367 50635 375605 -66170 -38893 111214 43881 207888 24187
13054 107811 15113 -68058 130497 284706 14 274449 -25034 159121 144173 50006 30590
13043 30590 54054 73056 189848 -162959 29586 -164500 248524 -178657 296670 76224
13032 83970 116664 28480 221713 87482 124533 56203 -354271 221222 266222 53882 88372
13021H8372k3451P1213A4846L04392A45751a4897j9870B12629D653b45780C35163
13009h5831j4187E9477d8620A82566D7799J71539j321M5790A7826M10155d9348
12997A92895K54202A61056L3484a17847B55033H3142d12853F3229a89418A89337
12986C0165M80863k37516a13109J8196A86264q6966a6985A22019a1614F9473R8912
12975A68385a60164J5732D8807K034A7350c3344j44964E0208B941O8228J91484
12964B62653l5412a33104j72063a18105l76390a18708b716j21225A5945O7288
12954H3233B4271R543J2558J07117b21489B2621g9015l4576j89825B4409a02223
12942B14418a76381A65303b09070h2882c1531B16833E9645K31612j25182d4931
$$ plain form
13021 88372 64921 136134 14846 319238 145751 -14897 -34767 212629 4653 -245780 335163
13009 -85831 -100018 59477 -48620 182566 47799 219338 218017 263807 17826 427981 -49348
12997 192895 447097 161056 194540 -117847 255033 83142 -412853 63229 -189418 189337
12986 30165 511028 273512 -113109 -94913 186264 99298 -16985 122019 -11614 69473 168385
12975 168385 -160164 -144432 48807 50841 17350 -33344 -178308 50208 2941 71169 262653
12964 262653 227241 -133104 -305167 -118105 -494495 -118708 -2716 -123941 15945 83233
12954 83233 24271 33814 46372 153489 -221489 22621 -79015 -113591 -303416 24409 -102223
12942 214418 -176381 165303 -209070 -82882 -31531 216833 59645 291257 166075 -44931
12931a42534F357a8708A59752a51682C2169J78330a75328A77333K0775P1712b00878
12919b42757A99764I5136L67668j95988a45478C22967f1071B35097a46477B48556
12908a28076C76248A48358b09656a3458n5925A89021d5490B62587h588j49869
12898a58457B25575a84193A1423J10103r159g3873A10452A6661J11246a1577p5281
12887h6858m1563A70119R622e8041o3803B65349j26910E2515k770i2652d2184
12875A18006g3063k4148j26668B34303r7391b3763k26073N1481a4788p1634j3395
12864i9817B47413B5469L6916Q1945L8073h6582d0195b835G4919a96348B35228
12852a67351O5629I3219K17401r5965C1620g287m178j72290A08550a39280A14338
$$ plain form
12931 -142534 6357 -18708 159752 -151682 32169 210499 -175328 177333 198108 269820 -200878
12919 -242757 199764 95136 462804 266816 -145478 322967 -61071 235097 -146477 248556
12908 -128076 376248 148358 -209656 -13458 -69383 189021 -45490 262587 -8588 -158457
12898 -158457 225575 -184193 11423 121526 112367 -73873 110452 16661 127907 -11577 -86858
12887 -86858 -128421 170119 179741 -58041 -121844 265349 138439 52515 49745 -92652 -42184
12875 118006 -73063 -97211 -223879 234303 136912 -23763 -249836 -198355 -14788 -86422 -99817
12864 -99817 247413 25469 62385 144330 182403 -86582 -40195 -2835 74919 -196348 235228
12852 -167351 -101722 93219 310620 214655 31620 -7287 -11465 -183755 108550 -139280 114338
12840C807a16099B15559I3092L33413h3080k81298i908A59765a95814M6089q2501
12829b32226A71311a92063B71403b82077P051A48066c35097J11455i165j01194
12819a10359C0794L0841g1809b5318C4228J85495o3664o5850a78573B85683b17822
12807I4950A7223J72577f6610j94286B94558d8419E0194i3362k45634f9997j48290
12796b18287c7086j09705N6939L7398B11674B3544h7394k55377h6287j26641f7947
12784h8283A20173a60185C0792N58002c8518j0307G1764a27002A49673p2737a29052
12772d05013b01907g5919B31747H1679K95832a14521m5343G6092L9696r611J2585
12761A18762e1381q2479I9995j5881c3254a1538C46533a40361A45232a96325B74493
$$ plain form
12840 3807 -116099 215559 93092 426505 -83080 -364378 -9908 159765 -195814 -149725 -232226
12829 -232226 171311 -192063 271403 -282077 -275026 148066 -335097 -223642 -9165 -110359
12819 -110359 30794 61635 -71809 -25318 34228 219723 156059 90209 -178573 285683 -217822
12807 94950 17223 189800 -66610 -260896 294558 -48419 50194 -93362 -338996 -69997 -218287
12796 -218287 -37086 -146791 -89852 -52454 211674 23544 -87394 -342771 -86287 -212928 -67947
12784 -88283 120173 -160185 30792 588794 -38518 -48825 71764 -127002 149673 76936 -129052
12772 -405013 -201907 -75919 231747 81679 377511 -114521 -159864 76092 115788 106177 118762
12761 118762 -51381 -133860 99995 84114 -33254 -11538 346533 -140361 145232 -196325 274493
12749G0378d3261H0764J9974C6637K0738J98556a83525n1634A55477B1632a95009
12737A60854b20772M0947A16383B2424J90676m4366p6858D419L86394I4965J14010
12726B08975b83821b3224k58164e5001a2143A40530e790A35273h6854F7566r789
12715E7777J8942K8199Q2017J8519N4453A05856f4329A8533L41921m590R0013
12704D45877j95791B3977b09707b6125R20j72646B02792a8667q7740q1202j44812
12693c32421a05745K1896l5924A80279o9813m0266c6001L342A38942c7329I9430
12681C46327A51584c1000C72243a86855B99206A08567a37671A04348R6629a82520
12670a55216l53230A6035b424B01176b50108a17930j54782h5103n4789e4519C2430
$$ plain form
12749 70378 -43261 80764 100738 36637 57375 255931 -183525 -235159 155477 21632 -195009
12737 160854 -220772 -179825 116383 22424 213100 168734 91876 4419 390813 94965 208975
12726 208975 -283821 -23224 -281388 -55001 -12143 140530 -5790 135273 -86854 67566 57777
12715 57777 76719 104918 186935 205454 259907 105856 -64329 18533 360454 355864 445877
12704 445877 250086 23977 -209707 -26125 -25205 -197851 202792 -18667 -106407 -187609 -332421
12693 -332421 -105745 -83849 -119773 180279 110466 70200 -36001 -32659 138942 -37329 99430
12681 346327 151584 -31000 372243 -186855 299206 108567 -137671 104348 200977 -182520
12670 -155216 -508446 16035 -2424 201176 -250108 -117930 -272712 -85103 -139892 -54519 32430
12658B37928c53734A08012Q7683O6346q1340a36811A01492B6227a25258A11899
12647f1243A88559G8032a28034A09558a05002B2334J03784B4536a2008A2429J58917
12636A71346j3892j1395a99744j58292g3866m6969B84324G1653b97306f1593K2829
12625c8764j00859j28213a01939B73994a8726m9961k30553A15969J20617j16179
12615A20407M3120G5880g3271j8413m6208C3899A6303J92860A01895a31114C033
12603A62835n8392J61951i6880G7457B2437a17891b7066A9549a84129B14428R3928
12592C08356j1412D7132c1509A67918a37668N3906l21533h3180d0279p8309B81436
12580a03985m020B38176F1798a85779h6885m5226k87649h9521r8296K6779j9585
$$ plain form
12658 237928 -353734 108012 195695 262041 180701 -136811 101492 26227 -125258 111899
12647 -61243 188559 78032 -128034 109558 -105002 22334 126118 24536 -12008 12429 171346
12636 171346 157454 146059 -199744 -358036 -73866 -120835 284324 71653 -297306 -61593 -38764
12625 -38764 -139623 -267836 -101939 273994 -18726 -68687 -299240 115969 236586 120407
12615 120407 163527 75880 -73271 -91684 -137892 33899 16303 209163 101895 -131114 3033
12603 162835 104443 266394 -96880 77457 22437 -117891 -27066 19549 -184129 214428 308356
12592 308356 296944 47132 -31509 167918 -137668 -83762 -405295 -83180 -40279 -118588 281436
12580 -103985 -108005 238176 61798 -185779 -86885 -132111 -419760 -89521 -187817 -161038 -180623
12569a80623l7313A19605a77358j24576a9298A32959a027C7675e6689A07914A3423
12557a18739B68303a17021B03652a20072D0456c65686A72192e3969j59835L2691
12547a81113m6282H1026M9886A0542h2708B5715l071J48872a26873G4317h4534
12535B3174a97455C9535j0439e5349E7637b16074a2590A96819C0278a53736j39241
12524b92977B02010b16136A17339O6102C8826i2329I4865L1798J1378A5181J02897
12513A18078e7891j6906j25510L9723e1020I1138m3147J35255d6945B5664J39450
12502A65114g187j09483N4927B5334d06262H4055a12329A51130b0746j11600M7383
12491h4963p3149b4305A73268b10673A47087b66044C01080j26003d2420A57919
$$ plain form
12569 -180623 -217936 119605 -177358 -301934 -19298 132959 -1027 37675 -56689 107914 13423
12557 -118739 268303 -117021 203652 -120072 40456 -365686 172192 -53969 -213804 -181113
12547 -181113 -227395 81026 130912 10542 -82708 25715 22644 171516 -126873 74317 -84534
12535 23174 -197455 39535 29096 -55349 57637 -216074 -12590 196819 30278 -153736 -292977
12524 -292977 202010 -216136 117339 183441 38826 -92329 94865 126663 138041 15181 118078
12513 118078 -57891 -74797 -200307 -160584 -51020 91138 47991 183246 -46945 25664 165114
12502 165114 -7187 -116670 -61743 25334 -406262 84055 -112329 151130 -20746 -132346 -84963
12491 -84963 -158112 -24305 173268 -210673 147087 -266044 301080 175077 -42420 157919
12480b40362A28751b31785B16296D806N1437J19437b23050I1530b9893A45831
12469A61685C6828L43370b0253A00412a80001A49657A7519M5566J10593m0270
12459A33408g9107D4512j2155a15780j78049n4470a63171j0547O1480B48832a41920
12447g7671j25760B14160d5242k48088m3655P4622h895k17923F8062d1724l7511
12436g9235A49144E519f0429r4907A77860F0558c9228A81265a27383j53152p8804
12425c59339g5119C1880a20975d1296a5668o8235j76906B0917O0856j0179R8718
12414A70312P3072c89878a54860j41234A40489b1074j34337j07480D5934b46944
12403D7774O1680C3696i2862B82618F0345J24442j6311a43502m5665D1789i4192
$$ plain form
12480 -240362 128751 -231785 216296 4806 56243 175680 -223050 91530 -29893 145831
12469 161685 36828 380198 -20253 100412 -180001 149657 17519 63085 173678 133408
12459 133408 -79107 44512 32357 -115780 -293829 -348299 -163171 -173718 -112238 248832 -141920
12447 -77671 -203431 214160 -45242 -293330 -336985 -262363 -8895 -226818 68062 -41724 -79235
12436 -79235 149144 5519 -60429 -155336 177860 60558 -39228 181265 -127383 -280535 -359339
12425 -359339 -75119 31880 -120975 -41296 -15668 -83903 -260809 20917 81773 71594 170312
12414 170312 243384 -389878 -154860 -296094 140489 -21074 -155411 -262891 45934 -246944
12403 47774 109454 33696 -92862 282618 60345 184787 168476 -143502 -189167 41789 -94192
12391a30268N1723H910a64558l61653G7742b15611F9448g2570k8391b4625j03259
12380a27884M6717K7090j27051A96244a01637j64571J28193q7697a8698A29589
12369a24628n5796E2225g4780B2667P3200E120K486P4289L5766e1187E1666a92418
12356a80821a4756j3218H0514A4102J39736a37609D4679O5206K23522A66335a14923
12344A59397o2775j4758J23963G0763J19370a10181A1724R5884J61615c93578
12333a77290B58012c2994k77758M5317H233L0747L46550a456o2953K5990C01225
12321a23297J2921o9020F75i3532j44480A06717K5861c75132A94246f4534A20246
12309A7381e2160k65057f7603B43780a70245I9350J04829a48358C12921a94509
$$ plain form
12391 -130268 -78545 8910 -164558 -526211 77742 -215611 69448 -72570 -100961 -24625 -127884
12380 -127884 -81167 -54077 -181128 196244 -101637 -266208 -138015 -225712 -18698 129589
12369 -124628 -180424 52225 -74780 22667 95867 5120 7606 81895 117661 -51187 51666 -192418
12356 -180821 -14756 -27974 80514 14102 153838 -137609 44679 109885 333407 166335 -114923
12344 159397 96622 81864 205827 70763 190133 -110181 11724 107608 269223 -393578
12333 -177290 258012 -32994 -310752 -265435 8233 38980 385530 -1456 -64409 -38419 301225
12321 -123297 -110376 -179396 675 -93532 -238012 106717 132578 -375132 194246 -64534 120246
12309 17381 -52160 -317217 -67603 243780 -170245 99350 204179 -148358 312921 -194509
12298a51196d3248j45975C82888A7989i3336c6427m8814q5828B1555N1821G292
12286C15533a67386m7413i107B64933a1614A05716c1066A41750b7105D78105j31550
12275C46555C3270a5435q7578A23152f0805B98477r8395J77082a27544B30666
12264a20324A50289m577M00597a20351F52873b9718k59458A42147a62083b9589
12253G9487a64328E3369a00947j20536A40862g2938q3492C763g0220A92243J09971
12242C02214j17773d29248a70451G676d2391o3330B0128R9290K22403a324m4869
12231d6193l6626A52887j3893a68048C5510J24889K27024A68770A0859c7531A37149
12219I2409J53393K72240A45990c6570r1292M6894E2570g5154B96860j04535o6657
$$ plain form
12298 -151196 -43248 -189223 382888 17989 -93336 -36427 -85241 -171069 21555 73376 7292
12286 315533 -167386 -214799 -9107 264933 -11614 105716 -31066 141750 -27105 478105 346555
12275 346555 33270 -15435 -103013 123152 -60805 298477 200082 377164 -127544 230666
12264 -120324 150289 145712 546309 -120351 652873 -29718 -289176 142147 -162083 -29589
12253 79487 -164328 53369 -100947 -221483 140862 -72938 -156430 3763 -70220 192243 302214
12242 302214 184441 -429248 -170451 7676 -42391 -105721 20128 119418 341821 -1324 -46193
12231 -46193 -82819 152887 138994 -168048 35510 160399 387423 168770 10859 -37531 137149
12219 92409 245802 518042 145990 -36570 -127862 -80968 52570 -75154 296860 192325 125668
12208A25668c05942a3456j6083B34991A13823J21662C0870b2898B53526K84449
12198E37975H2875a9756B9734a9931f151D06143f0082G890K38793l9869R9069
12187C05883d1447c228m8633d297l0656A30612a22862C39792j21526B741J25882
12176A28623a29299C75625D2039K36228G115h9932C39920l1528d7674C86086D8508
12164D6046N7919g2428D3080L2497a35985A03035b46323B09655j6643D2769K56806
12153B99575a00715D4776g7373a4375j6531B14471N3893f2403K9461J3673A0758
12141a789A79290O8185n3983J7690K5197A09033C5775N06639g3484D1859O2629
12130A04488e8582l2857F3482B6038b35870c1760j93370R8897k8625a5880B33590
$$ plain form
12208 125668 -305942 -13456 -29539 234991 113823 235485 30870 -22898 253526 537975
12198 537975 82875 -19756 29734 -19931 -6151 406143 -60082 7890 246683 206814 305883
12187 305883 -41447 -3228 -51861 -4297 -34953 130612 -122862 339792 218266 2741 128623
12176 128623 -129299 375625 42039 278267 7115 -89932 339920 308392 -47674 386086 48508
12164 46046 103965 -72428 43080 75577 -135985 103035 -246323 209655 193012 42769 299575
12153 299575 -100715 44776 -77373 -14375 -30906 214471 268364 -62403 -32942 -19269 10758
12141 -1789 179290 247475 193492 211182 236379 109033 35775 542414 -73484 41859 104488
12130 104488 -58582 -91439 63482 26038 -235870 -31760 -225130 -126233 -154858 -15880 233590
12118H4357M7951a19307d2222A50889o6119B8651K77344b29008b6934l77913f4218
12106B74731a61886a4325A98833N5471O2704G8629K07114H1714j6712k3248c53917
12094E5255M17387l0594b53699D4410K73252H3436a59201K6110g993k3492j16344
12083a47829c3012j32669L2552D1899J48434d0217D9218a28977m3829j03204g6148
12071g9727F7686b49587A3302a19329M4388E1802N1585l1533b85504H0213J95284
12060B75497Q9868N2837A09173m9527J8401a26100E3829d6941C3432A200M5410
12049D6610R129d59345D8454b2159k93681A8105a86642M1369d3551B92883p6896
12038B15987b2140l83410E1213Q5102o086D6076a36498l9933a4885I5379L5463
$$ plain form
12118 84357 132308 -119307 -42222 150889 84770 28651 305995 -229008 -26934 -404847 -64218
12106 274731 -161886 -14325 198833 254304 317008 78629 285743 81714 65002 41754 -353917
12094 55255 472642 442048 -253699 44410 317662 83436 -159201 -133091 -7993 -31485 -147829
12083 -147829 -33012 -165681 -133129 41899 190333 -40217 49218 -128977 -172806 -276010 -76148
12071 -79727 67686 -249587 13302 -119329 -74941 51802 103387 71854 -285504 80213 275497
12060 275497 365365 418202 109173 59646 78047 -126100 53829 -46941 33432 1200 46610
12049 46610 55739 -459345 48454 -22159 -315840 18105 -186642 -145273 -43551 292883 215987
12038 215987 -22140 -405550 51213 136315 130229 46076 -136498 -176431 -14885 95379 130842
12027A30842A8298h9563p159l2494c3907B66762b19209P2300A69504l1056a30440
12015b01786G7362P6742M4930C6342b49840n4520j52981K28520N1926E5655h7615
12003c90699J06675P7353A41097i7044A6311c3794p7996K9226I9616a21316d7413
11991B926A155L48064a11831E3573a37076f307j23627D5987i8959j57842b8461
11979c447p2480A86816J14283C3427K33172i1768o5016A39696D616a44805K1586
11968a23219g240k2039B03155n1583a43192C4974c14043J42853B1534O2208C2152
11956b96149B8473a81781B32416F8434L28443F3741b71714m8904n2313a45131
11945A59055J26589a37611q0350H0428a57927l1860A10160c2969D84963a18968
$$ plain form
12027 130842 18298 -89563 -96722 -129216 -33907 266762 -219209 -146909 169504 138448 -130440
12015 -201786 77362 154104 199034 36342 -249840 -304360 -457341 -228821 -176895 55655 -87615
12003 -390699 -284024 -206671 141097 -97044 16311 -33794 -111790 -82564 99616 -121316 -47413
11991 2926 1155 349219 -111831 53573 -137076 -6307 -129934 45987 -98959 -256801 -28461
11979 -3447 -75927 186816 301099 33427 266599 -91768 -156784 139696 4616 -144805 -123219
11968 -123219 -7240 -29279 203155 151572 -143192 34974 -314043 -171190 21534 83742 32152
11956 -296149 28473 -181781 232416 68434 396877 63741 -271714 -320618 -372931 -145131
11945 159055 285644 -137611 -217961 80428 -157927 -189787 110160 -32969 484963 -118968
11934a45284A26827B5619a08983A53157E116h9136p0780O0055j2510j87627Q4614
11923b15384L3699j09362e604j24457k3141K6842m0541e8731H5288j6191e6107
11911a33254d1409D42082A07287d40950a7268A38124O8895a91015h3869o7142
11901a51011E7405o9b04090A98028J19908b41926A4239f9670A308b31367A19013
11889g7382B44107a04786m7672A47988J57155g0882j6536A57786c56527B74885
11878c5181A0432M08269a03022k11014B7184O0624b63693e0804B07274m7536c6031
11866A38202K33301g2750G110a24222k28000a14542j47577N2924N6091A81611
11855D5269b13047H5370g2942j7134k07466A02298b47771Q8231k12797E6682a53520
$$ plain form
11934 -145284 126827 25619 -108983 153157 5116 -89136 -159916 -99861 -112371 -299998 -215384
11923 -215384 -181685 -291047 -5604 -130061 -153202 -126360 -166901 -58731 85288 69097 -56107
11911 -133254 -41409 442082 107287 -440950 -17268 138124 207019 -191015 -83869 -151011
11901 -151011 57405 57336 -204090 198028 317936 -241926 14239 -69670 1308 -231367 119013
11889 -77382 244107 -104786 -152458 147988 305143 -70882 -87418 157786 -356527 274885
11878 -35181 10432 418701 -103022 -314036 27184 87808 -263693 -50804 207274 159738 -36031
11866 138202 371503 -72750 7110 -124222 -352222 -114542 -262119 -209195 -153104 181611
11855 45269 -213047 85370 -72942 -90076 -297542 102298 -247771 -159540 -372337 56682 -153520
11843a99981O2409B68511j10463n8034b15615a6609E5199f13716A45446b76686
11832A57978i3970A45393b45000K8314A318K8456C508P1124g9703K6831j54532
11821b07404P7055C37797e4554h690k3038q6264b7460I8529b37002b4028l8005
11810f2033q4252a4935j040H8831a18686J4502m9973C238g8700F6349J873K38644
11798C06866j01828F4197H792J34037m4648a64535M5169A4079M1010a41143d1916
11786C44964h2746k16670B19275b7161m7876a3792k50390I5457B8825b94928d53
11774E9442b16078O9709r6429R8928A46336a33962c6461A52681a16857B19845
11763A37839a46187L4320A68727F5248a65419H5017Q9099L3818a63276A29632
$$ plain form
11843 -199981 -137572 268511 158048 100014 -215615 -16609 55199 -613716 145446 -276686
11832 157978 -93970 145393 -245000 -216686 1318 29774 3508 74632 -79703 -52872 -207404
11821 -207404 -130349 337797 -54554 -8690 -31728 -117992 -27460 98529 -237002 -24028 -62033
11810 -62033 -146285 -14935 -15975 88831 -118686 -104184 -154157 3238 -78700 66349 68222 306866
11798 306866 205038 64197 8792 142829 98181 -164535 -119366 14079 55089 -141143 -41916
11786 344964 -82746 -299416 219275 -27161 -75037 -13792 -264182 95457 28825 -294928 -453
11774 59442 -216078 -146369 -242798 -143870 146336 -133962 -36461 152681 -116857 219845
11763 137839 -146187 -111867 168727 65248 -165419 85017 174116 207934 -163276 129632
11752I7389f1791I1418f5955m1211A50219k4476b10623F6486a59447a465D8126
11740A2031J17596b68744N6469i1672M1127l10938a15534j24522B63530A01508
11729a12706r6283B15370a34473g429j75641B76421A7398J07641a9906B64099
11718A0276J69089A7633K02208d96948G0341J8126J7458c23841B847f9905B98706
11706A48151J15788a7279j39767j87574c6916C44843e9957A13661M94b10545A56650
11694F5641d9507A43465B5935J51694i6677C6754g7555A18843a94488A24644i6663
11682B92925e5285a4145H0633Q7775b39079Q6217A11644a01117n5642G2368a08500
11670A26271C8835a82104D20636A19754b49407A63855g9311L7388l4041j29792
$$ plain form
11752 97389 -61791 91418 -65955 -107166 150219 125743 -210623 66486 -159447 -1465 48126
11740 12031 129627 -268744 -212275 -91672 -50545 -361483 -115534 -240056 263530 101508
11729 -112706 -208989 215370 -134473 -7429 -183070 276421 17398 125039 -19906 264099
11718 10276 179365 17633 219841 -496948 70341 88467 105925 -323841 2847 -69905 298706
11706 148151 263939 -17279 -157046 -344620 -36916 344843 -59957 113661 114155 -210545 156650
11694 65641 -49507 143465 25935 177629 -96677 36754 -77555 118843 -194488 124644 -96663
11682 292925 -55285 -14145 80633 168408 -239079 -152862 111644 -101117 -156759 72368 -108500
11670 126271 38835 -182104 420636 119754 -249407 163855 -79311 -41923 -75964 -205756
11660b05756O6009N3734k2406F586J68972m6039d0430G05c1619C5518A2337a2642
11647A64103o8302m6092K51617G6827b84049B55750a33112j9852k75179a15372
11636B52658A10197h3507k08597C82692A8867c60185a27332M0161A01328A0719
11625A41247N6865F6389a98490A3269M79733A51625f8318k1399B01500p385a16936
11613a62558B11658a46999A65808p6740a85139c2344B70472a45798G8553k8534
11603E0019K60171i4297m9009k59060F4374K89675r7247c434H3198A5421a61944
11591a61644f320D5651K5085J58125b30553C2235a42737l122e8343p4053C4956
11579B00436N1378G540N8366a77906C98379G5713i1965B23804c00898c058j53350
$$ plain form
11660 -205756 -139747 -86013 -108419 6586 175558 129519 -40430 705 -31619 35518 12337 -12642
11647 164103 95801 49709 301326 76827 -284049 255750 -133112 -152964 -428143 -115372
11636 252658 110197 -83507 -292104 382692 18867 -360185 -127332 -87171 101328 10719
11625 141247 198112 66389 -198490 13269 493002 151625 -68318 -89717 201500 194115 -116936
11613 -162558 211658 -146999 165808 89068 -185139 -32344 270472 -145798 78553 50019
11603 50019 310190 -94297 -143306 -402366 64374 354049 256802 -3434 83198 15421 -161944
11591 -161644 -6320 45651 70736 228861 -230553 32235 -142737 -145859 -58343 -132396 34956
11579 200436 251814 7540 65906 -177906 398379 75713 -91965 223804 -300898 -3058 -156408
11568a56408B81076a36859C03566j42753i674n6646D6520c06649B65050d89288
11557A18103a74111e2778C57139G703a61871D5023b09598n3463c4960q4929k33265
11546c53154Q6490d5497a9949G3826J0438a19503C52731c90278h5261L7633A16593
11534F0674N74463C4482K4684a66557A26207a23437D0707J41206c62624D1009
11523f8474j46780d1904A27909n6650b11438G0059b51224B79104f497k7578A54064
11511A78653A632J72759j7828a34727B97040h5656L6975G8997i7480B7667J72440
11500B00107I2441f6611j99292A27061C4960a09615A94140c42199A94631k4368
11490A70263p6603f534H3421a49499F2592J9774C0691J97898C5326M7000J67320
$$ plain form
11568 -156408 281076 -136859 303566 160813 -9674 -66320 46520 -306649 265050 -489288
11557 118103 -174111 -52778 357139 7703 -161871 45023 -209598 -263061 -34960 -119889 -353154
11546 -353154 -266664 -45497 -19949 73826 84264 -119503 352731 -390278 -85261 -47628 116593
11534 60674 635137 34482 59166 -166557 126207 -123437 40707 181913 -362624 41009
11523 -68474 -215254 -41904 127909 71259 -211438 70059 -251224 279104 -6497 -34075 154064
11511 178653 1632 174391 156563 -134727 297040 -85656 -48681 78997 -97480 27667 200107
11500 200107 92441 -66611 -265903 127061 34960 -109615 194140 -342199 194631 170263
11490 170263 93660 -6534 83421 -149499 62592 82366 30691 228589 35326 82326 249646
11479B49646F3257L85129A75474C7593J80321R8832C9955K55841a59170B77664
11468A29213J17047q2271b18393H9137b78603D05988a93376B52933D293a58681
11457a14795B59297p6878H2017M8103A1367R5758C7571L81636A00233L27875a72699
11445a6655p5123A34755J4180c56969a06961A84673e7017J9484A24109A3260b16779
11433a79008k8339R0825B8047a31804L2654c9440j98483H741c8165A24034C5996
11421A36519D7974g1368O275p4954C3965J05269D3856J53088J27329A54186k3333
11410A30853a98758f3764B00184J91465i7914j89211I6754a01422f860k27226
11400b34086B54054I5276C4790a3610B01238N819a33740M2764D8484b12210d3123
$$ plain form
11479 249646 63257 448386 175474 37593 217914 316746 39955 295796 -159170 277664
11468 129213 246260 163989 -218393 89137 -278603 405988 -193376 252933 4293 -158681
11457 -114795 259297 182419 82017 130120 11367 107125 37571 419207 100233 428108 -172699
11445 -16655 -91778 134755 148935 -356969 -106961 184673 -57017 -37533 124109 13260 -216779
11433 -179008 -207347 -116522 28047 -131804 -99150 -39440 -237923 8741 -38165 124034 35996
11421 136519 47974 -71368 -65093 -140047 33965 139234 43856 196944 324273 154186 130853
11410 130853 -198758 -63764 200184 391649 -97914 -287125 96754 -101422 -6860 -234086
11400 -234086 254054 95276 34790 -13610 201238 207057 -133740 -90976 48484 -212210 -43123
11388c09630a5547B58383A08702b13603b6898D2358h2393L8812B0224a04864j63889
11377b68753F8081M0610R334g5340L6411H8923a10569F8173a18705C06512A34757
11365I9253a98054N2491B02675H4915c57314c6765j21660F306M4092a17352C0545
11353d4178k5265A12941E5974c3929A70424m7336l4626e1818q4650C3614J82182
11342B15796b25005A25707c23521i8752c658q8112q6338J292Q1591j7376j96386
11331c08987I1014b261r9562j7895J8658B49354g7215j52033a14554F5242B1201
11319B93734b47492I9614B152c4584j24945j05544o1969B40336n050b69494a6459
11307A69574j847a00946c1788j14616J4152A02836M5615b14177C2848J14055b48912
$$ plain form
11388 -309630 -15547 258383 108702 -213603 -26898 42358 -82393 -43581 20224 -104864 -268753
11377 -268753 68081 108691 118025 -75340 -38929 88923 -110569 68173 -118705 306512 134757
11365 99253 -198054 -145563 202675 84915 -357314 -36765 -158425 6306 50398 -117352 30545
11353 -44178 -69443 112941 55974 -33929 170424 123088 88462 -51818 -136468 33614 215796
11342 215796 -225005 125707 -323521 -98752 -3658 -91770 -178108 -176816 -95225 -112601 -308987
11331 -308987 91014 -2261 -101823 -119718 -101060 249354 -77215 -229248 -114554 65242 21201
11319 293734 -247492 99614 2152 -34584 -159529 -265073 -327042 240336 235286 -269494 -16459
11307 169574 167727 -100946 -31788 -146404 -132252 102836 148451 -214177 32848 146903 -248912
11295a064l61457a10431j45645J16772j10346r3736J37849H1703J95215A20117
11284I6462a54319D7853J12019J21045a08054C1196c45958j6883a46382c6278
11273h1397q3843B5882b08783R0197H0042a51022j00962e6506A1560J51388f4723
11261g4625G6567L8975E6361c1602B4849g5857A02597a79763o0253h5916k25091
11250c11007A03771e2096r8335A74729O0121f5754A38681d09786B66981j21933
11240A45048c00285A0590L2763d00311J50187C2074a70095F9069d6497A35536
11229b4470k49370K5535A33449b70008A0717P6990d47550a35319A76920g9763
11218c23870d6508A09045Q8588a24146A29941C8260e8441p2701B11331H4745b35082
$$ plain form
11295 -1064 -362521 -110431 -256076 -139304 -249650 -343386 -205537 81703 276918 120117
11284 96462 -154319 47853 159872 280917 -108054 31196 -345958 -362841 -146382 -36278
11273 -81397 -165240 25882 -208783 -118586 80042 -151022 -251984 -56506 11560 162948 -64723
11261 -74625 76567 115542 56361 -31602 24849 -75857 102597 -179763 -240016 -85916 -311007
11250 -311007 103771 -52096 -150431 174729 234850 -65754 138681 -409786 266981 145048
11240 145048 -300285 10590 43353 -400311 -250124 32074 -170095 69069 -46497 135536
11229 -24470 -273840 -248305 133449 -270008 10717 87707 -447550 -135319 176920 -79763
11218 -323870 -46508 109045 197633 -124146 129941 38260 -58441 -131142 211331 84745 -235082
11206b2406j31577C950J35663K5196J82148a86052B3389G996a94125p2757b4018
11194B13466b94214B34059c03948C46403A3381b00618i7401C44122a67517M6089
11184a21428A73166a69643k15703a04106D8032a70363Q2246A52252b66853P8268
11174a88585l55907b22080j0078a2193n029n3195I1430e1115F1102J06891b97098
11162a37270E460M571P856b99432A01328m3954K8738J02104b81481a22851A87517
11150G3333R0196n3366K03990A02755g9789A16088m9458a57079A3352J18044e4617
11138A49479N9870J23079g9057H236R5367c37991A08272L37126a40688O2680L2258
11127d5750C1920R4309a40304N1267o5600j6253d1988A93362a61375A8861J79011
$$ plain form
11206 -22406 -153983 3950 139613 164809 346957 -186052 23389 7996 -194125 -266882 -24018
11194 213466 -294214 234059 -303948 346403 13381 -200618 -97401 344122 -167517 -121428
11184 -121428 173166 -169643 -385346 -104106 48032 -170363 -88117 152252 -266853 -188585
11174 -188585 -544492 -222080 -232158 -12193 -17222 -70417 91430 -51115 61102 167993 -297098
11162 -137270 5460 10031 17887 -299432 101328 57374 86112 188216 -281481 -122851 187517
11150 73333 163529 110163 314153 102755 -79789 116088 66630 -157079 13352 131396 -54617
11138 149479 209349 332428 -79057 8236 103603 -337991 108272 445398 -140688 -78008 -45750
11127 -45750 31920 126229 -140304 -89037 -154637 -170890 -41988 193362 -161375 18861 197872
11116A97872q7349b42685I3012L5937a07327p26B14472d1911p7583A56003N051
11105A61054r486a61660A96735P9000K001D8320J39666J20488A35926k9915M18690
11094E24701k15807I2118J19518A8380Q7292C3441J04788O5540m2809Q4992a01112
11082a59046B96596a25766A07867J9423h5940A49228a8257A88700J8065H9048
11071B26252J43770G2634g6851B84303b35196Q9935o4748B57599J66915H70M22812
11060D23682j5115m9290C3187J69632q8604K86711l2897k201R330j52086K55935
11049D79007B03943m0653G7267J88850M26513j19696k00670j1755M4603j85805
11039B19307L71053o3364A58965K58871j65818L633J49835r9651J69405J287J36031
$$ plain form
11116 197872 110523 -242685 93012 128949 -107327 -108053 214472 -41911 -119494 156003 161054
11105 161054 151568 -161660 196735 275735 277736 48320 187986 308474 135926 106011 524701
11094 524701 308894 92118 211636 18380 105672 33441 138229 203769 160960 245952 -101112
11082 -159046 296596 -125766 107867 127290 -85940 149228 -18257 188700 206765 89048
11071 226252 370022 72634 -76851 284303 -235196 -145261 -210009 257599 424514 870 423682
11060 423682 408567 359277 33187 202819 114215 400926 368029 365828 375158 223072 479007
11049 479007 203943 163290 77267 266117 692630 572934 372264 360509 405112 219307
11039 219307 590360 526996 158965 417836 252018 255651 405486 305835 475240 476527 612558
11028F12558h8841D88839n7025F8949N74627k60399K33563K2672r5933B53066
11017A79664a98790C25330p0669E3027K88863e2100F14589C05389L21415j56451
11007D70353A65693e6674B79718E8377L03547J76778k57831j23721K77473c6557
10996H9117M6079J22788A04263K70302Q7459j50478P8581n9252J33151j80457
10986B83569M8026L6602k1782J94062p9730N1982j41464M85018j45380q2065M1848
10975F70686J24950K22986k29340R5593J19133j03016P68304m28225J05122J64154
10965A510347k8966L707l13176k405r4978j87663J00882j76887j19173K94460
10955I86148J93510j68766J30648J98955k64715j81358l37404N1012j2009B66211
$$ plain form
11028 612558 -88841 488839 431814 68949 643576 383177 616740 639412 543479 253066
11017 179664 -198790 325330 254661 53027 341890 -52100 614589 305389 626804 470353
11007 470353 165693 -56674 279718 58377 361924 538702 280871 157150 434623 -36557
10996 89117 135196 257984 104263 374565 462024 311546 390127 330875 464026 283569
10986 283569 331595 368197 346415 540477 460747 512729 371265 856283 710903 628838 670686
10975 670686 795636 1018622 789282 884875 1004008 900992 1669296 1241071 1346193 1510347
10965 1510347 1481381 1485088 1171912 1169507 1074529 886866 987748 810861 691688 986148
10955 986148 1179658 1010892 1141540 1340495 1075780 894422 557018 608030 596021 266211
10944D1789L69465J5625G5481L23552A97542K4853A05478M2634e5779k00398A49096
10932E2060a0841j10704B59301r0336K43958I2232M62c9005j06955A75360C084
10920B36402h1734A68519i1072a920l4647B41810P7963c57513A8044d1439a4305
10908b6773F5846a84739O5471H797a29618M7752A25349q364b36677R9556k75622
10897d12743D6099B2733c17773A83211c66749a295A22003i3255K2535B1896a53679
10885a46988D1043Q028K51244a87037Q0085A68998b1584k96767B20928a5717n4167
10874f9884A41480e5996o8621E8447c2266j79446a9666B01288a65792k29413J06002
10863b89203B140K17743m9867g4352a2325k88317a26447A21272b1229j12116q5680
$$ plain form
10944 41789 411254 426879 75481 399033 197542 222395 105478 148112 -55779 -256177 149096
10932 52060 -10841 -121545 259301 168965 412923 92232 92694 -39005 -145960 175360 3084
10920 236402 -81734 168519 -91072 -1920 -36567 241810 319773 -357513 18044 -41439 -14305
10908 -26773 65846 -184739 -119268 8797 -129618 -81866 125349 116985 -236677 -137121 -412743
10897 -412743 46099 22733 -317773 183211 -366749 -1295 122003 -93255 -70720 21896 -153679
10885 -146988 41043 49071 300315 -187037 -106952 168998 -21584 -318351 220928 -15717 -69884
10874 -69884 141480 -55996 -124617 58447 -32266 -211712 -19666 201288 -165792 -395205 -289203
10863 -289203 2140 219883 170016 -74352 -12325 -300642 -126447 121272 -21229 -133345 -219025
10852b19025B58131f3307m9584B2860A0938J68509b18294C5539d2412j44702e2758
10840a09712J2209C17776a34874D4695e442H342K39375f2861m008F5020b41113
10828i5769a4664k33108A6429b43311a1083M411a834j68030e722A38440E6630
10816a32824G7485j9245g8410A15882a80137I69b76143m5808d3638j18772G0691
10804b2821C2518a38402A89255D4178f7613k8046p5949A2735K95238o8259b4946
10792A63495f1289o0231D41805f1381q0324m4473M5068K6340H2882a74002A57129
10780D7420R152g6076B3646f3756j93070i9646D858N2496J05274b0165A02879
10768B33539a04525q6958q399C43888b9696B1027a19862A08349P1679a68763A28548
$$ plain form
10852 -219025 258131 -63307 -112891 22860 10938 179447 -218294 35539 -42412 -187114 -52758
10840 -109712 -97503 317776 -134874 44695 -5442 8342 247717 -62861 -66869 65020 -241113
10828 -95769 -14664 -247772 16429 -243311 -11083 -6672 -1834 -169864 -5722 138440 56630
10816 -132824 77485 58240 -78410 115882 -180137 969 -276143 -321951 -43638 -162410 70691
10804 -22821 32518 -138402 189255 44178 -67613 -95659 -171608 12735 307973 239714 -24946
10792 163495 -61289 -121520 441805 -61381 -141705 -186178 -141110 -114770 82882 -174002 157129
10780 47420 56572 -76076 23646 -63756 -256826 -99646 4858 57354 162628 -20165 102879
10768 233539 -104525 -191483 -199882 343888 -29696 21027 -119862 108349 180028 -168763 128548
10756d35058J75153k15433I801a50596A3440J15923l0339a80048D7231a00162
10745G2353g2470j54937b2858O931A80792o1056b31301B49721f3773e937l44209
10734c50146e4982L841B11814d60006E303b44510A10040a8937j760l97047h0199
10722a87745n8313f3122j61271L3722a2820B2831c0935H4129b71772B53186c77286
10710G563a61722f8671o5551A37466E1714J6205D356O112M8343a4503o6824a0371
10697a01342j37539N4490A90751G922K43114o7302E7704a13362A3810a9303A9751
10685A8323a21095L5818b9842A71185F6209b15510a1316E7589a92118m1542C26467
10673B16596b44148B8817J12816K10381j08428j10392b54575g97l4200j35753
$$ plain form
10756 -435058 -259905 -475338 9801 -150596 13440 129363 99024 -180048 47231 -100162
10745 72353 -72470 -227407 -22858 -15927 180792 119736 -231301 249721 -63773 -5937 -350146
10734 -350146 -54982 -51141 211814 -460006 5303 -244510 110040 -18937 -20697 -417744 -80199
10722 -187745 -246058 -63122 -224393 -190671 -12820 22831 -30935 84129 -271772 253186 -377286
10710 7563 -161722 -68671 -134222 137466 51714 67919 4356 10468 58811 -14503 -81327 -10371
10697 -101342 -238881 -184391 190751 7922 251036 183734 57704 -113362 13810 -19303 19751
10685 18323 -121095 -85277 -29842 171185 66209 -215510 -11316 57589 -192118 -233660 326467
10673 216596 -244148 28817 141633 352014 243586 133194 -254575 -797 -34997 -170750
10663a70750j04600A71286m9774a51527H7526b27700B25899R9678D1234e21826
10652c36274A52838o8058I135b781k05562E573a4731k90685D2010b08338J01946
10641a06392A4132b1214C68862A17558l881a40799l4262A88516G959c11705B17963
10629E9584J80927F1754R3846G0013L2898i889j45256A6989K12472e18968b9260
10617I8004a21111q4281O1744D5641K52491h6283o6808K9021j19164N838d7320
10605A69330E1277a74290M2077A9233c78813J333H6237Q1559k5502A072e3128
10593B38910b3145C6410P4929a80056f7627K034k50092a33510A17993c07952H587
10581d35586A5810P8077c09218a36599B22007b00420A29796i1312C7301b29345
$$ plain form
10663 -170750 -275350 171286 121512 -151527 87526 -227700 225899 325577 41234 -521826
10652 -336274 152838 84780 9135 -2781 -208343 5573 -14731 -305416 42010 -208338 -106392
10641 -106392 14132 -21214 368862 117558 113677 -140799 -175061 188516 7959 -311705 217963
10629 59584 240511 61754 155600 70013 102911 -9889 -155145 16989 229461 -518968 -29260
10617 98004 -121111 -205392 -143648 45641 298132 -86283 -153091 -124070 -243234 -237396 -47320
10605 169330 51277 -174290 -132213 19233 -378813 -377480 86237 167796 142294 1072 -53128
10593 238910 -23145 36410 111339 -180056 -67627 -65593 -315685 -133510 117993 -307952 8587
10581 -435586 15810 93887 -309218 -136599 222007 -200420 129796 -91312 37301 -229345
10570c51050c640B050R9283a1817m7085B7247c27139H3167a50247c1274j54118
10559a85392g8472a6452G5281J40842P594a26834m8262g1537p9151E0452b06361
10547a57565C1651a03503d5276H7138h8763i190j82261A2365a71164o7793P3477
10536a65480k1572N6666a7278G9085b31081a6787l2322k33045R907e3622H2607
10524b17939D6431b228l32468i1145D23470A95721b43688B61J46390a08966q2435
10513a91401j27684F8036j9164j4390b64109A1200J29111g6205O370C01195c69085
10501A43894e3100A55557m0765J64703f1466p9350B79012b94123d3267j02213
10491a45480d6210H1373b868l39930A1836J82774j5236m6298J65019g9823A53190
$$ plain form
10570 -351050 -3640 2050 101333 -11817 -58902 27247 -327139 83167 -150247 -31274 -185392
10559 -185392 -78472 -16452 75281 216123 223717 -126834 -175096 -71537 -150688 50452 -206361
10547 -157565 31651 -103503 -45276 87138 -88763 -9190 -191451 12365 -171164 -238957 -165480
10536 -165480 -187052 -130386 -17278 79085 -231081 -16787 -49109 -282154 -272247 -53622 82607
10524 -217939 46431 -2228 -334696 -91145 423470 195721 -243688 261 146651 -108966 -191401
10513 -191401 -319085 68036 48872 34482 -264109 11200 140311 -76205 -69835 301195 -369085
10501 143894 -53100 155557 114792 279495 -61466 -140816 279012 -294123 -43267 -145480
10491 -145480 -46210 81373 -2868 -342798 11836 194610 179374 133076 298095 -79823 153190
10479B67923J00080j52632J43820g8178B66445M0314G4555J10823m6202B8985
10468a42031A07923a64589B42489c9982N5k05636i8812p9596A24898n0504O2070
10457A36464a3003o5590j26385I966f0312A76589g2041o5189C18207c93373F3258
10445a85575P9015J3038E0778b8296j39440P19e7203B00996a44570q8645A47488
10433f3245E8c33164J03843a5887j17064j3962k6288j01159J13870b5047r1821
10422a16868j41941B30400r9227J13396b15063F6655b80196N6816l30f2512b6185
10410d2793A59811m2779G217a97432g1840A20349K09504c12591h2076L8766F87
10398F145a30406n2498P4829A35208K17994G9979A7484b89021P3286h1756C48131
$$ plain form
10479 267923 368003 215371 359191 -78178 266445 306759 74555 185378 139176 28985
10468 -142031 107923 -164589 242489 -39982 -39927 -245563 -98812 -178408 124898 74394 136464
10457 136464 -13003 -78593 -204978 9966 -60312 176589 -72041 -137230 318207 -393373 63258
10445 -185575 -106560 -93522 50778 -28296 -167736 -167017 -57203 200996 -144570 -233215 147488
10433 -63245 58 -333164 -229321 -15887 -132951 -146913 -173201 -274360 -160490 -25047 -116868
10422 -116868 -258809 230400 131173 244569 -215063 66655 -280196 -223380 -223710 -62512 -26185
10410 -42793 159811 117032 7217 -197432 -71840 120349 329853 -312591 -82076 -43310 687
10398 6145 -130406 -182904 -108075 135208 353202 79979 17484 -289021 -215735 -81756 348131
10386c3776J6852k15167B38385j1548q14a01418A02162K84561A42654g1754I447
10374B88467I7953a40286B09816D1915J00628M0996M3040A5695N9064K69292L9793
10363C83844A31915K60577j77628J08349j31071M5051p4451G4808Q7954a70248
10352H6171b6020B47063q7355C659O6487K0230e1947I2253J58342i6235B84189
10340A17608J0828c2170A59646p6581J45577E4120d9813A86306Q4691a4366A98897
10328B06159q1689a6011H6762A8894J93894A6023c9631k55554D90097B1899J60837
10317A82736a2358l03047C7548O5264R9905r3374J448A7091J02852d09059B36459
10305a28743K4896j10693e7930n9330A82064f4340B45891G5645e1838C9357b2186
$$ plain form
10386 -33776 -16924 -232091 238385 226837 226023 -101418 102162 386723 142654 -71754 9447
10374 288467 97953 -140286 209816 41915 142543 183539 226579 15695 74759 344051 383844
10363 383844 131915 392492 214864 323213 192142 237193 162742 74808 162762 -170248
10352 86171 -26020 247063 159708 3659 70146 90376 -51947 92253 250595 -96235 284189
10340 117608 128436 -32170 159646 83065 228642 54120 -49813 186306 270997 -14366 198897
10328 206159 124470 -16011 86762 18894 212788 16023 -39631 -295185 490097 21899 182736
10317 182736 -12358 -315405 37548 102812 202717 109343 110791 17091 119943 -409059 236459
10305 -128743 -103847 -214540 -57930 -117260 182064 -64340 245891 75645 -51838 39357 -22186
10293a27440E8385b46435G9099b8295J0132M362H7935c3313n0866k45928B05191
10281I8920m3594f2188A83457d15983J16935a41465C49189F273b5598m6373j115
10270g3086j62393a01324j9796G4600d3649A74678i412H4133N0127O8764b10013
10258B61294C5962J03833D0416M6384J65885I813J43868J45480A4220o376L28910
10247C36754a90724b5336n459k23270K4592C1308a86106g9255f020j51405F1339
10235b88124B86734n0753h4463j61412A2603J65596g6582B56997b65382j09184
10225c74566C81886d69324g929k79873f2821p7961j6351E14046B44711b62026
10214a23181A3424c69033a13668o0505N6084j25372f5889D85694A59147a40857
$$ plain form
10293 -127440 58385 -246435 79099 -28295 -18163 -13801 87935 -33313 -84179 -330107 205191
10281 98920 55326 -62188 183457 -415983 -299048 -141465 349189 6273 -25598 -71971 -73086
10270 -73086 -235479 -101324 -121120 74600 -43649 174678 -9412 84133 134260 203024 -210013
10258 261294 35962 139795 40416 86800 252685 9813 153681 299161 14220 7844 336754
10247 336754 -190724 -25336 -30795 -254065 -229473 31308 -186106 -79255 -6020 -157425 61339
10235 -288124 286734 235981 -84463 -245875 12603 178199 -76582 256997 -265382 -374566
10225 -374566 381886 -469324 -7929 -287802 -62821 -140782 -157133 514046 244711 -262026
10214 -123181 13424 -369033 -113668 -174173 -118089 -243461 -65889 485694 159147 -140857
10203b23781R8355c6777I4143e2508l199b2902j33176N1543j97008a15174A91605
10191H1074J11602g3944O353k09240H355a4410j2541q4079E8028a70381n9919
10180b30300O868A65887a11287q3684k1274A45766b16781L2456p4074L671r0124
10169c44852a05175J1411r7022B64d86483K35771A382b79124A02313m8410c19635
10157b54497a00213E1150J36576a98023A55482h527E3376J14728h8958r7779R1490
10146i5247D14922a87132B7007K59834b9102a408r3360A01409C0559O3417Q5823
10135A79799a01594A82992d56491a33058m9948j00979j38148f0385B8691J39903
10125A68594a38579A01967a61315l629J749j25070J27778E8115b24511D1854q746
$$ plain form
10203 -223781 -125426 -36777 94143 -52508 -55707 -22902 -156078 -104535 -301543 -115174 191605
10191 81074 192676 -73944 -67591 -276831 8355 -14410 -26951 -111030 58028 -170381 -230300
10180 -230300 -223432 165887 -111287 -194971 -216245 145766 -216781 -184325 -258399 -254728 -344852
10169 -344852 -105175 -93764 -190786 264 -486483 -250712 1382 -279124 102313 53903 -319635
10157 -254497 -100213 51150 187726 -198023 155482 -8527 53376 168104 -88958 -186737 -95247
10146 -95247 414922 -187132 27007 286841 -29102 -1408 -94768 101409 30559 93976 179799
10135 179799 -101594 182992 -456491 -133058 -183006 -283985 -422133 -60385 28691 168594
10125 168594 -138579 101967 -161315 -164944 -163195 -288265 -160487 58115 -224511 41854 33108
10114C3108j3989J9110d5246J8834J1451j26390B83085F6684R2592A2004J82190
10103A94194h2904e264l04381I6544A4663g898B71131h895k59947h9430B44956
10091G4079a17202q861C463N4361a08185A23110f0192J8380k99358i0010l7623
10080a27633B25153b5414k21885E0009b87951a40476M9532j09624k4562J01056
10070a24074A57116e7682F8360a383j28944A30192c07054g5546n6074I8177a84827
10058b44447i2422a7743j91964A39679a80268B1549h4692l82323a42192J8015
10048a24177k59625A79469a35260A34892c8I062b86565a06510K6514j42470J11212
10037a11254B3735c1056p0455b6102I836J60788I926c5098E4564b86997h8105
$$ plain form
10114 33108 19119 38229 -45246 -26412 -14961 -141351 283085 66684 159276 12004 194194
10103 194194 -82904 -5264 -309645 96544 14663 -7898 271131 -8895 -268842 -89430 244956
10091 74079 -117202 -126063 3463 57824 -108185 123110 -60192 -41812 -341170 -90010 -127633
10080 -127633 225153 -25414 -247299 50009 -287951 -140476 -90944 -200568 -225130 -124074
10070 -124074 157116 -57682 68360 -1383 -130327 130192 -307054 -75546 -131620 98177 -184827
10058 -244447 -92422 -17743 -209707 139679 -180268 21549 -84692 -467015 -142192 -124177
10048 -124177 -383802 179469 -135260 134892 -38 9062 -286565 -106510 -79996 -222466 -111254
10037 -111254 23735 -31056 -101511 -26102 9836 170624 9926 -35098 54564 -286997 -88105
10025a29061C4741A1265J78895b69409E564K7670d53123a79488P1271J8032b2495
10013A97841i278j25972k9132C4610M3547b24086F3517b04074L9049A42336a06908
10001a6256H0822J4682J18227a28099I3535P309c34679a26145I1691b50442i8962
9989h7442j20568B0118p078a53461j4801I7409a20725E7232M7029a30656A54594
9977F4674d3156J5044A87078c39525f4000q1442A35522b70842a09048A58927b70066
9965D1571a29570q707B14204c61578h8468C06641a32909c6273B6202a04539J7942
9954h6597n3524j23140a29075A68783b05216E8776P6863k2646B0653c66719C03997
9942B76361b1724k684l39107J09095G5682b20584c814j15243j59145A84887C4046
$$ plain form
10025 -129061 34741 11265 190160 -269409 5564 33234 -453123 -179488 -108217 -90185 -22495
10013 197841 -9278 -135250 -164382 34610 78157 -224086 63517 -204074 -165025 142336 -106908
10001 -16256 80822 95504 213731 -128099 93535 100844 -334679 -126145 91691 -250442 -98962
9989 -87442 -208010 20118 13040 -153461 -168262 97409 -120725 57232 104261 -130656 154594
9977 64674 -43156 -28112 187078 -339525 -64000 -145442 135522 -270842 -109048 158927 -270066
9965 41571 -129570 -138277 214204 -361578 -88468 306641 -132909 -36273 26202 -104539 -86597
9954 -86597 -140121 -263261 -129075 168783 -205216 58776 135639 112993 20653 -366719 303997
9942 276361 -21724 -24408 -363515 -254420 75682 -220584 -3814 -119057 -278202 184887 34046
9930C1791O7378L9556b04793f1804j83037I9341d4776A21291f1316o4562C02419
9918C2695g0593b6241A10146J9938g4060B1362J67956G6594a32042c7537A5717
9906a41402B32658b36336h9485F8103a56449j01504g180H8521a3281p9473k09449
9895c02203a39478H1446C364a63527j3552C9863g2832j50861e50p9090j75553
9884b55193d2144G5421J04078c40426J29582h7547A5108f8952j19008A14779J48356
9873B63135I3517a38152C7234J65992b18812F6582c09280a32721B29905J32215
9863C62120C7634f5502k83044P1194J14858G3066a67089q3867C3023P0829a82943
9851a47486F3479b49682A39c48404J3700a43249O6808M253k26472i7811L1180
$$ plain form
9930 31791 99169 138725 -204793 -61804 -244841 99341 -44776 121291 -61316 -125878 302419
9918 32695 -70593 -26241 110146 130084 -74060 21362 189318 76594 -132042 -37537 15717
9906 -141402 232658 -236336 -89485 68103 -156449 -257953 -7180 88521 -13281 -92754 -302203
9895 -302203 -139478 81446 3364 -163527 -177079 39863 -72832 -223693 -550 -79640 -255193
9884 -255193 -42144 75421 179499 -340426 -210844 -87547 15108 -68952 -187960 114779 263135
9873 263135 93517 -138152 37234 203226 -218812 66582 -309280 -132721 229905 362120
9863 362120 37634 -65502 -348546 -277352 -162494 73066 -167089 -250956 33023 103852 -182943
9851 -147486 63479 -249682 139 -348404 -334704 -143249 -76441 -72188 -298660 -97811 -66631
9840f6631J8690n4527D06318A4402c75271a0462G300b0840A93083f3040b071o6125
9828f8196k42637C3507e39346J67917N8796e1149j35774B5910b98024C267J316
9817D583M0870K58205a98597A52869m9245G438M9401p176b32157c1130F3431J9879
9805H3310a59973j88785A27125J22775i0689K2546b2355B05574d66419K11292
9795b55127b9649r9551I8095k8906b33816l2406A68249a91155r2206c2289j84490
9784b16779B42807a0132l03692o1094K7374K2029B35890c34759J50086n1232A37787
9772a2466j23575A59889E8985a00916a5146A52318a3002H8836g4414D2452f7903
9760b78744A8754d9907B13702B1789c19956F136g1537k28395C481a32230n88B44038
$$ plain form
9840 -66631 -47941 -102468 406318 14402 -375271 -10462 7300 -20840 193083 -63040 -2071 -68196
9828 -68196 -310833 33507 -539346 -371429 -312633 -51149 -186923 25910 -298024 3267 4583
9817 4583 45453 303658 -198597 152869 103624 7438 56839 49663 -232157 -31130 63431 83310
9805 83310 -159973 -348758 127125 249900 -90689 -68143 -22355 205574 -466419 -255127
9795 -255127 -29649 -129200 98095 69189 -233816 -266222 168249 -191155 -283361 -32289 -216779
9784 -216779 242807 -10132 -313824 -374918 -347544 -325515 235890 -334759 -184673 -235905 137787
9772 -12466 -136041 159889 58985 -100916 -15146 152318 -13002 88836 -74414 42452 -67903
9760 -278744 18754 -49907 213702 21789 -319956 6136 -71537 -299932 3481 -132230 -132818 244038
9747A00250f06883a82152M7812k0477k74892g2999m8420d6905A09970a30125A27570
9735e9164D5444P9833D0423M7190J38795i472C9849a390E8781a85986Q6607E8626
9722C11466A48O6415a10955j07096e6225B5111b1793k86210c5990D8091c10799
9710C373a05547n3507B46434b30314a01537j7497F8563a48875B53261j14598C1819
9698g4286l14622f8849K9858j80415I1750i474D1553J5505J7704J9782a7844o09
9686a8453l02560a5296j72102N5933q3081A46389N3430m4913J5947R4132h104
9674a51303A70987c08084a14840m0783A41729a7895n9120l31778b1657n0453B72125
9662c02553A85764O577b38825O5758o3265i5721j25481B37437e8051k48550B32115
$$ plain form
9747 100250 -606883 -182152 -134340 -154817 -429709 -72999 -121419 -46905 109970 -130125 127570
9735 -59164 45444 125277 40423 87613 226408 -9472 39849 -1390 58781 -185986 -99379 58626
9722 311466 148 66563 -110955 -218051 -56225 25111 -21793 -308003 -35990 48091 -310799
9710 3373 -105547 -159054 246434 -230314 -101537 -119034 68563 -148875 253261 138663 31819
9698 -74286 -388908 -68849 -38991 -219406 91750 -9474 41553 57058 74762 94544 -17844 -18453
9686 -18453 -321013 -15296 -187398 -131465 -214546 146389 199819 154906 170853 264985 -8104
9674 -151303 170987 -308084 -114840 -155623 141729 -17895 -77015 -408793 -21657 -72110 272125
9662 -302553 185764 192341 -238825 -173067 -236332 -95721 -221202 237437 -58051 -306601 232115
9650c27050a31138l66792D00954c12130a0163j73214h967n4614K6091n3447j41790
9639b32727A3135J95394a55360r8146B9372c06884F2679i0293j63458B60389b47411
9627c7719b760k25495B15470L9079a27574G9555G360J86777l7562J71662b44892
9615d42871A4848b1708C30242A26701a7435k78000M9616D68944e5825a9824q5438
9604a05262A7845a07062B8324b36015g4979k8376N0277j22585B1417h1710A65271
9592A8159J46134F391b01504h316j79603j80925q4332a32480A31060c19685F3583
9580A87914B0096H297a74460I978a85557d1249E8238a67323A4001b44017j74429
9569d18446A317b0251r8478j56805G6561L8998b82988B7228b2285j54097k3215
$$ plain form
9650 -327050 -131138 -497930 400954 -312130 -10163 -183377 -8967 -63581 -37490 -90937 -232727
9639 -232727 13135 208529 -155360 -253506 29372 -306884 62679 -90293 -253751 260389 -247411
9627 -37719 -2760 -228255 215470 254549 -127574 79555 7360 194137 156575 328237 -244892
9615 -442871 14848 -21708 330242 126701 -17435 -295435 -245819 468944 -55825 -19824 -105262
9604 -105262 17845 -107062 28324 -236015 -74979 -103355 -53078 -175663 21417 -81710 165271
9592 18159 164293 6391 -201504 -8316 -187919 -368844 -453176 -132480 131060 -319685 63583
9580 187914 20096 8297 -174460 9978 -185557 -41249 58238 -167323 14001 -244017 -418446
9569 -418446 1317 -20251 -118729 -275534 76561 115559 -282988 27228 -22285 -176382 -199597
9558a99597d9777a3638k1027k0548F9266b1031j04261I1667a29377D8420E092
9546a87214j51617h0725A58384a69311b8243m8221q5123J9489l9601B63518a38895
9534b86444E1448d23224a49700g1766e379I6167K37073a87658g871n08129d7807
9522a81659j03414i3687L6263j10101r8187G4009h9229D82a68968D3092c82746
9510B32427p9658o2971l6404J17602h8718L9711j39816q1821d589B8183L01899
9499C30082a47711k18838J51455d6095l2699p734j04247A34996c1714k34809h9285
9487A55055a43576j07261A9426J06344j457n3354J56831B6970b79907d5653j07839
9476a53492M4009A04564a14916c547A59523g1787G2486a30286a1226B15483D1209
$$ plain form
9558 -199597 -49777 -13638 -34665 -55213 69266 -21031 -125292 91667 -129377 48420 5092
9546 -187214 -338831 -80725 158384 -169311 -28243 -76464 -161587 -142098 -181699 263518 -138895
9534 -286444 51448 -423224 -149700 -71766 -5379 96167 333240 -187658 -7871 -516000 -47807
9522 -181659 -285073 -93687 -57424 -167525 -265712 74009 -89229 482 -168968 43092 -382746
9510 232427 152769 89798 53394 170996 -88718 -49007 -188823 -270644 -4589 28183 330082
9499 330082 -147711 -366549 -215094 -46095 -78794 -86528 -190775 134996 -31714 -266523 -89285
9487 155055 -143576 -250837 19426 125770 124313 70959 227790 26970 -279907 -45653 -153492
9476 -153492 -109483 104564 -114916 -3547 159523 -71787 72486 -130286 -11226 215483 41209
9464D8471I661d08125A50807C4433m170b8638j16714B22782C0040b5106B21366
9452c26362A41335J25653B7406a56077c4406n6176M39j05980A36616B1835a06749
9440a70158B3968b25211g1193j37984g3988L1825h847r7082m12094J31685A5997
9428B8628p756g5777E2766J75479e8979l4700A03151L5984a34454n5217j2173
9417b01844A25894B8706c39634a01782E3597b8565J0393I4261J70506i1233B88304
9405A98220H7485R9053q522B6393a08872J4293l94903B317a66974A26203d9320
9393b56480A0424g1729J7693k62706J28598C7117P7683J93215a55749G2780b13131
9381a16989A77963q6950b05756k7942I3896c15471a10941F2559g7990k479H0015
$$ plain form
9464 48471 9661 -408125 150807 34433 30263 -28638 -145352 222782 30040 -25106 221366
9452 -326362 141335 266988 27406 -156077 -34406 -90582 -90143 -196123 136616 21835 -106749
9440 -170158 23968 -225211 -71193 -209177 -73988 -42163 -8847 -105929 -518023 -386338 15997
9428 28628 20872 -75777 52766 228245 -58979 -93679 103151 139135 -134454 -189671 -201844
9417 -201844 125894 28706 -339634 -101782 53597 -28565 -18172 94261 264767 -91233 288304
9405 198220 87485 186538 178016 26393 -108872 -94579 -489482 2317 -166974 126203 -49320
9393 -256480 10424 -71729 -54036 -316742 -188144 37117 114800 308015 -155749 72780 -213131
9381 -116989 177963 91013 -205756 -233698 93896 -315471 -110941 62559 -77990 -80469 80015
9369a92525j30737b2923B4765d5273A02227e8539C7363b37590F991b18166o5587
9358b83753J26899B06768a77485j77153a34692B66797a4776k06646B18309H7591
9347b98504A9417b26254B8500a42958A52470D5952R7364m8146P8540F2609J87455
9336B50064b2196G2864d54932A85222a43720A67937a56521a9386k16661c032A26410
9324A24229k0646a0504j52317A60905a11656b6663k2320B00446e7818L045k8913
9313h3686A5405c13213a35247C854b7676C36028j37250j64a21931B4278a47740
9301A46346K52547b68338f0759k97724A2021d5656j83362c2626A37428a97991
9290B52702d11829C9981J9914a19800p6377Q0738E9666b53014d65B20469J6576
$$ plain form
9369 -192525 -323262 -22923 24765 -45273 102227 -58539 37363 -237590 6991 -218166 -283753
9358 -283753 -156854 206768 -177485 -354638 -134692 266797 -14776 -221422 218309 87591
9347 -298504 19417 -226254 28500 -142958 152470 45952 143316 95170 173710 62609 250064
9336 250064 -22196 72864 -454932 185222 -143720 167937 -156521 -19386 -236047 -3032 126410
9324 124229 103583 -10504 -162821 160905 -111656 -26663 -48983 200446 -57818 -54773 -83686
9313 -83686 15405 -313213 -135247 3854 -27676 336028 198778 198614 -121931 24278 -147740
9301 146346 398893 -268338 -60759 -358483 12021 -45656 -229018 -32626 137428 -197991
9290 252702 -411829 39981 59895 -119800 -196177 -115439 59666 -253014 -465 220469 237045
9279B37045B1362e6639k53700L681A71552b08920C3657b31176Q0811q4191f8708
9267I561b85856N2270j67220A13284D5640a02367c5187l0966j17975D5495M8699
9256I4194P1573G9134k8853c05767e7064C2016a24136A77640f9427k44133Q3349
9245b30211a7292q6213j00499B09807j3183q0599a75790g591k3556M682B18109
9233c17909e1179j77107c315D9452c61700A38322a28176N5126A24284a48861c5253
9221e3144J6504F7334d51433a9254C500a38220A5889c44971J50311N1807A65021
9209G1991a63765A90530b58452a24515l7114d638r6175B46802a26205D9970g0365
9197a84993B04337k3201a2311j06607R722k8582M945b916m7182A1334b94583f8119
$$ plain form
9279 237045 21362 -56639 -310339 -306658 171552 -208920 33657 -231176 -150365 -234556 -68708
9267 9561 -285856 -233586 -400806 113284 45640 -102367 -35187 -66153 -184128 45495 94194
9256 94194 165767 79134 50281 -305767 -57064 32016 -124136 177640 -69427 -313560 -230211
9245 -230211 -17292 -103505 -204004 209807 196624 116025 -175790 -7591 -31147 -26465 218109
9233 -317909 -51179 -228286 -3315 49452 -361700 138322 -128176 -73050 124284 -148861 -35253
9221 -53144 -36640 67334 -451433 -19254 3500 -138220 15889 -344971 -194660 -142853 165021
9209 71991 -163765 190530 -258452 -124515 -161629 -4638 -100813 246802 -126205 49970 -70365
9197 -184993 204337 181136 -12311 -118918 -109196 -137778 -132833 -2916 -50098 11334 -294583 -68119
9184f4926E9392h8512j80490j38564J55820Q4174A76941K50245b81599C64084
9173b04006A12548c12199A25025Q2564L3149f2680A59432b45325o1181g0500A3757
9161A38085a5779A31918k4242b93092r5964e0356B0152b25085g2053j22435L1757
9150a62731b1683k15633e0573b0094B74405b32723B32979I4451K31412L852A12277
9138i5350k05242a38516j5359f268D4437P2527P5112R1722A40114C8935E318Q0395
9126H5713a11344G3283b00157e0629A80384b8776A88069a71860A20334a54367
9115g2857l8179G2003d4827I1691b88507f6131j38506B44066h2778o5719j23872
9104b72369I1260N0422C2926d0850k26473h6245A16195g6772A95729c72863R1219
$$ plain form
9184 -64926 59392 -88512 -269002 -407566 -251746 -167572 176941 427186 -281599 364084
9173 -204006 112548 -312199 125025 207589 240738 -62680 159432 -245325 -306506 -70500 13757
9161 138085 -15779 131918 107676 -293092 -389056 -50356 20152 -225085 -72053 -194488 -162731
9150 -162731 -21683 -237316 -50573 -20094 274405 -232723 232979 94451 325863 329715 112277
9138 -95350 -300592 -138516 -153875 -6268 44437 116964 192076 283798 140114 38935 5318 85713
9126 85713 -111344 73283 -200157 -50629 180384 -28776 188069 -171860 120334 -154367
9115 -72857 -111036 72003 -44827 91691 -288507 -66131 -204637 244066 -82778 -148497 -272369
9104 -272369 91260 141682 32926 -40850 -267323 -86245 116195 -76772 195729 -372863 -281644
9093b81644D0461b44902Q7859M9905A75108H3559a32509k99550A18348J32130
9083B50478D7669a92934J7121k48117C5468b47179i6879H168J46358f1570B82911
9071A22861a51272A45675n4759a82219A92662D1487L2189a60597l103k80170A56094
9059b35739b6482n32931a47692m4745D2342b7912n1588j49531g2300m8437P62
9048a19975A77949q3935F920K37b01739B76237n9781b48169J21078e7915l42l02409
9036c60666E1466a51397J7603q2452O3589G3596K52301b4670j86957b5653j53933
9025a79586E1924a39180F2879b24538C6062K1183a11009B25623b5822j10222D9672
9013c95097a72266j49360I4725a12346I7307m5512K23741b40289a11270B970K59278
$$ plain form
9093 -281644 40461 -244902 -157043 -107138 175108 83559 -132509 -432059 118348 250478
9083 250478 47669 -192934 -175813 -423930 35468 -247179 -96879 8168 154526 -61570 282911
9071 122861 -151272 145675 90916 -182219 192662 41487 73676 -160597 -163700 -443870 156094
9059 -235739 -26482 -559413 -147692 -192437 42342 -27912 -79500 -229031 -72300 -120737 -119975
9048 -119975 177949 94014 6920 7157 -201739 276237 216456 -248169 -127091 -57915 -58257 -360666
9036 -360666 51466 -151397 -133794 -216246 -152657 73596 325897 -24670 -211627 -25653 -179586
9025 -179586 51924 -139180 62879 -224538 36062 57245 -111009 225623 -25822 -136044 49672
9013 -395097 -172266 -321626 94725 -112346 97307 51795 275536 -240289 -111270 2970 262248
9002B62248H8874a23053J5495j59403e4695K0590p6719E6457d48630d3329F6758
8990A016d5269j86749d1890j9669F5464e9387A71002P262N9766b96575J14699
8979a81876Q5271j62012i9124M5111n677k05701f5918k13186D41747b24137e3575
8967a35003e3190A12326J6561a30605F4728i6123j29253D39654A86880h9374k14134
8956c03508A28997c33584c2843H6581O0636a97195e6482j59897J06605L2281A03893
8944A34610b14575L2414C13271E6609b00152B98056E2057J8928a67410l0658I2108
8932f6176g899k64153b7588m9608G9389R6336b47106N8857k29566a2873E8079
8920E5109L98304K52391o0301k50014G5152N6801B6363b29560e226G7169c18041
$$ plain form
9002 262248 88874 -123053 -107558 -266961 -54695 -34105 -110824 56457 -448630 -43329 66758
8990 1016 -45269 -232018 -41890 -61559 65464 -59387 171002 178264 238030 -296575 -181876
8979 -181876 -96605 -258617 -99124 -54013 -59690 -265391 -65918 -279104 441747 -224137 -53575
8967 -135003 -53190 112326 128887 -130605 64728 -96123 -225376 439654 186880 -89374 -303508
8956 -303508 128997 -333584 -32843 86581 147217 -197195 -56482 -216379 -109774 -77493 103893
8944 134610 -214575 -182161 313271 56609 -200152 298056 52057 70985 -167410 -198068 92108
8932 -66176 -7899 -272052 -27588 -77196 79389 175725 -247106 -188249 -417815 -12873 58079
8920 55109 453413 705804 645503 395489 75152 131953 26363 -229560 -5226 77169 -318041
8908A12864D0329P8561a8755C6313b14588A46412j0872F0068h893C8957b38664
8896G2553a91157c9614A66049l3091B932J30032a98180E5324i224j28467n645
8885a43336f2543q8174B86654E6540a71145A51598B2708a42106D6515e85098b33642
8873A68412M2946a80528j23707A3361J2250N5470c33691A40789e1983j08304H9824
8861B34698H4898i3182k81598g9470K2260o3842A09824a0855l31086B2001c69723
$$ plain form
8908 112864 40329 118890 -18755 36313 -214588 146412 135540 60068 -8893 38957 -238664
8896 72553 -191157 -39614 166049 132958 2932 132964 -198180 55324 -9224 -137691 -143336
8885 -143336 -62543 -150717 286654 56540 -171145 151598 22708 -142106 46515 -585098 -233642
8873 168412 211358 -180528 -304235 13361 25611 81081 -333691 140789 -51983 -160287 89824
8861 234698 84898 -93182 -374780 -79470 -57210 -121052 109824 -10855 -341941 22001 -369723
$$ [...]
##END NTUPLES=NMR SPECTRUM
##END=
